
##TITLE=AC1309_BRAAS11121_6614207_eynF3lD209
##JCAMPDX= 6.0         $$ Bruker NMR JCAMP-DX V2.0
##DATA TYPE= NMR SPECTRUM
##DATA CLASS= NTUPLES
##ORIGIN= BRUKER
##OWNER= Administrator
$$ 1.72 TOPSPIN		Version 2.1
$$ 2012-08-02 17:49:12.343 -0500  Administrator@TOPSPIN
$$ Compression mode = diff/dup
##.OBSERVE FREQUENCY= 400.02188249412
##.OBSERVE NUCLEUS= ^1H
##.ACQUISITION MODE= SIMULTANEOUS (DQD)
##.ACQUISITION SCHEME= undefined
##.AVERAGES= 64
##.DIGITISER RES= 22
##SPECTROMETER/DATA SYSTEM= spect
##.PULSE SEQUENCE= noesygpps1d.comp
##.SOLVENT NAME= COFFEE_meoh
##.SHIFT REFERENCE= INTERNAL, COFFEE_meoh, 1, 14.96221
##AUDIT TRAIL= $$ (NUMBER, WHEN, WHO, WHERE, PROCESS, VERSION, WHAT)
$$ ##TITLE= Audit trail, TOPSPIN		Version 2.1
$$ ##JCAMPDX= 5.01
$$ ##ORIGIN= Bruker BioSpin GmbH
$$ ##OWNER= Administrator
$$ $$ C:\Bruker\TOPSPIN/data/COFFEE/nmr/AC1309_BRAAS11121_6614207_eynF3lD209/12/pdata/1/auditp.txt
$$ ##AUDIT TRAIL=  $$ (NUMBER, WHEN, WHO, WHERE, PROCESS, VERSION, WHAT)
(   1,<2012-08-02 17:49:04.437 -0500>,<Administrator>,<TOPSPIN>,<go>,<TOPSPIN 2.1>,
      <created by zg
	started at 2012-08-02 17:37:32.593 -0500,
	POWCHK enabled, PULCHK disabled,
       configuration hash MD5:
       6B 1B 68 BB D9 2E 58 E2 7F 35 AD 54 07 DF 0E 41
       data hash MD5: 64K
       30 74 D5 8A 68 E1 4F F3 F0 F6 DB BD A6 9C 52 36>)
(   2,<2012-08-02 17:49:10.453 -0500>,<Administrator>,<TOPSPIN>,<proc1d>,<TOPSPIN 2.1>,
      <Start of raw data processing
       efp LB = 0.3 FT_mod = 6 PKNL = 1 PHC0 = 0 PHC1 = 0 SI = 128K 
       data hash MD5: 128K
       F7 33 F1 DF 5A 84 FF 88 7B 87 FA 85 37 1A 54 8E>)
(   3,<2012-08-02 17:49:11.578 -0500>,<Administrator>,<TOPSPIN>,<proc1d>,<TOPSPIN 2.1>,
      <pk PHC0 = 3.685913 PHC1 = 0 
       data hash MD5: 128K
       3D 4A 0D 22 C7 C0 D0 21 51 E1 D5 F7 8A 96 BB 7F>)
(   4,<2012-08-02 17:49:11.828 -0500>,<Administrator>,<TOPSPIN>,<proc1d>,<TOPSPIN 2.1>,
      <abs ABSG = 1 
       data hash MD5: 128K
       F3 9F 86 8B 82 CE 66 24 50 6E 78 FE 8C 39 CC F1>)
(   5,<2012-08-02 17:49:11.906 -0500>,<Administrator>,<TOPSPIN>,<proc1d>,<TOPSPIN 2.1>,
      <abs ABSG = 2 
       data hash MD5: 128K
       60 07 FA 6D FA C2 30 9D 45 FB 47 2C D9 16 CE 66>)
(   6,<2012-08-02 17:49:11.968 -0500>,<Administrator>,<TOPSPIN>,<proc1d>,<TOPSPIN 2.1>,
      <abs ABSG = 3 
       data hash MD5: 128K
       6B D0 7C 0F 38 C0 C2 26 C3 54 B7 7B DF 98 C4 15>)
(   7,<2012-08-02 17:49:12.203 -0500>,<Administrator>,<TOPSPIN>,<proc1d>,<TOPSPIN 2.1>,
      <abs ABSG = 4 
       data hash MD5: 128K
       6B C0 E0 56 18 6A 4C 9E B9 0C 2B 75 63 4A 7B A5>)
(   8,<2012-08-02 17:49:12.265 -0500>,<Administrator>,<TOPSPIN>,<proc1d>,<TOPSPIN 2.1>,
      <abs ABSG = 5 
       data hash MD5: 128K
       A2 29 58 E6 5F D3 25 39 1E E1 50 6E 8D 1F 73 42>)
$$ ##END=
$$ 
$$ $$ hash MD5
$$ $$ 4A 4C 2B 48 D2 12 86 EE 6A 87 A6 0C F4 F0 7F 51
##$RELAX= 
##$RELAX= 
##$RELAX= 
##$RELAX= 
##$RELAX= 
##$RELAX= 
##$RELAX= 
##$RELAX= 
$$ Bruker specific parameters
$$ [...]
##$TP07= 0
##$TPNAME0= <>
##$TPNAME1= <>
##$TPNAME2= <>
##$TPNAME3= <>
##$TPNAME4= <>
##$TPNAME5= <>
##$TPNAME6= <>
##$TPNAME7= <>
##$TPOAL= (0..7)
0.5 0.5 0.5 0.5 0.5 0.5 0.5 0.5
##$TPOFFS= (0..7)
0 0 0 0 0 0 0 0
##$TUNHIN= 0
##$TUNHOUT= 0
##$TUNXOUT= 0
##$USERA1= <user>
##$USERA2= <user>
##$USERA3= <user>
##$USERA4= <user>
##$USERA5= <user>
##$V9= 5
##$VALIST= <valist>
##$VCLIST= <CCCCCCCCCCCCCCC>
##$VD= 0
##$VDLIST= <DDDDDDDDDDDDDDD>
##$VPLIST= <PPPPPPPPPPPPPPP>
##$VTLIST= <TTTTTTTTTTTTTTT>
##$WBST= 1024
##$WBSW= 4
##$XGAIN= (0..3)
0 0 0 0
##$XL= 0
##$YL= 0
##$YMAX_a= 17301071
##$YMIN_a= -10198381
##$ZGOPTNS= <>
##$ZL1= 120
##$ZL2= 120
##$ZL3= 120
##$ZL4= 120
##$ABSF1= 14.96221
##$ABSF2= -5.595972
##$ABSG= 5
##$ABSL= 3
##$ALPHA= 0
##$AQORDER= 0
##$ASSFAC= 0
##$ASSFACI= 0
##$ASSFACX= 0
##$ASSWID= 0
##$AUNMP= <proc_prof1d_extract.lims>
##$AXLEFT= 0
##$AXNAME= <>
##$AXNUC= <1H>
##$AXRIGHT= 0
##$AXTYPE= 0
##$AXUNIT= <>
##$AZFE= 0.1
##$AZFW= 0.1
##$BCFW= 0
##$BC_mod= 0
##$BYTORDP= 0
##$COROFFS= 0
##$CY= 15
##$DATMOD= 1
##$DC= 0
##$DFILT= <>
##$DTYPP= 0
##$F1P= 0
##$F2P= 0
##$FCOR= 0.5
##$FTSIZE= 131072
##$FT_mod= 6
##$GAMMA= 0
##$GB= 0
##$INTBC= 1
##$INTSCL= 1
##$ISEN= 128
##$LB= 0.3
##$LEV0= 0
##$LPBIN= 0
##$MAXI= 10000
##$MC2= 0
##$MEAN= 0
##$ME_mod= 0
##$MI= 0
##$NCOEF= 0
##$NC_proc= -2
##$NLEV= 6
##$NOISF1= 0
##$NOISF2= 0
##$NSP= 0
##$NTH_PI= 0
##$NZP= 0
##$OFFSET= 14.96221
##$PC= 1
##$PHC0= 3.685913
##$PHC1= 0
##$PH_mod= 1
##$PKNL= yes
##$PPARMOD= 0
##$PPDIAG= 0
##$PPIPTYP= 0
##$PPMPNUM= 2147483647
##$PPRESOL= 1
##$PSCAL= 4
##$PSIGN= 0
##$PYNMP= <proc.py>
##$REVERSE= no
##$SF= 400.020009152936
##$SI= 131072
##$SIGF1= 0
##$SIGF2= 0
##$SINO= 400
##$SIOLD= 131072
##$SPECTYP= <>
##$SREGLST= <1H.CDCl3>
##$SSB= 0
##$STSI= 131072
##$STSR= 0
##$SW_p= 8223.68421052631
##$SYMM= 0
##$S_DEV= 0
##$TDeff= 65536
##$TDoff= 0
##$TI= <>
##$TILT= no
##$TM1= 0
##$TM2= 0
##$TOPLEV= 0
##$USERP1= <user>
##$USERP2= <user>
##$USERP3= <user>
##$USERP4= <user>
##$USERP5= <user>
##$WDW= 1
##$XDIM= 131072
##$YMAX_p= 367736799
##$YMIN_p= -11085
##$CURPLOT= <Network HP LaserJet P1505>
##$CURPRIN= <$Network HP LaserJet P1505>
##$DFORMAT= <normdp>
##$LAYOUT= <+/1D_H.xwp>
##$LFORMAT= <normlp>
##$PFORMAT= <normpl>
##$SURQMSG= 1
$$ End of Bruker specific parameters
$$ ---------------------------------
##NTUPLES= NMR SPECTRUM
##VAR_NAME=  FREQUENCY,     SPECTRUM/REAL,   SPECTRUM/IMAG
##SYMBOL=    X,             R,               I
##VAR_TYPE=  INDEPENDENT,   DEPENDENT,       DEPENDENT
##VAR_FORM=  AFFN,          ASDF,            ASDF
##VAR_DIM=   131072,        131072,          131072
##UNITS=     HZ,            ARBITRARY UNITS, ARBITRARY UNITS
##FACTOR=    0.0627417313425164, 1,          1
##FIRST=     8223.62146879497, -1604,        -66526
##LAST=      0,             599,             -67760
##MIN=       0,             -11085,          0
##MAX=       8223.62146879497, 367736799,    0
$$ Real data points
##PAGE= N=1
##DATA TABLE= (X++(R..R)), XYDATA
$$ [...]
60940D614173l52873l07770k72812k45303k22253k02531j85887j71239j57433
60931B496072j44329j32042j20313j09513j00810r4458q9285q4595q0964p8405
60921A461358p5365p0705o5276o0444n6276n2199m8259m4654m1043l7235l3702
60910H76200l0691k7757k4818k2609k1351k0101j8110j5890j4133j2673j1269
60899F56798j0399j0352j0381r653q291o772n102l307j919j187n00P01K059L041
60885E94736L823M861O119P364Q580R588R840R132Q013P044O238N577N342N499
60871F91756N407M596L326K056R30lp55j744l416n375o682p219p808q735r185
60856F57149q565p388o398n724n273n045m582l092n87J945L967N994Q353J0398
$$ y = [4614173, 4261300, 3953530, 3680718, 3435415, 3213162, 3010631, 2824744, 2653505, 2496072, 2351743, 2219701, 2099388, 1989875, 1889065, 1794607, 1705322, 1620727, 1539763, 1461358, 1385993, 1315288, 1250012, 1189568, 1133292, 1081093, 1032834, 988180, 947137, 909902, 876200, 845509, 817752, 792934, 770325, 748974, 728873, 710763, 694873, 680740, 668067, 656798, 646399, 636047, 625666, 616013, 607722, 600950, 595848, 592541, 590622, 589435, 588935, 589636, 591695, 594736, 598559, 603420, 609539, 616903, 625483, 635071, 644911, 654043, 662056, 669100, 675338, 680915, 686257, 691756, 697163, 701759, 705085, 707141, 708071, 708068, 707313, 705569, 702153, 696778, 690096, 682877, 675069, 666334, 657149, 648584, 641196, 634798, 629074, 623801, 618756, 614174, 611082, 610495, 612440, 616407, 622401, 630754, 641152]
60842F41152J1562J2181J2609J2475J1586J0672J0472J0725J0822J0761J0821
60831G65838J0920J0913J0934J0914J0404R361Q459Q119P878P215O356N777N518
60818H78606N423N412N247M622L745L133K686J803N07n29j183k049l292m583o219
60803H93329q811j1633j3030j2996j3555j5707j7758j7802j6298j4778j3536j2069
60791G25356j0660r895r420q580p503o371m558j797P23J797K015K744M120N396
60777F83367O506P806Q892R164R044R305R715R722R791J0546J1215J0602R115
60764H04790Q171P890P179N915N235N528N877N741N721O238O858P349Q117R134
60750H99743R563R056Q404Q343Q583Q555Q302Q044P483O245M578L095J997R99
$$ y = [641152, 652714, 664895, 677504, 689979, 701565, 712237, 722709, 733434, 744256, 755017, 765838, 776758, 787671, 798605, 809519, 819923, 829284, 837743, 845862, 853740, 860955, 867311, 873088, 878606, 884029, 889441, 894688, 899310, 903055, 906188, 908874, 910677, 911184, 910655, 909472, 907423, 904131, 899548, 893329, 884518, 872885, 859855, 846859, 833304, 817597, 799839, 782037, 765739, 750961, 737425, 725356, 714696, 704801, 695381, 686801, 679298, 672927, 668369, 666572, 667295, 669092, 671107, 673851, 677971, 683367, 689873, 697679, 706571, 715735, 724779, 734084, 743799, 753521, 763312, 773858, 785073, 795675, 804790, 812961, 820851, 828030, 833945, 839180, 844708, 850585, 856326, 862047, 868285, 875143, 882492, 890609, 899743, 909306, 918362, 926766, 935109, 943692, 952247, 960549, 968593, 976076, 982321, 986899, 989994, 991991, 992990]
60736I92990j60j333k145k480k709l328m416n752p349r257j0899j1384j0846j0591
60722I10341j1372j2279j1984j0397q425o784n772n565n847n785n147m828n558
60709H10598o746p475p938q760r594r509q365o733m999l491k847l073k835r78
60695G27255J812M092N736P485Q969R074Q009P222P170O776N323L247Q76k080
60681H00966n392q065r770j1205j2671j3534j3617j3804j4536j4944j4171j2606
60669F56651j1004r342p380n578m562m139l587k610j451m33J77J91k65p54j040
60654F04874j238j395j311r37n13j51K98Q73J356J621J706J603J303R89Q37P45
60638F10660O67R36J708K500K886L240M047M943N342N632O607Q007Q871R246J0167
$$ y = [992990, 992830, 991497, 989352, 986872, 984163, 980835, 976419, 970667, 963318, 954061, 943162, 931778, 920932, 910341, 898969, 886690, 874706, 864309, 855884, 849100, 843328, 837763, 831916, 826131, 820984, 816156, 810598, 803852, 796377, 788439, 779679, 770085, 760576, 752211, 745478, 740479, 736988, 734141, 731068, 728233, 727255, 729067, 733159, 738895, 746380, 755349, 764423, 772432, 779654, 786824, 793600, 798923, 802170, 803046, 800966, 795574, 787509, 777739, 766534, 753863, 740329, 726712, 712908, 698372, 683428, 669257, 656651, 645647, 636305, 628925, 623347, 618785, 614646, 611059, 608449, 606998, 606565, 606742, 606933, 606668, 605914, 604874, 603636, 602241, 600930, 599993, 599480, 599329, 599627, 600500, 601856, 603477, 605183, 606786, 608089, 609078, 609915, 610660, 611327, 612263, 613971, 616471, 619357, 622597, 626644, 631587, 636929, 642561, 649168, 657175, 666046, 675292, 685459]
60623F85459J1884J3479J4537J5781J7601J9197J9807J9818J9858J9687J8758
60612H75866J7217J5608J4085J2423J0445Q084N463L106J493K07j783m751p809
60599I49654j0209j2183j4113j5642j6253j6086j5605j4934j3953j2624j0837
60588G97215q460n911m055l123k274q26O19R48J4j257k008k114j890j660j671
60573G63547j999k441k671k521k033j365o29J87J108J978K572L048L842M846N121
60558G72590M069K401J303R68Q15P85J355K326K843K839L382N171P635R974J2236
60543H30692J4872J7994K1646K6165L1583L7180M2118M6067M8651M8822M5475
60532A211265L8567K9128J8319O835m805j5768k4864l1074l4252l5179l4688l2867
$$ y = [685459, 697343, 710822, 725359, 741140, 758741, 777938, 797745, 817563, 837421, 857108, 875866, 893083, 908691, 922776, 935199, 945644, 953728, 959191, 962297, 963790, 963997, 962214, 957463, 949654, 939445, 927262, 913149, 897507, 881254, 865168, 849563, 834629, 820676, 808052, 797215, 788755, 782844, 778789, 775666, 773392, 772566, 773185, 774133, 774147, 772890, 770882, 768768, 766878, 765218, 763547, 761548, 759107, 756436, 753915, 751882, 750517, 749888, 750075, 751183, 753161, 755733, 758781, 762623, 767469, 772590, 776659, 779060, 780363, 781331, 782146, 782931, 784286, 786612, 789455, 792294, 795676, 800847, 808482, 818456, 830692, 845564, 863558, 885204, 911369, 942952, 980132, 1022250, 1068317, 1116968, 1165790, 1211265, 1249832, 1278960, 1297279, 1304114, 1299309, 1283541, 1258677, 1227603, 1193351, 1158172, 1123484, 1090617]
60520A090617k9419k4595j9219j3897q735l806O34M371P246Q966R513R579J0039
60507A041294J1026J2154J3553J5930J9657K4528L0442L7475M5284N3391O2297
60496A367031P3418Q7495J03759J20923J38413J56416J75473J96335K19578K45012
60486B883853K71819K98918L24018L42126L46324L31165K95108K39621J67128
60477E500080Q0985j2858j05401j86836k50153k93528l19434l31240l30747l19164
60467C431704k99399k75744k51252k26680k02256j79061j58123j39383j22378
60458A577428j07137r3684q1565p0684o1833n5517n0796m6176m1233l6614l2830
60447H99359k9770k7147k4799k2558k0378j8529j7363j6913j6793j6390j5241
$$ y = [1090617, 1061198, 1036603, 1017384, 1003487, 994752, 990946, 991580, 995951, 1003197, 1012163, 1021676, 1031255, 1041294, 1052320, 1064474, 1078027, 1093957, 1113614, 1138142, 1168584, 1206059, 1251343, 1304734, 1367031, 1440449, 1527944, 1631703, 1752626, 1891039, 2047455, 2222928, 2419263, 2638841, 2883853, 3155672, 3454590, 3778608, 4120734, 4467058, 4798223, 5093331, 5332952, 5500080, 5581065, 5568207, 5462806, 5275970, 5025817, 4732289, 4412855, 4081615, 3750868, 3431704, 3132305, 2856561, 2605309, 2378629, 2176373, 1997312, 1839189, 1699806, 1577428, 1470291, 1376607, 1295042, 1224358, 1162525, 1107008, 1056212, 1010036, 968803, 932189, 899359, 869589, 842442, 817643, 795085, 774707, 756178, 738815, 721902, 705109, 688719, 673478]
60436F73478j3556j2164j1518j0938r595p951p219p417p228o011m755m473m685
60423E65968m316l228k086j289p41k83K65J079K006K661L070L631M287M467M073
60408E79564L672L464L035K490K665L705M494M246L613L473L613L593L849M858
60394F30334N969O305O250O816Q013Q869Q841Q128O887N167L523K661K428J889
60380G12080M89j409l120m300n035n597o088o186n493m257l236k729k360j978
60366F60781j915k072j687n73L30L59J86O33J317J504J554K347L773M879N240
60351F76656N197N022M803M883N540O356O776P008P604Q413Q833Q781Q587Q181
60337G72640P307O382O135O508O812O939P517Q863J0653J2701J5189J7878J9883
$$ y = [673478, 659922, 647758, 636240, 625302, 615707, 607756, 600537, 593120, 585892, 579881, 575126, 570653, 565968, 561652, 558424, 556338, 555049, 554308, 554025, 554290, 555369, 557375, 560036, 563106, 566737, 571024, 575491, 579564, 583236, 586700, 589735, 592225, 594890, 598595, 603089, 607335, 610948, 614421, 618034, 621627, 625476, 630334, 636303, 642608, 648858, 655674, 663687, 672556, 681397, 689525, 696412, 701579, 705102, 707763, 710191, 712080, 712569, 711160, 708040, 703740, 698705, 693108, 687020, 680834, 675341, 671084, 667848, 665119, 662759, 660781, 658866, 656794, 655107, 654534, 654864, 655223, 655409, 656042, 657359, 658863, 660417, 662764, 666537, 671416, 676656, 681853, 686875, 691678, 696561, 702101, 708457, 715233, 722241, 729845, 738258, 747091, 755872, 764459, 772640, 779947, 786329, 792464, 798972, 805784, 812723, 820240, 829103, 839756, 852457, 867646, 885524, 905407]
60324I05407K0520J9802J7887J4706J0411N740J401k649o923j1438j5320j7533
60312I42011j7963j7502j6943j6118j4508j2391j0657r549q440p006n752n071
60300H00111m597l994l609l736l870l314k121r41l16m61j158j595r65M04J247
60285G71085J038O47R24J603K162K734L345L337K528K081L106N053O573P334P870
60270H21420Q315Q400Q371Q779R652J0729J2137J4032J5990J7636J9313K1414
60258I76188K3601K5570K7830L0748L3645L6011L8794M3112M8358N3139N7566
60247A394562O3022O9871P7103Q4061R0985R7780J03737J08689J13068J16585
60237B319463J18112J17113J14129J09593J03242R4905Q4934P3644O1204M8119
$$ y = [905407, 925927, 945729, 963616, 978322, 988733, 994473, 995874, 993225, 986302, 974864, 959544, 942011, 924048, 906546, 889603, 873485, 858977, 846586, 835929, 826380, 817940, 810934, 805182, 800111, 795514, 791520, 787911, 784175, 780305, 776991, 774870, 773929, 773613, 773152, 771994, 770399, 769434, 769838, 771085, 772123, 772770, 773694, 775297, 777459, 780193, 783538, 786875, 789403, 791484, 794590, 799643, 806216, 813550, 821420, 829735, 838135, 846506, 855285, 864937, 875666, 887803, 901835, 917825, 935461, 954774, 976188, 999789, 1025359, 1053189, 1083937, 1117582, 1153593, 1192387, 1235499, 1283857, 1336996, 1394562, 1457584, 1527455, 1604558, 1688619, 1779604, 1877384, 1981121, 2089810, 2202878, 2319463, 2437575, 2554688, 2668817, 2778410, 2881652, 2976557, 3061491, 3135135, 3196339, 3244458]
60227C244458L4914K1497P858m863j5231k3369l0562l6909m0925m1840m0754l8874
60215C035400l5858l0807k3858j5791o716L894J6148K9355M2621N5512O8182Q0899
60203C218981R3230J03924J11956J17394J20670J21385J18641J12325J03156R1622
60193D313284P7765O1880M4452K5492N069j5560l4490n1035o5867p9041q9125
60182D192824r4930r6936r6255r2977q6451p6805o5257n2955l9997k5871j0569
60171C453821M995J9921L4349M8809O2470P3114P9391Q2199Q2909Q1210P5903
60160D099091O7100N6112M3611K9504J4507K47j2330k3378l2818l9896m4197m5894
60148D111659m4811m0450l3138k3965j3378r41J3433K9198M6201O4757Q4538J04782
$$ y = [3244458, 3279372, 3300869, 3308727, 3303864, 3288633, 3265264, 3234702, 3197793, 3156868, 3115028, 3074274, 3035400, 2999542, 2968735, 2944877, 2929086, 2922370, 2926264, 2942412, 2971767, 3014388, 3069900, 3138082, 3218981, 3312211, 3416135, 3528091, 3645485, 3766155, 3887540, 4006181, 4118506, 4221662, 4313284, 4391049, 4452929, 4497381, 4522873, 4527942, 4512382, 4477892, 4426857, 4360990, 4281949, 4192824, 4097894, 4000958, 3904703, 3811726, 3725275, 3648470, 3583213, 3530258, 3490261, 3464390, 3453821, 3458816, 3478737, 3513086, 3561895, 3624365, 3697479, 3776870, 3859069, 3941978, 4023188, 4099091, 4166191, 4222303, 4265914, 4295418, 4309925, 4310172, 4297842, 4274464, 4241646, 4201750, 4157553, 4111659, 4066848, 4026398, 3993260, 3969295, 3955917, 3954976, 3968409, 3997607, 4043808, 4108565, 4193103, 4297885]
60136D297885J25847J48988J74201J99718K24267K48393K72759K96517L18210
60127F306785L37104L52655L63641L68928L68370L62112L49657L30442L04784
60118I444478K73597K37719J98036J55522J10554O2831J2592l8606q8798j36722
60108A0231203j81515k21952k56506k83866l03132l14047l17158l13179l02135
60099G737713k83993k60080k32702k03118j71028j36474j00949o6017l2030R89
60089F252311L2177O0404Q5175J06008J21709J31093J33904J30316J20234J03933
60079G277264Q2819N8850L3510P849j7210m1226o4372q6666j07522j26479j43618
60068F873199j58755j70973j79542j84660j86684j85365j80491j72633j62501
$$ y = [4297885, 4423732, 4572720, 4746921, 4946639, 5170906, 5419299, 5692058, 5988575, 6306785, 6643889, 6996544, 7360185, 7729113, 8097483, 8459595, 8809252, 9139694, 9444478, 9718075, 9955794, 10153830, 10309352, 10419906, 10482737, 10495329, 10456723, 10367925, 10231203, 10049688, 9827736, 9571230, 9287364, 8984232, 8670185, 8353027, 8039848, 7737713, 7453720, 7193640, 6960938, 6757820, 6586792, 6450318, 6349369, 6283352, 6251322, 6252311, 6284488, 6344892, 6430067, 6536075, 6657784, 6788877, 6922781, 7053097, 7173331, 7277264, 7360083, 7418933, 7452443, 7460292, 7443082, 7401856, 7337484, 7250818, 7143296, 7016817, 6873199, 6714444, 6543471, 6363929, 6179269, 5992585, 5807220, 5626729, 5454096, 5291595]
60059E291595j50179j35674j19604j02665q4910o6209m6896k7313p237J3529L4382
60048D598819N4286P2490Q8494J01818J12303J20011J24259J23509J16901J05485
60038E618375R1119P4591N5444L3382R158j5788m0172o3393q5354j05523j22395
60027E449444j34538j42026j45928j46446j42802j35167j25288j14551j02616
60018D260082q8825p3746n8397m2913k7046j1163M387K0221L7221N5342P4014
60007D149177R3125J12657J31792J49254J64171J75791J82898J84367J80038J70408
59997E693678J55889J37003J14704Q9856O2836L4204N074k3812n2584q0901j06920
59986F029027j28553j45063j56439j62064j61339j55232j45750j34015j19984
$$ y = [5291595, 5141416, 5005742, 4886138, 4783473, 4698563, 4632354, 4585458, 4558145, 4550908, 4564437, 4598819, 4653105, 4725595, 4814089, 4915907, 5028210, 5148221, 5272480, 5395989, 5512890, 5618375, 5709494, 5784085, 5839529, 5872911, 5882069, 5866281, 5826109, 5762716, 5677362, 5571839, 5449444, 5314906, 5172880, 5026952, 4880506, 4737704, 4602537, 4477249, 4362698, 4260082, 4171257, 4097511, 4039114, 3996201, 3969155, 3957992, 3962379, 3982600, 4019821, 4075163, 4149177, 4242302, 4354959, 4486751, 4636005, 4800176, 4975967, 5158865, 5343232, 5523270, 5693678, 5849567, 5986570, 6101274, 6191130, 6253966, 6288170, 6293244, 6269432, 6216848, 6135947, 6029027, 5900474, 5755411, 5598972, 5436908, 5275569, 5120337, 4974587, 4840572, 4720588]
59977D720588j03878q6634o8799n0064l0243r976R758K8322M5513O1350P5812
59966D591749Q8524R8806J06199J10576J11645J08985J02940R4738Q5194P3965
59956E573321O0647M6035L1559J8123O185l675j1093j6246j9069j8620j4022n467
59944E647678O477K1935M1262O4146R0092J19195J51533J86318K22653K60468
59934F811757K99616L38567L75106M07713M34944M53890M60784M53018M29483
59925A0464878L89312L32010K59132J74664Q3429r902j00403j83104k54374l12526
59915A0843116l56924l87292m04110m08727m02708l87563l65216l37905l07295
59906G485376k74245k39497k03995j68360j32683r7065o1854k7232O935M0609
$$ y = [4720588, 4616710, 4530076, 4461277, 4411213, 4380970, 4370994, 4380752, 4409074, 4454587, 4515937, 4591749, 4680273, 4779079, 4885278, 4995854, 5107499, 5216484, 5319424, 5414162, 5499356, 5573321, 5633968, 5680003, 5711562, 5729685, 5735870, 5732195, 5721102, 5704856, 5685787, 5667167, 5653145, 5647678, 5654155, 5676090, 5717352, 5781498, 5871590, 5990785, 6142318, 6328636, 6551289, 6811757, 7111373, 7449940, 7825046, 8232759, 8667703, 9121593, 9582377, 10035395, 10464878, 10854190, 11186200, 11445332, 11619996, 11703425, 11693523, 11593120, 11410016, 11155642, 10843116, 10486192, 10098900, 9694790, 9286063, 8883355, 8495792, 8130576, 7792671, 7485376, 7211131, 6971634, 6767639, 6599279, 6466596, 6369531, 6307677, 6280445, 6287380, 6327989]
59896F327989P3297J04210J32379J56729J76401J90765J98647J97909J86547J64237
59886G909110J32244R2092M5100o711o0130j11643j58572j99407k33432k60267
59876G148384k79624k91428k96073k94329k86945k74735k58990k41137k21820
59867D703303k00992j79252j58189j38905j21106j04375q9455p7395o8096o0814
59857C504724n5500n2594n1788n2044n2536n2741n1928m9553m5957m1746l6742
59846B961595l0380k2944j5552r207m607k530l369o513j1026j6717k3746l1384
59834B783620l8173m3137m6047m6802m5467m2673l9030l4334k8177k1036j3847
59823B384897o869l6N989J0381J3683J7549K2858K9130L5771M2780M9966N6469
$$ y = [6327989, 6401286, 6505496, 6637875, 6794604, 6971005, 7161770, 7360417, 7558326, 7744873, 7909110, 8041354, 8133446, 8178546, 8171835, 8111705, 8000062, 7841490, 7642083, 7408651, 7148384, 6868760, 6577332, 6281259, 5986930, 5699985, 5425250, 5166260, 4925123, 4703303, 4502311, 4323059, 4164870, 4025965, 3904859, 3800484, 3711029, 3633634, 3565538, 3504724, 3449224, 3396630, 3344842, 3292798, 3240262, 3187521, 3135593, 3086040, 3040083, 2998337, 2961595, 2931215, 2908271, 2892719, 2883512, 2878905, 2876375, 2873006, 2866493, 2855467, 2838750, 2815004, 2783620, 2745447, 2702310, 2656263, 2609461, 2563994, 2521321, 2482291, 2447957, 2419780, 2398744, 2384897, 2378028, 2377992, 2383981, 2394362, 2408045, 2425594, 2448452, 2477582, 2513353, 2556133, 2606099, 2662568]
59811B662568O1383O4278O5034O3819O1120N7162N1475M3740L4737K5676J6932
59800C207924Q488J138l935o651p863p755n680j627L501R379J6879K6810L8871
59787C279479N2359O7172Q3758J02671J24361J49059J76854K08081K43278K82062
59777D769134L22306L60761L93587M15235M17897L94243L41639K63592J67981
59768G846375O4993l4464j21347j90964k42559k76698k94112k96762k88056k71396
59758E895010k49303k23967j97332j70338j43247j16944r2797p1125n0968l1615
59748D547374j3292L788J9961L5482N0412O5228Q0524R6144J11768J28087J46081
59737E271557J65303J84617K04591K27300K53447K81649L11090L42936L78255
$$ y = [2662568, 2723951, 2788229, 2853263, 2917082, 2978202, 3035364, 3086839, 3130579, 3165316, 3190992, 3207924, 3216412, 3217550, 3213615, 3206964, 3199101, 3191346, 3185666, 3184039, 3187540, 3196919, 3213798, 3240608, 3279479, 3331838, 3399010, 3482768, 3585439, 3709800, 3858859, 4035713, 4243794, 4487072, 4769134, 5091440, 5452201, 5845788, 6261023, 6678920, 7073163, 7414802, 7678394, 7846375, 7911368, 7876904, 7755557, 7564593, 7322034, 7045336, 6751224, 6454462, 6166406, 5895010, 5645707, 5421740, 5224408, 5054070, 4910823, 4793879, 4701082, 4629957, 4578989, 4547374, 4534082, 4537870, 4557831, 4593313, 4643725, 4708953, 4789477, 4885621, 4997389, 5125476, 5271557, 5436860, 5621477, 5826068, 6053368, 6306815, 6588464, 6899554, 7242490, 7620745]
59728G620745M16267M55610M95685N35439N72300O03500O27418O42528O46402
59719A2615894O37268O15918N85095N47934N08077M70333M39468M18486M08786
59710A7247259M11381M26703M53488M88789N29017N70337O08262O37683O53509
59701B2026428O51388O28355N83381N17359M32837L34271K28044J20999J8553
59692B5541615p5171j55758k18666k61349k83978k87533k72533k40095j92767
59683B3553765j33121o2470J8235J07391K03610L06613M16049N29963O45257P58757
59673B6344049Q66609R62897J039643J087721J097511J060026R69417Q25022O31349
59664C4884244L97272J36155j34600l96408o33262q33531r89806j098674j160636
$$ y = [7620745, 8037012, 8492622, 8988307, 9523746, 10096046, 10699546, 11326964, 11969492, 12615894, 13253162, 13869080, 14454175, 15002109, 15510186, 15980519, 16419987, 16838473, 17247259, 17658640, 18085343, 18538831, 19027620, 19556637, 20126974, 20735236, 21372919, 22026428, 22677816, 23306171, 23889552, 24406911, 24839748, 25174019, 25402063, 25523062, 25541615, 25466444, 25310686, 25092020, 24830671, 24546693, 24259160, 23986627, 23746532, 23553765, 23420644, 23358174, 23376409, 23483800, 23687410, 23994023, 24410072, 24940035, 25585292, 26344049, 27210658, 28173555, 29213198, 30300919, 31398430, 32458456, 33427873, 34252895, 34884244, 35281516, 35417671, 35283071, 34886663, 34253401, 33419870, 32430064, 31331390, 30170754]
59655C0170754j179309j160408j111520j042128r62894q84861q19132p75651p60183
59646B1474668p71451q01437q38915q73565q98508r10573r08913q93583q65513
59637A3712210q27192p82134p33073o81345o28111n75206n24332m76203m31147
59628H053467l89739l52303l18375k87263k58685k32447k08140j85615j65072
59619E655828j46319j28596j11596r6028q2787p2264o4694o0297n8648n8750o0226
59608D715623o3593o8996p5628q2770r0204r7047j01536j02979j02756j02280
59598C827834j01020r7738r2671q7060q1138p4118o5976n7757n0183m2950l5578
59587C041645k8146k1002j4333q134k338K949P306J0439J2814J5191J7432J8538
$$ y = [30170754, 28991445, 27831037, 26719517, 25677389, 24714495, 23829634, 23010502, 22234851, 21474668, 20703217, 19901780, 19062865, 18189300, 17290792, 16380219, 15471306, 14577723, 13712210, 12885018, 12102884, 11369811, 10688466, 10060355, 9485149, 8960817, 8484614, 8053467, 7663728, 7311425, 6993050, 6705787, 6447102, 6214655, 6006515, 5820900, 5655828, 5509509, 5380913, 5269317, 5173289, 5090502, 5018238, 4953544, 4893247, 4834599, 4775849, 4715623, 4652030, 4583034, 4507406, 4424636, 4334432, 4237385, 4135849, 4032870, 3930114, 3827834, 3726814, 3629076, 3536405, 3449345, 3368207, 3294089, 3228113, 3170356, 3120173, 3077223, 3041645, 3013499, 2992497, 2978164, 2970030, 2967692, 2970641, 2977947, 2988386, 3001200, 3016391, 3033823, 3052361]
59575C052361J8175J7254J6654J6354J6319J7150J9208K2045K5469L0163L6437
59564C287589M3406N0383N8080O7268P7148Q6431R5462J05910J18665J33130J48390
59553D271862J64109J80427J97732K16252K35320K53439K69642K84138K96993
59544F369914L07026L12910L14620L12834L07648K98966K87529K74099K58028
59535I043574K38006K14331J89443J66171J46120J29633J16541J06885J01343
59526A0452047J00830J05430J14092J25432J37947J48990J54699J51854J39262
59517A1630583J16789Q4155M1660q905o5232j25587j87853k48428l03559l51247
59507A0582376l90716m20807m40329m49569m49949m42557m28275m08861l86354
$$ y = [3052361, 3070536, 3087790, 3104444, 3120798, 3137117, 3154267, 3173475, 3195520, 3220989, 3251152, 3287589, 3330995, 3381378, 3439458, 3506726, 3583874, 3670305, 3765767, 3871677, 3990342, 4123472, 4271862, 4435971, 4616398, 4814130, 5030382, 5265702, 5519141, 5788783, 6072921, 6369914, 6676940, 6989850, 7304470, 7617304, 7924952, 8223918, 8511447, 8785546, 9043574, 9281580, 9495911, 9685354, 9851525, 9997645, 10127278, 10243819, 10350704, 10452047, 10552877, 10658307, 10772399, 10897831, 11035778, 11184768, 11339467, 11491321, 11630583, 11747372, 11831527, 11873187, 11864282, 11799050, 11673463, 11485610, 11237182, 10933623, 10582376, 10191660, 9770853, 9330524, 8880955, 8431006, 7988449, 7560174, 7151313, 6764959]
59498F764959l61512l34250l05463k77023k49917k23813j98619j75197j54169
59489D484996j35017j16750r8872q1555o5280n0347l6256k1939p048P669K1872
59478C901473L6732N3444P1393Q9101J06468J24704J44334J64703J85268K05895
59468E083515K25827K43655K58430K69656K76097K75777K67362K50537K24935
59459G375791J89958J46089R5527M1188j4329o8727j19913j66185k06081k38138
59449G035180k61528k76815k85381k88198k85826k79213k69521k57268k42622
59440D588808k26454k10055j93895j77650j61501j46385j32766j20166j08108
59431C111828r6744q6257p6415o6991n8036m9592m1594l4102k7188k0689j4527
$$ y = [6764959, 6403447, 6069197, 5763734, 5486711, 5236794, 5012981, 4814362, 4639165, 4484996, 4349979, 4233229, 4134357, 4052802, 3987522, 3937175, 3900919, 3878980, 3871932, 3879601, 3901473, 3938205, 3991649, 4063042, 4152143, 4258611, 4383315, 4527649, 4692352, 4877620, 5083515, 5309342, 5552997, 5811427, 6081083, 6357180, 6632957, 6900319, 7150856, 7375791, 7565749, 7711838, 7807365, 7848553, 7834224, 7765497, 7645584, 7479399, 7273318, 7035180, 6773652, 6496837, 6211456, 5923258, 5637432, 5358219, 5088698, 4831430, 4588808, 4362354, 4152299, 3958404, 3780754, 3619253, 3472868, 3340102, 3219936, 3111828, 3015084, 2928827, 2852412, 2785421, 2727385, 2677793, 2636199, 2602097, 2574909, 2554220, 2539693]
59420B539693r067m531l68M065Q436J2027J5219J9390K4917L0010L2023K9820
59408B701634K4875K0269J8452J9725K2894K7233L3267M1659N2142O3720P4968
59397C100838Q3953Q9358R2507R7107J05811J18060J32216J48556J68675J93042
59387D330123K20936K52184K87180L25484L65971M08074M51374M94080N33159
59378G668565N65812N89727O02538O02621N90348N67337N34834M94167M48197
59369A2664146M00600L53771L08711K66466K27823J91663J55431J17487P7673
59360A4763771L5633r707n8791j10797j64245k16829k64685l03579l31308l48035
59350A2991428l54614l52163l43170l31213l19197l08934l02200l00460l03525
$$ y = [2539693, 2530626, 2526095, 2525727, 2529792, 2538228, 2550255, 2565474, 2584864, 2609781, 2639791, 2671814, 2701634, 2726509, 2746778, 2765230, 2784955, 2807849, 2835082, 2868349, 2910008, 2962150, 3025870, 3100838, 3184791, 3274149, 3366656, 3463763, 3569574, 3687634, 3819850, 3968406, 4137081, 4330123, 4551059, 4803243, 5090423, 5415907, 5781878, 6189952, 6641326, 7135406, 7668565, 8234377, 8824104, 9426642, 10029263, 10619611, 11186948, 11721782, 12215949, 12664146, 13064746, 13418517, 13727228, 13993694, 14221517, 14413180, 14568611, 14686098, 14763771, 14799404, 14789697, 14730906, 14620109, 14455864, 14239035, 13974350, 13670771, 13339463, 12991428, 12636814, 12284651, 11941481, 11610268, 11291071, 10982137, 10679937, 10379477, 10075952]
59341A0075952l10082l19475l31291l43369l52454l57197l58496l56668l50481
59332F996439l39638l25859l10439k92784k72577k51523k31365k11762j91736
59323D568756j71998j54131j38250j23078j07893r3113p9306o6648n5193m4779
59313C534367l4853k4960j5261o211K025R660J7072K4660L2544M0455M8288N6519
59301C684305O5425P4266Q2049Q8738R4689R9277J01447J01295R9698R6556R1027
59290D678772Q3534P5734O8218N9892N0358M1352L5101L2389L2836L5902M1049
59279E235137M7961N7005O8532Q1521R4122J05588J16136J24512J27462J22481
59269F180457J09859R1449O8815M3298J6491j0336l6457o0711q1464r8029j10910
$$ y = [10075952, 9765870, 9446395, 9115104, 8771735, 8419281, 8062084, 7703588, 7346920, 6996439, 6656801, 6330942, 6020503, 5727719, 5455142, 5203619, 4972254, 4760492, 4568756, 4396758, 4242627, 4104377, 3981299, 3873406, 3780293, 3700987, 3634339, 3579146, 3534367, 3499514, 3474554, 3459293, 3453082, 3455107, 3464767, 3481839, 3506499, 3539043, 3579498, 3627786, 3684305, 3749730, 3823996, 3906045, 3994783, 4089472, 4188749, 4290196, 4391491, 4491189, 4587745, 4678772, 4762306, 4838040, 4906258, 4966150, 5016508, 5057860, 5092961, 5125350, 5158186, 5194088, 5235137, 5283098, 5340103, 5408635, 5490156, 5584278, 5689866, 5806002, 5930514, 6057976, 6180457, 6290316, 6381765, 6450580, 6493878, 6510369, 6500033, 6463576, 6402865, 6321401, 6223372, 6112462]
59258F112462j20080j24386j23333j18133j10129r9404q5880p0592n4863l9092
59248E166570k3260p812O682K0014L1869M1735M9754N6703O2702O7015O9594P1749
59236E613315P4790P9138Q5330R4589J07698J24474J44956J69930J99412K31767
59226F925399K64977K97701L28317L53990L71469L78092L71542L49887L12596
59217I953970K60671J95446J18435L2744n6753j45282k29137l04583l67651m15967
59207I041893m49565m69265m75744m70757m57407m38055m13380l84416l53834
59198E129470l23990k95130k66839k39924k15482j93391j73067j54768j38890
59189C127989j24987j12537j01804r2903q5074p7843p1777o7136o3041n8829n4967
$$ y = [6112462, 5992382, 5867996, 5744663, 5626530, 5516401, 5416997, 5331117, 5260525, 5205662, 5166570, 5143310, 5135498, 5142180, 5162194, 5194063, 5235798, 5285552, 5342255, 5404957, 5471972, 5541566, 5613315, 5688105, 5767243, 5852573, 5947162, 6054860, 6179334, 6324290, 6494220, 6693632, 6925399, 7190376, 7488077, 7816394, 8170384, 8541853, 8919945, 9291487, 9641374, 9953970, 10214641, 10410087, 10528522, 10561266, 10504513, 10359231, 10130094, 9825511, 9457860, 9041893, 8592328, 8123063, 7647319, 7176562, 6719155, 6281100, 5867720, 5483304, 5129470, 4805480, 4510350, 4243511, 4003587, 3788105, 3594714, 3421647, 3266879, 3127989, 3003002, 2890465, 2788661, 2695758, 2610684, 2532841, 2461064, 2393928, 2330887, 2272058, 2217091]
59178B217091n1571m7554m2413l7418l3631l0146k5811k1258j7623j4474j0765
59167A884427o788l401j87L890Q666J3174J7215K1118K4625K7473L0372L4081
59155B054665L8054M1364M4295M7739N1680N5555N9505O4037O9044P4270Q0006
59144B680214Q6252R2026R6524J00114J03123J04773J04479J03037J01100R7620
59134C669262R1406Q3135P4227O4709N4029M3084L3521K5628J8800J3651J1730
59123D183182J3313J7181K2599L0159M0624N4005O9676Q6573J03595J20575J38319
59112D879801J57084J75789J93331K09499K23581K33413K36981K33759K23192
59103F766430K03452J73479J35205R2079M6446J20m3754q1678j12123j35237j51070
$$ y = [2217091, 2165520, 2117966, 2075553, 2038135, 2004504, 1974358, 1948547, 1927289, 1909666, 1895192, 1884427, 1877639, 1874238, 1874051, 1877941, 1886607, 1899781, 1916996, 1938114, 1962739, 1990212, 2020584, 2054665, 2092719, 2134083, 2178378, 2226117, 2277797, 2333352, 2392857, 2456894, 2525938, 2600208, 2680214, 2766466, 2858492, 2955016, 3055130, 3158253, 3263026, 3367505, 3470542, 3571642, 3669262, 3760668, 3843803, 3918030, 3982739, 4036768, 4079852, 4113373, 4139001, 4157801, 4171452, 4183182, 4196495, 4213676, 4236275, 4266434, 4307058, 4361063, 4430739, 4517312, 4620907, 4741482, 4879801, 5036885, 5212674, 5406005, 5615504, 5839085, 6072498, 6309479, 6543238, 6766430, 6969882, 7143361, 7278566, 7370645, 7417091, 7417211, 7373457, 7291779, 7179656, 7044419, 6893349]
59092F893349j59868j63197j62929j59656j53759j47011j41263j36430j31820
59083E537416j28388j27535j28507j29500j30684j33728j38678j43760j47956
59074D328680j51460j53833j54125j52798j51292j49564j46211j41009j35199
59065B993189j29245j22486j15083j08196j01953r5329q8184q1422p5077o8366
59055B007848o1822n7093n4227n1341m7508m3872m1254l8766l5666l2713l0647
59044A512939k8931k6888k4693k2424j9464j5628j1766q597o006l882k486j475
59032A340699K42L168O644R927J2861J5375J7332J9011K0646K1523K0668J8326
59020A506422J5580J2729R380N947L424J727n8j697j795k1K332M323O337Q730
$$ y = [6893349, 6733481, 6570284, 6407355, 6247699, 6093940, 5946929, 5805666, 5669236, 5537416, 5409028, 5281493, 5152986, 5023486, 4892802, 4759074, 4620396, 4476636, 4328680, 4177220, 4023387, 3869262, 3716464, 3565172, 3415608, 3269397, 3128388, 2993189, 2863944, 2741458, 2626375, 2518179, 2416226, 2320897, 2232713, 2151291, 2076214, 2007848, 1946026, 1888933, 1834706, 1783365, 1735857, 1691985, 1650731, 1611965, 1576299, 1543586, 1512939, 1484008, 1457120, 1432427, 1410003, 1390539, 1374911, 1363145, 1354548, 1348542, 1344660, 1342174, 1340699, 1340941, 1344109, 1350753, 1360680, 1373541, 1388916, 1406248, 1425259, 1445905, 1467428, 1488096, 1506422, 1522002, 1534731, 1544111, 1550058, 1553482, 1555209, 1555151, 1553454, 1551659, 1551638, 1553970, 1558293, 1564630, 1573360]
59006A573360J1058J3097J5117J6684J6605J4535J1479Q329N109J856j175m356
58994A681698q313j2322j4543j4255j2624j0926r347p785o482n380l997k377j052
58981A572295J00J732L716N276O464Q108J0182J1763J2807J4345J6659J8826K0513
58968A702786K2629K5621K8588L0720L2293L3694L4666L5094L5422L5771L5678
58957B052962L5074L4527L4339L4374L4871L6240L8103L9790M1762M5135M9774
58946B476951N4450N8934O4291P0877P7718Q4262R1160R8873J07045J15632J25179
58935C425372J35553J45909J56394J68430J82839J99102K16892K36891K59585
58926E126967K84582L11691L41446L74180M09715M48220M90115N34832N80930
$$ y = [1573360, 1584418, 1597515, 1612632, 1629316, 1645921, 1660456, 1671935, 1680264, 1685373, 1687229, 1686054, 1681698, 1673385, 1661063, 1646520, 1632265, 1619641, 1608715, 1599368, 1591583, 1585101, 1579721, 1575724, 1573347, 1572295, 1572395, 1574127, 1577843, 1583119, 1589583, 1597691, 1607873, 1619636, 1632443, 1646788, 1663447, 1682273, 1702786, 1725415, 1751036, 1779624, 1810344, 1842637, 1876331, 1910997, 1946091, 1981513, 2017284, 2052962, 2088036, 2122563, 2156902, 2191276, 2226147, 2262387, 2300490, 2340280, 2382042, 2427177, 2476951, 2531401, 2590335, 2654626, 2725503, 2803221, 2887483, 2978643, 3077516, 3184561, 3300193, 3425372, 3560925, 3706834, 3863228, 4031658, 4214497, 4413599, 4630491, 4867382, 5126967, 5411549, 5723240, 6064686, 6438866, 6848581, 7296801, 7786916, 8321748, 8902678]
58917H902678O27517O74184P19417P60278P93651Q16378Q24379Q13377P80633
58908A5712492P24708O44164N38798M12253K71369J22838k7623j73395l07407
58899A7918197m25235n25438o06478o66135p04769p26276p34321p29760p13071
58890A2086714o86940o54804o18640n79719n39897n00671m62359m25427l91149
58881G227108l60001l30932l03291k77981k55749k35939k17943k02108j88210
58872D854954j74787j61146j48360j37173j26582j15788j05742r7453r0284q3285
58862C614354p6723p0984o5420n9524n3889m8848m3654l7993l2806k8396k3552
58851C072565j7718j2265q095l796K152Q940J5017K0730K7422L4997M2286M9055
$$ y = [8902678, 9530195, 10204379, 10923796, 11684074, 12477725, 13294103, 14118482, 14931859, 15712492, 16437200, 17081364, 17620162, 18032415, 18303784, 18426622, 18398999, 18225604, 17918197, 17492962, 16967524, 16361046, 15694911, 14990142, 14263866, 13529545, 12799785, 12086714, 11399774, 10744970, 10126330, 9546611, 9006714, 8506043, 8043684, 7618257, 7227108, 6867107, 6536175, 6232884, 5954903, 5699154, 5463215, 5245272, 5043164, 4854954, 4680167, 4519021, 4370661, 4233488, 4106906, 3991118, 3885376, 3787923, 3697639, 3614354, 3537631, 3466647, 3401227, 3341703, 3287814, 3238966, 3195312, 3157319, 3124513, 3096117, 3072565, 3054847, 3042582, 3034487, 3030691, 3032843, 3041783, 3056800, 3077530, 3104952, 3139949, 3182235, 3231290]
58839C231290N6051O3656P1811Q0560Q9620R8218J06309J15028J25045J35600
58829D173188J46170J57767J71511J87076K03750K21852K42043K64393K89182
58820F056932L17406L49428L84333M21627M62216N06574N53191N99951O45702
58811A0297360O89258P27961P58379P77218P80722P64570P25656O63000N76520
58802A6760644M66858L37452J95032M6846j01152k42780l71002m80791n70990
58793A6040117o41801o92379p22625p35330p34246p21416o98254o67693o33015
58784I793358n95756n56764n18026m81401m46653m12869l80768l51676l25235
58775E724210l00187k76633k55596k37107k20522k05903j93320j81614j69692
$$ y = [3231290, 3287341, 3350997, 3422808, 3503368, 3592988, 3691206, 3797515, 3912543, 4037588, 4173188, 4319358, 4477125, 4648636, 4835712, 5039462, 5261314, 5503357, 5767750, 6056932, 6374338, 6723766, 7108099, 7529726, 7991942, 8498516, 9051707, 9651658, 10297360, 10986618, 11714579, 12472958, 13250176, 14030898, 14795468, 15521124, 16184124, 16760644, 17227502, 17564954, 17759986, 17806832, 17705680, 17462900, 17091898, 16611107, 16040117, 15398316, 14705937, 13983312, 13247982, 12513736, 11792320, 11094066, 10426373, 9793358, 9197602, 8640838, 8122812, 7641411, 7194758, 6781889, 6401121, 6049445, 5724210, 5424023, 5147390, 4891794, 4654687, 4434165, 4228262, 4034942, 3853328, 3683636]
58766C683636j58249j48462j39700j30309j20067j10103j00956r2277q3983p6228
58756B523302o8735o1324n4569m8832m3487l8065l3200k9350k5839k2352k0033
58745B077516j9688k0126j9792j8817j8116j7784j7892j9468k2904k6622k9019
58734A847288l0574l2371l3860l3918l3039l2546l2489l2028l1031k9790k8194
58723A497448k6537k5973k6712k7152k6244k5214k5295k5459k4352k2829k2343
58712A219338k2235k0887j8518j6589j5431j4456j3707j3261j2227j0155q266
58701A053606p507o924n795n561p303r158q947p840q433j0388j1114r934q596
58688I46106q083p692o986o260n397m332m054n205o505o620o483p531q826q498
$$ y = [3683636, 3525387, 3376925, 3237225, 3106916, 2986849, 2876746, 2775790, 2683513, 2599530, 2523302, 2454567, 2393243, 2338674, 2289842, 2246355, 2208290, 2175090, 2145740, 2119901, 2097549, 2077516, 2057828, 2037702, 2017910, 1999093, 1980977, 1963193, 1945301, 1925833, 1902929, 1876307, 1847288, 1816714, 1784343, 1750483, 1716565, 1683526, 1650980, 1618491, 1586463, 1555432, 1525642, 1497448, 1470911, 1444938, 1418226, 1391074, 1364830, 1339616, 1314321, 1288862, 1264510, 1241681, 1219338, 1197103, 1176216, 1157698, 1141109, 1125678, 1111222, 1097515, 1084254, 1072027, 1061872, 1053606, 1046099, 1039175, 1033380, 1027819, 1020516, 1011358, 1002411, 994571, 986138, 975750, 964636, 954702, 946106, 938023, 930331, 923345, 917085, 911688, 907356, 903302, 898097, 891592, 884972, 878489, 870958, 862132, 853634]
58674H53634o924n786m933l024n76N42J99j04P5R7L80J936M099N214N131M857
58658H54817M257K598O31k79n26j315k099j497kR30J727L861O799Q704R593J0954
58642H99153J2732J3624J4010J5520J8019J9898K1228K3649K7264L0490L3019
58631A128606L6171M0286M4399M8510N3628N9715O6057P3451Q3340R5112J06926
58620A836201J18994J33251J50008J67701J85678K04272K22227K36953K47234
58611C502519K52881K51845K40802K18707J87030J46715R8229M4710q239n6645
58601D878554r9464j35767j63673j82706j94358j99691j98683j92322j82923j72052
58591C156915j60228j48545j38154j28405j17967j07605r9171r2306q4995p7111
$$ y = [853634, 846710, 840924, 835991, 832967, 832391, 832933, 833132, 833028, 833103, 833200, 833580, 835516, 839615, 844829, 849960, 854817, 859074, 861672, 862303, 862024, 861498, 860183, 858084, 856587, 856585, 857515, 859242, 863103, 869902, 878606, 888199, 899153, 911885, 925509, 939519, 955039, 973058, 992956, 1014184, 1037833, 1065097, 1095587, 1128606, 1164777, 1205063, 1249462, 1297972, 1351600, 1411315, 1477372, 1550823, 1634163, 1729275, 1836201, 1955195, 2088446, 2238454, 2406155, 2591833, 2796105, 3018332, 3255285, 3502519, 3755400, 4007245, 4248047, 4466754, 4653784, 4800499, 4898728, 4943438, 4935199, 4878554, 4779090, 4643323, 4479650, 4296944, 4102586, 3902895, 3704212, 3511890, 3328967, 3156915, 2996687, 2848142, 2709988, 2581583, 2463616, 2356011, 2256840, 2164534, 2079539, 2002428]
58581B002428p0304o4684n8733n2404m7142m2866l8145l3273k9899k7610k4269
58570A513099j9852j6607j5176j3953j2503j2131j2728j2495j1339j1308j3127
58559A361880j5486j7982k1447k5049k6664k6571k7283k9102k9445k7243k4497
58548A091111k2661k0843j8488j6510j4957j2640r852q308p970p005n237m275
58536I42365m022k681n02L69M7Q29K491K069q72l224l749n032q512j1924j3444
58521H94208j4381j5805j6337j5306j4579j5231j5638j4586j3156j2079j0459
58510G36651q479p917q672q185n713l603l096k521j016j55m17J07J915K900K536
58495F94335L195N614P108O261N396O252P169O754O452P194P227N581M130M035
$$ y = [2002428, 1932124, 1867440, 1808707, 1756303, 1709161, 1666295, 1628150, 1594877, 1564978, 1537368, 1513099, 1493247, 1476640, 1461464, 1447511, 1435008, 1422877, 1410149, 1397654, 1386315, 1375007, 1361880, 1346394, 1328412, 1306965, 1281916, 1255252, 1228681, 1201398, 1172296, 1142851, 1115608, 1091111, 1068450, 1047607, 1029119, 1012609, 997652, 985012, 975160, 966852, 958882, 951877, 946640, 942365, 938343, 935662, 935160, 935529, 935576, 936405, 938896, 940965, 940093, 936869, 933120, 928088, 919576, 907652, 894208, 879827, 864022, 847685, 832379, 817800, 802569, 786931, 772345, 759189, 747110, 736651, 728172, 720255, 711583, 703398, 697685, 694082, 690986, 688465, 687449, 687294, 686877, 686984, 688899, 691799, 694335, 697530, 703144, 710252, 716513, 721909, 728161, 735330, 742084, 748536, 755730, 762957, 768538, 772668, 776703]
58481G76703L691K278J608K401K559J277R57K709M027L376L009M556N836N023
58467H20010M094N049O232N528L885K710R67k210n119o392p330q900r582q640
58453H00302q111r194j0077r633r602j0695j0479p751n150m587l997j542Q61J436
58439G11781K068M679P577Q648Q818R276Q671O116L627K644J537p59k296k029
58425G70358k186l981m968l603k174k229j432J738M616N139N592Q023J0371J0845
58411G96109J1648J4487J6853J6837J7033J9436K1021J8889J5385J3449J1372
58400I72519O924K353J69j791n985r944j0686j0358j2047j3809j2386r386q192
58387H87381q004o312m160l659l389j347O30K59o05L83J373J03j268j67J286L27
$$ y = [776703, 780394, 782672, 784280, 786681, 789240, 790517, 791474, 794183, 798210, 801586, 804595, 809151, 814987, 820010, 824104, 829153, 835385, 840913, 844798, 847508, 848475, 846265, 841146, 834754, 827424, 818524, 808942, 800302, 792191, 782997, 772920, 763287, 753685, 742990, 732511, 724760, 719610, 715023, 711026, 709484, 710345, 711781, 713849, 718528, 726105, 734753, 743571, 752847, 761518, 767634, 771261, 773905, 775442, 774683, 772387, 770358, 768172, 764191, 759223, 755620, 753446, 751217, 749785, 751523, 756139, 761278, 766870, 774893, 785264, 796109, 807757, 822244, 839097, 855934, 872967, 892403, 913424, 932313, 947698, 961147, 972519, 979443, 981796, 981965, 980174, 974189, 964245, 953559, 943201, 931154, 917345, 904959, 895573, 887381, 879377, 873065, 868905, 865246, 861857, 860510, 861140, 861399, 860794, 861177, 862550, 862653, 861385, 861218, 862504, 862831]
58371H62831r60M54K918L664M188O659Q803P962O470P334Q490P107N507O818Q720
58356I46965P822O315P878J0795J1536J1414J3090J4334J1982Q387P243O668L294
58343A067723o61j337n25j877l655k468m20j098k172L68M301N210M718O834R699
58328A084640R167P092P878J0121R916R037J1421J4850J4764J3083J4586J7721
58316A224276J7768J5999J6876J9250J9112J7863J8982J9999J6861J2711J2852
58305A412549J4707J2556Q504Q427J0673R554O788Q334J2721J3730J2123J3561
58293A544227J7267J7986J6840J8990K2797K2587J9922K0827K4171K4170K1996
58282A771780K3307K6767K6806K5103K7339L1449L1518L0226L4474M1643M3667
$$ y = [862831, 861871, 862325, 865243, 868907, 873095, 879754, 888557, 896519, 902989, 910323, 918813, 925920, 931427, 938245, 946965, 954787, 961102, 968980, 979775, 991311, 1002725, 1015815, 1030149, 1042131, 1050518, 1057761, 1064429, 1067723, 1067062, 1065725, 1065200, 1063323, 1059668, 1057200, 1056780, 1055682, 1053510, 1053878, 1058179, 1063389, 1068107, 1074941, 1084640, 1093807, 1100899, 1108777, 1118898, 1128814, 1137851, 1149272, 1164122, 1178886, 1191969, 1206555, 1224276, 1242044, 1258043, 1274919, 1294169, 1313281, 1331144, 1350126, 1370125, 1386986, 1399697, 1412549, 1427256, 1439812, 1448316, 1456743, 1467416, 1476970, 1483758, 1492092, 1504813, 1518543, 1530666, 1544227, 1561494, 1579480, 1596320, 1615310, 1638107, 1660694, 1680616, 1701443, 1725614, 1749784, 1771780, 1795087, 1821854, 1848660, 1873763, 1901102, 1932551, 1964069, 1994295, 2028769, 2070412, 2114079]
58271B114079M1845M3677M7855M6888M2093M1197M3274M1147L6539L7417M2289
58260B578300M2825M0159M2560M8884N0774M9486N3650O1888O5020O3951O7810
58249C165307P5717P8449P6822Q0050Q7352Q9971Q9747R6185J06858J10980J10694
58238D168132J17813J31137J38813J41422J50095J63523J70478J73387J84850
58229E539650K02540K13151K19125K34643K57359K72632K83466L06029L37696
58220G866291L61539L80395M12527M55545M90895N22167N70332O32669O87988
58211A2380348P41192Q18190R17646J015612J117226J252206J419973J595792
58203B1258185J791257K047451K369139K734654L171382L745880M480627N367096
$$ y = [2114079, 2155924, 2199601, 2247456, 2294344, 2336437, 2377634, 2420908, 2462055, 2498594, 2536011, 2578300, 2621125, 2661284, 2703844, 2752728, 2803502, 2852988, 2906638, 2968526, 3033546, 3097497, 3165307, 3241024, 3319473, 3396295, 3476345, 3563697, 3653668, 3743415, 3839600, 3946458, 4057438, 4168132, 4285945, 4417082, 4555895, 4697317, 4847412, 5010935, 5181413, 5354800, 5539650, 5742190, 5955341, 6174466, 6409109, 6666468, 6939100, 7222566, 7528595, 7866291, 8227830, 8608225, 9020752, 9476297, 9967192, 10489359, 11059691, 11692360, 12380348, 13121540, 13939730, 14857376, 15872988, 16990214, 18242420, 19662393, 21258185, 23049442, 25096893, 27466032, 30200686, 33372068, 37117948, 41598575, 46965671]
58195D6965671O458625P849959R572831J1638993J4180924J7389834K1312055
58188A35368892K5881948L1042572L6308125L9963949L9296141L2492976K0540280
58181C60894883O841916n237708j4319972k0743408k5123140k7645579k8394928
58174B46272064k7696582k5988824k3638938k0976224j8307750j5809781j3513338
58167A00340627j1432001r608719q035962o647314n409471m330347l372702k456734
58159D9047377j549071o53383K64443J192575J891967J969782J252542J4461j248460
58150E2182233k216977k868927l300330l559177l645940l571132l367376l078254
58142B6574120k752442k429398k125767j846130j598836j388706j207066j045098
$$ y = [46965671, 53424296, 61274255, 70847086, 82486079, 96667003, 114056837, 135368892, 161250840, 192293412, 228601537, 268565486, 307861627, 340354603, 360894883, 367736799, 362499091, 348179119, 327435711, 302312571, 274666992, 246272064, 218575482, 192586658, 168947720, 147971496, 129663746, 113853965, 100340627, 88908626, 79299907, 71263945, 64616631, 59207160, 54876813, 51504111, 49047377, 47498306, 46844923, 47109366, 48301941, 50193908, 52163690, 53416232, 53430693, 52182233, 49965256, 47096329, 43795999, 40236822, 36590882, 33019750, 29652374, 26574120, 23821678, 21392280, 19266513, 17420383, 15821547, 14432841, 13225775, 12180677]
58134A2180677r06851p96573p05887o25984n59608n09239m66820m26543l94137
58125F789035l72522l51996l25562l00310k82749k66359k44455k22270k05461
58116D217351j89137j68882j50900j40994j34566j26758j21362j20823j18692
58107B945237j10824j03224j00381r6760q8010p9606p6047p2241o4043n6710n4574
58096B042817n2493m6078m0455m0421m1470l8921l6759l9040m1364l9126l6010
58085A590680l6401l7318l5341l3615l4718l4411k9670k5276k5391k6157k3496
58074A248886k0702k1372k2219j9814j7315j7778j7796j4443j1532j2383j3230
58063A060302j0377p186p391q098o020m196n949q330p944p307r191j0690r110
$$ y = [12180677, 11273826, 10477253, 9771366, 9145382, 8585774, 8076535, 7609715, 7183172, 6789035, 6416513, 6064517, 5738955, 5438645, 5155896, 4889537, 4645082, 4422812, 4217351, 4028214, 3859332, 3708432, 3567438, 3432872, 3306114, 3184752, 3063929, 2945237, 2834413, 2731189, 2630808, 2534048, 2446038, 2366432, 2290385, 2218144, 2154101, 2097391, 2042817, 1990324, 1944246, 1903791, 1863370, 1821900, 1782979, 1746220, 1707180, 1665816, 1626690, 1590680, 1554279, 1516961, 1481620, 1448005, 1413287, 1378876, 1349206, 1323930, 1298539, 1272382, 1248886, 1228184, 1206812, 1184593, 1164779, 1147464, 1129686, 1111890, 1097447, 1085915, 1073532, 1060302, 1049925, 1042739, 1035348, 1027250, 1021230, 1017034, 1011085, 1002755, 994811, 987504, 978313, 967623, 958513]
58050I58513p717r461j0877q499n483n609o401m482k241k846l971k688j362k535
58036H84341l119M8L808M086K850L672M968L842K161K737L615K015j13K9P07m36
58020I15211j409j16P44j510m129l769k488l466n028m544l979n864p789o771n130
58005H59963o169p758o277l342k664l453k773j421j721k400j323m31k515n725
57991H11991o615n949o305o777n232l097k638k227N73L872M537L760M466N771
57977G96130N176L709L859M708M124L203L665L516M85k867k769o68o75k778l950
57962H14868l995m893o052n451m001l915m268k895j001j149k423k268j323j782
57948G69452k693j777j05j50q53M29K697K989J798J785K494J328j301k720k877
$$ y = [958513, 950796, 941335, 930458, 921959, 916476, 910867, 904466, 899984, 897743, 894897, 890926, 888238, 886876, 884341, 881222, 881270, 885078, 889164, 892014, 895686, 900654, 904496, 906657, 909394, 913009, 915024, 914911, 914940, 915647, 915211, 913802, 913686, 914430, 912920, 908791, 905022, 902534, 899068, 894040, 889496, 885517, 879653, 871864, 865093, 859963, 853794, 846036, 839759, 836417, 833753, 830300, 827527, 826106, 824385, 821985, 820662, 820231, 817716, 811991, 805376, 799427, 793122, 786345, 781113, 778016, 775378, 773151, 773724, 777596, 782133, 785893, 790359, 796130, 801306, 805015, 808874, 813582, 817706, 820909, 824574, 828090, 828575, 825708, 822939, 822271, 821596, 818818, 814868, 810873, 805980, 799928, 794477, 790476, 786561, 782293, 779398, 778397, 777248, 774825, 772557, 771234, 769452, 766759, 764982, 764877, 764727, 763874, 764303, 767000, 769989, 771787, 773572, 776066, 777394, 776093, 773373, 770496]
57933G70496l815n251n281m559n237o703o727n860o226p093o177m317m259n630
57919F93361n688m199l136k383k47K508L668L860N452P881Q561P822Q399J0424
57905G36283J1388J0742J0303J0337R459Q068P803P915O260L465K025J753L25
57892H26126k090l115k749l317n012n742n363n822o985o638m749l706l990l642
57878G63206k321j885k606k564j247j58M32J795L684M477M449N380O908O970N832
57863G92352N853P163P447O270N640O002N521L851K791K652J680k72j226q12r58
57848H43954k098k354j232o32j353j947j823k150k937k621j374j411l058l892
57834H15072k806j681j930k503k503k836l993m906n110n595o565o862o336o296
$$ y = [770496, 766681, 761430, 756149, 751590, 746353, 739650, 732923, 727063, 720837, 713744, 707567, 703250, 698991, 693361, 687673, 683474, 680338, 677955, 677708, 680216, 683884, 687744, 693196, 701077, 709638, 717460, 725859, 736283, 747671, 758413, 768716, 779053, 788512, 796580, 804383, 812298, 818558, 822023, 824048, 825801, 826126, 824036, 820921, 818172, 814855, 809843, 804101, 798738, 792916, 785931, 779293, 774544, 770838, 766848, 763206, 760885, 759000, 756394, 753830, 752583, 752425, 752857, 754652, 758336, 762813, 767262, 772642, 779550, 786520, 792352, 798205, 805368, 812815, 819085, 824725, 830727, 836248, 840099, 842890, 845542, 847222, 846950, 845724, 844912, 843954, 841856, 839502, 838270, 837638, 836285, 834338, 832515, 830365, 827428, 824807, 823433, 822022, 818964, 815072, 812266, 810585, 808655, 806152, 803649, 800813, 796820, 791914, 786804, 781209, 774644, 767782, 761446, 755150]
57820G55150p026p294o821o638o688n760m136l446l593k702n72Q80R98J210J964
57805G05526J953J084R99K080K867L143M424O729Q024P673P399P995Q210P668
57791G75774P653Q179P494N486M288M543M373L123K659L662M098K893J732J557
57777H37514N94k162m605m803l848l417l113k256j816k381k524j154N60J429K209
57762H10227L638M687M570M421N160N730N225M807N607O612O513N951O093O503
57748H85744O193N470N177N247N313N483N547M803L619L524M944O437O972P125
57734I61598P303O856N823N495O205O635O299O538P954R150R245R460J0796J2284
57720A071641J2984J3716J5290J6851J7511J7913J8842J9883K0624K1563K2823
$$ y = [755150, 748124, 740830, 734009, 727371, 720683, 714923, 710787, 707341, 703748, 701046, 700474, 701354, 702352, 703562, 705526, 707479, 708563, 709562, 711642, 714509, 717652, 722076, 728805, 736829, 744502, 751901, 759896, 768106, 775774, 783427, 791606, 799100, 804586, 808874, 813417, 817790, 820913, 823572, 827234, 831332, 834225, 835957, 837514, 838108, 835946, 831341, 826538, 822690, 819273, 816160, 813904, 812088, 809707, 807183, 806029, 806589, 808018, 810227, 813865, 818552, 823122, 827543, 832703, 838433, 843658, 848465, 854072, 860684, 867197, 873148, 879241, 885744, 891937, 897407, 902584, 907831, 913144, 918627, 924174, 928977, 932596, 936120, 941064, 947501, 954473, 961598, 968901, 975757, 981580, 987075, 993280, 999915, 1006214, 1012752, 1020706, 1029856, 1039101, 1048561, 1059357, 1071641, 1084625, 1098341, 1113631, 1130482, 1147993, 1165906, 1184748, 1204631, 1225255, 1246818, 1269641]
57709A269641K3683K4258K5658K7851K9560L0993L4062L8920M3144M5781M9194
57698A642745N5102O1537O6044O9418P3928P9921Q6749R5172J06319J19578J33772
57687B590285J49330J67323J87356K08064K28397K46685K59785K64918K61388
57678D563531K49287K27979J97690J61466J23983Q9170O0010L9361K9052K7779
57668E769308K9497K3464j878n0621j13659j74118k19983k49813k66870k72515
57658D472812k67411k54590k37387k16629j92789j68711j47230j27973j09304
57649B750788r1746p6871o4386n2955m2428l3041k4003j5082p858l007J807Q876
57637B350094J7122K4404L1305L9671M9118N8191O7643P9370R3058J06896J20783
$$ y = [1269641, 1293324, 1317582, 1343240, 1371091, 1400651, 1431644, 1465706, 1504626, 1547770, 1593551, 1642745, 1697847, 1759384, 1825428, 1894846, 1968774, 2048695, 2135444, 2230616, 2336935, 2456513, 2590285, 2739615, 2906938, 3094294, 3302358, 3530755, 3777440, 4037225, 4302143, 4563531, 4812818, 5040797, 5238487, 5399953, 5523936, 5613106, 5673116, 5712477, 5741529, 5769308, 5798805, 5822269, 5820391, 5769770, 5656111, 5481993, 5262010, 5012197, 4745327, 4472812, 4205401, 3950811, 3713424, 3496795, 3304006, 3135295, 2988065, 2860092, 2750788, 2659042, 2582171, 2517785, 2464830, 2422402, 2389361, 2365358, 2350276, 2342418, 2339411, 2341218, 2350094, 2367216, 2391620, 2422925, 2462596, 2511714, 2569905, 2637548, 2716918, 2809976, 2916872, 3037655]
57626C037655J35919J51885J66998J80910J94112K05237K11313K10246K00887
57617D695162J81551J51265J12130O8088K1773k5259p0057j08867j40092j64390
57607D721304j82017j92297j95472j92971j86000j75655j63976j52804j41927
57598C138185j30211j18105j07148r7611q8633q0210p3012o6614o0051n3629m8343
57587B214618m3905l9301l4823l1507k9045k6276k3283k1021j9320j7268j5112
57576A913757j3762j2762j0880q325o390n179l705j974r26n49N5R89J747K723
57562A854819M627O799Q047Q778J0331J2483J3688J3581J3369J3857J4826J6142
57550A991347J7755J9034J9715K0989K3934K7573L0385L2975L7112M2766M8427
$$ y = [3037655, 3173574, 3325459, 3492457, 3673367, 3867479, 4072716, 4284029, 4494275, 4695162, 4876713, 5027978, 5140108, 5208196, 5229969, 5204710, 5134653, 5025786, 4885694, 4721304, 4539287, 4346990, 4151518, 3958547, 3772547, 3596892, 3432916, 3280112, 3138185, 3007974, 2889869, 2782721, 2685110, 2596477, 2516267, 2443255, 2376641, 2316590, 2262961, 2214618, 2170713, 2131412, 2096589, 2065082, 2036037, 2009761, 1986478, 1965457, 1946137, 1928869, 1913757, 1899995, 1887233, 1876353, 1868028, 1861638, 1856459, 1852754, 1850780, 1849854, 1849305, 1849360, 1850349, 1852096, 1854819, 1859446, 1866245, 1874292, 1883070, 1893401, 1905884, 1919572, 1933153, 1946522, 1960379, 1975205, 1991347, 2009102, 2028136, 2047851, 2068840, 2092774, 2120347, 2150732, 2183707, 2220819, 2263585, 2312012]
57539B312012N3728N9565O6089P2979Q1133R1623J03403J14608J25671J38411
57529C219222J52266J64373J73312J79779J83161J80412J69163J49607J22729
57520D694024Q9301N1396J2672k3953n7206q5763j07873j23302j33602j39685
57510D176009j40949j37493j31244j24044j16223j07625r8518q8981p8914o9050
57500C082968o0493n3107m5902l9035l3591k9326k4763j9682j5382j2096q338
57489B741253l399J608N822R780J3831J7424K0683K4845L0288L5910M1146M6887
57477B986078N3692O0912O8334P6943Q7216R8274J09545J21609J34589J47247
57467C944439J58406J67736J74291J75809J70338J57291J36511J07938P3035L4983
$$ y = [2312012, 2365740, 2425305, 2491394, 2564373, 2645506, 2737129, 2840532, 2955140, 3080811, 3219222, 3371488, 3535861, 3709173, 3888952, 4072113, 4252525, 4421688, 4571295, 4694024, 4783325, 4834721, 4847393, 4823440, 4766234, 4680471, 4572598, 4449296, 4315694, 4176009, 4035060, 3897567, 3766323, 3642279, 3526056, 3418431, 3319913, 3230932, 3152018, 3082968, 3022475, 2969368, 2923466, 2884431, 2850840, 2821514, 2796751, 2777069, 2761687, 2749591, 2741253, 2737854, 2739462, 2745284, 2755064, 2768895, 2786319, 2807002, 2831847, 2862135, 2898045, 2939191, 2986078, 3039770, 3100682, 3169016, 3245959, 3333175, 3431449, 3540994, 3662603, 3797192, 3944439, 4102845, 4270581, 4444872, 4620681, 4791019, 4948310, 5084821, 5192759, 5265794, 5300777]
57457E300777l389m0560p4807j03466j24787j39165j47766j51197j50133j45881
57447D219626j39372j30781j20649j10216j00137r0155q0434p1790o4249n6882
57437C254961m9545m3236l8221l3475k8546k4326k1274j8487j5385j2758j1259
57426B958449j0240q863p163n304l089q19O17J078J410J989K377K637L461M696
57412B941236N339N354N733O475O430N626N641P030Q458R081R764J0997J1748
57399C038912J1479J1340J2154J2963J2834J2382J2416J2674J2972J3854J5139
57388C179119J5535J4757J4210J4552J4596J3737J3337J4238J5096J4740J4219
57377C338136J4689J5234J4747J4130J4560J5205J4828J4223J4766J5861J6065
$$ y = [5300777, 5297388, 5256828, 5182021, 5078555, 4953768, 4814603, 4666837, 4515640, 4365507, 4219626, 4080254, 3949473, 3828824, 3718608, 3618471, 3528316, 3447882, 3376092, 3311843, 3254961, 3205416, 3162180, 3123959, 3090484, 3061938, 3037612, 3016338, 2997851, 2982466, 2969708, 2958449, 2948209, 2939346, 2932183, 2926879, 2923790, 2922971, 2923588, 2924666, 2926076, 2928065, 2930442, 2933079, 2936540, 2941236, 2946575, 2951929, 2957662, 2964137, 2970567, 2976193, 2981834, 2988864, 2997322, 3006403, 3016167, 3027164, 3038912, 3050391, 3061731, 3073885, 3086848, 3099682, 3112064, 3124480, 3137154, 3150126, 3163980, 3179119, 3194654, 3209411, 3223621, 3238173, 3252769, 3266506, 3279843, 3294081, 3309177, 3323917, 3338136, 3352825, 3368059, 3382806, 3396936, 3411496, 3426701, 3441529, 3455752, 3470518, 3486379, 3502444]
57366C502444J5704J6052J6845J6847J6192J6004J6259J6071J5637J5906J6658
57355C680619J6729J5979J5344J5191J5103J5039J5291J5603J5582J5691J6499
57344C852670J7391J7359J6694J6511J6928J7066J6686J6483J6853J7451J7940
57333D040032J8300J8458J8346J8159J8033J7778J7414J7312J7436J7242J6814
57322D235324J7095J8294J9166J8707J7553J6798J6533J6541J7206J8621J9754
57311D431592J9824J9541J9832K0284K0119J9748J9994K0599K0805K0720K0911
57300D653969K1327K1795K2720K4177K5225K5264K5163K5848K6838K7493K8440
57289D928259L0314L2156L2831L3077L4287L6161L7395L8014L9018M0250M0588
$$ y = [3502444, 3518148, 3534200, 3551045, 3567892, 3584084, 3600088, 3616347, 3632418, 3648055, 3663961, 3680619, 3697348, 3713327, 3728671, 3743862, 3758965, 3774004, 3789295, 3804898, 3820480, 3836171, 3852670, 3870061, 3887420, 3904114, 3920625, 3937553, 3954619, 3971305, 3987788, 4004641, 4022092, 4040032, 4058332, 4076790, 4095136, 4113295, 4131328, 4149106, 4166520, 4183832, 4201268, 4218510, 4235324, 4252419, 4270713, 4289879, 4308586, 4326139, 4342937, 4359470, 4376011, 4393217, 4411838, 4431592, 4451416, 4470957, 4490789, 4511073, 4531192, 4550940, 4570934, 4591533, 4612338, 4633058, 4653969, 4675296, 4697091, 4719811, 4743988, 4769213, 4794477, 4819640, 4845488, 4872326, 4899819, 4928259, 4958573, 4990729, 5023560, 5056637, 5090924, 5127085, 5164480, 5202494, 5241512, 5281762, 5322350]
57278E322350M0076L9870M0159L9733L7749L4422L0056K4725J8951J3388P851
57267E649330J753m531r797j3380j5495j6499j6736j6740j6730j6216j4889j3267
57255E496803j1752r882p497n572m718l912k106q9P94Q71J334K101K310K298L082
57240E464065M296M617M028L822M436N043N235N472N795N639N087M919N266N459
57226E533179N194M799M480M382N052O621P981Q094P688Q279R918J1412J2366
57213E629445J3355J4292J4353J3571J3027J3289J3823J3902J3089J1161Q779
57202E772086P678Q769J0461J0483Q937P870Q129Q510P897O503M860L191J908
57189E867282J345R87J67o83q65j011k211l956m830m955n725p225p976p446o753
$$ y = [5322350, 5362426, 5402296, 5442455, 5482188, 5519937, 5554359, 5584415, 5609140, 5628091, 5641479, 5649330, 5651083, 5646552, 5636755, 5623375, 5607880, 5591381, 5574645, 5557905, 5541175, 5524959, 5510070, 5496803, 5485051, 5475169, 5467672, 5462100, 5457382, 5453470, 5451364, 5451275, 5452069, 5452940, 5454274, 5456375, 5458685, 5460983, 5464065, 5468361, 5472978, 5477006, 5480828, 5485264, 5490307, 5495542, 5501014, 5506809, 5512448, 5517535, 5522454, 5527720, 5533179, 5538373, 5543172, 5547652, 5552034, 5557086, 5563707, 5571688, 5579782, 5587470, 5595749, 5605667, 5617079, 5629445, 5642800, 5657092, 5671445, 5685016, 5698043, 5711332, 5725155, 5739057, 5752146, 5763307, 5772086, 5779764, 5788533, 5798994, 5809477, 5818414, 5826284, 5834413, 5842923, 5850820, 5857323, 5862183, 5865374, 5867282, 5868627, 5869614, 5869781, 5869098, 5868233, 5867222, 5865011, 5861055, 5856225, 5851270, 5845545, 5838320, 5830344, 5822898, 5816145]
57174E816145o683o833p024p638q278p959o994o806p507p582o498n618n791o018
57160E718916n373m592m672n466o588q311j0550j2270j2873j3135j4004j5488
57148E605594j7357j9802k2685k5317k7578l0196l3308l5930l7520l8887m0751
57137E276263m2557m3501m3757m3850m3718m3127m2308m1557m0849m0280m0078
57126D810681l9895l9015l7597l6643l6388l5789l4094l1761k9425k7145k5192
57115D437737k4412k5130k6684k8645l1210l3736l4108l0655k3727j4583l632
57104D161215R305K3982M0296N9200Q2081J09693J42728J83014K33215K95677
57094E340406L72345M65091N75047P01962Q45510J006860J187464J386161J598542
$$ y = [5816145, 5809462, 5802629, 5795605, 5787967, 5779689, 5771730, 5764736, 5757930, 5750423, 5742841, 5736343, 5730725, 5724934, 5718916, 5713543, 5708951, 5704279, 5698813, 5692225, 5683914, 5673364, 5661094, 5648221, 5635086, 5621082, 5605594, 5588237, 5568435, 5545750, 5520433, 5492855, 5462659, 5429351, 5393421, 5355901, 5317014, 5276263, 5233706, 5190205, 5146448, 5102598, 5058880, 5015753, 4973445, 4931888, 4891039, 4850759, 4810681, 4770786, 4731771, 4694174, 4657531, 4621143, 4585354, 4551260, 4519499, 4490074, 4462929, 4437737, 4413325, 4388195, 4361511, 4332866, 4301656, 4267920, 4233812, 4203157, 4179430, 4164847, 4161215, 4170520, 4194502, 4234798, 4293998, 4376079, 4485772, 4628500, 4811514, 5044729, 5340406, 5712751, 6177842, 6752889, 7454851, 8300361, 9307221, 10494685, 11880846, 13479388]
57085A3479388J818323K036519K239136K410529K541805K628834K651177K555447
57077C2361158K280613J821098J264514P47794L59200P9506j82496n03126q90461
57068C7337800j297087j663421j947523k131832k218634k221953k158850k044712
57060B1653788j893924j720845j538181j356054j183357j027645q92444p76508
57052A1264830o76893n91424n17972m54001l98398l52217l16380k89636k69445
57043G398464k53556k40231k28379k18105k09994k03657j98234j94006j91738
57034E460564j90623j88974j86805j85423j84430j81791j77225j72842j69698
57025C822753j66361j61630j56226j50823j45021j39218j34997j32542j30049
$$ y = [13479388, 15297711, 17334230, 19573366, 21983895, 24525700, 27154534, 29805711, 32361158, 34641771, 36462869, 37727383, 38475177, 38834377, 38913883, 38731387, 38228261, 37337800, 36040713, 34377292, 32429769, 30297937, 28079303, 25857350, 23698500, 21653788, 19759864, 18039019, 16500838, 15144784, 13961427, 12933782, 12041338, 11264830, 10587937, 9996513, 9478541, 9024540, 8626142, 8273925, 7957545, 7667909, 7398464, 7144908, 6904677, 6676298, 6458193, 6248199, 6044542, 5846308, 5652302, 5460564, 5269941, 5080967, 4894162, 4708739, 4524309, 4342518, 4165293, 3992451, 3822753, 3656392, 3494762, 3338536, 3187713, 3042692, 2903474, 2768477, 2635935, 2505886]
57016B505886j26672j23508j20689j16254j09243j01090r2523q2029o9027n5505
57006A509346m2393k7353q426J3249L6879O4070R2746J11836J08239P9713L7143
56995A975049o129m3679p4903r9515j16033j23750j23651j17551j07385r5026
56985A067427q2059o9465n7590m6602l7403l1830l0950l3251l5684l6768l7245
56974E68580l7601l6882l4595l1761k8962k5244k0202j5316j1725q333l765J340
56962C15534N626R176J2721J6077J9091K2686K7012K9667K7774K1186J2159K908
56950E21617n117j0769j3949j5987j7820j8669j7744j5895j4152j2063r185o650
56938C63617n283l571K49N302R536J3074J7700K3666K9207L2563L2537K7836J8292
$$ y = [2505886, 2379214, 2255706, 2135017, 2018763, 1909520, 1808430, 1715907, 1633878, 1564851, 1509346, 1466953, 1439600, 1431174, 1444423, 1481302, 1545372, 1638118, 1749954, 1858193, 1937906, 1975049, 1968920, 1925241, 1850338, 1750823, 1634790, 1511040, 1387389, 1269838, 1162453, 1067427, 985368, 915903, 858313, 811711, 774308, 742478, 711528, 678277, 642593, 605825, 568580, 530979, 494097, 459502, 427741, 398779, 373535, 353333, 338017, 326292, 317959, 314194, 315534, 321160, 330336, 343057, 359134, 378225, 400911, 427923, 457590, 485364, 506550, 518709, 521617, 516500, 505731, 491782, 475795, 457975, 439306, 421562, 405667, 391515, 379452, 370267, 363617, 358334, 354763, 355012, 360314, 369850, 382924, 400624, 424290, 453497, 486060, 518597, 546433, 564725]
56925E64725O370m488j2869j9215k3576k5478k5429k4561k3124k0992j8910j7526
56913C54927j5931j3109j0068q541q293p752o646n860n315m164k669j747j112
56900B63720J10J433J877K165L784O271P833Q359R419J1459J3366J4857J6949
56887C61602J9977K3202K6292K8987K9362K4977J6233O505j404p115j0981j2940
56875E04697j3470j3637j3498j2155r672p175m823j551K855P393J1873J7398K4302
56862D92537L1606L9133M8148N8661O7444O9749O2521M6058K4050K180j4984k6618
56850I00485l4668m0442m3467m3317m0643l6042k9506k1460j2941m334M872J4899
56838F13436K5447L6816M9928O5132Q1901R9057J13459J18875J09015Q3068M7246
$$ y = [564725, 571095, 566607, 553738, 534523, 510947, 485469, 460040, 435479, 412355, 391363, 372453, 354927, 338996, 325887, 315819, 307278, 298985, 291233, 284587, 278727, 273412, 269248, 266579, 264832, 263720, 263830, 265263, 267140, 269305, 273089, 279360, 287193, 295552, 304971, 316430, 329796, 344653, 361602, 381579, 404781, 431073, 460060, 489422, 514399, 530632, 537137, 535733, 528618, 517637, 504697, 491227, 477590, 464092, 451937, 442265, 435090, 430267, 428716, 431571, 438964, 450837, 468235, 492537, 524143, 563276, 611424, 670085, 737529, 807278, 869799, 915857, 939907, 942087, 927103, 900485, 865817, 825375, 781908, 738591, 697948, 661906, 632400, 610940, 597999, 593665, 598537, 613436, 638883, 675699, 725627, 790759, 872660, 971717, 1085176, 1204051, 1313066, 1396134, 1443380]
56827A443380J0248k1905m6992o4988p6631q2649q3461p9758p3085o4999n5914
56816H03246m5711l4991k4489j3812k183R985K1790L3716M7116O1740P4909Q2630
56804A013946Q0505O5295L8381P206j9492l8319n1430o1007o6489o7288o4859
56793H36449o0827n5260m8060m0218l2668k5315j7921j0665l387M356J2305J9962
56781E78751K7837L6247M2745M2926L4615J9895K875j2910k5110l2929l7638m1069
56769F36235m3229m2890m0297l7216l4365l1003k7202k4113k1735j8821j5453
56758B99911j3192j2211j0822q477o684o162n615m334l436l503l412k706k648
56745B16709l668m088k903j557j480j905j741j567k137k714k544k372k945l546
$$ y = [1443380, 1453628, 1431723, 1384731, 1319743, 1243112, 1160463, 1077002, 997244, 924159, 859160, 803246, 757535, 722544, 698055, 684243, 682060, 692045, 713835, 747551, 794667, 856407, 931316, 1013946, 1094451, 1159746, 1198127, 1205333, 1185841, 1147522, 1096092, 1035085, 968596, 901308, 836449, 775622, 720362, 672302, 632084, 599416, 574101, 556180, 545515, 542128, 546484, 558789, 578751, 606588, 642835, 685580, 728506, 763121, 783016, 785891, 772981, 747871, 714942, 677304, 636235, 593006, 550116, 509819, 472603, 438238, 407235, 380033, 355920, 334185, 315364, 299911, 286719, 274508, 263686, 255209, 248525, 242363, 236748, 232414, 228978, 225475, 222063, 219357, 216709, 213041, 208953, 206050, 204493, 203013, 201108, 199367, 197800, 195663, 192949, 190405, 188033, 185088, 181542]
56731A81542l449l274l568l616l003k755l493m002l089j449l03L48Q38P19l1k38
56715A51177N95J070L7j378j471m55K57K09p6l46n88n45k78l27o20k84Q10J576
56697A49363J472J283J468J303N85M41J440K430K390J851J541J142M66K47P58
56682A68180J103R38J144J949K178J446J098J844K444K047J727K190K108N11j118
56667A89789j127l10l45j052j265r96r37r36p14q93j694j964r40K54M08L9p1n33
56649A76713j863k931k755k368l042m013l854k805j996j611j527k362m073m957
56635A36556l899k281j776j711o86O89R11K58M8K82J75P5O59J172N83l76m17p3
56617A30189o87j874k077j173m19k65o8M15Q68J345J909J948J216P52J418K399
$$ y = [181542, 178093, 174819, 171251, 167635, 164632, 161877, 158384, 154382, 151293, 149844, 149541, 149889, 150727, 151446, 151415, 151177, 151772, 152842, 152879, 151501, 150030, 149575, 149832, 150041, 149965, 149619, 149031, 148486, 148208, 147881, 147261, 146977, 147787, 149363, 150835, 152118, 153586, 154889, 155474, 155915, 157355, 159785, 162175, 164026, 165567, 166709, 167175, 167422, 168180, 169283, 170221, 171365, 173314, 175492, 176938, 178036, 179880, 182324, 184371, 186098, 188288, 190396, 190907, 189789, 188662, 188352, 188007, 186955, 185690, 184694, 183757, 182821, 182107, 181214, 179520, 177556, 176616, 176870, 177278, 177317, 177246, 176713, 174850, 171919, 169164, 166796, 163754, 159741, 155887, 153082, 151086, 149475, 147948, 145586, 141513, 136556, 132657, 130376, 128600, 126889, 126203, 126892, 127803, 128061, 128109, 128391, 128566, 128641, 129300, 130472, 131055, 130679, 130262, 130189, 129502, 127628, 125551, 124378, 123959, 123694, 123626, 124041, 124909, 126254, 128163, 130111, 131327, 132079, 133497, 135896]
56601A35896K547K205K270K526K466K548L104L122J830K72k53j47k39k1J081K019
56585A61226J671Q11N96N02k54o49M59J933J954R71O66J075J159J151J940K893
56569A78104K785K132K320L113L274K966L305M231M954N746P125Q094P441O009
56555B41599N501N754N442M639M371M467M058L508L569L451K046J69o88j041k362
56540B84483m258n200n250n576n920n253m211m312n216n307m422l554k577q25
56526B22602O79L59j111j759j528j881k746k711j812j453j761j669j244j415j824
56511B00726j565j455k811m514m304k539j640k096k141j294r36j298r70K40Q13
56496A74216K93q8J57J91j02R7N12M1r21p65O34J863K367K687K615J590O07J088
$$ y = [135896, 138443, 140648, 142918, 145444, 147910, 150458, 153562, 156684, 158514, 158786, 158533, 158386, 158147, 158126, 159207, 161226, 162897, 163708, 164304, 164806, 164552, 163903, 164362, 166295, 168249, 169220, 169886, 170961, 172120, 173271, 175211, 178104, 180889, 183021, 185341, 188454, 191728, 194694, 197999, 202230, 207184, 212930, 220055, 228149, 235590, 241599, 247100, 252854, 258296, 262935, 267306, 271773, 275831, 279339, 282908, 286359, 288405, 288574, 287886, 286845, 284483, 280225, 275025, 269775, 264199, 258279, 253026, 248815, 244503, 239287, 233980, 229558, 226004, 223427, 222602, 223281, 223640, 222529, 220770, 219242, 217361, 214615, 211904, 210092, 208639, 206878, 205209, 203965, 202550, 200726, 199161, 197706, 194895, 190381, 186077, 183538, 181898, 179802, 177661, 176367, 175431, 174133, 173163, 173403, 174216, 174509, 174421, 174578, 174769, 174667, 174764, 175276, 175317, 174396, 173631, 174265, 176128, 178495, 181182, 183797, 185387, 185994, 187082]
56478A87082K314K509J952K159K699K048J029J930M352N478M600L776L932L741
56464B29601K862K764L731M233L934M223N238N381M328L533L280K291O64J22Q51
56449B77036J111L83r4j69r41j890j244M43O45p68j262k65j45j742k847k296j828
56432B64127k472k684j643r23j423j819j506j833l020l138j667q11j736k686k432
56417B34334k284k992k895j095N38N36J39O39J106O46K28N24M59l81n69M73J140
56400B30546N66J23N82O02l86p27L93J232O03r3K89O58K32K60J307J641L01r45
56382B37184o09P0l79j281j646j897k030p67J730L038K098R82J366K175K371L024
56366B45429M546M999L398J785J791K014J126N51J520K343J341j4K72J301J235
$$ y = [187082, 189396, 191905, 193857, 196016, 198715, 200763, 201792, 203722, 208074, 213552, 218152, 221928, 225860, 229601, 232463, 235227, 238958, 243191, 247125, 251348, 256586, 261967, 266295, 269828, 273108, 275399, 276063, 276185, 277036, 278147, 278530, 278436, 278267, 277326, 275436, 274192, 274635, 275280, 274512, 273250, 272985, 272840, 271098, 268251, 265955, 264127, 261655, 258971, 257328, 256405, 254982, 253163, 251657, 249824, 246804, 243666, 241999, 241188, 239452, 236766, 234334, 232050, 229058, 226163, 225068, 225606, 226142, 226281, 226920, 228026, 228672, 228900, 229424, 229883, 229502, 228933, 229406, 230546, 231112, 231235, 231817, 232419, 232033, 231306, 231699, 232931, 233534, 233441, 233730, 234388, 234620, 234880, 236187, 237828, 238129, 237184, 236575, 236645, 236266, 234985, 233339, 231442, 229412, 228645, 230375, 233413, 235511, 236493, 237859, 240034, 242405, 245429, 249975, 254974, 258372, 260157, 261948, 263962, 265088, 265639, 267159, 269502, 270843, 270829, 271101, 272402, 273637]
56351B73637M99L98N37Q2k30L57R32P10O40J389J880J559J823L335M453M151L980
56334C00132N149O262O027N563N894N844M606L782M593N678N830O175P477Q125
56320C81137P216O671P820Q801P972O959P470Q001O750N062M812M874L431J443
56306D68419P27O42k41j212j005l16j76J42J159J454L54j72J181K570K387K284
56290D78197L868N328M634L494M668P594R971J1502J2997J3928J3882J4327J6171
56277F00561J7814J8293J9581K3016K6430K7915K9464L3374L8099M1305M4262
56266I20114M9261N5360O0668O6401P4665Q4396R3455J02658J13758J25558J35863
56255A882157J45349J55646J65528J72636J77120J79931J79625J74416J65390
$$ y = [273637, 274136, 274534, 275071, 275153, 274923, 275280, 276212, 276922, 277562, 278951, 280831, 282390, 284213, 287548, 292001, 296152, 300132, 305281, 311543, 317570, 323133, 329027, 334871, 339477, 343259, 347852, 353530, 359360, 365535, 373012, 381137, 388353, 395024, 402844, 411645, 419617, 426576, 434046, 442047, 448797, 453859, 458671, 463545, 466976, 468419, 469146, 469788, 469547, 468335, 467330, 467014, 466838, 466980, 468139, 469593, 469947, 469775, 470956, 473526, 475913, 478197, 482065, 487393, 492027, 495521, 500189, 507783, 517754, 529256, 542253, 556181, 570063, 584390, 600561, 618375, 636668, 656249, 679265, 705695, 733610, 763074, 796448, 834547, 875852, 920114, 969375, 1024735, 1085403, 1151804, 1226469, 1310865, 1404320, 1506978, 1620736, 1746294, 1882157, 2027506, 2183152, 2348680, 2521316, 2698436, 2878367, 3057992, 3232408, 3397798]
56246C397798J54141J39451J19858R7309P4691N2110K9182Q343q090k1627l4527
56235D008639m5538n2701n7722o3224o8186p0499p1653p4441p8372q1771q5904
56224C258628r2445r9252j03411j06181j10253j14442j15982j15677j15818j15244
56214B169923j11671j06792j03643j00932r5307q7585q1257p6452p0635o3899
56204A271750n8345n3623m8064m2793l9838l7698l3775k9399k7432k6733k4293
56193H49757k0964j9656j9581j7779j4764j3161j2390j0152p506o940p093n110
56181F94661k388k130l001j359J905L031K416L538O177P166O807Q039J0207J0047
56167G45116Q079P690Q688P998N929N488O335N685M234M885O554N805L596L755
$$ y = [3397798, 3551939, 3691390, 3811248, 3908557, 3983248, 4035358, 4064540, 4072883, 4064793, 4043166, 4008639, 3963101, 3910400, 3852678, 3789454, 3721268, 3650769, 3579116, 3504675, 3426303, 3344532, 3258628, 3166183, 3066931, 2963520, 2857339, 2747086, 2632644, 2516662, 2400985, 2285167, 2169923, 2058252, 1951460, 1847817, 1746885, 1651578, 1563993, 1482736, 1406284, 1335649, 1271750, 1213405, 1159782, 1111718, 1068925, 1029087, 991389, 957614, 928215, 900783, 874050, 849757, 828793, 809137, 789556, 771777, 757013, 743852, 731462, 721310, 713804, 706864, 699771, 694661, 692273, 690143, 687142, 685783, 687688, 690719, 693135, 696673, 702850, 710016, 716823, 724862, 735069, 745116, 753195, 760885, 769573, 777571, 783500, 788988, 795323, 801008, 805242, 810127, 816681, 822486, 826082, 829837]
56153H29837N710N628L935M704Q172J0806J2308J5610K0448K3895K6839L2932
56141A000824M1610M9130N5925O5799P8424R0021J00721J13483J26097J32367
56131A854401J31296J27420J22210J13288J02259R4875R2370R0196Q5920Q0772
56121B895007P3160N8963L9334K0585N490q170k0525k9326l6929m9026o5458q0293
56109B802812r1570j02611j13203j18355j17011j13452j08905j00265q8267p8173
56099A771000p1032o2754n3042m6440m3421l9293l3371l0152l0079k8275k3963
56088A309178k1864k2608k1186j6659j3977j4258j2762q532o451p616p196l982
56076A152087k511l667k715J225L500L433N568R792J0624Q081Q445J2334J3302
$$ y = [829837, 835547, 841175, 845110, 849814, 857986, 868792, 881100, 896710, 917158, 941053, 967892, 1000824, 1042434, 1091564, 1147489, 1213288, 1291712, 1381733, 1482454, 1595937, 1722034, 1854401, 1985697, 2113117, 2235327, 2348615, 2450874, 2545749, 2638119, 2728315, 2814235, 2895007, 2968167, 3027130, 3066464, 3087049, 3092539, 3084369, 3063844, 3034518, 2997589, 2948563, 2883105, 2802812, 2711242, 2608631, 2495428, 2377073, 2260062, 2146610, 2037705, 1937440, 1849173, 1771000, 1699968, 1637214, 1584172, 1537732, 1494311, 1455018, 1421647, 1391495, 1361416, 1333141, 1309178, 1287314, 1264706, 1243520, 1226861, 1212884, 1198626, 1185864, 1177332, 1170881, 1163265, 1156069, 1152087, 1149576, 1145909, 1143194, 1144419, 1147919, 1151352, 1156920, 1166712, 1177336, 1185417, 1193862, 1206196, 1219498]
56063A219498J0328J0001J3764J5070J2146J1516J5341J7416J5355J4763J7500
56052A372698J7972J5047J5278K0166K2557K0029J9315K2998K4552K1367J9863
56041A591842K2769K4103K1694K1732K5936K7431K4370K4263K9640L3199L2209
56030A879188L3561L9315M1965L9528M0212M6370M9441M6754M7200N3841N7507
56019B374882N4591N4084N9687O2387N8669N8193O5057O9546O7278O7963P5977
56008C068314Q1271P9157P9795Q7949R3248R1035R2469J02887J11177J12011J16838
55997D116151J30754J41134J42090J46884J62357J75074J77355J82324J97824
55988E571947K11026K15052K24341K46479K66153K75100K89435L18403L45879
$$ y = [1219498, 1229826, 1239827, 1253591, 1268661, 1280807, 1292323, 1307664, 1325080, 1340435, 1355198, 1372698, 1390670, 1405717, 1420995, 1441161, 1463718, 1483747, 1503062, 1526060, 1550612, 1571979, 1591842, 1614611, 1638714, 1660408, 1682140, 1708076, 1735507, 1759877, 1784140, 1813780, 1846979, 1879188, 1912749, 1952064, 1994029, 2033557, 2073769, 2120139, 2169580, 2216334, 2263534, 2317375, 2374882, 2429473, 2483557, 2543244, 2605631, 2664300, 2722493, 2787550, 2857096, 2924374, 2992337, 3068314, 3149585, 3228742, 3308537, 3396486, 3489734, 3580769, 3673238, 3776125, 3887302, 3999313, 4116151, 4246905, 4388039, 4530129, 4677013, 4839370, 5014444, 5191799, 5374123, 5571947, 5782973, 5998025, 6222366, 6468845, 6734998, 7010098, 7299533, 7617936, 7963815]
55979G963815L62951L87402M29301M70243M99778N37825N96493O56380P07150
55970A2611338P72692Q67520R69601J067038J187311J347334J523033J705053
55962B2050920J932436K231741K581320K980951L493195M167026M993622N992835
55954E0424046P258066Q853561J0774929J3092015J5999923J9622692K3918907
55947A49944139K8853950L4250533L8975371M0522389L6319796K6036958J2370565
55940C67273701q35133j1201529j8551435k3646567k6918687k8418123k8319482
55933B29382745k7027309k4949250k2418770j9752967j7199890j4854623j2725953
55926I0453983j0845174r243420p887746o723760n743456m950967m304475l750727
$$ y = [7963815, 8326766, 8714168, 9143469, 9613712, 10113490, 10651315, 11247808, 11904188, 12611338, 13384030, 14251550, 15221151, 16288189, 17475500, 18822834, 20345867, 22050920, 23983356, 26215097, 28796417, 31777368, 35270563, 39437589, 44431211, 50424046, 57682112, 66535673, 77310602, 90402617, 106402540, 126025232, 149944139, 178798089, 213048622, 252023993, 292546382, 328866178, 354903136, 367273701, 366438568, 355237039, 336685604, 313039037, 286120350, 257702227, 229382745, 202355436, 177406186, 154987416, 135234449, 118034559, 103179936, 90453983, 79608809, 70365389, 62477643, 55753883, 50010427, 45059460, 40754985, 37004258]
55918C7004258l280768k900624k581904k289810k028753j815691j636421j468349
55910A9001938j318979j203112j106678j009153r18545q50279p93475p30493o69094
55901A0402130o24284n87438n43058m98053m66251m40638m07949l74747l53239
55892F106473l36238l11074k84091k67516k55532k36417k15535k04039j96800
55883C799231j82999j67165j59126j54101j42594j29442j23789j20459j10007
55874B509549r7362r2085q9775q1113p0295o6704o6823o1649n4028n1938n2142
55863A725635m6770l8916l6010l4749k7838j8975j6313j7625j6252j5104k0413
55852A436670k8061l0182k9426l2862l7748l6988l3050l2989l4904l2433k7600
$$ y = [37004258, 33723490, 30822866, 28240962, 25951152, 23922399, 22106708, 20470287, 19001938, 17682959, 16479847, 15373169, 14364016, 13445471, 12595192, 11801717, 11071224, 10402130, 9777846, 9190408, 8647350, 8149297, 7683046, 7242408, 6834459, 6459712, 6106473, 5770235, 5459161, 5175070, 4907554, 4652022, 4415605, 4200070, 3996031, 3799231, 3616232, 3449067, 3289941, 3135840, 2993246, 2863804, 2740015, 2619556, 2509549, 2412187, 2320102, 2230327, 2149214, 2078919, 2012215, 1945392, 1883743, 1829715, 1777777, 1725635, 1678865, 1639949, 1603939, 1569190, 1541352, 1522377, 1506064, 1488439, 1472187, 1457083, 1436670, 1408609, 1378427, 1349001, 1316139, 1278391, 1241403, 1208353, 1175364, 1140460, 1108027, 1080427]
55841A080427k6416k6702k2790j7472j6975j8831j6849j3383j4635j8295j7914
55830H70165j5211j6214j9212j8260j4844j4574j5985j3856j0204j0768j3929
55819G07108j3941j1881j2708j4664j2411p711o446p741o360l112k636l472o13
55806F03412M385N847M381N145P760P513M676L474L504J146k501l727m116p686
55792F33213j2414j3275j1440j1764j3576j2804j0788j1862j4255j2686q200o334
55780D93815p094n862k880k736n405o625o325q088j1109j1174q896q756j0673
55767C98192j0577q515q083q678o656l393l849p458q794p099o854q946r458p675
55753B92157p330r128r474p452o046n870m535k590l271n912o342m236l417m559
$$ y = [1080427, 1054011, 1027309, 1004519, 987047, 970072, 951241, 934392, 921009, 906374, 888079, 870165, 854954, 838740, 819528, 801268, 786424, 771850, 755865, 742009, 731805, 721037, 707108, 693167, 681286, 668578, 653914, 641503, 633792, 627346, 619605, 613245, 610133, 607497, 604025, 603412, 607797, 613644, 618025, 623170, 630930, 638443, 643119, 646593, 650097, 651243, 648742, 645015, 640899, 633213, 620799, 607524, 596084, 584320, 570744, 557940, 547152, 535290, 521035, 508349, 500149, 493815, 486721, 480859, 477979, 475243, 469838, 463213, 456888, 448800, 437691, 426517, 417621, 408865, 398192, 387615, 379100, 371017, 362339, 355683, 352290, 348441, 340983, 332189, 325090, 318236, 309290, 299832, 292157, 284827, 275699, 266225, 258773, 252727, 246857, 242322, 239732, 236461, 230549, 224207, 219971, 216554, 211995]
55739B11995m274j927p31j477j465j99l2q00J47K297K359M05l91Mj334l985m541
55722A96051l218l557n413m975k179j289l293m350k832j528j651r13J225K247
55708A64325J840K709N092O000M943M794O029N791L625K453K825J897o93j699
55694B09931l22K73j125j851p46j06p44m75J001R88r05j479L21J535P55N74K570
55677B10195M618N072N197N654M882K672J281J520J663J236J773K938K398L78
55663B51477k18R41J028m46o00J236K105R44M20J688K417J776K188M160M354J214
55647B74684k222l500m211n931p166o895p028q693r868r148q186q202p761o211
55633A79662n579o768p465o141m612m445m309l140k537l618m607l870k521j931
$$ y = [211995, 207721, 205794, 205063, 203586, 202121, 201922, 201890, 201090, 201237, 203534, 205893, 206298, 205907, 205911, 204577, 200592, 196051, 192833, 189276, 183863, 178888, 176709, 175420, 172127, 167777, 164945, 163417, 161766, 160853, 162078, 164325, 166165, 168874, 173966, 179966, 184909, 189703, 195732, 201523, 205148, 207601, 210426, 212323, 211630, 209931, 209609, 209882, 208757, 206906, 206160, 206054, 205310, 204835, 205836, 206824, 205919, 204440, 204761, 206296, 207051, 207625, 210195, 214813, 219885, 225082, 230736, 235618, 238290, 239571, 241091, 242754, 243990, 245763, 248701, 251099, 251477, 251259, 252200, 253228, 252782, 252182, 253418, 255523, 256467, 256887, 258575, 260992, 262768, 264956, 269116, 273470, 274684, 272462, 268962, 264751, 258820, 251654, 244759, 237731, 229038, 219170, 210022, 201836, 193634, 185873, 179662, 174083, 167315, 159850, 153709, 149097, 144652, 140343, 137203, 134666, 131048, 126441, 122571, 120050, 118119]
55619A18119j500p03n35j264j501r44j171k414k691j455p35j426j728p08K3m14
55603I8953o37j12l31j432j343L13J103O0o59N4L38o40q07P50J750R05L16J361
55585I9942K126J268P09J796K414P82j159j009M29J455K492M212N538O004P355
55570A34354J0384J2990J3766J4553J6915J8998J8563J6378J3962J0686N831J013
55558B88393k303n339r443j3195j4659j4380j3889j3214j2076j1351j1187r982
55546A57375p229n063m969n397m632l469k983k319r03k09r70j295J31J579J394
55531A21041Q80J555K295J857J569K636L319J831k80o68J4j27p76p65r23k484
55515A30974m320m749m535n235o115n523l977l129k903k258j620k106l302m014
$$ y = [118119, 116619, 115916, 115381, 114117, 112616, 111672, 110501, 108087, 105396, 103941, 103206, 101780, 100052, 99344, 99367, 98953, 98316, 98204, 97873, 96441, 95098, 95411, 96514, 96574, 95915, 95969, 96307, 95667, 94860, 95610, 97360, 98265, 98581, 99942, 102068, 103336, 104045, 105841, 108255, 109037, 107878, 106869, 107298, 108753, 111245, 115457, 120995, 126999, 134354, 144738, 157728, 171494, 186047, 202962, 221960, 240523, 256901, 270863, 281549, 287380, 288393, 286090, 280751, 271308, 258113, 243454, 229074, 215185, 201971, 189895, 178544, 167357, 157375, 150146, 145083, 140114, 134717, 130085, 126616, 123633, 121314, 120411, 120202, 119232, 117937, 118068, 119647, 121041, 121921, 123476, 125771, 127628, 129197, 131833, 135152, 136983, 136703, 136035, 136049, 135922, 135146, 134381, 133458, 130974, 126654, 121905, 117370, 112135, 106020, 100497, 96520, 93391, 90488, 88230, 86610, 84504, 81202, 77188]
55501G7188m082l832k993j887j927l226l708k370j205j855k722j841k97l2m81
55486D4730k02M0j124k657k702j751j494j793j522j030j222j426o99N1l23r11
55470B5965m20L48J09l48K67J114P89K7K83R69P50J33K54M36m55j527j402p87
55452B6505r59j190l03O42J19r19p09J24K1l50M35J325M48j128q74P98J198j06
55434B5077r16k78N62J007J702K291J616L64M77J796J995L25j312j453q79o71
55418C1703o51m13j58J1K73L85L9l01j01J66K2K52J559K817K527J254O56P64L55
55399D1159n83q64k84J92J54r3o55j631k098j272r2mp84j266j354j542j312l7
55381B7634J328J457Q06O75R37O59J06N8N5o55j335j120j028k298l746l340j526
$$ y = [77188, 73106, 69274, 66281, 64394, 62467, 59241, 55533, 53163, 51958, 50103, 47381, 45540, 45243, 45211, 44730, 44528, 44568, 43444, 40787, 38085, 36334, 34840, 33047, 31525, 30495, 29273, 27847, 27148, 27199, 26876, 25965, 25545, 25893, 26002, 25654, 25921, 27035, 27824, 27851, 28134, 29103, 29853, 29986, 30240, 30676, 30221, 28694, 27292, 26505, 25546, 24356, 24053, 24695, 24814, 23895, 23186, 23310, 23331, 22981, 23416, 24741, 25189, 24061, 23187, 23985, 25183, 25077, 24161, 23883, 24445, 25452, 27154, 29445, 31061, 31425, 31902, 33698, 35693, 36018, 34706, 33253, 32374, 31703, 31052, 30639, 30481, 30492, 30765, 31150, 31189, 30888, 30787, 30953, 30975, 31227, 32786, 35603, 38130, 39384, 40040, 40804, 41159, 40576, 39712, 39428, 39620, 39774, 39681, 39026, 37395, 35297, 34025, 33933, 33929, 33145, 31879, 30525, 28983, 27671, 27634, 28962, 30419, 31225, 31900, 32837, 33496, 33602, 33660, 33715, 33060, 31725, 30605, 29577, 27279, 23533, 20193, 18667]
55364A8667l53r2N01J309J139M35P83J935K119J111L49J15o08j587j408k34J49
55347B4330o19r97l40K06L4n6K67K78j25j24L36M25K09N58J232J069J47k74m6
55328B6510k05p30l70R39J681J122J83m11r62j474j301n56j91m40o30n56o01n39
55310B1469Q9O43J44q85j102o17o27j056o85N22J347J464J651J876J352L98J53
55293B6136M47Q2p34n56O33J197N10k67l92l71l95j6L89j53j228j340l79K23m2
55274B3744k76k32o78j436j328l43J98L0K20Q64P77j12m07K61O32K52K14Q26Q49
55255B4055j86r91p13j12J36L78N97P0r28j057k38L8o91j037k44N91O37N78Q37
55236B1720N50n73j236n23P06J311J222O23n55j612j285L12J518J560J392J580
$$ y = [18667, 18314, 18222, 18723, 20032, 21171, 21606, 22389, 24324, 26443, 27554, 27903, 28018, 27410, 25823, 24415, 24181, 24330, 23711, 22714, 22374, 22580, 22614, 22558, 22825, 23103, 22978, 22854, 23190, 23615, 23824, 24382, 25614, 26683, 26830, 26556, 26510, 26305, 25575, 25205, 26144, 27825, 28947, 29130, 28719, 27757, 26283, 24982, 24426, 24235, 23795, 23165, 22609, 22008, 21469, 21558, 22201, 22345, 21460, 20358, 19741, 19114, 18058, 17373, 17895, 19242, 20706, 22357, 24233, 25585, 25983, 26136, 26583, 26665, 25931, 25375, 26008, 27205, 27715, 27448, 27056, 26685, 26290, 26274, 26663, 26510, 25282, 23942, 23563, 23786, 23744, 23468, 23236, 22558, 21122, 19794, 19451, 19649, 19679, 19899, 20763, 21540, 21428, 21021, 21282, 21914, 22166, 22380, 23206, 24055, 23869, 22878, 22165, 22053, 22189, 22567, 23164, 23234, 22306, 21249, 21011, 21049, 20358, 19321, 19077, 19668, 20305, 20883, 21720, 22270, 21697, 20461, 19938, 20644, 21955, 23177, 23800, 23245, 21633, 20348, 20660, 22178, 23738, 25130, 26710]
55220B6710J323K90m63l21q2k72k69J35Q7n90p93j16M02K74M70J426K005J475
55202C1691P17N39M44O0k2K75k6j073j542q57k20l70l24N52J126N15k61q0M72
55183C1616M52K42M65O26J93k01J16P02R63J049R46J13j085j235j22N34l05j338
55165C3731j140l31j29l52k93k54o45q82m77q4k88n22l52m41j157j594j146n74
55147B3070l97J87J486K069Q88q42j474j137o43K53J719K440J368k67o22Q0L84
55130B8562J67M25J216J694J697J681J547R94N82R83J697J812J483J408J463J113
55114D8524N70K72j99j412k813l331k804j767m81Q07J344P77J8J50R31J423J391
55097D3400J142O67m8m42j00N06P84Q67R89Q61L81J35L60L88j17m29m8M09M88
$$ y = [26710, 28033, 28323, 27860, 27539, 27457, 27185, 26916, 27051, 27138, 26548, 25755, 25639, 26041, 26315, 26785, 28211, 30216, 31691, 32408, 32947, 33391, 33451, 33429, 33704, 33678, 32605, 31063, 30206, 29986, 29616, 29292, 29844, 30970, 31485, 31224, 31144, 31616, 32068, 32310, 32775, 33401, 33594, 33393, 33509, 34211, 35174, 36223, 37169, 37282, 36197, 34962, 34840, 35374, 35069, 33731, 32591, 32260, 32131, 31779, 31486, 31232, 30587, 29705, 29228, 29144, 28856, 28334, 27982, 27541, 26384, 24790, 23644, 23070, 22673, 22860, 24346, 26415, 27303, 26461, 24987, 23850, 23207, 23460, 25179, 27619, 28987, 28720, 28098, 28178, 28562, 28729, 29154, 30370, 32064, 33761, 35442, 36989, 37983, 38565, 39548, 41245, 43057, 44540, 45948, 47411, 48524, 49094, 49366, 49167, 47755, 44942, 41611, 38807, 37040, 36559, 37366, 38710, 39487, 39505, 39655, 40586, 42009, 43400, 44542, 45209, 45161, 44719, 44619, 45125, 45909, 46776, 47765, 48626, 49007, 49142, 49502, 49890, 49773, 49344, 49296, 49705, 50193]
55078E0193Q19J797K501K090J085K64n10j292j279l33J15q06j743j136L09Q74
55062E2948M27J4j70n88q89m57K16L44K99P74J202O85k52n19l89q26j489j276
55044E0054m27k41r34j440j178n34J79Q68J057N19J13O64J463J308N03K41N77
55027E2792O46M52O43Q18K5j163j048N59J901J840J189J050J327J488J501J375
55011F5395P79k71j130j339j135q86p40q84j451k013j931j311r34j109j279r03
54995D8858j75L23L16P0J20P06J318J165K30n39l98L37Q88R15N91K99N12J369
54977E6905K125J867Q76L18M81N75M19Q42J871K266J625J224J821K326J940J790
54961G9271K952M430M883M976O030P605Q452Q911J0252J2378J4211J5717J7585
$$ y = [50193, 51012, 52809, 55310, 57400, 58485, 58749, 58239, 56947, 55668, 55335, 55450, 54644, 52901, 51765, 52074, 52948, 53375, 53389, 53219, 52631, 51742, 51285, 51501, 51845, 52144, 52918, 54120, 54805, 54553, 54034, 53645, 52819, 51330, 50054, 49627, 49386, 48452, 47012, 45834, 45300, 45479, 46347, 47404, 47923, 48036, 48700, 50163, 51471, 51974, 52215, 52792, 53438, 53890, 54533, 55351, 55376, 54213, 53165, 53724, 55625, 57465, 58654, 59704, 61031, 62519, 64020, 65395, 66174, 65903, 64773, 63434, 62299, 61413, 60673, 59789, 58338, 56325, 54394, 53083, 52149, 51040, 49761, 48858, 48683, 49006, 49322, 49392, 49512, 50218, 51536, 52701, 52931, 52392, 51994, 52331, 53219, 54134, 54725, 55024, 55536, 56905, 59030, 60897, 61773, 62091, 62572, 63147, 63566, 64408, 66279, 68545, 70170, 71394, 73215, 75541, 77481, 79271, 82223, 86653, 91536, 96512, 102542, 110147, 118599, 127510, 137762, 150140, 164351, 180068, 197653]
54948A97653J9342J9734J8584J6620J3849R839N083M64m135q978j2872j4421j4419
54935B46343j4949j6365j7125j6457j5154j3723j1788r516p815o781n539l894
54923A07237k661k121j623q33j31L75R71J482J553J719K867M809O624Q227J0185
54908A38680J2326J3988J5379J7044J8300J7865J5921J3725J1291P411K038l248
54896B80720p455j1056j4271j6284j6669j6107j5137j3664j2041j1191j1167j0871
54884A24807r671q053o505n019l930l772m042l528k171j124q10m72Ok95j381j769
54868G2271q02J20k74j117q58K92Q11J45p31q52m61m53j127j683j113M04J511
54851F6083J373O79L40N7p57j410q73K07J34j334k698k935k472j895j266r14j285
$$ y = [197653, 216995, 236729, 255313, 271933, 285782, 295621, 300704, 301168, 297033, 288055, 275183, 260762, 246343, 231394, 215029, 197904, 181447, 166293, 152570, 140782, 131266, 123451, 116670, 111131, 107237, 104576, 102455, 100832, 99999, 99868, 100243, 101214, 102696, 104249, 105968, 108835, 113644, 120268, 128495, 138680, 151006, 164994, 180373, 197417, 215717, 233582, 249503, 263228, 274519, 281930, 283968, 280720, 273265, 262209, 247938, 231654, 214985, 198878, 183741, 170077, 158036, 146845, 135678, 124807, 115136, 107083, 100578, 95559, 91629, 87857, 83815, 80287, 78116, 76992, 76182, 75710, 75716, 75421, 74040, 72271, 71469, 71589, 71315, 70198, 69340, 69632, 70443, 70588, 69857, 69005, 68544, 68091, 66964, 65281, 64168, 64572, 66083, 67456, 68135, 68475, 68532, 67775, 66365, 65492, 65699, 65833, 64499, 61801, 58866, 56394, 54499, 53233, 52319, 51034]
54834E1034j738j027P17J890J693J034P99P34N26N67R48J010N45K90P19J309J597
54817F2647J815K061J962J536J301J203O31j71p7J060J928J796J711K770M463
54802H6636N651O289P142Q525J0262J2300J4577J6684J8169J8953J9093J8449
54790B42730J6792J3891R580M301o93m368o924r106j0900j1914j2501j3251j3685
54777B03952j2913j1355j0262r678q546o805n660n440n057l925k859k448k139
54764A16865j447o56K45J844L897N193N454O047P985J0578J2732J4334J5707J6860
54750B15638J7897J9014J9501J8050J4620J0662P001K975j737o048r107j1514
54738B96952j3864j5535j6010j6093j6568j6757j5659j3545j1374r460p824o990
$$ y = [51034, 49296, 48269, 48986, 50876, 52569, 53603, 54402, 55136, 55662, 56229, 57177, 58187, 58732, 59022, 59741, 61050, 62647, 64462, 66523, 68485, 70021, 71322, 72525, 73156, 72985, 72908, 73968, 75896, 77692, 79403, 82173, 86636, 92287, 98576, 105718, 114243, 124505, 136805, 151382, 168066, 186235, 205188, 224281, 242730, 259522, 273413, 282993, 287294, 286601, 282233, 275309, 266203, 255303, 243389, 230888, 217637, 203952, 191039, 179684, 169422, 159744, 151198, 144393, 138733, 133293, 128236, 124311, 121452, 119004, 116865, 115418, 114762, 115007, 116851, 120748, 125941, 131395, 137442, 145427, 156005, 168737, 183071, 198778, 215638, 233535, 252549, 272050, 290100, 304720, 315382, 322383, 325358, 323621, 317573, 308466, 296952, 283088, 267553, 251543, 235450, 218882, 202125, 186466, 172921, 161547, 152087, 144263, 137273]
54726A37273p239p737p399o237m971l972l235k889k922k876k377j568p40j11m0
54711H2960p63j687j870j307q41p28m57J1J27PL67R92Q51N1m5Q73J363O00l58
54692H0146m53j62j06K22J187J861J394L69k76m95m99k0P77R78L85O4M92O29j50
54673H6343p07N2J379K035K215K791L686M296M630M842M618M021L873M396M560
54658A33030L742K755K306J923J420J745L079L702K351K91n95l49M6O75J835K480
54642A60436J675N73R52K540L748M253M948N924O435O378O073N105K985M57j418
54627B11064k909m821o776p871q298q651q426p011n471n317o080o045m867l590
54613A24931k468q93P86J445J176J230K007K715K978L076K812J830Q41Q41J229
$$ y = [137273, 130034, 122297, 114898, 108661, 103690, 99718, 96483, 93594, 90672, 87796, 85419, 83851, 83111, 83000, 82960, 82197, 80510, 78640, 77333, 76492, 75764, 75307, 75318, 75445, 75452, 75819, 76811, 77662, 77713, 77668, 78541, 79904, 80504, 80146, 79693, 79531, 79425, 79647, 80834, 82695, 84089, 84458, 84182, 83687, 83188, 83168, 83945, 84923, 85308, 85372, 85864, 86493, 86343, 85636, 85688, 87067, 89102, 91317, 94108, 97794, 102090, 106720, 111562, 116180, 120201, 124074, 128470, 133030, 136772, 139527, 141833, 143756, 145176, 146921, 150000, 153702, 156053, 156344, 155749, 155400, 155446, 156121, 157956, 160436, 162111, 162684, 163636, 166176, 169924, 174177, 179125, 185049, 191484, 197862, 203935, 209040, 212025, 212482, 211064, 208155, 203334, 196558, 188687, 180389, 171738, 163312, 156301, 150830, 145513, 139433, 133388, 128521, 124931, 122463, 121570, 122356, 123801, 124977, 126207, 128214, 130929, 133907, 136983, 139795, 141625, 142466, 143307, 144536]
54598A44536N62j012j943j856j953k740l344l404l691m375m506l828l401l727
54584A05318l833l005k070k083k784l228l032k367j489q06p09j038j276j412j860
54569G4326k512k763k472k056j655j116p42r60j317r41L3N62L81L09O97Q11J59
54552F0744o66q86m48L34J246J952K027J549J079Q75O52K21j93l37j23M34J071
54535F9531J322J170J213J698J991J785J985L327M850N015L907K933K674K473
54521A05874J894J218N52k87r93j176j316k158l273l557k975k527k565k508k181
54506H4022j995j775r13K64O69J38m12n94r69j649j955j712j543j545r65M15J734
54489G1215K260K101J534P21J90M20Q19L45p69j227p52m61q84j108l97P15J492
$$ y = [144536, 145098, 144086, 142143, 140287, 138334, 135594, 132250, 128846, 125155, 120780, 116274, 112446, 109045, 105318, 101485, 98480, 96410, 94327, 91543, 88315, 85283, 82916, 81427, 80621, 79912, 78874, 77598, 76186, 74326, 71814, 69051, 66579, 64523, 62868, 61752, 61010, 60050, 58733, 57792, 57825, 58387, 58768, 59077, 59774, 60585, 60744, 60078, 59192, 58744, 59078, 60324, 62276, 64303, 65852, 66931, 67806, 68458, 68679, 68486, 68149, 68026, 68460, 69531, 70853, 72023, 73236, 74934, 76925, 78710, 80695, 84022, 88872, 93887, 97794, 100727, 103401, 105874, 107768, 108986, 109538, 109251, 108258, 107082, 105766, 103608, 100335, 96778, 93803, 91276, 88711, 86203, 84022, 82027, 80252, 79339, 79603, 80272, 80410, 79998, 79404, 78435, 76786, 74831, 73119, 71576, 70031, 69066, 69481, 71215, 73475, 75576, 77110, 77831, 78021, 78441, 79260, 79605, 78836, 77609, 76857, 76396, 75512, 74404, 74007, 74722, 76214]
54472G6214J980K340K306J854J364Q51k2q96q51Q9Q07O87K59k0l34n97l64L7l51
54453H5353j413j819j067k10j6P0M20K71p28j462r46P5K78l80j021j207j023n12
54435G4663J38L72rm78o29o69o84l08M15P20K71k65l11j65j14J51P01R22O41O18
54415G5980J242J696J263N00K47L56K85J96N10J021J380J783K444L010L215L475
54399I8603M093M542M356M074M465N324N854N776N363M819M312M196M503M606
54385A64886L927K647J337L06l81q34j527k917m476n055m470l892m142m607m470
54370A36332l992l795l716l339k885k707k456j653n84R9J95k67j376k749l228
54355A03879k096j95J006J062O44L88M15O77J113J587K044K511K789K627K350
$$ y = [76214, 78194, 80534, 82840, 84694, 86058, 86909, 86887, 85991, 85140, 85229, 86036, 86723, 86982, 86962, 86628, 86031, 85667, 85704, 85353, 83940, 82121, 81054, 80844, 80828, 80898, 81318, 81589, 80861, 79399, 78453, 78528, 78806, 78426, 77405, 76198, 75175, 74663, 74801, 75173, 75164, 74686, 74057, 73388, 72704, 72396, 72811, 73531, 73802, 73537, 73226, 73061, 72947, 73098, 73799, 74721, 75362, 75980, 77222, 78918, 80181, 80681, 80928, 81284, 81569, 81765, 82275, 83296, 84676, 86459, 88903, 91913, 95128, 98603, 102696, 107238, 111594, 115668, 120133, 125457, 131311, 137087, 142450, 147269, 151581, 155777, 160280, 164886, 168813, 171460, 172797, 173103, 172722, 171888, 170361, 167444, 162968, 157913, 153443, 149551, 145409, 140802, 136332, 132340, 128545, 124829, 121490, 118605, 115898, 113442, 111789, 111205, 111304, 111499, 111232, 109856, 107107, 103879, 101783, 101588, 102594, 103656, 104300, 104688, 105103, 105780, 106893, 108480, 110524, 113035, 115824, 118451, 120801]
54340A20801K618L321L567L159L110M142N579O385O367N645L956J488n30j156
54326A68452j130j743k911l498l198k914l332m121m653m791m810m955n187n139
54312A16070m538l718l313l340l165k615k281k454k587k302k091k407k833k803
54298G5623k464k164j773j215r07j044j094o99l56n28q16p51o19o98m85M16J322
54281F1748J407J003R42J130P87j86j051j236p76k0N50N96M19O28J055Q10o4k70
54263F7472O98J464Q76n2J93J076R46k25r47p28n46q47q15m4O64O22K38J51L21
54244G0517M03K73r3o17q79n33K6P1l87o01k03M20Q34R43P87N15M76O97M68p10
54224G2407k027k157j096k38n35j436j854j429n46K67O64O22M87N94Q18P46J97
$$ y = [120801, 123419, 126740, 130307, 133466, 136576, 140718, 146297, 152682, 159049, 164694, 168650, 170138, 169608, 168452, 167322, 165579, 162668, 159170, 155972, 153058, 149726, 145605, 140952, 136161, 131351, 126396, 121209, 116070, 111532, 107814, 104501, 101161, 97996, 95381, 93100, 90646, 88059, 85757, 83666, 81259, 78426, 75623, 73159, 70995, 69222, 68007, 67100, 66056, 64962, 64263, 63907, 63379, 62563, 61812, 61193, 60495, 60010, 60426, 61748, 63155, 64158, 65100, 66230, 67017, 66831, 65780, 64544, 63768, 63748, 64298, 64894, 65313, 65941, 66996, 67806, 67742, 67472, 68170, 69634, 70510, 70458, 70651, 71727, 72673, 72448, 71501, 70773, 70227, 69380, 68565, 68521, 69185, 69807, 70045, 70196, 70517, 70920, 71193, 71100, 70483, 69604, 69071, 69097, 69168, 68781, 68180, 67977, 68397, 69231, 70174, 70961, 71476, 71952, 72649, 73117, 72407, 70380, 68223, 67127, 66889, 66354, 64918, 63064, 61635, 61089, 61356, 62020, 62642, 63129, 63723, 64541, 65287, 65484]
54207F5484n93j107p28P08K271K503J109n22j063p76n45l15L98J117R17K1m70
54190F8409k82j25k19kN64O82M9o07p07o29q36j072q69k82K90N58L81j43n66m82
54170F4112r7L8j94n28q94j309j338n19O61J111N67o6JN79J064J132O73k43j064
54151F3686j026r3Q58J056O13R0j98k33q5Q4N5j78m20n52n70m18q7K06K13jj74
54130F2826j37K22R45J624J478L37q68j170p58m87n64n92n28p05r83q67m28k32
54112E9113l07r5M25M60m13j515j850j198q5Q89J495J849K139K205J629M63m80
54095F4724n39o3J97J50J94L00J36j12N3M82M82j11p53j123j382j498j068j12
54077E9957O69O79M7o95j100r75n19k40l09k11N25J500K013K053K040J883J221
$$ y = [65484, 64891, 63784, 63056, 63764, 66035, 68538, 69647, 69125, 68062, 67286, 66741, 66426, 66824, 67941, 68858, 68879, 68409, 68127, 68002, 67783, 67781, 68345, 69027, 69076, 68469, 67762, 67133, 66297, 65225, 64356, 64074, 64364, 64922, 65303, 65160, 64594, 64112, 64015, 64053, 63859, 63331, 62437, 61128, 59790, 59271, 59932, 61043, 61610, 61544, 61545, 62124, 63188, 64320, 64993, 64750, 63686, 62660, 62567, 63425, 64481, 65094, 65184, 64986, 64753, 64668, 64752, 64807, 64629, 64209, 63657, 63087, 62669, 62582, 62788, 63001, 63000, 62826, 62689, 62911, 63856, 65480, 66958, 67295, 66427, 65257, 64499, 64012, 63448, 62856, 62328, 61623, 60640, 59773, 59345, 59113, 58806, 58711, 59136, 59596, 59183, 57668, 55818, 54620, 54535, 55424, 56919, 58768, 60907, 63112, 64741, 65204, 64724, 64185, 64122, 64319, 64469, 64663, 64963, 65099, 64987, 65040, 65522, 66004, 65893, 65140, 64017, 62635, 61137, 60069, 59957, 60626, 61305, 61352, 60657, 59557, 58582, 58063, 57823, 57514, 57303, 57828, 59328, 61341, 63394, 65434, 67317, 68538]
54060F8538L39j35k72n45p16j37Q75J252R02Q86J568J909J189K82L83J329K038
54043G9685K021J682J554J867K503K969K723J985J753K616L978M846N048N165
54029A20395N554N896N724N072M562M816N723O472O477O003N587N159M336L307
54015A95083K676K547K407J987J565J365J276J214J181R34K26o03r75j002j330
54000B08551k021k323j818j090r43j520k386l054l262l116l110l605m299m650
53986A71354m607m442m074l302k545k470k930l061k449j461m62M10P43J14r72
53971A39846j393q47j77n2k26k71j75O5N23Q54N95J10K92J036J182K97n77n44
53953A40538o9J33M30J559L274M634N124M846M060L195K852L205L781M217M728
$$ y = [68538, 68877, 68742, 68470, 67925, 67209, 67072, 67947, 69199, 70101, 70987, 72555, 74464, 75653, 75935, 76318, 77647, 79685, 81706, 83388, 84942, 86809, 89312, 92281, 95004, 96989, 98742, 101358, 105336, 110182, 115230, 120395, 125949, 131845, 137569, 142641, 147203, 152019, 157742, 164214, 170691, 176694, 182281, 187440, 191776, 195083, 197759, 200306, 202713, 204700, 206265, 207630, 208906, 210120, 211301, 212235, 212461, 211858, 210883, 209881, 208551, 206530, 204207, 202389, 201299, 200356, 198836, 196450, 193396, 190134, 187018, 183908, 180303, 176004, 171354, 166747, 162305, 158231, 154929, 152384, 149914, 146984, 143923, 141474, 140013, 139551, 139961, 140704, 140818, 139846, 138453, 137606, 137429, 137377, 137151, 136880, 136705, 136770, 137293, 138147, 138742, 138852, 139144, 140180, 141362, 141659, 141082, 140538, 140469, 140602, 141032, 142591, 145865, 150499, 155623, 160469, 164529, 167724, 170576, 173781, 177562, 181779, 186507]
53938A86507N447N979O075O090O138N538L793J651K92j41m68j185j993k483k627
53923B18613k537k270j837j254n55R4N45J001J832K939L708L860L912M463N390
53908B37904O117O374O412O584O968P222O843N692M266L085K047P35p08j652j824
53893B96065j568j325j401k113l403m439m464l920l927m693n456n923o573p370
53879B39490p449o575n676n428n352m957m668m882n040m525l659l013k507k017
53865A73742k087l140m463m934m406l616l081k814k733k746k681k560k618k744
53851A29119k422j619j055j147j424j467j663k267k605k001q96j58J73M86N39
53836A11593j44j149j490r59k58Q6J54O7j99m87n20l53k14p4K14M85N54O61J026
$$ y = [186507, 191954, 197933, 204008, 210098, 216236, 221774, 225567, 227218, 227510, 227369, 226901, 225716, 223723, 221240, 218613, 216076, 213806, 211969, 210715, 210160, 210254, 210799, 211800, 213632, 216571, 220279, 224139, 228051, 232514, 237904, 244021, 250395, 256807, 263391, 270359, 277581, 284424, 290116, 294382, 297467, 299514, 300249, 299541, 297889, 296065, 294497, 293172, 291771, 289658, 286255, 281816, 277352, 273432, 269505, 264812, 259356, 253433, 246860, 239490, 232041, 225466, 219790, 214362, 209010, 204053, 199385, 194503, 189463, 184938, 181279, 178266, 175759, 173742, 171655, 168515, 164052, 159118, 154712, 151096, 148015, 145201, 142468, 139722, 137041, 134481, 131863, 129119, 126697, 125078, 124023, 122876, 121452, 119985, 118322, 116055, 113450, 111449, 110553, 110395, 110568, 111054, 111593, 111449, 110300, 108810, 107851, 107593, 107679, 107833, 107900, 107701, 107214, 106694, 106341, 106127, 106053, 106267, 106752, 107306, 107967, 108993]
53817A08993J205O04m52r03l10O04R75Q41Q74J402K023K151J709J213J205J801
53801A23935K811L957M818M863M093L358L484M270M901N097N157N100M675M160
53787A84679M049L992L166J839J325K011K667K280J392R66R54Q10M60p6j077k379
53771B07058l038k628k112k469l249l374k726k009j598j472j714k229k366j725
53757A74349r00o77r15j040j107j561k336k918l035k640j709n75Q5J33K43P23
53741A56120R19L79k82m69n54q24n90N28J407R24j37j50J005K122K729L324L911
53724A70362L865L214K629K162J260M1o85p22o17n39j81J86k52j509k565k670
53708A73979k016j075j39L95K59j02jM78O55L76R7Kj1L35J389K684L405L620M003
$$ y = [108993, 110198, 110802, 110350, 109447, 109137, 109741, 110716, 111557, 112431, 113833, 115856, 118007, 119716, 120929, 122134, 123935, 126746, 130703, 135521, 140384, 144477, 147835, 151319, 155589, 160490, 165587, 170744, 175844, 180519, 184679, 188728, 192720, 195886, 197725, 199050, 201061, 203728, 206008, 207400, 208366, 209320, 210130, 210590, 210514, 209437, 207058, 204020, 201392, 199280, 196811, 193562, 190188, 187462, 185453, 183855, 182383, 180669, 178440, 176074, 174349, 173449, 172772, 171857, 170817, 169710, 168149, 165813, 162895, 159860, 157220, 155511, 154936, 155021, 155154, 155397, 156120, 157039, 157418, 157136, 156667, 156113, 155289, 154699, 155227, 156634, 157558, 157421, 157271, 158276, 160398, 163127, 166451, 170362, 174227, 177441, 180070, 182232, 183492, 183533, 182848, 182126, 181509, 180970, 180789, 180975, 180723, 179214, 176649, 173979, 171963, 170888, 170749, 171144, 171403, 171301, 171300, 171778, 172433, 172809, 172906, 172908, 172897, 173232, 174621, 177305, 180710, 184330, 188333]
53689A88333M484M331L604L279L701M115L990L728L769L914L899L773L471K779
53675B41170K023J949K694L590M106M235L944L140K295K127K499K465J587M01
53661B78225n61j306j875k236k746l751m640m358l041k027j998k267k253k385
53647B42781l000l461l142k358j680j098n81n76j219j790j695j384j447j484p57
53632B17109M78J213J099P64P52Q47N85K2k45K67J304K039J992J628J677K066
53616B33597K105J655J381J724K256K435K385K534K958L445L850M077M006L814
53602B72222M023M907N979O410N886M914M328M533N194N672N744N669N544N125
53588C46150M463M184M594N025M719L926L464L491L497L246K891K378J605J032
$$ y = [188333, 192817, 197148, 200752, 204031, 207732, 211847, 215837, 219565, 223334, 227248, 231147, 234920, 238391, 241170, 243193, 245142, 247836, 251426, 255532, 259767, 263711, 266851, 269146, 271273, 273772, 276237, 277824, 278225, 277664, 276358, 274483, 272247, 269501, 265750, 261110, 256752, 253711, 251684, 249686, 247419, 245166, 242781, 239781, 236320, 233178, 230820, 229140, 228042, 227461, 226885, 225666, 223876, 222181, 220797, 219350, 217866, 217109, 217587, 218800, 219899, 220663, 221415, 222262, 222847, 222869, 222624, 222891, 224195, 226234, 228226, 229854, 231531, 233597, 235702, 237357, 238738, 240462, 242718, 245153, 247538, 250072, 253030, 256475, 260325, 264402, 268408, 272222, 276245, 281152, 287131, 293541, 299427, 304341, 308669, 313202, 318396, 324068, 329812, 335481, 341025, 346150, 350613, 354797, 359391, 364416, 369135, 373061, 376525, 380016, 383513, 386759, 389650, 392028, 393633, 394665]
53574C94665J271K069K544K429K266K407K601K649K661K568K154J596J291J158
53560D24329Q18M62O79J483K252K642K769K564J864J055P75R68J199J685K913
53545D48457M295M521L461K383K024J749J051O79J413K742L522L348K732K423
53531D84800K926M035M712M138K955K577L218L799L884M310N471O464O688O989
53517E46966Q253R945J1068J1681J2414J3260J3865J4412J5239J6106J6752J7643
53505G07604J9267K1130K2302K2671K2837K3160K3640K4472K5873K7548K8929
53494I69433K9897L0734L1553L2170L2440L2332L1831L1091L0453L0125L0050
53483A312109L0172L0493L0794L0769L0508L0344L0184K9626K8777K8182K7859
$$ y = [394665, 395936, 398005, 400549, 402978, 405244, 407651, 410252, 412901, 415562, 418130, 420284, 421880, 423171, 424329, 425147, 425609, 426288, 427771, 430023, 432665, 435434, 437998, 439862, 440917, 441692, 442660, 443859, 445544, 448457, 452752, 457273, 460734, 463117, 465141, 466890, 467941, 468620, 470033, 472775, 476297, 479645, 482377, 484800, 487726, 491761, 496473, 500611, 503566, 506143, 509361, 513160, 517044, 521354, 526825, 533289, 539977, 546966, 555219, 565164, 576232, 587913, 600327, 613587, 627452, 641864, 657103, 673209, 689961, 707604, 726871, 748001, 770303, 792974, 815811, 838971, 862611, 887083, 912956, 940504, 969433, 999330, 1030064, 1061617, 1093787, 1126227, 1158559, 1190390, 1221481, 1251934, 1282059, 1312109, 1342281, 1372774, 1403568, 1434337, 1464845, 1495189, 1525373, 1554999, 1583776, 1611958, 1639817]
53472A639817K7185K6026K5035K4511K3887K2720K1411K0427J9472J8020J5977
53461A884488J3526J0989R057Q340Q246P258M737J589j253l957o855r499j1460
53448A915206j3115j4837j6233j7092j8233k0480k3373k5801k7307k8028k8109
53437A682598k7968k8468k9852l1166l1593l1622l1966l2145l1207k9296k7274
53426A350041k5311k3047k0836j9540j9165j8765j7695j6097j4270j2340j0543
53415A152432r076p695o060m262k492m53K212N234Q060J0562J2803J4533J5639
53402A191437J6674J8190J9873K1158K2362K4319K7075K9806L1942L3629L5185
53391A471650L6789L8731M1228M4037M6651M8836N0684N2347N4033N5878N7552
$$ y = [1639817, 1667002, 1693028, 1718063, 1742574, 1766461, 1789181, 1810592, 1831019, 1850491, 1868511, 1884488, 1898014, 1909003, 1918060, 1926400, 1934646, 1941904, 1946641, 1948230, 1946977, 1943020, 1936165, 1926666, 1915206, 1902091, 1887254, 1871021, 1853929, 1835696, 1815216, 1791843, 1766042, 1738735, 1710707, 1682598, 1654630, 1626162, 1596310, 1565144, 1533551, 1501929, 1469963, 1437818, 1406611, 1377315, 1350041, 1324730, 1301683, 1280847, 1261307, 1242142, 1223377, 1205682, 1189585, 1175315, 1162975, 1152432, 1143356, 1135661, 1129601, 1125339, 1122847, 1122394, 1124606, 1129840, 1137900, 1148462, 1161265, 1175798, 1191437, 1208111, 1226301, 1246174, 1267332, 1289694, 1314013, 1341088, 1370894, 1402836, 1436465, 1471650, 1508439, 1547170, 1588398, 1632435, 1679086, 1727922, 1778606, 1830953, 1884986, 1940864, 1998416]
53380A998416N8559N9227O0673O3141O5289O5860O5336O4933O4801O4329O3606
53369B694170O3127O2414O0342N6836N2921M9107M4927M0312L6070L2530K8760
53358C221516K3814J8131J2946Q742M831L74m636r475j3588j7161k0793k4824
53346C199877k9380l4744m0993m7229n2081n5214n7551n9662o0955o0990o0562
53335B640516o0570o0668o0077n9020n8321n8084n7845n7573n7435n6946n5415
53324A998562n3079n0868m9116m7378m5231m2577l9415l6108l3484l1966l0901
53313A538439k9478k7816k6397k5002k3206k1337j9896j8485j6422j3985j1917
53302A304498j0053p617m676k111l51Q49J628K102K880M433O205P485Q701J0707
$$ y = [1998416, 2056975, 2116202, 2176875, 2240016, 2305305, 2371165, 2436501, 2501434, 2566235, 2630564, 2694170, 2757297, 2819711, 2880053, 2936889, 2989810, 3038917, 3083844, 3124156, 3160226, 3192756, 3221516, 3245330, 3263461, 3276407, 3285149, 3289980, 3290354, 3285718, 3276243, 3262655, 3245494, 3224701, 3199877, 3170497, 3135753, 3094760, 3047531, 2995450, 2940236, 2882685, 2823023, 2762068, 2701078, 2640516, 2579946, 2519278, 2459201, 2400181, 2341860, 2283776, 2225931, 2168358, 2110923, 2053977, 1998562, 1945483, 1894615, 1845499, 1798121, 1752890, 1710313, 1670898, 1634790, 1601306, 1569340, 1538439, 1508961, 1481145, 1454748, 1429746, 1406540, 1385203, 1365307, 1346822, 1330400, 1316415, 1304498, 1294445, 1286828, 1282152, 1280041, 1279690, 1280539, 1282167, 1284269, 1287149, 1291582, 1297787, 1305272, 1313973, 1324680]
53288A324680J3167J5076J6464J8199K0360K2384K4459K7141K9756L1006L1176
53277A573868L1792L2973L3155L1883L0739L0751L0745K9423K7340K5576K3880
53266A902125K1540J8948J6889J5074J2782J0364Q799Q100P224N405K744l03l269
53253B026422n695p412q881j0755j3238j5986j8484k0361k1679k2971k4695k6616
53241A829649k8105k9000k9645l0205l0561l0797l1017l0826k9839k8700k8462
53230A502492k8895k8550k6833k4874k3826k3409k2814k2156k2008k2226k2049
53219A234852k1161k0024j9254j9018j8827j7951j6301j4764j4170j4161j3829
53208A045392j3251j3306j4035j4503j4418j4615j5486j6172j5965j5359j4981
$$ y = [1324680, 1337847, 1352923, 1369387, 1387586, 1407946, 1430330, 1454789, 1481930, 1511686, 1542692, 1573868, 1605660, 1638633, 1671788, 1703671, 1734410, 1765161, 1795906, 1825329, 1852669, 1878245, 1902125, 1923665, 1942613, 1959502, 1974576, 1987358, 1997722, 2006521, 2014621, 2021845, 2027250, 2029994, 2029691, 2026422, 2020727, 2013315, 2004434, 1993679, 1980441, 1964455, 1945971, 1925610, 1903931, 1880960, 1856265, 1829649, 1801544, 1772544, 1742899, 1712694, 1682133, 1651336, 1620319, 1589493, 1559654, 1530954, 1502492, 1473597, 1445047, 1418214, 1393340, 1369514, 1346105, 1323291, 1301135, 1279127, 1256901, 1234852, 1213691, 1193667, 1174413, 1155395, 1136568, 1118617, 1102316, 1087552, 1073382, 1059221, 1045392, 1032141, 1018835, 1004800, 990297, 975879, 961264, 945778, 929606, 913641, 898282, 883301]
53197H83301j4576j3817j3199j3233j3532j3575j3610j4046j4615j5022j5702
53186G28374j7002j8202j8318j7483j6687j6461j6605j6888j7241j7405j7112
53175E38970j6473j5703j4708j3429j2274j1708j1590j1378j0766r840q891q346
53163C93864q512r039r070q249p154o493o320o359o524o732o726o479o314o289
53149B93604o018n334m587l973l280k606k526l050l310k795k126j949j839j200
53135B49011m33l35q07j100q86l55M34J385J988J910J718K155L015L445L185K744
53119B67074K530K538K753L176L548L591L345K824J662k98k332l466l613l521
53105B79811l708m136m715n424n959n907n384m948m863m856m675m476m536m845
$$ y = [883301, 868725, 854908, 841709, 828476, 814944, 801369, 787759, 773713, 759098, 744076, 728374, 711372, 693170, 674852, 657369, 640682, 624221, 607616, 590728, 573487, 556082, 538970, 522497, 506794, 492086, 478657, 466383, 454675, 443085, 431707, 420941, 411101, 402210, 393864, 385352, 376313, 367243, 358994, 351840, 345347, 339027, 332668, 326144, 319412, 312686, 306207, 299893, 293604, 287586, 282252, 277665, 273692, 270412, 267806, 265280, 262230, 258920, 256125, 253999, 252050, 250211, 249011, 248578, 248243, 247436, 246336, 245450, 245095, 245529, 246914, 248902, 250812, 252530, 254685, 257700, 261145, 264330, 267074, 269604, 272142, 274895, 278071, 281619, 285210, 288555, 291379, 293041, 292743, 290411, 286945, 283332, 279811, 276103, 271967, 267252, 261828, 255869, 249962, 244578, 239630, 234767, 229911, 225236, 220760, 216224, 211379]
53091B11379n108n035m657m307m172l976l450k938k942l165k833k049j830k478
53077A62439k958k485j760j733k063j872j341j340j817j815r74J2M90M95K22l51
53061A43149j091j587j603j292q73m66j54N9L38O92Q32O14L58L39K96j70r50j599
53043A36892j860j637q75J12O47N02K55L94N89M28K02K17Mq74j750j675r45o97
53025A29929j163j477j142n38K5P22J446J643J182O25L08nl89m57q3K42K26K30
53007A31324N60Q91Q42N77L80J19l81p53m53M28J118R83J42o72q13k32N17Q04
52989A35381M89m0k53J12Q58J480J604J373J337J856K808L818M546M762M567M517
52973A69215N053N772N870N388N262N842O247N708M685L915L141J746J10p84q23
$$ y = [211379, 206271, 201236, 196579, 192272, 188100, 184124, 180674, 177736, 174794, 171629, 168796, 166747, 164917, 162439, 159481, 156996, 155236, 153503, 151440, 149568, 148227, 146887, 145070, 143255, 142281, 142293, 142783, 143278, 143500, 143149, 142058, 140471, 138868, 137576, 136703, 136237, 136083, 136142, 136480, 137172, 138004, 138618, 138976, 139315, 139611, 139441, 138491, 136892, 135032, 133395, 132520, 132632, 133279, 133781, 134036, 134430, 135019, 135447, 135649, 135866, 135870, 134996, 133246, 131571, 130626, 129929, 128766, 127289, 126147, 125609, 125634, 126356, 127802, 129445, 130627, 131252, 131560, 131555, 131166, 130709, 130626, 130868, 131094, 131324, 131884, 132775, 133617, 134194, 134574, 134693, 134312, 133559, 133106, 133534, 134652, 135635, 135777, 135105, 134292, 134060, 134577, 135381, 135870, 135830, 135577, 135689, 136547, 138027, 139631, 141004, 142341, 144197, 147005, 150823, 155369, 160131, 164698, 169215, 174268, 180040, 185910, 191298, 196560, 202402, 208649, 214357, 219042, 222957, 226098, 227844, 227954, 227170, 226347]
52958B26347q44j299j833k129k363k659k754k426j796j202r73j212j534j345o85
52943B01293l86r16j661j904j835j888j729r43j07k7l76l38k06r05k084k282j151
52926A82555m3L3l05j24L94N72L72Q6l02q06j013o15P2N82Q52R38O81P3n12p68
52906A82722p77o64l77K8L23N34Q69J116Q06Q4k19K88J040J365J239Q65K65l09
52888A89198k76M22R63P29J82J52O73J133J165Q57L49j81m25k01L25R68J707K284
52870B00024K116J048j74p32o69n73n67k35N68J421J836J761J571J708K240K704
52854B14047K615K207K316L242M228M433M069M048M741N544N665M878L517K110
52840B67660J035L83Kk57m22n36p24j069j590k352l371m331m738m517m145m058
$$ y = [226347, 225503, 224204, 222371, 220242, 217879, 215220, 212466, 210040, 208244, 207042, 206069, 204857, 203323, 201978, 201293, 200907, 199991, 198330, 196426, 194591, 192703, 190974, 190031, 189924, 189897, 189521, 189183, 188977, 188072, 185988, 183706, 182555, 182512, 182545, 182240, 182116, 182510, 183082, 183454, 183540, 183238, 182432, 181419, 180804, 180876, 181458, 182310, 183248, 183929, 184002, 183490, 182722, 181945, 181281, 180904, 180932, 181255, 181789, 182658, 183774, 184580, 184664, 184445, 184733, 185773, 187138, 188377, 189242, 189507, 189198, 188922, 189344, 190307, 191036, 191218, 191370, 192043, 193176, 194341, 195198, 195547, 195366, 194941, 194740, 195065, 196033, 197740, 200024, 202140, 203188, 203014, 202282, 201613, 201040, 200473, 200238, 200806, 202227, 204063, 205824, 207395, 209103, 211343, 214047, 216662, 218869, 221185, 224427, 228655, 233088, 237157, 241205, 245946, 251490, 257155, 262033, 265550, 267660, 268695, 269078, 269080, 268823, 268401, 267865, 267141, 266072, 264482, 262130, 258759, 254428, 249690, 245173, 241028, 236970]
52824B36970m218m365m409m328m012l517l184l242l443l306k665j741r37o43j004
52809A91956j690k088j921j478j160j075j199j527j858j807j352j017j197j558
52795A71029j547j172r19j056j430j820k058j959j518j076r61j027r45q52j225
52780A51464k112k928l119k700k038j410r37o11k21M18J045J045K32p58j220j259
52764A34891j459j881j960j477r58r09j103j127j129j492k019k156j867j696j815
52749A11843j701j022k61j10o44j431k133k609k693k275j518o96J6M58M11j27
52733I5508p34q96n11lqq22j888j985n33J408K173J557R15J010J002K15m11K39
52715I6236J463J674P59Q3K86O26N03L37N96J141J842K810L681L728L165L236
$$ y = [236970, 232752, 228387, 223978, 219650, 215638, 212121, 208937, 205695, 202252, 198946, 196281, 194540, 193603, 192960, 191956, 190266, 188178, 186257, 184779, 183619, 182544, 181345, 179818, 177960, 176153, 174801, 173784, 172587, 171029, 169482, 168310, 167391, 166335, 164905, 163085, 161027, 159068, 157550, 156474, 155513, 154486, 153541, 152689, 151464, 149352, 146424, 143305, 140605, 138567, 137157, 136220, 135609, 135388, 135806, 136851, 137896, 138128, 137370, 136150, 134891, 133432, 131551, 129591, 128114, 127156, 126247, 125144, 124017, 122888, 121396, 119377, 117221, 115354, 113658, 111843, 110142, 109120, 108859, 108749, 108105, 106674, 104541, 101932, 99239, 96964, 95446, 94750, 94766, 95224, 95635, 95508, 94774, 93878, 93367, 93364, 93356, 92534, 90646, 88661, 88128, 89536, 91709, 93266, 94181, 95191, 96193, 96408, 95997, 96236, 97699, 99373, 100132, 100215, 100501, 101127, 101630, 101967, 102563, 103704, 105546, 108356, 112037, 115765, 118930, 122166]
52699A22166M409N384M739K818J157N46N51N49L70r3j045k366l489l910l658l165
52683A24963k745k377j895j402j268j666k270k676k858l000l043k777k282j853
52669I2851j586j390j296j361j433j412j552j950k008j083L93J274J164P80P27
52654H2118P75N25J21j18k14k91l03k44k47l29l72m80q80j370j425r26k65L36
52636G6411J003J576J572J034P56J227J892J879J003k61j376j956j802j099l81
52621H1478q6k97q84j531j689j047l8O65J077J664K233K020R83R6m1K3l72r51
52603H3303j048n50K02R37J362J176N33N6K9J00J8J7J59R1j97j48L72O59L52J50
52583H7573O95J525J900J960K149K169J510N32P6K47N47Q74J468K109K269K004
$$ y = [122166, 126575, 131959, 136698, 139516, 140673, 141219, 141770, 142319, 142689, 142596, 141551, 139185, 135696, 131786, 128128, 124963, 122218, 119841, 117946, 116544, 115276, 113610, 111340, 108664, 105806, 102806, 99763, 96986, 94704, 92851, 91265, 89875, 88579, 87218, 85785, 84373, 82821, 80871, 78863, 77780, 78173, 79447, 80611, 81391, 82118, 82893, 83418, 83539, 83421, 83207, 82916, 82613, 82369, 82122, 81793, 81421, 80941, 80061, 78691, 77266, 76340, 76075, 76411, 77414, 78990, 80562, 81596, 82352, 83579, 85471, 87350, 88353, 88092, 86716, 84760, 82958, 81859, 81478, 81392, 81095, 80211, 78680, 76991, 75944, 75906, 76571, 77648, 79312, 81545, 83565, 84548, 84644, 84603, 84626, 84254, 83303, 82255, 81705, 81907, 82844, 84206, 85382, 85915, 85971, 86000, 86100, 86118, 86135, 86294, 86385, 86188, 86040, 86412, 87071, 87423, 87573, 88268, 89793, 91693, 93653, 95802, 97971, 99481, 100013, 100089, 100336, 100883, 101757, 103225, 105334, 107603, 109607]
52567A09607J845J809J398O14K19O99J609K198K220J860J310O94K58K58O65J044
52551A28307Q90K27k55Q0R83J571J399Q91O07O26P71R76J156J123R14P95Q65R47
52533A42873J003J124J127P56L71O74J577K136J842J188P13L20q5k62k96o84j194
52516A53183q17N16J299N38n96m61O55J149N61r3j45j4j22k68k93m03o58q19q52
52497A52360r24r53p22m36n26j011j467j548j099q3J127J723J312N06J34K92O65
52480A49350J255K048K441J951J094P71J011J157R86P61N18J46k0M02J048J278
52464A66197J146J063Q30P6o22k60R46J629J107J61k44m8L42O90Q07N26N3j74
52446A74225j04J6K78R01J484J244K15n93m13M98J413J849J644R69M04M70J001
$$ y = [109607, 111452, 113261, 114659, 115273, 115492, 116191, 117800, 119998, 122218, 124078, 125388, 126082, 126340, 126598, 127263, 128307, 129197, 129424, 129169, 129249, 130232, 131803, 133202, 134093, 134700, 135326, 136097, 137073, 138229, 139352, 140266, 141061, 141926, 142873, 143876, 145000, 146127, 146883, 147254, 147928, 149505, 151641, 153483, 154671, 155384, 155704, 155619, 155357, 155061, 154377, 153183, 152366, 152882, 154181, 154719, 154123, 153662, 154317, 155466, 156027, 155934, 155789, 155775, 155653, 155385, 155092, 154689, 154031, 153212, 152360, 151436, 150483, 149761, 149325, 148799, 147788, 146321, 144773, 143674, 143591, 144718, 146441, 147753, 148259, 148393, 148685, 149350, 150605, 152653, 155094, 157045, 158139, 158910, 159921, 161078, 162064, 162825, 163343, 163489, 163469, 163871, 164919, 166197, 167343, 168406, 169236, 169312, 168690, 168430, 169376, 171005, 172112, 172273, 172029, 171981, 172323, 173013, 173820, 174346, 174399, 174225, 174121, 174137, 174415, 175316, 176800, 178044, 178259, 177666, 177253, 177751, 179164, 181013, 182657, 183626, 184030, 184500, 185501]
52429A85501J441J704K151K764L042K740K173J690J400J311J276R07O4p96j278
52414B06090j691k389k968k974k940l579m365m187l183k577k660k394j271k46
52400A68666k03p00p83k61M03P50M93k56p82m85P9k03j254j742r66K64R80J166
52382A65166J069N01m16q25k61O69J245J564J823J564M85o47q12k5R09J495J814
52365A75318K034K268K664L145L409L464L713M156M139L351K492K310K554K456
52351B17473J893J459J605K278L168L885M097L833L471L166K660J877J333J578
52337B53776K498L451L905L797L472L339L359K989K066J366J658K443K580K049
52323B92748J986K860L795M045L982M114M258M283M700N710O603O792O655O655
$$ y = [185501, 186942, 188646, 190797, 193561, 196603, 199343, 201516, 203206, 204606, 205917, 207193, 208100, 208164, 207368, 206090, 204399, 202010, 199042, 196068, 193128, 189549, 185184, 180997, 177814, 175237, 172577, 170183, 168912, 168666, 168463, 167763, 166980, 166719, 167122, 167872, 168365, 168109, 167327, 166842, 166921, 166718, 165464, 163722, 162756, 163020, 164000, 165166, 166235, 166736, 166320, 165495, 165234, 165903, 167148, 168712, 170535, 172099, 172584, 171937, 171125, 171100, 172009, 173504, 175318, 177352, 179620, 182284, 185429, 188838, 192302, 196015, 200171, 204310, 207661, 210153, 212463, 215017, 217473, 219366, 220825, 222430, 224708, 227876, 231761, 235858, 239691, 243162, 246328, 248988, 250865, 252198, 253776, 256274, 259725, 263630, 267427, 270899, 274238, 277597, 280586, 282652, 284018, 285676, 288119, 290699, 292748, 294734, 297594, 301389, 305434, 309416, 313530, 317788, 322071, 326771, 332481, 339084, 345876, 352531, 359186]
52309C59186O518O086O068P015Q313R189R925J1027J1947J1929J1545J2033J3347
52296D84128J4247J4211J4027J4350J4858J5142J5475J6229J7217J8024J8451
52285F56359J8402J7801J6921J6394J6530J6896J6757J5866J4686J3923J3846
52274H34381J4050J3886J3080J1779J0171Q450P082O519O486O127N085L907L131
52261I44134K614K067J628J418J147O12L8n13j413k547k859j661J63J164J231
52246I47223J536K844M722O329P251P606P873Q615R844J0803J0918J0632J0776
52233A046972J1385J1849J1946J1933J1732J0909R487Q088P093O320N563M920
52221A158197M366L633K624J616P90o9j227k635l951m818n176n389n925o761p365
$$ y = [359186, 365704, 371790, 377858, 384873, 393186, 402375, 412300, 423327, 435274, 447203, 458748, 470781, 484128, 498375, 512586, 526613, 540963, 555821, 570963, 586438, 602667, 619884, 637908, 656359, 674761, 692562, 709483, 725877, 742407, 759303, 776060, 791926, 806612, 820535, 834381, 848431, 862317, 875397, 887176, 897347, 905797, 912879, 919398, 925884, 932011, 937096, 941003, 944134, 946748, 948815, 950443, 951861, 953008, 953620, 953658, 953145, 951732, 949185, 946326, 944665, 944828, 945992, 947223, 948759, 951603, 956325, 962654, 969905, 977511, 985384, 993999, 1003843, 1014646, 1025564, 1036196, 1046972, 1058357, 1070206, 1082152, 1094085, 1105817, 1116726, 1126213, 1134301, 1141394, 1147714, 1153277, 1158197, 1162563, 1166196, 1168820, 1170436, 1171226, 1171157, 1169930, 1167295, 1163344, 1158526, 1153350, 1147961, 1142036, 1135275, 1127910]
52206A127910p463p490p910q491q699q481q171p813p173o255n347m602m011l638
52192A032366l513l400l026k392j605p17j1n4r30j784j752j055o21q28j262j456
52176A007960j294q06k33j25p88j737k227k233k274k484k520k348k392k832l324
52161I80343l529l417l040k475k069k180k661k967k854k494k004j301m61J70K80
52146I49341k44j307k507l257l384l342l474l540l451l899n377p022p428o485
52132H94624n397m957m836m698m891n548o000n651m838m257m062l951l785l593
52118H28160l319k912k478k030j383m28O36J522K141K525K798L252M159N390O520
52103H44553P296P851Q415R201J0444J2190J4033J5457J6489J7591J8953K0247
$$ y = [1127910, 1120447, 1112957, 1105047, 1096556, 1087857, 1079376, 1071205, 1063392, 1056219, 1049964, 1044617, 1040015, 1036004, 1032366, 1028853, 1025453, 1022427, 1020035, 1018430, 1017713, 1017702, 1017648, 1016718, 1014934, 1013182, 1012127, 1011506, 1010678, 1009416, 1007960, 1006666, 1005860, 1005627, 1005502, 1004714, 1002977, 1000750, 998517, 996243, 993759, 991239, 988891, 986499, 983667, 980343, 976814, 973397, 970357, 967882, 965813, 963633, 960972, 958005, 955151, 952657, 950653, 949352, 948891, 949061, 949341, 949097, 947790, 945283, 942026, 938642, 935300, 931826, 928286, 924835, 920936, 915559, 908537, 901109, 894624, 889227, 884270, 879434, 874736, 869845, 864297, 858297, 852646, 847808, 843551, 839489, 835538, 831753, 828160, 824841, 821929, 819451, 817421, 816038, 815610, 816246, 817768, 819909, 822434, 825232, 828484, 832643, 838033, 844553, 851849, 859700, 868115, 877316, 887760, 899950, 913983, 929440, 945929, 963520, 982473, 1002720]
52091A002720K1119K1466K1230K0398J9324J8606J8451J8501J8343J7857J7029
52080A215044J5828J4358J2817J1181R259P141N263L949L094K288J106n95k365
52067A298368l437l686l967m954o017o158n741o186p705q585p363m894l411l921
52053A222343n275n650m309j979OQ11O20K44L41J024K103L344M428N035N127N020
52037A233233N028N150N141M771M095L549L609M159M385L615K082N89l53p67q61
52022A277425r45j436k372l132l219l144l826n276o610p377q030q984j0004j0784
52008A202286j1480j2257j2940j3435j4052j5047j6218j7227j7997j8573j8957
51997A034103j9220j9488j9757j9977k0280k0721k0954k0667k0254k0415k1157
$$ y = [1002720, 1023839, 1045305, 1066535, 1086933, 1106257, 1124863, 1143314, 1161815, 1180158, 1198015, 1215044, 1230872, 1245230, 1258047, 1269228, 1278487, 1285628, 1290891, 1294840, 1297934, 1300222, 1301328, 1300733, 1298368, 1294931, 1291245, 1287278, 1282324, 1276307, 1270149, 1264408, 1258222, 1250517, 1241932, 1234569, 1229675, 1226264, 1222343, 1217068, 1211418, 1207109, 1205130, 1205136, 1205947, 1206567, 1206811, 1207152, 1208176, 1210279, 1213623, 1218051, 1223086, 1228213, 1233233, 1238261, 1243411, 1248552, 1253323, 1257418, 1260967, 1264576, 1268735, 1273120, 1276735, 1278817, 1279406, 1279053, 1278286, 1277425, 1276480, 1275044, 1272672, 1269540, 1266321, 1263177, 1259351, 1254075, 1247465, 1240088, 1232058, 1223074, 1213070, 1202286, 1190806, 1178549, 1165609, 1152174, 1138122, 1123075, 1106857, 1089630, 1071633, 1053060, 1034103, 1014883, 995395, 975638, 955661, 935381, 914660, 893706, 873039, 852785, 832370, 811213]
51986H11213k1866k2276k2637k2880k2509k1500k0455j9657j8804j7874j7413
51975E83342j7597j7856j7801j7647j7342j6315j4594j3198j2665j2170j0901
51964D15256r487q931q935q473p542p027p041o685n549m334l808l962m460n121
51950C23901n650n559m716l598k799k509k592k764k763k622k737l304l758l323
51936B75207k107j073q28r28o38M8M44N8q70j608j579q17J14O53O26J77m74j089
51918B65316j439j526j627j945k364k690k897k919k550j906j632k136k774k527
51904B34384j402n60q37j762k329k272k084k091k063j725j222r37j095j629k259
51889B10117k571k215j241j81L48K00k92q14j269j463j031K8R85J066M21o2Q9
$$ y = [811213, 789347, 767071, 744434, 721554, 699045, 677545, 657090, 637433, 618629, 600755, 583342, 565745, 547889, 530088, 512441, 495099, 478784, 464190, 450992, 438327, 426157, 415256, 405769, 396838, 387903, 379430, 371888, 364861, 357820, 351135, 345586, 341252, 337444, 333482, 329022, 323901, 318251, 312692, 307976, 304378, 301579, 299070, 296478, 293714, 290951, 288329, 285592, 282288, 278530, 275207, 273100, 272027, 271199, 270271, 269633, 269681, 270125, 270183, 269313, 267705, 266126, 265309, 265423, 266076, 266702, 266879, 266405, 265316, 263877, 262351, 260724, 258779, 256415, 253725, 250828, 247909, 245359, 243453, 241821, 239685, 236911, 234384, 232982, 232422, 231585, 229823, 227494, 225222, 223138, 221047, 218984, 217259, 216037, 215100, 214005, 212376, 210117, 207546, 205331, 204090, 203909, 204257, 204457, 204165, 203351, 202082, 200619, 199588, 199616, 200601, 201667, 202088, 202026, 202115]
51872B02115M17L45n8l41l50j98R3N55R87J140J116J205J359J210P33M61Q07J414
51854B13010J568J136P17Q23J265J547J598J639J620J277Q24R76J947K937L099
51839B35983K633K373K464K138Q77p81j838j879j302p66o01o91p44o23m17k13
51823B36613m3r7n67j155j128k39P51R60M75O4J63O68J430K181K290J413L62L35
51805B44476J269J846J248J13n32m39P6O86R98O85J15J25Q07J125L77p29j016
51788B51230l68L89O46M42M8k15K8P95J524J695J516J485J583J339O44J1K7P25
51770B63544J555J855J478R80R01J017P67K75K91R47J420J171P34Q04J291J794
51754B80824K373L077L346K732J771J350J482J517J320J478K365L633M636M935
$$ y = [202115, 202532, 202877, 202819, 202478, 202128, 201930, 202023, 202578, 203565, 204705, 205821, 207026, 208385, 209595, 210328, 210789, 211596, 213010, 214578, 215714, 216431, 217254, 218519, 220066, 221664, 223303, 224923, 226200, 227024, 228000, 229947, 232884, 235983, 238616, 240989, 243453, 245591, 246468, 245687, 243849, 241970, 240668, 239902, 239301, 238610, 237866, 237243, 236826, 236613, 236570, 236473, 235906, 234751, 233623, 233384, 234135, 235095, 235570, 235634, 235797, 236465, 237895, 240076, 242366, 243779, 244141, 244476, 245745, 247591, 248839, 248952, 248420, 247981, 248057, 248743, 249741, 250426, 250541, 250666, 251473, 252598, 252975, 252246, 251230, 250862, 251251, 251897, 252339, 252387, 252172, 252200, 252995, 254519, 256214, 257730, 259215, 260798, 262137, 262781, 262792, 262819, 263544, 265099, 266954, 268432, 269412, 270313, 271330, 272097, 272372, 272663, 273610, 275030, 276201, 276935, 277739, 279030, 280824, 283197, 286274, 289620, 292352, 294123, 295473, 296955, 298472, 299792, 301270, 303635, 307268, 311904, 316839]
51740C16839M526L965M070N044O148O595O385N852M940L611K447K009J892J311
51726C75634L90k4K59N44M09K26M03Q61J504K397L246L276K106K56j464k792l949
51709C83282n069n906o085n551m849m693n058n061m217l321l498m566n211m738
51695C15459l805l272l162l063k893k781k600k083j213k13O92J383J935K564L246
51680C00194L440K555Q00q83j882k431k935l188k673j393o4N44L89K30R16K569
51664B96188M494N925O715P250P965R029J0164J0579R509P193M818L058J166j763
51650C82290n182p615q543q786r045r213r249r569j0142j0160r224q036p262o443
51636B63821m952l439l185m162m863m261l086k672l167l507k963j976j374j288
$$ y = [316839, 321365, 325330, 329400, 334444, 340592, 347187, 353572, 359424, 364364, 367975, 370422, 372431, 374323, 375634, 376024, 376000, 376259, 376803, 377212, 377438, 377841, 378702, 380206, 382603, 385849, 389125, 391231, 391487, 390023, 387231, 383282, 378213, 372307, 366222, 360671, 355822, 351129, 346071, 341010, 336793, 333472, 329974, 325408, 320197, 315459, 311654, 308382, 305220, 302157, 299264, 296483, 293883, 291800, 290587, 290374, 291066, 292449, 294384, 296948, 300194, 303634, 306189, 306989, 306106, 304224, 301793, 298858, 295670, 292997, 291604, 291540, 292084, 292473, 292703, 293619, 296188, 300682, 306607, 313322, 320572, 328537, 337566, 347730, 358309, 367818, 375011, 379829, 382887, 384053, 382290, 377108, 369493, 360950, 352164, 343119, 333906, 324657, 315088, 304946, 294786, 285562, 277526, 270264, 263821, 258869, 255430, 252245, 248083, 243220, 238959, 235873, 233201, 230034, 226527, 223564, 221588, 220214, 218926]
51622B18926j220r06o59q16j296j841k352k733k700k099j213m66M7M22N57K62
51606B01913l01o83o29k14L79Q96R71M82j25k77nJ65P6J76Q18J748K468K774K746
51587B13378K484K080J742J781K490L895N515O560O682O390O402O814P200P372
51573B80785P453P351O776N793M818L949K868J541L87m51j397k704l889m388m340
51558C04552m280m263l871k958j934j262r54o47qJ017K175L142L783M298N000
51543C03790N971O927P455P432P194P158P286P067O103M527K818J457P91Q61J113
51528C77950O61p64k362l167l101k733k250j365j19R12J433J893K852M186N195
51513C79221N296M465L140J832P82m5p18j272j899k844l910m490m385m197m543
$$ y = [218926, 217706, 216800, 216141, 215325, 214029, 212188, 209836, 207103, 204403, 202304, 201091, 200625, 200672, 201094, 201651, 201913, 201612, 200929, 200300, 200086, 200465, 201361, 202332, 202814, 202689, 202412, 202407, 202572, 202648, 202824, 203642, 205390, 207858, 210632, 213378, 215862, 217942, 219684, 221465, 223955, 227850, 233365, 239925, 246607, 252997, 259399, 266213, 273413, 280785, 288238, 295589, 302365, 308158, 312976, 316925, 319793, 321334, 321721, 321270, 319873, 317169, 313280, 308892, 304552, 300272, 296009, 292138, 289180, 287246, 285984, 285030, 284383, 284375, 285392, 287567, 290709, 294492, 298790, 303790, 309761, 316688, 324143, 331575, 338769, 345927, 353213, 360280, 366383, 370910, 373728, 375185, 375976, 376837, 377950, 378611, 377847, 375485, 372318, 369217, 366484, 364234, 362869, 362750, 363662, 365095, 366988, 369840, 374026, 379221, 384517, 388982, 392122, 393954, 394736, 394691, 393973, 392701, 390802, 387958, 384048, 379558, 375173, 370976, 366433]
51498C66433n197n508n291m775m032l116k527k765l476l785l445k988k766k532
51484C14230k042j426q55l58l3Q8K75O83Q01J16p92o83O77K143K722K592K406
51467C20544K431K788L698M914N598N304M568M157M271M830N861P093P821P731
51453C91609P341P108O725N850M844M084L092J343n19j274p87j98l86j150j957
51438D25725k664l193l168k470j648j315j258p11N25J647J793J110N26N09M61
51423D15869m75k374m606o616q223r273r585r209q432p488o604o110o113o202
51409C24559n948n524n274m898l835k362j417j239j122p21n84r93j218n41P04
51394B89587J770K549L368M219M833N099M956M305L513L322L727L588K069j14
$$ y = [366433, 361236, 355728, 350437, 345662, 341630, 338514, 335987, 333222, 329746, 325961, 322516, 319528, 316762, 314230, 312188, 310762, 309907, 309549, 309516, 309604, 309879, 310562, 311363, 311479, 310687, 310004, 310681, 312824, 315546, 318138, 320544, 322975, 325763, 329461, 334375, 339973, 345277, 349845, 354002, 358273, 363103, 368964, 376057, 383878, 391609, 398950, 406058, 412783, 418633, 423477, 427561, 430653, 431996, 431477, 430203, 429416, 429218, 428832, 427682, 425725, 423061, 419868, 416700, 414230, 412582, 411267, 410009, 409298, 409823, 411470, 413263, 414373, 414899, 415408, 415869, 415394, 413020, 408414, 401798, 393575, 384302, 374717, 365508, 357076, 349588, 342984, 336874, 330761, 324559, 318611, 313087, 307813, 302915, 299080, 296718, 295301, 294062, 292940, 292219, 291635, 290642, 289424, 288883, 289587, 291357, 293906, 297274, 301493, 306326, 311425, 316381, 320686, 324199, 327521, 331248, 334836, 336905, 336791]
51380C36791j724k724m028n930p835r331j0435j0822r888p943o400o318p266q023
51366B38124p949p345o766o387n980n325m573m128m139m247m051l599l124k509
51352A68002j517m39Jm62j214j516j381j437j982k478k172j076p0P7m81j021j114
51335A49720q32l02L97R85J214J256J381J334P42N0J50R91J479J108O70Q94J348
51318A62585J413J410J955K893L766M670N772O567O587O283O195N877M803L764
51304B24540L969N058N517M948M418M343L612J345j667m025n212n478n163m790
51290B31415n015n743n955n105m016l758m246m671m683m366l628k559j946k466
51276A73258l520l908l478l175l417l496k836j957j625j764j785j476r91l78K66
$$ y = [336791, 335067, 332343, 328315, 322385, 314550, 305219, 294784, 283962, 274074, 266131, 259731, 253413, 246147, 238124, 230175, 222830, 216064, 209677, 203697, 198372, 193799, 189671, 185532, 181285, 177234, 173635, 170511, 168002, 166485, 166046, 166047, 165585, 164371, 162855, 161474, 160037, 158055, 155577, 153405, 152329, 152259, 152336, 151855, 150834, 149720, 148888, 148586, 148983, 149968, 151182, 152438, 153819, 155153, 155895, 155945, 156095, 157086, 158565, 159673, 160343, 161237, 162585, 163998, 165408, 167363, 170256, 174022, 178692, 184464, 191031, 197618, 203901, 210096, 215973, 220776, 224540, 228509, 233567, 239084, 244032, 248450, 252793, 256405, 257750, 256083, 252058, 246846, 241368, 236205, 231415, 226400, 220657, 214702, 209597, 205581, 201823, 197577, 192906, 188223, 183857, 180229, 177670, 175724, 173258, 169738, 165830, 162352, 159177, 155760, 152264, 149428, 147471, 145846, 144082, 142297, 140821, 139830, 139452, 139718]
51261A39718N14O9o09q19n91m53l67K69J385J900J113k47r16o14N5O93J386K037
51243A44523K218J778J072M70N9j87l71o52r36q14k57rn90j231q23K97O97J0n27
51224A44727j06M43J23o35p89k81J43J26k12p84j333j209k25P29P30J35J2O55
51206A42249J489J994J951J138k42j212j064m59m43p73m23N04P59m9q11o06J28
51189A44130N80O70O83N99M20L85M24L5q64j649j910j945j945j480m10M41K98
51172A38462m11o71k54K99O79J043J325J141M62j81k90J47Q67J581J941J600N92
51155A48332n15j058r10n63n76j010j479j750j974k259k311j879j311j203j509
51140A28025j518q38J7K97n6m29l02K53P76R47Q88R16J080J104Q96Q41J284J926
$$ y = [139718, 140232, 140301, 139692, 138873, 138282, 137829, 137462, 137731, 139116, 141016, 142129, 141882, 140966, 140352, 140407, 141100, 142486, 144523, 146741, 148519, 149591, 150061, 150120, 149933, 149562, 148910, 147974, 147160, 146903, 146894, 146304, 145073, 144250, 144547, 145244, 145254, 144727, 144621, 145064, 145187, 144552, 143763, 143482, 143625, 143751, 143539, 142755, 141422, 140213, 139988, 140717, 141447, 141582, 141594, 142249, 143738, 145732, 147683, 148821, 148579, 147367, 146303, 145844, 145401, 144628, 144205, 144709, 145468, 145419, 144608, 144002, 144130, 144710, 145380, 146063, 146662, 147082, 147467, 147891, 147926, 147062, 145413, 143503, 141558, 139613, 138133, 137723, 138164, 138462, 138051, 137380, 137126, 137425, 138104, 139147, 140472, 141613, 142075, 141894, 141604, 141751, 142618, 144199, 146140, 147740, 148332, 147817, 146759, 145849, 145286, 144710, 143700, 142221, 140471, 138497, 136238, 133927, 132048, 130737, 129534, 128025, 126507, 125669, 125686, 125983, 125927, 125498, 125196, 125449, 126225, 127172, 128060, 128976, 130056, 131160, 132056, 132897, 134181, 136107]
51122A36107K135J789J401J442J886K394K631K371J667R26N22L62Q3l88q67j348
51106A53113j944k392k177j285l96j10l04m39k14K09M61L47P6O8M15P21P01O22
51088A47472P47P60L56M2N32J425J566P84K69P85J485J134r7r51p65m8M62O43
51070A56601P79R97J125R33M50N9J55O52R36N19l96j071r68k82K30L5n61p21o7
51051A59405R34J729K328K894L126K748K252K358K888K984K480K122K282K357
51037A92887J850J265J375K107K658K462J623P14L45O39R65O28j39m30k9K24k69
51020B08875j012j284j194j184j126p43m18p09j251j106j48O97P67M89O31J286
51004B02570K011K582L132L640L741L304K934L474M922O173O230N403M853N104
$$ y = [136107, 138242, 140031, 141432, 142874, 144760, 147154, 149785, 152156, 153823, 154749, 155271, 155633, 155716, 155328, 154461, 153113, 151169, 148777, 146600, 145315, 144919, 144809, 144505, 144066, 143852, 144061, 144522, 144869, 144945, 145013, 145428, 146149, 146850, 147472, 148219, 148979, 149335, 149377, 149909, 151334, 152900, 153684, 153953, 154738, 156223, 157357, 157260, 156309, 155544, 155496, 155958, 156601, 157380, 158377, 159502, 160435, 160885, 160944, 161099, 161751, 162687, 163206, 162810, 161739, 160771, 160489, 160719, 160754, 160193, 159472, 159405, 160339, 162068, 164396, 167290, 170416, 173164, 175416, 177774, 180662, 183646, 186126, 188248, 190530, 192887, 194737, 196002, 197377, 199484, 202142, 204604, 206227, 206941, 207286, 207925, 208890, 209518, 209379, 208949, 208920, 209144, 208875, 207863, 206579, 205385, 204201, 203075, 202332, 201914, 201205, 199954, 198848, 198700, 199397, 200164, 200653, 201284, 202570, 204581, 207163, 210295, 213935, 217676, 220980, 223914, 227388, 232310, 238483, 244713, 250116, 254969, 260073]
50990B60073N633N987O511P623Q944R715R838R927J0466J1277J1874J2100J2398
50977C82366J3517J5807J8749K1415K3414K5207K7429L0298L3760L7700M1748
50966F71410M5280M8017N0415N3086N6047N8783O0781O1790O1719O0625N8664
50955A286617N5825N1909M6977M1584L6360L1495K6836K2285J7842J3511R439
50944A640680O018L676K615K775L885N400O634P174O950N892L716K39m292r341
50930A682021j4393j9173k3826k8883l4673m0688m5884m9699n2474n4747n6588
50919A260993n7755n8073n7393n5554n2644m9067m5151m0958l6616l2545k9177
50908G46060k6648k4798k3132k0881j7609j3833j0578q215o274m401k845j806
$$ y = [260073, 265706, 271693, 278204, 285827, 294771, 304486, 314324, 324251, 334717, 345994, 357868, 369968, 382366, 395883, 411690, 430439, 451854, 475268, 500475, 527904, 558202, 591962, 629662, 671410, 716690, 764707, 815122, 868208, 924255, 983038, 1043819, 1105609, 1167328, 1227953, 1286617, 1342442, 1394351, 1441328, 1482912, 1519272, 1550767, 1577603, 1599888, 1617730, 1631241, 1640680, 1646698, 1650374, 1652989, 1655764, 1659649, 1665049, 1671683, 1678857, 1685807, 1691699, 1695415, 1695654, 1691362, 1682021, 1667628, 1648455, 1624629, 1595746, 1561073, 1520385, 1474501, 1424802, 1372328, 1317581, 1260993, 1203238, 1145165, 1087772, 1032218, 979574, 930507, 885356, 844398, 807782, 775237, 746060, 719412, 694614, 671482, 650601, 632992, 619159, 608581, 600366, 594092, 589691, 586846, 585040]
50896E85040r65m2P02Q64M30k58p15m44N61J456J406P90O86J207J462J336J878
50879E95394L360M451M257L804M287N090N075M852N884P981R560J0249J1252J3060
50865F88556J4683J5612J6913J9532K2851K5829K8571L1884L6094M1166M7302
50854I88993N4456O1775O8506P5118Q2665R1209R9774J07735J15356J22764J29227
50843A997578J33932J36884J38372J37875J34220J26870J16527J04249R0527P5639
50833C192673O0407M5919L2679K0662J0227K254k734m997m882k422K110P748J3480
50820C373124J8752K2846K4282K1543J4389L946q367k1707l5902n1137o7316q3479
50808C210974r8077j10241j20329j28798j34948j37529j36308j32355j26826j20084
$$ y = [585040, 584075, 584033, 584735, 585599, 586029, 585771, 585056, 584612, 585173, 586629, 588035, 588825, 589511, 590718, 592180, 593516, 595394, 598754, 603205, 607462, 611266, 615553, 620643, 625718, 630570, 636454, 644435, 653995, 664244, 675496, 688556, 703239, 718851, 735764, 755296, 778147, 803976, 832547, 864431, 900525, 941691, 988993, 1043449, 1105224, 1173730, 1248848, 1331513, 1422722, 1522496, 1630231, 1745587, 1868351, 1997578, 2131510, 2268394, 2406766, 2544641, 2678861, 2805731, 2922258, 3026507, 3117034, 3192673, 3253080, 3298999, 3331678, 3352340, 3362567, 3364821, 3362087, 3357090, 3352208, 3349786, 3351896, 3359644, 3373124, 3391876, 3414722, 3439004, 3460547, 3474936, 3478882, 3470515, 3448808, 3412906, 3361769, 3294453, 3210974, 3112897, 3002656, 2882327, 2753529, 2618581, 2481052, 2344744, 2212389, 2085563, 1965479]
50798A965479j12090j03014r3284q3356p3564o4009n4623m5449l6720k8622k1140
50787A249608j4344q471l528P99M604P615R721J1142J1753J0973Q817O292M124
50774A299105J835j105m011n976p530r946j3146j5776j7314j8772k0903k3006
50762A163455k4051k4032k3530k2654k1178j9316j7652j6414j5194j3369j0714
50751I55351p675n000k927q46J984N603R526J3502J7566K1652K5681K9941L4764
50738A099122L9958M5061N0037N5160O0401O5653P1243P7419Q3434Q7960R0452
50727A825900R1259R0480Q7676Q2928P7095P0626O2888N3067M1250K8271J5049
50716B526489K367r219j9460k8017l4019l6719l6599l4979l2375k8130k1869j4504
$$ y = [1965479, 1853389, 1750375, 1657091, 1573735, 1500171, 1436162, 1381539, 1336090, 1299370, 1270748, 1249608, 1235264, 1226793, 1223265, 1224064, 1228668, 1236283, 1246004, 1257146, 1268899, 1279872, 1288689, 1294981, 1299105, 1300940, 1299835, 1295824, 1289848, 1282318, 1272372, 1259226, 1243450, 1226136, 1207364, 1186461, 1163455, 1139404, 1115372, 1091842, 1069188, 1048010, 1028694, 1011042, 994628, 979434, 966065, 955351, 947676, 942676, 939749, 938903, 940887, 946490, 956016, 969518, 987084, 1008736, 1034417, 1064358, 1099122, 1139080, 1184141, 1234178, 1289338, 1349739, 1415392, 1486635, 1564054, 1647488, 1735448, 1825900, 1917159, 2007639, 2095315, 2178243, 2255338, 2325964, 2388852, 2441919, 2483169, 2511440, 2526489, 2528856, 2519637, 2500177, 2472160, 2438141, 2401422, 2364823, 2329844, 2297469, 2269339, 2247470, 2232966]
50704B232966p352j198L373N547M967K143k450r095j8059k8572l9306m9496n8950
50691B034518o7284p3855p8224q0234p9828p7237p3135o8197o2662n6631n0439
50680A266792m4261l7723l0444k2814j5682r359l348K961R661J6361K2492K7603
50668A182239L1645L4988L7996M0523M1962M1805M0069L7277L4054L0748K7393
50657A580699K3973K0542J7005J3185R265N908L554J865K78j189k137k516k501
50644A667931j898l59J918M499P497J1298J5574J9542K3198K7195L1331L4279
50632A842005L5235L4782L3582L1356K7911K4113K0853J7730J3891R652O321M623
50620B102054M281M918O537R146J2586J6749K1340K5512K8293K9343K8866K6911
$$ y = [2232966, 2225614, 2224416, 2227789, 2233336, 2238303, 2240446, 2237996, 2228901, 2210842, 2182270, 2142964, 2093468, 2034518, 1967234, 1893379, 1815155, 1734921, 1655093, 1577856, 1504721, 1436524, 1373862, 1317231, 1266792, 1222531, 1184808, 1154364, 1131550, 1115868, 1106509, 1103161, 1106122, 1115783, 1132144, 1154636, 1182239, 1213884, 1248872, 1286868, 1327391, 1369353, 1411158, 1451227, 1488504, 1522558, 1553306, 1580699, 1604672, 1625214, 1642219, 1655404, 1664669, 1670577, 1674131, 1675996, 1676274, 1675085, 1672948, 1670432, 1667931, 1666033, 1665674, 1667592, 1672091, 1679588, 1690886, 1706460, 1726002, 1749200, 1776395, 1807726, 1842005, 1877240, 1912022, 1945604, 1976960, 2004871, 2028984, 2049837, 2067567, 2081458, 2091110, 2097431, 2102054, 2106335, 2111253, 2117790, 2126936, 2139522, 2156271, 2177611, 2203123, 2231416, 2260759, 2289625, 2316536]
50608B316536K3350J8434J2814O878N48o269j3418k0766k8367l6270m4328n2213
50596B176929n9415o5359o9770p2832p4784p5550p4946p3118p0497o7412o4056
50585A409190o0649n7326n3908n0069m5766m1358l7302l3795l0693k7671k4513
50574I46140k1219j7791j4153j0478p348n140l332j030J897M725P075R390J2096
50561I00832J4855J7153J9064K1030K3250K5679K8306L1094L3986L7167M0889
50550A193305M4777M7796M9292M9634M9455M8790M7398M5500M3604M1893M0253
50539A701697L8648L7121L5706L4768L4971L6508L8645M0487M1878M3251M5023
50528B128703M7573N1298N6021O0744O4540O7521P0339P3044P4998P5682P4968
$$ y = [2316536, 2339886, 2358320, 2371134, 2378012, 2378560, 2372291, 2358873, 2338107, 2309740, 2273470, 2229142, 2176929, 2117514, 2052155, 1982385, 1909553, 1834769, 1759219, 1684273, 1611155, 1540658, 1473246, 1409190, 1348541, 1291215, 1237307, 1187238, 1141472, 1100114, 1062812, 1029017, 998324, 970653, 946140, 924921, 907130, 892977, 882499, 875151, 870011, 866679, 865649, 867546, 872271, 879346, 888736, 900832, 915687, 932840, 951904, 972934, 996184, 1021863, 1050169, 1081263, 1115249, 1152416, 1193305, 1238082, 1285878, 1335170, 1384804, 1434259, 1483049, 1530447, 1575947, 1619551, 1661444, 1701697, 1740345, 1777466, 1813172, 1847940, 1882911, 1919419, 1958064, 1998551, 2040429, 2083680, 2128703, 2176276, 2227574, 2283595, 2344339, 2408879, 2476400, 2546739, 2619783, 2694781, 2770463, 2845431]
50517B845431P2760O8948O3613N6829M8462L8557K7660J6320M494q023k0864l3318
50505C180869m4921n5297o3682o9379p2459p3348p1839o7264n9645m9998l9408
50494B513629k8432j7423o884K681J0856J7209K1468K3749K4135K2070J6632P497
50482B607187m703j8903l4011m8917o2644p4581q4326r1427r5706r7637r7863
50471A896469r6460r3248q8692q3790p8988p3882o8130o2077n6186n0468m4799
50460A099749l9364l4440k9972k5639k1208j6737j2629r410p134n010k095J557
50448H97668M881P065Q441R853J1620J3437J5004J6359J7679J9115K0793K2725
50436A064640K4669K6260K7364K8214K9147L0250L1338L2123L2358L1931L1072
$$ y = [2845431, 2918191, 2987139, 3050752, 3107581, 3156043, 3194600, 3222260, 3238580, 3243074, 3235051, 3214187, 3180869, 3135948, 3080651, 3016969, 2947590, 2875131, 2801783, 2729944, 2662680, 2603035, 2553037, 2513629, 2485197, 2467774, 2460890, 2463571, 2474427, 2491636, 2513104, 2536853, 2560988, 2583058, 2599690, 2607187, 2602484, 2583581, 2549570, 2500653, 2438009, 2363428, 2279102, 2187675, 2091969, 1994332, 1896469, 1800009, 1706761, 1618069, 1534279, 1455291, 1381409, 1313279, 1251202, 1195016, 1144548, 1099749, 1060385, 1025945, 995973, 970334, 949126, 932389, 919760, 910350, 903216, 898206, 896111, 897668, 902549, 909614, 918055, 927908, 939528, 952965, 967969, 984328, 1002007, 1021122, 1041915, 1064640, 1089309, 1115569, 1142933, 1171147, 1200294, 1230544, 1261882, 1294005, 1326363, 1358294, 1389366]
50425A389366L0465L0753L1722L2330L1925L1086L0821L1168L1355L1135L1114
50414A733240L1722L2736L3978L5617L7355L8253L7891L6914L5827L4058L1011
50403B118602K7307K4018K1182J7960J3839Q824K847m049j1257j8263k5477l3458
50391B142075m1661m9038n5598o2086o8181p2320p3583p2595p0232o6621o1816
50380A448344n6436n0820m4457l6961k8951k1244j3798o311O44N960R336J1448
50368A216754J2723J2652J0518O404J140m533j0407j6427k2133k6776k9946l1895
50356A118074l3151l4067l4771l5136l4618l2594k9317k6124k4138k3036k1681
50345G89441j9674j7543j5567j3384j0961r083q387q437q181p097n519l999k676
$$ y = [1389366, 1419831, 1450584, 1482306, 1514636, 1546561, 1577647, 1608468, 1639636, 1670991, 1702126, 1733240, 1764962, 1797698, 1831676, 1867293, 1904648, 1942901, 1980792, 2017706, 2053533, 2087591, 2118602, 2145909, 2169927, 2191109, 2209069, 2222908, 2231732, 2234579, 2230530, 2219273, 2201010, 2175533, 2142075, 2100414, 2051376, 1995778, 1933692, 1865511, 1793191, 1719608, 1647013, 1576781, 1510160, 1448344, 1391908, 1341088, 1296631, 1259670, 1230719, 1209475, 1195677, 1189366, 1190010, 1195970, 1205306, 1216754, 1229477, 1242129, 1252647, 1259051, 1260191, 1255658, 1245251, 1228824, 1206691, 1179915, 1149969, 1118074, 1084923, 1050856, 1016085, 980949, 946331, 913737, 884420, 858296, 834158, 811122, 789441, 769767, 752224, 736657, 723273, 712312, 703229, 694842, 686405, 678224, 671127, 665608, 661609, 658933]
50332F58933j275M35K260L831N185O765Q703J0477J1582J2198J2753J3209J3384
50319G58440J3557J4118J4814J5133J5327J6269J8222K0369K1745K2090K1766
50308I51850K1351K1351K1830K2239K1999K1139J9993J8522J6624J4782J3613
50297A165293J2825J1501R440P427O037M939L539J630q18l766o879r740j2482
50284A188946j5646j9333k3046k6283k8664k9665k9131k7942k7194k6741k5604
50273I09697k3767k2338k1688k0852j9213j7455j6162j4695j2417r970q298p224
50261G15618n992m554l278k027n06R29J735K123K667L296L474L134K672K292K024
50246G23607K132K714L183K842J814Q31K61l2k24n19j404l142n174o566o963o661
$$ y = [658933, 657658, 658093, 660353, 664184, 669369, 676134, 684837, 695314, 706896, 719094, 731847, 745056, 758440, 771997, 786115, 800929, 816062, 831389, 847658, 865880, 886249, 907994, 930084, 951850, 973201, 994552, 1016382, 1038621, 1060620, 1081759, 1101752, 1120274, 1136898, 1151680, 1165293, 1178118, 1189619, 1199059, 1206486, 1212523, 1217462, 1221001, 1222631, 1221813, 1218047, 1211168, 1201428, 1188946, 1173300, 1153967, 1130921, 1104638, 1075974, 1046309, 1017178, 989236, 962042, 935301, 909697, 885930, 863592, 841904, 821052, 801839, 784384, 768222, 753527, 741110, 731140, 722842, 715618, 709626, 705072, 701794, 699767, 699261, 700190, 701925, 704048, 706715, 710011, 713485, 716619, 719291, 721583, 723607, 725739, 728453, 731636, 734478, 736292, 737123, 737384, 737352, 737128, 736609, 735205, 732063, 726889, 720323, 713360, 706699]
50230G06699o001n314n151n784o635o750n863m513l300k536k295k256j621N6K077
50215F50813L254L337L169L484M186M807N065M836M135L266K585J996J101j55
50201F95879j299j913k106k394l319n054p131q628q978q488p809p151o452n941
50187F19216n969o278o189n542n011n317o453p834q791q953q392p537o726n939
50173E24285n092m338l781l140k160j150n75l30n6Mp55k198l344l715l971m769
50157D84915n640n676m997m767n687p057p526o566m916l713l375l404l163k613
50143D15815k190k179k439k721k948l116l065k628j923j321j046q56l34M22P30
50128C90201K04m88j86J364L131M035M146M351N065N838O106N983O038O570P299
$$ y = [706699, 700698, 695384, 690233, 684449, 677814, 671064, 665201, 660688, 657388, 654852, 652557, 650301, 648680, 648736, 650813, 654067, 657404, 660573, 664057, 668243, 673050, 678115, 682951, 687086, 690352, 692937, 694933, 696034, 695879, 694580, 692667, 690561, 688167, 684848, 679794, 672663, 664035, 655057, 646569, 638760, 631609, 625157, 619216, 613247, 606969, 600780, 595238, 590227, 584910, 578457, 570623, 561832, 552879, 544487, 536950, 530224, 524285, 519193, 514855, 511074, 507934, 505774, 504624, 504049, 503719, 503663, 503667, 502912, 500714, 497370, 493655, 489684, 484915, 479275, 473599, 468602, 463835, 458148, 451091, 443565, 436999, 432083, 428370, 424995, 421591, 418428, 415815, 413625, 411446, 409007, 406286, 403338, 400222, 397157, 394529, 392606, 391285, 390239, 389383, 389049, 389471, 390201, 390405, 389917, 389731, 391095, 394226, 398261, 402407, 406758, 411823, 417661, 423767, 429750, 435788, 442358, 449657]
50113D49657P777P918P956P936P550O677N800N445N460N223M523L671K869K042
50099E30504J335J124J366J519J344J177J237J288J326J878L113M312M823M920
50085E61266N170N454N382N217N504O111O454O479O661P113P455P575P812Q309
50071F51962Q800R145R527J0089J0769J1555J2447J3148J3300J3089J3160J3831
50059G90822J4688J5092J4802J4134J3713J4001J4799J5290J4827J3570J2116
50048I47854J0796R606Q574P641O441M693K703J023k58j437k661l938n401p006
50034I78630q114q123p374o830o839o930o722o323n806n001l957k884j521P65
50020I02971L904O862Q747R766J0832J2746J5835J9882K4154K8081L2086L7144
$$ y = [449657, 457434, 465352, 473308, 481244, 488794, 495471, 501271, 506716, 512176, 517399, 521922, 525593, 528462, 530504, 531839, 532963, 534329, 535848, 537192, 538369, 539606, 540894, 542220, 544098, 547211, 551523, 556346, 561266, 566436, 571890, 577272, 582489, 587993, 594104, 600558, 607037, 613698, 620811, 628266, 635841, 643653, 651962, 660762, 669907, 679434, 689523, 700292, 711847, 724294, 737442, 750742, 763831, 776991, 790822, 805510, 820602, 835404, 849538, 863251, 877252, 892051, 907341, 922168, 935738, 947854, 958650, 968256, 976830, 984471, 990912, 995605, 998308, 999331, 999073, 997636, 994975, 991037, 985636, 978630, 970516, 962393, 955019, 948189, 941350, 934420, 927698, 921375, 915569, 910568, 906611, 903727, 902206, 902971, 906875, 913737, 922484, 932250, 943082, 955828, 971663, 991545, 1015699, 1043780, 1075866, 1113010]
50008A113010M3324M9498N4761N9348O3533O6373O6351O2969N6981M9360M0824
49997A726332L2170K4298J7776J2839R788Q838R519J0767J1692J1837J0598O967
49985A893421K44r313k0761l3132m5463n6592o5437p1539p5089p6407p5720p3336
49973A290876o9734o5368o0590n5754n1061m6327m1316l6342l2033k8401k4780
49962G79170k1051j8242j7209j7262j6948j5867j4744j3932j2983j1748j0816
49951F08368j0464j0192r697r384r422r187q277p236o549n824m702l866m038m660
49937E04870m575l623k545j654p74j93m45j092r06N52K360L492L874L975M136
49922E07452M531N200N875O207O282O499O958P480Q076Q799R274R097Q685Q979
$$ y = [1113010, 1156334, 1205832, 1260593, 1319941, 1383474, 1449847, 1516198, 1579167, 1636148, 1685508, 1726332, 1758502, 1782800, 1800576, 1813415, 1823203, 1832041, 1841560, 1852327, 1864019, 1875856, 1886454, 1893421, 1893665, 1884352, 1863591, 1830459, 1784996, 1728404, 1662967, 1591428, 1516339, 1439932, 1364212, 1290876, 1221142, 1155774, 1095184, 1039430, 988369, 942042, 900726, 864384, 832351, 803950, 779170, 758119, 739877, 722668, 705406, 688458, 672591, 657847, 643915, 630932, 619184, 608368, 597904, 587712, 578015, 568631, 559209, 550022, 541745, 534509, 527960, 522136, 517434, 513568, 509530, 504870, 500295, 496672, 494127, 492473, 491699, 491506, 491061, 489969, 489063, 489615, 491975, 495467, 499341, 503316, 507452, 511983, 517183, 523058, 529265, 535547, 542046, 549004, 556484, 564560, 573359, 582633, 591730, 600415, 609394]
49908F09394J0231J1832J3289J4655J5884J6746J7476J8804K0967K3475K6104
49897G98857K9362L3677L8857M4596N0873N7583O4458P1674P9611Q7595R3679
49886A450822R6359R5947R3578Q9568Q3605P6229O9075O3578O0025N7983N7103
49875B293872N7209N7844N8064N6788N3227M6885L7280K4137Q116r055k5680m1068
49863B617619n5039o6954p6065q2615q7608r1478r3743r4155r3311r1878q9949
49852A694824q7422q4358q0684p6198p1107o5998o1061n6029n1030m6744m3378
49841I70815m0253l6821l3384l0413k7841k5435k3230k1200j9157j7332j6338
49830F79411j6184j6088j5685j5534j5893j5931j4905j3358j2261j1608j0730
$$ y = [609394, 619625, 631457, 644746, 659401, 675285, 692031, 709507, 728311, 749278, 772753, 798857, 828219, 861896, 900753, 945349, 996222, 1053805, 1118263, 1189937, 1269548, 1357143, 1450822, 1547181, 1643128, 1736706, 1826274, 1909879, 1986108, 2055183, 2118761, 2178786, 2236769, 2293872, 2351081, 2408925, 2466989, 2523777, 2577004, 2623889, 2661169, 2685306, 2693422, 2684367, 2658687, 2617619, 2562580, 2495626, 2419561, 2336946, 2249338, 2157860, 2064117, 1969962, 1876651, 1784773, 1694824, 1607402, 1523044, 1442360, 1366162, 1295055, 1229057, 1167996, 1111967, 1060937, 1014193, 970815, 930562, 893741, 860357, 829944, 802103, 776668, 753438, 732238, 713081, 695749, 679411, 663227, 647139, 631454, 615920, 600027, 584096, 569191, 555833, 543572, 531964, 521234]
49819E21234r478q226p107o052n231m729m211l536l180l383l435k657j514q37
49805D57658m74K09R53R88N34O21J398J853J402O32K43K15M18J072K100K824K800
49788D75446K482K484K749K952L345M559O655Q829J0139J0431J0509J1416J3542
49775E65538J6466J9679K3169K7171L1654L6430M1563M7264N3457N9721O5510
49764I87622P0080P2500P2111O8945O3409N5885M7100L8489L1494K6564K3411
49753A557610K2030K2732K5157K7991K9812K9666K6769K0340J0118l288j8692
49742A750245l4630m9452o1750p1026p7565q1494q2427q0211p5546o9583o3215
49731A003346n6984n1291m6248m1516l6672l1751k7272k3747k1251j9395j7674
$$ y = [521234, 511756, 503530, 496423, 490371, 485140, 480411, 476200, 472664, 469484, 466101, 462666, 460009, 458495, 457658, 457184, 457393, 458346, 459334, 459868, 460489, 461887, 463740, 465142, 465774, 466017, 466232, 466650, 467722, 469822, 472646, 475446, 477928, 480412, 483161, 486113, 489458, 494017, 500672, 509501, 519640, 530071, 540580, 551996, 565538, 582004, 601683, 624852, 652023, 683677, 720107, 761670, 808934, 862391, 922112, 987622, 1057702, 1130202, 1202313, 1271258, 1334667, 1390552, 1437652, 1476141, 1507635, 1534199, 1557610, 1579640, 1602372, 1627529, 1655520, 1685332, 1714998, 1741767, 1762107, 1772225, 1768937, 1750245, 1715615, 1666163, 1604413, 1533387, 1455822, 1374328, 1291901, 1211690, 1136144, 1066561, 1003346, 946362, 895071, 848823, 807307, 770635, 738884, 711612, 687865, 666614, 647219, 629545]
49720F29545j5861j4118j2656j1482j0487r623q802p794o556n378m521l802k996
49707E15469k368k357k836l183l106k952l141l662m160m210l522k241j022l93
49693D76316j04M08J048J132N04j76l93l55k68J97J191J936J507J18j019j070
49677D80972l43L50N96N45N36Q04J312J763J832J454Q49K40l39q82j240j173o07
$$ y = [629545, 613684, 599566, 586910, 575428, 564941, 555318, 546516, 538722, 532166, 526788, 522267, 518465, 515469, 513101, 510744, 507908, 504725, 501619, 498667, 495526, 491864, 487704, 483494, 479972, 477731, 476709, 476316, 476212, 476620, 477668, 478800, 479304, 479128, 478735, 478380, 478112, 478309, 479500, 481436, 482943, 483061, 482042, 480972, 480629, 480979, 481575, 482120, 482656, 483460, 484772, 486535, 488367, 489821, 490670, 490910, 490571, 489689, 488449, 487276, 486669]
$$ [...]
##END NTUPLES=NMR SPECTRUM
##END=
