
##TITLE=AC1310_HONAH12126_6535079_WemgOAAI5z
##JCAMPDX= 6.0         $$ Bruker NMR JCAMP-DX V2.0
##DATA TYPE= NMR SPECTRUM
##DATA CLASS= NTUPLES
##ORIGIN= BRUKER
##OWNER= Administrator
$$ 1.72 TOPSPIN		Version 2.1
$$ 2012-07-16 21:02:54.578 -0500  Administrator@TOPSPIN
$$ Compression mode = diff/dup
##.OBSERVE FREQUENCY= 400.02188249412
##.OBSERVE NUCLEUS= ^1H
##.ACQUISITION MODE= SIMULTANEOUS (DQD)
##.ACQUISITION SCHEME= undefined
##.AVERAGES= 64
##.DIGITISER RES= 22
##SPECTROMETER/DATA SYSTEM= spect
##.PULSE SEQUENCE= noesygpps1d.comp
##.SOLVENT NAME= COFFEE_meoh
##.SHIFT REFERENCE= INTERNAL, COFFEE_meoh, 1, 14.96068
##AUDIT TRAIL= $$ (NUMBER, WHEN, WHO, WHERE, PROCESS, VERSION, WHAT)
$$ ##TITLE= Audit trail, TOPSPIN		Version 2.1
$$ ##JCAMPDX= 5.01
$$ ##ORIGIN= Bruker BioSpin GmbH
$$ ##OWNER= Administrator
$$ $$ C:\Bruker\TOPSPIN/data/COFFEE/nmr/AC1310_HONAH12126_6535079_WemgOAAI5z/12/pdata/1/auditp.txt
$$ ##AUDIT TRAIL=  $$ (NUMBER, WHEN, WHO, WHERE, PROCESS, VERSION, WHAT)
(   1,<2012-07-16 21:02:49.515 -0500>,<Administrator>,<TOPSPIN>,<go>,<TOPSPIN 2.1>,
      <created by zg
	started at 2012-07-16 20:51:18.890 -0500,
	POWCHK enabled, PULCHK disabled,
       configuration hash MD5:
       6B 1B 68 BB D9 2E 58 E2 7F 35 AD 54 07 DF 0E 41
       data hash MD5: 64K
       97 08 7C B8 21 2A 3F 34 9E DA C7 4A C4 49 7B D5>)
(   2,<2012-07-16 21:02:52.484 -0500>,<Administrator>,<TOPSPIN>,<proc1d>,<TOPSPIN 2.1>,
      <Start of raw data processing
       efp LB = 0.3 FT_mod = 6 PKNL = 1 PHC0 = 0 PHC1 = 0 SI = 128K 
       data hash MD5: 128K
       C1 A9 CB 0D FF 8C 1B A8 B3 F7 66 61 F7 9E 46 A8>)
(   3,<2012-07-16 21:02:53.609 -0500>,<Administrator>,<TOPSPIN>,<proc1d>,<TOPSPIN 2.1>,
      <pk PHC0 = -3.197021 PHC1 = 0 
       data hash MD5: 128K
       5F D1 66 89 EF 65 4D 0E 1B 22 CE EF 47 04 29 EE>)
(   4,<2012-07-16 21:02:54.218 -0500>,<Administrator>,<TOPSPIN>,<proc1d>,<TOPSPIN 2.1>,
      <abs ABSG = 1 
       data hash MD5: 128K
       F4 13 84 60 91 8D 9F EC 97 3A 1D 1E B0 84 06 31>)
(   5,<2012-07-16 21:02:54.296 -0500>,<Administrator>,<TOPSPIN>,<proc1d>,<TOPSPIN 2.1>,
      <abs ABSG = 2 
       data hash MD5: 128K
       83 06 54 C1 C6 0F 5A 7C 33 40 5A C9 6B 75 23 67>)
(   6,<2012-07-16 21:02:54.343 -0500>,<Administrator>,<TOPSPIN>,<proc1d>,<TOPSPIN 2.1>,
      <abs ABSG = 3 
       data hash MD5: 128K
       6D DC 74 AF 11 AE 54 E2 3E 7E 62 7E CE D3 07 B6>)
(   7,<2012-07-16 21:02:54.406 -0500>,<Administrator>,<TOPSPIN>,<proc1d>,<TOPSPIN 2.1>,
      <abs ABSG = 4 
       data hash MD5: 128K
       67 0D AB 86 18 20 FB C3 5E AA F4 80 14 39 17 D6>)
(   8,<2012-07-16 21:02:54.468 -0500>,<Administrator>,<TOPSPIN>,<proc1d>,<TOPSPIN 2.1>,
      <abs ABSG = 5 
       data hash MD5: 128K
       F5 AA 53 7A 06 99 20 55 FA EB 94 1F 2F 96 80 6B>)
$$ ##END=
$$ 
$$ $$ hash MD5
$$ $$ C0 F9 CF 7B 24 5F DA 39 DE 9E 18 02 68 E7 2E 38
##$RELAX= 
##$RELAX= 
##$RELAX= 
##$RELAX= 
##$RELAX= 
##$RELAX= 
##$RELAX= 
##$RELAX= 
$$ Bruker specific parameters
$$ [...]
##$TP07= 0
##$TPNAME0= <>
##$TPNAME1= <>
##$TPNAME2= <>
##$TPNAME3= <>
##$TPNAME4= <>
##$TPNAME5= <>
##$TPNAME6= <>
##$TPNAME7= <>
##$TPOAL= (0..7)
0.5 0.5 0.5 0.5 0.5 0.5 0.5 0.5
##$TPOFFS= (0..7)
0 0 0 0 0 0 0 0
##$TUNHIN= 0
##$TUNHOUT= 0
##$TUNXOUT= 0
##$USERA1= <user>
##$USERA2= <user>
##$USERA3= <user>
##$USERA4= <user>
##$USERA5= <user>
##$V9= 5
##$VALIST= <valist>
##$VCLIST= <CCCCCCCCCCCCCCC>
##$VD= 0
##$VDLIST= <DDDDDDDDDDDDDDD>
##$VPLIST= <PPPPPPPPPPPPPPP>
##$VTLIST= <TTTTTTTTTTTTTTT>
##$WBST= 2048
##$WBSW= 25
##$XGAIN= (0..3)
0 0 0 0
##$XL= 0
##$YL= 0
##$YMAX_a= 10850423
##$YMIN_a= -8984791
##$ZGOPTNS= <>
##$ZL1= 120
##$ZL2= 120
##$ZL3= 120
##$ZL4= 120
##$ABSF1= 14.96068
##$ABSF2= -5.597502
##$ABSG= 5
##$ABSL= 3
##$ALPHA= 0
##$AQORDER= 0
##$ASSFAC= 0
##$ASSFACI= 0
##$ASSFACX= 0
##$ASSWID= 0
##$AUNMP= <proc_prof1d_extract.lims>
##$AXLEFT= 0
##$AXNAME= <>
##$AXNUC= <1H>
##$AXRIGHT= 0
##$AXTYPE= 0
##$AXUNIT= <>
##$AZFE= 0.1
##$AZFW= 0.1
##$BCFW= 0
##$BC_mod= 0
##$BYTORDP= 0
##$COROFFS= 0
##$CY= 15
##$DATMOD= 1
##$DC= 0
##$DFILT= <>
##$DTYPP= 0
##$F1P= 0
##$F2P= 0
##$FCOR= 0.5
##$FTSIZE= 131072
##$FT_mod= 6
##$GAMMA= 0
##$GB= 0
##$INTBC= 1
##$INTSCL= 1
##$ISEN= 128
##$LB= 0.3
##$LEV0= 0
##$LPBIN= 0
##$MAXI= 10000
##$MC2= 0
##$MEAN= 0
##$ME_mod= 0
##$MI= 0
##$NCOEF= 0
##$NC_proc= -2
##$NLEV= 6
##$NOISF1= 0
##$NOISF2= 0
##$NSP= 0
##$NTH_PI= 0
##$NZP= 0
##$OFFSET= 14.96068
##$PC= 1
##$PHC0= -3.197021
##$PHC1= 0
##$PH_mod= 1
##$PKNL= yes
##$PPARMOD= 0
##$PPDIAG= 0
##$PPIPTYP= 0
##$PPMPNUM= 2147483647
##$PPRESOL= 1
##$PSCAL= 4
##$PSIGN= 0
##$PYNMP= <proc.py>
##$REVERSE= no
##$SF= 400.020009763688
##$SI= 131072
##$SIGF1= 0
##$SIGF2= 0
##$SINO= 400
##$SIOLD= 131072
##$SPECTYP= <>
##$SREGLST= <1H.CDCl3>
##$SSB= 0
##$STSI= 131072
##$STSR= 0
##$SW_p= 8223.68421052631
##$SYMM= 0
##$S_DEV= 0
##$TDeff= 65536
##$TDoff= 0
##$TI= <>
##$TILT= no
##$TM1= 0
##$TM2= 0
##$TOPLEV= 0
##$USERP1= <user>
##$USERP2= <user>
##$USERP3= <user>
##$USERP4= <user>
##$USERP5= <user>
##$WDW= 1
##$XDIM= 131072
##$YMAX_p= 439878004
##$YMIN_p= -11289
##$CURPLOT= <Network HP LaserJet P1505>
##$CURPRIN= <$Network HP LaserJet P1505>
##$DFORMAT= <normdp>
##$LAYOUT= <+/1D_H.xwp>
##$LFORMAT= <normlp>
##$PFORMAT= <normpl>
##$SURQMSG= 1
$$ End of Bruker specific parameters
$$ ---------------------------------
##NTUPLES= NMR SPECTRUM
##VAR_NAME=  FREQUENCY,     SPECTRUM/REAL,   SPECTRUM/IMAG
##SYMBOL=    X,             R,               I
##VAR_TYPE=  INDEPENDENT,   DEPENDENT,       DEPENDENT
##VAR_FORM=  AFFN,          ASDF,            ASDF
##VAR_DIM=   131072,        131072,          131072
##UNITS=     HZ,            ARBITRARY UNITS, ARBITRARY UNITS
##FACTOR=    0.0627417313425164, 1,          1
##FIRST=     8223.62146879497, -995,         -56511
##LAST=      0,             931,             -56834
##MIN=       0,             -11289,          0
##MAX=       8223.62146879497, 439878004,    0
$$ Real data points
##PAGE= N=1
##DATA TABLE= (X++(R..R)), XYDATA
$$ [...]
63941A544160J59322J74491J88088J99826K09285K16400K21308K23435K21260
63932C357575K13325J99173J79304J54752J26852R6950O5881L3869J011l2249
63922D396443o5221r7130j27119j54124j76874j94118k05158k10410k11151k08433
63912B746705k02442j93243j81726j69170j56178j42694j28974j15744j03429
63903A353105r1995q1627p2686o4776n6763m8216m0194l3972k9561k6051k2972
63892G84292k0608j9188j8473j8112j7906j7671j7193j6414j5441j4332j3013
63881E95941j1335r200o720m259k069R9K677N480P804R469J1222J3636J6159J7798
63867F46702J8484J9046K0033K1189K2025K2366K2220K1652K0817J9799J8362
$$ plain form
63941 1544160 1703482 1877973 2066061 2265887 2475172 2691572 2912880 3136315 3357575
63932 3357575 3570900 3770073 3949377 4104129 4230981 4327931 4393812 4427681 4428692 4396443
63922 4396443 4331222 4234092 4106973 3952849 3775975 3581857 3376699 3166289 2955138 2746705
63912 2746705 2544263 2351020 2169294 2000124 1843946 1701252 1572278 1456534 1353105
63903 1353105 1261110 1179483 1106797 1042021 985258 937042 896848 862876 833315 807264 784292
63892 784292 763684 744496 726023 707911 690005 672334 655141 638727 623286 608954 595941
63881 595941 584606 575406 568686 564427 562358 562457 565134 570614 578418 587887 599109 612745 628904 646702
63867 646702 665186 684232 704265 725454 747479 769845 792065 813717 834534 854333 872695
63856H72695J6236J3631J0991Q281N049J316k167m921p394j0188j3028j5176j6667
63843H58658j8357k0708k3068k4615k5409k6097k6897k7424k7475k7345k7253
63832E84010k6985k6316k5349k4125k2385k0094j7898j6514j5912j5554j5067
63821C57811j4207j2524r991p673o817p144p132o132n150n101n425n210m649m412
63807B56244m281l552k341j388q53l91j68o88j674k206k051j884k072k204k062
63792B28429k000k094j861j271j021j367j555j077n55o13p72l90Pn13j649k208
63776B09490j880j519j593j522q27%K91J56J04K33K78J39p5l19n20m38J6M34K20
63757B02668o73j558j671r14J15P84J060J367J856K089J598O00j73k74J03N60
$$ plain form
63856 872695 888931 902562 913553 921834 926883 928199 926032 921111 913717 903529 890501 875325 858658
63843 858658 840301 819593 796525 771910 746501 720404 693507 666083 638608 611263 584010
63832 584010 557025 530709 505360 481235 458850 438756 420858 404344 388432 372878 357811
63821 357811 343604 331080 321089 313416 306599 299455 292323 286191 281041 275940 270515 265305 260656 256244
63807 256244 251963 248411 246070 244682 243829 243438 243270 242582 240908 238702 236651 234767 232695 230491 228429
63792 228429 226429 224335 222474 221203 220182 218815 217260 216183 215628 215015 214243 213853 213860 213347 211698 209490
63776 209490 207610 206091 204498 202976 202149 202149 202440 202596 202700 202933 203211 203350 203275 202956 202436 201998 202014 202448 202668
63757 202668 201995 200437 198766 197852 197967 198751 199811 201178 203034 205123 206721 207321 207148 206874 206977 207537
63741B07537R94J509K131K667K812K406J739J467J939K684L028L017L264L810
63727B41004L863K977J830J323J491J894K612L945N397N919N289M349L690K981
63713B88564J965J240J273J323K91j631l120l494l467l930m693m926m249k978
63699B62168j620n45J8J32J70M41Q74J279J699K289K976L539L855L837L320K415
63683B86847J793K093L020L527L032K061J448J236P92j91j189j450q43lL64K48
63667C02785L30J129K281K856K410J460P67M14j47j254k603l683m351m765m983
63652B92646m928m697m531m403l890k803j653j130j222j285r90o76n49k08O83
63637B60364J660K024J882K037K889M016M825N137N099M959N054N618O448P164
$$ plain form
63741 207537 208531 210040 212171 214838 217650 220056 221795 223262 225201 227885 230913 233930 237194 241004
63727 241004 244867 247844 249674 250997 252488 254382 256994 260939 266336 272255 277544 281893 285583 288564
63713 288564 290529 291769 293042 294365 294656 293025 289905 286411 282944 279014 274321 269395 265146 262168
63699 262168 260548 260003 260021 260153 260323 260764 261638 262917 264616 266905 269881 273420 277275 281112 284432 286847
63683 286847 288640 290733 293753 297280 300312 302373 303821 305057 305849 305658 304469 303019 302176 302173 302537 302785
63667 302785 303115 304244 306525 309381 311791 313251 314018 314432 314285 313031 310428 306745 302394 297629 292646
63652 292646 287718 283021 278490 274087 270197 267394 265741 264611 263389 262104 261114 260438 259889 259681 260364
63637 260364 262024 264048 265930 267967 270856 274872 279697 284834 289933 294892 299946 305564 312012 319176
63623C19176P722Q357R052R552R891J0378J0966J1361J1812J3080J5275J7505
63611D54127J9138K0718K2986K5657K7943K9845L1990L4366L6121L6596L5705
63600G75192L3254K8690K1933J3932O117l99m988p445q145p962p682p612p853
63587H27032q683j0456j3285j6967k1079k4977k7858k9083k8551k6797k4662k2717
63575E71917k0950j9044j6941j4911j3067j1146q965o675m344j770R56L122M262
63562D62444M989O277Q095R531J0188J0569J0993J1044J0526J0242J1250J3663
63550E79811J6681J9564K2233K5130K8775L3347L8505M3643M8082N0700M9659
63539I56130M3437L2483J9289O581m065j1852j6102j6822j5294j3138j1049r054
$$ plain form
63623 319176 326898 335255 344307 353859 363750 374128 385094 396455 408267 421347 436622 454127
63611 454127 473265 493983 516969 542626 570569 600414 632404 666770 702891 739487 775192
63600 775192 808446 837136 859069 873001 879118 878719 873731 866286 858141 850179 842497 834885 827032
63587 827032 818349 807893 794608 777641 756562 731585 703727 674644 646093 619296 594634 571917
63575 571917 550967 531923 514982 500071 487004 475858 466893 460218 455874 454104 455060 458182 462444
63562 462444 467433 473710 481805 491336 501524 512093 523086 534130 544656 554898 566148 579811
63550 579811 596492 616056 638289 663419 692194 725541 764046 807689 855771 906471 956130
63539 956130 999567 1032050 1051339 1057920 1053855 1042003 1025901 1009079 993785 980647 969598 960544
63527I60544p653p846j0015j3537j7610k1920k6397l0762l4534l7172l8224l7656
63515F77218l6041l4077l1927k9324k6242k3076k0157j7543j5337j3755j2730
63504D17009j1798j0583r145p758o576n618m901m428m213m306m602m643l935k572
63490C31931j271o52n80l97L58J442K093J733O72J3N54J934L113L699M250N237
63474C54129O244O485N741M367K699Q70q94k317l368m214m830n002m774m505m377
63459C46254m171l713l217k923k622j979j172o94n45r9J005K330L270L868M548
63444C40140N327N867O159O652P587Q736R917J1354J3326J5816J8790K2423K6731
63431D98825L1037L4106L4731L2284K7048K0262J3578Q222M683L086L439N421
$$ plain form
63527 960544 952891 945045 935030 921493 903883 881963 855566 824804 790270 753098 714874 677218
63515 677218 641177 607100 575173 545849 519607 496531 476374 458831 443494 429739 417009
63504 417009 405211 394628 385483 377725 371149 365531 360630 356202 351989 347683 343081 338438 334503 331931
63490 331931 330660 330008 329428 329031 329389 330831 332924 334657 335329 335342 335896 337830 340943 344642 348892 354129
63474 354129 360373 366858 372599 376966 379665 380535 379641 377324 373956 369742 364912 359910 355136 350631 346254
63459 346254 342083 338370 335153 332230 329608 327629 326457 325763 325218 325119 326124 328454 331724 335592 340140
63444 340140 345467 351334 357493 364145 371732 380468 390385 401739 415065 430881 449671 472094 498825
63431 498825 529862 563968 598699 630983 658031 678293 691871 700093 704776 707862 711301 716722
63419G16722Q494J2450J7473K3363K9252L4455L9074M3203M5948M5892M2411L6012
63407A094749K7650J8320R104Q96n921j1134j4270j5133j4575j3991j4067j4710
63395A046918j6080j8785k2915k7646l2118l5958l8770l9923l9305l7652l5636
63384G02130l3198l0178k6967k3978k1046j7936j4996j2602j0378p722m882k738
63372D95509j535n14J102L320N651P692R339J0744J2283J4267J6651J9134K1579
63359F15222K4057K6617K9230L1998L5097L8440M1560M3851M4856M4414M2572
63348A017914L9256L3997K6356J6869P181j070p298j1643j4077j4608j4090j3904
63336A064883j4662j5865j7128j9039k2403k6951l1402l4658l6526l7377l7355
$$ plain form
63419 716722 725216 737666 755139 778502 807754 842209 881283 924486 970434 1016326 1058737 1094749
63407 1094749 1122399 1140719 1149823 1150719 1144798 1133664 1119394 1104261 1089686 1075695 1061628 1046918
63395 1046918 1030838 1012053 989138 961492 929374 893416 854646 814723 775418 737766 702130
63384 702130 668932 638754 611787 587809 566763 548827 533831 521229 510851 503129 498247 495509
63372 495509 493974 493460 494562 497882 503533 511225 520564 531308 543591 557858 574509 593643 615222
63359 615222 639279 665896 695126 727124 762221 800661 842221 886072 930928 975342 1017914
63348 1017914 1057170 1091167 1117523 1134392 1141573 1140503 1133205 1121562 1107485 1092877 1078787 1064883
63336 1064883 1050221 1034356 1017228 998189 975786 948835 917433 882775 846249 808872 771517
63325G71517l6154l3436k9475k5181k1300j7594j3137p576j962J718J789k055
63313E87154q393j4703j8889k0613k0960k0775j9827j7816j5420j3596j2245j0480
63301C93437q197o414n815n736n173m136l375l125k908k494k354k894l776m283
63287C32757m102l502k937k673k672k634k284j666j096p30m23j10p3n41j243j654
63271C04417j593j259p82j26N55R20R21J001J494K117K301J951J552J602K101
63256C17172K712L147L324L241K959K678K773L504M753O064P015P455P473P298
63242C81568P295P844Q993J0388J1722J3118J4853J6774J8314J9169J9641K0247
63230E49926K1187K2305K3330K4009K4103K3512K2448K1422K0935K1106K1616
$$ plain form
63325 771517 735363 701927 672452 647271 625971 608377 595240 587664 585702 587420 589209 587154
63313 587154 578761 564058 545169 524556 503596 482821 462994 445178 429758 416162 403917 393437
63301 393437 385240 378826 373011 367275 362102 357966 354591 351466 348558 346064 343710 340816 337040 332757
63287 332757 328655 325153 322216 319543 316871 314237 311953 310287 309191 308461 308038 307928 307855 307314 306071 304417
63271 304417 302824 301565 300783 300657 301212 302132 303053 304054 305548 307665 309966 311917 313469 315071 317172
63256 317172 319884 323031 326355 329596 332555 335233 338006 341510 346263 352327 359342 366797 374270 381568
63242 381568 388863 396707 405700 416088 427810 440928 455781 472555 490869 510038 529679 549926
63230 549926 571113 593418 616748 640757 664860 688372 710820 732242 753177 774283 795899
63219G95899K2105K2612K3373K4210K4439K3618K1984J9898J7169J3365Q570L277
63207A020519k289q090j3683j8401k2212k5694k8953l1159l1552l0279k7945k4948
63195G55314k1660j8670j6108j3189r100m237J45L335N688P806R881J1961J4297
63182G25463J7025J9761K1841K2953K3439K3905K4533K4860K4434K3600K3252
63171I75066K3605K3715K2538K0190J7688J5603J3385R976M752k046r419j6228
63159A098825k1978k7018l1769l5935l8791m0096m0353m0132l9492l8143l5923
63148G09195l3067l0044k7157k4338k1452j8751j6648j5001j3215j1174r502q520
63136D80326p625o278m938m290m052l471k610k101j888j294l25K72L68P38J703
$$ plain form
63219 795899 818004 840616 863989 888199 912638 936256 958240 978138 995307 1008672 1017242 1020519
63207 1020519 1018230 1010140 996457 978056 955844 930150 901197 870038 838486 808207 780262 755314
63195 755314 733654 714984 698876 685687 676587 672350 672495 675830 681518 689324 699205 711166 725463
63182 725463 742488 762249 784090 807043 830482 854387 878920 903780 928214 951814 975066
63171 975066 998671 1022386 1044924 1065114 1082802 1098405 1111790 1121766 1126518 1124472 1115053 1098825
63159 1098825 1076847 1049829 1018060 982125 943334 903238 862885 822753 783261 745118 709195
63148 709195 676128 646084 618927 594589 573137 554386 537738 522737 509522 498348 488846 480326
63136 480326 472701 466423 461485 457195 453143 449672 447062 444961 443073 441779 441454 441726 442094 442832 444535
63121D44535K534K757K989L809M631M613M049L916M411M754M409L679L137K933
63107D97156K842K623K251J957J972K180K243K116K026J872J162l4p05n5J292
63092E20898J958J466N84R4j02m75j045j358j014o6R79J490J271Q58J031K022
63076E28591L316M255M638M721M909N545O750Q260R503J0115J0422J1227J2919
63063F25171J4963J6470J7268J8050J9376K1047K2733K4743K7574L0992L4267
63052H72654L7290M0683M4688M8625N1668N3600N4595N4849N4727N4691N4733
63041A422803N4432N3836N3694N4392N5292N5646N5568N5533N5441N4881N3752
63030B025270N1851M8209M1772L2589K1585R438l564j6770k9243m0623n1050o0150
$$ plain form
63121 444535 447069 449826 452815 456624 461255 465868 469917 473833 478244 482998 487407 491086 494223 497156
63107 497156 499998 502621 504872 506829 508801 510981 513224 515340 517366 519238 520400 520366 519661 519606 520898
63092 520898 522856 524322 524906 525000 524898 524423 523378 522020 521006 520940 521919 523409 524680 525538 526569 528591
63076 528591 531907 536162 540800 545521 550430 555975 562725 570985 580488 590603 601025 612252 625171
63063 625171 640134 656604 673872 691922 711298 732345 755078 779821 807395 838387 872654
63052 872654 909944 950627 995315 1043940 1095608 1149208 1203803 1258652 1313379 1368070 1422803
63041 1422803 1477235 1531071 1584765 1639157 1694449 1750095 1805663 1861196 1916637 1971518 2025270
63030 2025270 2077121 2125330 2167102 2199691 2221276 2230714 2227150 2210380 2181137 2140514 2089464 2029314
63018B029314o6896p0710p1937p1103o8420o4290n9446n4132m7707l9629l0417
63007A384627k1268j2992n635J205Q024J5022K1787K7569L2079L5701L8771M1056
62995A565946M2273M2686M2849M3033M3218M3412M3525M3203M2117M0316L7946
62984B030524L4729K9981K3143J4206L734p359j8286k8890l9468m9989n9666o7548
62972A865111p3257p6921p8679p8669p7245p4765p1151o6133o0006n3788m8418
62961A106079m4029m0145l6443l3034l0080k7435k4913k2778k1586k1388k1359
62950G82889k0597j9114j7697j6877j6518j6331j6233j6017j5300j4126j3121
62939F00958j2618j2102j0992r597q643q150p510o570n872n715n623n071m199
$$ plain form
63018 2029314 1962418 1891708 1819771 1748668 1680248 1615958 1556512 1502380 1454673 1415044 1384627
63007 1384627 1363359 1350367 1344732 1345937 1353961 1368983 1390770 1418339 1450418 1486119 1524890 1565946
62995 1565946 1608219 1650905 1693754 1736787 1780005 1823417 1866942 1910145 1952262 1992578 2030524
62984 2030524 2065253 2095234 2118377 2132583 2136317 2128958 2110672 2081782 2042314 1992325 1932659 1865111
62972 1865111 1791854 1714933 1636254 1557585 1480340 1405575 1334424 1268291 1208285 1154497 1106079
62961 1106079 1062050 1021905 985462 952428 922348 894913 870000 847222 825636 804248 782889
62950 782889 762292 743178 725481 708604 692086 675755 659522 643505 628205 614079 600958
62939 600958 588340 576238 565246 555649 547006 538856 531346 524776 518904 513189 507566 502495 498296
62926D98296l452k915k407j995j912k060j912j090J00Q46N95l58j122j138p56
62911D78720p60j435k284k668k466k088k026k439l008l228l009k848l131l431
62897D43899l028k047j416j508j597j033k84q3j33L91J379J859J515J052Q73M44
62881D40283m86j088o26K43L99l8K5Q95J731J906J705J361M91j007k277k461j803
62864D39253j190j006j053j259j644j847j380l83N02R66J220J306R74L25l7J83
62848D34930N08M00K6l2M30J133J736J985J632O59m64j107j138j054j337j895
62832D36412k206j929j188l52L31P69P91K40o15r66k46J084J929J801J303J227
62816D38385J648K152K629L296M155M880N289N496N563N397N091N031N429N967
$$ plain form
62926 498296 494844 491929 489522 487527 485615 483555 481643 480553 480653 481499 482094 481736 480614 479476 478720
62911 478720 477960 476525 474241 471573 469107 467019 464993 462554 459546 456318 453309 450461 447330 443899
62897 443899 440871 438824 437408 435900 434303 433270 432986 432903 432770 433161 434540 436399 437914 438966 439839 440283
62881 440283 439797 438709 438083 438326 438725 438687 438712 439607 441338 443244 444949 446310 446801 445794 443517 441056 439253
62864 439253 438063 437057 436004 434745 433101 431254 429874 429491 429993 430959 432179 433485 434459 434784 434747 434930
62848 434930 435438 435838 435864 435832 436262 437395 439131 441116 442748 443407 442943 441836 440698 439644 438307 436412
62832 436412 434206 432277 431089 430737 431068 431837 432628 432868 432253 431287 431041 432125 434054 435855 437158 438385
62816 438385 440033 442185 444814 448110 452265 457145 462434 467930 473493 478890 483981 489012 494441 500408
62802E00408O195O175O430P289Q479R513J0269J1071J2183J3390J4243J4704J5396
62789F35745J7046J9638K2382K4717K7195L0965L6325M2271M7798N3183N9359
62778A016624O6299P2900P8608Q4099Q9795R4516R6576R5740R3005Q8600Q1368
62767A958130P0417N6447M0877K4489P550r373k5485m0344n3683o4907p3402p9243
62755A811473q3044q5186q5721q4907q3222q0766p7217p2530o7250o1975n6881
62744I72774n1980m7457m3454l9824l6315l2857k9497k6194k2848j9465j6222
62733F06661j3432j1395j0155r399q750q155p690p108n909l983j838n3J216K132
62719E22142K879L706M842O174P264P980Q843J0406J2602J5041J7707K0809K4075
$$ plain form
62802 500408 506603 512778 519208 526497 534976 544489 554758 565829 578012 591402 605645 620349 635745
62789 635745 652791 672429 694811 719528 746723 777688 814013 856284 904082 957265 1016624
62778 1016624 1082923 1155823 1234431 1318530 1408325 1502841 1599417 1695157 1788162 1876762 1958130
62767 1958130 2028547 2084994 2125871 2150360 2157910 2148537 2123052 2082708 2029025 1964118 1890716 1811473
62755 1811473 1728429 1643243 1557522 1472615 1389393 1308627 1231410 1158880 1091630 1029655 972774
62744 972774 920794 873337 829883 790059 753744 720887 691390 665196 642348 622883 606661
62733 606661 593229 581834 571679 562280 553530 545375 537685 530577 524668 520685 518847 518794 520010 522142
62719 522142 525021 528727 533569 539743 547007 554987 563830 574236 586838 601879 619586 640395 664470
62706F64470K6829K8961L1292L4739L9429M4893N0763N6926O3199O9273P4960
62695A185734Q0230Q4947Q8833R1680R3367R3615R1837Q7364P9744O8893N5160
62684B101404L9308K2219M511j3450l1062m7276o1118p2347q1297q8069r2252
62673A680571r3579r2611r0446q7737q4248p9398p3154o6284n9794n4223m9475
62662H49622m5212m1242l7475l3729k9886k6200k3192k1056j9388j7659j5748
62651E38835j3845j2085j0593r698r615r863r530q302o886o133o008n795n102
62638D25380m259l790l783l801l233j741K62J718J833R48J18j72m19j051j628
62623D06382j477p43j75p6j08N6M10J021K055L268M008M012L789L914M404N087
$$ plain form
62706 664470 691299 720260 751552 786291 825720 870613 921376 978302 1041501 1110774 1185734
62695 1185734 1265964 1350911 1439744 1531424 1624791 1718406 1810243 1897607 1977351 2046244 2101404
62684 2101404 2140712 2162931 2167442 2153992 2122930 2075654 2014536 1942189 1860892 1772823 1680571
62673 1680571 1586992 1494381 1403935 1316198 1231950 1152552 1079398 1013114 953320 899097 849622
62662 849622 804410 763168 725693 691964 662078 635878 612686 591630 572242 554583 538835
62651 538835 524990 512905 502312 492614 482999 473136 463606 455304 448418 442285 436277 430482 425380
62638 425380 421121 417331 413548 409747 406514 404773 405035 406753 408586 409534 409652 409480 409061 408010 406382
62623 406382 404905 404162 403987 403911 403803 403859 404269 405290 407345 410613 414621 418633 422422 426336 430740 435827
62607D35827O078P448Q804R702J0323J1217J2591J4301J6357J8847K1468K3803
62595E96766K6059K8970L2784L6820M0243M2811M4678M5802M5847M4473M1503
62584A026756L6992L1170K4220J6179P289j779j0390j8442k5870l1942l5899l8217
62572I80067m0180m2026m2612m1306l9082l6968l4544l1102k7444k5099k4152
62561E95552k3237k1532j9460j7413j5133j2663j0725r496q121o036m067l384
62549D44285l903m482m305l534k691k008j342n23L12P42O89Q35J833L143L448
62534D32499K390J120P40R85J075J128J890L454N116O378P473Q915J0985J3510
62520D97658J5900J7703J9403K2167K6355L0879L4586L7681M0989M4457M7454
$$ plain form
62607 435827 441905 449353 458157 467859 478182 489399 501990 516291 532648 551495 572963 596766
62595 596766 622825 651795 684579 721399 761642 804453 849131 894933 940780 985253 1026756
62584 1026756 1063748 1094918 1119138 1135317 1142606 1140827 1130437 1111995 1086125 1054183 1018284 980067
62572 980067 939887 897861 855249 813943 774861 737893 703349 672247 644803 619704 595552
62561 595552 572315 550783 531323 513910 498777 486114 475389 465893 457772 451736 447669 444285
62549 444285 440382 435900 431595 428061 425370 423362 422020 421497 421809 422551 423240 424075 425908 429051 432499
62534 432499 434889 436009 436749 437734 438809 439937 441827 445281 450397 456775 464248 473163 484148 497658
62520 497658 513558 531261 550664 572831 599186 630065 664651 702332 743321 787778 835232
62509H35232N0060N2767N4972N5110N2529M8093M2708L6289K8583J9998J1020
62498A287361J723p590j6001k2858k8314l2463l4655l4476l2674l0291k7377k3401
62486I98984j8519j3438q311k698L441R499J5073K0230K4930K8844L1946L4677
62474A124658L7167L8644L7921L4296K8094K0543J3037O129p32q319j6680k5361
62462A289397l4074m2440m9369n3607n5073n4997n4502n3603n1683m8419m3971
62451G47659l8844l3833k9599k6029k2419j8492j4782j1790r322o954m715k856
62439E28024j317J70J692L193M604N705O096N636M673L604K464J056q15l377o561
62424E54847r451j0796j0508j0028j0541j1381j1053r407p768p108p063o911o622
$$ plain form
62509 835232 885292 938059 993031 1048141 1100670 1148763 1191471 1227760 1256343 1276341 1287361
62498 1287361 1289084 1281494 1265493 1242635 1214321 1181858 1147203 1112727 1080053 1049762 1022385 998984
62486 998984 980465 967027 958716 956018 959459 968958 984031 1004261 1029191 1058035 1089981 1124658
62474 1124658 1161825 1200469 1238390 1272686 1300780 1321323 1334360 1340489 1339757 1331438 1314758 1289397
62462 1289397 1255323 1212883 1163514 1109907 1054834 999837 945335 891732 840049 791630 747659
62451 747659 708815 674982 645383 619354 596935 578443 563661 551871 542549 535595 530880 528024
62439 528024 526707 526877 528569 531762 536366 542071 548167 553803 558476 562080 564544 565600 564785 561408 554847
62424 554847 545396 534600 524092 514064 503523 492142 481089 471682 463914 456806 449743 442832 436210
62411D36210o508o500o238n583m716l905l334l027k824k577k305k048j731j393
62397C83521j278j369j129j67J053J764K011K469L247L658L267K482J878J567
62383D02974J530J894K563L095L297L552M148M864N465O171P153Q131Q830R458
62369D73125J0279J1173J2064J3325J5109J6773J7696J8379J9969K2867K6553
62358F57312L0721L5647M1289M6867N1719N6044O0338O4403O7252O7772O5224
62347A244588N9420N0797M0292K8991J7837P643j105q586j5589k2720k9758l6007
62335A335803m1109m5226m8392n0110m9850m7778m4687m1278l7714l3831k9532
62324H66296k4900k0327j6607j4574j4294j4886j5514j6238j7440j8785j9512
$$ plain form
62411 436210 429702 423202 416964 411381 406665 402760 399426 396399 393575 390998 388693 386645 384914 383521
62397 383521 382243 380874 379745 379578 380631 382395 384406 386875 390122 393780 397047 399529 401407 402974
62383 402974 404504 406398 408961 412056 415353 418905 423053 427917 433382 439553 446706 454837 463667 473125
62369 473125 483404 494577 506641 519966 535075 551848 569544 587923 607892 630759 657312
62358 657312 688033 723680 764969 811836 863555 919599 979937 1044340 1111592 1179364 1244588
62347 1244588 1304008 1354805 1395097 1424088 1441925 1449568 1448463 1439877 1424288 1401568 1371810 1335803
62335 1335803 1294694 1249468 1201076 1150966 1101116 1053338 1008651 967373 929659 895828 866296
62324 866296 841396 821069 804462 789888 775594 760708 745194 728956 711516 692731 673219
62313F73219j9556j9527j9514j8891j7524j6215j5404j4369j2455j0305q946q266
62301D92247p459o458n796n304m251k762j901k064k404k178j680j356r24n0R33
62286D48593J605K177K866L213K808K280K623L741M556M535M260M412M878N223
62272D97770N442N882O656P501Q100Q433Q842R827J1590J3837J6162J8562K1350
62259F39954K4623K8193L2083L6748M2489M8899N5112O0554O5176O8919P1213
62248A173963P1069O7691O0975N1569M0532K8954J7700P327j908j0088j7691k5425
62236A464668l3738m2326n0185n6295o0176o1782o1171n8664n5123n1523m8016
62225H85669m3882l8659l3006k8018k4011k0443j6907j3634j0949q768o948n663
$$ plain form
62313 673219 653663 634136 614622 595731 578207 561992 546588 532219 519764 509459 500513 492247
62301 492247 484788 478330 472534 467230 462979 460217 458316 456252 453848 451670 449990 448634 447710 447660 448593
62286 448593 450198 452375 455241 458454 461262 463542 466165 469906 474462 478997 483257 487669 492547 497770
62272 497770 503212 509094 515750 523251 531351 539784 548626 558453 570043 583880 600042 618604 639954
62259 639954 664577 692770 724853 761601 804090 852989 908101 968655 1033831 1102750 1173963
62248 1173963 1245032 1312723 1373698 1425267 1465799 1494753 1512453 1519780 1517872 1507784 1490093 1464668
62236 1464668 1430930 1388604 1338419 1282124 1221948 1160166 1098995 1040331 985208 933685 885669
62225 885669 841787 803128 770122 742104 718093 697650 680743 667109 656160 647392 640444 634781
62213F34781n090m934m714m469m697n547o472o855o727o599o827p311p678p562
62199E49299o811n720m901m627m359l302j428M38J669K551L726N294O749P602
62185E46180P820P832Q247R365J0725J1410J1087J0391R992R692Q886P630O568
62172F65825N997N752O065P715J1044J5360J9686K3731K7848L2425L7556M2973
62160I01977M7926N1365N2521N1122M7086M0423L1749K2402J3568N568j679p933
62148A256095j2966j7328k2005k7155l1836l5199l7450l9283m0684m0738l8634
62137I12817l4599k9807k5490k2140j9336j6236j2315p866l874j345n36p89j058
62124G37426o61M32J750K724L185L660M884O681P644O463L468K97j879l127l741
$$ plain form
62213 634781 629691 624757 620043 615574 610877 605330 598858 592003 585276 578677 571850 564539 556861 549299
62199 549299 542488 536768 531867 527240 522881 519579 518151 518589 520258 522809 526535 531829 538578 546180
62185 546180 554000 561832 570079 579444 590169 601579 612666 623057 633049 642741 651627 659257 665825
62172 665825 671822 677574 683639 691354 702398 717758 737444 761175 789023 821448 859004 901977
62160 901977 949903 1001268 1053789 1104911 1151997 1192420 1224169 1246571 1260139 1265707 1264028 1256095
62148 1256095 1243129 1225801 1203796 1176641 1144805 1109606 1072156 1032873 992189 951451 912817
62137 912817 878218 848411 822921 800781 781445 765209 752894 745028 741154 739809 739273 738484 737426
62124 737426 736765 737197 738947 741671 744856 748516 753400 760081 767725 774188 777656 777953 776074 772947 769206
62109G69206l434k123p85p37k306m801p524j0079j1893j2285j1162r116o663l921
62095F82377j107J182K627L635M760N904O520O499O386O750P592Q469Q992R058
62081G59644Q837Q734R304J0909J3307J5728J7549J8824K0017K1303K2397K3013
62069I49566K3135K2763K1820K0588J9937K0675K2697K5101K7135K8779L0353
62058A212549L1779L2381L1298K8111K3132J7169J0982M966p41o078j1152j6275
62046A358121k1674k7179l2359l7015m1276m5141m8115m9543m9355m8242m6956
62035I11266m5490m3293m0271l7119l4423l1802k8533k4725k1273j8698j6721
62024E68918j5015j3610j2358j0790q955p695p517p776p587p019o662o507o054
$$ plain form
62109 769206 765772 763649 762864 762127 759821 755020 747496 737417 725524 713239 702077 692961 686298 682377
62095 682377 681270 682452 685079 688714 693474 699378 705898 712397 718783 725533 733125 741594 750586 759644
62081 759644 768481 777215 786519 797428 810735 826463 844012 862836 882853 904156 926553 949566
62069 949566 972701 995464 1017284 1037872 1057809 1078484 1101181 1126282 1153417 1182196 1212549
62058 1212549 1244328 1276709 1308007 1336118 1359250 1376419 1387401 1392367 1391626 1385548 1374396 1358121
62046 1358121 1336447 1309268 1276909 1239894 1198618 1153477 1105362 1055819 1006464 958222 911266
62035 911266 865776 822483 782212 745093 710670 678868 650335 625610 604337 585639 568918
62024 568918 553903 540293 527935 517145 508190 500495 492978 485202 477615 470596 463934 457427 451373
62011D51373n287m562l774k520j039q9K77Q86K186L610M570N263O025O516O227
61996D69662N360M657M508M711M825M453L398J922O49j75j073k684m897p051q746
61981D79519r970j0603j0413r592q776q305p829o904n634m511l813l475l414l613
61967C82667l881l826l272k500j875j394q01r9L90M75L97N24R79J634K260K528
61951C74206K143J300P51J156K406L840M981N745O164O340O660P620R237J0984
61937D43533J2348J3232J3733J3830J3495J2843J2112J1496J1041J0567R739Q496
61925E86465P290O559O032M936K958N72j689l799n836p421q003p517o418n166
61911E68963l855k302k87K194M814P151R102J0936J2772J4216J4677J3931J2256
$$ plain form
62011 451373 446086 441524 437750 435230 434191 434102 434379 435265 437451 441061 445631 450894 456919 463435 469662
61996 469662 475022 479679 484187 488898 493723 498176 501574 503496 504145 503970 502897 500213 495316 488265 479519
61981 479519 469549 458946 448533 438941 430165 421860 414031 407127 401493 396982 393169 389694 386280 382667
61967 382667 378786 374960 371688 369188 367313 365919 365118 365019 365409 365884 366281 366805 367784 369418 371678 374206
61951 374206 376349 377649 378400 379556 381962 385802 390783 396528 402692 409032 415692 423312 432549 443533
61937 443533 455881 469113 482846 496676 510171 523014 535126 546622 557663 568230 577969 586465
61925 586465 593755 600314 606346 611282 614240 614812 613123 609324 603488 596067 588064 580547 574129 568963
61911 568963 565108 562806 562519 564713 569527 576678 585780 596716 609488 623704 638381 652312 664568
61898F64568J0098P729N108J980j692n392q294r937j0520j0503j0170r717r403
61885F13855r377r499r501r211q541p496o426n984o538p673q555q802q711q644
61871D98897q412p514n861m075k828k098j305j96Q76J717K715M068N107N185M940
61856D91216N683P567R409J0536J1718J3753J6111J7873J9198K0788K2400K3056
61844F69308K2598K1966K1750K1394K0049J7494J3962R780N488J736j365m397
61832H19763p723j0806j2743j3116j2027r670o429l064j68K482N495Q723J1068
61819G71785J1683J0891R596Q037N622J969k466o963j1374j5920k0328k3677k5239
61806G13616k5192k4249k2879k1137j9110j7179j5672j4454j3066j1304r587q604
$$ plain form
61898 664568 674666 682395 687503 689483 687791 682399 674105 664168 653648 643145 632975 623258 613855
61885 613855 604478 594979 585478 576267 567726 560230 553804 547820 541282 533609 525054 516252 507541 498897
61871 498897 490485 482971 477110 473035 470207 468109 466804 466608 467484 469201 471916 475984 481091 486276 491216
61856 491216 496899 504466 513875 524411 536129 549882 565993 583866 603064 623852 646252 669308
61844 669308 691906 713872 735622 757016 777065 794559 808521 818301 823789 825525 824160 819763
61832 819763 812040 801234 788491 775375 763348 753678 747249 744185 744017 746499 751994 760717 771785
61819 771785 783468 794359 803955 811992 817614 819583 817117 810154 798780 782860 762532 738855 713616
61806 713616 688424 664175 641296 620159 601049 583870 568198 553744 540678 529374 519787 511183
61794E11183q509q585p985o690n538n170n281n069m220l190k592k573k837l042
61780D39902l115l105k920k350j446o85n41r77j569j985k080j685q27o7q0p00
61764D15770r87m23M84J095J487J920K029J316J56m75k08M47J025J621K300K617
61748D30174K095Q68l94j100j136q57p70j098j612j941j938j647j120m98p9j5
61732D18932n6L0jm21q46n53M58J301J316Q44O91J112J647J731J242O45O10J360
61714D30042K315K662K241J610J222R60N33o3p57j609k588l357l582l259k574
61699D23796j720j020r07j500k365k942l043k821k484k252k322k610k807k872
61685C92131l190l919m499m256l254k192j576j482j907k696l234k853j817j226
$$ plain form
61794 511183 502674 494089 486104 479414 473876 468706 463425 458356 454136 450946 448354 445781 442944 439902
61780 439902 436787 433682 430762 428412 426966 426281 425740 424763 423194 421209 419129 417444 416617 416550 416470 415770
61764 415770 414783 414360 414844 415939 417426 419346 421375 422691 422847 422372 422164 422611 423636 425257 427557 430174
61748 430174 432269 433137 432743 431643 430507 429650 428880 427782 426170 424229 422291 420644 419524 419026 418947 418932
61732 418932 418876 418906 418905 418484 417638 417085 417543 418844 420160 421004 421695 422807 424454 426185 427427 428072 428682 430042
61714 430042 432357 435019 437260 438870 440092 441052 441585 441522 440765 439156 436568 433211 429629 426370 423796
61699 423796 422076 421056 420149 418649 416284 413342 410299 407478 404994 402742 400420 397810 395003 392131
61685 392131 388941 385022 380523 376267 373013 370821 369245 367763 365856 363160 359926 357073 355256 354030
61671C54030j638k288k121j207m79l88m88l23l9R8J65K24J4n23p80j43J043J813
61653C46970J904J996K550L055K864K184J708J604J505J331J395J743J994J939
61639C74742J816J799J717J525J593K112K464J744q5j940k738k569k498l168l933
61624C72581l686k445j531j967l220m010l962l705l537k952j685m62r5m08o24
61609C38292n11n78j291k551l892m833n029m489l657l026k659k262j656j019p18
61594C00121j058k035l108l475k919k237k362l144l504k825j670q78n19j41L10
61579B70556M24N4m09o58q77j321j774j787j315p51l65p7J31m1p30j422j358m12
61561B57868P52J422J487J213Q17M67M66R64J553J514O54l05l86O15J932K637
$$ plain form
61671 354030 352392 350104 347983 346776 346297 345909 345421 345098 345059 345157 345322 345546 345560 345037 344257 344114 345157 346970
61653 346970 348874 350870 353420 356475 359339 361523 363231 364835 366340 367671 369066 370809 372803 374742
61639 374742 376558 378357 380074 381599 383192 385304 387768 389512 389427 387487 384749 382180 379682 376514 372581
61624 372581 368895 366450 364919 362952 359732 355722 351760 348055 344518 341566 339881 339419 339324 338916 338292
61609 338292 337781 337203 335912 333361 329469 324636 319607 315118 311461 308435 305776 303514 301858 300839 300121
61594 300121 299063 297028 293920 290445 287526 285289 282927 279783 276279 273454 271784 270906 270387 270246 270556
61579 270556 270980 271034 270625 269967 269090 267769 265995 264208 262893 262142 261777 261700 261831 261790 261060 259638 258280 257868
61561 257868 258620 260042 261529 262742 263559 264026 264492 265456 267009 268523 269177 268872 268486 269101 271033 273670
61545B73670K458J798J105N62K77L66O65P05K77j81k14o6k56n31j7J377K450K149
61527B86594R85L19N51Q03L21n56j085j111r93r15p45m46j99j77l59o05p42o47
61509B80993l69j37j37l29n49p15p85n86K9Q78J453J380P66L2n05p96q71o95k43
61490B78814L58Q28R31O84L41K18M12O96P01K21m83p67j19J259K527L033K996
61473B92650L089L416L255K068L70p64r15o33n36n74l32K20N93L48m49j238j443
61456B99125r92m15k98o08p37k82M54Q33O15J48p3Q6K63K4n00n18M90J888K444
61437C01947J937J492K010K912L059K413J856J737J575J178J076J525J919J714
61423C28350J298J373J929K386K401K037J386O25K78P68J717K184J778J001L99
$$ plain form
61545 273670 276128 277926 279031 279593 279870 280236 280901 281606 281883 281702 281488 281422 281166 280635 280618 281995 284445 286594
61527 286594 287579 287898 288449 289252 289573 289017 287932 286821 285828 284913 284168 283722 283523 283346 282987 282382 281640 280993
61509 280993 280624 280487 280350 280021 279472 278757 277972 277386 277415 278293 279746 281126 281892 281924 281419 280623 279752 279057 278814
61490 278814 279172 280000 280931 281615 281956 282174 282586 283282 283983 284204 283721 282954 282835 284094 286621 289654 292650
61473 292650 295739 299155 302410 304478 304848 304084 303169 302536 302000 301426 301094 301314 301907 302255 301806 300568 299125
61456 299125 298133 297718 297420 296812 296075 295793 296247 297080 297695 297843 297770 297856 298119 298143 297643 297125 297615 299503 301947
61437 301947 303884 305376 307386 310298 313357 315770 317626 319363 320938 322116 323192 324717 326636 328350
61423 328350 329648 331021 332950 335336 337737 339774 341160 341785 342063 342831 344548 346732 348510 349511 349910
61408C49910j22p91j286j092m06r1o07j468j960k003j982k017j896j578j327j277
61392C30007j270j188j066p99j81O03R44N07m05j333k047k262j584k39P37P04
61376C21128L99R53K289L238L128K386J678J237J147J402J561J055O6n56m18M4
61360C40737M34Q75J385J629J670K086K945L434L169L020L866N265O234O768P489
61345C91006Q177P836O252M510L731L991M646N053M805L836K654K039K250K757
61331D53543K910K577K070J685J446J107M09n80j397j657j438j074p54n65n70
61316D57712n16J84J667L086L527L241L299M127N224O300P741R657J1338J2217
61302E28804J2694J3323J3711J2970J0966Q465O083L781J366j087l399n393o701
$$ plain form
61408 349910 349788 348997 347711 346619 346213 346122 345515 344047 342087 340084 338102 336085 334189 332611 331284 330007
61392 330007 328737 327549 326483 325684 325503 326106 327050 327557 327152 325819 323772 321510 319926 319687 320424 321128
61376 321128 321527 322480 324769 328007 331135 333521 335199 336436 337583 338985 340546 341601 341667 341111 340693 340737
61360 340737 341171 342046 343431 345060 346730 348816 351761 355195 358364 361384 365250 370515 376749 383517 391006
61345 391006 399183 407019 413271 417781 421512 425503 430149 435202 440007 443843 446497 448536 450786 453543
61331 453543 456453 459030 461100 462785 464231 465338 465747 465167 463770 462113 460675 459601 458847 458282 457712
61316 457712 457196 457380 459047 462133 465660 468901 472200 476327 481551 487851 495592 505249 516587 528804
61302 528804 541498 554821 568532 581502 592468 600933 607016 610797 612163 611076 607677 602284 595583
61289E95583p003o645o620p572r037j0014j0045r433q611p791p158o856o678o078
61275D86042m803l145j489M7J276J750J362Q33R62J592J901J626J370J607K111
61260D93042K639L468M845O370P401P799P804P462O598N277L927K993K660K775
61246E65060K945K864K603K373J964R13p35k252l061l265l138k662j935j446j427
61231E58801j431j070o88o35m03P03K321L390L621L758M335N026N380N541N950
61216E94599O782P866Q786R048Q515P684P080O510N420L910K707K119J782J523
61202F74331J725K465L019K825K430K891M405O093P122P682Q702J0704J3021J4239
61188G61654J3478J1137Q282N612L246J239k71j316k055k492k611k695l053l531
$$ plain form
61289 595583 588580 581935 575315 567743 558706 548692 538647 529214 520603 512812 505654 498798 492120 486042
61275 486042 481239 478094 476605 476652 477928 479678 481040 481873 482835 484427 486328 487954 489324 490931 493042
61260 493042 495681 499149 503994 510364 517765 525564 533368 540830 547428 552705 556632 559625 562285 565060
61246 565060 568005 570869 573472 575845 577809 578722 577987 575735 572674 569409 566271 563609 561674 560228 558801
61231 558801 557370 556300 555612 554977 554574 555277 557598 560988 564609 568367 572702 577728 583108 588649 594599
61216 594599 601381 609247 618033 627081 635596 643280 650360 656870 662290 666200 668907 671026 672808 674331
61202 674331 676056 678521 681540 684365 686795 689686 694091 700184 707306 714988 723690 734394 747415 761654
61188 761654 775132 786269 794551 800163 803409 804648 804377 803061 801006 798514 795903 793208 790155 786624
61174G86624l792m029m751n921o832p024o753o490o498o980p986r028r396r115
61160F92029q961r322r696r638r496r682r820r293q254p376o845o186n036l570
61146E78854k200j191o94q08j550k773m122n127n510n460n366n305n040m477l725
61131E25506k703j207N26J783K231K305K542K951L425M313O109Q698J1363J3414
61117E81256J4668J5468J6430J7979J9981K1959K3624K4910K5511K5041K3828
61106H10655K2874K2660K2473K1443J9708J7958J6271J4120J1346Q354N286J719
61094I94867k510o686r834j1807j3391j5317j7386j8784j9152j9042j9173j9580
61082H22205j9795j9631j9324j9014j8555j7868j7027j5995j4668j3212j1883
$$ plain form
61174 786624 782832 778803 774052 768131 761299 754275 747522 741032 734534 727554 719568 710540 701144 692029
61160 692029 683068 673746 664050 654412 644916 635234 625414 616121 607867 600491 593646 587460 582424 578854
61146 578854 576654 575463 574769 573961 572411 569638 565516 560389 554879 549419 544053 538748 533708 529231 525506
61131 525506 522803 521596 522122 523905 526136 528441 530983 533934 537359 541672 547781 556479 567842 581256
61117 581256 595924 611392 627822 645801 665782 687741 711365 736275 761786 786827 810655
61106 810655 833529 856189 878662 900105 919813 937771 954042 968162 979508 987862 993148 994867
61094 994867 992357 985671 975837 964030 950639 935322 917936 899152 880000 860958 841785 822205
61082 822205 802410 782779 763455 744441 725886 708018 690991 674996 660328 647116 635233
61071F35233j0573r028p494o504o002n327m190k982j970r43J17Q14J194J998L556
61056E87899N123N913O168O602P337Q083Q881R985J1290J2516J3687J4964J6249
61043G14697J7429J8709K0298K2060K3815K5580K7272K8645K9881L1613L4007
61032I94006L6460L8633M1011M3823M6220M7289M7332M7319M7679M8370M9678
61021A487820N2087N5830O1103O8182P6632Q5144R2884J00547J09567J21337J37855
61010B448988J61853J95269K38755K93799L63860M52183N60399O91101Q49903
61001F256110J042985J274356J543936J834710K086184K185709K017576J553776
60993A9795342R05597K73911j65336l39633k71590l1419K80386N23487N42665
$$ plain form
61071 635233 624660 615632 608138 601634 595632 590305 586115 583133 581163 580220 580337 581151 582345 584343 587899
61056 587899 593022 598935 605103 611705 619042 627125 636006 645991 657281 669797 683484 698448 714697
61043 714697 732126 750835 771133 793193 817008 842588 869860 898505 928386 959999 994006
61032 994006 1030466 1069099 1110110 1153933 1200153 1247442 1294774 1342093 1389772 1438142 1487820
61021 1487820 1539907 1595737 1656840 1725022 1801654 1886798 1979682 2080229 2189796 2311133 2448988
61010 2448988 2610841 2806110 3044865 3338664 3702524 4154707 4715106 5406207 6256110
61001 6256110 7299095 8573451 10117387 11952097 14038281 16223990 18241566 19795342
60993 19795342 20700939 20974850 20809514 20469881 20198291 20166872 20447258 20970745 21513410
60984B1513410K48372l11459r66700j524435j868884j988955j938267j783556
60976A1379526j579295j363817j159817r76054q13725o73279n55268m57762l76875
60967C423634l09973k56356k14815j82544j56774j36044j19457j05811r3883q2947
60957A765030p2668o2943n3855m5437l7586l0549k5123k1946k0749k0724k1157
60946A352293k1389k0728j9151j7612j7014j7179j7394j7472j7604j7731j7858
60935A151161j8536k0136k2028k3282k3881k4384k4769k4675k4356k4340k4309
60924H96465k3547k2297k1557k1440k0947j9617j8197j7357j6787j5974j4977
60913F83768j3998j2966j1945j1210j0583r475p978o980o795o550n512m199l405
$$ plain form
60984 21513410 21761782 21450323 20483623 18959188 17090304 15101349 13163082 11379526
60976 11379526 9800231 8436414 7276597 6300543 5486818 4813539 4258271 3800509 3423634
60967 3423634 3113661 2857305 2642490 2459946 2303172 2167128 2047671 1941860 1847977 1765030
60957 1765030 1692362 1629419 1575564 1530127 1492541 1461992 1436869 1414923 1394174 1373450 1352293
60946 1352293 1330904 1310176 1291025 1273413 1256399 1239220 1221826 1204354 1186750 1169019 1151161
60935 1151161 1132625 1112489 1090461 1067179 1043298 1018914 994145 969470 945114 920774 896465
60924 896465 872918 850621 829064 807624 786677 767060 748863 731506 714719 698745 683768
60913 683768 669770 656804 644859 633649 623066 613591 605613 598633 591838 585288 579776 575577 572172
60900E72172k961k268j522j377j746j841j297n16L7K79K27j65q81j862l024m054
60884E49201m470m269m137m557n107n214n161n564o157o062n271m824n266n824
60870D77318n572m694m009l785l644l289k680j747m82P98J763K452K887K514P20
60855D58550k041m300n001m388l297k123q95Q8L45j50r46j640k131k390k371k207
60839D25103k132k233k503l109m137n134n378m760l953l511l266k852k316j779
60825C78040r76K51J318J426P01J25K40N47L97n8k01J07M23M33L23M11O45O67
60807C84819K22n08j040j067p89o90j000j460j662j539j327j251j304j381j484
60792C68539j717k178k851l577m051l982l349k524j947j677j393r66p72j180j851
$$ plain form
60900 572172 569211 566943 565421 564044 562298 560457 559160 558644 558681 558960 559187 559022 558141 556279 553255 549201
60884 549201 544731 540462 536325 531768 526661 521447 516286 510722 504565 498503 493232 488408 483142 477318
60870 477318 471746 467052 463043 459258 455614 452325 449645 447898 447416 448214 449977 452429 455316 457830 458550
60855 458550 456509 452209 447208 442820 439523 437400 436505 436593 436938 436788 435842 434202 432071 429681 427310 425103
60839 425103 422971 420738 418235 415126 410989 405855 400477 395717 391764 388253 384987 382135 379819 378040
60825 378040 377064 377315 378633 380059 380760 380885 381125 381672 382069 382011 381810 381917 382340 382773 383096 383507 384152 384819
60807 384819 385041 384533 383493 382426 381637 380947 379947 378487 376825 375286 373959 372708 371404 370023 368539
60792 368539 366822 364644 361793 358216 354165 350183 346834 344310 342363 340686 339293 338327 337555 336375 334524
60777C34524j977j291m49k78q50j563j853j567q28J32R82J485J679J769J835J832
60761C33582J799J854K007K174K344K537K636K441J969J538J480J806K131J991
60747C62289J332P80J144K486L797L930K751J120j56j056k090l616n448o933p430
60732C52900o936o166n778n656n279m583l900l210k180j047o81j355k135k037
60718C01957j299p89o56l80M6l7q43j669j839j478r95m33K42O26L19l99q06n77
60700B90990J6O26J072J168Q11L51L85R93J516J345O95L59P87J681K430K787L063
60683C11075L636M296M320L386K262K057K844L547L389K871K933L643M301M523
60669C59083M484M155L019R04j405k722k579j651j138j704k943l852l889l388
$$ plain form
60777 334524 332547 331256 330807 330529 329679 328116 326263 324696 323868 324000 324982 326467 328146 329915 331750 333582
60761 333582 335381 337235 339242 341416 343760 346297 348933 351374 353343 354881 356361 358167 360298 362289
60747 362289 363621 364401 365545 368031 371828 375758 378509 379629 379473 378417 376327 372711 367263 360330 352900
60732 352900 345964 339798 334020 328364 323085 318502 314602 311392 309212 308165 307484 306129 303994 301957
60718 301957 300658 299869 299213 298833 298879 298842 297999 296330 294491 293013 292018 291585 291827 292453 292772 292373 291567 290990
60700 290990 291006 291632 292704 293872 294683 295034 295419 296412 297928 299273 299968 300327 301114 302795 305225 308012 311075
60683 311075 314711 319007 323327 326713 328975 331032 333876 337423 340812 343683 346616 350259 354560 359083
60669 359083 363567 367722 370741 371645 370240 367518 364939 363288 362150 360446 357503 353651 349762 346374
60655C46374k835k160j106K1N52L08k69p57r58n61O53K142K840K318J183R2r39
60638C46898k006k767k939k804k710k550k166j806j656j407q94o08q92j151o77
60623C19865J39L77Q3J13N71O01p0m89J03J096J439J070P26P34P33M10j16o54
60605C26731j170j488j194j10J173J652J034K97O37J864K511J845J032J482K654
60590C38950K732J283j22j28P71J408J553J539J167J54q53q63K7P43P62O94J272
60573C51089K456L645M281M225M005M648O634R124J0833J1558J2063J2436J1647
60560D48644R143N912L244J153j103l469n114n838o373p099p297o154l863j289
60546D20497J017K970M413N175N531O187P611R670J1929J3999J5557J6368J6475
$$ plain form
60655 346374 343539 341379 340273 340294 340846 341154 340885 340128 339170 338609 339262 341404 344244 346562 347745 347837 346898
60638 346898 344892 342125 339186 336382 333672 331122 328956 327150 325494 324087 323193 322585 321693 320542 319865
60623 319865 320004 320381 320464 320577 321148 321749 321679 321190 321293 322389 323828 324898 325624 326358 327091 327501 327385 326731
60605 326731 325561 324073 322879 322769 323942 325594 326628 326925 327562 329426 331937 333782 334814 336296 338950
60590 338950 341682 342965 342843 342715 343486 344894 346447 347986 349153 349307 348454 347591 347618 348361 349123 349817 351089
60573 351089 353545 357190 361471 365696 369701 374349 380983 390107 400940 412498 424561 436997 448644
60560 448644 457787 463699 466943 468096 466993 463524 458410 452572 446199 439100 431803 425649 421786 420497
60546 420497 421514 424484 428897 434072 439603 445790 453401 463071 475000 488999 504556 520924 537399
60533E37399J6072J5060J3068J0104O839L870J027k120n204p228p784p589p507
60520E66007p621p557p224o667n637l975k292j529j736j917j308k13P24J528K669
60505E23252M166N587O834Q405J0778J3913J7477K1265K5277K9573L4090L8390
60493G39007M1594M2927M2416M0721L8198L4485K9226K2766J5758Q331J58q811
60481A046776j8038k6768l4340m0161m3777m5172m4751m2994m0375l7499l4886
60470F38015l2440k9510k5737k1671j8284j6031j4562j3264j1860j0452r203q062
60458D26939o898n771m865m154l396k684k581l315m140m119l367k832k858k799
60444C73160k161j284o19p8L40J52p76j602j530q98n23m41k31r9n43j172j031
$$ plain form
60533 537399 553471 568531 581599 591703 598542 602412 603439 601319 596115 588887 581103 573514 566007
60520 566007 558386 550829 543605 536938 531301 527326 525034 523505 521769 519852 518544 518331 519055 520583 523252
60505 523252 527418 533005 539839 548244 559022 572935 590412 611677 636954 666527 700617 739007
60493 739007 780601 823528 865944 906665 944863 979348 1008574 1031340 1047098 1055429 1055587 1046776
60481 1046776 1028738 1001970 967630 927469 883692 838520 793769 750775 710400 672901 638015
60470 638015 605575 576065 550328 528657 510373 494342 479780 466516 454656 444204 435001 426939
60458 426939 420041 414270 409405 405251 401855 399171 396590 393275 389135 385016 381649 378817 375959 373160
60444 373160 370999 369715 369096 369018 369358 369510 368734 367132 365602 364704 364181 363740 363509 363410 362867 361695 360664
60427C60664j52L91J03l14l40n08j317k168k172j368m14M43J303J932J908J325
60411C59316P80O23P11P60O23L23P2Q2J60j34o57m58J011K892L756L291K501K295
60393C77947K579K762K578K190J903J946K212K225J705J128J210J917K543K766
60379D07611K966L315L336K741K025J708J591J323J167J449J679J162K26j00L66
60364D32565P66O65O75J192J540J132O72J203K442L191L205L518M767O267P139
60349D70939P517Q026Q666Q876Q363P269N686L585J133j322l558n476o893p626
60335E05185p711p252o276m971l889l462l433l245k887k912l549m339m701m539
60321D42019m046l316k403j569j176j302j483r19Q50L308N224N905O021O840Q777
$$ plain form
60427 360664 360512 360903 361006 360692 360352 359844 358527 356359 354187 352819 352405 352848 354151 356083 357991 359316
60411 359316 360096 360719 361430 362190 362813 363136 363208 363290 363450 363316 362659 362201 363212 366104 369860 373151 375652 377947
60393 377947 380526 383288 385866 388056 389959 391905 394117 396342 398047 399175 400385 402302 404845 407611
60379 407611 410577 413892 417228 419969 421994 423702 425293 426616 427783 429232 430911 432073 432299 432199 432565
60364 432565 433331 433996 434671 435863 437403 438535 439207 440410 442852 446043 449248 452766 457533 463800 470939
60349 470939 478456 486482 495148 504024 512387 519656 525342 528927 530060 528738 525180 519704 512811 505185
60335 505185 497474 490222 483946 478975 475086 471624 468191 464946 462059 459147 455598 451259 446558 442019
60321 442019 437973 434657 432254 430685 429509 428207 426724 425805 426655 429963 435187 441092 447113 453953 462730
60306D62730J1150J3295J5338J7617J9878K1329K1258J9345J5639J0429M135k714
60294F29429r290j4446j7474j8810j9478j9709j8738j6228j3141j0675q919p231
60282D55290n530m296l483k365p37N38N92l00j130j389j411j653k172k846l648
60267D25460m355m400l439j998j081j069j384j409j276j404j692j669j316j102
60253C97866j225j304r64k48O18J458J928J621O52j99l28jJ19j23l44l49l75o03
60235C98199p72m74L35J230J742J785J669J684J800J842J772J646J404J042Q54
60220D15758J156J739J983J629J107J031J645K790M093N125N721O155O733P179
60206D63844P002O412O242O801P419P416O890O230N468M659M214M325M449M050
$$ plain form
60306 462730 473880 487175 502513 520130 540008 561337 582595 601940 617579 628008 632143 629429
60294 629429 620139 605693 588219 569409 549931 530222 511484 495256 482115 471440 462521 455290
60282 455290 449760 445464 441981 439616 438879 439417 440009 439709 438579 437190 435779 434126 431954 429108 425460
60267 425460 421105 416705 413266 411268 410187 409118 407734 406325 405049 403645 401953 400284 398968 397866
60253 397866 396641 395337 394373 394125 394743 396201 398129 399750 400402 400203 399875 399874 399993 399870 399526 399177 398802 398199
60235 398199 397427 396953 397288 398518 400260 402045 403714 405398 407198 409040 410812 412458 413862 414904 415758
60220 415758 416914 418653 420636 422265 423372 424403 426048 428838 432931 438056 443777 449932 456665 463844
60206 463844 470846 477258 483500 490301 497720 505136 512026 518256 523724 528383 532597 536922 541371 545421
60192E45421L429L176L162K784J992J305R22M98k03j101k174l444m533m830m276
60177E42128l528l238l528m190m917n254m824l857l083k884k860k467j797j481
60163D94220j896k688l077k665j873j513j846k289k172j469o19J59Q75J433J669
60148D76249J688J666J466Q90K35J30P44J647K416K970L205K940K380K180K732
60133E03538L664M374M759N114N500N566M987L817K406J160M79O81J705K897L414
60118E54061L032K417K293K591K759K751L019L544L631K934K044J588J315O25
60104E88604n03j625k486l020l131l019l259l977m389l870l018k780k993k760
60090E47774k023j561j520j127o0R21J066M91k81q56q61j43O97P35k4o20n88n28
$$ plain form
60192 545421 548850 552026 555188 557972 559964 561269 562191 562689 562486 561385 559211 555767 551234 546404 542128
60177 542128 538600 535362 531834 527644 522727 517473 512649 508792 505709 502825 499965 497498 495701 494220
60163 494220 492324 489636 486559 483894 482021 480508 478662 476373 474201 472732 472113 472272 473147 474580 476249
60148 476249 477937 479603 481069 481959 482194 482324 483068 484715 487131 490101 493306 496246 498626 500806 503538
60133 503538 507202 511576 516335 521449 526949 532515 537502 541319 543725 544885 545364 546045 547750 550647 554061
60118 554061 557093 559510 561803 564394 567153 569904 572923 576467 580098 583032 585076 586664 587979 588604
60104 588604 588101 586476 583990 580970 577839 574820 571561 567584 563195 559325 556307 553527 550534 547774
60090 547774 545751 544190 542670 541543 541483 542404 543470 543961 543680 542824 541963 541820 542517 543252 543228 542608 542020 541492
60072E41492r83j699k377l215m194m788m974n589o888p710p057n757n395o117
60058D74749o645o168n152m319l813l410k852j900o51K34K37j67m9P70J682K415
60042D44961L266M174M503M116L880M520N447N397M042K437J770K108K551K392
60028D95564J798J303Q91J6j516l078l931m079m119m490n185n999o656o729n971
60013D47819m764l998m226n087n687n480m783m343m407m356l499k079j068r13
59999C93129r94n90J48N94N84M73N11O66R09J213J407J468J761K517L251L284
59983D10331K782K586K979L265K814J872J026L07o33j739k494k642k566k756l108
59968D12024k992k093r84o07j156j732j385k40P57J089J156J435J619J088l7q00
$$ plain form
60072 541492 540509 538810 536433 533218 529024 524236 519262 513673 506785 499075 492018 486261 480866 474749
60058 474749 468104 461936 456784 452465 448652 445242 442390 440490 439839 440073 440310 440143 440094 440864 442546 444961
60042 444961 448227 452401 456904 461020 464900 469420 474867 480264 484306 486743 488513 490621 493172 495564
60028 495564 497362 498665 499556 499572 498056 494978 491047 486968 482849 478359 473174 467175 460519 453790 447819
60013 447819 443055 439057 434831 429744 424057 418577 413794 409451 405044 400688 397189 395110 394042 393129
59999 393129 392135 391545 391693 392287 392871 393344 393855 394521 395430 396643 398050 399518 401279 403796 407047 410331
59983 410331 413113 415699 418678 421943 424757 426629 427655 427962 427329 425590 423096 420454 417888 415132 412024
59968 412024 409032 406939 405955 405348 404192 402460 401075 400835 401592 402681 403837 405272 406891 407979 407942 407142
59952D07142n78O5N0q20j564j273k23O12Q23Q65J185J618J748J398O22l40r61
59935D10369p63j5L90M5m43m29j67k04k73M00J876L305L992M069M056M263M751
59918D35222N393N874N940N776N787N956N754M830L449K170J294P67L95O8j38
59903D88537j12kk19q76j467j450r53n07k60JJ39l37j367k060j645l29J194K619
59885D80906M025N245N785N445M661M166M316M853N196N016M563M395M736N128
59871E48436M760L251J084p90j838k338k787l154l102k776k781l221l422k906
59857E28416k104j549r62K09J661K554K775L117M202N865P559Q648Q325O075K504
59842E77295r35l259m387m301k734j94J628J288r53l691n987p750q898q983p799
$$ plain form
59952 407142 406564 406629 406679 405859 404295 403022 402799 403411 404234 405099 406284 407902 409650 411048 411670 411330 410369
59935 410369 409606 409591 409981 410026 409583 409154 408987 408783 408510 408910 410786 414091 418083 422152 426208 430471 435222
59918 435222 440615 446489 452429 458205 463992 469948 475702 480532 483981 486151 487445 488212 488607 488675 488537
59903 488537 488425 488423 488204 487328 485861 484411 483458 482951 482691 482692 482831 482494 481127 479067 477422 477093 478287 480906
59885 480906 484931 490176 495961 501406 506067 510233 514549 519402 524598 529614 534177 538572 543308 548436
59871 548436 553196 556447 557531 556741 554903 552565 549778 546624 543522 540746 537965 534744 531322 528416
59857 528416 526312 524763 523801 524010 525671 528225 531000 534117 538319 544184 551743 560391 568716 574791 577295
59842 577295 576360 573101 568714 564413 561679 561485 563113 564401 563448 559757 553770 546020 537122 528139 520340
59827E20340n844m011k931k582k373j751q74m70q27j309j150m11K17L61J93o9
59811D96509m01p50r39q94o71l69k10n63j446k245k287j740j430j773k311k476
59795D76004k355k414k775l080k976k487j940j640j616j626j426j047p66p87j019
59780D48050j209j188r82p23n15l69k51r9J73O19J067J134O41L4P5R91K165K846
59762D52459K925K809K736K629K506K618K982L172K786K060J677J999K711L252
59748D89321L479L678M049M462M748M963N155N108M646L987L513L219K785K135
59734E45248J484Q94K55k29j58K57J17r86k154k172r81L70R98Q65L19l71r74j306
59716E41476j392j401j434j641k288l227l557k514o07Q32J290J447J828K016J625
$$ plain form
59827 520340 514496 510485 507554 504972 502599 500848 499974 499504 498677 497368 496218 495807 496024 496385 496578 496509
59811 496509 496108 495358 494419 493525 492854 492485 492275 491712 490266 488021 485734 483994 482564 480791 478480 476004
59795 476004 473649 471235 468460 465380 462404 459917 457977 456337 454721 453095 451669 450622 449856 449069 448050
59780 448050 446841 445653 444671 443948 443433 443064 442813 442714 442887 443506 444573 445707 446348 446382 446457 447448 449613 452459
59762 452459 455384 458193 460929 463558 466064 468682 471664 474836 477622 479682 481359 483358 486069 489321
59748 489321 492800 496478 500527 504989 509737 514700 519855 524963 529609 533596 537109 540328 543113 545248
59734 545248 546732 547626 547881 547652 547494 547751 547868 546882 544728 542556 541575 541945 542943 543808 544127 543756 542782 541476
59716 541476 540084 538683 537249 535608 533320 530093 526536 524022 523415 524247 525537 526984 528812 530828 532453
59701E32453J187J311J634J457R92J039J619J858J319P06R17J927K844K819J734
59686E55816K71o25n74j32n7l80n86n81q47j627k514l117l550m037m450m630m695
59669E23685m732m524l982l477l359l466l479l419l317k832j764o74k82m40l92
59654D83546O9N00Q77J842L545N041N373M724L966L458K860J862N59q60k296l598
59638E11468m496m747m271l307k464k302k639k652j936j152j131j689j914j540
59624D75228j238j491j818j574r44o65j019j610k092k602l333m122m648m778m442
59609D38852l458j868l44L21K35L68J232K082J956J064M16K84o1r43j519r23M63
59592D38157J526J831J833J905J824J285L95n37j308j807j916j642j216r21q56
$$ plain form
59701 532453 533640 534951 536585 538042 539034 540073 541692 543550 544869 545575 546492 548419 551263 554082 555816
59686 555816 556087 555462 554888 554756 554699 554319 553733 553152 552305 550678 548164 545047 541497 537460 533010 528380 523685
59669 523685 518953 514429 510447 506970 503611 500145 496666 493247 489930 487098 485334 484660 484378 483938 483546
59654 483546 483615 484115 484992 486834 490379 495420 500793 505517 509483 512941 515801 517663 518222 517362 515066 511468
59638 511468 506972 502225 497954 494647 492183 489881 487242 484590 482654 481502 480371 478682 476768 475228
59624 475228 473990 472499 470681 469107 468163 467498 466479 464869 462777 460175 456842 452720 448072 443294 438852
59609 438852 435394 433526 433182 433503 433738 434106 435338 437420 439376 440440 440856 441140 441079 440136 438617 437694 438157
59592 438157 439683 441514 443347 445252 447076 448361 448756 448219 446911 445104 443188 441546 440330 439409 438553
59577D38553r39j111j446j970k442k509k227k097k302k263j438l60r7p14j083
59562D15555m91L96O18K46j9J4M8J8Q3J27J7L6M52Q83Q44O68J108K175L172L820
59542D29770M561N709P067Q492J0196J2370J5089J8413K1718K2951J9711J1765
59530E87812J835o508j1347j2808j1939r900p635n559l569j558L04J862L055L562
59516E27607L046J895J031O10k65k078l918m734m858n407o589p602p939p809p347
59501D75643o364n017l951l469l189k728k167j683j247j002j293j927j949p80
59487D38877P37J182L79l61k1Q38J092P79R60K026L086L278K905K761K987L276
59471D64781L698M463N066M674L337K002J178M06o91j560j461m70O74J383J553
$$ plain form
59577 438553 437614 436503 435057 433087 430645 428136 425909 423812 421510 419247 417809 417449 417352 416638 415555
59562 415555 415064 415460 416078 416324 416305 416319 416367 416385 416468 416595 416612 416648 417100 417983 418827 419495 420603 422778 425950 429770
59542 429770 434331 440040 447107 455599 465795 478165 493254 511667 533385 556336 576047 587812
59530 587812 589647 583139 571792 558984 547045 537145 529510 523951 520382 518824 519128 520990 524045 527607
59516 527607 530653 532548 533579 534189 533924 531846 527928 523194 518336 512929 506340 498738 490799 482990 475643
59501 475643 469279 464262 460311 456842 453653 450925 448758 447075 445828 444826 443533 441606 439657 438877
59487 438877 439614 440796 441175 440814 440793 441631 442723 443502 444462 446488 449574 452852 455757 458518 461505 464781
59471 464781 468479 472942 478008 482682 486019 488021 489199 489605 488914 487354 485893 485423 486097 487480 489033
59456D89033J441J548K302L622N082O526Q026R161R158Q051O957O635O436N327
59442E69305L349J315m90k409m478o177p089p207o673n804n218n335n722n508
59428E11859m378k808j366k80M59J100K121L744N556P068Q461J0285J2549J4759
59414E69129J6738J8781K1128K3901K7262L0674L1896K7975J8001M521q223j7059
59402G64724k0909k0190j6121j0237l630L384J0232J4797J4040O579n413j7244
59390G20012k4877k7257k5938k3042j9850j6911j4552j2722j0858q507o007m051
59378E25440k642j175M81J600J706J403J681K708L813M451M653M608M361M052
59364E57140L957M040L807K955J954J557J881K393K820L466M452N210N285N185
$$ plain form
59456 489033 490474 492022 494324 497946 503028 509554 517580 526741 535899 543950 550907 557542 563978 569305
59442 569305 572654 573969 573479 571070 566592 560415 553326 546119 539446 533642 528424 523089 517367 511859
59428 511859 507481 504673 503307 503027 503486 504586 506707 510451 516007 523075 531536 541821 554370 569129
59414 569129 585867 604648 625776 649677 676939 707613 739509 767484 785485 790006 781783 764724
59402 764724 743815 723625 707504 697267 693637 697021 707253 722050 736090 742669 737256 720012
59390 720012 695135 667878 641940 618898 599048 582137 567585 554863 544005 535498 529491 525440
59378 525440 522798 521623 522104 523704 525410 526813 528494 531202 535015 539466 544119 548727 553088 557140
59364 557140 561097 565137 568944 571899 573853 575410 577291 579684 582504 585970 590422 595632 600917 606102
59350F06102N779P058Q204Q868R577J0741J1997J2845J3305J3463J3079J2110
59338G33128J1125J0552R900Q428O244M080K168J04k303m630o411p633q578r519
59324G46655j0559j1454j1741j1310j0664j0230r716q668p354o461o009n354m257
59311F32878l273k910k953k816k091o86J172K983M487O148Q562J1329J3030J2405
59297F78265R134L607l273r909j4574j6697j7152j6954j6235j4785j2936j1195
59285E57296r495p465n282l586k604j883r46J53J027J478J744K275L259M397N244
59270E45612N803O488P517Q610R448J0074J0631J0984J0823R968Q345N887K744
59257F52934m78k999m471n219n880o749p477p449o607n672n382n629n668n076
$$ plain form
59350 606102 611881 618939 627143 636011 645588 656329 668326 681171 694476 707939 721018 733128
59338 733128 744253 754805 764705 773133 779377 783457 785625 785729 783426 778796 772385 764752 756174 746655
59324 746655 736096 724642 712901 701591 690927 680697 670981 662313 654959 648498 642489 637135 632878
59311 632878 629605 626695 623742 620926 618835 618149 619321 622304 626791 632939 641501 652830 665860 678265
59297 678265 687399 691006 687733 677824 663250 646553 629401 612447 596212 581427 568491 557296
59285 557296 547801 540336 535054 531468 528864 526981 526035 526188 527215 528693 530437 532712 535971 540368 545612
59270 545612 551415 557903 565420 574030 583478 593552 604183 615167 625990 635958 644303 650190 652934
59257 652934 652456 649457 644986 639767 633887 627138 619661 612212 605605 599933 594551 588922 583254 578178
59243E78178m013k712j182M23J645K216K404K661L153L736M119M013L481L110
59229F01232L427M056M029L074J955J298P50k12j270j802j969k488l448m188m304
59214F00140m121l970l693l189k946l485m520n127m828m107l692l582l135k044
59200E47701q84m53q59j521j914j957j728j249o32j21J19J05j43n52p74l61O65
59183E35442J724K250K202J867J549J544K028K738L067K816K557K961L938M802
59169E71485N164N340N852O762P587P820P522P302P607Q094P948O826N214L753
59155F64276K550J255m15k412m442o151p365q199q830r137q882q170p455p034
59141E89589o892p008p360p598p290o653o459o917p236o751n894n467n363m768
$$ plain form
59243 578178 574165 571453 570271 570694 572339 574555 576959 579620 582773 586509 590628 594641 598122 601232
59229 601232 604659 608715 612744 615818 617773 619071 619821 619609 618339 616537 614568 612080 608632 604444 600140
59214 600140 596019 592049 588356 585167 582221 578736 574216 569089 564261 560154 556462 552880 549745 547701
59200 547701 546817 546364 545505 543984 542070 540113 538385 537136 536504 536383 536502 536607 536464 535912 535138 534777 535442
59183 535442 537166 539416 541618 543485 545034 546578 548606 551344 554411 557227 559784 562745 566683 571485
59169 571485 576649 581989 587841 594603 602190 610010 617532 624834 632441 640535 648483 655309 660523 664276
59155 664276 666826 668081 667666 665254 660812 654661 647296 639097 630267 621130 612248 604078 596623 589589
59141 589589 582697 575689 568329 560731 553441 546788 540329 533412 526176 519425 513531 508064 502701 497933
59127D97933l490k266j657j303n57N76J522K025K520L561N107O570P538Q149Q659
59112E34887Q981Q989Q966R247R533R231Q405P762P513P019N902M769M284M181
59098F39669L818L257K950K641J527m58k310l125k993k445j573k03J318K035J318
59083F45426l63j835k438k664l396m739n975o630p041p661q294q366p712o746
59069E71566n970n617n578n496n033m249l557l189k964k742k691k862k886k507
59055E16225k062k056k439k764k864k900k919k792k533k255j851j091o1P86J053
59040D89477P07P4l01j7P36J265J186R19J025J344J279P99N99J209K418L669M718
59023E11106N687O726P833Q935J0034J1171J2194J2636J2038J0483Q598O887N338
$$ plain form
59127 497933 494443 492177 490520 489217 488660 489236 490758 492783 495303 498864 503971 510541 518079 526228 534887
59112 534887 543868 552857 561823 571070 580603 589834 598239 606001 613514 620533 626435 631204 635488 639669
59098 639669 643487 646744 649694 652335 653862 653404 651094 647969 644976 642531 640958 640755 642073 644108 645426
59083 645426 645063 643228 640790 638126 634730 629991 624016 617386 610345 602684 594390 586024 578312 571566
59069 571566 565596 559979 554401 548905 543872 539623 536066 532877 529913 527171 524480 521618 518732 516225
59055 516225 514163 512107 509668 506904 504040 501140 498221 495429 492896 490641 488790 487699 487638 488424 489477
59040 489477 490184 490258 489957 489940 490676 491941 493127 494046 495071 496415 497694 498493 499092 500301 502719 506388 511106
59023 511106 516793 523519 531352 540287 550321 561492 573686 586322 598360 608843 617441 624328 629666
59010F29666L710J987L80q56j512j637j667j992k311j933q23L12J208K450M312
58995F31294N932O419O116N921N825N121L730K386J569J106O85O4j132k937m508
58980F67591m904m369l895l595k540l84J971L661M898O188P464Q603R962J1681
58966G02332J3048J3383J3094J3043J3203J2844J1845J0904J0365R615Q053O016
58954H37745M254K782P91k269o002r566j2530j4883j6400j6664j5841j4960j4900
58941G21557j5318j5076j3624j1521r612q185p050o042n133m282l402k505j729
58928F18078j231r74o51%P42R70N17J5Q2M23K24o90j656k064j919j470q40j87
58910F09369J80J37oJ95R02J901K803L427M167N733Q252J0762J2139J2343J2249
$$ plain form
59010 629666 633376 635363 635743 634887 633375 631738 630071 628079 625768 623835 623012 623324 624532 626982 631294
58995 631294 637226 643645 649761 655682 661507 666628 670358 672744 674313 675419 676104 676168 675036 672099 667591
58980 667591 662687 658318 654423 650828 648288 647904 649875 653536 658434 664622 672086 680689 690651 702332
58966 702332 715380 728763 741857 754900 768103 780947 792792 803696 814061 823676 831729 837745
58954 837745 841999 844781 845572 843303 837301 827735 815205 800322 783922 767258 751417 736457 721557
58941 721557 706239 691163 677539 666018 656406 648221 641171 635129 629996 625714 622312 619807 618078
58928 618078 616847 615873 615222 615222 615964 616934 617451 617466 617548 617971 618195 617505 615849 613785 611866 610396 609556 609369
58910 609369 609549 609686 609680 609875 610777 612678 615481 618908 623075 628808 637060 647822 659961 672304 684553
58895F84553J2347J2226J1517J0645J0336J0789J1677J2694J3821J5221J6990
58884H22816J8877K0256K0620K0080J9008J7268J4393J0596O979M390K415j20
58872I77578l831q204j2114j4668j5722j5820j5599j5220j4442j3138j1530j0033
58860H27257r086q976r435r638r052q231q176q972r705r779r563r530r485r079
58846F98550q465p947p417o706o113o116o690p384p826p911p658p232o903o670
58832E97512o159n170m115l544l481l554l575l599l495k889j562K72K073L278
58818E61992L692L727M083M982N939O441O499O276N568M211K815K373L012L663
58804F25273L286J990O54l07j251k509l776m556m864n132n565n934o067o169o505
$$ plain form
58895 684553 696900 709126 720643 731288 741624 752413 764090 776784 790605 805826 822816
58884 822816 841693 861949 882569 902649 921657 938925 953318 963914 970893 975283 977698 977578
58872 977578 973747 965543 953429 938761 923039 907219 891620 876400 861958 848820 837290 827257
58860 827257 818171 809195 799760 790122 781070 772839 764663 755691 745986 736207 726644 717114 707629 698550
58846 698550 690085 682138 674721 668015 661902 655786 649096 641712 633886 625975 618317 611085 604182 597512
58832 597512 591353 586183 582068 578524 575043 571489 567914 564315 560820 557931 556369 556641 558714 561992
58818 561992 565684 569411 573494 578476 584415 590856 597355 603631 609199 613410 616225 618598 621610 625273
58804 625273 628559 630549 631203 630896 629645 627136 623360 618804 613940 608808 603243 597309 591242 585073 578568
58789E78568p000p258o889n726m030k528j865j875j697q28L49J354K336L483M273
58774E50667M049L063K096J223k03k314m358n657o173n971m981l667l006l326
58760E21442l791l632l242l336l648l295k160j051m73q2N54J274J738K016K402
58745E04716K856L078L009K961L133L329L366L540M317N521O297O089N311M739
58731E62262M553M402M143M003M085M225M301M323M175L734L140K589J954J087
58717F12976L97N36J497K590L402M134N017N935O793P577P913P220N577L785K246
58702F77595M41k102m930p273r029j0525j1721j2377j2750j3462j4574j5261j4656
58689E49376j2832j0814r586r123q531p203n586m482l943l467l087l396m342m827
$$ plain form
58789 578568 571568 564310 557421 551695 547665 545137 543272 541397 539700 538872 539221 540575 542911 546394 550667
58774 550667 554716 557779 559875 561098 560895 558581 554223 548566 542393 536422 531441 527774 524768 521442
58760 521442 517651 514019 510777 507441 503793 500498 498338 497287 496814 496732 497286 498560 500298 502314 504716
58745 504716 507572 510650 513659 516620 519753 523082 526448 529988 534305 539826 546123 552212 557523 562262
58731 562262 566815 571217 575360 579363 583448 587673 591974 596297 600472 604206 607346 609935 611889 612976
58717 612976 613373 613909 615406 617996 621398 625532 630549 636484 643277 650854 658767 665987 671564 675349 677595
58702 677595 678036 675934 671004 663731 654702 644177 632456 620079 607329 593867 579293 564032 549376
58689 549376 536544 525730 516144 507021 498490 491287 485701 481219 477276 473809 470722 467326 462984 458157
58675D58157m033k502j415j144j069n61M01J463K356L124M044N286O629P668Q336
58660D86740Q833R035Q301O192L156L19j370j865k006k708l931m688m261l149
58646D98598k366k238k433k849l648m576n106n176n038m481l105j322j17K96O37
58631D57076J277J810K037K325K717K669K002J172L71o27j425j094K65J274J291
58616D73140J434K822M914O498P406Q168Q746Q617P656O088M139K313J316J133
58602E44390Q81J55l21l0M88P20J019J368O19j756m163m629l291j832j110p64
58586E31744l87L00J891M413O526P067O880P565Q931R344Q321O983O071N315M800
58571F15764N136O014O296N953O373Q219J0451J2098J3580J5596J7888J9916K1730
$$ plain form
58675 458157 454124 451622 450207 449063 447994 447433 447834 449297 451653 454777 458821 464107 470736 478404 486740
58660 486740 495573 504608 512909 519101 522257 522576 521206 519341 517335 514627 510696 506008 501747 498598
58646 498598 496232 493994 491561 488712 485064 480488 475382 470206 465168 460687 457582 456260 456143 456439 457076
58631 457076 458353 460163 462200 464525 467242 469911 471913 473085 473456 472829 471404 470310 470575 471849 473140
58616 473140 474574 477396 482310 488808 496214 504382 513128 521745 529401 535489 539628 541941 543257 544390
58602 544390 545271 545426 545105 545075 545563 546283 547302 548670 549289 547533 543370 538741 535450 533618 532508 531744
58586 531744 531357 531657 533548 537961 544487 551554 558434 565999 574930 584274 592595 599578 605649 610964 615764
58571 615764 620900 626914 633210 639163 645536 653755 664206 676304 689884 705480 723368 743284 765014
58558G65014K3331K4151K3920K3207K2341K0535J6946J2057P256L382L29k268
58546I40201m552o422p545p554o586n430m963n540p040r202j1784j4571j7273
58533H31739j9332k0050j9328j7969j6785j5599j3673j0960q256o239m977m287
58521F74284l873l192j970q34p24j593k417k554k364k309k197j680r24m90p91
58506F46372j734k653k801k269k093k894l748l321j808p16q03j295j306r18n34
58491F17479j30L53O48O90R60J790K874L818M699N678O550P086P530Q349R727
58476F78101J1489J3305J4745J5415J5192J4242J2699J0534P680M192L24l360
58464G94558o154p645p949p444o551n760n332m778l231n88K373N202Q196J1174
$$ plain form
58558 765014 788345 812496 836416 859623 881964 902499 919445 931502 938758 942140 942469 940201
58546 940201 935649 929227 921682 914128 907542 902112 897149 891609 884569 875367 863583 849012 831739
58533 831739 812407 792357 773029 755060 738275 722676 709003 698043 689787 683548 678571 674284
58521 674284 670411 667219 665249 664415 663691 662098 659681 657127 654763 652454 650257 648577 647653 647163 646372
58506 646372 644638 641985 639184 636915 634822 631928 628180 624859 623051 622335 621532 620237 618931 618013 617479
58491 617479 617349 617702 618350 619040 620000 621790 624664 628482 633181 638859 645409 652495 660025 668374 678101
58476 678101 689590 702895 717640 733055 748247 762489 775188 785722 793402 797594 797918 794558
58464 794558 788404 780759 772810 765366 758815 753055 747723 742945 739714 739126 741499 746701 754897 766071
58450G66071J2923J2775J1701J0798R534O751K767r98l965o596q913j0275j0528
58437G92045j0126r161p458n518m182l355k242p23O61J969L778N862P239P680
58423G76469Q019Q792R679J0327J0704J0510R311P284M955K352n82l082m376n092
58409H45270o388p890q147p107o374o772p347p209o756o531o199n298l860j911
58395G57481N56K830M022M407M979N577N106L682K852L157L301K415J443J422
58381H03230J852J751J100L69k30l56M84J992L189L948N139O811P817P772P859
58366H52727Q843R810R836R535R877J0693J1409J2165J3209J4096J4394J4362
58354I90956J4239J3687J2489J0944R140O903M752L636L411K867J760J270K032
$$ plain form
58450 766071 778994 791769 803470 814268 823802 830553 833320 832322 828357 821761 812848 802573 792045
58437 792045 781919 772758 765300 759782 755600 752245 750003 749280 749941 751910 755688 761550 768789 776469
58423 776469 784488 793280 802959 813286 823990 834500 843811 851095 856050 858402 857820 854738 850362 845270
58409 845270 838882 830992 822845 815738 809364 802592 795245 788036 781280 774749 768550 763252 759392 757481
58395 757481 758037 760867 764889 769296 774275 779852 784958 788640 791492 794649 797950 800365 801808 803230
58381 803230 805082 806833 807933 808302 808072 807716 808200 810192 813381 817329 822468 829279 837096 844868 852727
58366 852727 861570 871380 881216 890751 900628 911321 922730 934895 948104 962200 976594 990956
58354 990956 1005195 1018882 1031371 1042315 1051455 1058358 1063110 1066746 1070157 1073024 1074784 1076054 1078086
58341A078086L276M490O262Q707J0722J1640J2192J2967J3503J3656J4252J5502
58329A205255J6391J6495J6735J7378J7120J5250J3036J1741J0892R740Q755Q351
58317A367139P757O571N927O726Q064Q789R174R775J0148J0073J0560J2149J3664
58304A486516J4079J4224J5187J6427J6991J7269J7990J8701J8766J8739J9432
58293A674321K0664K2018K3615K5143K5640K5281K5710K7511K9173K9730L0413
58282A959219L2199L3844L3999L3489L3677L4412L5226L6721L8998M0572M0723
58271B353079M1124M3219M5852M7357M8229M9780N1867N3854N6136N8891O1102
58260B910490O2571O4958O9078P3184P5702P7507P9693Q1514Q2434Q3867Q6820
$$ plain form
58341 1078086 1081362 1085852 1092114 1100821 1111543 1123183 1135375 1148342 1161845 1175501 1189753 1205255
58329 1205255 1221646 1238141 1254876 1272254 1289374 1304624 1317660 1329401 1340293 1350033 1358788 1367139
58317 1367139 1374896 1381467 1387394 1394120 1402184 1410973 1420147 1429922 1440070 1450143 1460703 1472852 1486516
58304 1486516 1500595 1514819 1530006 1546433 1563424 1580693 1598683 1617384 1636150 1654889 1674321
58293 1674321 1694985 1717003 1740618 1765761 1791401 1816682 1842392 1869903 1899076 1928806 1959219
58282 1959219 1991418 2025262 2059261 2092750 2126427 2160839 2196065 2232786 2271784 2312356 2353079
58271 2353079 2394203 2437422 2483274 2530631 2578860 2628640 2680507 2734361 2790497 2849388 2910490
58260 2910490 2973061 3038019 3107097 3180281 3255983 3333490 3413183 3494697 3577131 3660998 3747818
58249C747818R0182R3256R7231J02388J06834J10129J14843J22224J29829J36025
58239D850759J43045J52586J62287J70063J78102J88901K01003K12525K25169
58230F484440K40670K57041K72626K89964L11331L34430L57046L81721M11033
58221I340302M42745M74783N10295N52277N98237O46216P00822P66784Q42044
58212A4874505R24369J018998J131917J261629J406158J572092J767594J993357
58204B5950619K251146K555053K924113L372154L917817M596759N451151O517978
58196E7536790P844560R503991J1573290J4104015J7132753K0702750K4839952
58189A63238101K9498554L4495920L9354653M3030276M3824119L9906494L0383522
$$ plain form
58249 3747818 3838000 3931256 4028487 4130875 4237709 4347838 4462681 4584905 4714734 4850759
58239 4850759 4993804 5146390 5308677 5478740 5656842 5845743 6046746 6259271 6484440
58230 6484440 6725110 6982151 7254777 7544741 7856072 8190502 8547548 8929269 9340302
58221 9340302 9783047 10257830 10768125 11320402 11918639 12564855 13265677 14032461 14874505
58212 14874505 15798874 16817872 17949789 19211418 20617576 22189668 23957262 25950619
58204 25950619 28201765 30756818 33680931 37053085 40970902 45567661 51018812 57536790
58196 57536790 65381350 74885341 86458631 100562646 117695399 138398149 163238101
58189 163238101 192736655 227232575 266587228 309617504 353441623 393348117 423731639
58182D23731639J6146365k70078j5777504k7967657l5741226l9219754l9282306
58175B81619479l7065939l3598104k9625012k5618526k1858675j8494046j5573327
58168I9785850j3084045j0992282r255614p820394o631339n646090m832499m158089
58160C7365498l593296l120151k726926k397847k116907j877218j676759j507998
58152A8348396j360267j229068j114470j012903r18656q31314p53976o85757o22768
58143I819217n64833n14614m71652m33471m01001l76593l57701l38500l17098
58134F043754k95957k76165k56520k37561k21297k07181j92832j78408j66113
58125D011720j55924j45837j35854j27717j21148j14146j06696j00534r5537q9895
$$ plain form
58182 423731639 439878004 439607926 423830422 395862765 360121539 320901785 281619479
58175 281619479 244553540 210955436 181330424 155711898 133853223 115359177 99785850
58168 99785850 86701805 75709523 66453909 58633515 52002176 46356086 41523587 37365498
58160 37365498 33772202 30652051 27925125 25527278 23410371 21533153 19856394 18348396
58152 18348396 16988129 15759061 14644591 13631688 12713032 11881718 11127742 10441985 9819217
58143 9819217 9254384 8739770 8268118 7834647 7433646 7057053 6699352 6360852 6043754
58134 6043754 5747797 5471632 5215112 4977551 4756254 4549073 4356241 4177833 4011720
58125 4011720 3855796 3709959 3574105 3446388 3325240 3211094 3104398 3003864 2908327 2818432
58115B818432q3702p8981p6228p3876p1157o8688o6430o3699o0978n9244n7882
58104B057567n5580n2776n0936m9967m8657m6972m5647m4242m1924l9417l7857
58093A543592l6530l4085l1205k9614k9175k8338k6791k5337k3895k1986k0535
58082A236101k0719k1667k1614k0715k0319k0273j9453j8370j8494j9433j9364
58071A015680j8083j7084j6808j6249j5320j5097j5609j5589j4688j3817j3181
58060H44155j1996j0348r437r605r902r838j0039j0848j1727j2219j2304j1811
58048G14081j0610r252q371p704o778n950n699n628n410n735o908p579o585n053
58034F16819m804n608o094o347p353q602q816q535r378j1038j1501j0255q828
$$ plain form
58115 2818432 2734730 2655749 2579521 2505645 2434488 2365800 2299370 2235671 2174693 2115449 2057567
58104 2057567 2001987 1949211 1898275 1848308 1799651 1752679 1707032 1662790 1620866 1581449 1543592
58093 1543592 1507062 1472977 1441772 1412158 1382983 1354645 1327854 1302517 1278622 1256636 1236101
58082 1236101 1215382 1193715 1172101 1151386 1131067 1110794 1091341 1072971 1054477 1035044 1015680
58071 1015680 997597 980513 963705 947456 932136 917039 901430 885841 871153 857336 844155
58060 844155 832159 821811 812374 802769 792867 783029 772990 762142 750415 738196 725892 714081
58048 714081 703471 694219 685848 678144 671366 665416 659717 654089 648679 642944 636036 628457 621872 616819
58034 616819 612015 606407 600313 593966 586613 578011 569195 560660 551282 540244 528743 518488 509660
58021E09660q081p331o338n802n600m730l453l297m451n178m378k904j816j124
58007D45177p90j142j755j524m41K32m0m15l51l14m49k15J74l83k013l427l900
57990D28424m214n029n810n976n748n272m251k940k238k280k279k150k782m183
57976C73272m883l936k199r04j88K14J01n43r97p46k05M1o2l81p77p30K19J388
57958C58684J519N60l33p11j296k281k795k618k804l782m345l489j985j119r56
57943C32249q56o60l64M63J969L400M106M459N108O039O999Q073R172R615Q963
57928C98735P632O148M491K676J140M6j059k372l329l546l443l512l695l917m376
57913C91619m861m685l762k887k444j885q95j52j88n84q52j175j649j800j572
$$ plain form
58021 509660 501579 494248 487910 482108 476508 471778 468325 465028 460577 455399 451021 448117 446301 445177
58007 445177 444387 443245 441490 439966 439525 439757 439717 439302 438951 438637 438188 437973 438147 437764 435751 432324 428424
57990 428424 424210 419181 413371 407395 401647 396375 392124 389184 386946 384666 382387 380237 377455 373272
57976 373272 368389 364453 362254 361350 361162 361376 361477 360934 359937 359191 358986 359027 358965 358584 357807 357077 357296 358684
57958 358684 360203 360763 360430 359719 358423 356142 353347 350729 347925 344143 339798 336309 334324 333205 332249
57943 332249 331393 330733 330369 330832 332801 336201 340307 344766 349874 355913 362912 370985 380157 389772 398735
57928 398735 406367 412515 417006 419682 420822 420868 419809 417437 414108 410562 407119 403607 399912 395995 391619
57913 391619 386758 382073 378311 375424 372980 371095 370200 370048 369860 369276 368424 367249 365600 363800 362228
57898C62228j741k595l263l134k870l051k995k109j315j707k600k429j105k1P0
57883C31363j98r8L56R46J615K101J967J212K71n89j362j887j844j240m73L2M9
57866C32221l92r65j237j106q39n79j89L31P87J213J780K208K000J441J499K427
57850C40600L281L234K493J572N28n31j154j374j923k916l318k537j634j982l440
57835C30899m837n529n515m737l450k600k760l058k344r45j20j74k78L7M87R99
57819B96075J906L091L923M202M271M163L425J871k05k573n094p240q368q474
57805B90973q024p109n547l789k819k934l319l089k202j164l32K88R14J738K563
57790B56148K854K457J949J927K252K516K811L318L632L322K861L013L543L568
$$ plain form
57898 362228 360487 357892 354629 351495 348625 345574 342579 340470 339155 337448 334848 332419 331314 331293 331363
57883 331363 331165 331067 331423 332369 333984 336085 338052 339264 339535 338946 337584 335697 333853 332613 332140 332172 332221
57866 332221 331829 330864 329627 328521 327682 327103 326914 327245 328032 329245 331025 333233 335233 336674 338173 340600
57850 340600 343881 347115 349608 351180 351708 351177 350023 348649 346726 343810 340492 337955 336321 334339 330899
57835 330899 326062 320533 315018 310281 306831 304231 301471 298413 296069 295124 295004 294830 294552 294589 295076 296075
57819 296075 297981 301072 304995 309197 313468 317631 321056 322927 322722 320149 315055 307815 299447 290973
57805 290973 282949 275840 270293 266504 263685 260751 257432 254343 252141 250977 250645 250933 251847 253585 256148
57790 256148 259002 261459 263408 265335 267587 270103 272914 276232 279864 283186 286047 289060 292603 296171
57776B96171L094K997L416L391K443J391J057J158J078R32J049J052L24j008k284
57761C16261l278m246n170n612n345m599l608k382j016J37Q02J073J199J245J179
57746B86640J163J446J964K308K255K035J877J563R02L42N28J234J517J002L51
57731C07127R9j10o22q87l17N35O18k3l42O0M00k8q80j476j734j992k272k307
57713B95849k069j888k041k484k921l117l118l169l349l429l228k884k567k130
57699B57455j397o21k40j60J98J087J996K145J212m77k203l237l297k730k132
57684B47599j729j343q64m70k03L56J686L737N924P814R688J2232J5747J9882
57670C20056K4282K9240L5399M2838N0617N6804N8555N2803L8180J6890o010k5676
$$ plain form
57776 296171 299265 302262 305678 309069 311512 312903 313960 315118 316196 317128 318177 319229 319553 318545 316261
57761 316261 312983 308737 303567 297955 292610 288011 284403 282021 281005 281142 281944 283017 284216 285461 286640
57746 286640 287803 289249 291213 293521 295776 297811 299688 301251 302153 302495 303023 304257 305774 306776 307127
57731 307127 307226 307116 306494 305607 305290 305825 306443 306420 306078 306138 306538 306510 305630 304154 302420 300428 298156 295849
57713 295849 293780 291892 289851 287367 284446 281329 278211 275042 271693 268264 265036 262152 259585 257455
57699 257455 256058 255437 255197 255037 255235 256322 258318 260463 261675 261198 258995 255758 252461 249731 247599
57684 247599 245870 244527 243663 243193 242990 243346 245032 248769 254693 262507 272195 284427 300174 320056
57670 320056 344338 373578 408977 451815 502432 559236 617791 670594 708774 725664 719654 693978
57658F93978l9680m7596m9785m7390m2539l7264l2297k7505k3037j9254j5971
57647C11660j2718r631p253n638m414l563l248k971k000n85K06J57L00J296K358
57632B63956K423J597P57K72j18n48q49r48q87o08j99j63r43k178l027l192l136
57615B52209l160k818j652j90L89l29j341j284J04J783K584K200J084j74j125
57600B48280j477j230p09k59N7L45N78N46N7q17j659j999j914k165l202m268m083
57583B26081k564j000l44j76J51K72m34j499j846j313p24n94o23m79k42k9J12
57566B14749m6o87j402j554j218j061j269j272p10J3M07N44P77J240J898K684
57550B13093L386L735L663L259K474J301J11o10q39q03m18M26J145R44O0l87N4
$$ plain form
57658 693978 654298 606702 556917 509527 466988 429724 397427 369922 346885 327631 311660
57647 311660 298942 289311 282058 276420 272006 268443 265195 262224 260224 259639 259845 260002 260302 261598 263956
57632 263956 266379 267976 268733 269005 268887 268339 267490 266542 265655 265047 264848 264685 263742 261564 258537 255345 252209
57615 252209 249049 246231 244579 244389 244778 244449 243108 241824 241928 243711 246295 248495 249579 249405 248280
57600 248280 246803 245573 244864 244605 244662 245007 245585 246131 246188 245371 243712 241713 239799 237634 234432 230164 226081
57583 226081 223517 222517 222173 221997 222148 222420 221986 220487 218641 217328 216604 216010 215387 214908 214666 214637 214749
57566 214749 214703 214016 212614 211060 209842 208781 207512 206240 205530 205543 205950 206494 207271 208511 210409 213093
57550 213093 216479 220214 223877 227136 229610 230911 231022 230412 229573 228770 228352 228778 229923 230867 230927 230540 230594
57533B30594O51P52O59P82Q46N83M27P21R26M34j75K94K018L850M653M288L360
57516B55663K524K204K474L028L435L497L260K856K550K642L040L152K602J896
57502B94823J803K218K214J318J55m69n83p40r89q66l33n5m53j035j123r35j208
57485B93742j933k244j665p16O1Q44J809K380K102J680K112K980K793J122o81
57470C04386j242p95n41j029j807k216j983j213j81Q28J716K479L011L194L163
57455C07770L116K988K722K728L430M335M373L287K040J536J657J859J987K015
57441C45843J702J099Q29J311K099K616K950L398L664L332K711K491K715K901
57427C79661K904K933K896K537K133K263K817L060K773K549K748K936K755K604
$$ plain form
57533 230594 231245 231997 232656 233438 234284 234867 235294 236015 236941 237375 237200 237494 239512 243362 248015 252303 255663
57516 255663 258187 260391 262865 265893 269328 272825 276085 278941 281491 284133 287173 290325 292927 294823
57502 294823 296626 298844 301058 302376 302531 302062 301479 300739 299750 298884 298551 298496 298043 297008 295885 294950 293742
57485 293742 291809 289565 287900 287184 287245 288089 289898 292278 294380 296060 298172 301152 303945 305067 304386
57470 304386 303144 302349 301808 300779 298972 296756 294773 293560 293379 294207 295923 298402 301413 304607 307770
57455 307770 310886 313874 316596 319324 322754 327089 331462 334749 336789 338325 339982 341841 343828 345843
57441 345843 347545 348644 349473 350784 352883 355499 358449 361847 365511 368843 371554 374045 376760 379661
57427 379661 382565 385498 388394 390931 393064 395327 398144 401204 403977 406526 409274 412210 414965 417569
57413D17569K891L237L093K797L215M441N559N775N290M795M569M364L936L299
57399D74830K606K061J939K427L323M128M472M369M039L720L695M195N113O006
57385E26923O596P083P742Q388Q559Q105P322O547N904N434N170N067N007M861
57371F18708M499L924L459L513L936L987L335K670K811L622M394M944N466N634
57357F74902M928L885L804M900N809N481M586M350M867N485O179P404Q893R639
57343G55112R212Q216P332O541N596M648M123M232M901N945P091P884P939P362
57329H46134O762O641O775O550N912N645O346P501Q109P974P770P892P961P610
57315I45582P099O925P332Q292R557J0524J0629J0057R580R574R760R964J0341
$$ plain form
57413 417569 420460 423697 426790 429587 432802 437243 442802 448577 453867 458662 463231 467595 471531 474830
57399 474830 477436 479497 481436 483863 487186 491314 495786 500155 504194 507914 511609 515804 520917 526923
57385 526923 533519 540602 548344 556732 565291 573396 580718 587265 593169 598603 603773 608840 613847 618708
57371 618708 623207 627131 630590 634103 638039 642026 645361 648031 650842 654464 658858 663802 669268 674902
57357 674902 679830 683715 687519 692419 698228 703709 708295 712645 717512 722997 729176 736580 745473 755112
57343 755112 764324 772540 779872 786413 792009 796657 800780 805012 809913 815858 822949 830833 838772 846134
57329 846134 852896 859537 866312 872862 878774 884419 890765 898266 906375 914349 922119 930011 937972 945582
57315 945582 952681 959606 966938 975230 984787 995311 1005940 1015997 1025577 1035151 1044911 1054875 1065216
57302A065216J0724J0559R881R481R703R894R549R114R063R022Q635Q453R118
57289A188412J0243J1088J1676J2185J1987J0538Q842Q591R852J1001J0988J0495
57277A315898J0537J1159J1983J3043J4349J5343J5505J5144J4976J5226J5543
57266A468706J5649J5716J6062J6641J6944J6501J5588J5091J5423J5973J5983
57255A644277J5599J5464J5600J5528J5240J5221J5405J5036J3852J2674J2371
57244A806267J2803J3175J3132J2988J3139J3565J3916J3909J3627J3386J3290
57233A953197J3161J3028J3219J3766J4075J3781J3485J3941J4807J5042J4449
57222B105951J3904J3984J4258J4172J3847J3588J3287J2753J2148J1742J1585
$$ plain form
57302 1065216 1075940 1086499 1096380 1105861 1115564 1125458 1135007 1144121 1153184 1162206 1170841 1179294 1188412
57289 1188412 1198655 1209743 1221419 1233604 1245591 1256129 1264971 1273562 1283414 1294415 1305403 1315898
57277 1315898 1326435 1337594 1349577 1362620 1376969 1392312 1407817 1422961 1437937 1453163 1468706
57266 1468706 1484355 1500071 1516133 1532774 1549718 1566219 1581807 1596898 1612321 1628294 1644277
57255 1644277 1659876 1675340 1690940 1706468 1721708 1736929 1752334 1767370 1781222 1793896 1806267
57244 1806267 1819070 1832245 1845377 1858365 1871504 1885069 1898985 1912894 1926521 1939907 1953197
57233 1953197 1966358 1979386 1992605 2006371 2020446 2034227 2047712 2061653 2076460 2091502 2105951
57222 2105951 2119855 2133839 2148097 2162269 2176116 2189704 2202991 2215744 2227892 2239634 2251219
57211B251219J1722J2225J2825J2991J2640J2377J2637J3119J3377J3615J4381
57200B393128J5737J7156J8089J8408J8365J8372J8719J9389K0172K0933K1599
57189B600067K2005K2048K1925K1910K2007K2170K2648K3571K4299K3934K2518
57178B849102K1014K0016J9206J8222J7274J6494J5452J3813J1875R985Q050O143
57166C026646M927M701M570L475J744P05Q58J293J083M65K46N88P79J11j376k986
57150C047829m046m503m854n593o804q261r628j0489j0534j0003r677j0111j1000
57137B942326j1574j1584j1548j2082j3267j4637j5542j5472j4321j2568j1041
57126B798690j0218r772q922p473o236o275p717r609j0961j1535j1531j0961r687
$$ plain form
57211 2251219 2262941 2275166 2287991 2300982 2313622 2325999 2338636 2351755 2365132 2378747 2393128
57200 2393128 2408865 2426021 2444110 2462518 2480883 2499255 2517974 2537363 2557535 2578468 2600067
57189 2600067 2622072 2644120 2666045 2687955 2709962 2732132 2754780 2778351 2802650 2826584 2849102
57178 2849102 2870116 2890132 2909338 2927560 2944834 2961328 2976780 2990593 3002468 3012453 3020503 3026646
57166 3026646 3031573 3036274 3040844 3044319 3046063 3046768 3047626 3048919 3050002 3050467 3050713 3051301 3052080 3052191 3050815 3047829
57150 3047829 3043783 3039280 3034426 3028833 3022029 3013768 3004140 2993651 2983117 2973114 2963437 2953326 2942326
57137 2942326 2930752 2919168 2907620 2895538 2882271 2867634 2852092 2836620 2822299 2809731 2798690
57126 2798690 2788472 2778700 2769778 2762305 2756069 2749794 2742077 2732468 2721507 2709972 2698441 2687480 2677793
57113B677793p802n467k537J160N389R786J4505K0135K7071L5499M6016N9638
57101B881186P7180R9074J25980J59051J99346K47235L02409L64041M30628M99848
57091E385978N68504O32412O86794P27424P51587P57741P44772P12198O60672
57082A1628082N91581N07564M15871L30777K67951K31562K05956J62505P7696
57073A4419545n2273k10717l71352n11393o19084o93431p38950p60580p62046
57064I699719p46795p18511o80447o35122n85008n32975m81721m33047l87908
57055D498185l46907l10485k78722k51287k27615k07196j89659j74551j61147
57046B350616j48728j37068j26417j16978j08611j01131r4467q8416q2544p6544
$$ plain form
57113 2677793 2669991 2664524 2661987 2663147 2668536 2678322 2692827 2712962 2740033 2775532 2821548 2881186
57101 2881186 2958366 3057440 3183420 3342471 3541817 3789052 4091461 4455502 4886130 5385978
57091 5385978 5954482 6586894 7273688 8001112 8752699 9510440 10255212 10967410 11628082
57082 11628082 12219663 12727227 13143098 13473875 13741826 13973388 14179344 14341849 14419545
57073 14419545 14367272 14156555 13785203 13273810 12654726 11961295 11222345 10461765 9699719
57064 9699719 8952924 8234413 7553966 6918844 6333836 5800861 5319140 4886093 4498185
57055 4498185 4151278 3840793 3562071 3310784 3083169 2875973 2686314 2511763 2350616
57046 2350616 2201888 2064820 1938403 1821425 1712814 1611683 1517216 1428800 1346256 1269712
57036A269712p0400o4020n7082m9391m1086l2159k2081j0238L155J6347K5796
57025I68553K7032J7155k453k6025m6666n9986o5247o4188n9499n3591m7672m1726
57013E45687l5592k9762k4892k1067j8042j5774j4187j2871j1597j0715j0400
57002C40788j0010q886p464o684o583o345n599m791m223l613k771j935j247l88
56988B70249J042L233O164R373J1795J2480J1578J0016Q185N591J896k352o309
56975C42941r523j1774j2763j2443j1313r980q557o809m714k653r78M79K348N047
56961B59308Q138J0742J2683J4730J7284J9298J9120J6143J1037M667k351r079
56949C81720j4203j6948j7614j6995j5644j3794j1512q814n861l074p14J485L901
$$ plain form
57036 1269712 1199312 1135292 1078210 1028819 987733 955574 933493 923255 926410 942757 968553
57025 968553 995585 1012740 1010287 984262 937596 877610 812363 748175 688676 635085 587413 545687
57013 545687 510095 480333 455441 434374 416332 400558 386371 373500 361903 351188 340788
57002 340788 330778 321892 314428 307744 301161 294816 289217 284426 280203 276590 273819 271884 270637 270249
56988 270249 271291 274524 280688 290061 301856 314336 325914 335930 344115 349706 351602 349250 342941
56975 342941 333418 321644 308881 296438 285125 275145 266588 259779 255065 252412 251434 251913 254261 259308
56961 259308 267446 278188 290871 305601 322885 342183 361303 377446 388483 393150 390799 381720
56949 381720 367517 350569 332955 315960 300316 286522 275010 266196 260335 257261 256547 258032 261933
56936B61933O418Q788J1315J4509J8186K1585K4158K5338K3737J7946Q487k038
56924D40362j1238j8482k3804k6596k6371k4074k1396j9070j6707j4037j1405
56913B27182r160p420o454o545p272p549o616m688k505o47N76R44M57m29r77o95
56897A68202K67J300J940K351L139M728O982R428J1679J3652J5524J7451J9146
56884B75789J9756J8404J4900R810L907k090p350j0973j2500j2167j0484p864
56872B79138m713j539J359M149P156J0450J3911J7595K1746K6492L1659L6952
56860D44355M2125M6748M9604M8501M1287K7662J0045p575k1846l1293l5985l6688
56848E76940l4360k9986k4439j8442j2495o703p29N836J3093K0913K9160L7750
$$ plain form
56936 261933 268351 277139 288454 302963 321149 342734 366892 392230 415967 433913 442400 440362
56924 440362 429124 410642 386838 360242 333871 309797 288401 269331 252624 238587 227182
56913 227182 218022 210602 204148 197603 190331 182782 176166 171478 168973 168326 168902 169846 170303 169874 168897 168202
56897 168202 168469 169769 171709 174060 177199 181927 188909 198337 210016 223668 239192 256643 275789
56884 275789 295545 313949 328849 338659 342566 340476 333126 322153 309653 297486 287002 279138
56872 279138 274425 272886 274245 278394 285550 296000 309911 327506 349252 375744 407403 444355
56860 444355 486480 533228 582832 631333 672620 700282 710327 702752 680906 649613 613628 576940
56848 576940 542580 512594 488155 469713 457218 450515 449786 455622 468715 489628 518788 556538
56836E56538M6768N6641O7525P7838Q3756Q1073O7823M5212J6735j2850l8442
56825A048617n6322o5811o8859o7838o4002n7814m9696m0210l0186k0813j2950
56814E14116o138R91R159J7965K6951L6180M5417N3479N8648N8909N1856L5992
56802I03525J3147j1349l2021m6520n5223n8863n7863n3405m7476m1501l5622
56791D76829k9531k3360j7577j2385p430k087L882R943J5371K0164K4709K8334
56779D86862K9132K5666J8293Q295l301j5280k5467l1838l4248l4148l2748l0347
56767C60871k7251k4195k1605j9234j6830j4571j2656j1024r629q596p908p323
56755A80049o640n785m694l478k575k310k413k306j842j368j176j269j560j948
$$ plain form
56836 556538 603306 659947 727472 805310 889066 970139 1037962 1083174 1099909 1087059 1048617
56825 1048617 992295 926484 857625 789787 725785 667971 618275 578065 547879 527066 514116
56814 514116 507978 508969 518128 536093 563044 599224 644641 698120 756768 815677 867533 903525
56802 903525 916672 905323 873302 826782 771559 712696 654833 601428 553952 512451 476829
56791 476829 447298 423938 406361 393976 386546 384459 388341 398284 413655 433819 458528 486862
56779 486862 515994 541660 559953 568248 564947 549667 524200 492362 458114 423966 391218 360871
56767 360871 333620 309425 287820 268586 251756 237185 224529 213505 203876 195280 187372 180049
56755 180049 173409 167624 162930 159452 156877 154567 152154 149848 148006 146638 145462 144193 142633 140685
56741A40685k242k285k065j531o22L49P69N46L46M89K78p95j770j225O63K170
56725A33760K231J541J282J672K177K443K467K258J875J565J558J748J706R79
56711A59262m76j982k538j803m80N37J049J288J245Q89N92O09M33m40j450j548
56695A55187p70j91l36n91l94l2O0n1j79l63m44k4Q47J473J320N83k25o57k89
56676A54924R03K000J875P88K89J139K233K263J487J031J142J152P98N69Q43J454
56660A74890K036K307K101J631J482J929K453K416J985J801K066K429K618K502
56646B04646J796L91j098j839j817j773k079k437k695l189l886m015l134j998
56632A76873j644j905j687n82N40P75K94j83l81m11j58N14J107R00M0m68j61K28
$$ plain form
56741 140685 138443 136158 134093 132562 131940 132289 133058 133604 133950 134439 134717 133922 132152 130927 131590 133760
56725 133760 135991 137532 138814 140486 142663 145106 147573 149831 151706 153271 154829 156577 158283 159262
56711 159262 158786 156804 154266 152463 151983 152520 153569 154857 156102 156991 157583 158192 158625 158185 156735 155187
56695 155187 154417 154226 153890 153299 152905 152873 152933 152882 152703 152340 151896 151872 152719 154192 155512 156095 155870 155213 154924
56676 154924 155827 157827 159702 160490 160779 161918 164151 166414 167901 168932 170074 171226 172024 172593 173436 174890
56660 174890 176926 179233 181334 182965 184447 186376 188829 191245 193230 195031 197097 199526 202144 204646
56646 204646 206442 206833 205735 203896 202079 200306 198227 195790 193095 189906 186020 182005 178871 176873
56632 176873 175229 173324 171637 171055 171595 172370 172664 172481 172100 171689 171531 172045 173152 174052 174092 173624 173463 173691
56614A73691j09r11j389j359j162q78m59l37r68j892k079j307m16n8J1J76L32
56597A60886L68N38Q54P64J1o85m93L30P37K33o59j186j097o03J2O08J203J791
56579A63612K140J946J312Q12R02J399J738J580J036N07M22R19J605J915J899
56564A83744K318L702N626P278Q476R679J1092J2169J2083J0487P734M556J573
56551B80517r36k815l779l630k721j824j429j436j657k144k785l029k547j937
56537B47848k099k987l564l111k057j282j054j046j092j320j655j726j411j085
56523B22359r67o64K13J191J265J04j547k741l095k649j584m12J10k28p50p93
56507B09812n86p17j148j331j039m79J83Q27J092P52K52J90M10K53l59q77j105
$$ plain form
56614 173691 173582 172671 171282 169923 168761 167883 167424 167087 166119 164227 162148 160841 160425 160367 160378 160554 160886
56597 160886 161254 161792 162646 163410 163421 162736 162243 162573 163310 163543 162884 161698 160601 159998 160010 160618 161821 163612
56579 163612 165752 167698 169010 169822 170724 172123 173861 175441 176477 176984 177406 178325 179930 181845 183744
56564 183744 186062 189764 195390 202668 211144 220823 231915 244084 256167 266654 274388 278944 280517
56551 280517 279581 276766 272987 269357 266636 264812 263383 261947 260290 258146 255361 252332 249785 247848
56537 247848 245749 242762 239198 236087 234030 232748 231694 230648 229556 228236 226581 224855 223444 222359
56523 222359 221392 220728 220941 222132 223397 223501 221954 219213 216118 213469 211885 211473 211583 211355 210605 209812
56507 209812 209226 208509 207361 206030 204991 204512 204695 205522 206614 207366 207618 207808 208218 208471 208112 207235 206130
56490B06130j426j922k016j333l06L41L02j93n71k29Q81J961K160J612J111R33
56474B07435P60O33J012J759K033J477O54J09k35m32k13L37O18M68M25O51M72
56457B17963m23j205j067m20j77l85l70J99J050J812K227K134J674J257J061R19
56441B26249P98Q58Q67L57l96m89J65M65k11j020j006m98k84k97j04M1l02p50
56423B24443o32j12J54Q3J9JJ3N00J614K424J888L29r81j382j124n02L26Q84P96
56404B28741M79N48Q17P07L39K72M61M42K74L26M01R3k43j7M06J77n53q11m24
56385B32435j36j73M2N59N51k83j113j172o60p1N14J078J450J766K451L437M077
56368B44752M023L510K669J403J33k27N52J589J972J658J130P37O48Q20R00O95
$$ plain form
56490 206130 204704 202782 200766 199433 199127 199468 199770 199577 199006 198777 199658 201619 203779 205391 206502 207435
56474 207435 208195 208828 209840 211599 213632 215109 215763 215872 215637 215205 214992 215329 215947 216415 216840 217491 217963
56457 217963 217540 216335 215268 214848 214671 214286 213916 214115 215165 216977 219204 221338 223012 224269 225330 226249
56441 226249 227047 227905 228772 229129 228733 228244 228409 228874 228663 227643 226637 226139 225855 225558 225454 225495 225193 224443
56423 224443 223811 223699 223853 223936 223955 223956 223969 224469 226083 228507 230395 230724 229743 228361 227237 226735 227061 227945 228741
56404 228741 229220 229768 230585 231292 231631 231903 232364 232806 233080 233406 233807 233900 233657 233640 234046 234223 233670 232859 232435
56385 232435 232299 232126 232168 232727 233278 232995 231882 230710 230050 229979 230493 231571 233021 234787 237238 240675 244752
56368 244752 248775 252285 254954 256357 256490 256263 256815 258404 260376 262034 263164 263901 264549 265369 266269 266964
56352B66964O74J325K136K172J588J420J772J564M18m41L9J213J764J487J144
56337B85239J175J501K135L168M264M797M468L549K659K424K985L725L898L602
56323C29589L560L888L778K645R58m48j218j368r60l41j16m29p02m52J27O35J008
56306C40154J299J429J542K027K871L536L780M000M445M709M467M091L976L881
56292C86207L509L180L273L437L149K710K946M013N214O001O536P097P493P434
56278D52199P215P534Q609R760J0215J0147J0478J1593J2900J3900J4945J6377
56266E85872J7600J7979J8186J9528K2095K4701K6704K8803L1773L5486L9551
56255H68278M3991M8921N4305O0478O8098P7235Q7188R7547J08605J20297J31610
$$ plain form
56352 266964 267638 268963 271099 273271 274859 276279 278051 279615 280033 279592 279631 280844 282608 284095 285239
56337 285239 286414 287915 290050 293218 297482 302279 306747 310296 312955 315379 318364 322089 325987 329589
56323 329589 333149 337037 340815 343460 344418 343970 342752 341384 340424 340083 339967 339538 338836 338384 338511 339146 340154
56306 340154 341453 342882 344424 346451 349322 352858 356638 360638 365083 369792 374259 378350 382326 386207
56292 386207 389716 392896 396169 399606 402755 405465 408411 412424 417638 423639 430175 437272 444765 452199
56278 452199 459414 466948 475557 485317 495532 505679 516157 527750 540650 554550 569495 585872
56266 585872 603472 621451 639637 659165 681260 705961 732665 761468 793241 828727 868278
56255 868278 912269 961190 1015495 1075973 1144071 1221306 1308494 1406041 1514646 1634943 1766553
56244A766553J41698J50842J59475J66804J71196J71694J68443J61795J51591
56235C210091J37329J18633R5572O8815L9562R338k0193m7581p2055r3595j12176
56224C333740j27250j38229j45230j48830j49442j47568j44150j39865j34332
56215B058844j26993j18516j10273j02589r4724q6514p8884p2460o6815o1300
56205A139776n5734n0125m4664m0018l6670l3927l0669k7020k4010k1686j9071
56194G56182j6133j4143j3631j3520j2865j1925j0912r238o853m939m319m316
56182F33388m053l708l613l361k673k069j806j251j59O15N51M39R52J456J278
56167F15986J017J445K132K394K613L416M414M935N246N889O598O952P373Q395
$$ plain form
56244 1766553 1908251 2059093 2218568 2385372 2556568 2728262 2896705 3058500 3210091
56235 3210091 3347420 3466053 3561625 3630440 3670002 3679340 3659147 3611566 3539511 3445916 3333740
56224 3333740 3206490 3068261 2923031 2774201 2624759 2477191 2333041 2193176 2058844
56215 2058844 1931851 1813335 1703062 1600473 1505749 1419235 1340351 1267891 1201076 1139776
56205 1139776 1084042 1033917 989253 949235 912565 878638 847969 820949 796939 775253 756182
56194 756182 740049 725906 712275 698755 685890 673965 663053 653815 646962 642023 637704 633388
56182 633388 629335 625627 622014 618653 615980 613911 612105 610854 610695 611310 611861 612300 613252 614708 615986
56167 615986 617003 618448 620580 622974 625587 629003 633417 638352 643598 649487 656085 663037 670410 678805
56153F78805R653J0599J1565J3087J4950J6787J8861K1421K4142K7079L1223L7149
56141I15321M3992N0687N7206O3600O8979P2536P4413P4394P1025O3597N4050
56130A609800M5422L9199L5445L4262L5213L6056L4031K8394K0534J2079M121
56119A934556k392p071j0754j4802k0143k7548l7748n0078o1900p0624p5564p6960
56107A478972p4510o8326o0122n1790m3683l5739k9048k4551k1119j6970j2263
56096A040851q506o148m449l082k007m69K028M292M861M356M637O072P345P617
56082A057398P271O912P049Q215J0080J1142J0713J0306J1538J3675J4963J5268
56070A184530J5546J5709J5112J4244J3978J3974J3743J4133J5757J7128J6776
$$ plain form
56153 678805 688458 699057 710622 723709 738659 755446 774307 795728 819870 846949 878172 915321
56141 915321 959313 1010000 1067206 1130806 1199785 1272321 1346734 1421128 1492153 1555750 1609800
56130 1609800 1655222 1694421 1729866 1764128 1799341 1835397 1869428 1897822 1918356 1930435 1934556
56119 1934556 1932164 1925093 1914339 1899537 1879394 1851846 1814098 1764020 1702120 1631496 1555932 1478972
56107 1478972 1404462 1336136 1276014 1224224 1180541 1144802 1115754 1091203 1070084 1053114 1040851
56096 1040851 1032345 1026197 1021748 1018666 1016659 1016190 1018218 1022510 1027371 1031727 1036364 1042436 1049781 1057398
56082 1057398 1064669 1071581 1078630 1086845 1096925 1108067 1118780 1129086 1140624 1154299 1169262 1184530
56070 1184530 1200076 1215785 1230897 1245141 1259119 1273093 1286836 1300969 1316726 1333854 1350630
56059A350630J6006J6960J9050K0068K0036K0876K2836K4195K4317K4244K4365
56048A583583K4049K3461K3379K3557K3383K3640K5161K6585K6115K4793K5234
56037A852940K7673L0178L2117L4324L6365L6947L6861L8317M1397M4103M5739
56026B256961M7294M8688M8812M8173M8510M9946N1320N2991N6188O0059O2647
56015B831589O4360O7259P1400P5238P9006Q4098Q9720R3847R6953J01025J05651
56004C760146J09055J12174J17377J23953J29396J34444J41927J51328J59516
55995D939316J66416J74812J85017J95052K05542K18809K33718K47342K61127
55986F827151K79175L00948L22396L43758L69129L98601M28472M59108M94735
$$ plain form
56059 1350630 1366636 1383596 1402646 1422714 1442750 1463626 1486462 1510657 1534974 1559218 1583583
56048 1583583 1607632 1631093 1654472 1678029 1701412 1725052 1750213 1776798 1802913 1827706 1852940
56037 1852940 1880613 1910791 1942908 1977232 2013597 2050544 2087405 2125722 2167119 2211222 2256961
56026 2256961 2304255 2352943 2401755 2449928 2498438 2548384 2599704 2652695 2708883 2768942 2831589
56015 2831589 2895949 2963208 3034608 3109846 3188852 3272950 3362670 3456517 3553470 3654495 3760146
56004 3760146 3869201 3981375 4098752 4222705 4352101 4486545 4628472 4779800 4939316
55995 4939316 5105732 5280544 5465561 5660613 5866155 6084964 6318682 6566024 6827151
55986 6827151 7106326 7407274 7729670 8073428 8442557 8841158 9269630 9728738 10223473
55977A0223473N35505N78169O24616O80866P47397Q19933R00073R95101J106916
55968A7212049J232080J373684J541703J741105J972530K245928K580272K989213
55960C2888564L482849M085676M837016N773962O934530Q378777J0181347J2396227
55952H8958948J5050962J8175198K1797430K5890477L0304428L4648614L8055936
55945B72881993L9025385L5791910K7337147J4369707o61782j4685577k5394726
55938C48664057l1922469l4613695l4408295l2341329k9283008k5844966k2399783
55931A37850512j9162892j6257246j3731539j1575116r753472q232088o971871
55924E2166288n926318n056031m335496l740850l243648k821917k465708k166432
$$ plain form
55977 10223473 10758978 11337147 11961763 12642629 13390026 14209959 15110032 16105133 17212049
55968 17212049 18444129 19817813 21359516 23100621 25073151 27319079 29899351 32888564
55960 32888564 36371413 40457089 45294105 51068067 58002597 66381374 76562721 88958948
55952 88958948 104009910 122185108 143982538 169873015 200177443 234826057 272881993
55945 272881993 311907378 347699288 375036435 389406142 388744360 374058783 348664057
55938 348664057 316741588 282127893 247719598 215378269 186095261 160250295 137850512
55931 137850512 118687620 102430374 88698835 77123719 67370247 59138159 52166288
55924 52166288 46239970 41183939 36848443 33107593 29863945 27042028 24576320 22409888
55916B2409888j910672j688668j498786j338731j200589j078308r71829q80199
55908A1842106p98144p22729o56190n99152n47805n00359m59389m25213l93589
55899F739536l62573l35150l12428k90697k68008k47436k30840k15275j98669
55890D278460j83405j71090j59025j45183j31879j21376j12405j04114r8941r8241
55880B952801r9064r8302r6436r4405r0689q4512p8495p4938p2531o9423o6530
55869B027476o5137o4083o2114o0308n9519n8013n4263m9741m6482m4020m1142
55858A422654l8517l7171l6253l4560l2618l1276k9831k7550k5398k4489k4287
55847A080704k3869k3507k3515k3160k2163k1639k2194k2618k1831k0495j9438
$$ plain form
55916 22409888 20499216 18810548 17311762 15973031 14772442 13694134 12722305 11842106
55908 11842106 11043962 10321233 9665043 9065891 8518086 8017727 7558338 7133125 6739536
55899 6739536 6376963 6041813 5729385 5438688 5170680 4923244 4692404 4477129 4278460
55890 4278460 4095055 3923965 3764940 3619757 3487878 3366502 3254097 3149983 3051042 2952801
55880 2952801 2853737 2755435 2658999 2564594 2473905 2389393 2310898 2235960 2163429 2094006 2027476
55869 2027476 1962339 1898256 1836142 1775834 1716315 1658302 1604039 1554298 1507816 1463796 1422654
55858 1422654 1384137 1346966 1310713 1276153 1243535 1212259 1182428 1154878 1129480 1104991 1080704
55847 1080704 1056835 1033328 1009813 986653 964490 942851 920657 898039 876208 855713 836275
55836H36275j8140j6210j4681j4427j4578j3886j2461j1130j0197r783j0061j0455
55824F80266r993r005q985j0164j1083j1151j1535j2780j3537j2824j1562j0792
55812E46855j0121r004p840o827n492m202m255n501n922m574k895j987q48J326
55798D78713L259L718L487L560L210J699K08R3O60N00k21n80p09j047r40K15J261
55781D97086M28k582o825j1434j5408j7235j6254j3653j0965q434n846l639j993
55768C83246o6K322L543K132j011l869n698o789o951n919m478l575k987k167j646
55753C46087k124l007l360l681n166p700r932j0987j0884r763p932o230n213m430
55739B55678l366k500k401k541k154j588j639k065k045j565j240j177j122j287
$$ plain form
55836 836275 818135 801925 787244 772817 758239 744353 731892 720762 710565 700782 690721 680266
55824 680266 670273 661268 652283 642119 631036 619885 608350 595570 582033 569209 557647 546855
55812 546855 536734 527730 519890 513063 507571 503369 499114 493613 487691 483117 480222 478235 477387 478713
55798 478713 481972 485690 489177 492737 495947 497646 497854 497947 498607 499107 498886 498306 497597 496550 495610 495825 497086
55781 497086 497514 494932 488107 476673 461265 444030 427776 414123 403158 394724 388878 385239 383246
55768 383246 383180 385502 389045 391177 390166 386297 380599 373810 366859 360940 356462 352887 349900 347733 346087
55753 346087 343963 340956 337596 333915 328749 321049 311117 300130 289246 279483 271551 265321 260108 255678
55739 255678 252312 249812 247411 244870 242716 241128 239489 237424 235379 233814 232574 231397 230275 228988
55725B28988k030l061l871m510n162n489n170m506l806k838j634r18r18o61O16
55710A85030K231L271M042N144O046N808M575L108J524l38j971k886l544m503
55696B07537n317n400n220n408n431m526l253k698k700k289j340m70K29J002J468
55681A66184J212R58J758L339M471M574L847K340L00j170j324j161k062l466l587
55666A76213k182q05m15m69m82p34j064o16P02J763J799J363J223J345J416J433
55650A80490J404J162Q37P88Q90N88j97r05j177j194j139j056j205j870k720l092
55634A71604k920k809l223m138n280o097n764m085k112j115j081j054o41k43p7
55619A30965P7K08J10l8M2j3o64j466j567j075r01j321j759j923k094k254k054
$$ plain form
55725 228988 226958 223897 220026 215516 210354 204865 199695 195189 191383 188545 186911 185993 185075 184414 185030
55710 185030 187261 190532 194574 199718 205764 211572 216147 219255 220779 220441 218470 215584 212040 207537
55696 207537 202220 196820 191600 186192 180761 176235 172982 170284 167584 165295 163955 163485 163714 164716 166184
55681 166184 167396 168354 170112 173451 177922 182496 186343 188683 188983 187813 186489 185328 183266 179800 176213
55666 176213 174031 173226 172811 172342 171860 171126 170062 169446 170148 171911 173710 175073 176296 177641 179057 180490
55650 180490 181894 183056 183893 184681 185571 186159 185962 185057 183880 182686 181547 180491 179286 177416 174696 171604
55634 171604 168684 165875 162652 158514 153234 147137 141373 137288 135176 134061 132980 131926 131285 131042 130965
55619 130965 131042 131250 131360 131322 131364 131351 130687 129221 127654 126579 125678 124357 122598 120675 118581 116327 114273
55602A14273j664j616j739j335n30k92q95j447j299q72p24p20n64l64k26oJ69
55585A00149j50q93j253o95L94J381K105K594K670K263J775J739K340L429M690
55570A22538N761O428O710O571N741M195K534J371N71l69j462k311k865l354l738
55555A48321l841l855m035m103l725l350l686m424m410l211j730j052j316j842
55541A03741j994j682j345j341j325o18O04J260R13N22R09J424J178O86R11J422
55525A05265J054Rm42j68l81j524k547k587k046j561j120o24k57J00Q46J843K447
55508I8307K494K273J612Q9j775k762k536j894j367p85l31n86j261j296n61j18
55492H9503m33p11m91m90j157j777j706j349j116n77M41J066N90l94r15q75o50
$$ plain form
55602 114273 112609 110993 109254 107919 107389 107097 106202 104755 103456 102584 101860 101140 100576 100212 99986 99980 100149
55585 100149 99999 99106 97853 97158 97552 98933 101038 103632 106302 108565 110340 112079 114419 117848 122538
55570 122538 128299 134727 141437 148008 153749 157944 160478 161849 162420 162051 160589 158278 155413 152059 148321
55555 148321 144480 140625 136590 132487 128762 125412 121726 117302 112892 109681 107951 106899 105583 103741
55541 103741 101747 100065 98720 97379 96054 95436 96040 97300 98213 98735 99644 101068 102246 102932 103843 105265
55525 105265 106319 106328 105886 105718 105337 103813 101266 98679 96633 95072 93952 93328 93071 93171 94017 95860 98307
55508 98307 100801 103074 104686 104775 103000 100238 97702 95808 94441 93656 93325 92739 91478 90182 89621 89503
55492 89503 89070 88359 87868 87378 86221 84444 82738 81389 80273 79696 80137 81203 81793 81399 80484 79609 78959
55475G8959l22%q6n11n23J04N37J90l22l07j17l40p05p16n93p07p49l65R6J98
55455G3721J94L90M45P7j76J96P09O02lm93p48r26q03k12L69M90M97Q63J297J317
55435G7806J157J236J255P09j15n91p72j034j167p99l92o97j373j307k61P41Q93
55418G5289N27L26M03N18O52R52J287J291P78Ln92q86j151j499j549j077o44q70
55400G3758j278q25M06J134O89j80p05j113j632j644p62K19M45L07O51J280J381
55383G2131R00M73L39K30O8q0m12r93j324j009m23k4M12J100J374N63p56j417
55365G1152j218q06l71L79J165J282P79M16M16K53k61n82m21k33m65r14j079o98
55347F8794R8Q08Q06pr26j201q32k23M43R92R41J76n11m29k0o6l21n2N16N22L6
$$ plain form
55475 78959 78637 78637 78551 78040 77517 77621 78158 78348 78026 77719 77602 77262 76557 75841 75248 74541 73792 73427 73523 73721
55455 73721 73915 74305 74750 74827 74651 74847 75556 76158 76155 75662 74914 73988 73185 72973 73342 73832 74329 75192 76489 77806
55435 77806 78963 80199 81454 82163 82048 81457 80685 79651 78484 77685 77293 76596 75223 73916 73655 74396 75289
55418 75289 75816 76142 76545 77063 77715 78667 79954 81245 82023 82026 81434 80548 79397 77898 76349 75272 74628 73758
55400 73758 72480 71655 72061 73195 73884 73704 72999 71886 70254 68610 67848 68067 68512 68819 69470 70750 72131
55383 72131 73031 73504 73843 74073 74141 74061 73649 72656 71332 70323 69900 69876 70288 71388 72762 73325 72569 71152
55365 71152 69934 69128 68757 69136 70301 71583 72362 72778 73194 73447 73186 72604 72183 71950 71485 70571 69492 68794
55347 68794 68892 69700 70506 70499 69573 68372 67540 67317 67760 68752 69693 69869 69358 68929 68909 68843 68522 68470 68986 69508 69544
55326F9544K0O90J189J019O28L65n1o67r70q08o62o69k78O26J237J048O53P30
55308G3644R06M68l24n33Q1P19O06j23p16o97k72J00L26O70J101J082L43n69q76
55289G5936n16m0J74J50j4j74o1L31M75No21p61n65o16r22j026q84p49m47K78
55269F9953Q91O89J73N65J860K575J862O53K09N08P68O65L87R2n5J51N07M29j53
55250H2729n73m59k75m29o04n50p01j286j558q16K69L63p16j790j861j055p0O47
55232G1265R75R62Q06P21P12O29M55L31L05K79J37j83o78j142j223p86j43K78
55214G3700L64L58M96P71R86R53O55K60p1k96l77j92K56O94Q41P28N13J95k36
55195H0598n53n89n81p85r40o07J07P05J039J306J368Q34j27p89q50p77r76j258
$$ plain form
55326 69544 69564 70254 71443 72462 73090 73455 73404 72737 71767 70959 70297 69628 69350 69976 71213 72261 72914 73644
55308 73644 74550 75018 74694 74161 74242 74961 75567 75444 74728 74031 73759 73859 74185 74855 75956 77038 77381 76812 75936
55289 75936 75420 75380 75554 75704 75690 75516 75455 75786 76261 76266 75645 74884 74319 73703 72781 71755 70871 70122 69675 69953
55269 69953 70844 71533 71706 72271 74131 76706 78568 79221 79430 79938 80706 81371 81758 81850 81795 81946 82453 82882 82729
55250 82729 82156 81697 81422 80993 80389 79839 79138 77852 76294 75478 75747 76110 75394 73604 71743 70688 70618 71265
55232 71265 72240 73202 74008 74729 75441 76070 76525 76856 77161 77440 77577 77394 76716 75574 74351 73565 73422 73700
55214 73700 74064 74422 74918 75689 76675 77628 78283 78543 78472 78176 77799 77607 77863 78557 79398 80126 80639 80834 80598
55195 80598 80045 79456 78875 78090 77150 76543 76650 77355 78394 79700 81068 81902 81775 80986 80136 79359 78383 77125
55177G7125j310j116o42K09J104J326P32N3j16k4j25l24l31k37j88N1O25J076
55159G7888R54N83O37J116J346R48K80j06p4O3q2n84j054j007m78l9n4k60k28
55140G9849K5K13K27J42j0j82k44k07k40l31k04J60L11j9l99k53L46Q22R14Q42
55120H1762P91O62L94J99L05O31P95M94q0l47j6M42L83o8j97J65L36j03n89m31
55100H5528J79N74O76Q91J227J204O57N7r1J86N16O28N49N32P68J062R28K45m07
55081I5909l72K31O46M10k07o82q60q82q15n40K8P23J218J324J113P29J97l97
55063I7773o91l06O05J342J344P10l6m82n83n97q28j258j482j207p58o66q55o89
55045I1336K4O97P47K98k16o24q77p17l4P48R90N04l61j099j358j093n77j55J46
$$ plain form
55177 77125 75815 74699 74057 74266 75370 76696 77428 77481 77365 77341 77216 76892 76561 76324 76136 76187 76812 77888
55159 77888 78842 79425 80062 81178 82524 83472 83752 83646 83572 83635 83553 82969 81915 80908 80430 80391 80337 80077 79849
55140 79849 79874 80087 80314 80456 80446 80264 80020 79813 79573 79242 79038 79198 79509 79490 79091 78838 79184 80006 80920 81762
55120 81762 82553 83215 83609 83808 84113 84744 85539 86033 85953 85606 85590 86032 86415 86347 86150 86315 86651 86548 85959 85528
55100 85528 85707 86281 86957 87848 89075 90279 90936 90993 90902 91088 91604 92232 92781 93313 94081 95143 96071 96316 95909
55081 95909 95537 95768 96414 96824 96617 95935 95075 94193 93378 92838 92866 93589 94807 96131 97244 97973 98170 97773
55063 97773 97082 96776 97381 98723 100067 100777 100741 100259 99676 99079 98251 96993 95511 94304 93546 92880 92025 91336
55045 91336 91360 92057 92804 93102 92886 92262 91385 90668 90634 91382 92372 92876 92515 91416 90058 88965 88388 88233 88379
55026H8379M30N14P1o61r51n40L7L37N49Q52R06N36K29L29L73J5m8Q67J924J611
55006I5759jj086m86Q30J207L49p41j242j122n91K11R78J266R77N70N18P29P48
54988I8873M54K60M55O24J54q14j401j187q15j095j836k067j205L63J736K210
54972I4709J668O46k5K6M47P61R22J055R49M16j78k95n3k5k62j88L79P84M27m35
54952A01728j052j096p60l21J00M20O19P58Q31O52J01n40p69m22Q0J66j98m28
54934I9869L2J019J799J859J344O65l3q05j458j570r49P0R17J282J338J497K024
54917A08900K845L740M619N477O192O540O391N677M367K677J129l5j352l352n392
54902A48423o063n070l811l567l873l490k371j703k128k981l320k905j964p47
$$ plain form
55026 88379 88809 89323 89394 88733 87782 87242 87279 87616 88165 89017 89923 90459 90688 91017 91390 91405 91357 92224 94148 95759
55006 95759 95758 94672 94186 95016 96223 96572 95831 94589 93467 92876 93087 94065 95331 96308 96878 97396 98125 98873
54988 98873 99327 99587 100042 100666 100820 100006 98605 97418 96603 95508 93672 91605 90400 90763 92499 94709
54972 94709 96377 97023 96998 97024 97471 98232 99154 100209 101158 101574 101396 101101 101048 101023 100761 100573 100952 101736 102163 101728
54952 101728 100676 99580 98820 98499 98599 99019 99638 100396 101227 101879 101980 101440 100671 100249 100329 100495 100297 99869
54934 99869 99901 100920 102719 104578 105922 106587 106554 105749 104291 102721 101772 101842 102759 104041 105379 106876 108900
54917 108900 111745 115485 120104 125581 131773 138313 144704 150381 154748 157425 158554 158519 157167 153815 148423
54902 148423 142360 137290 133479 129912 126039 122549 120178 118475 116347 113366 110046 107141 105177 104430
54888A04430L38P23K64l92l92M84J681K401K251J500Q74R00J475K113K527K768
54872A23945K973L261L874M964O149O589N712L777J626k4j035j721k472l459m591
54857A49568n595o068n655m419k991k031j567j199q91j092j911k693k763k198
54843A08495j561j135q05m33m3K21J36k95n51j18O08N65m35j223q75o0M5n36q82
54824A01118p77p92r99q01j20L57K96J90M15O76P40Q58J113J035L88k32j60M21
54806A03726Q18P34M38K54K56L62M23L53J90m4m93j182j641j302k52P98J334J437
54788A06209J354J253J371J841K177J604J40j193j532j058m34J9K56J68j26j14
54772A11935N38J448K030K198K231K231K183K229K486K737K776K871L459M492
$$ plain form
54888 104430 104768 105491 105755 105363 104971 105455 107136 109537 111788 113288 114162 115062 116537 118650 121177 123945
54872 123945 126918 130179 134053 139017 145166 151755 157467 161244 162870 162846 161811 160090 157618 154159 149568
54857 149568 143973 137905 132250 127831 124840 122809 121242 120043 119152 118060 116149 113456 110693 108495
54843 108495 106934 105799 104994 104561 104518 104739 104875 104580 104029 103911 104519 105084 104649 103426 102551 102491 102536 102000 101118
54824 101118 100341 99549 98550 97749 97629 97986 98282 98472 98887 99563 100303 101161 102274 103309 103697 103465 103305 103726
54806 103726 104544 105278 105716 105970 106226 106588 107011 107364 107554 107510 107017 105835 104194 102892 102640 103438 104772 106209
54788 106209 107563 108816 110187 112028 114205 115809 115949 114756 113224 112166 111732 111751 112007 112175 112049 111935
54772 111935 112473 113921 115951 118149 120380 122611 124794 127023 129509 132246 135022 137893 141352 145844
54758A45844N504O152O243N433L474Q09j547k939l630m234m929n359n186m500
54744A41135l700l125k795k553k340k218k144j874j259n55k84o69j310j513r49
54729A13847K0O90O74J95j74Q7J117K489L426L474L092L156L856M516M645M557
54713A49667M617M493L741K648J707N83j481m214o196o392n269m083l641l847
54699A32333m060l651k527j273n38l46l22l62o02q91r21q00q77j050r41o71p20
54682A11781r91q82l38M3M9J04K89J35k63o4Q66J384P35k71n57l73n26q37n68
54663A09716J07L27l0k73j89k67o13o68k23J58J4m19p18p64n17J21Q81J159P54
54644A08556K15J18L54M43K55L8j00l64p99r35k33J073J875J320r8j047r56n35
$$ plain form
54758 145844 151348 157500 163743 169176 172650 173459 171912 168973 165343 161109 156180 150821 145635 141135
54744 141135 137435 134310 131515 128962 126622 124404 122260 120386 119127 118572 118288 117619 116309 114796 113847
54729 113847 113867 114557 115231 115426 115252 115339 116456 118945 122371 125845 128937 132093 135949 140465 145110 149667
54713 149667 154284 158777 162518 165166 166873 167456 165975 161761 155565 149173 143904 139821 136180 132333
54699 132333 128273 124622 122095 120822 120284 119938 119616 119254 118652 117761 116840 116040 115163 114113 113172 112501 111781
54682 111781 110790 109908 109570 109613 109662 109766 110055 110190 109927 109863 110729 112113 112848 112577 112020 111647 111121 110284 109716
54663 109716 109823 110150 110120 109847 109658 109391 108778 108110 107887 108045 108059 107640 106922 106158 105641 105762 106643 107802 108556
54644 108556 108771 108889 109243 109686 109941 109979 109879 109515 108716 107781 107548 108621 110496 111816 111718 110671 109715 109180
54626A09180n19o73m13J59N79Q84J346J666J242K28n19o10n56q39j190j048l18
54609A08599O30J318J353O50l48r51r18o23m04j53K96P20Q09P17Q48J166J081
54592A14790K27q64j243o44J62L10j44m81l93k78n02q57r35o37j49K36J45n20
54574A08223j106o56Q03K021K029J294Q71R28Q85N73L71L81K83L8n6K4m4l25n63
54555A15974p16r99j288j145n07J83O26Q74Q89M70j37k22M75J329J585J196O66
54538A19253M22N44Q10Q22L73j69j70M42J038J092P08K30k37o96j004j088j125
54521A21245j321j583j601j107j39P55P87j49r82n76P18J388P80q7j19L63M43
54504A18815J40J64N13M19l77j143j159n49J49O60R50R43O26J77k12m57m69j47
$$ plain form
54626 109180 108661 107988 107575 107734 108313 109197 110543 112209 113451 113679 113160 112550 111994 111155 109965 108917 108599
54609 108599 109229 110547 111900 112550 112202 111251 110333 109710 109306 109153 109449 110169 110978 111695 112543 113709 114790
54592 114790 115017 114153 112910 112266 112428 112738 112594 112113 111720 111442 110940 110083 109148 108511 108362 108598 108743 108223
54574 108223 107117 106461 107264 109285 111314 112608 113479 114407 115292 115865 116236 116617 116900 116938 116882 116906 116862 116537 115974
54555 115974 115258 114259 112971 111826 111319 111502 112128 113002 113891 114361 114224 114002 114477 115806 117391 118587 119253
54538 119253 119675 120219 121029 121851 122224 122055 121885 122327 123365 124457 125165 125395 125158 124462 123458 122370 121245
54521 121245 119924 118341 116740 115633 115494 116249 117036 116887 115905 115329 116047 117435 118215 118128 118009 118372 118815
54504 118815 118955 119119 119632 120051 119674 118531 117372 116823 116972 117632 118582 119525 120151 120328 120116 119659 119190 119043
54486A19043K96L65j39p42q10l00K48M11K33n0k95l21J29R75J627J522Q27K42
54468A23261K11N99J114J636K059K180J931J437P45j56r14q70P9J096J292P28
54452A36428J18k13n13r10j113q45k51K29J86m37j115j114l68K61J06l33r5P53
54434A30774J209P75K6m02n40n82l88R0M47L06j83o55r46r77n95J06P05R26R17
54415A31013Q97R02R62J069Q80J0j152j589r53r9J26o7k9K50M31O25J098J544
54397A35918J499J252J505K157K351J740R05L70n3n55o82M9J226J810J246m3j173
54380A49522j626j487j099o60j94K00L57L36M29P32R53R07R00J218J509J178L62
54363A53537p9L35J135J577J534J411J536J893K326K651K724K575K438K417K268
$$ plain form
54486 119043 119339 119704 119565 118823 118013 117713 117961 118372 118605 118555 118260 117939 118068 119043 120670 122192 123019 123261
54468 123261 123472 124071 125185 126821 128880 131060 132991 134428 135173 135017 134103 133233 133312 134408 135700 136428
54452 136428 136546 136333 135820 134910 133797 132952 132701 132930 133116 132679 131564 130450 130082 130343 130449 130116 130021 130774
54434 130774 131983 132758 132784 132382 131842 131260 130872 130962 131409 131715 131532 130877 129931 128954 128359 128465 129170 130096 131013
54415 131013 131910 132812 133774 134843 135723 135733 134581 132992 132039 131940 132066 131999 131970 132220 132651 133276 134374 135918
54397 135918 137417 138669 140174 142331 144682 146422 147327 147697 147644 147089 146407 146456 147682 149492 150738 150695 149522
54380 149522 147896 146409 145310 144650 144456 144656 145013 145349 145778 146510 147463 148370 149270 150488 151997 153175 153537
54363 153537 153458 153793 154928 156505 158039 159450 160986 162879 165205 167856 170580 173155 175593 178010 180278
54348A80278J696Q30P9m75j238k441l556l767l059k393k531l006k775j779j173
54333A54690j802k981l298k354j086m75n28o25m62k34j57j89k36l36n12n56k38
54316A38621K83M89J22m07n20k88k79o24p56l56J5k79r01r83m19J2p1p0N57J295
54296A35441J246M45j86j24J12j57q43j320j291r84o62l70j63j25j08J69N91O47
54278A32318K64K03J125K547L249K728J611O72M8m10o56o55n94n39k05N61J427
54261A43694K012K292K314J908J154O30O68P54L20k48j94K67K01n65j138r86o73
54244A52410q06j068r48o86p58r41o65j6L76L12J32j01o95j532j811j034K35R38
54226A43342O06l55j161j202l88O98J230R81N92P11J087R37O5q88j307j236j005
$$ plain form
54348 180278 181974 182804 182883 182408 181170 178729 175173 171406 168347 165954 163423 160417 157642 155863 154690
54333 154690 152888 149907 146609 144255 143169 142694 142166 141541 141079 140845 140688 140499 140263 139927 139415 138859 138621
54316 138621 138904 139393 139515 139108 138588 138300 138021 137397 136641 136285 136300 136021 135120 134137 133718 133730 133659 133589 134146 135441
54296 135441 136687 137132 136946 136822 136934 136777 135934 134614 133323 132339 131677 131307 131144 131019 130911 131080 131671 132318
54278 132318 132582 132785 133910 136457 139706 142434 144045 144717 144765 144355 143699 143044 142450 141911 141706 142267 143694
54261 143694 145706 147998 150312 152220 153374 154004 154672 155426 155746 155498 155304 155571 155772 155207 154069 153083 152410
54244 152410 151604 150536 149588 148902 148144 147203 146538 146522 146898 147210 147342 147241 146546 145014 143203 142169 142404 143342
54226 143342 143948 143593 142432 141230 140842 141540 142770 143751 144343 145054 146141 147078 147143 146255 144948 143712 142707
54209A42707p26m21k44k43j84L8N7l93q55o20J36M18k57j090r80M1Q78P57N6k97
54189A38778K9M78L74k65p99p48l27r2k39n29p88j059j198q02K57J426J987J745
54171A38228J049K64m23q03o38J5P28J049Q47L39j66m68n45m64k52N7L39M22K93
54152A39871J00j2N6M19J053J497J111j84j606k231j804p78J96O78O32M66O88
54135A40152J243J479J042L82L6k05p82j305q70N45J692J489L14m84j13R84J830
54118A47429J939J589J260R55L28n55j000n46L40Q60R82J288J817J799P49p49
54102A58485j676j568o96L51R88R56N93N40R04J095O74n6n82q04p68k57P41J544
54084A60464J441O66P0m1o3j50Q7Q17J582K060K595L588M745N499N836O192O659
$$ plain form
54209 142707 141981 141560 141316 141073 140889 140927 140984 140591 139736 139116 139252 139670 139413 138323 137343 137384 138262 139019 139075 138778
54189 138778 138807 139285 139659 139394 138595 137847 137520 137428 137189 136660 135872 134813 133615 132813 133070 134496 136483 138228
54171 138228 139277 139541 139118 138315 137677 137692 138420 139469 140316 140655 140489 140021 139476 139012 138760 138817 139156 139578 139871
54152 139871 139971 139959 140015 140434 141487 142984 144095 143911 142305 140074 138270 137492 137688 138366 138998 139464 140152
54135 140152 141395 142874 143916 144298 144334 144129 143347 142042 141172 141717 143409 144898 145212 144728 144615 145599 147429
54118 147429 149368 150957 152217 153172 153500 152945 151945 151399 151739 152599 153581 154869 156686 158485 159234 158485
54102 158485 156809 155241 154545 154896 155884 156840 157433 157973 158877 159972 160646 160590 160008 159204 158436 158179 158920 160464
54084 160464 161905 162571 162641 162600 162537 162387 162474 163291 164873 166933 169528 173116 177861 183360 189196 195388 202047
54067B02047O811O290N069L123M00k600m696m985l882k795k720l415m016m017
54053A90614l482k601j492l54N46J154J622J987K112K022K005K241K552K775L096
54038B04797L726M438M823M941N369O407P540P842O881N164L703L115L119K951
54024B74816K308J643J428J510J497J442J553J487O80n81j323j319j588k845m328
54009B76380m975n005n286n546m697k902j853k440l435l340k408j737j165L14
53995B31905K415L351K155pj450j938k368l185l949m213m066l820l642l509l279
53980B04400k807k175j677j433j197p81m01l61o05q43r58r78q52n82m03m50l67
53963A87530L39J623K848L425L204K356J271N20N14J075J690K088K323K347K007
$$ plain form
54067 202047 208858 215148 220217 223340 223740 221140 216444 211459 207577 204782 202062 198647 194631 190614
54053 190614 187132 184531 183039 182685 183231 184385 186007 187994 190106 192128 194133 196374 198926 201701 204797
54038 204797 208523 212961 217784 222725 228094 234501 242041 249883 256764 261928 265631 268746 271865 274816
54024 274816 277124 278767 280195 281705 283202 284644 286197 287684 288364 287783 286460 285141 283553 280708 276380
54009 276380 271405 266400 261114 255568 250871 247969 246116 243676 240241 236901 234493 232756 231591 231905
53995 231905 234320 237671 239826 239819 238369 236431 234063 230878 226929 222716 218650 214830 211188 207679 204400
53980 204400 201593 199418 197741 196308 195111 194330 193929 193568 192963 192120 191162 190184 189332 188750 188347 187897 187530
53963 187530 187869 189492 192340 195765 198969 201325 202596 203116 203630 204705 206395 208483 210806 213153 215160
53948B15160J515J433J946K564K851L059L683M601N145N007M708N017O063P213
53934B69965P789P826P987Q755R991J1344J2845J4669J6442J7186J6072J2981
53922D13852Q375L050j929n535p414p942p552o243m032j488O16J992K818L169
53908C91737K845J829N02o45j363j654j616j390j158j166j655k673l852m576m574
53893C70591m277m378n115o121o952p467p738p856p889p865p680p164o337n472
53879B78280m818m267l471k396j577j656k531l238k959k075j817k777m186m845
53865B35667m456l640k944k370j793j403j465j900k285k187j591j060j258k122
53851B05193k687k134r00j61l44p08n66k09k00m03l25n8j40n52o14oO67O20j83
$$ plain form
53948 215160 216675 218108 220054 222618 225469 228528 232211 236812 241957 246964 251672 256689 262752 269965
53934 269965 277754 285580 293567 302322 312313 323657 336502 351171 367613 384799 400871 413852
53922 413852 422227 425277 423348 417813 410399 402457 394905 388662 384630 383142 383758 385750 388568 391737
53908 391737 394582 396411 396913 396268 394905 393251 391635 390245 389087 387921 386266 383593 379741 375165 370591
53893 370591 366314 361936 356821 350700 343748 336281 328543 320687 312798 304933 297253 290089 283752 278280
53879 278280 273462 269195 265724 263328 261751 260095 257564 254326 251367 249292 247475 244698 240512 235667
53865 235667 231211 227571 224627 222257 220464 219061 217596 215696 213411 211224 209633 208573 207315 205193
53851 205193 202506 200372 199472 199311 198967 198259 197693 197484 197284 196881 196556 196498 196358 195806 195192 195186 195853 196473 196290
53832A96290j108j612j613j274p07L1Q17J345J288O50p1k75J16O21Q33Q75J148
53815A97354J735K270K285J744J229J493K559L454L184K047J461K341M141N731
53801B33028O675P150P103O263M828L490K666K297K268K537K780K594K131J924
53787B87734J986J723R63L17J59pn88j081j021j112k364m335n417m955m083m062
53771B63857m646m716l903k892k411k473k599k372j790j309j456k242l033l220
53757B24795k858k525k620l025l356l300k794k021j265o58j71J13j9m96p55l52
53741A98693L94P49N42L25M93O99M62n9k89k7M28Q19J188J527J675J643J665J745
53723B12672J489O83k90q68q72l78O03J868K794K904K503K166J805J049L84Q42
$$ plain form
53832 196290 195182 193570 191957 190683 189976 190007 190824 192169 193457 194107 194036 193761 193877 194498 195331 196206 197354
53815 197354 199089 201359 203644 205388 206617 208110 210669 214123 217307 219354 220815 223156 227297 233028
53801 233028 239703 246853 253956 260219 265047 268537 271203 273500 275768 278305 281085 283679 285810 287734
53787 287734 289720 291443 292406 292723 292882 292875 292287 291206 290185 289073 286709 282374 276957 272002 267919 263857
53771 263857 259211 254495 250592 247700 245289 242816 240217 237845 236055 234746 233290 231048 228015 224795
53757 224795 221937 219412 216792 213767 210411 207111 204317 202296 201031 200373 200202 200315 200296 199800 199045 198693
53741 198693 199087 199836 200378 200703 201196 201895 202357 202298 202009 201982 202410 203229 204417 205944 207619 209262 210927 212672
53723 212672 214161 214844 214554 213686 212814 212436 213039 214907 217701 220605 223108 225274 227079 228128 228512 229354
53707B29354K305L180K393R09M31J269K388L097L596L980L873L244K748K877L296
53692B68940L431L212K942K748K477J947J099O7q99j676k311k688k437j581r35
53677B74336j198j870j838r71k91m89j118j542j711j619r22K33P99J03j045j375
53661B59482q69n30o88o13J28R01Q93K03l90l30K98R81J209Q63K84r2j59j0M27
53642B61988J236K101K443K106J546J282J368J530J535J338J080J023J336J810
53628B83722K025J880J788K159K847L282L113K581K224K368K940L743M616N303
53614C24591N427M928M395M530N240N655N283M660M546M822M688L774K589J845
53600C86973J733J899J813J115j49j544k594l159l343l187k702k093j661j492
$$ plain form
53707 229354 231659 234839 237232 238141 238572 239841 242229 245326 248922 252902 256775 260019 262767 265644 268940
53692 268940 272371 275583 278525 281273 283750 285697 286796 286863 285964 284288 281977 279289 276852 275271 274336
53677 274336 273138 271268 269430 268459 268168 267679 266561 265019 263308 261689 260767 261000 261799 261902 260857 259482
53661 259482 258613 258083 257395 256782 256910 257811 258704 258907 258517 258187 258485 259466 260675 261538 261822 261730 261571 261561 261988
53642 261988 263224 265325 267768 269874 271420 272702 274070 275600 277135 278473 279553 280576 281912 283722
53628 283722 285747 287627 289415 291574 294421 297703 300816 303397 305621 307989 310929 314672 319288 324591
53614 324591 330018 334946 339341 343871 349111 354766 360049 364709 369255 374077 378765 382539 385128 386973
53600 386973 388706 390605 392418 393533 393384 391840 389246 386087 382744 379557 376855 374762 373101 371609
53586C71609j427j361j293j199j076j087j383j782j919j728j506j482j538j476
53572C51352j292j077q56o18l96k61k52l36l70j58L30Q89J284J445J348R55M65
53555C52452L52Q17J408J564J407J496J951K341K492K789L410L855L593K907K614
53540C85448L105M004M697M922M849M819N075N710O683P849Q987R922J0698J1493
53526D78261J2275J2716J2627J2295J2185J2448J2996J3805J4830J5766J6407
53515F26611J7064J8201J9699K1024K2050K3104K4169K4797K4982K5396K6329
53504H73426K7100K7003K6263K5433K4433K2931K1316K0405K0273K0192J9738
53493A128513J9235J8966J8662J8099J7627J7709J8287J8922J9284J9203J8619
$$ plain form
53586 371609 370182 368821 367528 366329 365253 364166 362783 361001 359082 357354 355848 354366 352828 351352
53572 351352 350060 348983 348127 347509 347113 346852 346600 346264 345894 345736 346066 346955 348239 349684 351032 351987 352452
53555 352452 352804 353621 355029 356593 358000 359496 361447 363788 366280 369069 372479 376334 379927 382834 385448
53540 385448 388553 392557 397254 402176 407025 411844 416919 422629 429312 437161 446148 456070 466768 478261
53526 478261 490536 503252 515879 528174 540359 552807 565803 579608 594438 610204 626611
53515 626611 643675 661876 681575 702599 724649 747753 771922 796719 821701 847097 873426
53504 873426 900526 927529 953792 979225 1003658 1026589 1047905 1068310 1088583 1108775 1128513
53493 1128513 1147748 1166714 1185376 1203475 1221102 1238811 1257098 1276020 1295304 1314507 1333126
53482A333126J7784J7227J7151J7022J6160J4515J2518J0332P841N282L204J592
53470A473754l67l236o456r076j0972j2714j4361j5224j5013j4504j4656j5518
53458A341657j6486j7227j7916j8750j9783k0999k2127k2535k1917k0944k0567
53447A122406k0706k0298j8840j7064j5788j4703j2898j0190p369n315m303l995
53435I70937l709k849j428l3R81J960L286M610N387N884O957Q821J0724J2040
53421A023568J2973J4012J5230J6485J7817J9225K0493K1651K3261K5662K8241
53410A238618L0044L1032L2145L4052L6422L8548M0219M1676M3202M5026M7347
53399A658331M9984N2234N3500N3980N4403N5137N5894N6363N6685N7122N7530
$$ plain form
53482 1333126 1350910 1368137 1385288 1402310 1418470 1432985 1445503 1455835 1463676 1468958 1472162 1473754
53470 1473754 1473387 1470151 1463695 1454619 1443647 1430933 1416572 1401348 1386335 1371831 1357175 1341657
53458 1341657 1325171 1307944 1290028 1271278 1251495 1230496 1208369 1185834 1163917 1142973 1122406
53447 1122406 1101700 1081402 1062562 1045498 1029710 1015007 1002109 991919 984550 979235 974932 970937
53435 970937 967228 964379 962951 962918 963899 965859 969145 973755 979142 985026 991983 1000804 1011528 1023568
53421 1023568 1036541 1050553 1065783 1082268 1100085 1119310 1139803 1161454 1184715 1210377 1238618
53410 1238618 1268662 1299694 1331839 1365891 1402313 1440861 1481080 1522756 1565958 1610984 1658331
53399 1658331 1708315 1760549 1814049 1868029 1922432 1977569 2033463 2089826 2146511 2203633 2261163
53388B261163N7417N6422N4667N2562N0372M7937M4902M1341L7878L4973L2210
53377B771844K8693K4120J8978J3696Q198K502k904p794j2894j9149k6522l3978
53365B764790m0577m5986n0075n2716n4186n5159n5996n6383n5891n4669n3275
53354B189877n1966n0412m8131m5186m2415m0787m0484m0789m1017m1193m1525
53343A705972m1610m0780l9028l6928l4733l2276k9680k7402k5409k3134k0482
53332A354510j8126j6492j5214j4019j3403j3809j4783j5599j6089j6270j5792
53321A184914j4533j3235j2514j1728r905p484n918n539n020l235o55J604L180
53308A099932M317N081N412N667O485Q187J0612J3317J5794J7768J9459K1204
$$ plain form
53388 2261163 2318580 2375002 2429669 2482231 2532603 2580540 2625442 2666783 2704661 2739634 2771844
53377 2771844 2800537 2824657 2843635 2857331 2865529 2868031 2865127 2857333 2844439 2825290 2798768 2764790
53365 2764790 2724213 2678227 2628152 2575436 2521250 2466091 2410095 2353712 2297821 2243152 2189877
53354 2189877 2137911 2087499 2039368 1994182 1951767 1910980 1870496 1829707 1788690 1747497 1705972
53343 1705972 1664362 1623582 1584554 1547626 1512893 1480617 1450937 1423535 1398126 1374992 1354510
53332 1354510 1336384 1319892 1304678 1290659 1277256 1263447 1248664 1233065 1216976 1200706 1184914
53321 1184914 1170381 1157146 1144632 1132904 1122999 1115515 1109597 1104058 1099038 1095803 1095148 1096752 1099932
53308 1099932 1104249 1109330 1114742 1120409 1126894 1135081 1145693 1159010 1174804 1192572 1212031 1233235
53296A233235K2873K4086K5054K6563K8713L0398L0517K9270K7681K6319K5026
53285A529735K3707K2506K1262J9402J6614J3248R851O533K981r87n026q438j0871
53272A640517j2693j4556j6635j8656k0544k2493k4293k5307k5522k5906k7138
53261A406774k8488k8818k8283k8094k8745k9478k9614k9424k9253k8677k7170
53250A090730k5175k3820k3783k4746k5843k6285k5812k4848k4060k3626k3084
53239H19648k2055k0806j9864j9305j8691j7500j5477j2822j0233q474p656p245
53227F39520o952p148q025q932r187r186r928j1613j3449j4732j5348j5206j4113
53214D95701j2526j1558j1650j1867j1103r548q257p663p240o563n947n873o338
$$ plain form
53296 1233235 1256108 1280194 1305248 1331811 1360524 1390922 1421439 1450709 1478390 1504709 1529735
53285 1529735 1553442 1575948 1597210 1616612 1633226 1646474 1656325 1662858 1665839 1664852 1659826 1651388 1640517
53272 1640517 1627824 1613268 1596633 1577977 1557433 1534940 1510647 1485340 1459818 1433912 1406774
53261 1406774 1378286 1349468 1321185 1293091 1264346 1234868 1205254 1175830 1146577 1117900 1090730
53250 1090730 1065555 1041735 1017952 993206 967363 941078 915266 890418 866358 842732 819648
53239 819648 797593 776787 756923 737618 718927 701427 685950 673128 662895 654421 646765 639520
53227 639520 632568 625420 617395 608463 599276 590090 580162 568549 555100 540368 525020 509814 495701
53214 495701 483175 471617 459967 448100 436997 427449 419192 411529 404289 397726 391779 385906 379568
53201C79568p006p596p889p702p160o797o988p381p217o240n094m583m736m836
53187B88343m298l272k315j727j464j470j737k079k214k069j778j356p85l43m57
53172B60979j042j421j235r16r71j106p28PK32l90j126j147n99l47q05j419j360
53155B46606n41K79L49k78r45j259j406j611j654j250o51m25p87j401j799j729
53139B31498j136j98O32R81R60R90J197J286J066P11L93J2n03q73p18l6P63J233
53121B38258J206Q68O09P46J267J838K073J802J148M35p3m28r02j541j975j902
53105B43429j509j170q40k53L50K71p49j989k441j825p71j30j82m65l36K29O05
53088B32224L89J6P0L33J40m94q79q40r78j476j543n86P01J220R14N87N58L76
$$ plain form
53201 379568 372562 364966 357077 349375 342215 335418 328430 321049 313832 307592 302498 297915 293179 288343
53187 288343 284045 280773 278458 276731 275267 273797 272060 269981 267767 265698 263920 262564 261779 261436 260979
53172 260979 259937 258516 257281 256365 255394 254288 253560 253567 253799 253409 252283 251136 250537 250190 249385 247966 246606
53155 246606 246065 246344 246693 246415 245470 244211 242805 241194 239540 238290 237639 237214 236427 235026 233227 231498
53139 231498 230362 230164 230796 231777 232737 233727 234924 236210 237276 237987 238380 238392 237889 237016 236298 236262 237025 238258
53121 238258 239464 240332 240941 241687 242954 244792 246865 248667 249815 250250 250177 249749 248847 247306 245331 243429
53105 243429 241920 240750 239910 239657 240007 240278 239529 237540 235099 233274 232503 232373 232191 231726 231390 231619 232224
53088 232224 232613 232629 232699 233032 233172 232678 231799 230959 229981 228505 226962 226376 227077 228297 229211 229798 230356 230732
53070B30732k62j011j412j368r99m84j78l91r29j210j011p24p44q99p45j56N31
53053B18740Q82O67m4q95j391j187l11Q38J687J797J138J26o65r30q04o74p85
53036B18189j016j075r03p83q96r64o38j05J37M3J21N98J034J006P78Q16J054
53019B17396J034O12R3j81p2L77Q91J070Q62P03Q71R85N57j77m97j62L75O46N94
53000B25977L47O1k8J76L45J32k00m6O03J059Q78L50o0k65k74j1L51L43o3j23
52980B29552O83J767K111J663J309J500J644J122L26J69Q77J757K131K001J730
52965B50342J436J024N72L70N54R77J350J375Q38n7o58n94m98j346l022m204m044
52948B44415l232k841k766k155j002k48l62p61p82m60r1K57M58J85m56p33j75
$$ plain form
53070 230732 230470 229459 228047 226679 225680 225196 225018 224627 223698 222488 221477 220753 220009 219110 218365 218209 218740
53053 218740 219622 220289 220245 219350 217959 216772 216461 217299 218986 220783 221921 222047 221382 220452 219648 218974 218189
53036 218189 217173 216098 215195 214412 213516 212552 211914 211809 211946 211989 212110 212708 213742 214748 215526 216342 217396
53019 217396 218430 219042 219135 218954 218882 219259 220150 221220 222082 222785 223656 224641 225198 225021 224524 224362 224737 225383 225977
53000 225977 226324 226385 226357 226533 226878 227010 226810 226764 227367 228426 229304 229654 229594 229329 229055 229044 229395 229738 229675 229552
52980 229552 230235 232002 234113 235776 237085 238585 240229 241351 241677 241846 242723 244480 246611 248612 250342
52965 250342 251778 252802 253374 253744 254298 255275 256625 258000 258838 258781 258123 257529 257031 255685 252663 248459 244415
52948 244415 241183 238342 235576 233421 232419 232171 231809 231048 230266 229806 229715 229972 230430 230615 230159 229426 229251
52931B29251O89Q97J72r54j807j998j445m32M00N16K4n02o68n25k57O6M15O19
52913B24461M63n9n93o70j73M56O53L37q4k90l51m32n05m75l57j59K05P05J003
52894B24135P76J04n39p61n55j92J43M56P26P54M60J84L54P83P97K52j33J63N97
52875B28504M47R0M54J433J877J304N84O14J124J375J296J312J493J481J008J20
52859B44516q25j127k56J249J926J009n14j174q52o78j348k363k905k787k393
52844B31478k165k305k673k844k561k002j443q60j93K71K52k5j24m4k7R0O63J481
52826B16969J855J520R03L65k01q62j340j522j715k106k344k040j303m65L61J093
52810B09168J427J234R70J196J838K319K327J980J368M69m25p78n64m85j063j879
$$ plain form
52931 229251 229940 230837 231009 230055 228248 226250 224805 224373 224773 225289 225313 224811 224143 223618 223361 223427 223842 224461
52913 224461 224924 224865 224272 223602 223429 223885 224538 224875 224791 224501 224150 223718 223213 222738 222381 222222 222427 223132 224135
52894 224135 224911 225015 224476 223715 223160 222968 223111 223567 224293 225047 225507 225691 226045 226828 227625 227877 227744 227907 228504
52875 228504 228951 229041 229495 230928 232805 234109 234693 235307 236431 237806 239102 240414 241907 243388 244396 244516
52859 244516 243691 242564 242308 243557 245483 246492 245978 244804 243952 243274 241926 239563 236658 233871 231478
52844 231478 229313 227008 224335 221491 218930 216928 215485 214625 214432 214703 214955 214930 214806 214762 214735 214825 215488 216969
52826 216969 218824 220344 221247 221612 221411 220549 219209 217687 215972 213866 211522 209482 208179 207714 208075 209168
52810 209168 210595 211829 212799 213995 215833 218152 220479 222459 223827 224296 223871 223093 222529 222044 220981 219102
52794B19102k123j720j323j336j455j313r82o39k20K14K49k61o92m02K59M02j03
52777B07657n46n42m57m09J50J374K321K040Q70p4l56l97n06n61n39o15o56k93
52759B08461L66P07M48lk21k78l43k42J74N39L43l00o39o0J196K275K561K243
52741B17227J924J801J550J027P22J166K153K922K937K225J192M84O71J555K028
52726B41584J280q9q00o54o58j381k149k175j643j167r15q32j161j986k690k556
52710B22008j682p45q5L69N44K34l49o60m35J52Q95J635K017J752J112O59M79
52693B27900K35l1J89Q88J199M67q26j642j550q57P1R63J376R09j52r34r00l42
52675B26963J36K87J71j64o34r85r93o88k38K56O67P93O72P22J180J569J216L47
$$ plain form
52794 219102 216979 215259 213936 212600 211145 209832 208850 208211 207991 208205 208454 208193 207501 207099 207358 207760 207657
52777 207657 207111 206569 206112 205703 205853 207227 209548 211588 212458 212384 212028 211631 211125 210564 210025 209410 208754 208461
52759 208461 208827 209534 209982 209979 209758 209480 209137 208895 209069 209608 209951 209651 209012 208952 210148 212423 214984 217227
52741 217227 219151 220952 222502 223529 224251 225417 227570 230492 233429 235654 236846 237330 238001 239556 241584
52726 241584 242864 242775 241975 241321 240663 239282 237133 234958 233315 232148 231233 230401 229240 227254 224564 222008
52710 222008 220326 219581 219496 219865 220409 220643 220294 219634 219199 219351 220246 221881 223898 225650 226762 227421 227900
52693 227900 228135 228104 228293 229181 230380 230847 230021 228379 226829 225972 226043 227006 228382 229291 229139 228205 227305 226963
52675 226963 227099 227386 227557 227393 226759 225774 224781 224093 223855 224111 224778 225571 226243 226965 228145 229714 230930 231277
52657B31277K5Q34K080K710K619K534K848L172L007K324J324M4j441k762l509
52642B47086l594l166k313j133k8M78L73K51N41Q74N82k83q71o27M1M66O80J154
52624B40511J851K123J658Q69J97m17j057j390j155p11n77o91o41m46n09q76j078
52607B37661q41m03MM85J113J587J563J118O67N18O19O43K99l03o61l98K17O09
52589B44497N90M57M30M26L88M03M07J75j98k72J28O75J124J658K304K569K110
52572B57871J302O34j09j296k392k357j143K5J54m44r43j187j474j663j369q08
52556B44801p20j247j607j181l77lj49k82k12l38q38j219r75l00K24L31J76j07
52538B35977m07l74L86J636K496K324J423O14L32L91N04O66R19J115J101J027
$$ plain form
52657 231277 231302 232136 234216 236926 239545 242079 244927 248099 251106 253430 254754 254798 253357 250595 247086
52642 247086 243492 240326 238013 236880 236852 237330 237703 237954 238495 239369 239951 239668 238797 238170 238211 238677 239357 240511
52624 240511 242362 244485 246143 247012 247209 246792 245735 244345 243190 242479 241902 241211 240570 240124 239615 238739 237661
52607 237661 236820 236417 236421 236906 238019 239606 241169 242287 242954 243472 244091 244734 245033 244730 244069 243671 243888 244497
52589 244497 245087 245544 245974 246400 246788 247191 247598 247773 247575 247303 247431 248106 249230 250888 253192 255761 257871
52572 257871 259173 259807 259698 258402 256010 253653 252510 252535 252689 252245 251302 250115 248641 246978 245609 244801
52556 244801 244081 242834 241227 240046 239669 239666 239517 239235 239023 238685 237847 236628 235653 235353 235577 235908 236084 235977
52538 235977 235570 235196 235582 237218 239714 242038 243461 244075 244407 244798 245302 245968 246887 248002 249103 250130
52522B50130J182J477J422P38j74o81o89o34p16n91j2O81J055J293J912K936L751
52505B63080L855L389K791K217J437K18j292k493k804k273j598j385j554j666
52491B61922j580j455j315j074r47j216j678j735j217o16l96m26k89J46O84J006
52475B49814R11N39L91P64J197R86K48r8M69J468K230K697L053L210L097K992
52459B73968L011K711J738N58j34l17m71p19q93j188k014l183l977m146m174m343
52443B56427m169l179j752p61n11n10k51R1k2o71j198r48o7O68P65L99o2m13l96
52424B43440K72J294J772J290O15P32J565K190K077J460P38K73N60J764L129L689
52408B66860L660M314O296Q764J0503J1158J1009J0180Q501N792K024k379o233
$$ plain form
52522 250130 251312 252789 254211 254949 254775 254094 253405 252771 252055 251464 251452 252133 253188 254481 256393 259329 263080
52505 263080 266935 270324 273115 275332 276769 276987 275695 273202 270398 268125 266527 265142 263588 261922
52491 261922 260342 258887 257572 256498 255551 254335 252657 250922 249705 249089 248693 248267 247978 248124 248808 249814
52475 249814 250725 251264 251655 252419 253616 254602 254850 254752 255221 256689 258919 261616 264669 267879 270976 273968
52459 273968 276979 279690 281428 281986 281852 281535 281064 280345 279452 278264 276250 273067 269090 264944 260770 256427
52443 256427 252258 249079 247327 246566 246055 245545 245294 245385 245363 244692 243494 242546 242479 243147 243912 244311 244249 243836 243440
52424 243440 243712 245006 246778 248068 248683 249415 250980 253170 255247 256707 257445 257718 258278 260042 263171 266860
52408 266860 270520 274834 281130 289894 300397 311555 322564 332744 341245 347037 349061 346682 340449
52395C40449q240q271p470o832o284n492m716m295l904l082k018j142l88M11R15
52380B79641Q08O09J078K065K798L120L498L948L931L377K909K915L209L776M855
52365C22537O091O467N550M010K548J129l10j233j293j015r46p64l2P52Q07L48
52349C44646K90Q74J500J793J946K078K139K411L256M287M748M804N439O855P981
52334C95047Q137Q179R245J1084J2530J3192J3741J4796J6301J7949J9499K0731
52322E60431K1593K2416K3473K4413K4596K3880K2699K1425K0161J9091J8393
52311H02571J7748J6578J4930J3613J3178J3203J2862J1886J0639R505Q543P601
52299I52857O515N240L918K717J597L16j256k998m692o148p196p814q230q687
$$ plain form
52395 340449 332209 323938 316468 309636 303352 297860 293144 288849 284945 281863 279845 278703 278315 278726 279641
52380 279641 280449 281058 282136 284201 286999 290119 293617 297565 301496 304873 307782 310697 313906 317682 322537
52365 322537 328628 335095 340645 344655 347203 348332 348022 346789 345496 344481 343535 342771 342739 343491 344298 344646
52349 344646 344936 345810 347310 349103 351049 353127 355266 357677 360933 365220 369968 374772 380211 387066 395047
52334 395047 403184 411363 420608 431692 444222 457414 471155 485951 502252 520201 539700 560431
52322 560431 582024 604440 627913 652326 676922 700802 723501 744926 765087 784178 802571
52311 802571 820319 836897 851827 865440 878618 891821 904683 916569 927208 936713 945256 952857
52299 952857 959372 964612 968530 971247 972844 973160 971904 968906 964214 958066 950870 943056 934826 926139
52285I26139r054r000q490p759o788n254l124q36J393L915O954R891J1791J2443
52271I22221J2567J3018J4125J5630J6871J7146J6243J4707J3361J2582J2187
52260A080658J1867J1510J1099J0657J0158R429Q263O825N764N513N625N204L894
52247A186466K056Jk378n098p698r679j1038j2053j2758j2931j2511j1747j0958
52234A079674j0335r914r583r131q398p426o420n526m707l764k548j193j01M96
52220A001124Q34J295J822K047K118K845M629O597P445P017O451O644P213P310
52206A065391O851O425O294O159N817N431N093M642M106L850M035M271M082L465
52192A135912K749K157J795J763J973K083J989K065K523K712J744k91k319l616
$$ plain form
52285 926139 917085 908085 899595 891836 885048 879794 876670 875834 877227 881142 888096 897987 909778 922221
52271 922221 934788 947806 961931 977561 994432 1011578 1027821 1042528 1055889 1068471 1080658
52260 1080658 1092525 1104035 1115134 1125791 1135949 1145378 1153641 1160466 1166230 1171743 1177368 1182572 1186466
52247 1186466 1188522 1188523 1186145 1181047 1173349 1163670 1152632 1140579 1127821 1114890 1102379 1090632 1079674
52234 1079674 1069339 1059425 1049842 1040711 1032313 1024887 1018467 1012941 1008234 1004470 1001922 1000729 1000628 1001124
52220 1001124 1001958 1003253 1005075 1007122 1009240 1012085 1016714 1023311 1030756 1037773 1044224 1050868 1058081 1065391
52206 1065391 1072242 1078667 1084961 1091120 1096937 1102368 1107461 1112103 1116209 1120059 1124094 1128365 1132447 1135912
52192 1135912 1138661 1140818 1142613 1144376 1146349 1148432 1150421 1152486 1155009 1157721 1159465 1159174 1156855 1153239
52178A153239m598n972p666r021r681r802r546q897p969p078o318n345l844k100
52164A055402q07l38l40j84M30J401K584L837M772M917M236L160J970N97p72j412
52148A079453r13J08P46R58J303J757J667Q92J57J4J68J48P3L28R54J786K873
52131A092472M413O431Q818J1370J3738J5586J7021J8547K0509K2906K5696K8751
52119A286258L1443L2903L3026L2579L2088L1173K9367K6896K4192K1240J7994
52108A599159J4912J2391J0028P115L576j39l635o544q307q739q501q360q272
52095A594684p857p464p825q899r859j0256j0443j0845j1496j2327j3222j3682
52083A470509j3027j1145q601o018l722j820r9J976M590P073Q745J0028J1884
$$ plain form
52178 1153239 1148641 1142669 1135003 1125982 1116301 1106499 1096953 1088056 1080087 1073009 1066691 1061346 1057502 1055402
52164 1055402 1054595 1054257 1053917 1053733 1054163 1055564 1058148 1061985 1066757 1071674 1075910 1079070 1081040 1081637 1080865 1079453
52148 1079453 1078540 1078648 1079394 1080352 1081655 1083412 1085079 1085971 1086128 1086142 1086310 1086458 1086531 1086859 1087813 1089599 1092472
52131 1092472 1096885 1103316 1112134 1123504 1137242 1152828 1169849 1188396 1208905 1231811 1257507 1286258
52119 1286258 1317701 1350604 1383630 1416209 1448297 1479470 1508837 1535733 1559925 1581165 1599159
52108 1599159 1614071 1626462 1636490 1643605 1647181 1647042 1643407 1636863 1628556 1619817 1611316 1602956 1594684
52095 1594684 1586827 1579363 1571538 1562639 1552780 1542524 1532081 1521236 1509740 1497413 1484191 1470509
52083 1470509 1457482 1446337 1437736 1431718 1427996 1426176 1426077 1428053 1432643 1439716 1448461 1458489 1470373
52070A470373J4264J6089J6829J7156J7694J8083J7712J6657J5350J3822J1832
52059A645861R442P041M977L329J826rk300m490n984o975q112r520j0887j2352
$$ plain form
52070 1470373 1484637 1500726 1517555 1534711 1552405 1570488 1588200 1604857 1620207 1634029 1645861
52059 1645861 1655303 1662344 1667321 1670650 1672476 1672467 1670167 1665677 1659693 1652718 1644606 1635086 1624199 1611847
$$ [...]
##END NTUPLES=NMR SPECTRUM
##END=
