
##TITLE=AC1310_HONAH12126_6614145_50nEYG3tpd
##JCAMPDX= 6.0         $$ Bruker NMR JCAMP-DX V2.0
##DATA TYPE= NMR SPECTRUM
##DATA CLASS= NTUPLES
##ORIGIN= BRUKER
##OWNER= Administrator
$$ 1.72 TOPSPIN		Version 2.1
$$ 2012-08-02 17:13:36.312 -0500  Administrator@TOPSPIN
$$ Compression mode = diff/dup
##.OBSERVE FREQUENCY= 400.02188249412
##.OBSERVE NUCLEUS= ^1H
##.ACQUISITION MODE= SIMULTANEOUS (DQD)
##.ACQUISITION SCHEME= undefined
##.AVERAGES= 8
##.DIGITISER RES= 22
##SPECTROMETER/DATA SYSTEM= spect
##.PULSE SEQUENCE= zg30
##.SOLVENT NAME= COFFEE_meoh
##.SHIFT REFERENCE= INTERNAL, COFFEE_meoh, 1, 14.98509
##AUDIT TRAIL= $$ (NUMBER, WHEN, WHO, WHERE, PROCESS, VERSION, WHAT)
$$ ##TITLE= Audit trail, TOPSPIN		Version 2.1
$$ ##JCAMPDX= 5.01
$$ ##ORIGIN= Bruker BioSpin GmbH
$$ ##OWNER= Administrator
$$ $$ C:\Bruker\TOPSPIN/data/COFFEE/nmr/AC1310_HONAH12126_6614145_50nEYG3tpd/10/pdata/1/auditp.txt
$$ ##AUDIT TRAIL=  $$ (NUMBER, WHEN, WHO, WHERE, PROCESS, VERSION, WHAT)
(   1,<2012-08-02 17:13:27.031 -0500>,<Administrator>,<TOPSPIN>,<go>,<TOPSPIN 2.1>,
      <created by zg
	started at 2012-08-02 17:12:20.390 -0500,
	POWCHK enabled, PULCHK disabled,
       configuration hash MD5:
       6B 1B 68 BB D9 2E 58 E2 7F 35 AD 54 07 DF 0E 41
       data hash MD5: 64K
       A0 7B 0C FB DC 71 5F BA E9 1B 6F 9B F6 0C 09 E1>)
(   2,<2012-08-02 17:13:32.125 -0500>,<Administrator>,<TOPSPIN>,<proc1d>,<TOPSPIN 2.1>,
      <Start of raw data processing
       efp LB = 0 FT_mod = 6 PKNL = 1 PHC0 = 0 PHC1 = 0 SI = 32K 
       data hash MD5: 32K
       DE 76 9F 67 F6 A5 99 BF 80 14 4C 42 0F 9E 1E CB>)
(   3,<2012-08-02 17:13:32.390 -0500>,<Administrator>,<TOPSPIN>,<proc1d>,<TOPSPIN 2.1>,
      <pk PHC0 = 182.3236 PHC1 = 0 
       data hash MD5: 32K
       58 B1 D6 35 77 57 60 5C E8 52 11 1F 5E 2B BC 83>)
(   4,<2012-08-02 17:13:32.484 -0500>,<Administrator>,<TOPSPIN>,<proc1d>,<TOPSPIN 2.1>,
      <abs ABSG = 1 
       data hash MD5: 32K
       3F A9 5F CC 64 57 43 78 4C A7 68 9C 48 1D 5E 49>)
(   5,<2012-08-02 17:13:32.515 -0500>,<Administrator>,<TOPSPIN>,<proc1d>,<TOPSPIN 2.1>,
      <abs ABSG = 2 
       data hash MD5: 32K
       3F BF 37 2E A9 38 98 6B 05 FB C5 72 0F 79 EF A4>)
(   6,<2012-08-02 17:13:32.546 -0500>,<Administrator>,<TOPSPIN>,<proc1d>,<TOPSPIN 2.1>,
      <abs ABSG = 3 
       data hash MD5: 32K
       EF 16 AB 15 2A AB 02 1C 1C 31 7C E1 16 5C 6C 0B>)
(   7,<2012-08-02 17:13:32.578 -0500>,<Administrator>,<TOPSPIN>,<proc1d>,<TOPSPIN 2.1>,
      <abs ABSG = 4 
       data hash MD5: 32K
       7B 90 0B 2F F6 0D D0 10 93 2A B0 92 BC AE 84 6E>)
(   8,<2012-08-02 17:13:32.609 -0500>,<Administrator>,<TOPSPIN>,<proc1d>,<TOPSPIN 2.1>,
      <abs ABSG = 5 
       data hash MD5: 32K
       74 B8 0F 07 82 15 7F 5A 3B E4 60 E4 A6 2A 10 CE>)
$$ ##END=
$$ 
$$ $$ hash MD5
$$ $$ B7 8C 2A 7E 5D CB 9A 46 8D E9 08 0F 9B 49 87 0B
##$RELAX= 
##$RELAX= 
##$RELAX= 
##$RELAX= 
##$RELAX= 
##$RELAX= 
##$RELAX= 
$$ Bruker specific parameters
$$ --------------------------
$$ [...]
##$TP= (0..7)
150 150 150 150 150 150 150 150
##$TP07= 0
##$TPNAME0= <>
##$TPNAME1= <>
##$TPNAME2= <>
##$TPNAME3= <>
##$TPNAME4= <>
##$TPNAME5= <>
##$TPNAME6= <>
##$TPNAME7= <>
##$TPOAL= (0..7)
0.5 0.5 0.5 0.5 0.5 0.5 0.5 0.5
##$TPOFFS= (0..7)
0 0 0 0 0 0 0 0
##$TUNHIN= 0
##$TUNHOUT= 0
##$TUNXOUT= 0
##$USERA1= <user>
##$USERA2= <user>
##$USERA3= <user>
##$USERA4= <user>
##$USERA5= <user>
##$V9= 5
##$VALIST= <valist>
##$VCLIST= <CCCCCCCCCCCCCCC>
##$VD= 0
##$VDLIST= <DDDDDDDDDDDDDDD>
##$VPLIST= <PPPPPPPPPPPPPPP>
##$VTLIST= <TTTTTTTTTTTTTTT>
##$WBST= 1024
##$WBSW= 4
##$XGAIN= (0..3)
0 0 0 0
##$XL= 0
##$YL= 0
##$YMAX_a= 478012
##$YMIN_a= -624904
##$ZGOPTNS= <>
##$ZL1= 120
##$ZL2= 120
##$ZL3= 120
##$ZL4= 120
##$ABSF1= 14.98509
##$ABSF2= -5.573092
##$ABSG= 5
##$ABSL= 3
##$ALPHA= 0
##$AQORDER= 0
##$ASSFAC= 0
##$ASSFACI= 0
##$ASSFACX= 0
##$ASSWID= 0
##$AUNMP= <proc_prof1d_extract_pilot.lims>
##$AXLEFT= 0
##$AXNAME= <>
##$AXNUC= <1H>
##$AXRIGHT= 0
##$AXTYPE= 0
##$AXUNIT= <>
##$AZFE= 0.1
##$AZFW= 0.1
##$BCFW= 0
##$BC_mod= 0
##$BYTORDP= 0
##$COROFFS= 0
##$CY= 15
##$DATMOD= 1
##$DC= 0
##$DFILT= <>
##$DTYPP= 0
##$F1P= 0
##$F2P= 0
##$FCOR= 0.5
##$FTSIZE= 32768
##$FT_mod= 6
##$GAMMA= 0
##$GB= 0
##$INTBC= 1
##$INTSCL= 1
##$ISEN= 128
##$LB= 0
##$LEV0= 0
##$LPBIN= 0
##$MAXI= 10000
##$MC2= 0
##$MEAN= 0
##$ME_mod= 0
##$MI= 0
##$NCOEF= 0
##$NC_proc= -8
##$NLEV= 6
##$NOISF1= 0
##$NOISF2= 0
##$NSP= 0
##$NTH_PI= 0
##$NZP= 0
##$OFFSET= 14.98509
##$PC= 1
##$PHC0= 182.3236
##$PHC1= 0
##$PH_mod= 1
##$PKNL= yes
##$PPARMOD= 0
##$PPDIAG= 0
##$PPIPTYP= 0
##$PPMPNUM= 2147483647
##$PPRESOL= 1
##$PSCAL= 4
##$PSIGN= 0
##$PYNMP= <proc.py>
##$REVERSE= no
##$SF= 400.02
##$SI= 32768
##$SIGF1= 0
##$SIGF2= 0
##$SINO= 400
##$SIOLD= 32768
##$SPECTYP= <>
##$SREGLST= <1H.CDCl3>
##$SSB= 0
##$STSI= 32768
##$STSR= 0
##$SW_p= 8223.68421052631
##$SYMM= 0
##$S_DEV= 0
##$TDeff= 65536
##$TDoff= 0
##$TI= <>
##$TILT= no
##$TM1= 0
##$TM2= 0
##$TOPLEV= 0
##$USERP1= <user>
##$USERP2= <user>
##$USERP3= <user>
##$USERP4= <user>
##$USERP5= <user>
##$WDW= 1
##$XDIM= 32768
##$YMAX_p= 452698046
##$YMIN_p= -752953
##$CURPLOT= <Network HP LaserJet P1505>
##$CURPRIN= <$Network HP LaserJet P1505>
##$DFORMAT= <normdp>
##$LAYOUT= <+/1D_H.xwp>
##$LFORMAT= <normlp>
##$PFORMAT= <normpl>
##$SURQMSG= 1
$$ End of Bruker specific parameters
$$ ---------------------------------
##NTUPLES= NMR SPECTRUM
##VAR_NAME=  FREQUENCY,     SPECTRUM/REAL,   SPECTRUM/IMAG
##SYMBOL=    X,             R,               I
##VAR_TYPE=  INDEPENDENT,   DEPENDENT,       DEPENDENT
##VAR_FORM=  AFFN,          ASDF,            ASDF
##VAR_DIM=   32768,         32768,           32768
##UNITS=     HZ,            ARBITRARY UNITS, ARBITRARY UNITS
##FACTOR=    0.250966925370066, 1,           1
##FIRST=     8223.43324360094, -103633,      27931
##LAST=      0,             -99446,          -97406
##MIN=       0,             -752953,         0
##MAX=       8223.43324360094, 452698046,    0
$$ Real data points
##PAGE= N=1
##DATA TABLE= (X++(R..R)), XYDATA
$$ [...]
19493A81276f4577n0466p4591i1611L0517l75232a29965k03555B10290b7274A15267
19481b17808A49615b45134R2008c9042l5923j09393j97938a0043o2554E4997b17177
19469a52346e7938k0438k43801a16574m1607j07029g2606p190k37887D6893c87218
19457A76801a52156b7467k55346P3475r8219D9167a20911d9405n3355o2245K5779
19446a39226e6730Q379l83223B63192e727j90289i5377B5982h9622A37883a68367
19434B28759G7192R1308K25512g5382h878k03118L2357B17001b61944m1345A97941
19422i6775r1391D5953a60225k03280a33583j43295J24957m141j1872H7313D48
19410a02833A62921e167B00706f8185D0371f3395a1406l72226a27992k34361P3011
$$ y = [181276, -64577, -115043, -189634, -91611, -61094, -436326, -129965, -333520, 210290, -27274, 115267, -217808, 149615, -245134, -153126, -39042, -74965, -184358, -382296, -10043, -72597, 54997, -217177, -152346, -57938, -78376, -322177, -116574, -158181, -265210, -72606, -79796, -317683, 46893, -387218, 176801, -152156, -27467, -282813, -209338, -307557, 49167, -120911, -49405, -102760, -165005, -139226, -56730, -48351, -431574, 263192, -5727, -196016, -95377, 25982, -89622, 137883, -168367, 228759, 77192, 168500, 394012, -75382, -8878, -211996, -179639, 217001, -261944, -303289, 197941, -96775, -188166, 45953, -160225, -363505, -133583, -276878, -151921, -156062, -167934, 87313, 448, -102833, 162921, -5167, 200706, -68185, 40371, -63395, -11406, -383632, -127992, -362353, -289342]
19399b89342a29261d7042l72605a00929d1562j42252k7567B78283G0162a94942
19388a72218B9824a3732m55817F122J88412e900j7158n6714A3861d5270j20744
19377a66014j20043a06113d6214J0283n287k63697O4084d6782p0744D831a07178
19365a51571B07561i3811M6038j31122k51859b6028A0830K5627b746l76489e7696
19353C28326a82440A44455J40872G4354f5995F9444a90844j89053f0518m1133
19343a01651l23898a12012l7246O7368K0973b0225h653A86799n3409J3116F3675
19331e7543q4006B35718D6871B1784a72717G4554b37317A36050b53496j92715
19321d46211B33817G3051J61787b00054c1984A00670J37714c86045a65589j23255
$$ y = [-289342, -129261, -47042, -419647, -100929, -41562, -183814, -211381, 278283, 70162, -194942, -172218, 29824, -13732, -469549, 6122, 194534, -5900, -23058, -79772, 13861, -45270, -166014, -286057, -106113, -46214, -35931, -41218, -304915, -240831, -46782, -117526, 4831, -107178, -151571, 207561, -93811, -47773, -178895, -430754, -26028, 10830, 36457, -2746, -379235, -57696, 328326, -182440, 144455, 285327, 74354, -65995, 69444, -190844, -379897, -60518, -101651, -425549, -112012, -149258, -81890, -60917, -20225, -8653, 186799, 133390, 146506, 63675, -57543, -141549, 235718, 46871, 21784, -172717, 74554, -237317, 136050, -253496, -446211, 233817, 73051, 234838, -200054, -31984, 100670, 238384, -386045, -165589, -288844]
19311b88844G3065b15380N6205F7383J38836H8032f0521B88752O2301e0218A22688
19299a52275H8759O1592b12811n2991A41889c13160C4845P9664P318L72673f4632
19287c5087A15002c5193F8174a28322j41465A27705a88800k89F9344C477a42051
19275i8963j9061d2770P968j07191n6414A85769c68865c0460j42888B0625e6411
19263b11903a9266l39695D266K6859p764b8892j65689n987c2355q6728j57627
19252b76710Q3535d2364j91278E946M4186b8379C17435b65855B6835c04540J49151
19241a55389A71843a12177M849d7543a7991q3521A54641b25192P0644K499f2207
19229i6991A2123J15569B7936p662d1436l89669B6431a34441b6956p0189b1187
$$ y = [-288844, 73065, -215380, -159175, 67383, 206219, 88032, -60521, 288752, 351053, -50218, 122688, -152275, 88759, 150351, -212811, -265802, 141889, -313160, 34845, 114509, 121827, 494500, -64632, -35087, 115002, -35193, 68174, -128322, -269787, 127705, -188800, -189089, 69344, 3477, -142051, -98963, -118024, -42770, -34802, -141993, -198407, 185769, -368865, -30460, -173348, 20625, -56411, -211903, -19266, -358961, 4266, 31125, 23361, -28892, -194581, -200568, -32355, -119083, -276710, -193175, -42364, -233642, 5946, 50132, -28379, 317435, -265855, 26835, -304540, -155389, 171843, -112177, -107328, -47543, -17991, -101512, 154641, -225192, -154548, -152049, -62207, -96991, 12123, 127692, 27936, 20274, -41436, -431105, 26431, -134441, -26956, -97145, -21187]
19217H2149Q392c16927A68017N2411J50959a37728A37840K5949P9112B4023b2931
19205G5338b04617h7386M131A5810c53652C38056A26317k2478d88156A13245b50988
19193a55842l164A9022b9140l864j08443O781j08529D91315A00013a15300b4141
19181g7657n686k0428p8276B6189c4548A74600J26157B766d01376e1409q7694
19170a39103C8660a84396M8527k18676a14637j8455B57240M9764c04199J14938
19160a89261l7694E976a58352k3279H3369B5283b0552G1039K4097b33481M5299
19149a88182a488j25687B56360G6092a04920j7188A37942a48375F2976a46406
19138b21898B85893a21124N6580p3189O3775m3356k64983a76007L8020j3815N5474
$$ y = [82149, 90541, -316927, 168017, 220428, 371387, -137728, 137840, 163789, 242901, 24023, -22931, 75338, -204617, -87386, -83255, 15810, -353652, 338056, 126317, 103839, -488156, 113245, -250988, -155842, -159006, 19022, -29140, -33004, -141447, -134666, -243195, 491315, 100013, -115300, -24141, -77657, -83343, -103771, -182047, 26189, -34548, 174600, 300757, 2766, -401376, -51409, -139103, 38660, -184396, -135869, -354545, -114637, -133092, 257240, 307004, -304199, -189261, -226955, 5976, -158352, -181631, 83369, 25283, -20552, 71039, 95136, -233481, -188182, -1488, -127175, 256360, 76092, -104920, -122108, 137942, -148375, 62976, -146406, -221898, 285893, -121124, -64544, -137733, -73958, -117314, -382297, -176007, -137987, -151802, -96328]
19127i6328H972L02805b43285k28357B3475a64263a2023G2566a18319k61115j4394
19116c93828H438J67679a25239j6426k82674F5545a99400i6789j17926e9424k02565
19105b61989A20407j5553f5909B1731J8784a16526A12096c90268a50054e2934
19094A72273a06026C5780I900J00134a69441j62190h9456H9717b54789a07922
19083b05896K6333N837C89643f2421H0702O9748N181R3651D7715a9713k8878j25300
19071a73891G4162B3251d1038R599B542i7470a7082E4871d46867H9782a03946
19059f4253A10900n1650a24830B68198a35470K3529K2411j44070A9561J13776
19049A33337E1645a01090B41323g3904l34108a26834A10378O878b45404R1748
$$ y = [-96328, 8972, 311777, -243285, -471642, 23475, -164263, -12023, 72566, -118319, -379434, -393828, 8438, 176117, -125239, -141665, -424339, 65545, -199400, -96789, -214715, -59424, -261989, 120407, 104854, -65909, 21731, 40515, -116526, 112096, -390268, -150054, -52934, 172273, -106026, 35780, 9900, 110034, -169441, -331631, -89456, 89717, -254789, -107922, -205896, -179563, -173726, 389643, -62421, 80702, 150450, 155631, 249282, 47715, -19713, -48591, -173891, 74162, 23251, -41038, -31439, 2542, -97470, -17082, 54871, -446867, 89782, -103946, -64253, 110900, 59250, -124830, 268198, -135470, -111941, -89530, -233600, 19561, 133337, 51645, -101090, 241323, -73904, -408012, -126834, 110378, 117256, -245404, -153656]
19039a53656g0520j53048a639A36144M1205d0989l7852q1264k8588B62315b99222
19027B74639b12712B7014J6294A6179d320I6417d261l9277m8735D7187O3407d22474
19014e2715k82483A16356a33853B43907o9476a6479q0213F8943J24851a24132
19003I7240b27679A84374L05635A01291e0743l4443k25542B35844G7432a64335
18992D9036b59864g9073r1404o0231G6589O6002l0990K40946a0888A95818a17943
18980a88446E4497a85352A01994b48639A02368b29383a8272E839M53585K25024
18970F84448k37280l1529D6762P7358R8803C329L6737h7111C7042a98575i3930
18958a54843A85972b71210B07412e6331A14986b3347B49058f542A2982c1152C4081
$$ y = [-153656, -70520, -223568, -1639, 136144, 177349, -40989, -78841, -160105, -188693, 262315, -299222, 274639, -212712, 27014, 43308, 16179, -4320, 96417, -4261, -43538, -92273, 47187, 110594, -422474, -52715, -335198, 116356, -133853, 243907, 174431, -16479, -96692, 68943, 193794, -124132, 97240, -227679, 184374, 490009, 101291, -50743, -85186, -310728, 235844, 77432, -164335, 49036, -259864, -79073, -170477, -230708, 76589, 142591, 111601, 352547, -10888, 195818, -117943, -188446, 54497, -185352, 101994, -248639, 102368, -229383, -18272, 5839, 459424, 684448, 447168, 415639, 46762, 124120, 222923, 3329, 40066, -87111, 37042, -198575, -93930, -154843, 185972, -271210, 207412, -56331, 114986, -23347, 249058, -6542, 12982, -31152, 34081]
18946C12393A56021D6322f1417D50040b93210A91727c51320a23260q534o513B9452
18934a96364D1256d8592A12040a07973k52536A2963K11048c78778C71725G0739
18923a60263A08692P972a94755n5763G2264a30768N2213c5745k26056l1026C84510
18911B68423k2806f5141C21513P4754L17964j82488k19770j20114G6844a2702
18900B94109F0262b1124r881C7987J31785D4675a07060r4230k09392J79195B1608
18888a56662d3855l9329n4111d1684B98924a37525N4700b827C2631c69519a47369
18876b05099j36996O5846J22269H7930a0644A17444a94961h0629j77237O667C59407
18864C03621a66330b6018j2158R431q370k5769j13404L9345C3335J01338e615
$$ y = [312393, 156021, 46322, -61417, 450040, -293210, 191727, -351320, -123260, -131794, -138307, 29452, -196364, 41256, -48592, 112040, -107973, -360509, 12963, 224011, -378778, 371725, 70739, -160263, 108692, 116664, -194755, -250518, 72264, -130768, -78555, -35745, -261801, -292827, 384510, 268423, 245617, -65141, 321513, 396267, 714231, 531743, 311973, 191859, 76844, -12702, 294109, 60262, -21124, -31005, 37987, 169772, 44675, -107060, -201290, -410682, -231487, 21608, -156662, -43855, -83184, -137295, -41684, 298924, -137525, -82825, -2827, 32631, -369519, -147369, -205099, -342095, -276249, -153980, 87930, -10644, 117444, -194961, -80629, -257866, -251199, 359407, 303621, -166330, -26018, -38176, -28745, -37115, -62884, -176288, -136943, 33335, 134673, -5615]
18852b33205i8270K0939p5787A3330a84362n3g8151j72326C4895K3262m493a33126
18839C7342d0215D15987a64059j62566B19830b4878D7460a04450A02505m3786
18829E8719a49302N0529l6911A77734a88554E6993b61291M1159A48378e1459k29535
18818b80994D8518J9749K86869G3430I555K19247j6407l1248a29391L8128B20511
18806A52860a32093A42969c13266H3059K92796b86251d2076G7474a31984p5569
18796b07553k754A1617a37746k86836J71971J18924A0768K5167g4049r8976o6538
18785b39563i3757m7876q613L4028j93297A754J38232a27042N751j12612k56086
18774d89989e9931r6391H9565b32243j15535i23l35381G0493e4847i929j2167
$$ y = [-233205, -98270, -77331, -153118, 13330, -184362, -184415, -78151, -250477, 34895, 58157, 53664, -133126, 37342, -40215, 415987, -164059, -326625, 219830, -24878, 47460, -104450, 102505, 58719, -149302, -98773, -135684, 177734, -188554, 56993, -261291, -220132, 148378, -51459, -280994, 48518, 68267, 355136, 73430, 9555, 228802, 212395, 181147, -129391, -91263, 220511, 152860, -132093, 142969, -313266, 83059, 375855, -286251, -42076, 77474, -131984, -207553, -210307, 11617, -137746, -424582, -252611, -133687, 10768, 35935, -74049, -173025, -239563, -93757, -141633, -150246, -116218, -309515, 1754, 139986, -127042, -121291, -233903, -489989, -59931, -156322, 89565, -232243, -347778, -923, -336304, 70493, -54847, -9929, -22096]
18763b2096A74949N3057a08439G7602N3061b00820A39824k8379a88233C7837b61881
18751I6265a09706A15318J35285G2046a29245k3403A07461l5422b39761r445d800
18739A9703c9934j50183g7570q701A39725O9557a89172j02098C5329a11318A19767
18727f5804A6366a2920r150p5204O5C7548b30877N5910f1717l88027J36882L2517
18715b80345Q762J29574j36654B1457J61899a27243e7628i16j59215A8539K20661
18704B39200b2573k64024B36433a21919c9053k37592a36663j1572j81297B2449
18693a63105A51404R6177l1638g1753A7132a60631k4073f2124j9236K3928o8389
18682a25821K5350d6016l17247a28170n0927c195k63827d0663r9584G1218c64263
$$ y = [-22096, 174949, 228006, -108439, 77602, 130663, -200820, 139824, 111445, -188233, 37837, -261881, 96265, -109706, 115318, 250603, 72046, -129245, -152648, 107461, 72039, -239761, -249206, -4800, 19703, -39934, -190117, -77570, -86271, 139725, 209282, -189172, -291270, 35329, -111318, 119767, -65804, 16366, -12920, -22070, -97274, -97209, 37548, -230877, -174967, -61717, -449744, -312862, -280345, -271583, -142009, -278663, 21457, 183356, -127243, -57628, -916, -160131, 18539, 239200, -22573, -286597, 236433, -121919, -39053, -276645, -136663, -148235, -329532, 22449, -163105, 151404, 247581, 215943, -71753, 17132, -160631, -184704, -62124, -81360, -57432, -125821, -100471, -46016, -363263, -128170, -179097, -3195, -267022, -40663, -140247, 71218, -364263]
18670A93241F8516c07119E882J03971g6019C2842i7546j44766B49231b38899A50411
18658d3236B84387c89100a79841O3388J6716k18117a36747M7727D38093i9499
18647F8909a07458J9501A57357a31779k01066A7099J10896a46292D9321a28821
18636B1747f1852j1457C8520K39891i6151r0004K8286H715h760G5422b0358q8316
18624a08674k6713O357k3180m6757G1379f3940p4605M364A96206I0001j4790b90119
18611f2088o5579e9291b9606B7644c6338A5341c21534B968J79454a10983A49833
18599c03845J26496A87232a75211e8373j71499e7528A54617j7907a87400A1899
18588D9034P1694J51302j25528c27655g1524G5312J39677A5960L64765c12807
$$ y = [193241, 68516, -307119, 5882, 109853, -76019, 32842, -97546, -242312, 249231, -238899, 150411, -43236, 284387, -389100, -179841, -116453, -99737, -317854, -136747, -89020, 438093, -99499, 68909, -107458, -87957, 157357, -131779, -332845, 17099, 127995, -146292, 49321, -128821, 21747, -61852, -73309, 38520, 278411, -96151, -186155, -157869, 8715, -8760, 75422, -20358, -108674, -135387, -129030, -152210, -198967, 71379, -63940, -138545, -134181, 196206, 90001, 75211, -290119, -62088, -127667, -59291, -29606, 27644, -36338, 15341, -321534, 2968, 182422, -110983, 149833, -303845, -177349, 187232, -175211, -58373, -229872, -57528, 154617, 136710, -187400, 11899, 49034, 120728, 272030, 146502, -327655, -71524, 75312, 214989, 15960, 380725, -312807]
18577A66851b83812B6804J30260a10969C7603b02282j29048a22375g662n7874
18567f5536j63744j48099a9107D5433N5469e6078H9038a55929E6132e17604J32765
18556c84839a01782B04942C4847g1790o0031l56429f9807p3128A95448b39799
18545A21446h7945F3050m94O6163g5809A81001o5783D8338L17592c45979l151
18534c49130D09437a84381G61N5999J1964A9015J04070a6230j34246j62619e2669
18522c10397A6388a00930j70940i6038E490J3761J24749d52k09293g8957K0290
18511e8667F9990b32581K9952A7625J0834i7959j17305A08850d8900j51193J1517
18500a88576q4629b1220q124A40489a5972m4659q9591H464d6932B05962l9714
$$ y = [166851, -283812, 26804, 157064, -110969, 37603, -202282, -331330, -122375, -7662, -65536, -229280, -377379, -19107, 45433, 100902, -56078, 89038, -155929, 56132, -517604, -384839, -101782, 204942, 34847, -71790, -131821, -488250, -69807, -142935, 195448, -239799, 121446, -87945, 63050, 62556, 128719, -75809, 181001, 115218, 48338, 365930, -345979, -349130, 409437, -184381, 761, 56760, 68724, 19015, 123085, -16230, -150476, -313095, -52669, -310397, 16388, -100930, -271870, -96038, 5490, 19251, 144000, -452, -209745, -78957, -58667, 69990, -232581, -202629, 17625, 28459, -97959, -215264, 108850, -48900, -200093, -188576, -273205, -21220, -29344, 140489, -15972, -60631, -150222, 8464, -46932, 205962, 166248]
18489A66248d16555b06275f2147j2581p8890B60740A09014N9228a66619g9266
18478a66797e8591j31133o891C7911b33C832a39523o2544c4119k41306a04946
18466a31423l6592C9678e4552A74019a99588A87384g1713j25365h3731E9260p675
18455E1585a21130j46199A94015c21844e9891A35955h1800n665B01796F4171J73105
18444B37276d512q693j49077q1137a6443k80631G474i9898A37765b01354A73712
18432c268A02577a54739P0798E2426a56201A0268J66748g4028Q997k3767A01657
18420a0706H8898b17925q5981B19376a47023e2719A89207b99570A99498a42783
18409e8678j57790O5240G9341j9634k5637e5057G2053g8159j8598n624l6743G6839
$$ y = [166248, -416555, -206275, -62147, -74728, -153618, 260740, 109014, 168242, -166619, -79266, -166797, -58591, -189724, -196615, 37911, -233, 3832, -139523, -202067, -34119, -275425, -104946, -131423, -168015, 39678, -54552, 174019, -199588, 187384, -71713, -197078, -83731, 59260, 51585, -121130, -267329, 194015, -321844, -59891, 135955, -81800, -87465, 201796, 64171, 237276, -4512, -13205, -162282, -243419, -16443, -297074, 7474, -99898, 137765, -201354, 173712, -3268, 102577, -154739, -83941, 52426, -156201, 10268, 177016, -74028, -65031, -88798, 101657, -10706, 88898, -217925, -303906, 219376, -147023, -52719, 189207, -299570, 199498, -142783, -58678, -216468, -151228, 79341, 59707, 34070, -55057, 72053, -78159, -96757, -102381, -139124, 76839]
18396a45904B86973a23441L1232I1991a45253g734o1378A68439g4841A96669c57773
18384B8201e1965G3273c46099A24980J2376a04899A35710M8574c14438R6795e017
18372b19106k43937A06148i8780I3809a98559D6417b40026D08J1107n740e2095
18360A01649K60875f7194b3182C57611j62131E7536c32480I2004a85373A01994
18349c3902A54228b73905B2321c97192C60665i1882p2783g0285l8731d7781J0121
18338c7660I66P1996J06721a39488A78576a55416N6695j98612a05741E4109a75235
18326b70205e4916D9144a94582A19587o309e2281E5924a37354d0840k9989N934
18315f4895j10707H3790c9285B5298a75224F3818a64732o9339F0674c31364B31323
$$ y = [-145904, 286973, -123441, -92209, 91991, -145253, -7734, -69112, 168439, -74841, 196669, -357773, 28201, -51965, 73273, -346099, 124980, 137356, -104899, 135710, 184284, -314438, -217643, -5017, -219106, -463043, 106148, -98780, 93809, -198559, 46417, -240026, 408, 11515, 5775, -52095, 101649, 362524, -67194, -23182, 357611, 195480, 57536, -332480, 92004, -185373, 101994, -33902, 154228, -273905, 22321, -397192, 360665, -91882, -164665, -70285, -109016, -47781, -37660, 966, 72962, 179683, -139488, 178576, -155416, -98721, -297333, -105741, 54109, -175235, -270205, -54916, 49144, -194582, 119587, 113278, -52281, 55924, -137354, -40840, -70829, -64895, -175602, 83790, -39285, 25298, -175224, 63818, -164732, -234071, 60674, -331364, 231323]
18303G0603G82a7911k44657A84194H4357b60556A63211g569j00215J8212j15665
18292b05237F923i71o9292I3012B1611b76867N6424R3076K3709K3367B66381J60565
18280D26946b9898l65335f5350A24190b90695a0730D0593L18759j76117O3097
18270B46332f0990k11979Q6959m556E4276g5156c942A1481a45124j08369A2086
18258A12155A276L3724f933r1571i274k24491K4534r1575C02359b71837a22239
18246c9240A29085g6867n0495E2538O6589K5269e2591A83301d1929A95672m8994
18235A46678O0817b20355d2169j24718A18036D7898K96583r304b56961P5085A41158
18223a59651E6218J81673A6887J18464K6745C5034J37874a62159L0701A59434
$$ y = [70603, 782, -17911, -262568, 184194, 84357, -260556, 163211, -7569, -107784, -89572, -205237, 6923, -971, -70263, 93012, 21611, -276867, -220443, -127367, -103658, -80291, 266381, 426946, -29898, -395233, -65350, 124190, -290695, -10730, 40593, 359352, 183235, 246332, -60990, -272969, -186010, -190566, 54276, -75156, -3942, 11481, -145124, -253493, 12086, 112155, 1276, 35000, -6933, -98504, -9274, -233765, -209231, -300806, 302359, -271837, -122239, -39240, 129085, -76867, -127362, 52538, 119127, 144396, -52591, 183301, -41929, 195672, 146678, 207495, -220355, -42169, -166887, 118036, 47898, 344481, 335177, -256961, -181876, 141158, -159651, 56218, 237891, 16887, 135351, 162096, 35034, 172908, -162159, -131458, 159434]
18212A45647a49390r8044A50613e7769j0810A95256a55545D8958c68115J20176
18202b47939j35029C18036C634b76560f4932H9623b63085A0834J42235L2805q2545
18191A03329J44638d0715a4754j54134C5251f1570A90249D0746a19969A30433
18180a23633r9763A7812h286A7781b16076G9511P4475Q3356b42971c2081A45197
18168E9825L5155b04776e0671J7180d294A91805a31962G2319J42318a58511g9014
18156C52612a11061k746A3578f7031j25719A03191b885j69306D3831j2492N7041
18145H8380K4842a41244c2104D5484c5713k25383G3856b31736B596i8568B13377
18133C9728M32826d5711n5075L4014q7081D0312b42594M5154A7109d42085h06
$$ y = [145647, -149390, -247434, 150613, -57769, -68579, 195256, -155545, 48958, -368115, -247939, -382968, 318036, 3634, -276560, -64932, 89623, -263085, 10834, 153069, 185874, 103329, 247967, -40715, -14754, -168888, 35251, -61570, 190249, 40746, -119969, 130433, -123633, -223396, 17812, -8286, 17781, -216076, 79511, 153986, 237342, -242971, -32081, 145197, 59825, 94980, -204776, -50671, -33491, -4294, 191805, -131962, 72319, 214637, -158511, -79014, 352612, -111061, -113807, 13578, -67031, -192750, 103191, -2885, -172191, 43831, 31339, 88380, 113222, -141244, -32104, 45484, -35713, -261096, 73856, -231736, 2596, -98568, 213377, 39728, 472554, -45711, -100786, -66772, -153853, 40312, -242594, -197440, 17109, -442085, -806]
18121A73499d44038B68048a98848d3191p7587j73041F5124c92393a75840C82008
18110e6069n7836m3756M5001D0644g5637j83837H3617O0195J86084o2856I3645
18098b8043H1645j3982a37163D16069a12241F1136J02960Q890P8016b34391I5864
18086f9242n638B8076K56032B8984K35292c17741G7593g8103a9831j09588F4921
18074d1840k57211a17433k09574A99321C9196J05441P6302i8208A6839M6597e9233
18062A79078a51100i804k67553H8228e881j16024h35A40895B8642Q9972A1386
18050B19291e3152A28313c54785I5828f9373B64083b2171B6446a04450D0164K12016
18039B52180B1519e1054k0490l5740p691M9012j5133A958e26757f6865L1417B12352
$$ y = [173499, -444038, 268048, -198848, -43191, -120778, -293819, 65124, -392393, -175840, 382008, -56069, -113905, -157661, -112660, 40644, -75637, -259474, 83617, 143812, 329896, 267040, 93645, -28043, 81645, 67663, -137163, 416069, -112241, 61136, 164096, 172986, 251002, -234391, 95864, -69242, -74880, 28076, 284108, 28984, 264276, -317741, 77593, -78103, -19831, -129419, 64921, -41840, -299051, -117433, -327007, 199321, 39196, 144637, 220939, -98208, 16839, 63436, -59233, 179078, -151100, -9804, -277357, 88228, -5881, -121905, -835, 140895, 28642, 118614, 11386, 219291, -53152, 128313, -354785, 95828, -69373, 264083, -22171, 26446, -104450, 40164, 252180, 21519, -51054, -71544, -107284, -114975, -65963, -81096, 1958, -526757, -66865, -35448, 212352]
18026a08000l2019n5289A69996b33429i6319A88984H8458a7429F3726R2923D1150
18014a91152A06452a53228K8748j0297E8924p046Q9286f8934A6692a38488B32714
18002F1334b39434b4726p9843c0981D1710a81153B84646B6117c3997l3586j87037
17991b54620R4577A30215a2550B2978a7073D9454c57800J68282G324i1592d3823
17979i7188A6160J63062b03535h360A06424L14291a70444B23368b90290A54165
17968A07653P7326b62626i1364A8231a02328m8031B45114a51748f1479A95816
17957B25221d6652A5458J00202a93584B57536a27778j25337I0583J34633g2655
17946b96762A86093J37816A3526c14988a03867E1542i8241A94896E3422O7923
$$ y = [-108000, -140019, -195308, 169996, -233429, -96319, 188984, 88458, -17429, 63726, 156649, 41150, -191152, 106452, -153228, -124480, -134777, 58924, 51878, 141164, -68934, 16692, -138488, 232714, 61334, -239434, -24726, -104569, -30981, 41710, -181153, 284646, 26117, -33997, -67583, -254620, -160043, 130215, -12550, 22978, -17073, 49454, -357800, -189518, 7324, -91592, -43823, -97188, 16160, 179222, -203535, -8360, 106424, 420715, -170444, 223368, -290290, 154165, 107653, 184979, -262626, -91364, 18231, -102328, -150359, 245114, -151748, -61479, 195816, 225221, -46652, 15458, 115660, -193584, 257536, -127778, -253115, 90583, 225216, -72655, -296762, 186093, 323909, 13526, -314988, -103867, 51542, -98241, 194896, 53422, 121345]
17936A21345b0186A28489K2659K36281A32380a94197B7371A191b5624G9038a29477
17924A1330d29262K06491i2608r0706A74693d4602k35551a06980C3944Q6966J96667
17913C17577j10382F6931b18962g3340g069B33971K3969a39005A63349b80810
17902A20140C9398A3211J6929K06307I0368a0134r6648A3085M67075b55117B67061
17890g2033A5034N1351L0625a0698A70453G7454A3162J91304a4651E9407a54513
17878d2167j6715k51383J48647B41871H065K9608a07223B51311b7493K323k10495
17867b35665P7067A30250J42775A1483a06134E4276J76906b60481H8706i8135
17856D8116L9118K3451b1622B75364G7258J85863f5717F9406k9389d3584j20429
$$ y = [121345, -20186, 128489, 151148, 387429, 132380, -194197, 27371, 1191, -25624, 79038, -129477, 11330, -429262, -222771, -92608, -183314, 174693, -44602, -280153, -106980, 33944, 120910, 317577, 207195, 66931, -218962, -73340, -7069, 233971, 257940, -139005, 163349, -280810, 120140, 39398, 13211, 30140, 236447, 90368, -10134, -106782, 13085, 480160, -255117, 267061, -72033, 15034, 66385, 97010, -10698, 170453, 77454, 13162, 204466, -14651, 59407, -154513, -42167, -58882, -310265, -161618, 241871, 8065, 37673, -107223, 251311, -27493, -25170, -235665, -158598, 130250, 273025, 11483, -106134, 54276, 231182, -260481, 88706, -98135, 48116, 87234, 110685, -21622, 275364, 77258, 263121, -65717, 69406, 40017, -43584, -164013]
17845a64013j33905A62784i6881A39473M8524c3666G1405j6123Q6263a5980D04542
17833A85936p1394b90565B13547d3417F8580N3042J22495f2997A48274a43970
17822a28355j43A09706J00626H3616a0456B9620c1453A71476h4889E4981A9832
17810b61566A05510g7393k34402h1156B91520g7971I8306Q9035a26376B63347
17799B20479L4633D090a72856C90773E7847a43731H1433L59191a05335C03257
17788a23740C42735A529L35580K0078a85134P6247m5481I2801L88751j48539a1564
17776B34964q971B5876J59137b692A96503c72916J77008D98116B31886B1316a9565
17764c7230B63384A11863l5861b988q2067D75e5205j0702B1945e8587o8468B87804
$$ y = [-164013, -297918, 162784, -96881, 139473, 187997, -33666, 71405, 55282, 141545, -15980, 404542, 185936, 114542, -290565, 213547, -43417, 68580, 121622, 244117, -62997, 148274, -143970, -128355, -128498, 109706, 210332, 83616, -10456, 29620, -31453, 171476, -84889, 54981, 19832, -261566, 105510, -77393, -311795, -81156, 291520, -77971, 98306, 187341, -126376, 263347, 220479, 255112, 4090, -172856, 390773, 57847, -143731, 81433, 440624, -105335, 303257, -123740, 342735, 1529, 337109, 357187, -185134, -108887, -154368, 92801, 481552, 333013, -11564, 234964, 225993, 25876, 185013, -2692, 196503, -372916, -195908, 498116, 231886, 21316, -19565, -37230, 263384, 111863, 76002, -2988, -85055, 475, -55205, -65907, 21945, -58587, -127055, 287804]
17751b82416a30773D75698f0037n7448M4681A09107J28324C509P3908B4936c4600
17739a77788A01717e083A76592e73660D30572a24602l44619C95780H5008J1294
17729I6302M2397e9265F312O7453b6468j90487a4393j44939E5751c8506a2355
17717a68507h0701k14996J5538A63985n8216C9117a34236j89194C6966a43130
17706B18338O1371I1958J06883J19335i4128a0455D6801f6720A3695O2590P0420
17695A46705K56660a02656E74379A04899m7737R7267f9665A73260b72278E2178
17684a26187B78831b07430K9562J1478N2858C37835n1997m9199H0019K9440J60029
17673B69488c33F4824J75051K4065a6991I9233K96625j93104l60I3270K55746
$$ y = [-282416, -130773, 475698, -60037, -117485, -72804, 109107, 237431, 3509, 77417, 24936, -34600, -177788, 101717, -5083, 176592, -573660, 430572, -124602, -469221, 395780, 85008, 96302, 138699, -59265, 6312, 73765, -26468, -216955, -14393, -159332, 55751, -38506, -12355, -168507, -80701, -295697, -280159, 163985, 105769, 39117, -134236, -323430, 36966, -143130, 218338, 279709, 91958, 198841, 318176, -94128, -10455, 46801, -66720, 13695, 76285, 146705, 403365, -102656, 574379, 104899, 57162, 154429, -69665, 173260, -272278, 52178, -126187, 278831, -207430, -177868, -166390, -113532, 337835, 285838, 236639, 80019, 109459, 269488, -333, 64824, 239875, 263940, -16991, 99233, 395858, 202754, 202394, 93270, 349016]
17662C49016j44925B6269F171K1513i6089C28091D3315J88540g7794B32136D168
17650D17360I7232j957P0716G9191K23589A02706P2187J53268A08001m1290J65323
17639B32034N7730J37880A23905J29423N2746A42997a04495H498L16581A25219
17628B33838b54430i5633d7146A9987J20492E8510h7751D63820c7468d753q6057
17617i0810d1562B74804A8287P0387J18078H5962J05541P1204A11983C3256Q7081
17606A20337a45853D6421a126B11888K1376L0680A5135b05905H5138K29357O0
17595C14555e4498p3042A14745E5929J11980f8974A01866J7851D5119M97787k58278
17584B84628j5336a12199e0592J0208B62447q3381g8343j5464L6567A42100P5934
$$ y = [349016, 204091, 26269, 6171, 27684, -96089, 328091, 43315, 231855, -77794, 232136, 4168, 417360, 97232, 95275, 165991, 79191, 302780, 102706, 174893, 328161, 108001, 66711, 232034, 289764, 427644, 123905, 253328, 306074, 142997, -104495, 8498, 325079, 125219, 233838, -254430, -95633, -47146, 19987, 140479, 58510, -87751, 463820, -37468, -4753, -90810, -41562, 274804, 18287, 88674, 206752, 85962, 191503, 262707, 111983, 33256, 120337, -145853, 46421, -1126, 211888, 233264, 263944, 15135, -205905, 85138, 314495, 314555, -54498, -127540, 114745, 55929, 167909, -68974, 101866, 119717, 45119, 542906, 284628, 269292, -112199, -50592, -40384, 262447, 179066, -78343, -93807, -57240, 142100, 218034]
17573B18034E6920O7287o1977K35677A06028J50709n2933a12958A22937n7200
17563F5737L53954G3134R0115B0770L20L43187J52433l2935A97215i3513C87678
17551A49124F9155K40551M2064q0391G4751b88733A25317J84721A15558C6613
17540C5487Q0327h3298E1199R3317L31404C8277L89962F0813K41309A37670J26366
17529B64036N4715L39372j11212K61007M4797L54276k85103l94110p0632J20985
17519E78131m9202J12155B46278L09535B12891L69575B01515K67520L22799K56888
17509A048722N7485J37662l63236m36410L69961C72244A51216M35841k51134J33819
17499D69742B06106N3446M0488I6677Q4299G8492K64644A60689d4800H3020P8167
$$ y = [218034, 56920, 124207, 62230, 297907, 106028, 256737, 203804, -112958, 122937, 65737, 419691, 73134, 163249, 20770, 21090, 364277, 516710, 483775, 197215, -93513, 387678, 149124, 69155, 309706, 351770, 271379, 74751, -288733, 125317, 310038, 115558, 36613, 35487, 115814, -83298, 51199, 144516, 475920, 38277, 428239, 60813, 302122, 137670, 264036, 318751, 658123, 546911, 807918, 852715, 1206991, 921888, 527778, 457146, 578131, 528929, 641084, 246278, 555813, 212891, 582466, 201515, 469035, 791834, 1048722, 1106207, 1243869, 880633, 444223, 814184, 372244, 151216, 587057, 335923, 469742, 206106, 259552, 300040, 96677, 180976, 78492, 343136, 160689, -44800, 83020, 161187]
17488A61187J4068H7418M14809j12586A59864k2733l2111J15183k8988o8497M6158
17477A68876K7885K6276K29437A10159B996N89215j14688M8624J03743A56218
17466C66551J64204B11794K18464E0062K3191J80910J5829A030J60972b8750B4567
17454I8566K60846J65300B51525j0706j19308L30965A01046L78017J13375r1650
17444E00788J59364j20020r2310J86609k27808j28694p2280P9554K56786I9775
17433C44036j48820M4419J18233j18964l8107K49966j59573k468K35119B01031
17422B75481M58198k98774A19468K66748P1168C7574K85967A01848K90419J48477
17412E40744m7272A27592J56311L73121k84098K28976B48503n3233Q2404n1408
$$ y = [161187, 175255, 87418, 502227, 389641, 159864, 137131, 105020, 220203, 191215, 122718, 168876, 196761, 223037, 452474, 110159, 2996, 592211, 477523, 526147, 629890, 156218, 366551, 530755, 211794, 430258, 50062, 73253, 254163, 269992, 1030, 162002, -28750, 24567, 98566, 359412, 524712, 251525, 240819, 121511, 452476, 101046, 479063, 592438, 500788, 660152, 540132, 447822, 634431, 406623, 277929, 205649, 285203, 541989, 99775, 344036, 195216, 239635, 357868, 238904, 200797, 450763, 291190, 288722, 523841, 201031, 275481, 733679, 434905, 119468, 386216, 457384, 37574, 323541, 101848, 392267, 540744, 493472, 127592, 283903, 657024, 372926, 601902, 248503, 195270, 277674, 226266]
17402B26266M6155n2870N2937L77098k31155F5509K02909I5968J61592F9638J31700
17391B01338K52367m1790G4914J2221k3555L44394A18169J54045G5708K70265
17381C45973l5366j35434K29108k01658O2457J41963j60096P5200a3415A40866
17370B79226b7648B09324J55261J04867j62233k9715j28705K49622j79080L3633
17360B52974J11689j9648J4412K6592M9438I9506M28847A56669K06968A67942
17349d5355C33111A6819J22417K02867Q6633f2465A62924L71165B27805l826j4934
17338B09045J19012G2433L68524A67107M65436D9185K7841N17729A08241M3998
17328A52239J96845j65710M1088L3166M5874m7088a20797B59486P0893j21679
$$ y = [226266, 272421, 219551, 272488, 649586, 418431, 65509, 268418, 95968, 257560, 69638, 201338, 453705, 411915, 74914, 87135, 63580, 407974, 118169, 272214, 75708, 345973, 310607, 175173, 404281, 202623, 265080, 407043, 246947, 322147, -13415, 140866, 279226, -27648, 209324, 364585, 469452, 307219, 277504, 148799, 398421, 219341, 252974, 364663, 345015, 359427, 386019, 435457, 99506, 528353, 156669, 363637, 167942, -45355, 333111, 16819, 139236, 342103, 428736, -62465, 162924, 534089, 227805, 223979, 209045, 328057, 72433, 440957, 167107, 632543, 49185, 77026, 594755, 108241, 152239, 349084, 183374, 224462, 257628, 303502, 256414, -120797, 259486, 330379, 208700]
17318B08700J7576P5218R3938j45517P9234L3932r3324J60948j40217j22508J98487
17307C66467b1373C28276j02157J86893j99031M8098l7038l4209R3064K03797
17297D87693j34994j52706K4030I5272K61410O0370k0888A29624N22127H4850
17286A99659a79331D17072L9627j51768M9342j41441L807j1789K03024j46648
17276B61226j30429l8622L18987A44523K47639l8332J98423H3766K12024L11555
17266F07345A77656R4803L43286k61950J66110A54119K68578j19405K72427B86573
17255D53399k07036j06410d2424C25331A4209M66467k13728N3308j27656J26918
17245C19518k5568K97705j37378L4416F9925N14100A29332J60201O32397C05477
$$ y = [208700, 226276, 301494, 395432, 249915, 329149, 363081, 269757, 430705, 290488, 167980, 366467, -21373, 328276, 226119, 413012, 213981, 262079, 225041, 190832, 283896, 487693, 352699, 199993, 224023, 95272, 356682, 417052, 396164, 129624, 651751, 84850, 199659, -179331, 417072, 456699, 304931, 354273, 212832, 216639, 204850, 407874, 261226, 130797, 92175, 411162, 144523, 392162, 353830, 552253, 83766, 295790, 607345, 177656, 272459, 615745, 353795, 519905, 154119, 422697, 303292, 575719, 286573, 453399, 246363, 139953, -42424, 325331, 14209, 480676, 266948, 320256, 192600, 319518, 293950, 591655, 454277, 488693, 69925, 584025, 129332, 289533, 921930, 305477]
17234B83830L52727A53062K17129R0903A64144M30611k02035L1312A38224J56858
17224B95082j03426K88568J8536Q928n2530N1750j51424M7967Q3927K9815k47517
17213B69676L22835k70458Q8353j62605P74J22815j47470q4063M20349B50656
17202C06571N0199J23330R677L57701D05449J12j51881J99500K21990L0059i31
17190C71993j38293O2229o9187J80621j59450L67241m2339p5152M40798D07739
17179D24335R60B12235K57437K2759q6150J34786B43779J87121K39776k25428
17169D45248A66709D6130M86780q3022j20288M92657B24103L56898j48226Q7402
17159E20177j47816O3524p4442L14669k14276L88197l40965m6123Q9795j59770
$$ y = [283830, 636557, 153062, 370191, 461094, 164144, 594755, 392720, 424032, 138224, 295082, 191656, 480224, 498760, 507688, 455158, 506908, 355484, 403451, 487378, 517193, 269676, 592511, 322053, 410406, 247801, 248575, 371390, 223920, 139857, 560206, 250656, 306571, 356770, 480100, 489777, 847478, 405449, 405561, 253680, 453180, 675170, 705229, -931, 371993, 233700, 295929, 226742, 407363, 247913, 615154, 572815, 497663, 938461, 407739, 424335, 425295, 212235, 469672, 492431, 406281, 541067, 243779, 430900, 670676, 445248, 166709, 46130, 532910, 449888, 329600, 822257, 224103, 581001, 432775, 520177, 372361, 435885, 361443, 676112, 461836, 850033, 509068, 462945, 552740, 392970]
17149C92970L02268m8017K36750m04806k02771K03132O0626L19415l59365j28782
17139C71420K06879j93052J85277K75827n6082p74j43685k5039j11192n710J8466
17128E22335k30935M89014K33341j97791l04940K41079j44672K9319B79197L89713
17118F68910j05046J24026k13052J57819Q4555r8716j16729K52182k07073Q8608
17108F35484j29690K37070k71265k29736N21544N189J48456j84529j16996L50644
17098I66171B08767L93184L4406K446K53008l80313A77389L57679R4888J61635
17088G91591l40247L11842r125r3598o6459K73138K25973l09083J39266k93769
17078F29529j28578J55223N86013l18865r2765p7065j61406L42681K11904n55088
$$ y = [392970, 695238, 647221, 883971, 479165, 276394, 479526, 540152, 859567, 500202, 371420, 578299, 385247, 570524, 846351, 790269, 789495, 645810, 620771, 509579, 503869, 522335, 291400, 780414, 1013755, 815964, 511024, 752103, 607431, 636750, 279197, 668910, 563864, 687890, 474838, 632657, 717212, 618496, 501767, 753949, 546876, 635484, 505794, 742864, 471599, 241863, 763407, 768596, 917052, 732523, 615527, 966171, 208767, 601951, 636357, 638803, 891811, 511498, 177389, 535068, 629956, 791591, 451344, 763186, 754061, 660463, 594004, 867142, 1093115, 784032, 923298, 629529, 500951, 656174, 1242187, 923322, 830557, 753492, 592086, 934767, 1146671, 591583]
17068E91583L74561j5908p4308J42392k36767M6714k06561Q7255L1010K50577
17058I90548m71102J45586L01479J3053k52853J99175J16054j45844k90748M12895
17048A018243J9610D82856M81211R8557j68071N1903J1010J48374k19907M22425
17038A308358D46290O20520p8290K95445k5256l41231k99905L31157O4503j54317
17028H58916K36693M5141j30208J19707J33374j148k22855j30817J96831J34652
17018A240286k82748K61638j79227k04655M10252N6095k83621K5073K71335k0270
17008A294158j83347L35923j63352R6739q112k54903L73608m55050K36738J5151
16998A287553n5418K5606o284j25287J71206K23161R1492k60133m9500J39969
$$ y = [591583, 966144, 950236, 875928, 1018320, 781553, 828267, 621706, 708961, 739971, 990548, 519446, 665032, 966511, 979564, 726711, 925886, 1041940, 896096, 605348, 1018243, 1037853, 482856, 964067, 1062624, 894553, 946456, 957466, 1105840, 885933, 1308358, 446290, 1066810, 988520, 1283965, 1258709, 917478, 617573, 948730, 1013233, 858916, 1095609, 1140750, 1010542, 1130249, 1263623, 1262475, 1039620, 908803, 1105634, 1240286, 957538, 1219176, 1039949, 835294, 1245546, 1301641, 1018020, 1043093, 1314428, 1294158, 1110811, 1446734, 1283382, 1380121, 1372009, 1117106, 1490714, 1035664, 1272402, 1287553, 1232135, 1257741, 1251457, 1126170, 1297376, 1520537, 1612029, 1351896, 1302396, 1442365]
16988A442365R1850k36016J34866j07661L38229l81671P3840j25983K82510k84198
16978A228131L13631m5258r5392l1128k8741j61466K76479J6231N34920p06743
16968A300664M10604l7403J42676l04473o630j07268K03217J30787O6920m21742
16958A377352L54071q263q6999L0992L86564o57170L73939J89206k62769j04856
16948A592067K53098K15534m40474L61858k56509K93819m04241K90508K85036
16939B190696L6J10839l68578m2669q775K20519j54184J83702K71543j97397K07626
16928B413358l52068K38045k92905L17350J22397j25894K46440o04833K18047
16919B179937L9344L06272j64633M21088l49164m0884q9360L79482j70379N0397
$$ y = [1442365, 1534215, 1298199, 1433065, 1325404, 1663633, 1281962, 1355802, 1229819, 1512329, 1228131, 1541762, 1496504, 1401112, 1369984, 1341243, 1179777, 1456256, 1472487, 2007407, 1300664, 1711268, 1673865, 1816541, 1512068, 1505438, 1398170, 1601387, 1732174, 1799094, 1377352, 1731423, 1723160, 1636161, 1667153, 2053717, 1396547, 1770486, 1959692, 1696923, 1592067, 1845165, 2060699, 1620225, 1982083, 1725574, 2019393, 1615152, 1905660, 2190696, 2190732, 2301571, 1932993, 1890324, 1881549, 2102068, 1947884, 2131586, 2403129, 2205732, 2413358, 2061290, 2299335, 2006430, 2323780, 2446177, 2320283, 2566723, 1961890, 2179937, 2219281, 2525553, 2360920, 2782008, 2432844, 2391960, 2302600, 2682082, 2511703, 2562100]
16909B562100J01398j59682M48400k83225J31721j89047L17153J52376n4907l31830
16899B694457N3674J48749L24499j75986O2311J20858k20192P3780J66984O3989
16889C313123r0081K31158j90438L46149m46065O00603j68297k49073J32289K77130
16879C756498j90288L45258j59208J47180j66135k9318L20634J95068k70855M27489
16869D376323m7799l43675L64738J58108k5778J51885o4197Q2028r965K13399
16859D855067o1663j92154N78968m016j69044J36313q3007J30607L53756l99917
16849E144910L47753J8811M26473L34032p16728J77132M90944j86619l7825L63838
16839F362721r5026J68079N53709l61931J9607L00988p9844J80933O70174k28924
$$ y = [2562100, 2663498, 2503816, 2952216, 2668991, 2800712, 2611665, 2928818, 3081194, 3026287, 2694457, 2748131, 2896880, 3221379, 3045393, 3107704, 3228562, 3008370, 3082150, 3249134, 3313123, 3223042, 3454200, 3263762, 3609911, 3163846, 3764449, 3596152, 3347079, 3479368, 3756498, 3566210, 3911468, 3752260, 3899440, 3733305, 3703987, 4024621, 4219689, 3948834, 4376323, 4328524, 3984849, 4349587, 4507695, 4481917, 4633802, 4569605, 4651633, 4641668, 4855067, 4793404, 4601250, 5180218, 5176202, 5007158, 5143471, 5060464, 5191071, 5544827, 5144910, 5492663, 5511474, 5937947, 6271979, 5555251, 5732383, 6223327, 6036708, 5998883, 6362721, 6267695, 6435774, 6989483, 6627552, 6647159, 6948147, 6868303, 7049236, 7719410, 7490486]
16829G490486N8484p3575L20460M32581l06591J73140O26153l25132J55456K79518
16819H830980J76303o5142L67474K99004k01304O71742K09984j2834J70189L44327
16809A0790723L95646K58091J17714J07782J63087M93193J61070K16182M83031
16800A3186519K25380K08080N73971J37785J54812O11212L49790N35620J84189
16791A6167358K60763J84893J018353J68680N17516M20949M60634N59113M48349
16782B0206608O38296N88989M61789P60034J018725M39673M34110Q90337Q82310
16773B6320871P07623Q26844Q35827R25891R89829Q84026J047696P51383R63721
16764C4253711J536342J163040J154054J209050J453287J457063J241276J646177
$$ y = [7490486, 7548970, 7475395, 7795855, 8228436, 7921845, 8094985, 8721138, 8396006, 8551462, 8830980, 9007283, 8942141, 9309615, 9608619, 9407315, 10079057, 10289041, 10276207, 10446396, 10790723, 11186369, 11444460, 11562174, 11669956, 11833043, 12326236, 12487306, 12703488, 13186519, 13411899, 13619979, 14193950, 14331735, 14486547, 15097759, 15447549, 15983169, 16167358, 16428121, 16613014, 17631367, 17800047, 18317563, 18738512, 19199146, 19758259, 20206608, 20844904, 21433893, 21895682, 22655716, 23674441, 24114114, 24548224, 25438561, 26320871, 27028494, 27855338, 28691165, 29617056, 30606885, 31490911, 32538607, 33289990, 34253711, 35790053, 36953093, 38107147, 39316197, 40769484, 42226547, 43467823, 45114000]
16756D5114000J606481J651424J781318J654711J935870J384886K436727K077127
16748E9642544K040579J989106K721291K094342K270802K599120K543633K622019
16740G8523436K301469K651574K976170K538754K647380K840197K324597K256297
16732I9059874K542991K291022K007986K208289J237970J728509J464469J019121
16724A13560231R61609K01701K15071J34795k44887o45392r32389j635128p69545
16715A10846066j828959j719361j889331k575894k070790k573851k332685k620473
16707I3234722k834517k806164k790913k401935k582222k912333k593341k429727
16699G1883570k283739k566738k093536k537313k257804k576278j290990k532758
$$ y = [45114000, 46720481, 48371905, 50153223, 51807934, 53743804, 55128690, 57565417, 59642544, 61683123, 63672229, 66393520, 68487862, 70758664, 73357784, 75901417, 78523436, 80824905, 83476479, 86452649, 88991403, 91638783, 94478980, 96803577, 99059874, 101602865, 103893887, 105901873, 108110162, 109348132, 111076641, 112541110, 113560231, 114521840, 114723541, 114938612, 115073407, 114828520, 114183128, 113250739, 111615611, 110846066, 109017107, 107297746, 105408415, 102832521, 100761731, 98187880, 95855195, 93234722, 90400205, 87594041, 84803128, 82401193, 79818971, 76906638, 74313297, 71883570, 69599831, 67033093, 64939557, 62402244, 60144440, 57568162, 56277172, 53744414]
16691E3744414j764202j986781j490542j914234j371053j851087j503474j457936
16683D0405105j315568j188419j438849j261080r72893j170148q59195j259437
16675C0939516r86804o84261j146156o79881r76772q03959q90093r09770m49358
16666B3412462q00480o86267p72804o00811k9784q27496p12499l65743l93160
16657A8223418n02980o04374m70367m95844k78699m46834m18081K4999q85995
16648A4145243k34378j71345l44295l49702k98213J01386n16452m76966n03139
16639A1352139J64843k48005n20380J5369m05469P9001j49173o78100N6884l15320
16629I351789j35154n79537K80712j98153j04488k71412q13757M43781m6283L4058
$$ y = [53744414, 51980212, 49993431, 48502889, 46588655, 45217602, 43366515, 41863041, 40405105, 39089537, 37901118, 36462269, 35201189, 34228296, 33058148, 32198953, 30939516, 29952712, 29268451, 28122295, 27442414, 26465642, 25661683, 24771590, 23861820, 23412462, 22611982, 21925715, 21152911, 20552100, 20522316, 19694820, 18982321, 18616578, 18223418, 17720438, 17116064, 16645697, 16149853, 15871154, 15424320, 15006239, 15031238, 14145243, 13910865, 13739520, 13395225, 13045523, 12747310, 12848696, 12332244, 11855278, 11352139, 11516982, 11268977, 10748597, 10763966, 10358497, 10437498, 10288325, 9610225, 9667109, 9351789, 9216635, 8637098, 8917810, 8719657, 8615169, 8343757, 7530000, 7973781, 7927498, 7961556]
16619G961556m37817m15951O1127L99279p83651k3527J56847k23350m13235m7708
16609F233570k35842J174J79512J33964j48206m86730J30875N1102o45422K20065
16599E434062k10868N5169J16557l58422j9615l5663j74178J62649k11878j92059
16589D565754j68991R5548J45611k18182J32978m16374j48780K62247q1028P3426
16579D242209l10018l6265Q9090k66459M9593j12717l6140j53048r8973j4963
16569C352309k70323L70138n12632K50696K39948j63354j60113j27896J80351
16560C159124k38106J60882J19707j27023O386l4672k48393k37307M7163j1203
16550B596558M12622q8531m06320r3239L74853k05954Q5064k95898l2756O2459
$$ y = [7961556, 7523739, 7107788, 7168915, 7568194, 6784543, 6761016, 6917863, 6694513, 6281278, 6233570, 5997728, 5998902, 6178414, 6312378, 6164172, 5677442, 5808317, 5859419, 5213997, 5434062, 5223194, 5278363, 5394920, 5036498, 5016883, 4981220, 4807042, 4969691, 4757813, 4565754, 4396763, 4492311, 4637922, 4419740, 4552718, 4136344, 3987564, 4249811, 4168783, 4242209, 3932191, 3895926, 3985016, 3718557, 3768150, 3655433, 3619293, 3466245, 3367272, 3352309, 3081986, 3452124, 2939492, 3190188, 3430136, 3266782, 3106669, 2978773, 3159124, 2921018, 3081900, 3201607, 3074584, 3080970, 3046298, 2797905, 2560598, 2607761, 2596558, 3009180, 2920649, 2514329, 2421090, 2795943, 2589989, 2675053, 2379155, 2346399, 2408858]
16540B408858j12488L3287K15366j17210j48569J42600j72158J26893j04241j57352
16530B114986J39404n84548K99557J2857J48913j96350m2364J81092J55458n1605
16520B177400O6223m62116J42721K42221m63050N6492J04282L497m31913K42301
16510A678058J11237N3907j52661J15372M9970J74337l80674J75749j66893m16060
16500A242342M24436j11162K50783k13914k81963L21502l51207M12861K84095
16491A977773p74824L92922o4928J65884k73022o5917O4771Q7942l57181L86242
16481A539662j4677O443l86157J31691K69873j4777o7629m1421J60843m51634
16471A132217K8268r1312K54956j59269o70K36392l89316K56309k24949n7007
$$ y = [2408858, 2296370, 2329657, 2545023, 2427813, 2279244, 2421844, 2249686, 2376579, 2272338, 2114986, 2254390, 1669842, 1969399, 1982256, 2131169, 1934819, 1892455, 2073547, 2229005, 2177400, 2243623, 1781507, 1924228, 2166449, 1703399, 1759891, 1864173, 1867670, 1435757, 1678058, 1789295, 1843202, 1690541, 1805913, 1855883, 2030220, 1649546, 1825295, 1658402, 1242342, 1666778, 1555616, 1806399, 1592485, 1310522, 1632024, 1280817, 1693678, 1977773, 1202949, 1595871, 1530943, 1696827, 1423805, 1357888, 1422659, 1510601, 1153420, 1539662, 1524985, 1531428, 1145271, 1276962, 1546835, 1532058, 1464429, 1423008, 1583851, 1132217, 1160485, 1069173, 1324129, 1164860, 1164190, 1400582, 1011266, 1267575, 1042626, 985619]
16461I85619J43625L04879l46501j46705J82274K42215n00327J10767o8259N6546
16451I64133J5330J75427J15878k04090J44205m42847M80095k49625j52J55959
16441A154313l13618P3551j26727K79363m66408L12927J43900m18175K57249m0494
16431H55881j27994r3461L32253O2617q2633M0949j14082L9280K56400Q940k79696
16420H98454n0816O002q166j7691k2581r4551L23767E07528N49327j01861l50084
16409F04910k49938O60168m91880N1544Q582M25855k76778j07085l2732K82845
16399H75491p3401K8416l50579L10206k32124j21207L34838j77235L26117m33495
16389D87027N0603K56709k22895L03929C80606L81216B74892J82455L49662C88949
$$ y = [985619, 1129244, 1434123, 1087622, 940917, 1123191, 1365406, 865079, 975846, 907587, 964133, 979463, 1154890, 1270768, 1066678, 1210883, 768036, 1248131, 998506, 998354, 1154313, 840695, 914246, 787519, 1066882, 600474, 913401, 1057301, 639126, 896375, 855881, 727887, 634426, 966679, 1029296, 946663, 987612, 873530, 912810, 1169210, 1178150, 898454, 847638, 853640, 845474, 827783, 805202, 710651, 1034418, 507528, 1056855, 954994, 604910, 354972, 1015140, 523260, 574804, 583386, 1009241, 732463, 625378, 592646, 875491, 802090, 830506, 479927, 790133, 558009, 436802, 771640, 594405, 920522, 487027, 537630, 794339, 571444, 875373, 380606, 761822, 274892, 457347, 807009, 388949]
16378E59108K19703j11911j60868J77979j82707M2283J02301J5699J74959k28464
16368F08082R5659C04190L48720J49430n5742l27733J37785K26890j49175k91932
16358C42433O0812K49471l940j70511j58185K38340k9207L52412l27078j03941
16348D50606L9598m1704K98112k28893K011j98206J91920j68256J64921K2465
16338E32574j71664L45496k53037K2297k12522M13518m6458j23256J43646B31895
16327C22826N870q5032J3616P3814j57546K75654j78549Q8336f3326C81929k7249
16316C54680K41942j99784J6734A91620J33960N8953L5654M6619n5564A68675
16305D00222p5277L90849g3222B57898j09685o0871K63108J13517p3243j35894
$$ y = [559108, 778811, 666900, 506032, 684011, 501304, 543587, 645888, 661587, 836546, 608082, 703741, 304190, 652910, 802340, 746598, 418865, 556650, 783540, 634365, 342433, 403245, 652716, 648776, 478265, 320080, 558420, 529213, 881625, 554547, 450606, 490204, 448500, 746612, 517719, 519730, 321524, 513444, 345188, 510109, 532574, 360910, 706406, 453369, 475666, 263144, 676662, 630204, 506948, 650594, 231895, 322826, 328696, 243664, 257280, 331094, 173548, 449202, 270653, 358989, -63326, 381929, 354680, 596622, 396838, 413572, 191620, 325580, 384533, 420187, 466806, 411242, 168675, 400222, 324945, 715794, -73222, 257898, 148213, 87342, 350450, 463967, 390724, 254830]
16295B54830J76431N2550e0069D91967A75396K43794m9761j3662J43677A58224
16284A96388J70893A42872L05203j73757L0517n9285K70863j87951J16971E3133
16273C64257d974F00966k73023K43325F0412L41792j66397M6553J5582J2508m3908
16262B66542j06396k5301L44024A89589q9137J60480A30419A3309K43501K62912
16252E19722j38252Q1236k08837A6166M24209j9511j6252J15323q7100A45812
16241D57849A78374M5188J08265j26727K05323A52135K46850A89727L29741F8109
16230C02780C7212K64445d1555A27802J73902G9759J72335b6689D05931A71657
16219B98519c0685B40744J50868k4840H3188A3284L79615J2214q4688p7912R1685
$$ y = [254830, 431261, 483811, -50069, 491967, 175396, 419190, 369429, 355767, 499444, 158224, 196388, 367281, 142872, 448075, 274318, 304835, 245550, 516413, 328462, 445433, 53133, 364257, -4974, 600966, 327943, 571268, 60412, 402204, 235807, 282360, 297942, 310450, 266542, 160146, 134845, 478869, 189589, 100452, 260932, 130419, 13309, 256810, 519722, 381470, 462706, 253869, 16166, 440375, 420864, 404612, 519935, 432835, 145812, 457849, 178374, 223562, 331827, 205100, 410423, 152135, 398985, 189727, 519468, 68109, 302780, 37212, 301657, -41555, 127802, 301704, 79759, 252094, -26689, 405931, 171657, 298519, -30685, 240744, 391612, 366772, 83188, 13284, 392899, 405113, 320425, 242513, 334198]
16208C34198o3369a2866A59740K38082j32139O692A14174O3987G8884L65397j16686
16197C27595K04158C1933P280J72925b7706k671I675L32842A0057L16759q5085
16186B41731C8431L50318a79363F2583M9214n1201q973Q2245a96831A81582N2454
16175B34036N9625r0376J90417F3378b7175F0008J03915J25220H6694J20191H9846
16163a18748B04131b2721B08393K57734i4463c8864H4028K60388A57953k0571
16153A37382o355e1525A07985Q9511a20320C15251H4709a01943d432A38787i2395
16141A14671J48979K25862A81685j8046Q2544j04265K9089N7285n1554O903b65125
16129a24502C44344p0528n7308O8611H1637J89275C1951a83935d1113C00038d9926
$$ y = [334198, 270829, -12866, 159740, 397822, 265683, 272375, 114174, 178161, 78884, 444281, 327595, 531753, 31933, 39213, 212138, -27706, -30377, 9675, 342517, 10057, 326816, 241731, 38431, 388749, -179363, 62583, 111797, 60596, 51623, 133868, -196831, 181582, 234036, 293661, 203285, 393702, 63378, -27175, 60008, 163923, 289143, 86694, 206885, 89846, -118748, 204131, -22721, 208393, 466127, -94463, -38864, 84028, 344416, 157953, 137382, 131027, -51525, 107985, 197496, -120320, 315251, 84709, -101943, -4432, 138787, -92395, 114671, 263650, 489512, 181685, 163639, 246183, 141918, 171007, 228292, 176738, 183641, -265125, -124502, 344344, 273816, 216508, 285119, 81637, 270912, 31951, -183935, -41113, 300038, -49926]
16117B90194F536P6317C7573g9860A53483b9698J0368B72357n8657I5948K94675
16106C90623G7551M3856O1592o4971a67958H0610A4312J85867J00675m6690D0926
16094A06699h4351R557L7167m6024b739m47923a48590j00020B9173J50286J05552
16083B85011a85755P2899A1975K09525k9031J24182l6452a17964A08511c66791
16072B72758i0683A28259J80540A27920d107A53799F1035b41969A08259a20580
16061B53913d172A47107J14014j26181j537M3951D3385d7422j9553A68695J17
16050A68812d7415p4339H4902a30901b5423H4369l6131f0408H1652R6118f7872
16038A90578L0255B1715a79270a2009B22526K79159a1999j99333e4043H1678J10936
$$ y = [290194, 6536, 82853, 37573, -79860, 153483, -29698, -19330, 272357, 213700, 95948, 390623, 77551, 121407, 182999, 118028, -167958, 80610, 14312, 200179, 300854, 254164, 40926, 106699, -84351, -74794, -37627, -83651, -2739, -450662, -148590, -248610, 29173, 179459, 285011, -185755, -112856, 11975, 221500, 192469, 316651, 280199, -117964, 108511, -366791, 272758, -90683, 128259, 308799, 127920, -4107, 153799, 61035, -241969, 108259, -120580, 253913, -4172, 147107, 261121, 134940, 133403, 177354, 43385, -47422, -66975, 168695, 168812, -47415, -121754, 84902, -130901, -25423, 84369, 48238, -60408, 81652, 177770, -67872, 190578, 220833, 21715, -179270, -12009, 222526, 501685, -11999, -211332, -54043, 81678, 192614]
16027A92614E8958J97435g3933k62538B74219A34254c67428A16927c1223p7182
16017a08405a7741m3819p4340c2961j24831B31477I8447M6290a58954A21390J63304
16006B84694F0986d4366B2587L51415f6994p9728C11087A44734k1940C7121K62856
15995B99977o2196h4588G5471J71810B532K6624d5661B92479J2826J02367L16983
15984G24655N03713R1242q490m67071k13574A95685p000j5501i1042A74564h0907
15972H9454a7558j4967A69311d6622D6898K25247j24573F5081K0965J52512b097
15960G4842a64927F4864N4103c21344a01035C3410M9017a76365A13939a99838
15949a8517A55751a56865H8674b12416j9734B5192c1359A51929b37387b7301I1039
$$ y = [192614, 58958, 256393, -73933, -336471, 274219, 134254, -367428, 116927, -31223, -108405, -17741, -61560, -135900, -32961, -157792, 231477, 98447, 144737, -158954, 121390, 284694, 60986, -44366, 22587, 374002, -66994, -146722, 311087, 144734, 122794, 37121, 299977, 237781, -84588, 75471, 247281, 2532, 29156, -45661, 292479, 305305, 407672, 724655, 1228368, 1319610, 1311120, 844049, 630475, 195685, 188685, 173184, -91042, 174564, -80907, 89454, -17558, -32525, 169311, -46622, 46898, 272145, 147572, 65081, 86046, 238558, -2097, 74842, -164927, 64864, 118967, -321344, -101035, 33410, 82427, -176365, 113939, -199838, -18517, 155751, -156865, 88674, -212416, -232150, 25192, -31359, 151929, -237387, -27301, 91039]
15937D6044e6429A15366a79732B25807q3682J871c67166A43237J11564a90117
15926e0927K4025m3767k27506a00465B36524b5443B65526p0242a82878B02604
15915e5158C0473a5729k63619A29464e8694o6152F4388N5147j4344D3972a25456
15903B27164n7915h9526c2858A9854K120b1283l51096D7862i6627a8736k42603
15892b61339A7923N9709c71571n6977l897D7127h4096B93510a5789A44670l8111
15881A06559e1948B18538e8219B31160o1149q589C31g0167p7806A05538O7579
15870A73117c7200o18358b95225e4660B36766j16792P2209a54912q4372B574J01011
15859A03585i998A3004K27790d43775a35194F06Q9828L0947e5191C8283i3019
$$ y = [46044, -56429, 115366, -179732, 225807, 142125, 143996, -367166, 143237, 254801, -190117, -50927, -26902, -70669, -298175, -100465, 236524, -25443, 265526, 195284, -182878, 202604, -55158, 30473, -15729, -279348, 129464, -58694, -124846, 64388, 119535, 105191, 43972, -125456, 227164, 169249, -89526, -32858, 19854, 21974, -21283, -372379, 47862, -96627, -18736, -261339, 17923, 77632, -371571, -428548, -432445, 47127, -84096, 293510, -15789, 144670, 106559, -51948, 218538, -58219, 231160, 170011, 161422, 331, -70167, -147973, 105538, 173117, -37200, -655558, -295225, -54660, 236766, 119974, 192183, -154912, -239284, 2574, 103585, -9998, 13004, 240794, -443775, -135194, 606, 90434, 121381, -55191, 38283, -93019]
15847c6834I9816a02856C0161K0472b01166A24883c10685c3301G3699e7341A39321
15835i0406o3757A55263k4857b04807I7063e1055j30152C1479e5656j56190e571
15823D7183b29361d6321A61368a85874K2302C29329C4022K41237b80955B91602
15812i1053A30525c15214C3468b23632A39745f8230B74280B263b25165H2028A972
15800D6068c1294k30867D81J44509g1295I9671B7800J18521h6480M0019C7486
15788a7029r9133B09467r0401a00833l10949G2915h9609L1069n8277k30749A47907
15776b5403j41390c8896E6214b05997A51785a41532A20967A1156Q5509d0579l1997
15765g2576o9340A22016c2959A30019K9975c5031M760A66751a60572E1230e0831
$$ y = [-36834, 99816, -102856, 30161, 50633, -201166, 124883, -310685, -33301, 73699, -57341, 139321, -90406, -154163, 155263, 130406, -204807, 97063, -51055, -181207, 31479, -55656, -211846, -5571, 47183, -229361, -46321, 161368, -185874, -163572, 329329, 34022, 275259, -280955, 291602, -91053, 130525, -315214, 33468, -223632, 139745, -68230, 274280, 2263, -225165, 82028, 1972, 46068, -31294, -262161, 481, 144990, -71295, 99671, 27800, 146321, -86480, -46461, 37486, -17029, -116162, 209467, 119066, -100833, -411782, 72915, -89609, -58540, -116817, -347566, 147907, -25403, -166793, -38896, 56214, -205997, 151785, -141532, 120967, 11156, 96665, -40579, -72576, -141916, 122016, -32959, 130019, 159994, -35031, -30271, 166751, -160572, 51230, -50831]
15753D3650J11107b7491I0635e9865k05512H5629K27341o5817C9356M25822r3496
15742C71682g0207A79704g5347b5650j11478n8877C8430b48207a320j47157c6312
15730f2614l8177E8669b65172h3406m95790b77628F6745j2921a80481k1788f6003
15718a08796l0378d9417r8831N3208j02583A2542J10724c70274J80040O0527B1001
15706A33694f1282K8343r3042d4059m311k7158i025C2302P3407a64574M0572j52973
15694b76975A06009a20003L4882J4149D67736c1989C31047m4857j6131C4163M8053
15683H2216j5401a24161l8114j03028J06680L8898F2440N8791b4212j2887h812
15671B34432I4859a12622J6018B16187G8258o456b04313e923k73384h024B7295
$$ y = [43650, 154757, -27491, 90635, -59865, -265377, 85629, 312970, 247153, 39356, 465178, 371682, -70207, 179704, -75347, -25650, -137128, -196005, 38430, -248207, -1320, -148477, -36312, -62614, -100791, 58669, -265172, -83406, -579196, -277628, 66745, 53824, -180481, -202269, -66003, -108796, -139174, -49417, -148248, -95040, -197623, 12542, 123266, -370274, -190234, -129707, 21001, 133694, -61282, -32939, -125981, -44059, -48370, -75528, -9025, 32302, 105709, -164574, -124002, -276975, 106009, -120003, -85121, -70972, 467736, -31989, 331047, 286190, 270059, 34163, 82216, 66815, -124161, -162275, -265303, -158623, -119725, 62440, 121231, -24212, -37099, -8812, 234432, 94859, -112622, -96604, 216187, 78258, 71802, -204313, -5923, -279307, -8024, 27295]
15659b88288D6113i7124j11143B23233A10407e6038j10193c6532I6457p456b22701
15647b30860R9462j27754A27106g4917G0910l1011d4015B63775b1196A58082p1832
15636H6250a21102k43453G720b25472D06871b00585B71333D7834a54086B37294
15625f3521r6200B9695K13135I0128f5276A57017a58650L3536f2147I020L1478
15614D0498M4700g7315K829p1098f5613l12690a62631N2218c8433k05127A68664
15602A70872f7426o564A17307J09840c8266O634j373C0710a43498d28j89251N1821
15590a37858A44247m5590D0513h5132A24418b25068A657L04776A5467b61428a00387
15578c72129A56640h2503p2056d3327B46845d9323C3165Q822K47395d56457A21976
$$ y = [-288288, 46113, -97124, -208267, 223233, 110407, -56038, -166231, -36532, 96457, 89001, -222701, -230860, -131398, -259152, 127106, -74917, 70910, 39899, -44015, 263775, -21196, 158082, 86250, -121102, -364555, 7720, -225472, 406871, -200585, 271333, 47834, -154086, 237294, -63521, -159721, 29695, 242830, 90128, -65276, 157017, -158650, -125114, -62147, 9020, 40498, 85198, -77315, -74486, -145584, -65613, -378303, -162631, -110413, -38433, -243560, 168664, 170872, -67426, -73990, 117307, 227147, -38266, -31632, -33005, 30710, -143498, -428, -189679, -137858, 144247, 98657, 40513, -85132, 124418, -225068, 1657, 306433, 15467, -261428, -100387, -372129, 156640, -82503, -154559, -43327, 246845, -49323, 33165, 41987, 289382, -456457, 121976]
15566a20035l6308d8780k81869d403F2684b531r5882A24966O5772L1868a61843
15554b65205C1713b33727C23281H7385i1133B73438A2456h3471H7575B4963a9544
15542B67128o43b04046Q3373Q941H4757l0412A9102L24498a79987H5622e0039
15530c67334B10658b79478A14192c1060B23708a06058B8705a29119A68982C6298
15519B2114K03188b7004C57951q2132j08523i5216D697K02230j6754I3328M68955
15508E62283G7389Q1180O1023I5205K8639A6315J7359J31975m6169j5490K8329
15497A32319E7024L03970J20647a59557A03693a12347k96253A29840m6681b1642
15486D53547H4892b09215C7303e7926A12449K0884a28440C0756O1444J81286q0165
$$ y = [-120035, -156343, -48780, -330649, -4403, 62684, -2531, -98413, 124966, 190738, 222606, -161843, -265205, 31713, -233727, 323281, 87385, -91133, 273438, 12456, -83471, 87575, 24963, -19544, 267128, 266485, -204046, -120673, -111732, 84757, 54345, 19102, 343600, -179987, 85622, -50039, -367334, 210658, -279478, 114192, -31060, 223708, -106058, 28705, -129119, 168982, 36298, 22114, 225302, -27004, 357951, 275819, 167296, -95216, 4697, 206927, 190173, 93328, 562283, 77389, 158569, 219592, 95205, 123844, 16315, 33674, 165649, 119480, 103990, 132319, 57024, 360994, 481641, -159557, 103693, -112347, -408600, 129840, 83159, -21642, 453547, 84892, -209215, 37303, -57926, 112449, 133333, -128440, 30756, 92200, 273486, 193321]
15475A93321L07807J24534N9312O4924l72461N7348j02295G6052O4745o0526a00242
15463e953k88857h9841A47190E3991Q0795J60628A29270E8575a14306E9040j5295
15452D3745N0529a33847D3715J68148F9589e7689B78648E1452K31093K38561J85284
15441G06390L97277M82945k16886E24493K20827A46455M49317A22571a2444C13814
15430A36972a78347K4097f7167j07680A11877H327f5602j44900b9313B01034C230
15418a2956A7207c82C3488L548d8752B31371F125Q2288J61369a93137B7294O3751
15406I1045a92382A3069J35301f8171A21464b28519C56182r1333a16621d9918
15395c12278A64406g5726j78281A2217b77280N7638A64695n8791G946N0928k3470
$$ y = [193321, 501128, 625662, 684974, 749898, 377437, 434785, 332490, 76052, 140797, 80271, -100242, -5953, -294810, -89841, 147190, 53991, 134786, 295414, 129270, 58575, -114306, 59040, 43745, 94274, -133847, 43715, 211863, 69589, -57689, 278648, 51452, 282545, 521106, 706390, 1103667, 1586612, 1369726, 524493, 745320, 146455, 595772, 122571, -12444, 313814, 136972, -178347, -154250, -67167, -174847, 111877, 8327, -65602, -210502, -29313, 201034, 3230, -12956, 17207, -382, 33488, 37036, -48752, 231371, 6125, 88413, 249782, -193137, 27294, 91045, -192382, 13069, 148370, -68171, 121464, -228519, 356182, 264849, -116621, -49918, -312278, 164406, -75726, -254007, 12217, -277280, -219642, 164695, 105904, 7946, 58874, 35404]
15384C5404c3178B05532a23354e8490j48116N9444A35289H988J2652L83826A74708
15372C36654J30948j76775J50448A6366M2389Q1746m7089a2109B53919C4175J46057
15361A80232n8994K05315j01172o5642K24099j13146A31639J25601A3723M3098
15351E6821M57749q3631j97568K08107B11484A02675O6369J32144A6523K56784
15341B73307J39798k5870j858j85025j1498L0079i9112A99133a9802j03134A92091
15329i709I0463b26025A08452l9733a53105B8068a0746A10324n3781e7717D4110
15317a03855k33436c8431A54350K28356H5456L65928A0392Q3172O9482L14566
15307D77612B0831O1297a27654A85949g8906a1158A84807o3182D9457J48147J72986
$$ y = [35404, -33178, 205532, -123354, -58490, -206606, -147162, 135289, 8988, 21640, 405466, 174708, 336654, 467602, 290827, 441275, 16366, 58755, 140501, 93412, -12109, 253919, 34175, 180232, 121238, 326553, 225381, 159739, 383838, 270692, 131639, 257240, 13723, 56821, 514570, 430939, 233371, 441478, 211484, 102675, 169044, 301188, 16523, 273307, 413105, 387235, 385377, 200352, 188854, 218933, -99112, 199133, -19802, -122936, 192091, -9709, 90463, -226025, 108452, 68719, -153105, 28068, -10746, 110324, 56543, -57717, 44110, -103855, -337291, -38431, 154350, 382706, 85456, 451384, 10392, 93564, 163046, 477612, 20831, 82128, -127654, 185949, -78906, -11158, 184807, 121625, 49457, 197604, 370590]
15296C70590i8683j66816P2828g4611B65989D4939L2128a22680A6759K82781K5578
15285C25118r3456A821K67537A4795L40312B6924P5290k381B8714a93234A21757
15273a07478A8823Q9310a42348D85643A33051b34931a00151b4582j59135B84032
15262A37655F788K63757I748i3330B14064N6711b8076C87852a93204f6117B0340
15250I7547b868A2924P5140L69326G0432b692A40957J22047N40335O4003J218015
15239B085357o23442K78203K7649G72632B43136j12361Q2998d6582l9274j35740
15229b21596C99489j91167c6637b389j86880h2240a7665C8152L4655a88458b4545
15217A18616A0192c25783B41949k2909A2059M0175L54475e0702A91141P0912E5384
$$ y = [370590, -98683, -265499, -192671, -74611, 265989, 44939, 77067, -122680, 16759, 299540, 325118, 231662, 1821, 269358, 14795, 355107, 26924, 102214, 99833, 28714, -193234, 121757, -107478, 18823, 108133, -142348, 485643, 133051, -234931, -100151, -24582, -183717, 284032, 137655, 6788, 270545, 9748, -93330, 214064, 270775, -28076, 387852, -193204, -66117, 20340, 97547, -2868, 12924, 88064, 457390, 70432, -2692, 140957, 263004, 803339, 867342, 2085357, 1461915, 1740118, 1767767, 772632, 243136, 130775, 213773, -46582, -85856, -221596, 399489, 208322, -36637, -2389, -189269, -82240, -17665, 38152, 72807, -188458, -24545, 118616, 10192, -325783, 241949, 219040, 12059, 52234, 406709, -50702, 191141, 262053, 55384]
15205G9100i9640p2018O6654A80281J23620K27561e8659C27771O9396A15607c616
15193B72432j32871O2478m6107O4986b61951I1870a67221H5554a03894A36396
15182a02177k1994j05351F8339L6440B4149K63599j4382j24706o2165L39086j81339
15171B44242i1804l1183B65368b1021m12198g1251A70034L6816b47151b6709A2148
15159A78966l679M7317p0372J57685j47906k737b02651B0196a5384B23647a8678
15147a5248A5331J24609j8307O9561J19690f8696B10478a08357A5548Q1621J5471
15136A12640K9158J85521p6400C4919n267L16522q9099q6359D5056O7883C3679
15124A12328e8682m6062A70300L62751r9338L1924j72525P526o8731p3518O3037
$$ y = [79100, -99640, -171658, -105004, 180281, 303901, 531462, -58659, 327771, 397167, 115607, -3616, 272432, 139561, 202039, 155932, 220918, -261951, 91870, -167221, 85554, -103894, 136396, -102177, -124171, -229522, 68339, 104779, 24149, 287748, 273366, 148660, 86495, 425581, 244242, -91804, -122987, 265368, -21021, -433219, -71251, 170034, 206850, -247151, -26709, 12148, 178966, 175287, 222604, 152232, 309917, 162011, 159274, -202651, 20196, -15384, 223647, -18678, -15248, 15331, 139940, 121633, 191194, 310884, -68696, 210478, -108357, 15548, 97169, 112640, 141798, 327319, 250919, 34919, 29652, 346174, 257075, 170716, 45056, 112939, 33679, 112328, -58682, -104744, 170300, 533051, 433713, 465637, 293112, 300638, 231907, 158389, 221426]
15113B21426I815J07625D1874J03382a61354L1003b7023A13871B9044L42616j41292
15102B30368m2829m6866a03865D75763A73157G5846J18694m5700C9199F411R4012
15091A00423R3007D5692O3000g3288B82583d44693D8503p198a10025B40306R241
15080B49547H5455J81542j21713c0501A53061l2220D3552J62874l9452j3327K78062
15069D31709g7510j45635H2221K50711b74205B97701Q8324j58786r2738O22205
15059G56706C10171H960M46283j45482D6092O147R0526J4570K78112F5794J01219
15048A67013M90151m8268q6551A45657L46308A46609K31517O6538J09189k70870
15038B82983m8915J48524A55198K74780J49075n7850M2971J26640k06646J51347
$$ y = [221426, 9815, 117440, 41874, 145256, -161354, -130351, -27023, 113871, 29044, 371660, 230368, 187539, 140673, -103865, 475763, 173157, 75846, 194540, 148840, 39199, 6411, 100423, 193430, 45692, 108692, -73288, 282583, -444693, 48503, 41305, -110025, 240306, 249547, 85455, 266997, 145284, -30501, 153061, 120841, 43552, 206426, 166974, 153647, 431709, -77510, -223145, 82221, 332932, -274205, 297701, 386025, 227239, 134501, 756706, 310171, 8960, 455243, 309761, 46092, 52239, 142765, 157335, 435447, 65794, 167013, 657164, 608896, 522345, 145657, 491965, 146609, 378126, 444664, 553853, 282983, 234068, 382592, 155198, 429978, 579053, 521203, 564174, 690814, 484168, 635515]
15028F35515k27901J4171K66111k55859K75005B55938K33438k4707J58027o7773
15018E54923J33235k46488k936j16797c3183C85304j33961A13369N26743B31365
15007E98703m3501I4322L88880k3633Q6840j65722j1898J66078J6895r687j68991
14996C73084n8563M56448C26125J95532B08803L21070j15869K6956R8116K68725
14986H07801k94843k05265N16030j53695K36755l16830M25676j91473j75156R7205
14976G46205l70151K14627k75965L67568r3934j13121J02170K7568n5642r6774
14966D52551j91366j6118J16075o6884p1758I8397J76429K89912k62245I2043
14955C10881J2742K32455h750H4625R6079L42522m2257A75628P2087J98436k08820
$$ y = [635515, 407614, 421785, 687896, 432037, 707042, 255938, 489376, 464669, 622696, 554923, 688158, 441670, 438734, 321937, -33183, 385304, 251343, 113369, 640112, 231365, 598703, 555202, 94322, 483202, 459569, 546409, 380687, 368789, 534867, 551762, 542075, 373084, 314521, 770969, 326125, 521657, 208803, 529873, 414004, 440960, 539076, 807801, 512958, 307693, 823723, 670028, 906783, 589953, 1015629, 824156, 649000, 746205, 376054, 590681, 314716, 682284, 588350, 475229, 577399, 604967, 549325, 452551, 261185, 245067, 361142, 294258, 222500, 98397, 274826, 564738, 302493, 92043, 310881, 323623, 556078, -8750, 84625, 180704, 523226, 480969, 175628, 247715, 446151, 237331]
14944B37331J46612M67115k05182M089B81321o710K23142j33295M26535A52105
14933D18517J00616L78226k86599K93637n4332M28142L78128j1617J44553P0778
14923A860049k90616j63842l7293J5999K28070L54835K14754N31399o09645k65728
14913A837982l62802l32928n8579k68263o7515j4044k6411n5134j55656j34641
14903C62009j17269F2356M26074j61971K85812k18978D7023L05368M04590j10876
14893F46105k91885L02622A24309K50272k2364J18565J97884k61733J03784K76099
14883G86816P237J4814P8661k79271K94307k52620J32008j97921R9965j04202
14873E79794R1997A69675L26981P4390l8032M4363m5479M72753m80022K43918
$$ y = [237331, 383943, 851058, 645876, 649965, 281321, 274611, 497753, 364458, 790993, 152105, 418517, 519133, 897359, 610760, 904397, 850065, 1278207, 1656335, 1644718, 1789271, 1860049, 1569433, 1405591, 1368298, 1384297, 1612367, 1967202, 2181956, 2713355, 2103710, 1837982, 1475180, 1142252, 1083673, 815410, 747895, 733851, 707440, 652306, 496650, 362009, 244740, 62356, 488430, 326459, 612271, 393293, 47023, 352391, 756981, 646105, 354220, 656842, 124309, 374581, 352217, 470782, 668666, 406933, 510717, 786816, 794053, 808867, 887528, 608257, 902564, 649944, 781952, 584031, 683996, 579794, 671791, 169675, 496656, 571046, 533014, 577377, 531898, 1004651, 524629, 768547]
14863G68547q9680k2273C02636L2694L49399B94533m1049J92335o8048L2624L84212
14852G94607C91179l3002m3139L32538j75391J44261n1788J0309J59110M18279
14842A152356j81386J60473l7039j36749k78439J24409p3302K2894m7536J31938
14832H37619j62461j39475j73835J57494r6774M1698r4521M28258Q2676l07393
14822E73286q4465B31986J79621N79529k48402K22129m1194R7968m30647M7505
14812F38495K68621l72859J14459r587l286O3232K05856L80220l12528K48852
14802A221475m56009K81794m00752m5672j46650q9721K96740j91091J79352J9917
14792F69383j83457N2306j72577L3516J57324O457K5327L05162j86432q2k49890
$$ y = [768547, 678867, 656594, 302636, 335330, 684729, 294533, 253484, 445819, 377771, 410395, 794607, 391179, 358177, 315038, 647576, 472185, 616446, 564658, 574967, 734077, 1152356, 970970, 1131443, 1094404, 957655, 679216, 803625, 730323, 753217, 705681, 837619, 675158, 535683, 361848, 519342, 422568, 464266, 369745, 798003, 880679, 573286, 488821, 231986, 411607, 991136, 742734, 964863, 923669, 1021637, 590990, 638495, 907116, 534257, 648716, 639129, 635843, 699075, 904931, 1285151, 972623, 1221475, 765466, 1047260, 646508, 600836, 454186, 364465, 661205, 470114, 649466, 669383, 485926, 538232, 365655, 399171, 556495, 562952, 588279, 893441, 707009, 706927, 457037]
14781D57037M4666K60731m5238J32115M5876K46258m04690m8237L32394k28398
14771G92514j57181J80781J31926k45787r4734k77282J10984J19377j53218L03897
14761G11277k2872j77773R9527k65888J76060l902B48174J09468K77533J64342
14751G99517j41894P6433m9605K3208k58838L32515j36952j80845N87564m89563
14741E61540K94514o6413r2658R368J13123j98469M70580l88119K82473j17247
14731H68692N66741o4313j89644L02078O49766m20659K08080o89148k39464M1367
14721A033496M780j29452k74531L17379J68720o0136j83693j07360J71500K82154
14711A222857D99764N22475j01506k27869K64628j94760N09876J71623k1710O9254
$$ y = [457037, 501703, 762434, 717196, 849311, 895187, 1141445, 736755, 688518, 1020912, 792514, 635333, 816114, 948040, 702253, 607519, 330237, 441221, 560598, 407380, 711277, 688405, 510632, 610159, 344271, 520331, 516429, 248174, 357642, 635175, 799517, 657623, 734056, 684451, 707659, 448821, 781336, 644384, 463539, 1051103, 561540, 856054, 789641, 696983, 706351, 819474, 621005, 1091585, 703466, 985939, 868692, 1435433, 1371120, 1181476, 1483554, 2133320, 1712661, 1920741, 1231593, 992129, 1033496, 1038276, 908824, 634293, 951672, 1120392, 1060256, 876563, 769203, 940703, 1222857, 499764, 1022239, 920733, 692864, 957492, 762732, 1272608, 1444231, 1422521, 1491775]
14701A491775K17861L68554l39454k26580m69569J56761k10346r6460L34505j77739
14691A049308J34058l84693j44959K81065R4128K4688m34275L39920j6787j51739
14681G90714J34886L1766j20310K02926J03132p0504q4712J09813j0816k31598
14671H55297P4639l0079O296M8243J16584j39497r1734L22426P4338j49246j82089
14660I05178L31190n60818M73183k62400K46721j29656J08897K25287q6863R6822
14650A347541K48993m75181J1832M1862l01231J86547Q1933m3474m4408J49327
14640A203741O3841J07241l67113J69625O8490K68534l33908p8107M8640o4680
14630A086304J06527k06262m0672L72207k5731K38293j68602k71601K3130p1604
$$ y = [1491775, 1709636, 2078190, 1738736, 1512156, 1042587, 1199348, 989002, 892542, 1227047, 1049308, 1183366, 798673, 653714, 934779, 1028907, 1053595, 619320, 959240, 942453, 790714, 925600, 957366, 837056, 1039982, 1143114, 1072610, 987898, 1097711, 1086895, 855297, 929936, 899857, 906153, 954396, 1070980, 931483, 839749, 1162175, 1236513, 1087267, 905178, 1236368, 675550, 1148733, 886333, 1133054, 1003398, 1112295, 1337582, 1250719, 1347541, 1596534, 1121353, 1133185, 1175047, 873816, 1060363, 1142296, 1098822, 1054414, 1203741, 1267582, 1374823, 1007710, 1177335, 1245825, 1514359, 1180451, 1102344, 1150984, 1086304, 1192831, 986569, 945897, 1318104, 1292373, 1530666, 1362064, 1090463, 1113593, 1041989]
14620A041989J88737l1814J43502k64158L43401l35890J62474J37015j02897L71288
14610A653647j84322l2881m6727L62478k97087Q6260j08806J53779m3985J00470
14600A642826j51350Q3183k11702J61714L86308k76296Q1802J43382m13213L05263
14590A751917Q4775l88674N76223m06679J50144O5602n32076L19771L47726j8194
14580A950535j35598J2839K55086l63293K87868j78953O0935Q5263j2542M1066
14570B003206k27132K67628j39870m8812K15180M39380l78492K07034o723J48457
14560B479856P6366K10242l78196N42191l13545N94634J64757M16975J82138M44929
14550D420347P50375J616748L172921P835011K1128132N215652B0551121H183648
$$ y = [1041989, 1230726, 1198912, 1342414, 1078256, 1421657, 1085767, 1248241, 1385256, 1282359, 1653647, 1469325, 1436444, 1389717, 1752195, 1455108, 1541368, 1432562, 1586341, 1542356, 1642826, 1491476, 1574659, 1362957, 1524671, 1910979, 1634683, 1716485, 1859867, 1446654, 1751917, 1836692, 1448018, 2024241, 1617562, 1767706, 1833308, 1301232, 1621003, 1968729, 1950535, 1814937, 1827776, 2082862, 1719569, 2007437, 1828484, 1889419, 1974682, 1962140, 2003206, 1776074, 2043702, 1903832, 1855020, 2070200, 2509580, 2131088, 2338122, 2331399, 2479856, 2556222, 2766464, 2388268, 2930459, 2616914, 3211548, 3376305, 3793280, 3975418, 4420347, 5170722, 6787470, 9960391, 17795402, 38923534, 44139186, 20551121, 8183648]
14541D373856j145977m65853l13585K992N21769K283416r42881j651001m03995
14532B258741j16115j06652l12839M25239Q7238j41024M4582m6815J37030J51653
14522B381038k20216J44285N0068o1782Q7715J36046k42370J11862o0241j72973
14512B153432P36424l6237j00704j98330L3984J84099k34874K53256J61944m9061
14502B903933j3239L6448J58681k70837N17648l76149L110J49470J7592k21439
14492B905218O38721n73386P34618k91965l34877K80563j10703J49205J69234
14483C566628l41944M84056m7617j79898M9764J42850R7359P8116j38721K00588
14473C911181j39814Q3603l5734J79055n5822l2438K59604K10573k24400L43468
$$ y = [4373856, 3227879, 2762026, 2448441, 2451433, 2973202, 5256618, 4313737, 2662736, 2258741, 2142626, 2035974, 1723135, 2148374, 2235612, 2094588, 2139170, 2092355, 2229385, 2381038, 2160822, 2305107, 2355175, 2293393, 2381108, 2517154, 2274784, 2386646, 2326405, 2153432, 2889856, 2853619, 2752915, 2554585, 2588569, 2772668, 2537794, 2791050, 2952994, 2903933, 2890694, 2927142, 3085823, 2814986, 3332634, 2956485, 2959595, 3109065, 3126657, 2905218, 3543939, 2970553, 3705171, 3413206, 3078329, 3358892, 3248189, 3397394, 3566628, 3224684, 3708740, 3661123, 3481225, 3530989, 3673839, 3771198, 3849314, 3710593, 3911181, 3771367, 3854970, 3819236, 3998291, 3942469, 3910031, 4169635, 4380208, 4155808, 4499276]
14463D499276l36408M47736J92387k00589L43647k74584q416K21543N1016Q0907
14453E016515r7153M8175N40381n18588q4780M17090j42646M56102j93590m1494
14443E400012M44771k91621K77553n4685L19488j80367K67068J19174k29745J76739
14433F248387J35729k95493M95666q7015K39305J31969l26563P21744n8139r9853
14423G105737J52107J35090K06606L72282K7490J12037k8140J17899p6380k2878
14413H101850L56575K2375k8504N09432j31860N73134m39685L18259L21226Q0936
14403I683738M22915l67589L15494r7773r846L68054J79664R1348J34187N87969
14393A1308161l28794J84227K63539M78931J1240M45586J6781L29792k6040M73681
$$ y = [4499276, 4162868, 4610604, 4802991, 4602402, 4946049, 4671465, 4663049, 4884592, 4935608, 5016515, 4919362, 4967537, 5507918, 4989330, 4904550, 5321640, 5178994, 5635096, 5441506, 5400012, 5844783, 5553162, 5830715, 5776030, 6095518, 5915151, 6182219, 6301393, 6071648, 6248387, 6384116, 6088623, 6584289, 6497274, 6736579, 6868548, 6541985, 7263729, 7205590, 7105737, 7257844, 7392934, 7599540, 7971822, 7999312, 8111349, 8083209, 8201108, 8124728, 8101850, 8458425, 8480800, 8452296, 8961728, 8829868, 9403002, 8963317, 9281576, 9602802, 9683738, 10106653, 9739064, 10054558, 9956785, 9946939, 10314993, 10494657, 10586005, 10720192, 11308161, 10979367, 11163594, 11427133, 11906064, 11917304, 12362890, 12379671, 12709463, 12683423, 13157104]
14383A3157104L10920J94558L42879M59931L2882K83724o0421M79005r687L92792
14373A5583687N69779n0682N14784N478Q17772L10046L07307M25186M63738J46326
14363A9093421M74991M3244M29226L73530O06156M69989M42305M74564K47640
14354B2655066R11088O69246M18570P62384N48999M42593O37060P48431P14880
14345B8508317J011187K59872J132526O29101P65463R51180J000423O55286J185066
14336C6098421J137565R64327J163730J266333R61209J598767J274362J087536
14328D5552250J444211J723359J119229J982773K059221J453794K329304J897424
14320E9561565K232700J905599K591266K046421K436131K875704K679494K901682
$$ y = [13157104, 13468024, 13662582, 14005461, 14465392, 14498274, 14781998, 14721577, 15200582, 15190895, 15583687, 16153466, 16102784, 16617568, 16623046, 17440818, 17750864, 18058171, 18483357, 18947095, 19093421, 19568412, 19611656, 20040882, 20414412, 21020568, 21490557, 21932862, 22407426, 22655066, 23566154, 24235400, 24653970, 25416354, 25965353, 26407946, 27045006, 27793437, 28508317, 29519504, 29779376, 30911902, 31541003, 32306466, 33257646, 34258069, 34913355, 36098421, 37235986, 38200313, 39364043, 40630376, 41591585, 43190352, 44464714, 45552250, 46996461, 48719820, 49839049, 51821822, 53881043, 55334837, 57664141, 59561565, 61794265, 63699864, 66291130, 68337551, 70773682, 73649386, 76328880, 79230562]
14312G9230562L141351L541796L336087L585280M043115M218450M514054M642178
14304A10252873M634519N429104N375544O145553O335964O583054P077852P242424
14296A59076887P496123Q623006R243798R171388R685453J0531908J0928283J1662959
14288B36419805J2004449J2662470J3124829J3775439J4351810J4262117J4674200
14281C31275119J4671685J5251179J4520479J4162070J3660969J2685880J1477480
14274D27704861R993624O904434L749006K782916J563205j436044k359592k164778
14266D46737632n353714p306311q877026j0716764j2125147j3776988j4743770
14259C73837912j5295234j5729278j5329739j5256740j5412354j4384068j4013837
$$ y = [79230562, 82371913, 85913709, 89249796, 92835076, 96878191, 101096641, 105610695, 110252873, 114887392, 120316496, 125692040, 131837593, 138173557, 144756611, 151834463, 159076887, 166573010, 175196016, 184439814, 193611202, 203296655, 213828563, 224756846, 236419805, 248424254, 261086724, 274211553, 287986992, 302338802, 316600919, 331275119, 345946804, 361197983, 375718462, 389880532, 403541501, 416227381, 427704861, 437698485, 444602919, 448351925, 451134841, 452698046, 451262002, 448902410, 446737632, 441383918, 434077607, 425200581, 414483817, 402358670, 388581682, 373837912, 358542678, 342813400, 327483661, 312226921, 296814567, 282430499, 268416662]
14252B68416662j3522461j2703965j2471200j2064146j1347220r132605q521188
14245A88653877r370278q523155q216897q099389p637657o364940o751409n680835
14237A28009317n659010n409944n326776m694364m823347l636775m019142l921136
14229I0518823l625333l245511l354484k927754k815762l206214k586290k560078
14221F6197397k149429k131132j928620k244763j996788j845662j608161j423957
14213E0868885j339472j668229j466294j438828j571493j292500m40353j189123
14205D0462593j601107j073776j231841p49821r38463l73133j318759q46587j108306
14196C1220800p52603n77849p31910n48962q58468o76760p42194m46318p49828
$$ y = [268416662, 254894201, 242190236, 229719036, 217654890, 206307670, 197175065, 188653877, 179283599, 170760444, 162543547, 154444158, 146806501, 140441561, 133690152, 128009317, 122350307, 116940363, 111613587, 106919223, 102095876, 98459101, 94439959, 90518823, 86893490, 83647979, 80293495, 77365741, 74549979, 71343765, 68757475, 66197397, 64047968, 61916836, 59988216, 57743453, 55746665, 53901003, 52292842, 50868885, 49529413, 47861184, 46394890, 44956062, 43384569, 42092069, 41651716, 40462593, 38861486, 37787710, 36555869, 35806048, 34867585, 34494452, 33175693, 32329106, 31220800, 30468197, 29890348, 29158438, 28609476, 27751008, 27074248, 26332054, 25885736, 25135908]
14187B5135908m98129o30249p86256o06885k98675o15703k34727n61737l47378
14178B0556169o04241q1637p67776m02392J15868o80557k29175p60602k45684
14169A6899973N4434n57559m76674j50524l07049O3262m79415l93080m08157J22639
14159A4367850n27076k9899l37646j34520m98122k23946K77m07421n87249K02825
14149A1825073p9469l76327k2505j01961j35218k50247k88671p616m65294Q4176
14139A0181941j20289k82501o8094m34368p7047L663j33947k54164J06400j94970
14129H726624j48971l58937M95779m58333Q6431m21366J71459j45927k42015o3642
14119G641102j00033j60676K28972l25065m46926K45337K16363m60039j23240
$$ y = [25135908, 24637779, 24007530, 23221274, 22614389, 22315714, 21700011, 21465284, 20903547, 20556169, 19951928, 19870291, 19102515, 18700123, 18815991, 18135434, 17906259, 17145657, 16899973, 16954407, 16396848, 15920174, 15769650, 15462601, 15525863, 15046448, 14653368, 14245211, 14367850, 13840774, 13810875, 13473229, 13338709, 12840587, 12616641, 12616918, 12209497, 11622248, 11825073, 11745604, 11369277, 11346772, 11244811, 11109593, 10859346, 10570675, 10563059, 10097765, 10181941, 10061652, 9779151, 9711057, 9276689, 9199642, 9203305, 9069358, 8815194, 8921594, 8726624, 8577653, 8218716, 8714495, 8256162, 8342593, 7921227, 8092686, 7946759, 7704744, 7641102, 7541069, 7380393, 7609365, 7284300, 6837374, 7082711, 7299074, 6839035, 6715795]
14110F715795N4988k84100q548p0204j23891k47084j28570J66470k54569l376
14100E816911k6324M7262K51393o71018J88710R0166l30861K75670m3132l85866
14090E212911J60255p346k80522Q4593k63492J9275L6385j18947K95660m90577
14080D648195J83381q1907R753l342l44158Q8374J57935k60648j25899l1268k65546
14069C974870J36327K42219j41741j19362p9477j30774J13143M7861J25950k9712
14059D139304j00350j76764m9704J39632j39473j98213R9606p7071l42085r5984
14049C198898J95034J37312J23503p1151k59176J34984j89931m1442n9983j60764
14039C007284K15178j29648N5099k69397j22718k2051K95580m64886J53905J75461
$$ y = [6715795, 6770783, 6486683, 6478135, 6407931, 6284040, 6036956, 5908386, 6074856, 5820287, 5816911, 5790587, 5837849, 6089242, 5418224, 5606934, 5697100, 5366239, 5641909, 5598777, 5212911, 5373166, 5365820, 5085298, 5169891, 4906399, 4925674, 4962059, 4843112, 5138772, 4648195, 4831576, 4749669, 4759422, 4756080, 4411922, 4500296, 4658231, 4397583, 4271684, 4240416, 3974870, 4111197, 4353416, 4211675, 4092313, 4012836, 3882062, 3995205, 4043066, 4169016, 4139304, 4038954, 3862190, 3812486, 3952118, 3812645, 3614432, 3714038, 3636967, 3294882, 3198898, 3393932, 3531244, 3654747, 3583596, 3324420, 3459404, 3269473, 3228031, 3168048, 3007284, 3222462, 3092814, 3147913, 2878516, 2755798, 2733747, 3029327, 2564441, 2718346, 2893807]
14029B893807N6184L82831l06480j53514j15528K76431l52920J35114n0662l76116
14019B389147K40843j85052J17956m82065O58051k36186K84776p91011N32102
14010B528561l11612J47438j75482K78565l90886k8835K57989k02315M37974m49712
14000B091685j46401K71807j69182K23409k73933J06152k92269L28085k00367
13991A938986K00688K38057P88795K006688N699781J8183184J9237410k0217465
13983B8076124j3829383o280481j973132j450141n98497n06607J69256o36562
13975B970577l15711L03560l41478J5736j94966J39148m7609k35410n3394J47832
13965B388285o8135k9913j79616o7558K33862l32843K63531m5036m75954K53705
$$ y = [2893807, 2949991, 3332822, 3026342, 2872828, 2757300, 3033731, 2680811, 2815925, 2765263, 2389147, 2629990, 2444938, 2562894, 2080829, 2738880, 2502694, 2787470, 1996459, 2528561, 2216949, 2364387, 2188905, 2467470, 2076584, 2047749, 2305738, 2103423, 2541397, 2091685, 1945284, 2217091, 2047909, 2271318, 1997385, 2103537, 1811268, 2139353, 1938986, 2139674, 2377731, 3166526, 5173214, 10872995, 29056179, 48293589, 28076124, 14246741, 7966260, 5993128, 4542987, 3944490, 3437883, 3607139, 2970577, 2654866, 2958426, 2616948, 2632684, 2437718, 2576866, 2529257, 2293847, 2240453, 2388285, 2320150, 2290237, 2110621, 2043063, 2276925, 1944082, 2207613, 2162577, 1686623, 1940328]
13955A940328k4295q0573j3407J18764l86657K35848k32030N42091n32989P6938
13945A644018j56738M56249l04511k06689M27102k39012L8056K18788l06051J13829
13935A685041K44790n09318k51988L27544N1516M16713n54132L68146j24470k33224
13925A420618L54407k1583j67414K12444l22039J2784K14166k55365J61760l89656
13915A220122L63198l42124J10109j60030M4245P6788L15081l42730J29065k73477
13905A140247M48841k69574O8786l54402M20132n9450j01004k9700j51963k60548
13895H51365K78658M8938M54371k04257P9926l79259J80784N1051J031N031O4467
13884A432106m32663K72602l60629j39999N90193j08984l3263J4733k76296M53416
$$ y = [1940328, 1916033, 1835460, 1822053, 1940817, 1554160, 1790008, 1557978, 2100069, 1567080, 1644018, 1487280, 1943529, 1639018, 1432329, 1859431, 1620419, 1658475, 1877263, 1571212, 1685041, 1929831, 1420513, 1168525, 1496069, 1547585, 1964298, 1410166, 1778312, 1653842, 1420618, 1775025, 1753442, 1586028, 1798472, 1476433, 1489217, 1703383, 1448018, 1609778, 1220122, 1583320, 1241196, 1351305, 1191275, 1235520, 1312308, 1627389, 1284659, 1413724, 1140247, 1589088, 1319514, 1388300, 1033898, 1454030, 1394580, 1293576, 1263876, 1111913, 851365, 1130023, 1178961, 1633332, 1429075, 1509001, 1129742, 1310526, 1361577, 1362608, 1367639, 1432106, 999443, 1272045, 911416, 771417, 1361610, 1252626, 1219363, 1234096, 957800, 1411216]
13874A411216m46807K5925J95788j68043K92449m02699P0377L15201R2220l78812
13864A006815L02544k93307L62184o85082M22760l0496k68421m4404K82252L16249
13854A371094m62595K65307k64183J36321J1970r3329J14093k83554L77950m7531
13844A125543k90165K55485n7880K04052k24365j83397P2460o4090K29593k16581
13834H50655N2423l97776K49532J65124J22641l59305q7745L34636k81904L11781
13824I60062J0015k57163K85744k14065K77082k91697L42362j93147m48746L22874
13814G93321L57769m55469K21929K05635n15683j40637L46043j1993m0660o9202
13804F91053J14020k33630J22686j55810L64432J4577k76885j63895J96106j08459
$$ y = [1411216, 964409, 990334, 1186122, 1018079, 1310528, 907829, 978206, 1293407, 1385627, 1006815, 1309359, 1016052, 1378236, 693154, 1115914, 1085418, 816997, 772593, 1054845, 1371094, 908499, 1173806, 909623, 1045944, 1057914, 964585, 1078678, 795124, 1173074, 1125543, 835378, 1090863, 1032983, 1237035, 1012670, 829273, 901733, 837643, 1067236, 850655, 903078, 505302, 754834, 919958, 1042599, 683294, 595549, 930185, 648281, 960062, 970077, 712914, 998658, 784593, 1061675, 769978, 1112340, 919193, 470447, 793321, 1151090, 695621, 917550, 1123185, 607502, 466865, 812908, 800915, 760255, 691053, 805073, 571443, 694129, 538319, 902751, 917328, 640443, 476548, 672654, 564195]
13794E64195Q3375N4946k0358l5594J18446j7451Q0042q5146j77958J48729K16874
13783I30100j27146n3363J93620j27470j8414o4535C66346L33072n676k27376
13773D66366A68118L01593L0777O18336k38672p0622K17707k81292j22484M1261
13763F64722K36047l56141K4688L03086k62207J73704j71076J50108k37726J56528
13753F81733K4795l6889K04870l96823G8401M38955K14396j71944M67540m22675
13743F04673J25903l55062L54726J69066m00033j32411A16270M05763M4318r5829
13733D70522J66693p8141j05730K70685k43001J31751J17989A58989N95896k08699
13723E46186j38718J84997j91067q6738J51003r0460J24095n3484j56779K82547
$$ y = [564195, 647570, 702516, 682158, 646564, 765010, 747559, 827601, 742455, 564497, 713226, 930100, 802954, 749591, 943211, 815741, 797327, 732792, 366346, 699418, 693742, 466366, 168118, 469711, 500488, 1118824, 880152, 809530, 1027237, 745945, 623461, 664722, 900769, 544628, 569316, 872402, 610195, 783899, 612823, 762931, 525205, 681733, 706528, 669639, 874509, 477686, 78401, 517356, 731752, 559808, 1027348, 604673, 730576, 375514, 730240, 899306, 499273, 366862, 116270, 522033, 566351, 470522, 637215, 559074, 453344, 724029, 481028, 612779, 730768, 158989, 754885, 546186, 407468, 592465, 401398, 314660, 465663, 375203, 499298, 445814, 289035, 571582]
13713E71582A15347J12878M78244C44945L28631K00032m22762j58226J28212l6828
13703C84004L03213j98791J04412k09698L93881n7848k08518j75837K24067B58702
13692E48172J28047r6450j15721K36170A45449M87578k95214K28895j25388l2217
13682D09103o3739J47465P9239j59288k3224o9370O4043L79971q42k06153M6872
13671F04077A63542L50845L2667j57065J01222q1505L0053A32764J02512q769
13661B26507M81526j29272J0259j78353r9725A39928N20060B63340o2132K1300
13651B22508Q6401M4927j72654L14917m0102N3433j49174j68752L67052j846j84583
13640C72127A54758K82317j80207J32994P2326P9528k47187o1049N16367l68604
$$ y = [571582, 115347, 228225, 706469, 344945, 673576, 873608, 450846, 292620, 420832, 384004, 687217, 488426, 592838, 383140, 777021, 719173, 510655, 334818, 558885, 258702, 548172, 676219, 579769, 464048, 700218, 145449, 633027, 337813, 566708, 441320, 409103, 345364, 492829, 572068, 412780, 389556, 320186, 384229, 764200, 763358, 557205, 604077, 163542, 514387, 547054, 389989, 491211, 409706, 439759, 132764, 235276, 226507, 708033, 578761, 589020, 410667, 310942, 139928, 659988, 263340, 201208, 222508, 308909, 353836, 181182, 496099, 455997, 509430, 360256, 191504, 558556, 556710, 372127, 154758, 437075, 256868, 389862, 462188, 541716, 294529, 233480, 749847, 381243]
13630C81243K2578B7282L69404A20191J48280K35583B43174l3891q0320K54460
13620C83423J11806j49259N345K17852j60215K8255Q2118j09784j08087R1670
13610C93124O8628j35484I7597J26098K15985k7436j35485K12559A82336M77770
13600F60106l25007j25162L48059j02420J6883r7699J70175j59714k2911k390
13590C59920j21121J83643j07987n8640J98549A51247J77082M06739j00295A58943
13579B73788A18705L29206o361m4624E1431M64024j77590G8530J7481a20800B52743
13567B52794K37119B22143K5236J41045o781H6684J15485l178K88047N1374j41796
13556C96616d4382D8477J30801J52839I3790J04049E4805K40024N7069K2739H2075
$$ y = [381243, 403821, 27282, 396686, 120191, 268471, 504054, 243174, 209283, 128963, 383423, 495229, 345970, 351315, 569167, 408952, 437207, 519325, 409541, 301454, 393124, 461752, 326268, 97597, 223695, 439680, 412244, 276759, 489318, 182336, 660106, 335099, 209937, 557996, 455576, 472459, 374760, 544935, 385221, 362310, 359920, 238799, 422442, 314455, 255815, 454364, 151247, 328329, 735068, 634773, 158943, 273788, 118705, 447911, 441550, 396926, 51431, 515455, 337865, 78530, 96011, -120800, 252743, 252794, 489913, 222143, 247379, 388424, 381643, 86684, 202169, 198991, 487038, 538412, 396616, -44382, 48477, 179278, 332117, 93790, 197839, 54805, 294829, 351898, 374637, 82075]
13544E01567k43446J39483J30044J18697B49290q439M47110A11085K30037J0824
13534C51946D2569f940A81843J8644q002l5465L5468K39013K26697A66393J39797
13523C06190j11831L8208M54564k75702l2367E9847J21576I0570k3609J79991
13513B46952k6929J75898o9723l3808C2051h6355B01889L6951M2542j25010C5685
13501B29506Q0487j7540j45713J59656j49461K42050A76383L50835k00583n2236
13491B74399j18013h8627B00164H5510K24908J05136j77026j1530d579B15119
13480A11690K98757e0380B55318j04616m3850Q5322l663K32007A27238a6400o9345
13469h5745A54116c1213C51688R3108B15268b0035C09659J82030k22211l0461
$$ y = [501567, 258121, 397604, 527648, 646345, 249290, 240851, 687961, 111085, 341122, 351946, 42569, -6940, 181843, 200487, 192485, 157020, 192488, 431501, 658198, 166393, 306190, 194359, 232567, 687131, 411429, 379062, 59847, 181423, 90570, 66961, 246952, 220023, 395921, 326198, 292390, 32051, -86355, 201889, 238840, 281382, 156372, 35685, 229506, 309993, 292453, 146740, 306396, 156935, 398985, 176383, 527218, 326635, 274399, 156386, -88627, 200164, 85510, 310418, 415554, 238528, 226998, -4579, 215119, 111690, 410447, -50380, 255318, 150702, 106852, 192174, 188511, 420518, 127238, -16400, -85745, 154116, -31213, 351688, 444796, 215268, -20035, 309659, 491689, 269478, 239017]
13459B39017J20550A42681J65901H8829K27881D0688a86063A6180L80409j08529
13449B88060I0015R3626J77477E6705a31389B12620A7454M5000L5768N374i6714
13437B24286D148J09298J65469B244K21605J31836k6972a40172C72975j55421
13427B17554C0503K84152k4080L0479j03329a93296D43390c7607B52572J91457
13417D44029A87237H7644K07972J27902k03895J58117m4507f1477A70411G0935
13406B2624J81197c0838A80838n0900m6918C9836O5255d8379B27880r8088L7474
13395A67266M824F4848i3011B24411K21387j31238r9370D0551j7820J11257L44442
13384D78430A66459K78891D5025L17817K9020j55374a73061E8082M49061j95076
$$ y = [239017, 359567, 142681, 308582, 88829, 316710, 40688, -186063, 16180, 396589, 288060, 90015, 183641, 361118, 56705, -131389, 212620, 17454, 62454, 98222, 103596, -96714, 224286, 4148, 113446, 278915, 2244, 223849, 355685, 328713, -140172, 372975, 217554, 30503, 314655, 290575, 321054, 217725, -193296, 443390, -37607, 252572, 444029, 187237, 87644, 295616, 423518, 219623, 377740, 333233, -61477, 170411, 70935, 22624, 203821, -30838, 180838, 129938, 83020, 39836, 105091, -48379, 227880, 129792, 167266, 172090, 64848, -93011, 224411, 445798, 314560, 215190, 40551, 22731, 133988, 478430, 166459, 445350, 45025, 362842, 391862, 236488, -173061, 58082, 507143, 312067]
13374C12067j09238K32588A22627D0260K56828e0995C51399A66184K63634q5991
13364C43827j33522P0876r8697l3632R3528j17734K00074c9760f038B10371L4419
13353B44790k9305L06460j68135A59040L7168l7643N6597D5310J56453F7702J97826
13342B65528p1541j93R3078A26817l2621P4823K44446A41591f7139B80580p9347
13331B01233K89534A81981K6836l8662a70936D56911r1994j40270p0010L3015
13321A87652J30314d7684C17312k4495L16067f0913C56796L8473j33777q3773
13311A77719L30221B2205K86674C4925J77493B4126b711D66889a99486c809E9339
13299D28709a83681A38823J15571a54939C27336I0816J39363c13563A69424L2484
$$ y = [312067, 202829, 435417, 122627, 40260, 297088, -50995, 351399, 166184, 429818, 343827, 210305, 281181, 182484, 148852, 242380, 124646, 324720, -39760, -6038, 210371, 244790, 215485, 521945, 353810, 159040, 196208, 158565, 215162, 45310, 201763, 67702, 265528, 193987, 193794, 286872, 126817, 94196, 169019, 413465, 141591, -67139, 280580, 201233, 490767, 181981, 208817, 170155, -170936, 456911, 364917, 224647, 154637, 187652, 317966, -47684, 317312, 292817, 608884, -60913, 356796, 395269, 261492, 177719, 507940, 22205, 308879, 34925, 212418, 24126, -2711, 466889, -199486, -3809, 59339, 428709, -183681, 138823, 254394, -154939, 327336, 90816, 230179, -313563, 169424, 201908]
13289B01908c6950B29418F1736L85634A80326E8226c6209A62471p0058Q4095K4191
13278B00699a53560A19899e0009H0958a54537K9961A90170F748J57053K78400
13268D42201A90582a02963D3977Q6922j3831b19865B99123j46391J92126A49544
13257A88186J05808b56593G8476K72608l1610A40502k9885A5848a52342B87391
13246B449R9833e0151H6796J69408q5583D6673K9412J50128A2033K74247N4368
13235C40648A17407j6971P3717o6241A2525Q1764J54103O3593A38342a5222A43727
13223B71700j30849J1493A6716K18035b58960F2066K45468F6313J25019a1629
13212C36543A50857M9511K4985e783D13577g6927C665L30359B8749a89499B72965
$$ y = [201908, -36950, 229418, 61736, 447370, 180326, 58226, -36209, 162471, 92413, 176508, 200699, -153560, 119899, -50009, 80958, -154537, -124576, 190170, 6748, 163801, 442201, 190582, -102963, 43977, 130899, 117068, -219865, 299123, 152732, 344858, 149544, 188186, 293994, -256593, 78476, 351084, 319474, 140502, 110617, 15848, -152342, 287391, 2449, 102282, -50151, 86796, 256204, 170621, 46673, 76085, 226213, 12033, 286280, 340648, 117407, 100436, 174153, 107912, 12525, 94289, 248392, 311985, 138342, -15222, 143727, 271700, 140851, 152344, 16716, 234751, -258960, 62066, 307534, 66313, 191332, -11629, 336543, 150857, 200368, 225353, -5783, 413577, -76927, 3665, 334024, 28749, -189499, 272965]
13200C19188A10287j87N8828G0078Q764J03855J68532b52480B26794d9009B14047
13188A05086a6508A58454a16206d2720I2555N0573c241B18243C5234h1194k9760
13177a10954A52886i8731K5886A40640O2462b0453E5920L3473A1076J07558E7944
13165A45452c5383j07986C173J64431e7736C70578j69327a1612H4254J57073b7185
13153A17673e5446o0131j42165A34640a72188m3131c4118o3440G0508J59969A5818
13141B90576A06229o904D3279K48262a07971A29902g9756r6610g0790b2709B9202
13129f5080b7198D9627Q8379c7881E5640J11695a14454A88109K2567H7515a86276
13117C37861b8866A4662c95307B7879K87771a88311A95543O8105l3436a37553
$$ y = [319188, 110287, 110100, 168928, 70078, 78842, 182697, 351229, -252480, 226794, -49009, 214047, 105086, -16508, 158454, -116206, -42720, 92555, 143128, -3241, 218243, 35234, -81194, -110954, 152886, -98731, -72845, 140640, 203102, -20453, 55920, 89393, 11076, 118634, 57944, 145452, -35383, -143369, 3173, 167604, -57736, 370578, 201251, -11612, 84254, 241327, -27185, 117673, -55446, -115577, -257742, 134640, -172188, -215319, -34118, -97558, 70508, 230477, 15818, 290576, 106229, 99325, 43279, 291541, -107971, 129902, -79756, -176366, -70790, -22709, 29202, -65080, -27198, 49627, 138006, -37881, 55640, 167335, -114454, 188109, 210676, 87515, -186276, 337861, -28866, 14662, -395307, 27879, 315650, -188311, 195543, 263648, 230212, -137553]
13106D8433K33811H1021N352a17968A61526J5042f4727A45635a90678I8142J22299
13095B20441M4364C3344b21241A06355J35878e9346A33100n415g2720K5016j61330
13084b09034D0902J9741R4099A9122J13640g3419j28669C23090j12358m7170a61490
13072d0738C89739E1880L2127K46083b5737A54538a04845I4702L95856a64114
13061B27630k4339i4594c0030L307j19838L9563B50129A2133L16091A48935l9137
13050A09798L060a04796q6850h0967B74308N9296G383b28139H4890B1439a82944
13038c0348A75994a58928A02925b00206J8067I3550a86889N3046A99393E7336
13027B73676f6010A34301K03016G8453a41691C8338G873J29890m4888j2582a15383
$$ y = [48433, 282244, 81021, 86373, -117968, 161526, 176568, -64727, 145635, -190678, 98142, 220441, 264805, 33344, -221241, 106355, 242233, -59346, 133100, 127685, -72720, -47704, -209034, 40902, 60643, 154742, 19122, 132762, -73419, -202088, 323090, 210732, 163562, -161490, -40738, 389739, 51880, 84007, 330090, -25737, 154538, -104845, 94702, 490558, -164114, 227630, 203291, -94594, -30030, -26723, -146561, -106998, 250129, 12133, 328224, 148935, 109798, 112858, -104796, -191646, -80967, 274308, 333604, 7383, -228139, 84890, 21439, -182944, -30348, 175994, -158928, 102925, -200206, -182139, 93550, -186889, -133843, 199393, 57336, 273676, -66010, 134301, 337317, 78453, -141691, 38338, 7873, 137763, 92875, 80293, -115383]
13015B88786e5504J8378B79478B7595a38067I8656P0737J72463a44827I6607M6481
13004A43088R1827Q8470A0850J79474J07929C8621J5086J00699a99509B21206
12993G1907a68606F2757M0173L5115J45752a9062l20366E8957g879A17418L0196
12982A47614p3391J67869c1548k9024B44418m9605j4705a24379a9196j01619d2358
12970B69863n9776f3801A18594J11811r6208a91012o221f7696B8059j451a66895
12958a13601D7799P9318c6250A61998p4951e7595k9982m4184E0297j1925b4211
12946A51207m7249J867b00639B7154M27341A29417m2142M302e9587A09766a37895
12934f3522A10803f5706j2399j3146c5268A676N4119K36283C8147b46823C28473
$$ y = [288786, -55504, -37126, 279478, 27595, -138067, 98656, 169393, 341856, -144827, 96607, 143088, 234915, 323385, 10850, 190324, 298253, 38621, 53707, 154406, -199509, 221206, 71907, -168606, 62757, 102930, 138045, 283797, -19062, -339428, 58957, -7879, 117418, 147614, 74223, 242092, -31548, -60572, 244418, 194813, 180108, -124379, -19196, -120815, -42358, 269863, 210087, -63801, 118594, 230405, 134197, -191012, -197233, -67696, 28059, 26608, -166895, -113601, 47799, 127117, -36250, 161998, 87047, -57595, -87577, -131761, 50297, 38372, -24211, 151207, 103958, 105825, -200639, 27154, 454495, 129417, 87275, 91577, -59587, 109766, -137895, -63522, 110803, -65706, -78105, -91251, -35268, 1676, 55795, 292078, 38147, -246823, 328473]
12922B0855K77859D4782N0457b10720A91133J223a32380b5044A0697a67554E6305
12910B80791b43857C31588j54504c88799A76896J7855J07657C6199i7226F9433
12899A17006b83704f3509B77448d89133b31042P8328b2972l104B20285c08373
12888b10543O3530A42260O2323c5713A23509O6101a10863D5491J37889p9983F087
12876A31700l5281P8238p3052L1369P8254a9860l6880a7033j45528A16993R2033
12865B09026a09582p8033J0571A82257a49246m045J2465A51369Q0507F1695k920
12854E8775K08208F3335A6019J98756a60719A41325b8959k51583a03877l0208
12844a34085a9979A61543K61877A81152J6242K9731a98890i1633j04177M5903
$$ y = [20855, 298714, 44782, 95239, -210720, 191133, 192356, -132380, -25044, 10697, -167554, 56305, 280791, -243857, 331588, 177084, -388799, 176896, 194751, 302408, 36199, -97226, 69433, 117006, -283704, -63509, 277448, -489133, -231042, -152714, -22972, -26076, 220285, -308373, -210543, -147013, 142260, 204583, -35713, 123509, 189610, -110863, 45491, 183380, 103397, 6087, 131700, 96419, 174657, 101605, 132974, 211228, -19860, -56740, -17033, -162561, 116993, 209026, -109582, -187615, -177044, 182257, -149246, -153291, -140826, 151369, 231876, 61695, 58775, 266983, 63335, 16019, 214775, -160719, 141325, -28959, -280542, -103877, -134085, -19979, 161543, 423420, 181152, 197394, 227125, -198890, -91633, -195810, -149907]
12834a49907M6169k36627a40672I8343b49644G3660a09162B28516I8121E289a87851
12822A02616a68249c55l70147a13462B38418a95247N8046a8369q9236H4163c48458
12810e483j50971N7157l987c4139E7863J16908B8905a48475A04249b76874a30913
12798C61950a65974j65054A88365a85769A15294g2901A85891B0740M4106a53433
12787a60401P9136h258k13272E2168b24268b6092j45514E1658e553k03334b2016
12775A26254c48445e5594A95017a837A68012E834d22D5648q357J84672j4066B1101
12762c5056H7573a31443B31443n065a03196C4390a40703N753E5677J21137l0320
12751A46494B2035d7176j30985B20347D4453J36739f1329n1220j843j61649a1266
$$ y = [-149907, -103738, -340365, -140672, 98343, -249644, 73660, -109162, 228516, 98121, 5289, -187851, 102616, -168249, -355, -370502, -113462, 238418, -195247, -137201, -18369, -107605, 84163, -348458, -5483, -156454, -99297, -103284, -34139, 57863, 174771, 28905, -148475, 104249, -276874, -130913, 361950, -165974, -331028, 188365, -185769, 115294, -72901, 185891, 20740, 64846, -153433, -160401, -81265, -8258, -221530, 52168, -224268, -26092, -171606, 51658, -5553, -208887, -22016, 126254, -348445, -55594, 195017, -1837, 168012, 5834, -422, 45648, 37291, 221963, 207897, 21101, -35056, 87573, -131443, 231443, 226378, -103196, 34390, -140703, -134950, 55677, 176814, 146494, 22035, -47176, -178161, 220347, 44453, 181192, -61329, -112549, -114392, -276041, -11266]
12739A23018J50037J91466a7134j0682G5800J22286k9027e7388I0416h1556E7603
12727h7603b4654B87137j08573i0047A48050e4446k58435P1437c2571l12886F4228
12715G9500p60a9234F7612e9854A5066b92661A19229C1401a4384B09840M53284
12704F63124B18772c0729D4884K27680b4427B04997h1870B20006H0683g8744L1371
12693d7373A31710O7719B201g568F1562d6288j69811A41369M910a56988A01804
12681b16081I5440J94120a39857G7553a18380o1752D922M64964F0917L21835A48094
12669A63795n6003l9260a67027l2729A14645J04125e9395E8899J64854a69581
12658e5656A57903l4141a67404F6007P4550J43868h6333I6770m4847J06562p246
$$ y = [123018, 273055, 464521, -17134, -27816, 75800, 198086, 169059, -57388, 90416, -81556, 57603, -87603, -24654, 287137, 178564, -90047, 148050, -54446, -312881, -241444, -32571, -345457, 64228, 79500, 78740, -19234, 67612, -59854, 15066, -292661, 119229, 31401, -14384, 209840, 663124, 218772, -30729, 44884, 272564, -24427, 204997, -81870, 220006, 80683, -78744, -47373, 131710, 199429, 2201, -7568, 61562, -46288, -216099, 141369, 146279, -156988, 101804, -216081, 95440, 289560, -139857, 77553, -118380, -180132, 4922, 469886, 60917, 382752, 148094, 163795, 107792, 68532, -167027, -199756, 114645, 218770, -59395, 58899, 223753, -169581, -55656, 157903, 123762, -167404, 66007, 140557, 284425, -86333, 96770, 51923, 158485, 151239]
12647A51239J59042O6638F9441P9376g6261j84953d8587A30218g3384m4789j66950
12636b85123d1648C6066d9070j96511i271A27441N0431n3686n6572k5421O4783
12625A06976j0874L2856n7938h1157A0264J10954J01902I602b90495Q4486B0825
12613A22055b27073H6954O7811R9405F9370a35885b1312A8871J1105J52368p2768
12602A09576K40393C558K6932a46349C21952Q1185I2137A5987J45588h3788L9166
12591d4622A8093K85165a55870A01701f2771q6016f2817G9544N5886E4273J16277
12580A70550a07327G3181c6036A05856K9126C9794c757r717A13960c8379A24358
12568a38614n4859A22467b07328D8285b19834K8735N8312F3382b60824B34894
$$ y = [151239, 310281, 376919, 69441, 148817, -76261, -261214, -48587, 130218, -73384, -118173, -285123, -41648, 36066, -49070, -245581, -9271, 127441, 177872, 124186, 67614, 42193, 106976, 96102, 128958, 71020, -81157, 10264, 121218, 223120, 9602, -290495, -206009, 20825, 122055, -227073, 86954, 154765, 254170, 69370, -135885, -21312, 18871, 29976, 182344, 109576, 349969, 3558, 30490, -146349, 321952, 403137, 92137, 15987, 161575, -83788, -44622, 18093, 303258, -155870, 101701, -62771, -148787, -62817, 79544, 135430, 54273, 170550, -107327, 73181, -36036, 105856, 134982, 39794, -3757, -13474, 113960, -38379, 124358, -138614, -193473, 122467, -207328, 48285, -219834, -191099, -132787, 63382, -260824, 234894]
12557c4335j08432l4147F6788J28301m2384a40975D1627g7862D4365K37102b55402
12545A91270C4608N0246c59420J18726F0228J46387p2029E900a58710B49369G1430
12533f2752B42937b0042A35581B6834J93052a8746j04812K9394a2151D6890a60673
12521C2721c6528A49782O0581D5059J7275b2131A2145b26476J060A00880L1120
12510A32000n5168Q7509i2255m7085E3437J13251c9661l20758H9078a1549K01
12499a1348j67720Q0800M4734I7471C4353J30079b03699C18801h9681B88787A04086
12487H7410o222Q5002f5312p0764j12373c6257A11450a32526j87067O7621B78620
12475h0987c4390j24880j12650b20k12025L645P2997o8716i7470c7266C08985
$$ y = [-34335, -142767, -176914, 66788, 195089, 152705, -140975, 41627, -77862, 44365, 281467, -255402, 191270, 34608, 84854, -359420, -240694, 60228, 206615, 134586, 5900, -158710, 249369, 71430, -62752, 242937, -20042, 135581, 26834, 219886, -18746, -123558, -94164, -12151, 46890, -160673, 32721, -36528, 149782, 210363, 45059, 62334, -22131, 12145, -226476, -225416, 100880, 132000, 76832, 164341, -92255, -139340, 53437, 166688, -39661, -360419, 89078, -11549, -11348, -179068, -98268, -53534, 97471, 34353, 164432, -203699, 318801, -89681, 288787, 104086, 87410, 81188, 166190, -65312, -136076, -248449, -36257, 111450, -132526, -319593, -251972, 278620, -80987, -34390, -159270, -271920, -220, -212245, -208600, -135603, -204319, -97470, -37266, 308985]
12463A87928a32821c4972l6202A31789K175c03196F71262h6421j05961B8038e3366
12451b22564F0968b87111C81006H6342A3939a65954M8164F432f3222H3949A5289
12439D4642a22151A726L79956F7158b00773A7404b36699J16939B29279m1504a45154
12427g9534J5466q006l060j85187i4550d3903j25536A79503k7786A616J5636f12
12414C73232A41824a86748Q9983A52421E2891J70516E8192P1068J00648C1769
12403b13835A84216d7961j57403A82066c2758A17745E973K96971j33611c24749
12392B13611C3086a45023A32727L367K9294L20078a44908A24538a01195A70686
12381C40627a68185b0432B67082a14484l1390k1980E5685a835m115H2231k5855
$$ y = [187928, -132821, -34972, -71174, 131789, 133964, -303196, 671262, -86421, -192382, 28038, -53366, -222564, 60968, -287111, 381006, 86342, 13939, -165954, -117790, 6432, -63222, 83949, 15289, 44642, -122151, 1726, 381682, 67158, -200773, 17404, -236699, -119760, 229279, 187775, -145154, -79534, -64068, -72074, -75134, -260321, -94550, -43903, -169439, 179503, 151717, 1616, 17252, -612, 373232, 141824, -186748, -96765, 152421, 52891, 223407, 58192, 129260, 229908, 31769, -213835, 184216, -47961, -205364, 182066, -32758, 117745, 5973, 302944, 169333, -324749, 213611, 33086, -145023, 132727, 136094, 165388, 485466, -144908, 124538, -101195, 170686, 340627, -168185, -20432, 267082, -114484, -145874, -167854, 55685, -1835, -5950, 82231, 56376]
12370E6376J57332a93213R4039r5767I3270b13289k0192J00771C47839H5953C9564
12358h9947A71713g8060K1391K5071C0756J134k428c1858A7467N6184J18829a11138
12345B2701i9876B07659i3216A13901n6012L01980G9525c0488F9343J31975P294
12334B08612O3917F5355K97369A66007o7361K25387j33182K18975L3275D617a54947
12322A46955O4678M9960K4865A1597J4043M14197A54645a5614A85252K92512D6458
12310A78696G4716R9285k2543l4818O1918K272J62940a37770q7150F5913a43313
12298A43760h5849o1363B08781a47195D2588P3094J27774K89085a32635B26976
12287I1866M7058c5842b496A70267a99770H6415K13853D2885a77549C26573f3552
$$ y = [56376, 213708, -193213, -99174, -194941, 93270, -213289, -233481, -132710, 347839, 85953, 39564, -89947, 171713, -78060, -56669, -31598, 30756, 31890, 29462, -31858, 17467, 73651, 192480, -111138, 22701, -99876, 207659, -93216, 113901, 57889, 359869, 79525, -30488, 69343, 201318, 208612, 272529, 65355, 362724, 166007, 98646, 324033, 190851, 409826, 443101, 4617, -154947, 146955, 211633, 261593, 286458, 11597, 25640, 439837, 154645, -15614, 185252, 477764, 46458, 178696, 74716, 174001, 151458, 116640, 178558, 180830, 343770, -137770, -224920, 65913, -143313, 143760, -85849, -147212, 208781, -147195, 42588, 115682, 243456, 532541, -132635, 226976, 91866, 138924, -35842, -2496, 170267, -199770, 86415, 300268, 42885, -177549, 326573, -63552]
12275C82574A3580A230K4361J04652E5711J23610J66969r395A07748P2754K14461
12264C94963o8734q8729J98734N6932a6747n5438q571A49390L6676e70040a81154
12252b5014I2383J00194b2635I4403K36009l3886A34403a11599A34555a26826
12241A13000J5664K42929D3235n321i9448l42809A12725J14916O038M0026N3631
12230C27336c98782e7926D35434j75800b97588c2465C09030J00462o2827L6218
12220C82883A21686a23986B48609k3401e5366A60280K31856j70907j1178f4689
12209d349A57831O7895E0934j9903a8715A14220b64729I1998K1120N1361p1372
12198I3107P9514J04666J3845o5412d7233b2299F38261j72046a35911A51530e5225
$$ y = [382574, 13580, 1230, 25591, 130243, 55711, 179321, 346290, 336895, 107748, 180502, 394963, 326229, 237500, 436234, 493166, -16747, -72185, -80756, 149390, 186066, -570040, -181154, -25014, 92383, 192577, -22635, 94403, 330412, 296526, 134403, -111599, 134555, -126826, 113000, 128664, 371593, 43235, 37914, -99448, -442257, 112725, 227641, 233679, 273705, 327336, -398782, -57926, 435434, 259634, -297588, -32465, 309030, 409492, 346665, 382883, 121686, -123986, 248609, 225208, -55366, 160280, 392136, 221229, 210051, -64689, -4349, 157831, 225726, 50934, 31031, -18715, 114220, -264729, 91998, 113118, 164479, 93107, 172621, 277287, 291132, 225720, -47233, -22299, 638261, 466215, -135911, 151530, -55225]
12186C40689J44496C6774a30417A5530J58322J18270l8642l7447L91769B17585
12175A0687J23037E001J41004b00625A12102J4078R807J01453A13664J28458j01343
12164A40779Q2153o4472J23233q7351I1371J51089I9646N6528e2369o1153d3602
12152A80184A364J47183r281J44707r0616a21334A38596A228c6233a0216j95914
12141b06130E1257K04979i453G1817d7221C69120j35716j9952M3637d31445D75811
12129c39774B10660R9284r5924a60814B40796i749j269B16069j00842O95000B18376
12117E04222B4818N11850d7866j35248B45954A06600J28867H2998C4855O4330
12107I9185a70261a5808E334J97495G3620B2227a53733A40825c38552G5026N2563
$$ y = [340689, 485185, 36774, -130417, 15530, 173852, 292122, 253480, 216033, 607802, 217585, 10687, 133724, 5001, 146005, -200625, 112102, 126180, 135987, 237440, 113664, 242122, 140779, 222932, 158460, 281693, 194342, 91371, 242460, 99646, 156174, -52369, -113522, -43602, 180184, 1364, 148547, 139266, 283973, 193357, -121334, 138596, 1228, -36233, -10216, -206130, 51257, 256236, -9453, 71817, -47221, 369120, 233404, 213452, 257089, -431445, 475811, -339774, 210660, 309944, 214020, -160814, 240796, -9749, -11018, 216069, 115227, 810227, 218376, 504222, 24818, 536668, -47866, -183114, 245954, 106600, 235467, 82998, 34855, 99185, -170261, -15808, 5334, 202829, 73620, 22227, -153733, 140825, -338552, 75026, 127589]
12096A27589c2458F7434b31178A32563e1160D84000b6851j36073f9021A46153
12085I7356J48263o1397J84463A35392f681A83531J69724j55975L4618A09377
12074h4269r8925I4396A1056L11232k6661A47407J61675N8897b88136I6970Q2379
12063A79349B0232h4559A53712a44482M8960D9443K79786a8264l06604R8207A07117
12051D8368M7144a55070A52755b0813A78217c06616J07147E6134A3451K32796
12041B46247e303j73953c684A04779m9844a36151q780C64659F6473h0362c9166
12029b45959F7297b08912C39845A06577k4200J47968M0425C2137K93057b962F234
12017a20963D9562D915N4607g6149C21110a89081B84129j33402h1450C02878F9644
$$ y = [127589, -32458, 67434, -231178, 132563, -51160, 484000, -26851, -162924, -69021, 146153, 97356, 245619, 184222, 368685, 135392, -6681, 183531, 353255, 197280, 231898, 109377, -84269, -183194, 94396, 11056, 322288, 295627, 147407, 309082, 367979, -288136, 96970, 179349, 20232, -84559, 153712, -144482, -95522, 49443, 329229, -18264, -324868, -226661, 107117, 48368, 95512, -155070, 152755, -20813, 178217, -306616, -199469, 56134, 13451, 246247, -5303, -179256, -3684, 104779, 54935, -136151, -144931, 364659, 66473, -80362, -39166, -245959, 67297, -208912, 339845, 106577, 82377, 230345, 270770, 32137, 325194, -2962, 6234, -120963, 49562, 4915, 59522, -76149, 321110, -189081, 284129, 150727, -81450, 302878, 69644]
12005a250r4841B1273c9582l2437b3328q0120L5638j05459G1831d7892p6730e0868
11992e2235l1068B88721D076i1234a6039E7515a29695A92210B7314J63856B7665
11980a72285d1941C71415b05714R5640M6967B3556J81771H3470j3810b94368J06330
11969a88038j11662g872o2611C3152a99262E6223j5944a21187I0417f4823l3099
11958i7922o0733f0807b4369A5583L271Q7189K70894b02653f3504B06817h6919
11946b36390B55521a39598e0520B84874A2967a62139j1834A40772o4961h553n3168
11935f1721D9204b27967K8816L3905e6816H138d1830j24328A57141p0018a24781
11923a45096B98522g7842B90435i9761c1153C4248f8186A06823d7412o7175B5742
$$ y = [-1250, -96091, 21273, -39582, -72019, -23328, -103448, -67810, -173269, 71831, -47892, -124622, -50868, -52235, -83303, 288721, 4076, -91234, -16039, 57515, -129695, 192210, 27314, 191170, 27665, -172285, -41941, 371415, -205714, -110074, -63107, 23556, 205327, 83470, 69660, -294368, -188038, -299700, -7872, -70483, 33152, -199262, 56223, 40279, -121187, 90417, -64823, -97922, -158655, -60807, -24369, 15583, 18854, 106043, 376937, -202653, -63504, 206817, -86919, -236390, 255521, -139598, -50520, 284874, 12967, -162139, -173973, 140772, 75811, -8553, -61721, 49204, -227967, -199151, -165246, -56816, 8138, -41830, -166158, 157141, 87123, -124781, -145096, 298522, -77842, 290435, -99761, -31153, 34248, -68186, 106823, -47412, -114587, 25742]
11911D6280L2865a18594B86998A001a69814B61909a44746b5055j41894m807K8102
11900a43654B9155d8900j01771A97374n7924a90845I9956a13987C1075a05000
11889a5166k90063f1968B38159a93472f7764j38553b9208l2468j03007D0389b95605
11877a34422E3967G741a31519D38440b99038J45219A91107c4659j68851c2551
11866b22468a3013q8717b4775j11415l8914D0680f008C9489h2491k1643m4549
11855a48683C3888d5030k64497C1630g7250H1465b76611J9763a01620K4044L4530
11844d3046A58061b67816N5143M8988B06163b49156J18648A1790c7673p2059D886
11832h4400L5162A84947n0434Q5055F6939J7887e6793D4451F507J86661f6036
$$ y = [46280, 79145, -118594, 286998, 1001, -169814, 261909, -144746, -25055, -166949, -171756, -143654, 29155, -48900, -150671, 197374, 139450, -190845, 99956, -113987, 31075, -105000, -15166, -305229, -61968, 238159, -193472, -67764, -206317, -29208, -61676, -164683, 40389, -295605, -134422, 53967, 7741, -131519, 438440, -299038, -153819, 191107, -34659, -203510, -32551, -222468, -13013, -101730, -24775, -136190, -175104, 40680, -6008, 39489, -82491, -104134, -148683, 33888, -45030, -309527, 31630, -77250, 81465, -276611, -256848, -101620, -77576, -43046, 158061, -267816, -212673, -163685, 206163, -249156, -130508, 11790, -37673, -109732, 4886, -84400, -49238, 184947, 134513, 219568, 66939, 84826, -56793, 44451, 6507, 193168, -66036]
11820h4915A79926a62708l0968A87672a54045j4242G0640b27905B00923I2871
11809h6442J9724B047K2072b66872A51645G5672m209h1519b7633A67507E5227
11797i8919J1339A60815b84852a01122n7j06964R4662N3835A2388b98934M6641
11786b52293a1256A88406Q9722J64839i3899j41143B23112F1727B1441b45911
11775b26335P2583B29751a39232b1036M492m7486k34714a20031J8387k30864J38841
11764a93667c5191j1202k64242J36348j02931g0224j03662q7371b8711j28045
11754a56756E4651l978J89166c2974B00402a29577L0770j28002L2333F58364F8471
11742a19289c5296p8305l0110A68845c30066A03086c3994A32685b22518g2078
$$ y = [-84915, 179926, -162708, -193676, 187672, -154045, -168287, 70640, -227905, 200923, 92871, -86442, -66718, 2047, 24119, -266872, 151645, 75672, 71463, -81519, -27633, 167507, 55227, -98919, -87580, 160815, -284852, -101122, -101179, -208143, -113481, -59646, 12388, -298934, -252293, -11256, 188406, 278128, 442967, -93899, -235042, 223112, 61727, 21441, -245911, -226335, -153752, 229751, -139232, -21036, -16544, -64030, -298744, -120031, -101644, -332508, -193667, -35191, -46393, -310635, -174287, -277218, -70224, -173886, -261257, -28711, -156756, 54651, 50673, 239839, -32974, 200402, -129577, -98807, -226809, -194476, 658364, 68471, -119289, -35296, -113601, -143711, 168845, -330066, 103086, -33994, 132685, -222518, -72078]
11731c09199c4162j65530A34226f0238p8303q7340a3131j78970C16541M2503j56474
11720B02570a90818k0335A01127h436k60742B09316J08200F280P4889c8312B06040
11708H6010J12027m337R3293i1180A59034J66787f9419I5255O87e1736B83922
11696a62866C11577A02029E647i6456p8888E57701I1338l507m2765b15268f5033
11684a70068A17529a06789H1579J48013o5972d9759B60494j18137b13462A4485
11673H8149j6522b4022j00200G6382J77304a7755r966A56840a01275j01230A39019
11661b86947J42947A73770o4839M3264J03704r6428a48110f1745O707A92327a98001
11649C5284Q8970L5244h853B84912j23734b0439A07268a5176k59806F7084N0166
$$ y = [-309199, -34162, -199692, 134226, -60238, -138541, -225881, -13131, -192101, 316541, 359044, 202570, -190818, -211153, 101127, -8436, -269178, 209316, 317516, 6280, 81169, -38312, 206040, 86010, 198037, 193700, 286993, -91180, 159034, 325821, -69419, 95255, 95942, -51736, 283922, -162866, 311577, 102029, 5647, -96456, -175344, 557701, 91338, 87831, 45066, -215268, -65033, -170068, 117529, -106789, 81579, 229592, 163620, -49759, 260494, 142357, -213462, 14485, 88149, 71627, -24022, -124222, 76382, 253686, -17755, -27721, 156840, -101275, -202505, 139019, -286947, -144000, 173770, 108931, 152195, 255899, 159471, -148110, -61745, -55038, 192327, -198001, 35284, 124254, 159498, -8853, 284912, 161178, -20439, 107268, -15176, -274982, 67084, 117250]
11638A17250b22278a8555C04845j29897d00639J50149a11963c1676B9033J86188
11628B15221F3995K78712j18484g9563A05778C1875g3806A07134h6040G8645e6481
11616a92867F1519a01822j4284B18206m7524J06388i2127A7343b6229D1835N4440
11605I6275P7100b60673E6703a0422j88060P5174F1229f7703r6736D8045J83457
11594B31502j3159J54235n0810a79970F4011a38726B32570E1650A5775K49280
11584B65055j12462j9247C2614a10854I458J30049m2761b62504B06515K32836
11574D39351a59133N8365H4513b91678g2464b4117p8711F2147M4169J67984j01894
11563A72406H5638K42087f3163A32086d8750H5429b80538C0397J21474b56992
$$ y = [117250, -222278, -18555, 304845, 174948, -400639, -250490, -111963, -31676, 29033, 215221, 63995, 342707, 224223, -79563, 105778, 31875, -73806, 107134, -86040, 78645, -56481, -192867, 61519, -101822, -116106, 218206, 170682, 277070, -92127, 17343, -26229, 41835, 96275, 173375, -260673, 56703, -10422, -198482, -123308, 61229, -67703, -164439, 48045, 231502, 218343, 372578, 321768, -179970, 64011, -138726, 232570, 51650, 15775, 265055, 152593, 133346, 32614, -110854, 9458, 139507, 96746, -262504, 206515, 439351, -159133, -100768, 84513, -291678, -72464, -24117, -102828, 62147, 106316, 274300, 172406, 85638, 327725, -63163, 132086, -48750, 85429, -280538, 30397, 151871, -256992]
11552i6051A09611l4828a84489B52578r425r2101m1441b67520A84364b4139A58192
11540D0137J13172o4710K8819D8383D269R0065i6519b9745l49806A84510c5482
11528b28575c1093k76610C04801b9269l35728g4029E6046L963M167K72161c9368
11516a32605D8524b22648B33120a67031O7557A22082l1220P0171a90721G6818
11505a6869k62567C17209q502N9275A41246E9568J50962a01290E5281j1269n910
11494C8102l241f8465A05927K2395J3142J84749o9266D4019J80427r3742J08103
11483B38807H1249K5774J66696J86213G4686l065A8673i3172C10569G5860e0843
11471a14933B53156E288J9437J94906q7044L23481B20988k3173L15172d5473A99786
$$ y = [-96051, 109611, 74783, -184489, 252578, 243153, 151052, 109611, -267520, 184364, -24139, 158192, 40137, 153309, 88599, 117418, 48383, 4269, 94334, -96519, -29745, -379551, 184510, -35482, -228575, -31093, -307703, 304801, -29269, -364997, -74029, 56046, 60009, 64176, 336337, -39368, -132605, 48524, -222648, 233120, -167031, -99474, 122082, 90862, 161033, -190721, 76818, -16869, -279436, 317209, 308707, 367982, 141246, 59568, 210530, -101290, 55281, 44012, 38102, 34861, -68465, 105927, 128322, 141464, 326213, 256947, 44019, 224446, 130704, 238807, 81249, 107023, 273719, 459932, 74686, 71621, 18673, -93172, 310569, 75860, -50843, -114933, 253156, 5288, 24725, 219631, 132587, 456068, 220988, 197815, 512987, -45473, 199786]
11459C86949A50042O360k3575F4483A9118d0617J5993D2997m075i8240B3140f9893
11446E6678L10119c2780m843A6581a9298I2530a2523o7060A28511O6097H5192
11434H7373g6285C05275o5833n2509C3092K65093f9403F4690J08014b2524G5899
11422E851a27540D3790b35542J7690B19944A00137F12e8276m6133A7942b5253
11410h7511j38595H0332k2724D567O4756a00756A49176b01112R6577a1068j65259
11399a76327A08826L3743p0001J60756d3555A08527n2485J56630j1939c3738n6896
11388i0634a2092A78399b66101Q5883I8799l0396d3394j41710A88710a76139A33027
11376H844a25925C03435A4172b2121B83015e2476E9234b64238b5268j12313A86887
$$ y = [386949, 150042, 156402, 132827, 64483, 19118, -40617, -24624, 42997, 38922, -98240, 23140, -69893, 56678, 366797, -32780, -37623, 16581, -19298, 92530, -12523, -79583, 128511, 194608, 85192, 87373, -76285, 305275, 239442, 186933, 33092, 298185, -69403, 64690, 172704, -22524, 75899, 5851, -127540, 43790, -235542, -217852, 219944, 100137, 612, -58276, -104409, 17942, -25253, -87511, -226106, 80332, 57608, 4567, 69323, -100756, 149176, -201112, -104535, -11068, -176327, 108826, 142569, 72568, 233324, -43555, 108527, 56042, 212672, 200733, -33738, -90634, -12092, 178399, -266101, -180218, 98799, 68403, -43394, -185104, 188710, -176139, 133027, 8844, -125925, 303435, 14172, -22121, 283015, -52476, 59234, -264238, -25268, -137581, 186887]
11364b45004A03947b95600H4510a63258b4771p9725I3914D3781c6250A09827a7037
11352C09893b46517J12106B19255H0851e560F756h372j59206f3274A01077M3983
11341A45060K9299o8455J28243b74531E62690c14724a17012N3997B26709F3408
11330a99256h7869P185B22394a53357J0446D3947a29336H8564Q9625L8233j0001
11319B06421H3121d0627j08992l7494c7685A0995c44056d2909B30148b14547M5468
11308a69079A9355Q652R5301L4049B4924a56724M7853A76920b40100P1905L8293
11297a29902q4558b3360j67748L9604a5732k48903l5360A54732A2866a49208c0157
11285a6142l5078g999j5226A2363b36455F2468J43925h85k97115G1679c57564
$$ y = [-245004, 103947, -295600, 84510, -163258, -24771, -104496, 93914, 43781, -36250, 109827, -17037, 309893, -246517, -134411, 219255, 80851, -5560, 6756, -8372, -167578, -63274, 101077, 145060, 174359, 105904, 234147, -274531, 562690, -314724, -117012, -63015, 226709, 63408, -199256, -87869, -80684, 222394, -153357, -142911, 43947, -129336, 88564, 178189, 216422, 206421, 83121, -40627, -149619, -187113, -37685, 10995, -344056, -42909, 230148, -214547, -169079, 19355, 28007, 123308, 157357, 24924, -156724, -108871, 176920, -240100, -168195, -129902, -214460, -23360, -191108, -151504, -15732, -264635, -299995, 154732, 12866, -149208, -30157, -16142, -51220, -7999, -23225, 12363, -236455, 62468, 206393, -885, -298000, 71679, -357564]
11273d75666h3276j5358j25081G3945a69600A45726g4297m9615A22955b83628
11262B56956b11878B6076f0809j56844C5694N6340c06827A63932F6342N9011P9970
11251B05323h8127B53937r8048c62929J5932A92527D9102c10254A63370A4013
11240b65719i4646D8640q98C840P2120a03819e035k0329k35078O3413A95499d30062
11227a58751f5357B90534h5977j13701j736j80418a16669D8970a71477r300P4449
11216a06328l48445a97759f6735l3439B28901c45703a5842A43498i511k33037
11206b42548F145Q9818a67184A75391a37162C9157c01199a09174n162a511A46076
11194A31621n4224h5877d0673j65175B29273c18896J34316E0281O4759D1459b31106
$$ y = [-475666, -83276, -98634, -223715, 73945, -169600, 145726, -74297, -123912, 122955, -283628, 256956, -211878, 26076, -60809, -217653, 35694, 92034, -306827, 163932, 66342, 125353, 205323, -88127, 253937, 155889, -362929, -346997, 192527, 49102, -310254, 163370, 14013, -265719, -94646, 48640, 47742, 3840, 75960, -103819, -5035, -25364, -260442, -197029, 195499, -430062, -158751, -65357, 290534, -85977, -199678, -201414, -381832, -116669, 48970, -171477, -180777, -106328, -454773, -197759, -66735, -100174, 228901, -345703, -15842, 143498, -9511, -242548, 6145, 95963, -167184, 175391, -137162, 39157, -301199, -109174, -114336, -1511, 146076, 131621, 77397, -85877, -40673, -205848, 229273, -318896, -184580, 50281, 115040, 41459, -231106]
11182e5684l53570J15761A48959p2658a36051O4508M875C36100A51554g5266A53897
11170h0445P296k92284a38984j8471M6388q8478A00442J599b90212c5902A84453
11158c09046A00246a193j9404A18776a78380f8757B79794B1505e7402B43459b4577
11146b9589A10448a60481j20009i26B18377i5141A51026l1101j4665a00176n441
11135a05617f964E897a87214A05009a25597A83873d1469B52676B8818P1357k2768
11124G7407J76707m4013K3391J47990C29M10924j23050a332A81998L6599a53700
11112A69026d00895A1390L39019J81780c24220a9958C24681M1705j1299e5844
11101a31027B28672p5192o5764e0391j8891F5590J21300L2938N9878L5473F2414
$$ y = [-55684, -409254, -293493, 148959, 76301, -136051, -71543, -66668, 336100, 151554, -75266, 153897, -80445, -73149, -365433, -138984, -157455, -111067, -199545, 100442, 102041, -290212, -35902, 184453, -309046, 100246, -1193, -20597, 118776, -178380, -68757, 279794, 21505, -57402, 243459, -24577, -29589, 110448, -160481, -280490, -926, 218377, -95141, 151026, 119925, 105260, -100176, -105617, -6964, 5897, -187214, 105009, -125597, 183873, -41469, 252676, 28818, 100175, 77407, 254114, 210101, 233492, 381482, 329, 411253, 288203, -1332, 181998, 218597, -153700, 169026, -400895, 11390, 350409, 532189, -324220, -19958, 324681, 366386, 355087, -55844, -131027, 228672, 153480, 87716, -50391, -69282, 65590, 186890, 219828, 279706, 315179, 62414]
11089C18393b8550C18242l8330G8857M33858D7599J85038o5689c55325a3807A70142
11077C8416L27789h8249r0962C67868j65257a7281B51938N34675A70221J37082
11067C07303J5330o9535n1150G8015L50606j28543o9944L26717n1764j93516L65722
11056F77293j9018K13105k34595k55611j46035J80073K92024l24971J39163J72331
11046F93759J75336k05159J92718l56430Q8834R7156n0162J43904o8356J09551
11036H21151o8258C04852L39274j50459j02203L80889j28813j01984L00207Q2927
11026I24690m27426j6740m7016L16698j18781N3665j0553L61619n17329K77599
11016G96426j72952J47911l50386Q3086L02759r7102j44523N9898B33868J82492
$$ y = [318393, -28550, 318242, 279912, 78857, 512715, 47599, 232637, 166948, -355325, -13807, 170142, 38416, 366205, -88249, -179211, 367868, 202611, -17281, 251938, 786613, 170221, 307303, 322633, 253098, 201948, 78015, 428621, 300078, 230134, 556851, 505087, 311571, 677293, 658275, 871380, 636785, 381174, 235139, 415212, 707236, 382265, 521428, 693759, 869095, 663936, 856654, 500224, 589058, 686214, 636052, 779956, 711600, 821151, 752893, 304852, 644126, 493667, 391464, 772353, 643540, 541556, 841763, 924690, 497264, 480524, 433508, 750206, 631425, 685090, 674537, 1036156, 518827, 796426, 623474, 771385, 420999, 504085, 806844, 709742, 565219, 625117, 233868, 416360]
11006D16360j753L20928k49128J6887q1756P1312n547K00494j41807m9800J33816
10995F30006k83482Q1818K64839k10976j74875P27432l08644k9764j65044J13417
10985F44727q539L09144k97609K42361J38172j2315J55961l3477k57335L86798
10975A267888k3999J82075M56906K29777L7519k6082J63644J61584j78500M52158
10965B722970l04563O5269P5704m94553k21636J24394j12903n08321L26795M7563
10955A720719k34251M54019k88665K24703k67909p8019k52924k07900J84345n23581
10945G30537N844C17988K84419I5601K59591l5975J26157A94348k4045R4831A17054
10933a63226e7695B00559B9819B931J98148E4166M58907B28946A8636a22664k8321
$$ y = [416360, 414607, 735535, 486407, 503294, 421538, 492850, 487303, 687797, 545990, 496190, 630006, 346524, 428342, 693181, 482205, 307330, 1034762, 726118, 696354, 531310, 644727, 636188, 945332, 647723, 890084, 1028256, 1015941, 1171902, 1138425, 881090, 1267888, 1243889, 1425964, 1882870, 2112647, 2150166, 2124084, 2287728, 2449312, 2270812, 2722970, 2418407, 2483676, 2559380, 2064827, 1843191, 1967585, 1854682, 1346361, 1673156, 1720719, 1486468, 1940487, 1651822, 1876525, 1608616, 1530597, 1277673, 1069773, 1254118, 730537, 736381, 317988, 602407, 95601, 355192, 319217, 445374, 194348, 170303, 265134, 117054, -163226, -57695, 200559, 29819, 2931, 201079, 54166, 513073, 228946, 18636, -122664, -150985]
10922a50985A29508e2562j81454C14550A44380b75598J02722E2542N9249l6064
10912G5727C104a63424A83479b06210b1019k3921A56437C3071b76585e6363D5301
10900I1798L3672L9645b89231b7056E5664b23984B56672d3493p4952j83509F2811
10888A1184a67366P4092j2250H9380J61622a12178k14378a31816e6641A25988
10877H7156a9129A43814c59078B52541j20920l5641A3335a46591j10802O16B27401
10865A5281J6790b64974k6835a9454j94736A63031b89815F6393i8818c4393l9887
10854g4280k2055D320a8667A39387b7246a0872k02575A53529O9203J6013b12047
10842b15878m847A38444h9122n9229A3362b05099Q5100j02537D48868A17757K04173
$$ y = [-150985, 129508, -52562, -234016, 314550, 144380, -275598, -172876, 52542, 111791, 75727, 3104, -163424, 183479, -206210, -21019, -44940, 156437, 33071, -276585, -56363, 45301, 91798, 125470, 165115, -289231, -27056, 55664, -223984, 256672, -43493, -118445, -301954, 62811, 11184, -167366, -93274, -105524, 89380, 251002, -112178, -326556, -131816, -56641, 125988, 87156, -19129, 143814, -359078, 252541, 131621, 95980, 13335, -146591, -257393, -256777, 227401, 15281, 32071, -264974, -291809, -19454, -214190, 163031, -289815, 66393, -98818, -34393, -74280, -96335, 4320, -18667, 139387, -27246, -10872, -213447, 153529, 222732, 238745, -212047, -215878, -220725, 138444, -89122, -148351, 13362, -205099, -119999, -222536, 448868, 117757, 321930]
10831C21930A15766b20269N8728A8418J64482B1710J75519a2867B6386a17742
10820A84548G8277R164M2789K30251a56437A28587b14441P1811r8373A49600e2785
10808d36522e7154A8207b47184B64514a18020H6326a97792j51260F50K1456M2695
10797F4801A8486L9339b46642a00727C89587A65272b08181g7878E6977d1753j15005
10786a56758E4866b2499q2966j5094d6560j1147i551B4380a04927n6163m6268
10775b07358B57328B6033c01113f0744j73862R0366D36548f1771o3981j31530
10765b57282B03263b67091P1809I0087g7810B0364a10804A64980a86612h4721
10754a3029k3596A77264a12273l8596J1725A35640c359k00606E1740C651M5502
$$ y = [321930, 115766, -220269, -161541, 18418, 182900, 21710, 197229, -12867, 26386, -117742, 184548, 78277, 87441, 130230, 360481, -156437, 128587, -214441, -142630, -241003, 149600, -52785, -436522, -57154, 18207, -247184, 264514, -118020, 86326, -197792, -349052, 650, 22106, 64801, 18486, 57825, -246642, -100727, 389587, 165272, -208181, -77878, 56977, -41753, -156758, 54866, -22499, -105465, -120559, -46560, -57707, -9551, 24380, -104927, -161090, -207358, 257328, 26033, -301113, -60744, -234606, -144240, 436548, -61771, -125752, -257282, 203263, -267091, -195282, 90087, -77810, 20364, -110804, 164980, -186612, -84721, -13029, -36625, 177264, -112273, -150869, -139144, 135640, -3359, -203965, 51740, 3651, 49153]
10743D9153L9517a15422E4188a32767H6426c50409I1569K52803b63895A92772
10732E599J52642a89005F8184G488M55894a51047F6666b9631A4611c03285g9112
10720b99200o0289J16867l9239i1474B38488a70081G8197O562a13176B48368a81436
10708d16572E052P4083J14345C5638i5640b8410A24481D6611k582a90964B6620
10696c8340I7254b55099i1599B04469i5657D5513a620D6292j4360b39062P8548
10685a60514b5550q6518d1881F6728e99673e8847k2712C3648a64706A84894H7316
10673A24310F0589c34541A511a95557j38251B61613A1671O3247K0287L333e8057
10661B05372J51775a3466n3791j51765e5417A12464c41768J48062B8406a1995
$$ y = [49153, 88670, -115422, 54188, -132767, 86426, -350409, 91569, 344372, -263895, 192772, 5599, 158241, -189005, 68184, 7488, 463382, -151047, 66666, -29631, 14611, -303285, -79112, -299200, -359489, -242622, -281861, -91474, 238488, -170081, 78197, 84759, -113176, 248368, -181436, -416572, 5052, 79135, 193480, 35638, -95640, -28410, 124481, 46611, 44029, -190964, 26620, -38340, 97254, -255099, -91599, 204469, -95657, 45513, -1620, 46292, 31932, -239062, -160514, -25550, -112068, -41881, 66728, -599673, -58847, -81559, 33648, -164706, 184894, 87316, 124310, 60589, -334541, 1511, -195557, -333808, 261613, 11671, 74918, 95205, 98538, -58057, 205372, 357147, -13466, -67257, -219022, -55417, 112464, -341768, -193706, 28406, -11995]
10650C3575a62991j22304D4980L4140a2739k47537m5243d368m0600h09F2087k0908
10638D1179O5432b29255j19235B00339b33865e1915D0455K4167k5586b13830E7014
10626C3520q465K52998a18423B62728b47728a11901C9613b41569A30117A2232
10615a28902L9580j38079c7617j22086D4447A7714c9787A20924c1655p6855j84014
10604b92524D2011G215i8446a5113B11311o8036c44957A30153i3899B73829G7414
10592a35151k4399j30247i3137o5333B06488f8194a0295k21206r8469g5419j78019
10581b53438A18994c1958j91057F8570l330b30581k93604A26540L86038A1277
10570f7985A40011a75671j42682H1966A4787b83497d3672j89848M7704a3850I7206
$$ y = [33575, -162991, -285295, 44980, 79120, -12739, -260276, -305519, -4368, -44968, -809, 62087, 41179, 106611, -229255, -348490, 200339, -233865, -51915, 40455, 64622, 39036, -213830, 57014, 33520, 25055, 278053, -118423, 262728, -247728, -111901, 39613, -241569, 130117, 12232, -128902, -89322, -227401, -37617, -159703, 44447, 17714, -39787, 120924, -31655, -108510, -292524, 42011, 7215, -98446, -15113, 211311, 143275, -344957, 130153, -93899, 273829, 77414, -135151, -159550, -289797, -93137, -158470, 206488, -68194, -10295, -231501, -329970, -75419, -253438, 118994, -31958, -223015, 68570, 65240, -230581, -524185, 126540, 512578, 11277, -67985, 140011, -175671, -318353, 81966, 14787, -283497, -43672, -233520, -185816, -13850, 97206]
10558g9272C9962J17543B109c50324i547A89827N971d90D8804b64652B9589c40841
10545a96373d8887A3529J70010a21451k3596k55249d432B13888o5098f1746j10083
10534a71829A80821R4437c7023H7723b7408p124E2818b30891g0739j36062A89981
10522a67895L1321G612J63369p1427d6242H2655b02251b0934r9238B36416I9367
10510b35730G9027f1766G4188O7049b43325D730g2000I5354c3354C9850d7776
10498F5060J49005A1899b93753a3211l45495i0679B16342f4890A13219O6001a10083
10486b7441A16093b4839l04859a02731B3798N4718J01165c05775d7636l07130
10476c54766B54300A16894M23795j17841I0693d1187B43486d8369m859A68938
$$ y = [-79272, 39962, 157505, 2109, -350324, -9547, 189827, 195798, -490, 48804, -264652, 29589, -340841, -196373, -48887, 13529, 183539, -121451, -145047, -400296, -4432, 213888, 148790, -61746, -171829, 180821, 275258, -37023, 87723, -27408, -34532, 52818, -230891, -70739, -206801, 189981, -167895, -136574, 7612, 170981, 99554, -46242, 82655, -202251, -20934, -120172, 236416, 99367, -235730, 79027, -61766, 74188, 141237, -243325, 4730, -72000, 95354, -33354, 39850, -47776, 65060, 214065, 11899, -293753, -13211, -358706, -90679, 216342, -64890, 113219, 179220, -110083, -27441, 116093, -24839, -329698, -102731, 23798, 78516, 179681, -305775, -47636, -354766, 254300, 116894, 540689, 422848, 90693, -41187, 243486, -48369, -53228, 168938]
10465I7456B3174J48394E0239L8582a36900P253N898B12063C0144a36212F5463
10453b7795m7737b9173m32438C1997h5578H0810O9304e64123I6782a28907D1364
10441a20389A06450f0779j47436e9546j2924J3225G4358c44091M1264A5932a02011
10429a40380r7195l9498i3531d828C00869f799I7742B9753e4379j06812g4948
10417b9992l4558K8054J3647C7932b02214A1709N2167a06267m9030N8999A35754
10405A90340B2097a64813K8722q7615R3649G4728g368k29729i5382L0579C10325
10393e7356B22720J565r1051O9859H2043l9288L08164i1962j82670A68969P1946
10382B40915N253g8734j61488f6485A81127R084H621f3202A13187K51226p7950
$$ y = [97456, 23174, 171568, 50239, 88821, -136900, -129647, -123749, 212063, 30144, -136212, 65463, -27795, -75532, -29173, -461611, 31997, -85578, 80810, 150114, -564123, 96782, -128907, 41364, -120389, 106450, -60779, -208215, -59546, -72470, -59245, 74358, -344091, -302827, 15932, -102011, -140380, -237575, -277073, -93531, -4828, 300869, -6799, 97742, 29753, -54379, -161191, -74948, -29992, -64550, -36496, -22849, 37932, -202214, 11709, 63876, -106267, -155297, -96298, 135754, 190340, 22097, -164813, -136091, -223706, -130057, 74728, -7368, -237097, -95382, -64803, 310325, -57356, 222720, 224285, 133234, 203093, 82043, 42755, 350919, -91962, -274632, 168969, 240915, 246168, -78734, -240222, -66485, 181127, 190211, 8621, -63202, 113187, 364413, 286463]
10371B86463p8031r4991M7209J03186J87200k22455K58789j17200M06037C26759
10360C31814i2945D33236A49149K2985K85963j50585A27212N3110J01619a5368
10349A88036G1475M46191B40158K04283A70484p0034p926C2035K84739K48130
10339E64904A73201N409C7593L07123F6345J62590j02810E3506J02382l7836C6404
10327A89279D6338K62438J51790k11226o2672q5188J08330R9682a68585A18054
10316A79633n1916Q744K11435G0043e183A52069G2431a69194j01894a03933H148
10304A62624C9020QL9997P2947k466n1454a63483j57999A02129K31559C9173g9620
10291A28259R0798a03310N073A84699a6243j1090a049m28768f4331l98423e8612
$$ y = [286463, 208432, 113441, 160650, 263836, 451036, 228581, 487370, 370170, 776207, 326759, 331814, -92945, 433236, 149149, 172134, 458097, 307512, 127212, 180322, 281941, -15368, 188036, 71475, 517666, 240158, 444441, 170484, 100450, 92524, 32035, 316774, 564904, 173201, 178610, 37593, 344716, 66345, 228935, 126125, 53506, 155888, 118052, 36404, 189279, 46338, 308776, 460566, 249340, 186668, 101480, 209810, 309492, -168585, 118054, 179633, 127717, 136461, 347896, 70043, -5183, 152069, 72431, -169194, -271088, -103933, 8148, 162624, 39020, 39028, 79025, 151972, 149506, 98052, -163483, -321482, 102129, 333688, 39173, -79620, 128259, 219057, -103310, -98237, 184699, -16243, -27333, -1049, -429817, -64331, -462754, -58612]
10279h586A64815i3429j75056q0549A06733a80065j76492J04963A87426K9113
10269B16539d27197f0535n7420I0034h055A18412C2709c5328j45199j08404f1973
10257D05168j00216A51058J54889j40827J04838L55791B38827K70018j65179A70686
10246G4852A370M8816c3241B8949a49886j67965a33035n2455Q7657k30282a58974
10234c17073E7813J2348d1243G8928b32458G9606K75827c2378j72330h3023A8241
10222b9381j0185j9995E1i1131j13337N3078p2796r573c5497A24643J16029a61777
10209f5611A45258a82468O6814K0244B71073a23783C49070m3219b58152A90666
10198a42341m39064A63983g6865C10524d2964B4688e2095j32186b9420A29515
$$ y = [-8586, 164815, -93429, -268485, -349034, 106733, -180065, -356557, -251594, 187426, 216539, -427197, -60535, -117955, 90034, -8055, 118412, 32709, -35328, -180527, -288931, -61973, 405168, 304952, 151058, 305947, 165120, 269958, 625749, 238827, 508845, 343666, 170686, 74852, 1370, 50186, -33241, 28949, -149886, -317851, -133035, -185490, -97833, -328115, -158974, -317073, 57813, 70161, -41243, 78928, -232458, 79606, 355433, -32378, -204708, -83023, 18241, -29381, -39566, -59561, 51, -91131, -204468, -151390, -224186, -233759, -35497, 124643, 240672, -161777, -65611, 145258, -182468, -115654, -95410, 271073, -123783, 349070, 305851, -258152, 190666, -142341, -581405, 163983, -76865, 310524, -42964, 24688, -52095, -184281, -29420, 129515]
10187a19735j89369B07459b19876q6120J16837H495b10228A54153a04506l6889
10177a41395A36150E8953O179c9661A2493c81620a43259J0970j45092H9605a36320
10165E6193a56687K7926A62695c34801f1926k03315N5793d8406k45121A57262
10154b70962l6089A09183d0712k0142l39783A10501b29176j307b1987l94874B1282
10142a31947A55705J35244d532r5017B4438a81568B39486b1907j81218j36821
10132c39946J17463C3067J78494c22437J49433O8979L5550L3294j83951k81967
10122e01099F424a37791d2818j37163A16331a27611j8460B60010a63238k7773
10112a91011n3658A05997a45507A26211b66078f1464m5900K0326r9685R0541k47619
$$ y = [-119735, -309104, 207459, -219876, -305996, -189159, 8495, -210228, 154153, -104506, -141395, 136150, 58953, 65132, -39661, 12493, -381620, -143259, -132289, -277381, 89605, -136320, 56193, -156687, -128761, 162695, -334801, -61926, -265241, -209448, -48406, -293527, 157262, -270962, -307051, 109183, -40712, -60854, -400637, 110501, -229176, -230483, -21987, -416861, 21282, -131947, 155705, 290949, -4532, -99549, 24438, -181568, 239486, -21907, -203125, -339946, -222483, 33067, 211561, -322437, -173004, -104025, -68475, -35181, -219132, -501099, 6424, -137791, -42818, -179981, 116331, -127611, -146071, 260010, -163238, -191011, -244669, 105997, -145507, 126211, -266078, -61464, -107364, -87038, -186723, -96182, -343801]
10101c43801a46287q532B07987b46827k2679A46618c13083C46731i7079l48329
10091d45408a89645P9903M472o4013B1093c68160M3117J00354f0075j96727A40387
10079a95084j39094H3801b34295J4298a173j42739m5055c4840h171j70764e2079
10067D2121B929L19289c28955a1725d778r4461o6114p8284c978j80904B30996
10055c3668d073D3452K69100D5426K6574J06773E488a69619P7318k10767a33844
10043a29791b8540G7331c09533g0347m2829G0433a27093j05700l1424O4984b3524
10031a11129j34690j3624A97611A017K58750K9347b17706H8368b83400b8268A73832
10019d78859F1691J00821a72830O2641l7266j43337H9127c14604c3202J5317N846
$$ y = [-343801, -146287, -154819, 207987, -246827, -269506, 146618, -313083, 346731, -97079, -445408, -189645, -109742, -105270, -169283, 21093, -368160, -325043, -224689, -60075, -256802, 140387, -195084, -334178, 83801, -234295, -219997, -1173, -143912, -188967, -34840, -8171, -178935, -52079, 42121, 2929, 322218, -328955, -11725, -4778, -99239, -165353, -243637, -3978, -184882, 230996, -33668, -4073, 43452, 312552, 45426, 72000, 178773, 5488, -169619, -92301, -303068, -133844, -129791, -28540, 77331, -309533, -70347, -113176, 70433, -127093, -232793, -264217, -199233, -23524, -111129, -245819, -259443, 197611, 1017, 259767, 289114, -217706, 88368, -283400, -28268, 173832, -478859, 61691, 162512, -172830, -110189, -147455, -290792, 89127, -314604, -33202, -17885, -12039]
10008a2039B71973E0896L5394J4706A348b47234M4787A2946b52204Q9541F5779
9996c2739q0218C6043a15093j12068q0531I9885e2082l20769A98189a6618E5496
9984i3624l2277B5674a54115G443O8301f9446A42569h1973j147k13147B86453
9972C3990A3272a59192A57682b47570b6350A6360b43460N6295B29324a70923A73710
9960e4423i265j8710C5873K04002b12871l9711B06421F828J62033a14424l06556
9949d20980K00736d5627j36544p1941E6140a55027r4717J21611M2317F5412c30993
9937A98593c5714A55623c94780f551p9838B93129b49233E506d68049B41593N1682
9926B93275d36647a15348m005B66167h9572k91475B21950a08075q872j5573C4707
$$ y = [-12039, 271973, 50896, 86290, 100996, 1348, -247234, -202447, 12946, -252204, -162663, 65779, -32739, -112957, 36043, -115093, -227161, -307692, 99885, -52082, -372851, 198189, -16618, 55496, -93624, -125901, 25674, -154115, 7443, 75744, -69446, 142569, -81973, -83120, -296267, 286453, 33990, 13272, -159192, 157682, -247570, -26350, 16360, -243460, -187165, 229324, -170923, 173710, -54423, -9265, -27975, 35873, 239875, -212871, -252582, 206421, 6828, 168861, -114424, -420980, -220244, -45627, -182171, -254112, 56140, -155027, -249744, -128133, -85816, 65412, -330993, 198593, -35714, 155623, -394780, -6551, -86389, 293129, -249233, 5506, -468049, 241593, 293275, -436647, -115348, -119353, 266167, -89572, -381047, 221950, -108075, -116947, -132520, 34707]
9914d34265A10998a2790C1062b08803O8482A19933a12228I1582i3951A89821J16520
9903C06341C6441e4190J4779N95j49535A66534e9459l6327j14798A28292c49963
9891B226M502O7212B6961a07989B00580I8754b44043C3767a34738B22977b10635
9879b6563j29471k10692A77577b43172C3001c33210O1298B43971B9075b44644
9868b75664g5035l766G0964a85501O2170k52224D9445j5959K7556c0548C3558
9856a79679l8486D5962b6285k09905f9034k02744n0017k624A12192g1638A5069
9844E530b8498A29628f7302B32171f1053k31421e4182A47821a76035A89294A8520
9832a3391k89474B69754b24812P9181m5726k8279k77780E5659g0830I8527c8422
$$ y = [-434265, 110998, -12790, 31062, -208803, -140321, 119933, -112228, 91582, -93951, 189821, 306341, 36441, -54190, -39411, -38816, -188351, 166534, -59459, -95786, -210584, 128292, -349963, 2226, 6728, 73940, 26961, -107989, 200580, 98754, -244043, 33767, -134738, 222977, -210635, -26563, -156034, -366726, 177577, -243172, 33001, -333210, -271912, 243971, 29075, -244644, -275664, -75035, -78801, 70964, -185501, -123331, -375555, 49445, 33486, 61042, -30548, 33558, -179679, -218165, 45962, -26285, -236190, -69034, -271778, -321795, -324419, 112192, -71638, 15069, 5530, -28498, 129628, -67302, 232171, -61053, -292474, -54182, 147821, -176035, 189294, 18520, -13391, -302865, 269754, -224812, -145631, -191357, -219636, -497416, 55659, -70830, 98527, -38422]
9820b69974a24649K0431l08559r908b1445l2080j53402M182B10851j6864i8800
9808a06494C073K41222c17510c7968J5587j51873H7272h9952K8656A6513a85928
9796F7735n512b73452i7068m90926A42461a5250D2613b22348c6257j34799o3618
9785b34674j07375a64434P9859o68378a10959j10997a08287e3108A28789b5074
9774a36475F2261B6558L45630b09215m4801M0930o820A01219a53859N0558j5248
9763a18549k11392C0653J47288d7374A71288l8526k1610b16913i107j01444A33498
9751d5521l17430i4775c0040I2077J74950n5286c68765a03718j61000i8319n5166
9740a53485q8344g0134A85640b33280R6598A45615b4967C4923P0151a93038B05596
$$ y = [-269974, -124649, -104218, -412777, -422685, -21445, -53525, -206927, -202745, 210851, 193987, -98800, -106494, 3073, 244295, -317510, -37968, -22381, -174254, 87272, -89952, -61296, 16513, -185928, 67735, 62223, -273452, -97068, -587994, 142461, -15250, 42613, -222348, -36257, -171056, -234674, -342049, -164434, -84575, -752953, -110959, -221956, -108287, -53108, 128789, -25074, -136475, 62261, 26558, 372188, -209215, -254016, -213086, -219906, 101219, -153859, -103301, -118549, -329941, 30653, 177941, -47374, 171288, 132762, 111152, -216913, -9107, -110551, 133498, -45521, -362951, -94775, -30040, 92077, 267027, 211741, -368765, -103718, -264718, -98319, -153485, -241829, -70134, 185640, -233280, -136682, 145615, -24967, 34923, 105074, -193038, 205596]
9728b17563C6616c0333A92128c6897p9159A26874i0841m07367K43879a24248k41880
9717c66128a20038A19636c1161G1535e8181C9142c24230E4639b91450J16338C56305
9705a15175B45000c41309J46103R1134G4909k3464a35029F0144i2581C0674O9975
9694A00649l6351M7559a34805j10046h452j5926k03759J13113M5748n7288k12289
9683c38853a21562j13247L1856g5936m3738B5886h6937j2563A54565a43776c4900
9671D1266J38722c3311D854c9395j09357j27086a26685K4802B4363a37090B34409
9659A4782h4779B28953a62534b5429c931l11724g0358j9238K6046H0288a02465
9647c97516A85480a95508I5463b7582j31922n2179A58582R1025j14680O521e9204
$$ y = [-217563, 36616, -30333, 192128, -36897, -116056, 126874, -90841, -498208, -254329, -124248, -366128, -120038, 119636, -31161, 71535, -58181, 39142, -324230, 54639, -291450, -175112, 356305, -115175, 245000, -341309, -195206, -104072, 74909, 51445, -135029, 60144, -92581, 30674, 100649, 64298, 111857, -134805, -244851, -8452, -24378, -228137, -115024, -69276, -126564, -338853, -121562, -234809, -202953, -75936, -119674, 25886, -86937, -99500, 154565, -143776, -34900, 41266, 179988, -33311, 4854, -39395, -148752, -275838, -126685, -101883, 24363, -137090, 234409, 14782, -84779, 228953, -162534, -25429, -3931, -315655, -70358, -89596, -63550, 80288, -102465, -397516, 185480, -195508, 95463, -27582, -159504, -211683, 158582, 249607, 134927, 141448, -59204]
9635a5958C8346d4710G440J14992C4404a52778O9021E6440j3047e582o08j52222
9623a58412a3628n4211q2005B18026a58727P4512j39381Q606a07207A71659e5407
9611g6285j07092a4907j60896k27774A0108e173k15697j59539a66386A46879a33886
9599a10591M2530B17896b18535r7096E1819j8950K11406a58058C0340b7828k59968
9588b87796K8479A80736b99624P1052h7703d2684A7430K13393a11672p5297j96816
9577c83785J69453P2256e7364k75020C20b40165n9941a18101J33F7932J11573
9566A79505a32207C6754g6454p8998E098M42485A8408a82901R1370r1184G5833
9554a60967c2827l0393j70923J06094j89801i2041H344e6266m403k04077j77982
$$ y = [-15958, 38346, -44710, 7440, 122432, 34404, -152778, -83757, 56440, 43393, -5582, -6190, -158412, -13628, -67839, -149844, 218026, -158727, -84215, -223596, -214990, -107207, 171659, -55407, -76285, -183377, -14907, -175803, -403577, 10108, -5173, -220870, -380409, -166386, 146879, -133886, -110591, -68061, 217896, -218535, -315631, 51819, 32869, 244275, -158058, 30340, -27828, -287796, -259317, 180736, -299624, -228572, -87703, -42684, 17430, 230823, -111672, -186969, -383785, -214332, -142076, -57364, -332384, 320, -240165, -300106, -118101, -117968, 67932, 179505, -132207, 36754, -76454, -155452, 5098, 447583, 18408, -182901, -91531, -182715, 75833, -160967, -32827, -63220, -234143, -128049, -317850, -92041, 8344, -56266, -60669, -264746, -442728]
9543d42728a87545d827m4620A94375I1245a52170O6334b241m15148h8906q8343
9532a77249n3953C6526b6671k46398M9486q0295a0785A19674a36480F6141k4443
9521D1698k207a24197k999A2995e6194C23628a44084N0912j94146K9872K9020
9510b28426B45052b37335c9979m9426l9241m1091l83612I6806c75573J40692A30336
9498d7273j50222j79188J71866b9659A30222k2726e2349k4971k32457L9382a4521
9486b33505A62183L4717H3353b59280B89472a0918k62393A10004a72781B16624
9475A43876K2878a61510M6524k74290a15109B313L6244P260h3673E9060b68065
9463g9991A47003j6853e4638A9461a33191A11437e990j84836b7925j4101B77168
$$ y = [-442728, -187545, -4827, -49447, 194375, 91245, -152170, -85836, -2241, -417389, -88906, -177249, -231202, 36526, -26671, -273069, -223583, -303878, -10785, 119674, -136480, 66141, 41698, 39491, -124197, -127196, 12995, -56194, 323628, -144084, -93172, -287318, -257446, -228426, 245052, -237335, -39979, -89405, -128646, -169737, -553349, 96806, -375573, -234881, 130336, -47273, -197495, -376683, -204817, -29659, 130222, 107496, -52349, -77320, -309777, -270395, -14521, -233505, 162183, 196900, 83353, -259280, 289472, -10918, -273311, 110004, -172781, 216624, 143876, 166754, -161510, -114986, -389276, -115109, 2313, 38557, 45817, -83673, 59060, -268065, -79991, 147003, 130150, -54638, 19461, -133191, 111437, -5990, -190826, -27925, -42026, 277168]
9451c5165k84473N3241a29652k20385A5832K1326a11156j8068H4307a11927C24705
9439d8438E6896a07635m6287g4119k83845a06291j74949k2483J03003n6766A12774
9427a1120B9567f4802A06023M1704K6010d7345j22052D1998f4993j92699B59561
9415G2937c5792l27193d3782A43092a08368p3315j7393E4760Q9423a57036o8187
9404b25223o3327a30404H1554k5420c10710B54773p468d918m7672r1744J7785
9393a26549j26545P3287d0412f809j59193n2754M4446N3525C2906a48211f4808
9381d3050F1530b12217E4166b11395k9136j69510J82794j6475j27502A80713b22282
9369e5224b5144j94050D1458J34001b39361k3055a18399d6418n9533j75399Q1480
$$ y = [-35165, -319638, -266397, -129652, -350037, 15832, 37158, -111156, -129224, 84307, -111927, 324705, -48438, 56896, -107635, -153922, -74119, -357964, -106291, -281240, -303723, -200720, -257486, 112774, -11120, 29567, -64802, 106023, 147727, 173737, -47345, -169397, 41998, -64993, -257692, 259561, 72937, -35792, -362985, -43782, 143092, -108368, -181683, -199076, 54760, 144183, -157036, -225223, -288550, -130404, 81554, 56134, -310710, 254773, 247305, -4918, -52590, -144334, -126549, -253094, -179807, -40412, -6809, -166002, -218756, -174310, -120785, 32906, -148211, -64808, -43050, 61530, -212217, 54166, -211395, -240531, -410041, -227247, -243722, -371224, 180713, -222282, -55224, -25144, -219194, 41458, 175459, -239361, -262416, -118399, -46418, -105951, -281350, -199870]
9358a99870A6857d35972j6615a01779q058r1106A89462g3853K8906m251j36842
9347a86040g7279j20888B03965b75616D411b1516C1556J16021R9527A06439g6206
9335b14098C6957K45138b27038A23563a8672B17828g9514k10717A0600a97120
9324b53192a07319p2876H7459Q6110j3675J13785c09917B7125d2513A90608b83512
9312h6348o7547B20403a10015p8050O2473f1856n269B2350J40600o4530R1919
9301A90339l5985a56438M8770K2365j13786A30946Q8022f3395L1487A75915c51658
9289A66683b26015L5040K2648k30659A60225g9550a7380l45861J63315A98819
9278d12481A01706c76871a30369j14916h1297L1695j38238O6751B95286F5109
$$ y = [-199870, 16857, -435972, -452587, -101779, -109837, -200943, 189462, -73853, -44947, -49198, -186040, -77279, -198167, 203965, -275616, 4411, -21516, 31556, 147577, 247104, 106439, -76206, -214098, 36957, 282095, -227038, 123563, -18672, 217828, -79514, -290231, 10600, -197120, -253192, -107319, -180195, 87459, 173569, 159894, 273679, -309917, 27125, -42513, 190608, -283512, -86348, -153895, 220403, -110015, -188065, -125592, -61856, -67125, 22350, 162950, 98420, 190339, 154354, -156438, -107668, -85303, -199089, 130946, 218968, -63395, -31908, 175915, -351658, 166683, -226015, -190975, -168327, -398986, 160225, -79550, -17380, -363241, -199926, 198819, -412481, 101706, -376871, -130369, -245285, -81297, -49602, -187840, -121089, 295286, 65109]
9267b02786B35923c1740A00070a04480B76852a82472d2467B33717A09769l2646
9257G7123a2135j72796K2382d9774p8899a0246l00395d8130A1936J30433b014
9245b00019b8299H0283c9177j8596j03402A65178p5070a01787B90804g0374l47943
9234d18317a40439A47686c38286a29525D9826P54a43435B72252f44100F965b18224
9222B30035a57387A2552i7466j60948b6937A9548g0516C1942L219i4425j75375
9211b69800J33772r2110N3749E2533c93038A15085a63551O9098a4317C01693p2724
9200B28969a55064P6261A40129D3466G482L9940f7067j06173b2168C8794A9298
9188b81158m813A36507b42014o1450J40582B01721d5643k46545J7509a04738L3022
$$ y = [-202786, 235923, -31740, 100070, -104480, 276852, -182472, -42467, 233717, 109769, 77123, -12135, -184931, -162549, -49774, -128673, -10246, -310641, -48130, 11936, 142369, -2014, -200019, -28299, 80283, -39177, -57773, -161175, 165178, 90108, -101787, 290804, -70374, -418317, -140439, 147686, -338286, -129525, 49826, 50580, -143435, 272252, -644100, 6965, -218224, 230035, -157387, 12552, -97466, -258414, -26937, 19548, -70516, 31942, 35161, -94425, -269800, -136028, -228138, -174389, 52533, -393038, 115085, -163551, -94453, -14317, 301693, 228969, -155064, -78803, 140129, 43466, 7482, 47422, -67067, -173240, -22168, 38794, 19298, -281158, -285971, 136507, -242014, -303464, -162882, 201721, -45643, -292188, -274679, -104738, -71716]
9177g1716n7369F9279J25540a98547n0532B56103B8456a27797H2669b3513l73972
9166c97485h073D9146a20899j57353d4464k352J215l04516a51877m477j0449k46197
9154d13000a89506A19070l0315a17031c9212l04334a52853e8847A08871j1924
9144I6947a84275A59990b31354e2986A58351h1066B07750i005I2645a23702L9206
9133h4496A7047a82022A5452c2511J1621j4761a1222q8856a9945C0720K83592
9122C14312e4243D848J47369a46532f4024G513J30099M5557h3806l2565A19483
9110f9612B00310a21012d3899j03691E7740b06474g5687j91056B50564e2964m02664
9099d55628B05442a8528A72672a79801E4637g3363A56619E8283d20942A94991
$$ y = [-71716, -129085, 69279, 194819, -198547, -249079, 256103, 28456, -127797, 82669, -23513, -397485, -8073, 49146, -120899, -278252, -44464, -46816, -45601, -350117, -151877, -156354, -166803, -413000, -189506, 119070, 88755, -117031, -39212, -343546, -152853, -58847, 108871, 96947, -184275, 159990, -231354, -52986, 158351, -81066, 207750, -9005, 92645, -123702, -84496, 17047, -182022, 15452, -32511, -20890, -35651, -11222, -100078, -19945, 30720, 314312, -54243, 4848, 152217, -146532, -64024, 7513, 137612, 183169, -83806, -116371, 119483, -69612, 200310, -121012, -43899, -147590, 57740, -206474, -75687, -266743, 250564, -52964, -455628, 205442, -18528, 172672, -179801, 54637, -73363, 156619, 58283, -420942, 194991]
9088d23001J46781J2816A43088c01301d9776j21605b8965F3065K4459b08833A15817
9076a60120C2140l07d6827B09780a71577N0739R165q2357H3622b40528Q4627j1297
9064a67198Q0260D3005L2872J0854F976N7978a62065j39457h6545C2431J87705
9053B20136a74607o1548b0639j03739A17464N8030R540c9618m9100A16214K58776
9042C74990a69162P8477A137a81651g3643j34315P1556F7392i0651p6679j6757
9031a84087j71403C8168e70711a95646j19916a05352k30979N2362A63276b8246
9020a37948a574k11321B86465c26698a8407j30218q7305f4467E2488J4461C2411
9008E4145j6711F479J7424b2019a543r5815A2928J78171a34867j18379N218R1195
$$ y = [-423001, -276220, -263404, 143088, -301301, -49776, -171381, -28965, 63065, 87524, -208833, 115817, -160120, 32140, 31833, -46827, 209780, -171577, -120838, -111673, -194030, 83622, -240528, -155901, -167198, -86938, 43005, 75877, 86731, 6976, 64954, -162065, -301522, -86545, 32431, 220136, -174607, -236155, -20639, -124378, 117464, 175494, 185034, -39618, -88718, 116214, 374990, -169162, -90685, 1137, -181651, -73643, -207958, -136402, 67392, -90651, -167330, -184087, -355490, 38168, -570711, -195646, -315562, -105352, -336331, -283969, 163276, -28246, -137948, -1574, -212895, 286465, -326698, -18407, -148625, -235930, -64467, 52488, 66949, 32411, 54145, 37434, 6479, 23903, -22019, -1543, -97358, 12928, 191099, -134867, -253246, -248028, -156833]
8996a56833A38898C0577J78306a61841d6767o6551B9137R2830a17267q62j51473
8985b69602M4559j71933e9748K9218j56399o6464J04842a656C10801f02876E9679
8973a79987k929a7454D1678d32871A89229d8323G844c57150g4333B43535c29132
8961B13172e0337j78009A38468e0186I3975b62455D668J77219a92446A66588C1859
8949A66380l1920a60838P281j29871a11322r9719d9799j5551C02989j02613H7042
8937b12834F7642M0052R7242A2042a96528C70343C3238d28812b3150j78502K7882
8926a73770b2320B44398j11864b10479D11642P40265L073796O884593D422531
8916A333633B34427J04411f0848B42550e9368F0847a27638j9585m0935f7451C43622
$$ y = [-156833, 138898, 30577, 208883, -161841, -46767, -113318, 29137, 121967, -117267, -118129, -269602, -225043, -396976, -59748, -30530, -186929, -253393, -148551, -1656, 310801, -602876, 59679, -179987, -182916, -17454, 41678, -432871, 189229, -48323, 7844, -357150, -74333, 243535, -329132, 213172, -50337, -228346, 138468, -50186, 93975, -262455, 4668, 181887, -192446, 166588, 31859, 166380, 134460, -160838, -153557, -283428, -111322, -211041, -49799, -65350, 302989, 200376, 87042, -212834, 67642, 107694, 204936, 12042, -196528, 370343, 33238, -428812, -23150, -201652, -173770, -22320, 244398, 132534, -210479, 411642, 1151907, 4225703, 11110296, 4422531, 1333633, 234427, 338838, -60848, 242550, -59368, 60847, -127638, -147223, -188158, -67451, 343622]
8904g2924j91140a23353a3455p4508D61262c9824J1043K970I3866a49890A85398
8892i6004B23659p6466a55427A34349a79777a7623C54090h3481J4397l8711A89977
8880D9793c25000N0943i5185L0355A73325b7956l07812C68181c42j36423c7515
8868A48800m6939c5122o257F7654l1888g6790j28455r333b3863m2917B0887J59893
8856A80780b3251m6148j10653A2606M8816j9411a82302g8347k4776C7489P0657
$$ y = [-72924, -264064, -123353, -13455, -87963, 461262, -39824, -28781, -25811, 93866, -149890, 185398, -96004, 223659, 147193, -155427, 134349, -179777, -17623, 354090, -83481, -69084, -107795, 189977, 49793, -325000, -274057, -95185, -64830, 173325, -27956, -335768, 368181, -342, -136765, -37515, 148800, 101861, -35122, -41379, 67654, 35766, -76790, -205245, -214578, -23863, -66780, 20887, 180780, -23251, -69399, -180052, 12606, 61422, 42011, -182302, -78347, -103123, 37489, 108146]
$$ [...]
##END NTUPLES=NMR SPECTRUM
##END=
