
##TITLE=AC1310_HONAH12126_6614145_50nEYG3tpd
##JCAMPDX= 6.0         $$ Bruker NMR JCAMP-DX V2.0
##DATA TYPE= NMR SPECTRUM
##DATA CLASS= NTUPLES
##ORIGIN= BRUKER
##OWNER= Administrator
$$ 1.72 TOPSPIN		Version 2.1
$$ 2012-08-02 17:26:53.562 -0500  Administrator@TOPSPIN
$$ Compression mode = diff/dup
##.OBSERVE FREQUENCY= 400.02188249412
##.OBSERVE NUCLEUS= ^1H
##.ACQUISITION MODE= SIMULTANEOUS (DQD)
##.ACQUISITION SCHEME= undefined
##.AVERAGES= 64
##.DIGITISER RES= 22
##SPECTROMETER/DATA SYSTEM= spect
##.PULSE SEQUENCE= noesygpps1d.comp
##.SOLVENT NAME= COFFEE_meoh
##.SHIFT REFERENCE= INTERNAL, COFFEE_meoh, 1, 14.96241
##AUDIT TRAIL= $$ (NUMBER, WHEN, WHO, WHERE, PROCESS, VERSION, WHAT)
$$ ##TITLE= Audit trail, TOPSPIN		Version 2.1
$$ ##JCAMPDX= 5.01
$$ ##ORIGIN= Bruker BioSpin GmbH
$$ ##OWNER= Administrator
$$ $$ C:\Bruker\TOPSPIN/data/COFFEE/nmr/AC1310_HONAH12126_6614145_50nEYG3tpd/12/pdata/1/auditp.txt
$$ ##AUDIT TRAIL=  $$ (NUMBER, WHEN, WHO, WHERE, PROCESS, VERSION, WHAT)
(   1,<2012-08-02 17:26:48.187 -0500>,<Administrator>,<TOPSPIN>,<go>,<TOPSPIN 2.1>,
      <created by zg
	started at 2012-08-02 17:15:17.843 -0500,
	POWCHK enabled, PULCHK disabled,
       configuration hash MD5:
       6B 1B 68 BB D9 2E 58 E2 7F 35 AD 54 07 DF 0E 41
       data hash MD5: 64K
       7F C3 D5 3E 3C F7 C6 B0 DF 0C C6 C9 76 7D 63 A7>)
(   2,<2012-08-02 17:26:51.296 -0500>,<Administrator>,<TOPSPIN>,<proc1d>,<TOPSPIN 2.1>,
      <Start of raw data processing
       efp LB = 0.3 FT_mod = 6 PKNL = 1 PHC0 = 0 PHC1 = 0 SI = 128K 
       data hash MD5: 128K
       8C B5 3E 44 30 37 47 05 00 96 A8 29 EB C6 75 19>)
(   3,<2012-08-02 17:26:52.390 -0500>,<Administrator>,<TOPSPIN>,<proc1d>,<TOPSPIN 2.1>,
      <pk PHC0 = 4.779053 PHC1 = 0 
       data hash MD5: 128K
       85 17 0A C7 22 31 3D CE B3 30 C5 C2 28 19 F4 B5>)
(   4,<2012-08-02 17:26:53.203 -0500>,<Administrator>,<TOPSPIN>,<proc1d>,<TOPSPIN 2.1>,
      <abs ABSG = 1 
       data hash MD5: 128K
       18 7E E2 89 AF 9F 39 24 D6 9D 09 66 15 30 BD 35>)
(   5,<2012-08-02 17:26:53.281 -0500>,<Administrator>,<TOPSPIN>,<proc1d>,<TOPSPIN 2.1>,
      <abs ABSG = 2 
       data hash MD5: 128K
       9A C7 57 35 4A 4E 2D FE A4 33 DE D3 86 BE C5 75>)
(   6,<2012-08-02 17:26:53.343 -0500>,<Administrator>,<TOPSPIN>,<proc1d>,<TOPSPIN 2.1>,
      <abs ABSG = 3 
       data hash MD5: 128K
       7D 90 DC 29 BB 62 24 E3 2E 56 C9 D1 30 71 85 4F>)
(   7,<2012-08-02 17:26:53.437 -0500>,<Administrator>,<TOPSPIN>,<proc1d>,<TOPSPIN 2.1>,
      <abs ABSG = 4 
       data hash MD5: 128K
       8C 52 E5 54 53 D7 1A 1D 3D C0 C8 4C B1 2B A7 0D>)
(   8,<2012-08-02 17:26:53.484 -0500>,<Administrator>,<TOPSPIN>,<proc1d>,<TOPSPIN 2.1>,
      <abs ABSG = 5 
       data hash MD5: 128K
       8E B9 94 11 80 53 86 67 EF CA 61 5F F0 73 8B E9>)
$$ ##END=
$$ 
$$ $$ hash MD5
$$ $$ 6C EA 8C 1E E9 29 72 52 F3 D5 50 A0 A7 C3 FE DD
##$RELAX= 
##$RELAX= 
##$RELAX= 
##$RELAX= 
##$RELAX= 
##$RELAX= 
##$RELAX= 
##$RELAX= 
$$ Bruker specific parameters
$$ [...]
150 150 150 150 150 150 150 150
##$TP07= 0
##$TPNAME0= <>
##$TPNAME1= <>
##$TPNAME2= <>
##$TPNAME3= <>
##$TPNAME4= <>
##$TPNAME5= <>
##$TPNAME6= <>
##$TPNAME7= <>
##$TPOAL= (0..7)
0.5 0.5 0.5 0.5 0.5 0.5 0.5 0.5
##$TPOFFS= (0..7)
0 0 0 0 0 0 0 0
##$TUNHIN= 0
##$TUNHOUT= 0
##$TUNXOUT= 0
##$USERA1= <user>
##$USERA2= <user>
##$USERA3= <user>
##$USERA4= <user>
##$USERA5= <user>
##$V9= 5
##$VALIST= <valist>
##$VCLIST= <CCCCCCCCCCCCCCC>
##$VD= 0
##$VDLIST= <DDDDDDDDDDDDDDD>
##$VPLIST= <PPPPPPPPPPPPPPP>
##$VTLIST= <TTTTTTTTTTTTTTT>
##$WBST= 1024
##$WBSW= 4
##$XGAIN= (0..3)
0 0 0 0
##$XL= 0
##$YL= 0
##$YMAX_a= 17457296
##$YMIN_a= -9743220
##$ZGOPTNS= <>
##$ZL1= 120
##$ZL2= 120
##$ZL3= 120
##$ZL4= 120
##$ABSF1= 14.96241
##$ABSF2= -5.595772
##$ABSG= 5
##$ABSL= 3
##$ALPHA= 0
##$AQORDER= 0
##$ASSFAC= 0
##$ASSFACI= 0
##$ASSFACX= 0
##$ASSWID= 0
##$AUNMP= <proc_prof1d_extract.lims>
##$AXLEFT= 0
##$AXNAME= <>
##$AXNUC= <1H>
##$AXRIGHT= 0
##$AXTYPE= 0
##$AXUNIT= <>
##$AZFE= 0.1
##$AZFW= 0.1
##$BCFW= 0
##$BC_mod= 0
##$BYTORDP= 0
##$COROFFS= 0
##$CY= 15
##$DATMOD= 1
##$DC= 0
##$DFILT= <>
##$DTYPP= 0
##$F1P= 0
##$F2P= 0
##$FCOR= 0.5
##$FTSIZE= 131072
##$FT_mod= 6
##$GAMMA= 0
##$GB= 0
##$INTBC= 1
##$INTSCL= 1
##$ISEN= 128
##$LB= 0.3
##$LEV0= 0
##$LPBIN= 0
##$MAXI= 10000
##$MC2= 0
##$MEAN= 0
##$ME_mod= 0
##$MI= 0
##$NCOEF= 0
##$NC_proc= -2
##$NLEV= 6
##$NOISF1= 0
##$NOISF2= 0
##$NSP= 0
##$NTH_PI= 0
##$NZP= 0
##$OFFSET= 14.96241
##$PC= 1
##$PHC0= 4.779053
##$PHC1= 0
##$PH_mod= 1
##$PKNL= yes
##$PPARMOD= 0
##$PPDIAG= 0
##$PPIPTYP= 0
##$PPMPNUM= 2147483647
##$PPRESOL= 1
##$PSCAL= 4
##$PSIGN= 0
##$PYNMP= <proc.py>
##$REVERSE= no
##$SF= 400.020009074019
##$SI= 131072
##$SIGF1= 0
##$SIGF2= 0
##$SINO= 400
##$SIOLD= 131072
##$SPECTYP= <>
##$SREGLST= <1H.CDCl3>
##$SSB= 0
##$STSI= 131072
##$STSR= 0
##$SW_p= 8223.68421052631
##$SYMM= 0
##$S_DEV= 0
##$TDeff= 65536
##$TDoff= 0
##$TI= <>
##$TILT= no
##$TM1= 0
##$TM2= 0
##$TOPLEV= 0
##$USERP1= <user>
##$USERP2= <user>
##$USERP3= <user>
##$USERP4= <user>
##$USERP5= <user>
##$WDW= 1
##$XDIM= 131072
##$YMAX_p= 430369695
##$YMIN_p= -13470
##$CURPLOT= <Network HP LaserJet P1505>
##$CURPRIN= <$Network HP LaserJet P1505>
##$DFORMAT= <normdp>
##$LAYOUT= <+/1D_H.xwp>
##$LFORMAT= <normlp>
##$PFORMAT= <normpl>
##$SURQMSG= 1
$$ End of Bruker specific parameters
$$ ---------------------------------
##NTUPLES= NMR SPECTRUM
##VAR_NAME=  FREQUENCY,     SPECTRUM/REAL,   SPECTRUM/IMAG
##SYMBOL=    X,             R,               I
##VAR_TYPE=  INDEPENDENT,   DEPENDENT,       DEPENDENT
##VAR_FORM=  AFFN,          ASDF,            ASDF
##VAR_DIM=   131072,        131072,          131072
##UNITS=     HZ,            ARBITRARY UNITS, ARBITRARY UNITS
##FACTOR=    0.0627417313425164, 1,          1
##FIRST=     8223.62146879497, 3217,         -64608
##LAST=      0,             6266,            -63967
##MIN=       0,             -13470,          0
##MAX=       8223.62146879497, 430369695,    0
$$ Real data points
##PAGE= N=1
##DATA TABLE= (X++(R..R)), XYDATA
$$ [...]
67440 83030 84195 84822 84969 85136 85576 85964 85944 85767 86097 87192 88607 89669 90015 89646 88803 87867 87194 86958
67422 86958 87257 88227 89695 90887 91059 90451 90059 90267 90340 89548 88166 86907 85981 85365 85508 86875 88954
67405 88954 90539 90985 90590 89831 88945 88299 88319 88808 88981 88489 87789 87265 86663 85849 85413 85844 86643 87054 87284
67386 87284 88043 89062 89137 87879 86492 86289 87166 88149 88913 89879 91019 91496 90673 88928 87165 85974 85534
67369 85534 85919 86985 88122 88586 88136 87185 86360 86125 86663 87772 88906 89656 90283 91441 93247 94921 95549
67352 95549 95040 94164 93839 94527 96053 97727 98753 98831 98384 98050 98046 98173 98236 98143 97728 96953 96370 96932 99015
67333 99015 101807 103997 104999 105366 106014 107292 108803 109986 110662 111020 111210 111115 110656 110188 110323 111266 112463
67316 112463 113149 113164 113030 113237 113715 114134 114476 115046 116002 117101 117910 118109 117631 116753 116079 116123 116801 117553 118060
67297 118060 118554 119270 119947 120169 119979 119723 119457 118972 118349 118053 118378 119095 119773 120194 120436 120824 121758 123233
67279 123233 124532 124789 123972 122901 122265 122063 122158 122767 124007 125433 126460 126950 126975 126401 125241 124138 123866
67262 123866 124442 125250 125992 126959 128359 129946 131453 132892 134233 135197 135606 135679 135754 135989 136464 137285 138360
67245 138360 139365 140134 140868 141718 142452 142897 143453 144721 146588 148153 148726 148651 148916 150098 151913 153664 154842
67228 154842 155250 154895 154062 153390 153499 154367 155278 155593 155453 155492 156021 156826 157754 159056 160930 163026 164698 165617
67210 165617 165894 165786 165642 166048 167499 169739 171720 172543 172286 171725 171469 171643 172256 173360 174778 176054 176939
67193 176939 177681 178604 179574 180118 180038 179750 180013 181331 183534 185892 187792 189334 191059 193058 194699 195379
67177 195379 195230 194870 194785 195210 196221 197540 198570 199154 199956 201489 203089 203676 203452 203844 205595 207801 209231
67160 209231 209837 210422 211448 212762 214068 215047 215385 215249 215446 216605 218430 220240 221908 223746 225742 227535
67144 227535 228945 230011 230723 231352 232754 235527 238937 241527 242878 243999 245784 247919 249687 251123 252730
67129 252730 254570 256310 257903 259644 261655 263750 265813 267954 270270 272667 274856 276457 277343 278056 279564
67114 279564 282226 285256 287649 289430 291386 293674 295447 296128 296356 297164 298684 300355 302157 304763 308356
67099 308356 312002 314651 316326 317916 320058 322700 325542 328382 331053 333467 335790 338284 340926 343488
67085 343488 345956 348507 351096 353521 356012 359244 363490 368135 372334 375885 379139 382315 385264 387747
67071 387747 389706 391377 393326 396147 399822 403575 406696 409360 412355 416130 420412 424690 428730 432617
67057 432617 436551 440628 444695 448463 451887 455297 459014 462956 466751 470017 472452 473965 475056 476805
67043 476805 480079 484801 490189 495455 500115 504018 507599 511801 517120 522835 527732 531577 535399 540287
67029 540287 546409 553158 559723 565439 570186 574682 579910 586027 592236 597949 603593 609926 616913 623756
67015 623756 629829 635206 640326 645530 650973 656767 663030 669851 677256 685186 693463 701765 709700 717068
67001 717068 724103 731232 738494 745440 751853 758330 765755 774352 783609 793048 802589 812147 821401 830174
66987 830174 838721 847389 856209 865006 873701 882363 891136 900210 909729 919611 929612 939636 949843
66974 949843 960412 971333 982440 993508 1004315 1014809 1025236 1035917 1046901 1058048 1069402
66963 1069402 1081194 1093428 1105739 1117758 1129383 1140674 1151705 1162713 1174115 1186211 1198932
66952 1198932 1211974 1225108 1238327 1251809 1265713 1279892 1293813 1306986 1319514 1332061 1345179
66941 1345179 1358807 1372466 1385835 1399077 1412575 1426346 1439783 1452203 1463689 1475095 1487092
66930 1487092 1499559 1512124 1524867 1538042 1551439 1564629 1577658 1590864 1604104 1616859 1629206
66919 1629206 1642018 1655853 1670094 1683512 1695453 1706242 1716707 1727496 1738709 1750056 1761374
66908 1761374 1772871 1784648 1796213 1806923 1816830 1826625 1836692 1846679 1856057 1864642 1872467 1879610 1886310
66895 1886310 1892817 1898915 1904003 1907914 1911318 1915087 1919499 1924213 1928748 1932733 1935923 1938158 1939277 1939159
66881 1939159 1938093 1936898 1936153 1935309 1933165 1929368 1924915 1920943 1917517 1913877 1909434 1904148 1898270 1892118
66867 1892118 1885951 1879834 1873667 1867367 1860750 1853310 1844541 1834585 1824194 1813944 1803855 1793738 1783326
66854 1783326 1772107 1759750 1746927 1734942 1724103 1713116 1700590 1686588 1672233 1658347 1645085
66843 1645085 1632389 1620015 1607342 1593887 1579863 1565692 1551220 1536064 1520641 1506030 1492642
66832 1492642 1479572 1465639 1450729 1435755 1421480 1407700 1393703 1379285 1365019 1351460 1338402
66821 1338402 1325238 1311760 1298204 1284684 1271158 1257853 1245067 1232485 1219407 1205814 1192499
66810 1192499 1179916 1167591 1155079 1142734 1130985 1119453 1107431 1094776 1081804 1068773 1056053
66799 1056053 1044311 1033768 1023631 1013008 1002113 991819 982186 972224 961171 949371 937751 926858
66787 926858 916528 906202 895531 884827 874815 865816 857438 849168 840867 832386 823296 813488 803632
66774 803632 794431 785761 777045 768157 759363 750714 742148 733899 726163 718582 710714 702787 695300 688124
66760 688124 680756 673253 666132 659428 652656 645702 638972 632656 626579 620819 615637 610687 605052 598368
66746 598368 591255 584427 577979 571738 565661 559597 553239 546616 540163 534100 528257 522725 518029 514271
66732 514271 510677 506428 501573 496697 492126 487869 483953 480293 476452 472040 467280 462762 458776 455238
66718 455238 452150 449653 447500 444927 441336 436968 432615 428709 424971 421019 417012 413375 410078 406645
66704 406645 402936 399414 396411 393546 390236 386524 383004 380116 377838 375914 373978 371566 368378 364527
66690 364527 360402 356372 352761 349758 347101 344117 340455 336518 332913 329853 327363 325592 324392 323041
66676 323041 321038 318808 316977 315326 313227 310752 308464 306321 303768 300833 298173 295981 293826 291618
66662 291618 289703 287789 284929 281063 277605 275825 275384 275088 274384 273354 271830 269472 266532 263752 261551
66647 261551 259843 258558 257750 257191 256377 255118 253744 252532 251179 249110 246224 243073 240220 237716 235423
66632 235423 233577 232439 231447 229524 226546 223750 222079 220823 218813 216423 215145 215345 215702 215075 213820
66617 213820 212858 212424 212309 212538 213063 213281 212541 210927 209170 207969 207620 207911 208184 207761 206483 204529 201780
66600 201780 198002 193737 190284 188463 187944 187985 188177 188165 187399 185709 183634 181742 180087 178670 177842 177784 178108
66583 178108 178403 178679 178872 178572 177739 177010 176711 176151 174687 172929 172008 172075 172434 172771 173234 173426 172480 170371
66565 170371 168244 167015 166259 164878 162441 159474 156741 154627 153153 152281 152023 152302 152849 153436 154165 155241
66549 155241 156469 157338 157684 157753 157460 156136 153538 150654 148854 148408 148346 147714 146502 145417 145092 145562 146182
66532 146182 146133 145191 143876 142661 141344 139533 137451 135774 134793 134238 133891 133903 134395 135066 135413 135175 134544
66515 134544 133965 133691 133514 133074 132414 131905 131571 130895 129523 127757 126088 124656 123498 122907 123024 123375 123333
66498 123333 122870 122398 122078 121775 121507 121415 121338 120893 119983 118828 117572 116273 115240 114945 115492 116479 117338 117612
66480 117612 117036 115766 114454 113718 113517 113357 113041 112791 112670 112353 111569 110498 109604 109298 109792 110924 112030
66463 112030 112284 111431 110094 109215 109204 109634 109698 108968 107798 106962 106895 107313 107566 107227 106350 105388 104911 105179 105862
66444 105862 106321 106309 106161 106215 106270 105807 104619 103077 101852 101369 101426 101399 101027 100729 100814 100715 99703 98183 97356
66425 97356 97500 97633 97214 97085 97982 99070 98993 97853 97083 97601 98992 100335 101032 100911 100294 99941 100297 100799
66407 100799 100461 99080 97294 95612 94039 92533 91163 89791 88199 86581 85391 84697 84218 83912 83959 84233
66391 84233 84372 84375 84523 84706 84516 84043 83901 84312 84848 85306 86159 87711 89308 89888 89070 87380 85634 84427
66373 84427 84023 84336 84955 85368 85313 84942 84556 84119 83193 81639 80273 80265 81726 83430 84204 84058 83579 82893 81880
66354 81880 80886 80374 80178 79895 79759 80323 81429 82297 82567 82481 82185 81665 81329 81694 82374 82242 80842 78912
66336 78912 77356 76408 76021 76280 77089 77964 78453 78330 77396 75695 73995 73276 73575 73980 73869 73409 72781 71826
66318 71826 70786 70421 70944 71592 71773 71837 72234 72665 72725 72706 73043 73474 73502 73210 72949 72583 71720 70421 69098
66299 69098 67969 67084 66550 66220 65561 64433 63656 64167 65762 67264 67772 67281 66319 65529 65408 65850 66082 65568
66281 65568 64799 64650 65138 65528 65591 65975 67162 68687 69651 69594 68668 67364 66293 65893 66072 66352 66493 66667
66263 66667 66873 66560 65247 63348 61920 61518 61627 61420 60821 60481 60784 61327 61509 61255 60852 60397 59853 59447
66245 59447 59458 59678 59647 59480 59837 60896 61975 62502 62814 63520 64510 65172 65333 65335 65323 65008 64264 63503 63295 63813
66225 63813 64779 65783 66574 67158 67656 68064 68196 67868 67099 66073 65045 64250 63743 63265 62495 61541 60999 61362
66207 61362 62518 63884 64920 65442 65564 65447 65002 63955 62399 61130 60972 61753 62424 62367 62076 62346 63224
66190 63224 64158 64743 64846 64350 63376 62610 62786 63743 64489 64384 63896 63913 64586 65262 65511 65749 66543 67599 67963
66171 67963 67244 66122 65402 65104 64953 65248 66446 68118 69207 69373 69258 69221 68707 67299 65633 64581 64043
66154 64043 63207 61768 60252 59271 58969 59154 59576 60065 60634 61400 62270 62897 63101 63070 63017 62930 62868 63062 63395 63193
66134 63193 62041 60490 59423 58929 58342 57302 56191 55459 55087 54885 54972 55637 56870 58230 59166 59380 58932
66117 58932 58058 57033 56237 56130 56853 57928 58658 58819 58632 58143 57129 55721 54567 54120 54221 54588 55233
66100 55233 56060 56596 56588 56493 56876 57605 58104 58092 57620 56661 55324 54247 54112 54722 55083 54502 53255 52072 51302
66081 51302 50730 49969 48967 48215 48415 49786 51751 53414 54236 54169 53412 52318 51405 51140 51680 52821 54002
66064 54002 54396 53439 51514 49763 48945 48763 48526 48059 47628 47364 47289 47618 48549 49850 51051 51885 52259 52031
66046 52031 51268 50528 50452 51149 52252 53391 54301 54707 54551 54145 53774 53398 53095 53439 54857 56818 58240 58632
66028 58632 58343 57847 57370 57170 57573 58559 59707 60645 61344 62005 62901 64190 65574 66384 66387 66269 66847 67964
66010 67964 68699 68498 67574 66311 64927 63726 63064 62854 62582 61933 61078 60271 59605 59169 59049 59071 58938 58679
65992 58679 58647 59051 59756 60574 61339 61753 61563 60970 60477 60292 60121 59621 58757 57778 57089 57077 57680 58234 58108 57445
65972 57445 56913 56823 56877 56717 56264 55558 54716 54063 53960 54456 55338 56396 57345 57803 57796 57999 58933 60109 60645 60504
65952 60504 60433 60783 61174 61361 61588 61954 62190 62238 62379 62632 62706 62714 63158 63972 64389 64114 63884 64400 65358 66075 66493
65931 66493 67008 67772 68717 69849 70986 71587 71377 70829 70515 70317 69854 69370 69522 70338 70968 70593 69271 67844
65913 67844 67229 67755 68960 70076 70802 71430 72139 72520 72135 71215 70441 70132 70027 69758 69171 68265 67137 66016
65895 66016 65129 64522 64226 64486 65549 67184 68705 69641 70157 70621 70917 70511 69262 67834 67039 66881 66643
65878 66643 65893 65008 64548 64504 64444 64063 63282 62106 60758 59721 59240 58987 58590 58251 58401 58994 59673 60403 61366
65859 61366 62366 62969 63185 63462 64068 64976 66175 67500 68317 68159 67548 67390 67687 67712 67362 67274 67503 67253 66247
65840 66247 65297 65041 65158 65338 65950 67026 67589 66940 65822 65356 65545 65878 66703 68720 71406 73186 73231 72133
65822 72133 70841 69874 69601 70290 71556 72446 72441 71887 71286 70696 70081 69762 70109 71009 71918 72389 72448 72524 73033 73969
65802 73969 74979 75835 76598 77260 77539 77303 76850 76480 76041 75287 74438 73954 73928 74117 74486 75363 77029 79342
65784 79342 81677 83200 83510 83167 83194 83836 84245 83642 82223 80537 78648 76597 75056 74531 74277 73067 70951
65767 70951 69211 68535 68252 67615 66842 66420 66175 65760 65464 65838 66713 67245 66900 66040 65487 65706 66403 66781 66269
65748 66269 65035 63754 62847 62099 61081 59729 58443 57650 57345 57047 56301 55261 54613 54753 55252 55311 54615
65731 54615 53453 52228 51247 50847 51284 52414 53764 54976 55965 56768 57494 58357 59432 60465 61197 61721 62156
65714 62156 62193 61469 60296 59388 58859 58105 56848 55720 55485 56126 57011 57648 58000 58279 58673 59087 59051 58194 56858
65695 56858 55850 55477 55260 54815 54519 54876 55648 56136 56175 56329 57152 58646 60445 62135 63320 63613 62805 61027
65677 61027 58774 56723 55385 54778 54558 54470 54540 54764 54925 54912 54972 55310 55624 55371 54456 53358 52650 52655 53449 54771
65657 54771 55912 56136 55406 54396 53716 53454 53623 54483 55952 57078 56826 55341 53864 53275 53299 53315 53334 53758
65639 53758 54596 55518 56448 57539 58644 59414 59991 61019 62701 64199 64329 62734 60243 58182 57437 57932
65623 57932 58839 59350 59288 58925 58381 57519 56374 55211 54070 52752 51467 51027 51899 53421 54431 54585 54543
65606 54543 54925 55546 55823 55625 55424 55703 56364 56833 56805 56709 57191 58170 58785 58413 57380 56380 55577 54715 53847
65587 53847 53391 53422 53387 52759 51721 50981 50977 51398 51583 51294 50951 50937 50928 50309 49207 48528 48769 49353 49536 49464 49765
65566 49765 50417 50752 50463 49956 49653 49546 49567 49879 50523 51143 51294 50833 49892 48763 47918 47790 48290 48712 48377
65547 48377 47280 45984 45033 44635 44816 45628 47077 48975 50988 52889 54658 56246 57321 57481 56752 55659
65531 55659 54743 54172 53835 53581 53269 52901 52833 53493 54708 55683 55978 56129 56874 58072 58896 58932 58616 58713 59845
65512 59845 62365 66022 69654 71795 71924 70915 70114 70184 70854 71460 71569 71229 70725 70130 69254 68121 67173
65495 67173 66696 66327 65540 64391 63326 62499 61856 61694 62405 63628 64422 64472 64526 65351 66843 68435 69867 71178
65477 71178 72413 73744 75480 77564 79366 80392 80896 81426 82042 82455 82719 83262 84183 84949 84878 83677 81555
65460 81555 79060 76843 75277 74173 73001 71477 69824 68395 67205 66008 64784 63990 64138 65130 66164
65445 66164 66383 65512 63852 61841 59808 57972 56424 55140 54220 54010 54734 56028 57129 57521 57186 56266
65429 56266 54834 53084 51402 50028 48851 47710 46745 46291 46502 47227 48238 49461 50943 52556 53874
65414 53874 54547 54841 55500 56835 58196 58644 57964 56719 55514 54660 54451 55162 56628 58199 59306 59846 60035
65397 60035 60200 60764 62021 63798 65600 67142 68440 69376 69642 69313 69002 69163 69539 69559 69077 68465 68231 68760
65379 68760 70185 72197 74116 75445 76383 77549 79264 81278 83213 85133 87560 90920 95069 99457 103695
65364 103695 107792 111894 116180 121162 127601 135650 144345 152362 159040 164141 166995 166755 163553 158647
65350 158647 153233 147763 142577 138309 135155 132342 128929 124830 120588 116562 112858 109742 107478 105806
65336 105806 104078 101920 99433 96798 94008 90961 87612 84042 80587 77767 75838 74488 73164 71633
65322 71633 70021 68456 66936 65508 64303 63354 62515 61593 60486 59250 58114 57332 56934 56701 56450 56236
65306 56236 56127 55930 55306 54176 52873 51810 51049 50245 49083 47719 46629 46081 45986 46355 47457 49221 50814
65289 50814 51361 50957 50504 50622 51204 51946 52704 53270 53379 53180 53221 53743 54385 54769 54972 55184 55333 55311 55242 55231
65269 55231 55089 54579 53753 52961 52677 53294 54707 56096 56614 56391 56439 57474 59307 61438 63559 65269 66088
65252 66088 66179 66498 67679 69240 70288 70517 70039 68823 66974 65151 63971 63211 62188 60750 59336 58240
65236 58240 57372 56635 56041 55514 55011 54746 54889 55141 54931 53955 52295 50268 48429 47363 47062 46821 46174 45587
65218 45587 45719 46328 46575 46181 45660 45534 45904 46665 47527 47876 47248 45990 44926 44429 44271 44281 44493 44650 44248
65199 44248 43247 42273 41947 42412 43516 44935 46094 46485 46264 46062 46085 45866 45073 44116 43692 44076 45065 46281
65181 46281 47368 48158 48824 49658 50633 51440 51999 52514 52942 52813 51822 50315 48921 47916 47177 46600 46378 46879
65163 46879 48285 50210 51759 52170 51421 50116 48912 48272 48479 49407 50340 50543 50075 49628 49550 49534 49344 49304
65145 49304 49818 50808 51911 52879 53536 53689 53403 53128 53276 53859 54685 55668 56712 57535 57882 57763 57295 56569
65127 56569 55886 55819 56617 57671 57970 57154 55829 54855 54565 54742 55080 55432 55742 55943 56038 56120 56201 56075 55516 54631
65107 54631 53878 53635 53900 54488 55291 56196 56959 57458 57975 58958 60557 62627 65063 67839 70790 73743 76852
65090 76852 80441 84461 88455 92152 95784 99691 103957 108557 113521 118691 123553 127595 130693 132986
65076 132986 134516 135253 135337 135104 134877 134828 134852 134388 132570 128943 124123 119449 115750 112565 108774 103933 98739
65059 98739 94129 90220 86417 82390 78523 75292 72638 70267 68277 67046 66544 66097 64987 63090 60867
65044 60867 58870 57331 56104 54902 53612 52392 51494 51070 51105 51363 51392 50796 49638 48402 47456 46733 46068
65027 46068 45592 45562 46003 46744 47612 48411 48936 49263 49753 50437 50701 50008 48832 48320 49082 50619 51935 52292
65009 52292 51455 49717 47800 46432 45891 46075 46813 47755 48198 47672 46712 46453 47245 48202 48389 47984 47882 48453
64991 48453 49141 49250 48781 48428 48819 49837 50790 51260 51569 52170 52862 53014 52492 51794 51228 50517 49439 48401
64973 48401 48015 48446 49494 51041 53018 55035 56436 56841 56471 55913 55604 55494 55208 54525 53616 52711 51720
64956 51720 50471 49218 48540 48632 49088 49438 49627 49813 50052 50365 50838 51345 51373 50448 48796 47325 46906 47646
64938 47646 48881 49854 50389 50832 51377 51682 51353 50586 49976 49766 49647 49329 48949 48793 48939 49330 49966 50812 51696
64919 51696 52443 53055 53633 54224 54787 55250 55534 55541 55162 54347 53316 52648 52854 53714 54373 54329 54027 54156 54712 55235
64899 55235 55664 56270 56854 56754 55782 54559 53681 53099 52569 52230 52327 52646 52583 51733 50270 48853 48217 48692 50012
64880 50012 51705 53519 55298 56673 57272 57169 56716 56006 54893 53495 52203 51251 50722 50823 51535 52072 51529
64863 51529 50169 49308 49589 50168 50024 49382 49257 50172 51880 53925 55806 56917 56985 56472 56086 56006 55951 55758
64845 55758 55469 55041 54455 54062 54402 55647 57447 59268 60663 61320 61120 60221 58977 57832 57183 57069 56975
64828 56975 56350 55447 55176 55927 56959 57288 56730 55685 54350 52727 51112 49928 49125 48307 47463 47096 47538
64811 47538 48458 49205 49405 49247 49341 50274 52045 53938 55135 55453 55331 55206 55132 55005 54891 55039 55637 56624 57700
64792 57700 58510 58793 58445 57613 56834 56795 57564 58263 57905 56564 55261 54730 54850 55347 56381 58047 59848 61138
64774 61138 61792 62065 62086 61896 61730 61889 62405 63089 63685 63778 62890 61088 59310 58724 59718 61605 63106 63039 60997
64755 60997 57759 54858 53379 53204 53529 53800 53944 54065 54348 55062 56306 57769 58999 59835 60422 60894 61169
64738 61169 60940 59915 58307 56971 56633 57020 57305 57399 58019 59294 60206 59922 58975 58476 58762 59466 60354 61318
64720 61318 61973 62118 62299 63131 64282 64882 64794 64658 64787 64813 64492 64139 64081 64182 64103 63676 63005 62438 62312 62434
64700 62434 62077 60952 59828 59618 60145 60550 60656 61062 61962 62800 63231 63564 63975 64042 63508 62904 62990 63943 65394
64681 65394 66853 67798 67781 66877 65853 65578 66311 67580 68555 68567 67611 66446 65915 66094 66380 66357 66168 66011 65809
64662 65809 65548 65466 65629 65672 65283 64672 64268 64178 64225 64380 64811 65505 66103 66209 65772 65050 64276 63524 62994 63160
64642 63160 64280 65817 66835 67029 66915 66821 66361 65279 64195 63878 64205 64534 64734 65032 65151 64567 63586 63247
64624 63247 63939 64922 65404 65403 65289 65219 65369 66026 67063 67844 68041 67987 67809 66869 64737 62268 60910 61085 61887
64605 61887 62335 62346 62401 62819 63607 64637 65643 66232 66258 66154 66537 67366 67765 66989 65428 64257 64141 64735 65525
64586 65525 66543 67851 68878 68955 68250 67512 67001 66287 65065 63519 61857 60160 58899 58940 60564 62854
64570 62854 64452 64830 64598 64712 65543 66629 67246 67205 66993 67025 67078 66789 66430 66640 67482 68333 68730 68754 68541 68069
64550 68069 67637 67940 69267 70996 72245 72704 72568 72015 71159 70291 69792 69798 70098 70280 69925 68901 67609 66746
64532 66746 66668 67084 67456 67568 67662 68168 69334 70958 72472 73447 73940 74194 74156 73553 72330 70672 68771 66988
64514 66988 66029 66341 67301 67629 66786 65485 64673 64517 64633 64763 64865 64892 64882 65029 65384 65671 65651 65497 65624 66248
64494 66248 67266 68416 69488 70484 71563 72657 73234 72733 71190 69197 67328 65936 65327 65594 66271 66716
64478 66716 66904 67370 68234 68838 68604 67773 67043 66824 67101 67681 68284 68607 68532 68169 67691 67314 67323 67785 68346 68728
64458 68728 69327 70702 72502 73550 73188 71952 70771 70052 69766 69831 70133 70582 71340 72487 73418 73279 72200
64441 72200 71374 71569 72276 72757 73125 73774 74424 74569 74464 74825 75737 76503 76541 75906 74987 74189 73894 74367 75576
64422 75576 77190 78751 79966 81127 83159 86702 91104 94899 97424 99286 101032 102232 102405 102019 101883
64407 101883 102090 102347 102810 103719 104552 104399 103008 100786 97972 94624 91267 88687 86999 85559 83951 82470
64391 82470 81508 81010 80734 80667 80951 81611 82423 82920 82651 81646 80491 79697 79160 78531 77833 77292 76793 76055 75229
64372 75229 74800 74887 75095 75083 74853 74479 73987 73613 73782 74615 75712 76569 77008 77147 77108 76891 76474 75987 75749 76025
64352 76025 76753 77613 78412 79179 79849 80190 80169 80106 80257 80533 80809 81178 81609 81657 80908 79521 78093 77121 76829
64333 76829 77258 78222 79329 80313 81187 81983 82564 82858 82968 82935 82781 82936 84087 86233 88398 89723 90438 91272
64315 91272 92285 92926 92946 92694 92610 92908 93621 94540 95222 95391 95192 94810 94180 93396 93041 93556 94535 95116 94880
64296 94880 93978 92687 91352 90535 90654 91600 93007 94661 96290 97430 98065 99058 101247 104359 107449 110214
64280 110214 113239 117067 121660 126589 131194 134730 137066 139099 141813 145004 147538 148792 149129 149005 148341
64265 148341 146936 144895 142516 140077 137747 135350 132369 128649 124876 121816 119340 116867 114504 112951
64251 112951 112349 112065 111673 111369 111257 110938 110016 108564 107037 106159 106716 108819 111433 113344 114459 115488
64235 115488 116627 117582 118831 121602 126260 131730 136909 141692 146200 150035 153021 155869 159294 162976
64221 162976 166023 168026 169053 169075 168048 166282 164147 161695 158949 156289 154055 152069 149964 147774 145797
64206 145797 144095 142488 140856 139192 137593 136448 136305 137266 138779 140347 142073 144211 146517 148471 149909
64191 149909 151039 152025 152880 153645 154363 155041 155799 156821 157929 158496 158134 157301 156847 157051 157365 157109 156208 155318
64173 155318 155276 156352 157992 159428 160509 161720 163458 165712 168457 171887 176048 180729 185932 192070 199303
64158 199303 207099 214870 222882 232069 242994 255239 267749 279576 290415 300693 311117 321940
64146 321940 332539 341664 348074 351137 351103 348779 344725 338849 331084 322275 313842 306446 299459 291895
64132 291895 283509 274825 266602 259496 253856 249500 245912 242870 240549 238862 237091 234484 230987 227108
64118 227108 223315 219766 216409 213081 209645 206221 203152 200728 199133 198589 199096 199990 200306 199906 199841 201272
64102 201272 204325 208224 212190 215892 219347 222835 226799 231634 237559 244661 252762 261279 269750 278604
64088 278604 288861 300752 313188 324913 335662 345758 355150 363506 370870 377414 382660 385634 385862
64075 385862 383699 379650 373874 366548 358262 349763 341437 333293 325390 318128 311978 306962 302554 298262
64061 298262 294242 291059 288900 287374 286116 285295 285356 286540 288768 291696 294792 297684 300636 304422 309627
64046 309627 316280 324222 333468 344066 356027 369499 384576 400739 416992 432882 449026 466296
64034 466296 484867 504301 524068 543527 561749 578010 592318 605088 616470 626311 634518 640957
64022 640957 645166 646569 644966 640593 633872 625384 615832 605630 594662 582817 570692 559429 549904
64009 549904 542333 536570 532451 529846 528578 528397 529064 530607 533440 537906 543645 549879 556523 564465 574342
63994 574342 585458 596466 606879 617335 628597 640873 654200 668933 685596 704531 725810
63983 725810 749383 775245 803501 834244 867383 902856 941072 982822 1028474 1077524 1129277
63972 1129277 1183832 1242083 1304829 1372239 1444227 1521140 1604075 1694619 1794358 1904713 2027416
63961 2027416 2165022 2320676 2497445 2698448 2927928 3191828 3497047 3850381 4258405
63952 4258405 4727882 5265493 5876575 6563679 7325713 8158259 9054971 10009023 11013157
63943 11013157 12058201 13131314 14214872 15286041 16317554 17280533 18148498 18899961
63935 18899961 19518450 19991636 20310994 20471277 20468924 20301035 19966873 19471072 18825837 18050594
63925 18050594 17169748 16209680 15195941 14151467 13096184 12047461 11020733 10029983
63917 10029983 9087703 8204147 7386639 6639876 5966483 5366490 4836476 4370482 3962271
63908 3962271 3606211 3296250 3025718 2789026 2582469 2402567 2244687 2104338 1978922
63899 1978922 1866972 1766440 1675043 1591710 1516225 1447665 1384400 1325401 1270316 1218324 1168187
63888 1168187 1119444 1072422 1026931 982018 937225 893126 850429 809438 770594 734580 701507
63877 701507 670657 641324 613358 586877 562126 539677 519985 502598 486486 471220 457162
63866 457162 444509 432998 422628 413673 405770 397907 389715 382013 375695 370761 366736 363325 360270
63853 360270 357315 354785 353612 354334 356491 359339 362651 366526 370919 375663 380470 384717 387765 389684
63839 389684 391040 391699 390585 386956 381245 374199 365869 356061 345213 334160 323351 312819 302629
63826 302629 292903 283622 274749 266305 258156 250113 242450 235836 230450 225637 220701 215530 210166 204445
63812 204445 198549 193319 189354 186172 182845 179112 175396 172095 169467 167877 167439 167539 167307 166508 165526
63797 165526 164570 163437 162038 160684 159705 159066 158458 157649 156739 156060 155720 155278 154219 152766 151794 151712 151849
63780 151849 151204 149513 147307 145233 143585 142181 140501 138286 136162 135145 135244 135147 133760 131558 129871
63765 129871 129250 129194 129187 129272 129631 130153 130485 130234 129287 128143 127655 128105 128872 129356 129765 130474 131148 131320 131460 132492
63745 132492 134341 135895 136570 137026 138078 139654 141273 142898 144795 146995 149495 152722 157224 162910 168978
63730 168978 174732 180289 186420 193790 202381 211655 221192 231030 241290 251596 261076 268892 274634 278338
63716 278338 280335 281007 280443 278291 274178 268229 260996 253011 244677 236469 228747 221290 213515 205405 197854
63701 197854 191701 186675 181765 176549 171709 168097 165651 163548 161214 158837 156875 155450 154458 153983 154226
63686 154226 155028 155899 156689 157946 160340 163865 167890 171899 175910 180206 185047 190847 198298 207842 218960
63671 218960 230311 240804 250428 259783 268863 276589 281630 283400 282142 278321 272263 264286 254878 244706
63657 244706 234593 225321 217168 209697 202277 194865 188065 182459 178159 174952 172561 170720 169308 168531
63643 168531 168674 169568 170544 171073 171253 171590 172483 174026 176100 178522 181261 184491 188273 192238 195986 199790
63627 199790 204552 210853 218400 226570 235214 244736 255646 268209 282290 297382 313073 329623 347840
63614 347840 368235 390598 414493 439640 465511 490939 514640 535786 553678 567156 575044 577273
63602 577273 575184 570650 565107 559330 553738 548712 544640 541585 538872 535281 529921 522761 514010 503270
63588 503270 489827 473828 456678 440071 424786 410526 396644 382831 369314 356643 345407
63577 345407 336005 328455 322237 316384 310056 303264 296936 292123 289174 287761 287495 288325 290407 293886 298835
63562 298835 305264 313124 322338 332876 344825 358417 373940 391514 410965 432071 454886 479607
63550 479607 506090 533617 561141 587511 611493 631989 648455 660936 669575 674417 675959 675682
63538 675682 675658 677524 681789 687917 694907 701824 707833 711779 712008 707091 696730 681590 662218 638654
63524 638654 611225 581168 550058 519046 488931 460451 433936 409039 385429 363575 344358
63513 344358 328050 314200 302349 292286 283685 276118 269523 264117 259784 256027 252603 249677 247213
63500 247213 244825 242557 241253 241607 243159 244780 246044 247631 250404 254562 259812 265991 273242 281732
63486 281732 291387 301799 312307 322345 331927 341678 352156 363103 373575 382696 390042 395310 398035
63473 398035 397941 395274 390557 384184 376498 368028 359233 350114 340467 330508 320942 312451 305386 299814 295399
63458 295399 291271 286584 281408 276687 273129 270492 268135 265866 263932 262503 261463 260661 260136 260203 261376
63443 261376 264006 267958 272835 278519 285152 292644 300690 309399 319441 331295 344769 359507 375599
63430 375599 393363 412873 434029 456783 481003 506384 532814 560548 589814 620572 652879
63419 652879 686900 721972 755960 786149 810584 828243 838380 840682 836191 827361 816712 805581
63407 805581 794209 782722 771739 762033 753644 745392 735391 722113 704860 683436 658054 629868
63395 629868 600959 573057 546440 520584 495698 472903 452970 435580 420083 406376 394624
63384 394624 384543 375522 367397 360665 355842 352971 351956 353026 356422 361659 367649 373876 381098 390536
63370 390536 402657 417104 433550 451947 472125 493802 517088 542352 569542 598202 628200
63359 628200 659700 692157 723954 753197 778239 797415 809352 814190 813704 809590 802256 791926
63347 791926 780134 769158 760344 753704 748655 744262 739041 731458 720691 706537 688985 668510 646350
63334 646350 623600 600241 575797 550694 526200 503213 481886 462243 444300 427650 411738
63323 411738 396624 382881 370852 360631 352477 346434 341718 337431 333793 331679 330998 330609 329948 329627
63309 329627 330075 330667 330695 330318 329950 329404 328245 326460 324294 321906 319595 317827 316579 315126 312957 310455
63293 310455 308305 306648 305299 304354 304059 304348 305038 306263 308233 310719 313177 315338 317366 319488 321703
63278 321703 323782 325441 326609 327667 329290 331917 335402 339211 342859 346146 349149 351990 354556 356550
63264 356550 357970 359317 361013 362866 364463 365875 367438 369035 370255 371296 373022 375939 379628 383372
63250 383372 386868 390224 393713 397669 402154 406629 410525 414257 419102 425779 433716 442020 450656 460318
63236 460318 471626 484883 500217 517488 536242 556136 577223 599621 623134 647459 672537
63225 672537 698427 724980 751789 778301 803912 828215 851243 873232 894177 913955 932938
63214 932938 951976 971576 991405 1010696 1028751 1044944 1058632 1069246 1076121 1078235 1074668 1065443
63202 1065443 1051414 1033153 1010573 983923 954568 924305 894343 865276 837638 811971 788640
63191 788640 767995 750506 736460 725820 718674 715476 716490 721242 728886 738948 751510 766928
63179 766928 785514 807169 831086 856153 881833 908268 935407 962635 989664 1017147 1045736
63168 1045736 1074843 1103040 1129613 1155119 1180326 1204961 1227577 1246369 1260095 1268304 1270828 1267279
63156 1267279 1257319 1241276 1219972 1193928 1163304 1128816 1092061 1054547 1016837 979164 942435
63145 942435 908073 876982 849073 823675 800141 778228 758172 740311 724543 710399 697693
63134 697693 686593 676961 668193 660076 653254 648364 645135 642810 641056 639969 639488 639363 639467 639716 639973
63119 639973 640458 641906 644782 648636 652744 657108 662220 668077 674134 680160 686518 693562 701217 709174
63105 709174 717096 724719 732123 739806 748012 756119 763123 768644 772938 776044 777624 777759 777320 777248 777731
63090 777731 778254 778199 777259 775571 773560 771546 769479 767268 765280 764225 764480 765764 767522 769418 771458
63075 771458 773900 777090 781242 786269 791901 797993 804709 812449 821585 832123 843653 855845 869036
63062 869036 883972 900879 919165 938286 958536 980661 1005041 1031659 1060608 1092154 1126380
63051 1126380 1163114 1202153 1243322 1286502 1331836 1379604 1429493 1480252 1530533 1579930 1628766
63040 1628766 1677052 1724274 1770141 1814987 1859303 1903322 1947209 1991198 2035308 2079212 2122583
63029 2122583 2165358 2207390 2247901 2285367 2317863 2343492 2360618 2367915 2364388 2349520 2323444 2286933
63017 2286933 2241242 2188060 2129454 2067478 2003741 1939576 1876641 1816991 1762450 1714183 1672913
63006 1672913 1639074 1612578 1592937 1579990 1574198 1575973 1585096 1600995 1623186 1651091 1683872 1720864
62994 1720864 1761682 1805517 1850805 1896269 1941962 1988690 2036640 2085171 2133531 2181018 2226621
62983 2226621 2269334 2308810 2344970 2376912 2402854 2421188 2430908 2430941 2419875 2396770 2361713 2315307
62971 2315307 2258149 2191253 2116547 2036419 1952875 1867491 1781944 1698118 1617616 1541349 1469612
62960 1469612 1402398 1339708 1281751 1228944 1181566 1139393 1101723 1067919 1037758 1011120 987476
62949 987476 966062 946650 929619 914975 901750 888911 876509 865183 854797 844483 834033
62938 834033 824244 815590 807437 799023 790402 781921 773475 764878 756391 748266 740332 732544 725334 718805
62924 718805 712288 705351 698573 692508 686598 680083 673376 667380 661971 656369 650686 645791 641784 637936
62910 637936 634113 630968 628506 625721 622043 618018 614184 610355 606599 603912 603114 603724 604582 605081 605304
62895 605304 605448 605688 606192 606738 606593 605146 602381 598546 593789 588423 583084 578237 573850 569789 566193
62880 566193 563213 560741 558651 556988 555661 554317 552703 550845 548742 546370 544166 542970 543163 544212
62866 544212 545307 546117 546696 547127 547508 547814 547510 545869 543085 540512 539269 538983 538467 537261 535835 534610
62850 534610 533581 532920 533126 534227 535313 535285 533937 532065 530640 530116 530431 531299 532253 532622 532007 530955 530737
62833 530737 531991 533773 534441 533414 531570 529936 528583 527065 525371 523982 523256 523150 523443 523876 524100 523751
62817 523751 522684 521061 519219 517460 515877 514352 512818 511441 510407 509615 508851 508374 509025 511496 515506
62802 515506 519874 523501 526309 529179 532956 537672 542884 548528 554990 562402 570488 579304 589485 601341
62788 601341 614279 627668 641846 657563 674859 693338 713403 736285 762771 792625 825468
62777 825468 861614 901741 946209 995035 1048311 1106493 1170370 1240580 1316880 1397993 1482384
62766 1482384 1568770 1655472 1739795 1818917 1891186 1955677 2010646 2053404 2081850 2095321 2093785
62755 2093785 2077168 2045846 2001113 1944778 1878834 1805658 1727823 1647310 1565436 1483640 1403612
62744 1403612 1326363 1251984 1180799 1114060 1052932 997356 946481 899771 857112 818253 782798
62733 782798 750573 721516 695282 671373 649573 630053 613107 598834 586843 576248 566271 556933
62721 556933 548829 542239 536868 532459 529123 526950 525821 525771 527022 529546 533065 537581 543325 550195 557956
62706 557956 567093 578649 592962 609368 627477 647922 671348 697544 726256 758238 794723 836302
62694 836302 882944 934699 991763 1054123 1121676 1194443 1272274 1354629 1440839 1529974 1620004
62683 1620004 1707700 1790009 1865115 1931671 1987551 2030099 2057257 2067883 2061443 2038200 1999512
62672 1999512 1947251 1883036 1808550 1726342 1639603 1551109 1462767 1375969 1291852 1211284 1135001
62661 1135001 1063679 997556 936220 879171 826470 778526 735455 696933 662432 631284 602775
62650 602775 576538 552666 531301 512403 495996 481993 469471 456790 443050 428990 415924
62639 415924 404282 393703 383989 375209 367218 359810 353127 347291 341923 336671 331902 328151 325111 321886
62625 321886 318169 314521 311537 309310 307652 306347 305226 304366 304043 304178 304141 303619 303273 303982 305732 307879
62609 307879 310173 312806 315711 318601 321612 325227 329651 334886 341219 348957 357792 367169 377225 388696
62595 388696 401992 417107 434351 454337 477091 501971 528699 557863 590231 626047 665144
62584 665144 707097 750998 795527 839568 882442 923325 960717 992689 1017605 1034704 1044243 1046935
62572 1046935 1043063 1032350 1014915 991863 964468 933238 898510 861629 824583 788542 753583
62561 753583 719851 688091 658805 631690 606272 582517 560542 540325 522008 505954 492119
62550 492119 479721 467831 455984 444099 432275 420911 410656 401816 394023 386695 379694 373342
62538 373342 367936 363384 359262 355270 351686 349228 348272 348363 348720 349014 349422 350255 351995 355396 360918 368144
62522 368144 376210 384766 393984 403887 414307 425521 438194 452593 468437 485694 505032 527312
62510 527312 553090 582660 616112 653196 693540 737027 783502 832154 881754 931559 981379
62499 981379 1030498 1077056 1118663 1153232 1179164 1195434 1201940 1199302 1188029 1168194 1140204 1105476
62487 1105476 1065932 1023085 977886 931270 884483 838955 795958 756295 720164 687386 657725
62476 657725 630934 606671 584696 565075 547945 533129 520282 509277 500100 492461 485947 480528
62464 480528 476535 474133 473155 473347 474436 476066 478103 480837 484445 488488 492590 497424 504193 513044 522749
62449 522749 532104 540974 549746 558479 566970 575104 582651 589076 593843 596624 597076 594764 589490 581319
62435 581319 570174 555972 539360 521865 504961 489274 474803 461415 448823 436577 424538
62424 424538 413188 403171 394718 387739 382237 378397 376388 376148 377234 378943 380876 383402 387206 392397
62410 392397 398384 404669 411360 418914 427736 437973 449191 460232 469945 478200 485739 492980 499490
62397 499490 504640 508164 509952 509933 508377 505788 502274 497563 491712 485195 478198 470616 462915 456137 450643
62382 450643 445696 440830 436890 435048 435498 437853 442257 449159 458316 468892 480494 493472 508339
62369 508339 525480 545366 568528 595318 626051 661191 700948 744781 791696 840921 892003
62358 892003 944526 998169 1052770 1107731 1161412 1211526 1256076 1293520 1322406 1341586 1350914 1351223
62346 1351223 1343596 1329049 1308788 1284101 1255787 1224134 1189560 1152778 1114227 1074039 1032901
62335 1032901 992383 953865 917620 883479 851975 823907 798890 775339 752173 729782 708855
62324 708855 689079 669808 651509 635474 622174 610875 600996 592908 586949 582476 578547 574975 572009
62311 572009 569403 566548 563349 560241 557352 554165 549999 544445 537443 529371 520966 512793 504918 497389
62297 497389 490710 485341 481018 477165 473787 471378 470080 469601 469823 470933 473041 476211 480670 486322 492330
62282 492330 497970 503749 510790 519200 527976 536529 545232 554355 563568 572903 583162 594764 606976
62269 606976 618963 630982 643935 658255 673846 690795 709639 731171 756269 785594 819205
62258 819205 856783 898316 944112 993948 1046695 1100895 1155123 1207609 1256042 1298055 1331552
62247 1331552 1354747 1366779 1368508 1361885 1348219 1327684 1300571 1267909 1230482 1188345 1142103 1093812
62235 1093812 1045838 999460 955245 914023 876558 842812 812393 785359 761830 741252 722882
62224 722882 706738 693321 682592 673889 666685 660814 656157 652600 650094 648312 646506 644165 641585
62211 641585 639425 638067 637713 638620 640712 643478 646753 651091 656792 663155 669428 675922 683349 691534 699849
62196 699849 708719 719635 733569 750076 768072 786903 806669 828031 851736 877880 905580 933596
62184 933596 960943 986570 1009001 1027112 1041105 1052072 1060716 1067119 1071596 1075056 1078585 1083209 1089956
62171 1089956 1099551 1112072 1127510 1146620 1170573 1199742 1233312 1270049 1308829 1348328 1386803
62160 1386803 1422504 1454055 1480433 1500896 1515085 1523127 1525747 1524285 1520185 1514018 1505218 1493046
62148 1493046 1477582 1459546 1439651 1418652 1397593 1377370 1358266 1340438 1324529 1311139 1299907
62137 1299907 1289864 1280629 1272610 1266073 1260651 1255869 1251701 1248487 1246597 1246170 1246921 1248429 1250847 1254988
62123 1254988 1261348 1269474 1278851 1289983 1303830 1320362 1338421 1356947 1375719 1394955 1414906 1435909
62111 1435909 1458276 1481961 1506714 1532511 1559484 1587495 1616164 1645235 1674634 1704332 1734529
62100 1734529 1765719 1798197 1831747 1866120 1901441 1937788 1974881 2012703 2051889 2092887 2135324
62089 2135324 2178998 2224903 2274294 2327163 2382577 2439968 2498681 2556619 2611068 2661347 2709477
62078 2709477 2757860 2807287 2857502 2908311 2959198 3008585 3054457 3095638 3132299 3165760 3198180
62067 3198180 3231868 3268268 3307673 3349968 3395241 3443438 3493874 3545312 3596281 3645233 3690887
62056 3690887 3732670 3770649 3805045 3836101 3864297 3890138 3913638 3934361 3951941 3966168 3976667
62045 3976667 3983014 3985204 3983731 3979413 3973527 3967654 3962596 3957602 3951366 3943578 3934746 3924848 3913319 3900338
62031 3900338 3886939 3873594 3859723 3844895 3829516 3813900 3797644 3780432 3762725 3745139 3727852
62020 3727852 3711117 3695603 3681702 3669133 3657704 3647844 3639855 3633313 3627818 3623816 3622039 3622608 3625226
62007 3625226 3629833 3636528 3645259 3656149 3669700 3686138 3704891 3725248 3747099 3770394 3794211 3817066
61995 3817066 3837880 3855881 3869639 3877056 3876630 3868371 3853279 3832275 3805861 3774584 3739415 3701555
61983 3701555 3661959 3621220 3579873 3538429 3496897 3454657 3411281 3367343 3323894 3281267 3238980
61972 3238980 3196817 3155247 3114655 3074874 3035806 2997907 2961604 2926699 2892785 2859899 2828363
61961 2828363 2798314 2769796 2743023 2718155 2694991 2673136 2652333 2632414 2613220 2594789 2577419
61950 2577419 2561333 2546595 2533468 2522487 2513833 2506981 2501232 2496373 2492484 2489490 2487309 2486238 2486658
61937 2486658 2488384 2490736 2493351 2496619 2501170 2507165 2514336 2522605 2532326 2543804 2556963 2571917 2589606
61924 2589606 2611192 2636718 2665125 2696070 2731102 2772543 2821767 2879341 2946335 3024481 3115310
61913 3115310 3220205 3341404 3481988 3644714 3831699 4045472 4289600 4568119 4885271
61904 4885271 5246295 5657794 6126664 6658739 7258185 7926731 8661670 9453064 10281078
61895 10281078 11114001 11908232 12612040 13173088 13547231 13705921 13640776 13364217 12905464
61886 12905464 12303518 11600499 10837189 10049921 9268084 8513189 7799883 7137503 6530993
61877 6530993 5981601 5487864 5046407 4652526 4301244 3988402 3710515 3463735 3243842
61868 3243842 3047457 2872431 2716789 2578085 2454177 2343696 2245270 2157107 2077899 2007344
61858 2007344 1945058 1889746 1840217 1796642 1759859 1729797 1705275 1685002 1668052 1653647 1641282
61847 1641282 1631009 1622968 1616668 1611128 1605665 1600153 1594710 1589458 1584494 1579746 1575005 1570323 1566205 1563236
61833 1563236 1561681 1561530 1562625 1564675 1567562 1571664 1577394 1584341 1591339 1597445 1602215 1605097 1605472 1603581
61819 1603581 1600560 1597177 1593391 1589489 1586696 1586020 1587394 1590617 1596289 1604960 1616191 1629461 1645442
61806 1645442 1665396 1689725 1717994 1750020 1786078 1826386 1871213 1921172 1976698 2037587 2103819
61795 2103819 2176399 2256460 2343897 2437872 2538512 2647212 2765504 2894620 3036181 3192363
61785 3192363 3365204 3556496 3768505 4004283 4267340 4561747 4892648 5266083 5688220
61776 5688220 6165301 6704396 7313773 8002579 8780713 9658812 10647227 11753741 12980786
61767 12980786 14322281 15759513 17256620 18757574 20186603 21453659 22465924 23143672
61759 23143672 23435191 23325029 22833788 22011624 20928190 19661166 18285902 16868503 15462677
61750 15462677 14108832 12834449 11655610 10579314 9605916 8731495 7949970 7254204 6636065
61741 6636065 6086788 5598288 5164042 4778357 4435357 4129384 3855947 3611548 3392920
61732 3392920 3197207 3022530 2867333 2729252 2605441 2493960 2393911 2304180 2222959 2148681
61722 2148681 2080579 2018014 1959976 1905634 1854851 1807743 1764102 1723447 1685338 1649478 1615833
61711 1615833 1584741 1556455 1530473 1505630 1481121 1457169 1434616 1413992 1394984 1376613 1357985
61700 1357985 1339071 1320594 1302959 1285550 1267379 1248195 1228583 1209233 1190588 1172997 1156621
61689 1156621 1141230 1126462 1112239 1098611 1085450 1072719 1060801 1050046 1040221 1030948 1022471 1015339
61677 1015339 1009477 1004232 999349 995262 992308 990183 988286 986272 984189 982375 981127 980173 978622 975833
61663 975833 972150 968395 964835 961102 956906 952284 947287 941971 936617 931532 926758 922291 918321 914824
61649 914824 911240 907140 902914 899241 896229 893722 891985 891221 890733 889586 888001 887179 887789 889528 892128
61634 892128 895802 900592 906202 912717 920630 929947 939995 950285 960729 970865 979769 987097 993348
61621 993348 998650 1002070 1002723 1000965 997949 994469 990680 986577 982201 977585 972801 967797 962081 954908
61607 954908 946005 935801 924892 913684 902596 892061 882091 872332 862748 853730 845355 837131 828783
61594 828783 820799 813785 807709 802209 797369 793806 792132 792533 794664 797826 801555 806183 812488 820671
61580 820671 830054 840011 850822 863280 877766 894029 911717 930804 951572 974357 999298 1026204
61568 1026204 1054704 1084451 1115145 1146482 1178285 1210594 1243371 1276143 1308118 1338612 1367276
61557 1367276 1394080 1419277 1443218 1466008 1487508 1507724 1526792 1544449 1560035 1573323 1584659
61546 1584659 1593781 1599259 1599932 1596331 1589796 1580640 1568286 1552837 1535288 1516271 1495817 1474492 1453602
61533 1453602 1433979 1415556 1398417 1383263 1370463 1359578 1350353 1343393 1339382 1338336 1340082 1344845
61521 1344845 1352916 1364455 1379979 1400411 1426162 1456895 1492719 1534908 1584738 1642260 1707116
61510 1707116 1780212 1863674 1959209 2067268 2187929 2322105 2471749 2639282 2826911 3036067
61500 3036067 3266888 3517870 3785788 4065740 4350950 4632223 4897823 5134801 5331458
61491 5331458 5479197 5572801 5610276 5593263 5526973 5418576 5275390 5104815 4915132 4714979
61481 4714979 4511731 4310969 4117271 3934488 3765081 3610070 3469922 3345032 3235472
61472 3235472 3141129 3062189 2998757 2949980 2914349 2890876 2879184 2878511 2887708 2906329 2934555 2971694
61460 2971694 3015715 3064624 3117313 3172655 3228854 3284315 3338373 3390641 3440476 3487581 3532339
61449 3532339 3574998 3615429 3654262 3693347 3734319 3777336 3821943 3868396 3917301 3968491 4020996
61438 4020996 4073702 4125370 4174492 4219794 4260562 4296066 4325261 4347505 4362794 4370627 4369406 4357873
61426 4357873 4336659 4307636 4272254 4231314 4185816 4137007 4085867 4033498 3981839 3933144 3888879
61415 3888879 3849788 3816739 3790590 3771337 3758229 3750698 3748443 3750645 3755881 3762961 3771200 3779735 3787116
61402 3787116 3791731 3792229 3787515 3777008 3761215 3741656 3720001 3697531 3675608 3656361 3642579 3636947
61390 3636947 3641495 3657735 3687157 3731453 3792301 3871150 3969417 4088697 4230427 4395348 4583597
61379 4583597 4795272 5030476 5288606 5567663 5863876 6171229 6481033 6782313 7062915
61370 7062915 7310545 7513788 7663814 7756123 7790677 7770413 7699943 7585152 7432516 7247800
61360 7247800 7035609 6800399 6547380 6282139 6009962 5735811 5464347 5199383 4943608
61351 4943608 4699107 4467778 4251025 4049536 3863577 3693091 3537384 3395411 3266801
61342 3266801 3152138 3051950 2965907 2893191 2833061 2784754 2747496 2720995 2705461 2700775 2706054
61331 2706054 2720166 2742166 2771123 2806206 2847004 2893006 2942673 2993929 3045758 3098253 3150816
61320 3150816 3201488 3248649 3292272 3332862 3370192 3403942 3434593 3462703 3488072 3510537 3530866
61309 3530866 3549952 3567705 3583528 3597180 3608273 3615633 3618123 3615536 3607725 3593438 3571158 3540752
61297 3540752 3503477 3460660 3413164 3361566 3305970 3246126 3182638 3117668 3053601 2991477 2931519
61286 2931519 2874531 2821685 2773486 2730107 2692352 2661083 2635983 2616008 2600832 2590681 2584906
61275 2584906 2581869 2580223 2579256 2577998 2575088 2569673 2561644 2551033 2538070 2523800 2509741 2496802 2485274
61262 2485274 2475844 2469765 2467923 2470475 2477451 2489119 2505866 2528419 2558152 2596552 2644539 2702900
61250 2702900 2772962 2855940 2951865 3059976 3179722 3310097 3447995 3588324 3725638 3854364
61240 3854364 3967316 4055557 4110790 4127689 4104119 4040571 3940342 3809632 3656461 3489157
61230 3489157 3315476 3142074 2973932 2814269 2665037 2527311 2401271 2286461 2182352
61221 2182352 2088467 2004037 1928006 1859535 1798257 1744104 1697130 1657236 1623694 1595158 1570578
61210 1570578 1549834 1533037 1519672 1509191 1502086 1499425 1501385 1507084 1515735 1527112 1540740 1555598
61198 1555598 1570955 1586914 1603832 1621648 1639808 1657284 1672569 1684283 1692064 1696514 1698207 1697129
61186 1697129 1693077 1686082 1676443 1664773 1652031 1638976 1625528 1611086 1595433 1578912 1561757 1543821
61174 1543821 1524991 1505410 1485184 1464286 1442771 1420726 1398038 1374503 1350129 1324946 1298646
61163 1298646 1270800 1241425 1211014 1180117 1149195 1118734 1089156 1060695 1033587 1008219 984907
61152 984907 963805 945160 929169 915256 901981 888069 873140 857203 840115 822058 803863
61141 803863 786195 768927 751992 736371 723543 714297 708517 705570 704410 704004 704360 706481 710672
61128 710672 715679 720352 725248 731577 739260 747250 755144 763290 771785 780530 789853 799938 810110 819909
61114 819909 830418 843213 858313 874375 890548 906866 923177 939107 954866 970717 985755
61103 985755 998508 1008561 1016259 1021062 1021755 1018377 1012447 1005060 996016 985051 972688 959668 946556
61090 946556 934077 922813 912448 902182 891783 881383 870639 859266 848072 838088 828972 819668
61078 819668 810406 802511 796398 791351 787128 784077 781680 778838 775764 773796 773032 771917 769488 766258
61064 766258 762459 757317 750763 744108 738164 732242 725826 719691 714426 709236 703213 696653 690233 684005
61050 684005 678060 673090 669479 666790 664873 664457 665975 668838 672578 677731 684850 693490 702834 712463
61036 712463 722015 731005 739541 748399 757927 767631 777090 786351 795232 803378 811217 819682 828688 837150
61022 837150 844802 852673 861398 870434 879452 889136 900011 911730 924053 937370 951837 967182 983718
61009 983718 1002203 1022398 1043164 1064319 1086935 1111539 1137696 1165716 1197050 1232489 1271675
60998 1271675 1314822 1363126 1416941 1475245 1537321 1603099 1671701 1742004 1815241 1894794 1982928
60987 1982928 2080218 2188417 2310581 2447184 2595349 2753513 2924206 3111474 3319542 3556124
60977 3556124 3833367 4163096 4554590 5019412 5574836 6241125 7042298 8015279 9214674
60968 9214674 10705814 12559636 14850204 17616758 20768518 24002594 26855565 28908706
60960 28908706 30000882 30275559 30050668 29661538 29396652 29484223 30023696 30875281 31648319
60951 31648319 31871207 31235974 29723837 27539360 24957290 22219373 19512639 16975035
60943 16975035 14691747 12695013 10980952 9529450 8312560 7297221 6450901 5745914
60935 5745914 5157615 4662287 4239730 3875622 3559158 3280393 3031529 2808318 2607928
60926 2607928 2426886 2262461 2114133 1981904 1864494 1760376 1668887 1588752 1516855 1449797
60916 1449797 1385699 1323670 1263056 1204298 1149039 1098116 1050637 1006023 965495 930296 899684
60905 899684 872014 846759 824157 803871 785328 768701 754400 742139 731453 722549 715808 710977
60893 710977 707596 705605 704932 705180 706337 709093 713899 720339 727896 736430 745342 753216 759079 763285 766487
60878 766487 768537 769125 768732 768036 766842 764348 760154 754463 747702 740408 733048 725484 717005 707213 696576
60863 696576 685988 676231 667904 661164 655405 649851 644576 640237 636830 633694 630844 629252 629500 631127
60849 631127 633625 637095 641569 646824 653363 662544 674963 689508 704596 719627 734672 749588 764219
60836 764219 778925 794179 809966 825847 841124 854710 865501 873321 879017 883499 887268 890861
60824 890861 894801 898906 902558 905870 909557 913369 915869 916309 915634 914909 913720 910955 906351 900339 892993
60809 892993 883985 873276 861174 848027 834241 820236 806074 791582 777062 763319 750748 739014
60797 739014 727819 717280 707335 697653 688517 680915 675318 671181 668025 666186 666068 667508 670378 674910
60783 674910 680828 687025 692870 699174 707245 717544 729729 743285 757524 771673 785624 800080
60771 800080 815442 831172 846660 861864 876511 889516 900064 908655 916315 923245 928969 933324
60759 933324 936659 939422 942121 945276 948880 952320 955265 958124 961198 963980 965858 967003 968014 969199
60745 969199 970668 972587 974765 976404 976799 975904 973840 970392 965409 959197 952053 943843 934452 924168
60731 924168 913309 901980 890504 879491 869128 859011 849007 839675 831544 824631 818956 814786
60719 814786 812076 810384 809594 809925 811049 812235 813518 815485 817492 817540 814651 810059 805162 799719 793223
60704 793223 786783 782077 779169 776803 774317 772091 770630 770417 772137 775810 780057 783348 785621 787653
60690 787653 789351 789818 788712 786262 782232 776099 768133 759162 749295 738017 725509 712876 700925
60677 700925 689567 678458 667451 656451 645654 635922 628120 622064 616866 612308 609111 607813 608051
60664 608051 609003 609989 610633 611079 611930 613422 614754 614869 613753 612312 611125 610073 609105 608569 608641 609161 610194
60647 610194 612232 615626 620191 625443 630841 635810 639902 642994 645124 646333 646969 647859 649787 652920 657074
60632 657074 662194 668218 674862 682134 690757 701497 714279 728496 743860 760271 777135 793624
60620 793624 809665 825952 842830 859688 875571 890031 903167 915097 925482 933555 938755 941335
60608 941335 942039 941182 938538 934202 928926 923310 917310 910942 904732 898914 892806 885691 877774 869605 861046
60593 861046 851602 841411 831235 821865 814109 808787 805862 804014 801916 799649 798105 797383 796667 795334
60579 795334 793299 790506 787040 783531 780525 777588 773921 769776 766423 764733 764608 765668 767694 770357
60565 770357 773344 776756 780793 785166 789535 794204 799493 804675 808543 810936 812539 813316 812427 809941 807323
60550 807323 805758 805105 805102 806455 809826 814631 819928 826067 834478 846006 860338 877119 896970 921179
60536 921179 950810 986390 1028145 1076035 1129199 1185326 1240751 1291361 1333480 1364143 1381149
60525 1381149 1383432 1371428 1346890 1312537 1271990 1229512 1188959 1152767 1122116 1097860 1080768
60514 1080768 1070912 1067423 1069138 1075216 1084947 1097194 1110312 1122679 1133380 1142454 1150518 1158290 1166598
60501 1166598 1176658 1189811 1206888 1228262 1254666 1287531 1328356 1378328 1438866 1511950 1599305
60490 1599305 1701546 1818535 1950288 2097173 2259649 2438526 2635539 2853516 3096300
60481 3096300 3368531 3674375 4014503 4382489 4762734 5131098 5458378 5715724 5879822
60472 5879822 5935619 5877092 5708285 5444450 5110070 4732875 4337770 3944474 3567833 3217860
60462 3217860 2899560 2614222 2361439 2139876 1947058 1779805 1635123 1510279 1402463
60453 1402463 1309200 1228811 1159729 1099584 1045737 996591 951862 911871 877035 847537 822652
60442 822652 800685 780213 761015 743303 726688 710688 695579 681752 668801 656271 644805
60431 644805 635400 627933 621560 616181 612232 609322 606434 603439 601182 600020 599416 599003 598975 599396 600203 601877
60415 601877 604950 608711 611550 612845 613527 614578 615968 617278 618329 618925 618936 618974 620192 623080 627162 631968
60399 631968 637474 643448 649260 654636 659919 665486 671589 678685 686965 695514 702904 708702 713412 716956
60385 716956 718459 717833 716293 714792 712981 710310 707185 704379 702075 700093 698393 696826 695019 692986
60371 692986 691324 690408 689975 689718 689656 689705 689614 689635 690412 691846 692938 693239 693638 695125 697543 700135 702659 705280
60353 705280 707964 710778 714336 719219 725161 731390 737631 744303 751861 760335 769439 778886 788641 798857
60339 798857 809409 819554 828403 835723 841932 847451 852505 857434 862576 867868 873196 879089 886488 895832
60325 895832 907076 920549 936866 955707 975333 993569 1008743 1019711 1025761 1026751 1022756 1013561
60313 1013561 999241 981288 962216 943707 925902 908661 892662 878843 867494 858286 850564 843349
60301 843349 835820 828169 821440 816263 812371 809478 807821 807546 808408 810385 813719 817962 821817 824468 826379
60286 826379 828301 830291 832201 834393 837194 840140 842400 843669 844305 845030 846784 850318 855539 861701 868451
60271 868451 876094 884658 893532 902484 912319 924038 937943 953988 972353 993114 1015957 1040747
60259 1040747 1067869 1097550 1129515 1163833 1201636 1244303 1292288 1345247 1402988 1465879 1534658
60248 1534658 1610177 1693014 1783030 1879700 1983008 2093444 2210897 2334136 2461603 2591972
60238 2591972 2723435 2853137 2977908 3095160 3202811 3298981 3382312 3452050 3507248 3546401
60228 3546401 3568443 3573808 3564050 3540760 3505289 3459245 3404930 3345471 3284588 3225764 3171379 3123029
60216 3123029 3082629 3052457 3033916 3027093 3031967 3049434 3080720 3126455 3186837 3262126 3352297 3456410
60204 3456410 3572613 3698477 3831161 3967709 4105316 4240847 4370089 4488329 4591994
60195 4591994 4679178 4748455 4798074 4826650 4833791 4819552 4784040 4728187 4654400 4566038 4466724
60184 4466724 4360350 4250976 4142161 4036808 3937832 3848308 3770727 3706856 3658513 3627642
60174 3627642 3615309 3621474 3645982 3688741 3748476 3822254 3906684 3998584 4094042 4188135 4276501
60163 4276501 4356466 4426114 4483377 4526851 4556452 4572234 4573377 4559359 4531505 4492512 4445161
60152 4445161 4392319 4337430 4283920 4234586 4192339 4160907 4143820 4143136 4159916 4195429 4251193 4328412
60140 4328412 4428077 4550989 4697032 4865338 5056146 5271812 5515014 5786578 6085806 6412011
60130 6412011 6764270 7140096 7535406 7945332 8364058 8784412 9198810 9600328 9981891
60121 9981891 10335024 10650870 10922430 11144934 11314398 11427175 11480937 11474930 11409006 11283310
60111 11283310 11099312 10860825 10574207 10248183 9893199 9520061 9138851 8759113 8390304
60102 8390304 8041200 7718923 7428910 7175283 6960614 6785760 6650719 6555539 6500112 6483796
60092 6483796 6505803 6565173 6659372 6783297 6930272 7093429 7265464 7438013 7602517 7751400
60082 7751400 7877720 7974710 8037272 8063790 8055477 8014263 7942235 7842293 7717684 7570876 7404048
60071 7404048 7220554 7024569 6819382 6607317 6391540 6176701 5967416 5766971 5577774
60062 5577774 5402193 5242502 5100481 4977266 4873323 4788770 4724161 4680745 4659459 4660083 4681966
60051 4681966 4725073 4789525 4874457 4978051 5098145 5231794 5374597 5521436 5667614 5808429
60041 5808429 5938308 6051704 6144784 6215177 6260438 6278119 6267326 6228875 6163821 6073029 5958481
60030 5958481 5823934 5673994 5513444 5347550 5181862 5020984 4867941 4724804 4593336
60021 4593336 4474983 4371006 4282733 4211219 4156732 4119297 4099624 4098842 4117517 4155752 4214156
60010 4214156 4293867 4395633 4519534 4665262 4831628 5015768 5213626 5420949 5632737 5842002
60000 5842002 6040581 6221663 6380745 6514189 6618247 6690036 6728369 6732913 6703246 6639484
59990 6639484 6543486 6419106 6271673 6107477 5933201 5755189 5579052 5409681 5251170 5106636
59980 5106636 4978371 4868150 4777189 4706062 4655007 4624162 4613379 4622297 4650899 4699358 4766841
59969 4766841 4851072 4949517 5060091 5179937 5304522 5429136 5550670 5666855 5774559 5870401
59959 5870401 5952652 6021088 6075223 6114193 6138285 6149125 6148322 6137304 6118758 6096988 6076625 6061927
59947 6061927 6057373 6067730 6097254 6149668 6228834 6338442 6481079 6658732 6874114 7130329
59937 7130329 7429145 7770650 8154428 8579402 9041858 9534288 10045930 10563076 11068646
59928 11068646 11542804 11964751 12314041 12571741 12723344 12762100 12689240 12511366 12239005 11887231
59918 11887231 11474909 11021438 10544413 10059953 9582915 9125192 8694541 8295915 7933224
59909 7933224 7609429 7326129 7084037 6883362 6723380 6602600 6520030 6475731 6469978 6502656
59899 6502656 6573444 6681266 6823175 6994819 7192200 7411423 7646155 7886610 8121615 8340209
59889 8340209 8530572 8679479 8775023 8809745 8780528 8686737 8530134 8316168 8053731 7753235
59879 7753235 7425130 7079564 6726182 6373810 6030385 5702609 5395108 5110177 4848765
59870 4848765 4611592 4399215 4211591 4047992 3907069 3786937 3685713 3602021 3534360 3479919
59860 3479919 3434770 3395426 3359478 3324651 3288325 3248509 3204821 3158394 3111445 3066738 3026275
59849 3026275 2990263 2958349 2931932 2913920 2905781 2905983 2911594 2919888 2927650 2930526 2924640 2908417 2882153
59836 2882153 2846644 2803064 2753376 2699885 2644749 2590356 2539342 2493500 2453351 2419332 2392598
59825 2392598 2373987 2363030 2358808 2361140 2370284 2386318 2409690 2441687 2483432 2534840 2595129 2663626
59813 2663626 2739165 2819268 2900859 2981586 3059942 3134658 3204613 3268866 3326076 3374256 3411593
59802 3411593 3437057 3449962 3449943 3438234 3418392 3394902 3371303 3350052 3333413 3323599 3322446 3331751
59790 3331751 3353625 3390004 3442167 3511241 3598803 3706652 3836631 3991294 4174339 4389920
59780 4389920 4642015 4934712 5272038 5656129 6084811 6549766 7034692 7513582 7951809
59771 7951809 8311941 8562110 8682827 8670190 8535351 8300592 7993475 7641818 7270870 6901596
59761 6901596 6549304 6223690 5930443 5672535 5450257 5261748 5104805 4977927 4879399 4806459
59751 4806459 4756194 4726631 4716370 4724072 4749086 4791730 4852000 4928692 5020677 5128402 5253211
59740 5253211 5395879 5556879 5737617 5940274 6166624 6417997 6696246 7004032 7344248
59731 7344248 7719764 8133517 8588140 9085418 9626294 10210797 10837185 11500981 12194707
59722 12194707 12907981 13627627 14338570 15025696 15675635 16278133 16827957 17326929 17783774
59713 17783774 18211406 18624471 19038899 19471526 19937906 20449709 21013759 21632083 22301525
59704 22301525 23013169 23752233 24498072 25224570 25902407 26502938 27001113 27376735 27616290
59695 27616290 27715867 27682168 27530051 27279439 26954118 26580741 26186184 25795117 25429752 25110133
59685 25110133 24853080 24671426 24575397 24574359 24676712 24889233 25217974 25669359 26249274 26961136
59675 26961136 27804849 28775981 29863734 31048642 32301168 33580303 34832095 35991165
59667 35991165 36987066 37752748 38231745 38384348 38193562 37668282 36841044 35762121 34493153
59658 34493153 33100636 31648952 30195230 28787605 27464372 26251622 25161224 24191370
59650 24191370 23327723 22543277 21800103 21056710 20278242 19443360 18546030 17594383 16607370
59641 16607370 15608983 14622511 13667871 12761009 11912898 11128949 10410651 9757663 9167710
59632 9167710 8635920 8156539 7725333 7339249 6994510 6686748 6412593 6169439 5953959
59623 5953959 5762632 5593625 5446469 5319854 5211237 5118578 5040761 4976056 4921551 4874388
59613 4874388 4832235 4792258 4750925 4705294 4653604 4594398 4526113 4447871 4360058 4264011 4161701
59602 4161701 4055492 3947392 3838670 3730846 3626551 3528487 3437903 3354956 3280036 3213683
59592 3213683 3155789 3106130 3065219 3033315 3009149 2991153 2979587 2975843 2979811 2989557 3003568 3021679
59580 3021679 3043556 3067844 3093167 3118767 3143821 3167417 3189639 3211687 3234620 3258851 3285042
59569 3285042 3314498 3348477 3387928 3434011 3487936 3550181 3620678 3699829 3788615 3887852 3998270
59558 3998270 4121246 4258542 4411338 4580366 4766850 4972397 5197991 5443866 5710117
59549 5710117 5996509 6301740 6623543 6959149 7304913 7656102 8008014 8356880 8698876
59540 8698876 9029191 9343536 9640194 9919528 10182093 10428286 10658574 10872123 11066012
59531 11066012 11238210 11391426 11532390 11667569 11801186 11936607 12076687 12221727 12368431
59522 12368431 12510881 12640769 12746681 12815521 12835882 12799395 12699502 12531398 12294138 11991315
59512 11991315 11629233 11215838 10761482 10278527 9778910 9272942 8770362 8280398 7809785
59503 7809785 7362140 6940067 6546600 6184021 5852815 5552712 5283519 5044165 4832180
59494 4832180 4645114 4481578 4340299 4219191 4116055 4029432 3958364 3902273 3861363 3836098
59484 3836098 3825944 3829650 3846968 3878887 3925954 3987824 4064875 4158843 4271211 4402260 4552352
59473 4552352 4722966 4915637 5130793 5368116 5626942 5905614 6201078 6509246 6824642
59464 6824642 7139329 7443189 7725578 7975949 8183325 8337218 8430073 8458049 8419696 8315665
59454 8315665 8150301 7931879 7670335 7375482 7057219 6725384 6388390 6053010 5725707
59445 5725707 5412543 5117110 4840103 4581664 4342802 4124075 3924616 3743361 3579813
59436 3579813 3432828 3300249 3180722 3074500 2981535 2900207 2828926 2767647 2716684 2675221
59426 2675221 2642027 2616531 2598317 2586601 2580987 2581602 2587737 2597643 2610382 2626579 2646614 2669591
59414 2669591 2695016 2724076 2758305 2798335 2844588 2897102 2953276 3007626 3055828 3098259 3138613
59403 3138613 3180625 3227543 3282986 3350079 3430581 3526508 3641307 3777130 3931633 4099726
59393 4099726 4278698 4470481 4679781 4911965 5172616 5467189 5800322 6175956 6597570
59384 6597570 7067106 7583696 8144057 8743220 9373481 10022966 10676607 11318823 11935074
59375 11935074 12512239 13039782 13511328 13924664 14280441 14581456 14832495 15039224 15206340
59366 15206340 15336425 15429656 15483819 15494899 15458440 15370318 15226511 15023600 14761039 14443143
59356 14443143 14078886 13680608 13263103 12842192 12432141 12043751 11684463 11358647 11066400
59347 11066400 10802577 10558118 10322592 10085879 9839143 9575837 9291989 8985561 8656660
59338 8656660 8308825 7948873 7584303 7221245 6865025 6521097 6194127 5887007 5601686
59329 5601686 5340095 5103221 4890183 4699331 4529670 4380488 4250551 4138634 4044004 3965465
59319 3965465 3900820 3848267 3807474 3778424 3760251 3752207 3754605 3767603 3790097 3821152 3861603 3912836
59307 3912836 3974776 4046359 4127032 4216200 4311877 4411528 4513793 4617911 4721691 4821448 4913804
59296 4913804 4996513 5067948 5126973 5173223 5206691 5227470 5236688 5237087 5231833 5223342 5214091 5207615 5207509
59283 5207509 5216180 5235638 5268609 5317580 5383479 5466524 5567392 5685923 5819323 5963296 6114423
59272 6114423 6269741 6424315 6571014 6702840 6814372 6901370 6960836 6991894 6995512 6972985
59262 6972985 6925317 6854015 6761768 6652662 6532511 6408568 6287945 6176231 6077785 5996272
59252 5996272 5933746 5889825 5862803 5851018 5852331 5863296 5880413 5901878 5926989 5954410 5982413
59241 5982413 6010552 6040059 6072983 6112020 6160754 6222958 6302008 6401816 6527638 6684778 6876901
59230 6876901 7106405 7375475 7685197 8033784 8416210 8824298 9245699 9663709 10059925
59221 10059925 10417046 10718637 10948086 11090571 11136305 11080900 10923767 10668442 10324284 9905796
59211 9905796 9429887 8914487 8378324 7838950 7309902 6800569 6318307 5868915 5455241
59202 5455241 5077315 4734341 4425404 4148577 3901181 3681282 3487538 3317406 3166974
59193 3166974 3032948 2913675 2808016 2714303 2630570 2554888 2485480 2421392 2362771 2309578 2260492
59182 2260492 2214228 2171340 2133214 2099766 2069771 2043155 2021125 2003994 1990607 1980221 1973489
59171 1973489 1971355 1974228 1982308 1995396 2012298 2031807 2054393 2081596 2113674 2149238 2187340 2228591
59159 2228591 2273938 2323604 2377581 2436076 2499188 2567036 2640288 2719705 2805206 2896283 2993008
59148 2993008 3095571 3203102 3314102 3427722 3543251 3658681 3771101 3878271 3978359
59139 3978359 4068520 4145510 4207860 4255979 4290148 4310045 4316435 4311784 4298971 4280660 4259953 4240141
59127 4240141 4223472 4211366 4206035 4210643 4227937 4260011 4309394 4378863 4469980 4583138 4719084
59116 4719084 4878989 5063003 5270229 5500096 5752010 6023147 6307855 6599265 6889735
59107 6889735 7169255 7425080 7644025 7814807 7928767 7980603 7969790 7900810 7781790 7623430
59097 7623430 7438377 7239315 7036379 6836548 6644853 6464514 6295851 6136742 5984666
59088 5984666 5837324 5691554 5543511 5390556 5231919 5067357 4896551 4720049 4539480
59079 4539480 4356536 4172819 3990624 3812370 3639039 3470526 3307671 3152491 3006213
59070 3006213 2868541 2739188 2618646 2507056 2403661 2307816 2219422 2138144 2063368 1995094
59060 1995094 1933626 1878324 1827895 1781929 1740812 1704082 1670300 1638485 1608251 1578580 1548189
59049 1548189 1517217 1486914 1457488 1427920 1398091 1369429 1343137 1319406 1298554 1281198 1266944
59038 1266944 1254655 1244359 1237300 1233735 1232443 1232765 1235337 1240377 1247029 1255032 1265391 1278750 1294666
59025 1294666 1312863 1333449 1355168 1375119 1391096 1402977 1411374 1416410 1418392 1418195 1416409 1413389 1410447
59012 1410447 1409453 1410926 1414068 1418912 1426721 1437954 1451667 1467296 1485058 1504016 1521748 1536746
59000 1536746 1549429 1560122 1567858 1571963 1573100 1571926 1568315 1562677 1556519 1551034 1546480 1543268 1541965
58987 1541965 1541988 1542217 1543217 1546819 1553131 1560378 1568192 1578485 1592070 1607012 1621605 1636677 1653501
58974 1653501 1671634 1690373 1710497 1733020 1757897 1785219 1815982 1850392 1887105 1925230 1965233
58963 1965233 2006831 2048155 2088321 2128734 2170342 2211737 2251590 2290954 2331348 2372526 2414079
58952 2414079 2457554 2505081 2557489 2615526 2681111 2755317 2836665 2923523 3016841 3118588 3228989
58941 3228989 3347564 3475712 3615935 3769325 3935803 4116121 4311795 4523815 4753244
58932 4753244 5002461 5274275 5570526 5892989 6244878 6630029 7051483 7512263 8016584
58923 8016584 8568699 9171241 9825847 10534157 11296452 12109743 12968134 13863569 14784115
58914 14784115 15711676 16622284 17487955 18277798 18959686 19504019 19887266 20093016 20112716
58905 20112716 19947813 19610466 19120456 18501455 17779932 16984518 16142996 15279340 14413683
58896 14413683 13563089 12740445 11953751 11208222 10508376 9857149 9254692 8699931 8192327
58887 8192327 7730656 7311377 6930036 6583469 6269219 5983943 5723986 5486497 5268554
58878 5268554 5066324 4876688 4698772 4532566 4377200 4231816 4096693 3971971 3856649
58869 3856649 3750336 3654427 3569703 3494172 3425109 3361873 3304900 3253436 3206448 3164566 3128868
58858 3128868 3098691 3072591 3050518 3033178 3020373 3011949 3009261 3013623 3024330 3040267 3062379 3092395
58846 3092395 3130141 3174397 3225527 3284891 3352302 3426288 3506468 3593758 3688828 3792205 3905270
58835 3905270 4029358 4164616 4311444 4472031 4648547 4840894 5048403 5272840 5517580
58826 5517580 5784699 6075224 6391606 6737725 7117033 7532788 7989440 8491586 9041972
58817 9041972 9642291 10294902 11001295 11759237 12563142 13405905 14277370 15161006 16034096
58808 16034096 16870702 17642623 18319003 18869072 19267144 19495014 19541864 19405575 19094590
58799 19094590 18626352 18023459 17311979 16521130 15680175 14814033 13942679 13083531 12251519
58790 12251519 11456771 10704612 9998162 9339265 8727404 8160325 7636189 7153615 6710019
58781 6710019 6302038 5927499 5585082 5272217 4985340 4722105 4481416 4261312 4058580
58772 4058580 3870437 3695017 3530531 3375629 3230279 3094710 2967989 2849136 2738794
58763 2738794 2637896 2545462 2459681 2380399 2308489 2243551 2184429 2131255 2084731 2044025 2007644
58752 2007644 1975599 1948363 1924477 1901784 1880342 1861483 1844583 1827569 1810183 1793974 1779295
58741 1779295 1765044 1751057 1738010 1725123 1710699 1694880 1679185 1663478 1646191 1627419 1608910
58730 1608910 1590895 1571807 1551338 1530924 1510825 1489470 1466148 1441771 1416533 1389380 1360353
58719 1360353 1331060 1302330 1273626 1245137 1218171 1193131 1169310 1147002 1127594 1111313 1097026
58708 1097026 1084365 1073773 1064343 1054124 1042822 1031983 1022333 1013244 1004857 998232 993114 987969 982456
58695 982456 977565 973245 968384 963241 959418 957179 955208 952990 950789 947274 940017 928749 915533 901583
58681 901583 886617 871452 858110 846828 835804 824567 814856 807663 802125 797919 795924 795744 795316
58668 795316 793782 792334 791630 790998 790750 792605 797022 802529 808234 814423 820276 823737 824379 823896 823289 822221
58652 822221 821513 823323 828188 834671 842432 852705 865297 878341 891863 908406 929106 952185 976333
58639 976333 1002522 1031390 1061955 1094202 1129987 1170033 1212885 1258154 1308063 1364506 1427352
58628 1427352 1496919 1575398 1664444 1764025 1875023 2000440 2142708 2302337 2480288 2679009
58618 2679009 2899754 3141320 3402241 3681124 3973171 4268635 4555738 4822585 5055629
58609 5055629 5240052 5364138 5421852 5411102 5333094 5194808 5008786 4788390 4545061 4290259
58599 4290259 4035790 3789958 3556099 3336395 3134052 2950318 2782852 2629261 2489539
58590 2489539 2363362 2248185 2142098 2045769 1959662 1882218 1812615 1752264 1701468 1657576 1618582
58579 1618582 1585645 1559711 1538441 1518882 1500548 1483458 1465690 1445341 1422798 1398908 1373134
58568 1373134 1345467 1317751 1291174 1264830 1238578 1214679 1194505 1176183 1157479 1138457 1119348
58557 1119348 1098686 1075864 1052921 1031493 1010555 989415 970255 955217 943319 932590 922926
58546 922926 914675 906902 899371 893843 891202 889616 887559 886110 886138 885979 884188 881967 880521 878643 875154
58531 875154 871072 867004 861143 852248 841800 830883 817870 801830 785230 770409 756168 740715
58519 740715 725197 711362 698426 685345 673530 664276 656019 647298 639879 635770 633552 630906 628494
58506 628494 628106 629063 629568 629691 630174 630409 630306 631902 636361 641665 645885 650107 655390 659736 661307 661976
58490 661976 664353 667810 670659 673660 677902 681760 683493 684561 686962 689649 691006 692437 695887 700161
58476 700161 703335 706554 711846 718317 724102 729875 736801 743180 746777 748462 750006 750435 748062 743970
58462 743970 739904 734898 727577 719506 712603 705488 696077 685561 676156 667272 657640 648843 642787 637977
58448 637977 632207 626642 623328 621084 617886 614943 614288 614799 614844 616341 621686 628968 634840 639919 646672
58433 646672 654048 658954 661252 662759 663109 661117 658374 657097 656276 654221 652819 654767 658814 662338 666447
58418 666447 673697 682956 691474 700017 710922 723011 733533 743228 754406 765794 774434 780925 787777
58405 787777 794306 798242 800527 803394 805479 803975 799817 795657 790682 782749 773642 766709 761226 754594
58391 754594 748166 745148 744556 743069 741128 741392 742913 742779 741922 743393 746424 748033 748763 751012 753511
58376 753511 753522 752640 754275 757346 758804 760231 765145 771836 776021 778794 784601 792910 799470 804513 811946
58361 811946 821319 828322 832687 838116 844890 849966 853948 860584 869660 877539 884290 893029 902727 909101
58347 909101 912212 915901 920170 921563 920542 920838 921976 920192 916411 915514 918031 920312 922510 928354 937277
58332 937277 944948 951509 961114 973457 984005 992512 1002971 1015237 1025212 1033297 1043988 1057100 1068138
58319 1068138 1077434 1089920 1105658 1119745 1131943 1147151 1165748 1182693 1196781 1211697 1227357
58308 1227357 1239555 1248650 1259231 1270766 1278270 1282625 1290243 1302023 1312767 1322025 1334951 1351648
58296 1351648 1366484 1378928 1394310 1412938 1429535 1444458 1463937 1487978 1509778 1528568 1551090
58285 1551090 1578651 1604931 1628582 1655709 1687637 1718603 1747802 1781135 1818686 1853252 1883795
58274 1883795 1917376 1955278 1990618 2022367 2057928 2098831 2137962 2174045 2214418 2260085 2302887
58263 2302887 2341215 2383445 2431836 2478511 2521594 2569351 2623633 2675507 2722448 2773535 2832350
58252 2832350 2891532 2949803 3016972 3095822 3176514 3255286 3340969 3436528 3532716 3627014 3729874
58241 3729874 3844774 3961589 4077394 4203687 4344740 4489583 4634204 4790286 4962738
58232 4962738 5140756 5321061 5517107 5734770 5962473 6196311 6450394 6730770 7024973
58223 7024973 7329839 7662715 8031738 8423261 8833100 9280768 9777538 10311705 10882191
58214 10882191 11513763 12220787 12990691 13823187 14749336 15790820 16940193 18205489 19633025
58205 19633025 21261489 23100267 25183127 27595877 30422019 33717623 37575539 42153413
58197 42153413 47600652 54033872 61641414 70746010 81729853 95021956 111258929 131367115
58189 131367115 156403926 187398788 225202759 269703779 318216689 364497313 400266095
58182 400266095 418899874 418424191 401457721 372808775 337231074 298645873 260172140
58175 260172140 224064059 191600769 163269843 139095782 118810759 101929005 87901306
58168 87901306 76259795 66608843 58565468 51799003 46092776 41299985 37268101 33857030
58160 33857030 30991513 28632202 26716245 25176784 23997227 23193380 22759888 22687848 23025146
58151 23025146 23869818 25314378 27451165 30409649 34257710 38746105 43152725 46485088
58143 46485088 47957940 47363850 45051420 41604670 37549853 33278768 29097670 25239020
58135 25239020 21826145 18880615 16380884 14295850 12573249 11140914 9939438 8935754
58127 8935754 8100166 7394540 6791551 6282646 5856036 5485979 5153162 4856449 4593964
58118 4593964 4350336 4113441 3887174 3676506 3475153 3278776 3095649 2932927 2785375
58109 2785375 2647990 2526805 2426620 2340072 2258920 2184525 2117558 2049314 1973739 1897378 1827499
58098 1827499 1760697 1692741 1629029 1574915 1525285 1473827 1423812 1380049 1338906 1295912 1255124
58087 1255124 1221490 1191649 1161134 1132984 1110395 1088412 1061814 1034125 1010319 987614 961955
58076 961955 936643 915984 896873 875031 853313 835764 819645 801343 784131 772112 762293 750452
58064 750452 739074 731789 725682 716849 708018 702918 698443 690066 679897 671804 663614 651712 638553
58051 638553 628132 618666 607011 595750 588675 583732 577566 572505 571865 572724 570658 567480 567172 568283
58037 568283 567583 567220 570947 576913 581339 585695 593099 601111 605279 606673 608920 610909 609467 606297 605246
58022 605246 605330 603192 599884 598538 597819 594343 589340 586486 585246 582456 578312 574773 570364 562665 553806
58007 553806 547559 543130 537465 531261 526755 522135 514442 505812 500478 497519 492846 486595 482230 479888
57993 479888 476790 473114 471430 471373 470478 469289 470234 472654 474227 476007 480648 486927 491395 494242 498269
57978 498269 503353 507364 511258 517670 525409 530765 533425 535888 538020 537544 535052 533169 531358 526835
57964 526835 520007 513822 508332 501150 492836 486549 482486 477709 471397 465460 460046 453268 445441 439043
57950 439043 434350 429438 424424 421455 420588 419901 419498 421219 424633 427482 429836 433583 438129 440869 441672
57935 441672 442687 444040 444043 443390 444517 446729 446375 442162 436194 429549 421035 410696 400590 391557 382796
57920 382796 374835 369369 366109 363377 361683 363045 366915 370667 374026 379074 385910 392287 397777 404365
57906 404365 412545 420619 428142 436387 444996 451778 456176 459614 462293 463102 462695 463065 463977 463406 461431
57891 461431 460011 458931 455849 450497 444971 439682 432963 424972 417950 412159 405531 397893 391611 387334
57877 387334 383015 377943 373930 371588 369157 366079 364180 364321 365231 366540 369589 374382 379164 383834 390350
57862 390350 398885 407070 413976 421334 429751 437265 442900 448223 453989 458386 460077 459997 458932 456203 451946
57847 451946 447758 443918 438807 432125 425809 420749 415537 409486 403846 399012 393607 387542 382871 380316
57833 380316 377917 374433 371065 368521 365371 360880 356534 353127 349084 343277 336929 331128 324967 317697
57819 317697 310282 303317 295750 287135 278882 271909 265346 258743 253207 249102 245046 240486 236871 235067
57805 235067 234018 233132 233473 235260 236721 236805 236667 237187 237563 237698 239338 243297 248015 252453 258048 266248
57789 266248 276386 287388 299149 310748 319851 325633 330038 334597 338328 340230 341293 342298 342147
57776 342147 340273 338260 337079 335043 330514 324482 318536 312482 306041 300636 297217 294371 290850 288071
57762 288071 287760 288892 289344 289045 289209 289870 290482 291677 294261 297484 300216 302746 305732 308627 310917 313658
57746 313658 317997 323218 327846 331599 334858 337462 339482 341861 344912 347504 349055 350768 353534 356364
57732 356364 358472 361139 365724 371454 377059 383018 390253 398117 405783 414322 425254 438034 450989
57719 450989 463894 477883 493591 510943 529869 549777 569274 587819 606703 627283 649385
57708 649385 672553 697394 724446 753268 784095 818793 858748 903392 952341 1007202 1069690
57697 1069690 1139771 1217502 1304906 1404007 1514821 1637490 1774704 1929642 2103031 2294597
57687 2294597 2505893 2738791 2991949 3260908 3540280 3822949 4097821 4351106 4569904
57678 4569904 4743393 4862590 4922601 4925425 4878733 4792478 4678379 4551137 4426633 4318031
57668 4318031 4234049 4178056 4144170 4114079 4062231 3967947 3823975 3635781 3415974 3179542
57658 3179542 2940724 2710902 2498066 2307172 2139957 1995251 1871086 1766530 1680680 1610977
57648 1610977 1554297 1509137 1475120 1450994 1434946 1426438 1425896 1432957 1446822 1468004 1497869 1536637
57636 1536637 1583668 1639625 1706607 1786074 1878287 1983874 2104397 2241201 2394883 2565834
57626 2565834 2754075 2958475 3176899 3406350 3641510 3873357 4090447 4281282 4434790
57617 4434790 4540261 4589663 4580588 4515944 4401283 4243752 4052628 3838291 3610044 3375774
57607 3375774 3143029 2918516 2706425 2508534 2325770 2158477 2005772 1866325 1739680
57598 1739680 1625627 1522918 1430055 1346650 1272389 1205345 1143298 1086207 1035413 990780 950641
57587 950641 914184 881678 852397 824614 797962 773847 753047 734617 717479 701553 687015
57576 687015 673911 662734 654041 647339 641525 636298 631822 627403 622249 617338 614723 614953 616890 619947
57562 619947 624621 630766 637362 644375 653033 663853 676028 689125 703721 719931 736859 754022
57550 754022 772013 791557 813312 838705 869369 905426 945768 990271 1040261 1096739 1159847
57539 1159847 1230354 1309918 1399444 1498811 1608679 1730947 1866929 2016439 2178913 2353646
57529 2353646 2538281 2728446 2919155 3104790 3277179 3425607 3539988 3613272 3640969 3620832
57519 3620832 3554474 3448070 3310136 3149185 2973524 2791340 2609423 2432430 2263901 2106890
57509 2106890 1962904 1831443 1711532 1603040 1506029 1419897 1343862 1277400 1219652 1169275
57499 1169275 1125399 1087920 1056472 1030032 1007901 990155 976813 967482 962051 960722 963129 968520
57487 968520 977004 989452 1006001 1025934 1049355 1077720 1112457 1154339 1204490 1264537 1335243 1416280
57475 1416280 1507821 1611128 1727159 1855975 1997879 2153589 2322436 2501359 2685884 2870538
57465 2870538 3047724 3207752 3340996 3439364 3495946 3505555 3467020 3384006 3262902 3110921
57455 3110921 2936311 2748271 2555041 2362645 2175775 1998393 1832828 1679724 1539689
57446 1539689 1413651 1301014 1199233 1106292 1022242 947423 880740 820771 767124 719393 676103
57435 676103 635995 599359 566944 538586 513814 492555 474146 456835 439450 422558 407026
57424 407026 392621 379039 366885 356385 346361 335897 325864 317464 310375 303663 297396 291875
57412 291875 286425 280521 275164 271498 268909 266090 263199 261306 260431 259819 259559 260243 261378 261744 261084 260036
57396 260036 258746 256969 255265 254670 255249 256182 257079 258120 259143 259764 260238 261099 262187 262983 263609 264486 265338
57379 265338 265564 265313 265149 264961 264227 263073 262066 261226 260237 259405 259441 260474 262069 263972 266053 267883 269143
57362 269143 270155 271347 272665 274120 276237 279137 281975 284228 286847 291037 296538 302176 307415 312217
57348 312217 316089 318697 320998 324370 328823 333165 336672 339551 342171 344887 348285 352558 357063 361417
57334 361417 366349 372389 378436 383099 386821 391134 396234 400947 404845 408766 413213 417683 421674 425185
57320 425185 428269 431231 435123 440831 447847 455086 462612 471187 480454 489222 497532 506810 517691 529208
57306 529208 540452 551745 563666 576071 588576 601181 614033 627257 641083 655593 670491
57295 670491 685823 702490 721052 740472 759313 777827 797576 819235 842321 866906 893954
57284 893954 923650 954828 986405 1018222 1050293 1082412 1114661 1147041 1178373 1206627 1230530
57273 1230530 1249790 1263807 1271452 1272219 1266437 1254412 1236735 1215365 1192738 1169597 1145254 1120220
57261 1120220 1096873 1076986 1060210 1045667 1033533 1024226 1017382 1012529 1009772 1009111 1010077 1012564 1016981
57248 1016981 1023110 1029979 1037374 1046214 1056810 1068003 1078775 1089489 1100789 1112410 1123971 1135904
57236 1135904 1148669 1161966 1175555 1189919 1205315 1221038 1236567 1252589 1270037 1288758 1307951
57225 1307951 1327276 1346862 1366834 1387466 1409105 1431417 1453445 1474895 1496553 1518955 1541681
57214 1541681 1564546 1588382 1613783 1640046 1666242 1692399 1718755 1744799 1770199 1795971 1823566
57203 1823566 1853273 1884402 1916502 1949500 1983117 2017083 2051575 2086811 2122640 2159161 2197047
57192 2197047 2236458 2276172 2314601 2351147 2385877 2418525 2448784 2477028 2503889 2529555 2554287
57181 2554287 2579114 2604997 2631651 2658176 2684605 2712001 2741112 2771717 2803171 2834986 2866944
57170 2866944 2899067 2931396 2963579 2994990 3025397 3054910 3083118 3109198 3133446 3157844 3184367
57159 3184367 3213308 3243886 3275720 3308785 3342542 3376084 3408835 3440542 3471043 3500725 3530650
57148 3530650 3561561 3593342 3625999 3660380 3697111 3735552 3774711 3814468 3854967 3895528 3935334
57137 3935334 3974702 4014615 4055409 4096883 4139182 4182398 4225574 4267048 4305579 4340465 4371238
57126 4371238 4398231 4422959 4446930 4470670 4494892 4522005 4555189 4596519 4647165 4708720 4782704
57115 4782704 4868941 4965724 5071303 5184107 5302328 5425377 5555980 5699616 5862143 6049438
57105 6049438 6268796 6528578 6836444 7200067 7630327 8142826 8756886 9495719 10388512
57096 10388512 11470958 12783650 14371744 16286095 18581801 21313995 24535297 28294686
57088 28294686 32631862 37566887 43092583 49171812 55733454 62667976 69832949 77063503
57080 77063503 84159581 90840975 96719361 101355194 104396507 105704076 105365298 103596926
57072 103596926 100626351 96634067 91765872 86171078 80027780 73544415 66942993 60433418
57064 60433418 54190304 48341312 42967197 38107353 33767017 29926384 26550739 23598314
57056 23598314 21024641 18785367 16838606 15145890 13671804 12384253 11255621 10262919
57048 10262919 9386473 8609049 7916308 7296918 6741464 6241667 5790819 5383950 5016837
57039 5016837 4685238 4385374 4114329 3869306 3647029 3444436 3259440 3090467 2935795
57030 2935795 2793959 2664270 2546251 2438859 2340731 2250752 2167913 2091208 2020198 1955148
57020 1955148 1895953 1841523 1790879 1744175 1701829 1663285 1627638 1594935 1565676 1539366 1514827
57009 1514827 1491783 1470957 1452714 1436866 1423909 1415240 1411885 1414193 1423118 1440720 1469149 1510517
56997 1510517 1568427 1648455 1756737 1899806 2085994 2321728 2598812 2882710 3118372 3255481
56987 3255481 3273694 3186959 3027159 2825573 2606009 2386432 2179547 1990917 1819710 1663012
56977 1663012 1519131 1387512 1267877 1160548 1066378 985502 916927 859819 814140 779301
56967 779301 753178 733385 718789 709049 703529 701787 704523 712939 727400 747633 773701 805363
56955 805363 840082 872424 895943 905917 900990 883216 856616 825171 791744 758456 727225 699457
56943 699457 675652 655802 639920 627899 619407 614339 612998 615672 622633 634832 653796 680456
56931 680456 714689 755802 801720 846817 882165 899914 897485 877294 843787 801930 756980 713169
56919 713169 672227 634196 599317 568145 540560 516177 495349 478429 464451 451933 440602
56908 440602 430946 422505 414283 406555 400542 396359 392955 390038 388352 387925 387802 387783 388805 391295 394783
56893 394783 399534 406919 417645 431209 447749 468913 496049 528843 566212 606795 647323 682009
56881 682009 705266 714850 711873 698902 679060 655901 632518 610678 591333 575520 564100 557200
56869 557200 554671 556806 564141 577022 595923 621840 656032 699827 754894 822848 903433 992515
56857 992515 1081481 1158507 1211742 1233743 1224487 1190161 1138912 1077886 1013246 950679 894514 847013
56845 847013 809076 781031 762491 752665 751664 760961 782144 816057 863719 927290 1009556 1112926
56833 1112926 1238323 1382232 1532438 1667679 1764645 1808028 1795611 1735855 1642139 1528377
56823 1528377 1406959 1287771 1177588 1079980 996022 925595 868498 824669 793924 775986 770724
56812 770724 778061 797939 830987 879151 944941 1029500 1130374 1239379 1341646 1418731 1456199
56801 1456199 1450166 1406821 1336425 1248748 1152653 1056354 966060 885212 815559 757883 711340
56790 711340 673838 644080 622358 608933 603118 604707 614955 635232 665836 706717 757407 814378
56778 814378 869277 911632 933738 932996 911108 872487 822890 767852 711625 657269 606912 561532
56766 561532 521294 486557 457832 434431 414318 396020 379716 365938 354302 344309 336262 330382
56754 330382 325940 322176 319245 317340 315714 313550 311052 308828 306930 305252 304042 303183 301795 299424
56740 299424 296824 294722 292719 290232 287627 285447 283412 281124 278867 276737 273934 270018 266008 263099
56726 263099 261063 259007 256915 255335 254282 253565 253413 253691 253321 251627 249486 247956 246602 244438 241702
56711 241702 239314 237272 235026 232888 231633 231119 230624 230152 230199 230606 230782 230676 230463 229787 228365 226802 225716
56694 225716 224710 223270 221937 221319 220747 219372 217912 217721 218614 219199 219022 218872 219184 219582 219851 220086 220105
56677 220105 219933 220517 222606 225240 226785 227276 228333 230842 234038 236910 239242 241134 242518 243299 243318 242379
56661 242379 240896 239940 239924 239890 239016 237943 237541 237286 236202 234516 232840 230549 226724 222090 218253 215456
56645 215456 212819 210304 208607 207410 205713 203714 202492 201893 200591 198382 196528 195579 194613 193035 191572
56630 191572 190985 191143 191783 193053 194976 197310 200040 203092 205719 207236 208182 209642 211713 213818 216067
56615 216067 218903 221766 223709 225060 226892 229096 230692 231884 233896 236723 238841 239484 239571 240070 240859
56600 240859 241502 241803 241411 240158 238829 238296 237976 236581 234270 232517 231930 231840 232003 232962 234518 235582 235843
56583 235843 236091 236741 237526 238713 240907 243466 244837 244766 244613 245159 245742 245890 246222 247343 249194 251798 255286
56566 255286 259050 262256 265248 269043 273569 277999 282650 288663 295794 302510 308406 314571 321343 327781
56552 327781 333639 339769 346063 351088 354406 357312 360575 363268 364559 364835 364362 362553 359296 355457 351462
56537 351462 346910 341997 337633 333726 329104 323612 318490 314307 310391 306713 304248 302893 301178 298721
56523 298721 296860 296101 295150 293328 291754 291037 289873 287194 283799 280658 277390 273638 270246 267847 265808
56508 265808 263615 261731 260150 257817 254449 251189 248529 245427 241488 238111 236268 235049 233611 232692
56494 232692 232846 233036 232451 232049 232727 233511 233116 231972 231292 231349 231936 233302 235466 237817 240287 243612 247681
56477 247681 251216 253929 257153 261393 265134 267281 268869 271102 273565 275710 278252 281634 284904 287570
56463 287570 290855 295568 300455 304160 307252 310768 314397 317612 321000 324923 328432 330986 333674 337252
56449 337252 340636 342795 344435 346266 347449 347409 347465 348868 350858 352356 353945 356393 358916 360633 362038
56434 362038 363193 362260 357924 351718 345881 340446 334392 328099 322460 316990 310989 305346 301043 297148
56420 297148 292334 287161 282904 279362 275791 272694 270636 268549 265298 261750 259312 257675 256018 255073
56406 255073 255830 257402 258343 259000 260406 262043 262816 263246 264502 266256 267485 268439 269815 271020 271186 270869
56390 270869 270882 270612 269375 268234 268504 269672 270684 271995 274392 277188 279606 282507 286607 290497 292743
56375 292743 294504 297643 301637 304788 307173 309849 312389 313802 314822 316687 318700 319438 319404 320054 321207
56360 321207 321799 322112 322933 323639 323484 323554 325011 326705 327037 326842 327817 329481 330490 331606 334298 337589 339462
56343 339462 340414 342548 345922 348858 351168 354167 358108 362336 367225 373296 379281 383762 387787 393152
56329 393152 399249 404515 409791 417065 425884 434253 442146 450877 459868 467446 474084 481532 489408 495960
56315 495960 501431 507298 512875 516235 517858 519845 521971 522146 520407 518877 517998 516305 513723 511655 509931
56300 509931 507136 503868 502320 502710 503317 503859 505626 508598 511739 515768 522248 530260 537458 544027 552083
56285 552083 561610 570734 579688 590605 603608 617080 631687 650051 672257 695704 719646 745931
56273 745931 775000 805230 836748 871923 911498 954029 999738 1051113 1109104 1172496 1241762
56262 1241762 1319771 1407999 1505703 1613502 1734062 1868437 2015280 2174291 2346781 2532108
56252 2532108 2727155 2929950 3140034 3354442 3566990 3772344 3967267 4147237 4305724
56243 4305724 4437870 4541577 4614484 4653890 4660576 4639028 4593040 4524758 4438623 4341879 4239720
56232 4239720 4133469 4024489 3916019 3809908 3705278 3601768 3500678 3401758 3302313 3200615
56222 3200615 3096962 2990681 2879818 2764749 2648481 2532466 2415661 2298403 2183308
56213 2183308 2071479 1961721 1854494 1752774 1658011 1569003 1485535 1409144 1339422 1273764
56203 1273764 1211738 1155720 1106328 1061381 1020231 984701 954717 927491 902103 880411 862328
56192 862328 844919 827447 812552 800935 789678 777493 766912 759466 753281 747262 743163 741621
56180 741621 740624 739702 741254 745922 751095 755616 761448 769037 775809 781007 787250 795415 802772 808012 813303
56165 813303 819473 824197 826852 830072 834445 836906 836525 836618 838759 840066 838918 838066 839434 841087 842069
56150 842069 845098 851671 859550 867737 878756 893411 908620 923211 940484 962391 986737 1012956
56138 1012956 1044908 1084944 1131070 1183200 1246367 1324244 1415189 1517898 1634601 1764458 1899506
56127 1899506 2031288 2156371 2272074 2373307 2458383 2532524 2601121 2664244 2720930 2772520
56117 2772520 2817489 2849099 2863112 2862863 2853038 2834489 2808996 2782054 2755401 2722387 2675706 2614422
56105 2614422 2539512 2449425 2345457 2235225 2125272 2015821 1907511 1806507 1717250 1636537
56095 1636537 1560793 1493104 1437084 1389829 1347131 1309962 1279875 1253759 1229097 1208626 1194061
56084 1194061 1181218 1167088 1155394 1149209 1144686 1138324 1133689 1134374 1137011 1137980 1140306 1146994 1154338 1158976
56070 1158976 1164693 1174917 1185425 1192047 1198623 1209458 1220993 1229082 1237553 1251031 1266034 1277773
56058 1277773 1289113 1304234 1320087 1332902 1346345 1364421 1383093 1397895 1412905 1433166 1455362
56047 1455362 1475285 1497071 1525330 1555538 1582251 1609376 1642091 1676204 1706100 1735564 1769759
56036 1769759 1804176 1832879 1860150 1892470 1926624 1957517 1989935 2030385 2074906 2117202 2161037
56025 2161037 2212079 2265623 2315275 2365504 2422346 2480216 2531636 2581267 2636151 2691190 2739236
56014 2739236 2786452 2842143 2902457 2960105 3020798 3093229 3172148 3248642 3327834 3418603 3515547
56003 3515547 3609840 3708146 3821258 3943709 4064823 4190081 4330623 4481593 4632652 4789928
55993 4789928 4964991 5152257 5340595 5536874 5753825 5985447 6219666 6464120 6733092
55984 6733092 7020729 7315118 7626667 7973197 8349518 8742752 9164708 9636316 10153795
55975 10153795 10705117 11305587 11979919 12724247 13526003 14405997 15398452 16506631 17724906
55966 17724906 19087507 20645893 22417983 24416376 26708654 29391999 32532653 36198684
55958 36198684 40528136 45690507 51813251 59041086 67647976 78007528 90517085 105704975
55950 105704975 124397863 147651057 176550729 212123526 254905627 303527217 353092516
55943 353092516 395512319 422687005 430369695 419522953 394519715 360449499 321700905
55936 321700905 281811633 243488370 208454659 177508093 150844554 128306639 109470686
55929 109470686 93776463 80708384 69844531 60789127 53173361 46727736 41274638
55922 41274638 36647434 32677900 29250821 26300666 23752285 21518132 19547740 17824671
55914 17824671 16315244 14967258 13755301 12680591 11727424 10862045 10072300 9367569 8740151
55905 8740151 8164179 7631591 7153259 6725107 6326907 5954113 5618674 5318386 5035850
55896 5035850 4767591 4525136 4307271 4099093 3898569 3717338 3555154 3399193 3248546
55887 3248546 3114394 2995785 2879543 2764397 2661552 2570861 2479639 2386065 2301375 2227465
55877 2227465 2153889 2078573 2010711 1951192 1890106 1825650 1766508 1713787 1659144 1602587 1553904
55866 1553904 1514450 1474931 1433047 1396284 1365438 1332275 1295740 1264345 1240362 1217156 1193975
55855 1193975 1177860 1169057 1159797 1149596 1146997 1154122 1163829 1173543 1187062 1200884 1203818 1193085 1176996
55842 1176996 1159379 1135306 1104553 1074934 1048842 1019844 986039 954009 926257 897286 865532
55831 865532 836992 813579 789666 763640 741383 724978 709137 692075 678757 670002 659353 644355
55819 644355 630447 620197 608948 594704 582276 574046 566220 557584 552558 552288 551972 550175 551679
55806 551679 558002 564071 567268 570870 575707 577421 575049 573483 574351 572957 567072 560189 553408 542890
55792 542890 528202 514501 503457 490560 474335 459539 448208 436173 421763 409445 401397 393727
55780 393727 384518 377539 374552 371981 368637 368550 372474 374494 370922 364959 358982 350091 337174 324690
55766 324690 315228 305593 294351 285933 283010 281761 278950 276908 277297 276724 272923 268919 266749 263263
55752 263263 256369 249330 244637 239524 231721 223953 218699 214052 208559 204570 203045 200664 195801 191756
55738 191756 190494 188862 184743 181209 180747 181034 180302 181240 185567 190079 192063 193339 195169 194663 190228
55723 190228 185172 181820 177319 169425 161250 156026 152174 147766 144800 144732 144651 142394 140870 142944 146489
55708 146489 148783 151414 156583 162835 168654 176055 186413 196807 204513 211041 217920 222896 224401 225374
55694 225374 228368 230979 230417 228471 227619 226292 222506 218304 216099 214225 210541 206897 205746 205840 205547
55679 205547 206851 211695 217814 222564 227410 234197 240421 242916 243101 243935 244658 243285 241456 241906 243496
55664 243496 243401 242236 242584 244296 245302 245398 245514 245064 243399 241935 241658 240748 237753 234657 233568 232940 230348
55647 230348 226405 222546 217568 209926 200991 192626 183965 173880 164039 156091 148415 139125 129801 122818
55633 122818 117537 112447 108418 106284 103940 99494 94801 92310 90965 88768 86682 86268 86077 84284 82373
55618 82373 82342 82770 81589 80287 81222 83128 83409 82706 83004 83313 81578 78949 77891 77685 75942 73017 70869
55601 70869 69115 66190 63046 61798 61980 61811 61731 63029 64472 64039 62638 62470 63149 62978 62580 63593 65232
55584 65232 65783 66054 67724 69744 70028 69241 69275 69474 68204 66621 66929 68211 68019 66965 67687 70272 72596
55567 72596 74360 76943 80025 82140 83920 87165 91319 94291 96019 97827 99141 98376 96323 95197 95020
55552 95020 94220 92952 92451 91988 89932 87093 85597 85265 84427 83465 84026 85652 86737 88014 91456 96422
55536 96422 100549 103789 107865 112331 114958 115690 116540 117787 117897 116997 116859 117487 117119 115590 114320 113024
55520 113024 109799 104584 99414 95120 90728 86094 82182 78807 74954 71226 69154 68262 66661 64264
55506 64264 62587 61697 60271 58330 56994 55898 53826 51505 50699 50826 49578 46593 43501 40627 36866
55491 36866 32639 29770 28371 26804 24706 23219 22412 21335 20389 20694 21422 20773 19347 19413 21049 22157
55475 22157 22130 22334 23019 22981 22337 22502 23301 23116 21901 21046 20338 18196 14891 12395 10999 9180 6920
55458 6920 5920 6380 6703 6509 6851 7323 6265 4023 2767 2836 2476 1457 1547 3047 4180 4452 5304 6897
55440 6897 7575 7158 7491 8965 9728 9156 8948 9853 10381 9764 9284 9706 10200 10619 12049 14262 15497 15573
55422 15573 16327 18164 19134 18422 17816 18602 19732 20193 20492 20736 19950 18363 17830 18927 20103 20584 21497
55405 21497 23232 24499 25030 26424 29116 31165 31290 30529 29690 27865 24881 22598 22140 22083 20998 19652
55389 19652 19227 19348 19259 19161 19149 18553 17327 16403 15891 14775 12986 11744 11238 10269 8813 8520 9827 10999
55371 10999 10884 10278 9719 8406 6311 4892 4688 4517 4019 4494 6240 7680 8216 9317 11526 13087
55355 13087 13014 12890 13992 15105 14865 14025 13577 12779 10855 8802 7867 7873 8371 9614 11127 11357 10091 9276
55337 9276 10098 11247 11360 11069 11164 10866 9566 8383 8351 8766 8782 8912 9617 10192 10381 11266 13231 14913 15417
55318 15417 15658 16267 16236 15038 14012 14143 14479 14223 14301 15274 15815 15018 14224 14749 15653 15593 15065 14967 14690 13551
55298 13551 12496 12586 13252 13652 14210 15235 15725 15176 14910 15933 17193 17605 17964 19091 19860 19107 17814
55281 17814 17407 17460 17041 16780 17512 18292 17910 17129 17351 18184 18321 17818 17580 17535 17078 16433 16025 15467 14591 14330
55261 14330 15174 15983 15740 15095 14818 14279 13054 12397 13309 14629 14908 14715 15210 15901 15821 15581 16165 16948 16928
55242 16928 16723 17293 17834 17078 15650 15035 15150 14978 14670 14957 15339 14899 14176 14353 15282 16059 16713 17541 17742
55223 17742 16578 15034 14407 14149 13079 11862 12174 14015 15854 16921 17527 17669 17131 16490 16391 16359 15809
55206 15809 15451 16087 16930 16858 16488 17163 18735 20226 21894 24589 27669 29611 30194 30209 29556 27582 24907
55189 24907 22980 22080 21517 21386 22349 23987 25159 25737 26364 26798 26146 24504 22856 21657 20900 21065 22418
55172 22418 23852 24046 23333 22856 22411 20858 18359 16439 15966 16530 17573 18786 19628 19814 19945 20542 21000
55155 21000 20685 20268 20588 21103 21029 21127 22496 24371 25109 24844 25114 26229 27005 26921 26598 26164 24949 22906
55137 22906 20843 19195 17863 17119 17342 18084 18658 19307 20583 22067 23011 23663 24576 25263 25106 24872 25696
55120 25696 27168 28151 28879 30363 32273 33356 33556 33820 34169 33941 33577 34095 34979 34657 33098 31958 32030
55103 32030 32438 32474 32503 32800 33152 33793 35254 37158 38547 39397 40377 41315 41454 41046 41059 41406 41132 40283 39904
55084 39904 40246 40634 41071 42292 44174 45760 46865 48036 48987 48822 47905 47665 48370 48834 48600 48706 49873
55067 49873 51483 52805 53891 54860 55528 55969 56367 56321 55399 54167 53419 52726 51255 49635 49250 49919 50189
55050 50189 49866 50238 51635 52726 52589 51699 50458 48552 46226 44587 44087 44082 44223 44789 45483 45530 45313 46175
55032 46175 48141 49496 49246 48413 48266 48688 49000 49066 48941 48593 48538 49633 51740 53641 54589 54923 55030 54972
55014 54972 55297 56768 58940 60363 60576 60600 61144 61698 61769 61554 60921 59169 56420 54026 52915 52651 52610 52995
54996 52995 54108 55584 56869 57642 57567 56521 55186 54424 54009 53076 51751 51036 51062 50906 50315 50130 50673 51128
54978 51128 50957 50652 50677 50921 51459 52666 54250 55421 56279 57796 60155 62465 64373 66601 69563 72777
54962 72777 75964 79424 83000 86107 89123 93386 99394 106330 113810 122713 133834 146889 161286 176644
54948 176644 192237 207187 221442 235218 247237 254996 257184 254542 248139 238396 226135 212788
54936 212788 198956 184266 169217 155593 144348 134621 125531 117500 111047 105720 101066 97380 94706
54923 94706 92312 89898 88191 87711 88114 89235 91465 94540 97323 99408 101715 104990 109127 114451 122072
54908 122072 132280 144066 156964 171722 188233 204390 218082 228976 237308 242235 242583 238179
54896 238179 229494 217121 202452 187650 173875 160564 147257 134932 124613 115899 107915 100694
54884 100694 94587 89388 85061 82285 81215 80654 79433 77754 76316 75054 73701 72644 72215 71935 71273
54869 71273 70428 69621 68439 66624 64680 63056 61603 60361 59855 60021 59940 59232 58602 58376 57802 56525 55399
54852 55399 54966 54383 52859 50919 49316 47856 46361 45570 45949 46624 46646 46350 46436 46602 46166 45248 44392 43804
54834 43804 43679 44361 45446 45835 45446 45661 47280 49307 50706 51942 53622 54952 54994 54404 54503 55507 56896
54817 56896 58681 60995 63249 64860 66160 67640 69144 70689 72987 76133 78928 80700 82680 86286
54803 86286 91111 96062 101475 108555 117448 127394 138184 150150 163315 177714 193820 211293 227978
54790 227978 241512 251389 258291 262041 261614 256725 248175 237023 224403 211621 199390 187430 175645
54777 175645 164966 156127 148584 141737 136236 132886 131106 129800 128898 128671 128399 127218 125702 125158 125895
54762 125895 127491 130199 134631 140535 147172 154528 163000 172436 182678 194452 208518 224556 242024
54749 242024 261270 282317 303251 321387 335450 345237 349934 348604 341984 332004 319651 304808
54737 304808 287994 270644 253639 236921 220590 205183 190921 177762 166077 156230 147775 140152
54725 140152 133768 129215 125769 121980 117531 113286 109780 106836 104390 102472 100647 98587 96889 96131
54711 96131 95616 94319 92655 91868 92005 92001 91564 91508 92229 93284 94484 96147 98189 100016 101297 101923 101511
54694 101511 100085 98869 99145 100601 101951 102827 103721 104544 104820 105013 105987 107194 107111 105593 104244 104235 105256
54677 105256 106817 109051 111708 113755 114661 115163 116285 118370 121303 124831 128488 131966 135647 140051 144882
54662 144882 149476 154015 159304 165449 171768 177918 184068 190021 195157 199242 202460 204877 206786 209208
54648 209208 212829 216699 219257 220498 221958 224749 228975 234808 242598 251829 261456 271542 283227 296804
54634 296804 310945 323959 334578 341420 343153 339705 332211 321420 307258 290243 272167 254862
54622 254862 239138 225131 212706 201242 190082 179638 171174 165141 160548 156307 152421 149543 148007
54609 148007 147639 148012 148813 150261 152974 156923 160974 164160 166787 169367 171188 171240 170020 168880 167860
54594 167860 165771 162323 158540 154963 151046 146566 142098 137701 132599 126693 121125 116752 113121 109414
54580 109414 105413 101187 96777 92592 89232 86699 84583 83026 82429 82296 81615 80484 79971 80122 79541 77442
54564 77442 74823 72983 71982 71174 70277 69334 68396 67741 67729 68158 68515 68935 70010 71593 72879 73792 75142
54547 75142 77131 78868 79726 80120 80577 81068 81640 82657 84075 85426 86783 88777 91440 94118 96760 100175
54531 100175 104724 110006 116122 123914 133360 142903 151070 157732 163236 167357 169739 170397 169127 165293
54517 165293 158879 151020 142977 135222 127913 121410 115818 110712 105783 101189 97072 93397 90382 88302
54503 88302 86772 85082 83281 82018 81291 80418 79290 78512 78219 77963 77852 78444 79283 79046 77533 76173 76015
54486 76015 76550 77027 77552 78201 78339 77618 76712 76347 76571 77408 79211 81802 84271 86114 87614 88813 89301
54469 89301 89341 89846 90773 90901 89744 88346 87579 87055 86387 86035 86122 85868 85047 84580 84708 84063 81733 78940
54451 78940 77367 76959 76632 76107 75753 75493 75181 75282 76017 76592 76323 75757 75627 75495 74601 73244 72193 71388
54433 71388 70366 69376 68942 68863 68719 68852 69784 71093 71867 71915 71711 71537 71425 71552 71987 72493 73113 74336 76140
54414 76140 77628 78244 78556 79184 79836 80246 81115 83174 86022 88834 91486 94121 96370 98043 99957 103115
54398 103115 107581 112950 119256 126468 133769 140319 146237 152054 157789 163353 169111 175137 180521 184321
54384 184321 186561 187585 187165 185224 182660 180415 178304 175635 172340 168620 164249 159193 154194 149783
54370 149783 145478 140880 136663 133336 130017 125787 121508 118751 117459 116154 114090 111825 109956 108642
54356 108642 108143 108523 108904 108235 106742 105659 105729 106919 109198 112416 115639 117845 119306 121283 124398 128222
54340 128222 132347 136864 141803 146993 152481 158303 163937 168728 172747 176552 180251 183392 185561 186556
54326 186556 186282 185004 183272 181076 177705 173021 168042 163470 158546 152432 145854 140085 134975 129402
54312 129402 123202 117196 111653 106145 100744 95998 91826 87780 84253 82126 81155 80045 78241 76403
54298 76403 74911 73114 70443 67269 64267 61732 59827 58783 58495 58430 58141 57502 56607 55900 56144 57563
54282 57563 59185 59744 59114 58260 57996 58479 59557 60821 61518 61209 60410 59917 59804 59720 59712 59963 60172 60138 60554
54263 60554 62195 64594 66611 68003 69347 70659 71321 71355 71535 72115 72546 72663 73149 74464 76082 77101
54247 77101 77027 75808 73683 71210 69000 67348 66346 66087 66387 66683 66691 66806 67332 67864 68018 68160 68681 69125
54229 69125 68912 68375 68148 68057 67585 66915 66503 66117 65371 64743 64853 65171 64662 63402 62304 61572 60680 59635
54211 59635 58956 58554 57994 57712 58690 60852 62956 64078 64156 63246 61504 59844 59304 59659 59746 59161 58526 58226
54193 58226 58114 58346 59221 60162 60264 59910 60502 62402 64424 65532 65853 65811 65560 65490 66042 66757 66612 65573
54175 65573 64666 64355 64073 63517 63115 62940 62456 61747 61721 62619 63466 63539 63281 63306 63498 63647 63990 64623 65112 65104 64633
54154 64633 63693 62338 61204 61024 61532 61914 62250 63341 65063 66273 66487 66296 65991 65266 64530 64844 66047
54137 66047 66526 65559 64369 64124 64368 64299 64204 64539 64917 65096 65828 67561 69263 69727 69255 68965 69136 69253 69001
54118 69001 68246 66700 64560 62933 62641 63112 63226 62782 62314 62031 61767 61583 61611 61665 61657 61988 62929 64008 64630
54099 64630 64886 65174 65465 65547 65597 65930 66453 66879 67138 67268 67171 66807 66241 65344 63955 62455 61501 61033 60314
54080 60314 59189 58478 58732 59469 60048 60448 60756 60725 60426 60462 60986 61319 61098 60964 61437 61971 61903 61566 61650 62167
54060 62167 62913 64246 66445 68793 70257 70738 70844 70832 70610 70545 71341 73099 75088 76500 77109 77390 78269
54043 78269 80471 83804 87306 90286 92839 95214 97289 98984 100614 102494 104704 107535 111505 116527
54029 116527 121652 126088 130027 134097 138514 143122 147782 152407 157047 162051 167590 172992 177311 180661
54015 180661 184051 187802 191161 193724 196014 198163 199303 198955 197983 197317 196800 196073 195510 195320 194673 192801
53999 192801 190260 188070 186358 184788 183562 182874 182042 180376 178463 177447 177423 177560 177478 177438 177437 177129 176483 175705
53981 175705 174627 172954 170883 168801 166537 163624 160066 156312 152746 149719 147644 146440 145338 143865
53967 143865 142559 142033 141837 141026 139436 137643 136072 134925 134570 135147 136006 136348 136243 136430 137351 138907 140757
53950 140757 142326 143039 143199 144113 146630 150093 153487 157006 161574 167318 173582 180092 187112 194715 202815
53935 202815 211682 221489 231472 240397 247700 253494 257743 260233 261096 260550 258382 254507 249698 244916 240231
53920 240231 235345 230845 227824 226414 225768 225511 226147 227928 230258 232504 234697 237241 240518 244804 250017
53905 250017 255532 260758 265797 271047 276404 281537 286561 291606 295938 298454 298991 298322 296918 294709 292018
53890 292018 289705 288013 286095 283095 279093 274688 270159 265317 259849 253563 246587 239415 232525 225988
53876 225988 219674 213663 208090 202814 197678 192883 188655 184765 180804 176661 172309 167504 162330 157706
53862 157706 154581 152754 151110 148855 145989 142855 139938 137848 136691 135559 133446 130591 128187 126749
53848 126749 125514 123493 120481 116952 113599 111062 109579 108785 108188 107713 107397 106851 105634 103979 102544
53833 102544 101603 101048 100934 101317 101731 101582 101019 100712 100841 101027 101201 101809 103018 104359 105247 105390 104696 103348
53815 103348 101974 101246 101244 101644 102359 103532 105011 106433 107706 108935 109964 110591 111174 112526 115176 118997
53799 118997 123349 127296 130105 132011 134099 137019 140366 143839 148186 154098 160789 166825 171889 176580
53785 176580 180812 183795 185532 187093 189198 191630 194114 196730 199213 200860 201425 201298 200688 199459 197872
53770 197872 196494 195154 192905 189354 185153 180936 176670 172450 169023 166894 165542 164021 161946 159612
53756 159612 157548 156154 155297 154195 152271 150180 149271 149852 150667 150353 148826 146996 145808 145827 147099 148960
53740 148960 150450 151243 151827 152561 153045 152720 151708 150737 150388 150592 150729 150326 149809 150270 152102 154285 155656
53723 155656 156537 158258 161263 164624 167435 169800 172252 175028 178082 181144 183552 184716 184930 185127 185729
53708 185729 186355 186686 186813 186675 185974 184854 183881 183068 181681 179341 176699 174715 173839 174088 175279 176933
53692 176933 178579 180349 182642 185080 186619 186978 187197 188364 190453 192870 195500 198645 202355 206348 210300
53677 210300 213870 216734 218910 220894 223325 226601 230680 234817 237650 238254 237225 236207 236317 237491 239243
53662 239243 241247 243077 244163 244348 243984 243328 242458 241831 242106 243118 243761 243214 241717 239843 237607 234747
53646 234747 231424 228271 225957 224803 224461 223966 222531 220367 218328 216893 215990 215557 215513 215303 214352 212967
53630 212967 211917 211141 209849 208023 206754 206730 207352 207779 208003 208442 209234 210400 212077 214174 216363 218718
53614 218718 221695 225209 228409 230734 232522 234266 236011 237835 240219 243424 247007 250428 253698 257191
53600 257191 261247 266076 271560 277047 281933 286482 291411 296742 301929 307061 312809 319040 324581 328707
53586 328707 331824 334421 336529 338611 341712 345994 350149 353054 355077 357121 359297 361298 363181 364947
53572 364947 366114 366487 366687 367282 368148 369233 370988 373289 374960 375309 375213 375668 376203 375908 375238 375454 376779
53555 376779 378441 380224 382662 385851 389194 392299 395206 397809 399982 402204 405187 408821 412239 414890
53541 414890 416946 418762 420659 423129 426523 430464 434169 437347 440241 442907 445092 446912 449076 452285
53527 452285 456726 462132 468083 474324 481042 488670 497166 505742 513656 521117 529080 538323 548954 560630
53513 560630 572919 585601 598753 612482 626615 641087 656427 673229 691117 709108 727132
53502 727132 746270 767132 789005 811215 834309 859036 884923 910921 936918 963678 991543
53491 991543 1020026 1048431 1076223 1103097 1129362 1155953 1183393 1210989 1237665 1263246 1288334
53480 1288334 1313301 1338075 1362618 1386909 1410623 1433519 1456025 1478892 1502377 1526140 1549726
53469 1549726 1572777 1595046 1616521 1637209 1656561 1673670 1688385 1701520 1713520 1723706 1731471
53458 1731471 1737414 1742368 1746003 1747409 1746594 1744272 1740464 1734341 1725380 1713875 1700378 1685369 1669339
53445 1669339 1652508 1634587 1615427 1595594 1575687 1555376 1533813 1510687 1486211 1460474 1433661
53434 1433661 1406650 1380454 1355161 1330100 1304914 1279818 1255132 1231317 1209215 1189433 1171714
53423 1171714 1155618 1141444 1129574 1119243 1109069 1098707 1088994 1080545 1073274 1067315 1063259 1061195
53411 1061195 1060457 1060689 1062448 1066454 1072851 1081395 1091770 1103519 1116241 1130092 1145677 1163363 1183150
53398 1183150 1205173 1229699 1256561 1285192 1315340 1347200 1380768 1415622 1451608 1489203 1528959
53387 1528959 1570899 1614694 1660206 1707743 1757863 1810825 1866074 1922494 1979407 2037061 2095852
53376 2095852 2155422 2214965 2274035 2332557 2390382 2447506 2504410 2561443 2617918 2672416 2723934
53365 2723934 2772190 2816925 2857538 2893488 2924647 2951186 2973340 2991167 3004322 3012291 3015025 3012942
53353 3012942 3006065 2993790 2975989 2953757 2928450 2900475 2869642 2836076 2799958 2760840 2718122
53342 2718122 2672003 2623204 2572158 2519264 2465522 2412015 2359071 2306757 2255738 2206556 2158383
53331 2158383 2109668 2059983 2010267 1961379 1913493 1866819 1821823 1778552 1736673 1696226 1657536
53320 1657536 1620413 1584473 1550263 1519098 1491605 1467222 1445165 1424947 1405874 1387067 1368273
53309 1368273 1349906 1332131 1314734 1297954 1282529 1268754 1256367 1245533 1236961 1230730 1225898 1221766
53297 1221766 1218819 1218002 1219622 1223293 1228437 1234562 1241546 1249843 1260052 1272210 1285943 1301103 1317646
53284 1317646 1335065 1352921 1371945 1393666 1418721 1446260 1475217 1505331 1536601 1568455 1599921
53273 1599921 1630192 1658838 1685856 1711592 1736256 1759596 1781402 1801910 1821087 1837990 1851814
53262 1851814 1863239 1873612 1882946 1889931 1893846 1895194 1894381 1891163 1885623 1878376 1869336 1857549 1842779
53249 1842779 1826147 1808592 1789824 1769442 1748031 1726308 1703995 1680357 1655218 1628843 1601505
53238 1601505 1573785 1546579 1520092 1493474 1466132 1438813 1412645 1387617 1362755 1337520 1312327
53227 1312327 1287887 1264552 1242192 1220390 1198840 1177700 1157318 1137676 1118494 1099872 1082238
53216 1082238 1065674 1049885 1034884 1020933 1007741 994501 980941 967550 954561 941495 927949
53205 927949 914013 899677 884599 868788 852644 836074 818561 800502 783493 768649 755469
53194 755469 742908 730731 719165 707981 696697 685124 673096 660199 646349 632078 617757
53183 617757 603151 588206 573567 559651 545895 531621 517200 503641 491444 480387 470032
53172 470032 459842 449208 437937 426542 415689 405664 396559 388460 381173 374243 367516 361178 355099
53159 355099 348855 342589 337025 332330 327744 322699 317447 312242 306863 301430 296714 293021 289720 286505
53145 286505 284107 283003 282398 281440 280544 280474 280868 280833 280479 280741 281953 283577 285106 286590 288487 291538 296282
53128 296282 302124 307578 312035 316511 321780 326644 329188 329178 327938 326294 323874 320289 315808 310840 305621
53113 305621 300416 295323 289969 284094 278158 272673 267224 260996 254045 247271 241278 235997 231170 226483
53099 226483 221483 216109 211088 207081 203784 200639 197916 196063 194312 191234 186664 182010 178521 176245
53085 176245 174763 173892 173349 172593 171436 170208 169046 167600 165651 163460 161373 159518 158055 157170 156652
53070 156652 155932 154707 153169 151634 150388 149836 150249 151246 152026 152258 152332 152640 153053 153243 153177 153088 153140 153268 153228
53051 153228 152841 152175 151377 150334 148877 147393 146734 147230 148253 149114 149898 150994 152370 153818 155387 156904
53035 156904 157574 156831 155287 154035 153238 152134 150268 147968 145740 143878 142623 142043 141791 141508 141361 141697
53019 141697 142389 143092 143882 144943 145892 146176 145986 146024 146412 146682 146865 147729 149685 152115 154048 155068 155348
53002 155348 155250 155122 155291 156075 157768 160330 162994 164665 165131 165444 166697 168945 171799 175391 179896 184681
52986 184681 189055 193509 199068 205515 211425 216089 220335 225184 230603 235918 240649 244530 247354 249201
52972 249201 250337 250668 249712 247294 243812 239760 235512 231603 228581 226386 224381 222130 219648 216837 213290
52957 213290 208909 204227 199869 196029 192597 189457 186594 184292 183142 183368 184145 184191 183137 181833 181233
52942 181233 181471 182090 182594 182583 181853 180647 179487 178609 177812 176874 175826 174820 174083 173959 174682 176114 177929
52925 177929 179831 181306 181613 180624 179371 179049 179628 180145 180146 179985 179850 179472 178922 178717 178866 178699 178059 177882
52907 177882 179000 180950 182558 183337 183775 184396 185059 185286 185076 185195 186439 188533 190153 190319 189468 188769 188775
52890 188775 189323 190362 192040 194091 195948 197460 198805 199706 199569 198531 197679 197959 199385 201386 203333
52875 203333 204681 205328 206069 208036 211379 214965 217595 219071 220022 221245 223367 226612 230618 234829 239114
52860 239114 243624 248201 252535 256820 261493 266293 270326 273262 275716 278246 280622 282308 283048 282737 281326
52845 281326 279110 276576 273818 270693 267619 265433 264226 263013 260907 257971 254680 251333 248296 246012
52831 246012 244200 241732 237900 233344 229176 225719 222595 219568 216639 213676 210599 207793 205768 204453
52817 204453 203190 201415 199130 196835 195159 194423 194430 194727 194997 194963 194081 191896 188755 185673 183385 181907
52801 181907 181017 180561 180187 179394 178122 176843 175859 174971 173930 172712 171217 169311 167351 166062 165554 164989
52785 164989 163570 161448 159389 157944 157192 156826 156211 154755 152504 150068 147921 146190 145075 144794 144904
52770 144904 144424 142990 141363 140439 140281 140369 140308 139982 139481 139118 139002 138472 136634 133721 131128 129692 128681
52753 128681 127020 124855 123178 122381 121907 121071 119651 117875 116213 114994 113940 112382 110161 107942 106409
52738 106409 105643 105494 105913 106514 106490 105599 104744 104920 105943 106837 107163 107238 107299 107211 107081 107526 109119 111798 114988
52719 114988 118148 121152 124177 127218 129931 132174 134464 137442 141022 144585 147973 151591 155433 158764
52705 158764 161000 162231 162573 161683 159317 155856 151911 147881 144210 141390 139294 137001 133780 129815 125660
52690 125660 121566 117745 114684 112588 110953 109211 107454 106097 105254 104849 104879 105049 104625 103215 101401 100041
52674 100041 99222 98297 96700 94370 91691 89317 87745 86743 85573 84009 82635 81909 81497 80972 80576 80803
52658 80803 81687 82949 84362 85556 86015 85769 85580 85930 86365 86361 86252 86601 87125 86994 85942 84438 83010 81914
52640 81914 81322 81326 81916 83100 84710 85953 85843 84470 83194 83106 83979 85118 86439 87970 89051 88949 87846
52623 87846 86501 85431 85062 85961 87978 89713 89837 88612 87295 86487 85976 85712 85793 85783 85146 84267 84078 84777
52605 84777 85768 86735 87831 88908 89584 89994 90635 91416 91818 91998 92768 94298 95707 96197 95885 95316 94899 95039
52587 95039 96156 98164 100325 101853 102399 102015 101119 100481 100744 101830 103138 104217 104919 105161 105134 105528 106906
52570 106906 108940 110849 112483 114386 116858 119594 122176 124297 125586 125898 125850 126399 127824 129615 131364
52555 131364 133179 135160 137033 138463 139336 139714 139914 140585 142203 144523 146867 148857 150482 151659 152327
52540 152327 152822 153590 154541 155156 155118 154421 153134 151571 150471 150384 151072 152021 153152 154460 155440 155801 156349 158061
52522 158061 160387 161624 161034 159610 158606 158369 158840 160169 162213 164145 165107 164897 163855 162542 161637 161527
52506 161527 161822 161796 161358 161032 160941 160511 159323 157623 155904 154616 154338 155429 157272 158616 158937 158857 159025
52489 159025 159375 159716 160266 161134 161914 162270 162459 162842 163382 163939 164600 165384 166077 166699 167666 169113 170475 171158
52471 171158 171294 171486 172099 173113 174377 175695 176851 177817 178784 179848 180867 181713 182498 183448 184691 186112
52455 186112 187286 187741 187577 187626 188635 190487 192575 194665 196882 199160 201363 203694 206310 208718 210367
52440 210367 211676 213643 216479 219457 222027 224184 225799 226640 227227 228560 230666 232340 232629 231725 230125
52425 230125 227937 225470 223429 221896 219909 216715 212671 208359 203673 198595 194113 191357 190209 189548
52411 189548 188547 187076 185189 182972 180709 178603 176558 174683 173626 173815 174666 175269 175640 176619 178603
52396 178603 180961 182790 183762 184196 184652 185553 186892 188168 188797 188646 188172 188021 188470 189206 189670 189726 189808 190239
52378 190239 190698 190799 190910 191772 193368 194917 196044 197215 198885 200912 203138 205785 208827 211560 213320
52363 213320 214278 215109 216254 217832 219927 222558 225577 228833 232192 235343 237998 240429 243299 246836 250637
52348 250637 254364 257982 261163 263286 264432 265664 267740 270190 272195 273821 275712 278024 280382 282670
52334 282670 285217 288226 291452 294405 296710 298423 300138 302458 305224 307698 309628 311595 314094 316868
52320 316868 319499 322080 324899 328027 331631 336132 341511 346974 351870 356554 361804 367765 374024 380354
52306 380354 386823 393452 400326 407782 415997 424632 433334 442367 452297 463291 475160 487862 501544
52293 501544 516247 531832 548081 564663 581302 598056 615105 632167 648747 665157 682548
52282 682548 701508 721281 740876 760268 779918 799709 819075 837711 855471 871990 887041
52271 887041 900930 913934 925788 936265 945761 954578 962160 967814 971831 975020 977491 978755 978783 978087
52257 978087 976934 975323 973616 972315 971263 969862 968065 966409 965066 963621 961973 960768 960682 961732 963477
52242 963477 965541 967865 970669 974170 978209 982436 987111 993220 1001393 1011173 1021894 1033679 1046757
52229 1046757 1060290 1072987 1084709 1096398 1108475 1120344 1131649 1142908 1154455 1165576 1175201
52218 1175201 1182979 1189304 1194735 1199798 1204884 1209924 1214302 1217343 1218807 1218862 1217708 1215258 1211118 1205061
52204 1205061 1197671 1190206 1183435 1176954 1169984 1162418 1154516 1146028 1136556 1126573 1117213 1109012 1101646 1094924
52190 1094924 1089153 1084360 1079959 1075573 1071573 1068515 1066503 1065308 1064585 1063810 1062511 1060793 1059203 1057936
52176 1057936 1056678 1055289 1054020 1052882 1051500 1049886 1048708 1048362 1048263 1047546 1046041 1044165 1042228 1040293 1038417
52161 1038417 1036588 1034591 1032336 1030111 1028161 1026171 1023471 1019737 1015268 1010643 1006359 1002669 999520 996546
52147 996546 993209 989019 983745 977560 971020 964743 959054 953898 948958 943753 937862 931359 924885 919058
52133 919058 913943 909303 905055 901061 896784 891821 886695 882439 879288 876327 872602 868042 863130 858252
52119 858252 853674 849609 845877 841875 837296 832664 828807 825982 823879 822262 821217 820816 820902 821337 822280
52104 822280 824038 826742 830257 834504 839767 846494 854724 863965 873850 884728 897322 911920 928203
52091 928203 945770 964525 984544 1005883 1028516 1052203 1076379 1100476 1124359 1148205 1171929
52080 1171929 1194998 1216822 1237108 1255814 1272984 1288656 1302749 1315172 1326197 1336515 1346530
52069 1346530 1355734 1363219 1368753 1372861 1375863 1377406 1377117 1375253 1372348 1368542 1363549 1357122 1349376 1340801
52055 1340801 1332109 1323882 1316145 1308404 1300277 1292036 1284397 1277825 1272185 1267081 1262482 1258781 1256206 1254380
52041 1254380 1252813 1251687 1251628 1252644 1253901 1254833 1255889 1257751 1260341 1263227 1266535 1270656 1275258 1279456 1282989
52026 1282989 1286511 1290556 1294836 1298692 1301745 1303889 1305154 1305800 1306266 1306895 1307871 1309266 1310779 1311586 1311012
52011 1311012 1309265 1306894 1303632 1298550 1291436 1283217 1274683 1265543 1255177 1243678 1231516 1218585 1204157
51998 1204157 1187646 1168949 1148214 1125715 1101876 1077095 1051498 1025019 997642 969456 940607
51987 940607 911388 882246 853519 825151 796797 768224 739639 711625 684680 658762 633450
51976 633450 608655 584958 563031 542979 524527 507502 491696 476524 461440 446634 432743
51965 432743 419869 407415 395025 383126 372419 363226 355475 348860 342859 336993 331295 326263 322217
51952 322217 318886 315649 311956 307634 303082 298976 295383 291410 286320 280789 276300 273359 271160 269082
51938 269082 267514 266886 266727 266242 265207 263755 261784 259159 256183 253430 251329 250118 249830 250071 250290 250494
51922 250494 251182 252304 252987 252744 252297 252521 253103 253018 252022 250835 249961 249040 247429 244873 241545 237895 234544
51905 234544 231903 229768 227520 224835 222027 219714 218248 217393 216437 214750 212382 210015 208185 206772 205345
51890 205345 203681 201730 199403 196803 194466 192984 192391 192210 191997 191661 191357 191341 191829 192663 193196 192759 191329
51873 191329 189558 188187 187562 187652 188242 188995 189431 189059 187691 185699 183900 182996 183042 183525 183954 184252 184612 185145
51855 185145 185749 186166 186203 185995 186010 186637 187810 189149 190409 191588 192721 193848 195119 196714 198640 200805
51839 200805 203162 205629 208086 210693 213858 217505 220685 222502 223148 223398 223312 222285 220341 218418 217161
51824 217161 216210 215073 213995 213476 213433 213304 212685 211587 210321 209325 208799 208439 207856 207229 207024 207174 207224 207368
51806 207368 208426 210518 212647 214090 215408 217427 219819 221465 221884 221689 221794 222610 223872 224886 225110
51791 225110 224617 223816 222746 221242 219698 218887 218783 218506 217777 217472 218068 218510 217570 215669 214330 214226 214729
51774 214729 215122 215278 215191 214665 213669 212537 211786 211926 213168 215012 216510 217329 218204 219974 222662 225896 229557
51757 229557 233396 236641 238831 240511 242311 243886 244697 245309 246849 249517 252751 256515 261150 266040 269882
51742 269882 272511 275262 279130 283662 288112 292693 298018 304121 310747 318118 326751 336830 348150 360313
51728 360313 372594 383932 393506 401152 407097 411569 414806 417011 418061 417611 415777 413400 411387 410008
51714 410008 409072 408506 408464 408924 409346 408761 406365 402262 397605 393655 390687 388028 385070 381836 378650 375673
51698 375673 372886 370111 366960 363120 358790 354501 350474 346548 342854 340113 338933 339050 339494 339491 339097 339091
51682 339091 340342 343243 347714 353558 360363 366931 371347 372256 369940 365716 360553 354741 348619 342770
51668 342770 337518 332927 329408 327645 327706 328817 330293 332205 334995 338978 344456 351765 360795 370749 380609
51653 380609 389479 396353 400186 400607 398253 393967 387981 380233 371168 361727 352594 343809 335082 326265
51639 326265 317548 309312 301783 294882 288545 283026 278465 274233 269272 263330 257352 252349 248287 244508
51625 244508 240853 237837 235839 234617 233605 232328 230534 228286 226021 224331 223500 223233 222830 221663 219671
51610 219671 217447 215681 214503 213533 212634 212204 212498 212939 212495 210716 208137 205737 204212 203668 203706 203716 203303
51593 203303 202588 202072 202167 202890 203971 205217 206747 208913 211865 215115 217668 218870 219206 220119 222905 227779
51577 227779 233983 240638 247328 254035 260834 267789 274922 282136 289308 296502 303806 310740 316178 319317
51563 319317 320574 320977 320757 319169 315759 311126 306099 300780 294950 288978 283693 279552 276415 273972 271994
51548 271994 270310 269034 268687 269678 271718 274114 276570 279389 283042 287886 294076 301273 308535 314987 320585
51533 320585 325817 330860 335492 339709 343756 347530 350540 352554 353784 354343 354060 353029 351795 350782 349983
51518 349983 349407 349402 350180 351405 352537 353389 354158 355125 356473 358141 359700 360620 360733 360207 359067 357161 354654
51501 354654 352050 349503 346525 342672 338131 333322 328294 322930 317434 312224 307527 303464 300317 298238
51487 298238 296755 295025 292656 290032 287745 286021 284740 283718 282818 281938 281118 280615 280717 281494 282791 284450
51471 284450 286408 288559 290729 292984 295829 299812 304809 309928 314273 317748 321100 325282 330782 337283
51457 337283 343898 349962 355713 361996 369213 376884 384362 391541 398589 405444 412031 418572 425068 430697
51443 430697 434431 436220 437000 437542 437866 437826 437596 437242 436309 434290 431408 428677 427207 427448 428964 430865
51427 430865 432520 433891 435170 436332 437180 437564 437298 436085 433844 430893 427445 423157 417648 411214 404543
51412 404543 397921 391318 385110 379930 375775 371889 367806 363900 360724 358278 356249 354552 353276 352337
51398 352337 351409 350123 348345 346381 344859 344105 343735 343160 342329 341607 341154 340918 341102 341989 343372 344766 346127
51381 346127 347607 348591 347841 344893 340645 336221 331830 327120 321993 316569 310757 304362 297401 289992 282163
51366 282163 274004 265742 257503 249315 241443 234221 227394 220150 212195 204400 197961 193224 189636 186574
51352 186574 183831 181444 179344 177224 174751 172050 169862 168854 168847 169086 169175 169195 169041 168367 167347 166706 166682
51335 166682 166539 165466 163462 161066 158744 156857 155700 155217 155135 155569 156919 158942 160651 161562 162328 163657
51319 163657 165277 166624 167894 169621 171648 173397 174887 176737 179270 182318 185831 190115 195362 201416
51305 201416 208008 214881 221657 227879 233219 237613 241278 244600 247722 250222 251600 252061 252252 252130 250784
51290 250784 247682 243440 238996 234729 230762 227295 224007 219874 214445 208775 204258 201010 198224 195591
51276 195591 193326 191089 188042 184019 179753 175853 172255 168725 165173 161463 157571 154001 151412 149811
51262 149811 148689 147863 147453 147069 145898 143781 141503 139733 138312 136862 135527 134789 134984 136253 138450
51247 138450 140794 142097 141806 140607 139690 139637 140243 141151 142285 143734 145468 147230 148641 149477 149775 149676 149202
51230 149202 148369 147390 146559 145988 145636 145479 145440 145269 144792 144200 143754 143290 142349 140803 139072 137703 136991 136957
51212 136957 137389 137881 138129 138236 138521 139073 139762 140571 141602 142741 143671 144266 144667 144882 144617 143686 142441 141592
51194 141592 141594 142265 142984 143369 143732 144700 146332 147867 148545 148409 148077 147975 148161 148664 149515 150412 150800 150451 149715
51175 149715 149079 148624 148003 146863 145167 143140 140988 138850 137089 136355 136980 138373 139528 140149 140810 141847
51159 141847 142693 142659 141901 141152 140851 140957 141348 141915 142470 142904 143247 143286 142509 140818 138954 137698 136905 135840
51141 135840 134224 132381 130597 128975 127831 127613 128336 129452 130339 130705 130630 130527 130784 131156 130837 129570 128297
51124 128297 128134 129001 129977 130733 131821 133642 135930 138363 140953 143674 146298 148791 151389 154069 156389
51109 156389 157954 158666 158435 157147 155030 152685 150619 149043 148047 147548 147065 146067 144635 143356 142514 141841
51093 141841 141124 140594 140576 141177 142368 143959 145502 146726 148107 150301 152812 153946 152637 149899 147863
51078 147863 147606 148461 149347 150114 151246 152757 153960 154411 154534 154975 155727 156464 157433 159216 161544 163255 163748
51061 163748 163664 163664 163405 162450 161380 160980 160946 160497 159861 159987 161034 162362 163911 166251 169131 171270 172041 172248
51043 172248 172745 173302 173475 173770 175160 177993 181965 186678 191634 196123 199734 202736 205565 208214 210423
51028 210423 212089 213162 213544 213448 213432 213638 213356 211858 209419 207100 205642 204953 204530 204050 203524 203072 202574
51011 202574 201601 199956 198266 197678 198773 200985 203203 204732 205674 206716 208604 211511 214812 217773 220421
50996 220421 223363 226841 230569 234522 239179 244694 250494 256155 262164 269284 277491 286057 294531 303141
50982 303141 312336 322342 333243 345177 358307 372622 387922 404168 421922 442205 465727 492453
50970 492453 522191 555264 592125 632518 675642 721171 769565 821358 876661 935394 997392
50959 997392 1062114 1128655 1196068 1263287 1328828 1391258 1449971 1504832 1554965 1598703 1635042
50948 1635042 1664476 1688053 1706226 1719056 1727001 1731044 1732404 1732421 1732334 1732868 1734372 1737441 1742773 1750109
50934 1750109 1757820 1763928 1767077 1766332 1760657 1749184 1731607 1707902 1677931 1641543 1598728 1549456
50922 1549456 1493843 1432762 1367922 1301114 1233696 1166812 1101418 1037906 976439 917916 863818
50911 863818 814713 769771 728325 691098 659089 631910 608129 586817 567831 550963 535778
50900 535778 522340 511266 502931 497024 492856 489724 487168 485258 484514 485066 486062 486315 485445 484097 483211
50885 483211 483366 484567 486289 487963 489708 492299 496066 500296 504160 507881 512390 518132 524859 532443
50871 532443 541230 551508 563108 575641 588885 602954 618281 635346 654332 675198 698172 723759
50859 723759 752151 783157 817109 855316 899125 948935 1004635 1066636 1135859 1212956 1298151
50848 1298151 1391683 1493874 1604834 1724538 1852986 1989832 2133897 2283370 2436235 2590117
50838 2590117 2741932 2888127 3025245 3150063 3259691 3352078 3426361 3482500 3520885 3542703
50828 3542703 3550294 3546677 3534974 3518610 3501484 3487246 3478471 3476930 3484082 3500487 3524845 3554106
50816 3554106 3584252 3610578 3627875 3631561 3618812 3588219 3538643 3469250 3380448 3273818 3151066
50805 3151066 3013818 2864572 2707015 2545127 2382496 2222559 2068686 1923495 1788447
50796 1788447 1664367 1551994 1451698 1363041 1284957 1216359 1156530 1105188 1062277 1027516 1000090
50785 1000090 978862 962802 951065 942828 937405 934473 933877 935124 937202 938880 939155 937636 934634 930650
50771 930650 925673 919260 911328 902359 892642 881968 870465 859032 848246 837369 825269 812069
50759 812069 799153 787702 777917 769422 761726 754440 747847 743275 742220 745048 751014 759426 770172
50746 770172 783282 798778 817013 838490 863212 890743 920968 954363 991537 1033065 1079664
50735 1079664 1131944 1189935 1253347 1322234 1396881 1477244 1563078 1654341 1750580 1849939 1949632
50724 1949632 2047485 2142286 2232625 2316388 2391612 2456949 2510931 2551593 2577390 2587984 2583875
50713 2583875 2565956 2535957 2496796 2451999 2405028 2359247 2317864 2283267 2256650 2238417 2228578
50702 2228578 2226515 2230924 2240238 2252562 2264888 2273037 2273021 2262282 2239369 2203085 2152744 2089023 2013874
50689 2013874 1929526 1838046 1741822 1643985 1547965 1456588 1371559 1293625 1223041 1159844 1103809
50678 1103809 1054518 1011763 975693 946326 923116 905377 892952 886009 884388 887699 895992 909596
50666 909596 928175 950483 975239 1001616 1028731 1055387 1080779 1104996 1128259 1150011 1169260
50655 1169260 1185658 1199834 1212733 1224973 1236760 1248120 1259082 1269713 1280089 1290415 1301366
50644 1301366 1314197 1330167 1349806 1372956 1399504 1429747 1464054 1502560 1545327 1592441 1643697
50633 1643697 1698318 1755067 1812517 1869278 1924136 1975946 2023278 2064457 2098363 2125037 2145096
50622 2145096 2158766 2166023 2167608 2165178 2160407 2154583 2149272 2146699 2148908 2156768 2169951 2187532 2208333
50609 2208333 2231007 2254175 2276536 2296886 2314257 2328017 2337549 2341798 2339401 2329233 2310565 2282880
50597 2282880 2245945 2200016 2145562 2082875 2012515 1936084 1855990 1774335 1692506 1611804 1533683
50586 1533683 1459129 1388337 1321307 1258344 1199781 1145669 1096003 1050846 1010069 973313 940389
50575 940389 911356 886077 864116 845161 829147 815880 805022 796541 790739 787803 787835 791286 798562
50562 798562 808966 820786 832843 845495 859858 876691 896293 918764 943780 970607 998927
50551 998927 1029364 1062782 1099370 1138692 1180231 1223464 1267672 1312079 1355977 1398658 1439593
50540 1439593 1478881 1517072 1554270 1589904 1623709 1656528 1689837 1724840 1762205 1802208 1844890
50529 1844890 1890536 1940271 1995600 2057036 2123778 2195192 2272004 2355515 2446045 2542659 2643836
50518 2643836 2747771 2852358 2955566 3055669 3150680 3237885 3314487 3378497 3428580 3463415
50508 3463415 3481864 3483554 3468709 3437493 3390158 3327863 3252903 3168106 3076400 2980991 2885505
50497 2885505 2793616 2708529 2632805 2568661 2518278 2483501 2464891 2461272 2470659 2491534 2522641 2561607
50485 2561607 2604459 2646575 2683538 2710974 2724634 2721247 2698944 2656788 2594797 2514876 2420829
50474 2420829 2316746 2205804 2090876 1975265 1861935 1752660 1648678 1551512 1462290 1380883
50464 1380883 1306675 1239718 1180174 1127199 1079572 1037167 1000647 969812 943426 920738 902102
50453 902102 887869 877565 870475 866308 864998 866397 870448 877128 886163 897231 910447 926061 943711
50440 943711 962620 982641 1004417 1028407 1054346 1081843 1110860 1141350 1173000 1205631 1239351
50429 1239351 1274054 1309207 1344402 1379689 1415023 1449843 1483524 1515921 1547047 1576431 1603322
50418 1603322 1627570 1649996 1671733 1693349 1714726 1735758 1756915 1779000 1802528 1827732 1855086
50407 1855086 1885232 1918112 1952614 1987526 2022522 2057817 2093116 2127357 2159286 2187769 2211703
50396 2211703 2230122 2242329 2247555 2244671 2232704 2211482 2181227 2141627 2091975 2032358 1964199 1889597
50384 1889597 1810658 1729589 1648833 1570657 1496867 1429056 1368826 1317412 1275307 1242498 1219010
50373 1219010 1204972 1200141 1203502 1213531 1228912 1248802 1272034 1296088 1317320 1332537 1340168 1339849
50361 1339849 1331382 1314554 1289624 1257503 1219615 1177904 1134561 1091115 1047930 1005105 963746
50350 963746 925661 891745 861196 832544 805115 779421 756428 736609 719540 704388 690794
50339 690794 679117 669668 662082 655728 650445 646453 643838 642641 643239 646050 650938 657449 665498 675281
50325 675281 686581 698767 711604 725444 740496 756343 772396 788515 805042 822467 841133
50314 841133 860984 881549 902412 923704 945928 969371 993824 1018642 1042832 1065374 1085904
50303 1085904 1104886 1122698 1138851 1152662 1164409 1175060 1184883 1192995 1198346 1200543 1199639 1195825 1189613
50290 1189613 1181782 1172879 1163025 1152270 1140676 1127895 1113150 1095875 1076146 1054468 1031558 1008341
50278 1008341 985656 963719 942162 920688 899410 878547 858211 838587 819886 802071 784994
50267 784994 768871 754206 741152 729399 718764 709429 701407 694272 687758 682248 678416 676555 676448
50254 676448 677630 679593 681943 684539 687528 691233 696125 702626 710582 719086 727204 734799 742183 749140
50240 749140 754937 759394 763211 766900 769947 771438 771205 769876 768013 765572 762202 757826 752825 747661
50226 747661 742416 736803 730682 724337 718090 711921 705802 700186 695742 692687 690712 689497 688971 689164 690121
50211 690121 691879 694229 696723 699269 702451 706809 712027 717320 722380 727345 732120 736398 740199 743639
50197 743639 746290 747543 747592 747223 746605 745087 742322 738699 734441 729072 722220 714355 706315 698576 691204
50182 691204 683951 676151 667094 656827 646135 635532 624823 613835 602890 592299 582056 572392
50170 572392 564018 557375 552194 548145 545329 543744 542922 542583 543056 544446 545875 546235 545288 543427 540701
50155 540701 536784 531694 525905 519759 513258 506396 499353 492423 486035 480678 476431 472632 468371 463306
50141 463306 457881 452803 448465 444734 441163 437511 434070 431305 429214 427380 425739 424853 425291 427036 429626
50126 429626 432535 435312 437731 440020 442663 445842 449363 453059 456903 460781 464688 469159 474809 481352
50112 481352 487740 493508 499233 505354 511318 516381 520607 524509 528181 531373 534053 536372 538336 539859
50098 539859 540830 540966 540157 539216 539518 541439 543844 545746 547721 550889 555169 559624 564170 569823 577255
50083 577255 586025 595312 604630 613714 622498 631471 641444 652617 664223 675360 685929 696598 708018
50070 708018 720246 732767 744995 756711 768038 779083 789840 800422 810992 821321 830871 839603
50058 839603 848331 857905 868272 878662 888438 897499 906107 914680 923565 932731 941807 950550 959018 967164
50044 967164 974673 981367 987336 992446 996225 998590 1000110 1001136 1001130 999356 995743 990600 983971 975946 967252
50029 967252 958811 950836 942821 934215 924719 914297 903468 893279 884398 876494 869002 862105 856334
50016 856334 851600 847378 843636 840804 838979 837939 837864 839293 842353 846678 852092 858785 866781 875840 885883
50001 885883 897014 909142 922077 935887 950615 965838 981183 997230 1015232 1035939 1059263
49990 1059263 1084963 1112745 1141601 1169874 1196291 1220294 1241172 1257588 1268409 1273581 1273983 1270912
49978 1270912 1266013 1261181 1258088 1257873 1261209 1268013 1276856 1285216 1290771 1292156 1288325 1277739 1258776 1230767
49964 1230767 1194425 1151459 1104044 1054406 1004511 956023 910368 868479 830380 795403 763031
49953 763031 733336 706513 682377 660508 640549 622060 604434 587313 570973 556012 542681
49942 542681 530711 519666 509273 499460 490322 482086 474951 468862 463468 458380 453545 449339 446175
49929 446175 443990 442278 440662 439216 438126 437296 436524 435830 435315 434947 434777 435151 436182 437181 437204 436271 435619
49912 435619 436432 438689 441442 443951 446201 448417 450462 451950 452949 454282 456770 460235 463628 466324 468904
49897 468904 472363 476941 482187 487831 493975 500597 507574 515309 524683 536046 548624 561274 573642
49884 573642 586439 600781 617526 637106 659711 685483 714539 747007 783244 824024 870116
49873 870116 921368 976357 1033182 1090407 1146996 1201648 1252792 1299313 1340971 1378114 1411417
49862 1411417 1442016 1471548 1501690 1533587 1567625 1603453 1639969 1675215 1706432 1730560 1745051
49851 1745051 1748452 1740302 1720785 1690825 1652264 1607241 1557138 1502642 1444909 1385967 1327504 1269904
49839 1269904 1213002 1157265 1103525 1051984 1002377 954962 910599 869773 832139 797165 764712
49828 764712 734901 707766 683125 660581 639714 620439 603033 587617 573964 561996 551931
49817 551931 543456 535342 526580 517522 509191 501859 495113 488941 483627 478758 473457 467823 463105 460108
49803 460108 458235 456444 454443 452555 451073 450139 449708 449222 447807 445198 442108 439360 437050 434897 433003
49788 433003 431808 431424 431427 431307 431000 430891 431267 431751 431646 430994 430876 432171 434355 436160 437185 438133 439589
49771 439589 441494 443893 447298 451875 456889 461472 465636 470207 476068 483653 492940 503737 516142 530666
49757 530666 547705 567057 588382 612060 639155 670700 707312 749089 795056 842831 889689
49746 889689 934070 975526 1013390 1046410 1073719 1095377 1111917 1124314 1134526 1145108 1157860
49735 1157860 1173387 1191867 1213134 1235678 1256550 1272750 1282016 1282176 1271093 1248147 1214992 1174140
49723 1174140 1127467 1076639 1023980 971888 921860 874858 831996 793938 760106 729440 701698
49712 701698 677233 655800 636540 619060 603771 591042 580628 571927 564335 557300 550523 544174
49700 544174 538707 534483 531659 530174 529529 528899 527758 526291 524996 524167 523925 524344 525274 526378 527571 529007
49684 529007 530464 531336 531488 531505 531690 531473 530423 529183 528668 528811 528883 528688 528594 528606 528259 527394 526378 525519 524861
49665 524861 524544 524803 525538 526274 526618 526491 526059 525790 526387 528202 530717 532940 534232 534559 534181 533484 532856
49648 532856 532296 531298 529495 527236 525145 523360 521668 520198 519354 519187 519338 519627 520207 521123 522124 523048
49632 523048 524070 525407 526988 528527 529887 531314 533194 535444 537319 538195 538428 538927 539923 540852 541609 543018
49616 543018 545644 548919 552104 555429 559520 564214 568872 573500 578644 584342 589996 595329 600808 607107
49602 607107 614676 623742 634141 645166 656058 666680 677382 688432 699997 712402 725872 740191
49590 740191 755136 770951 787854 805404 823106 841403 861268 882983 906111 930498 956420
49579 956420 983814 1012439 1042856 1076146 1112246 1149557 1186738 1224123 1262795 1302996 1344212
49568 1344212 1386232 1429293 1473461 1518702 1565442 1614261 1664898 1716188 1767273 1818393 1870080
49557 1870080 1921863 1972331 2020478 2066490 2110936 2153493 2192891 2227933 2258078 2283117 2302787
49546 2302787 2316938 2325605 2328704 2326087 2318142 2305887 2290162 2271157 2249113 2225049 2200267 2175449
49534 2175449 2150765 2126621 2103819 2083187 2065466 2051291 2040736 2033123 2027848 2025230 2026043 2030456
49522 2030456 2038071 2048813 2063135 2081327 2103210 2128471 2156771 2187556 2220274 2254788 2291079
49511 2291079 2328559 2366160 2403002 2438511 2471988 2502668 2530123 2554058 2573676 2587863 2596007
49500 2596007 2598140 2594224 2583869 2566781 2542980 2512507 2475472 2432494 2384668 2333003 2278187 2220753
49488 2220753 2161011 2098950 2034836 1969828 1905430 1842355 1780557 1720265 1662197 1606723 1553603
49477 1553603 1502722 1454380 1408670 1365219 1323774 1284403 1246990 1211141 1176815 1144394 1113984
49466 1113984 1085259 1058210 1033260 1010385 988863 968250 948939 931435 915780 902058 890618
49455 890618 881210 872582 863621 854495 846075 838703 832036 825686 819421 813071 806758 800907 795589 790272
49441 790272 784684 779531 775837 773900 773359 773862 775136 776870 779127 782507 787221 792454 797356 802318 808467
49426 808467 816272 825546 836574 850194 866949 887396 913009 944903 980556 1013083 1035311 1044645
49414 1044645 1043565 1036281 1026146 1015736 1007363 1002343 1000425 1000776 1003285 1008373 1015868 1024759 1034124 1043839
49400 1043839 1054325 1065994 1079035 1093304 1108175 1122740 1136352 1148905 1160520 1171230 1181139
49389 1181139 1190642 1200170 1209773 1219139 1227997 1236421 1244759 1253271 1261756 1269623 1276590 1283315 1290902 1299714
49375 1299714 1309080 1318346 1327801 1338223 1349958 1362864 1376786 1391633 1407250 1423710 1441547 1461238
49363 1461238 1482653 1505371 1529272 1554350 1580307 1606975 1634867 1664630 1696145 1728840 1762768
49352 1762768 1798607 1836724 1877056 1919835 1965461 2013535 2063000 2113591 2166262 2221760 2279570
49341 2279570 2338781 2399365 2461992 2527139 2594964 2665600 2738983 2814655 2892185 2971474 3052272
49330 3052272 3133800 3215349 3296942 3378895 3461027 3542777 3623862 3704262 3783641 3861113 3935490
49319 3935490 4005481 4069883 4128027 4179868 4225330 4263711 4294097 4316233 4330638 4337961 4338565 4332667
49307 4332667 4320531 4302554 4279389 4252082 4221908 4190143 4158025 4126729 4097091 4069401 4043666
49296 4043666 4020090 3999172 3981430 3967140 3956356 3949107 3945564 3945991 3950391 3958283 3969038 3982458
49284 3982458 3998950 4019159 4043547 4072090 4104084 4138362 4174017 4210742 4248119 4284922 4319755
49273 4319755 4352153 4382169 4408912 4430414 4445245 4453369 4455061 4449863 4437196 4417175 4389998 4355163
49261 4355163 4312224 4262058 4206484 4146782 4083288 4016320 3946701 3875280 3802629 3729372 3656321
49250 3656321 3584053 3512775 3442776 3374815 3309756 3247900 3188745 3131477 3075841 3022561 2972769
49239 2972769 2926965 2884783 2845725 2809626 2776174 2744479 2713636 2683507 2654572 2627229 2601600
49228 2601600 2577756 2555592 2534549 2513918 2493503 2473763 2455327 2438616 2423727 2410428 2398285
49217 2398285 2386994 2376556 2366980 2358020 2349349 2340760 2331977 2322585 2312429 2301826 2291137 2280366
49205 2280366 2269507 2258862 2248584 2238232 2227442 2216832 2207601 2200191 2193949 2188220 2183171 2179299
49193 2179299 2176556 2174405 2172611 2171664 2172294 2174634 2177964 2181427 2184955 2189208 2194531 2200352 2205834 2210846
49179 2210846 2215904 2221480 2227813 2235243 2244183 2254743 2266785 2280399 2295876 2313111 2331423 2350196
49167 2350196 2369412 2389303 2409702 2430120 2450589 2472106 2495940 2522475 2551017 2580919 2612525
49156 2612525 2646602 2683031 2720665 2758580 2796921 2836324 2877011 2918771 2961375 3004601 3048280
49145 3048280 3092725 3138847 3187351 3237925 3289424 3340474 3389587 3435265 3476781 3514813 3550793
49134 3550793 3585638 3619447 3652107 3683590 3713860 3743090 3771874 3800557 3828416 3854234 3877822
49123 3877822 3900194 3922016 3942562 3960685 3976306 3990334 4003432 4015478 4026164 4035610 4044294 4052748
49111 4052748 4061430 4070595 4080063 4089321 4098065 4106596 4115467 4124835 4134413 4144051 4154030 4164631 4175778
49098 4175778 4187387 4199695 4212713 4225604 4237304 4247840 4258503 4270491 4283841 4297820 4311850
49087 4311850 4325771 4339710 4354062 4369295 4385391 4401767 4418017 4434397 4451271 4468465 4485508
49076 4485508 4502232 4518656 4534595 4549790 4564225 4577881 4590378 4601283 4610622 4618659 4625290 4630013
49064 4630013 4632431 4632488 4630295 4626033 4619975 4612331 4603111 4592216 4579537 4564853 4547993 4529164 4508791
49051 4508791 4486838 4462775 4436475 4408696 4380333 4351656 4322627 4293416 4264054 4234108 4203404
49040 4203404 4172746 4143259 4115265 4088412 4062597 4038107 4015082 3993540 3973762 3955964 3939783
49029 3939783 3924768 3911213 3899810 3890595 3882994 3876896 3872904 3871441 3872323 3875297 3880363 3887365 3895819
49016 3895819 3905314 3915635 3926460 3937463 3948777 3960754 3973204 3985359 3996690 4007234 4017027 4025830
49004 4025830 4033615 4040724 4047285 4052845 4056773 4058687 4058345 4055573 4050452 4043249 4034059 4022885 4010033 3995941
48990 3995941 3980528 3963200 3943696 3922475 3900130 3876846 3852583 3827395 3801347 3774420 3746646
48979 3746646 3718003 3688090 3656235 3622135 3586201 3549275 3512220 3475631 3439516 3403280 3366462
48968 3366462 3329499 3293397 3258675 3225137 3192647 3161518 3132018 3103981 3077240 3052134 3029448
48957 3029448 3009950 2993902 2980675 2969028 2958257 2948960 2942170 2937902 2935175 2933418 2933126 2935054 2939510
48944 2939510 2946576 2956325 2968442 2982157 2996815 3012152 3028001 3044303 3061507 3080307 3100826 3122594
48932 3122594 3145494 3170027 3196484 3224559 3254055 3285217 3318045 3351949 3386464 3421647 3457348
48921 3457348 3492896 3528015 3563373 3599595 3636425 3673588 3711821 3752057 3793961 3836320 3878826
48910 3878826 3922612 3968795 4017264 4067183 4118173 4170575 4224783 4280690 4337829 4395891 4454912
48899 4454912 4514961 4575825 4637280 4699512 4762819 4826874 4890711 4953606 5015617 5077089 5138011
48888 5138011 5198092 5257103 5314817 5370767 5424323 5474846 5521748 5564594 5603236 5637599 5667388
48877 5667388 5692297 5712455 5728137 5739047 5744433 5743987 5738059 5726844 5710015 5687463 5659848 5628016
48865 5628016 5592323 5552823 5509728 5463353 5414017 5362236 5308623 5253399 5196437 5137995 5078776
48854 5078776 5019055 4958420 4896761 4834813 4773269 4712027 4651018 4591144 4533584 4478502 4425231
48843 4425231 4373476 4323643 4276140 4230980 4188039 4147162 4108079 4070634 4035083 4001821 3970913
48832 3970913 3942128 3915198 3889788 3865592 3842818 3822181 3803922 3787231 3771280 3756535 3744351
48821 3744351 3735425 3729286 3725340 3723718 3724904 3728977 3735475 3743799 3753692 3765471 3779654 3796238 3814448
48808 3814448 3833502 3853458 3875124 3899326 3926448 3956430 3988774 4022706 4057666 4093625 4130772
48797 4130772 4169028 4208019 4247264 4286250 4324605 4362446 4400248 4438151 4475729 4512635 4549093
48786 4549093 4585398 4621377 4656716 4691428 4725576 4758898 4791193 4822760 4854020 4884985 4915528
48775 4915528 4945774 4975771 5005035 5032906 5059123 5083686 5106504 5127566 5147018 5164533 5179009
48764 5179009 5189432 5195690 5197990 5195946 5188934 5176901 5160074 5138229 5111132 5079352 5043755 5004336
48752 5004336 4960577 4912895 4862671 4810734 4756729 4700225 4641641 4581762 4521086 4460062 4399433
48741 4399433 4339981 4282331 4227113 4174879 4125649 4079071 4035262 3995151 3959832 3929900 3905344
48730 3905344 3885588 3869626 3856759 3847431 3842792 3843196 3847581 3854551 3863590 3874919 3888614 3904307 3921481
48717 3921481 3939669 3958460 3977518 3996625 4015629 4034495 4053381 4072552 4092143 4112151 4132495
48706 4132495 4152966 4173265 4193236 4212861 4231814 4249410 4265418 4280627 4296124 4312318 4329199
48695 4329199 4347163 4366770 4387814 4409509 4431767 4455634 4482329 4512473 4546339 4584155 4625873
48684 4625873 4671185 4720062 4772973 4830474 4892973 4960803 5033878 5111202 5191398 5273928 5359184
48673 5359184 5447201 5536965 5627282 5717615 5807527 5895733 5980173 6058773 6129897 6192484 6246135
48662 6246135 6290790 6325947 6350396 6362836 6362501 6349158 6322952 6284519 6234790 6174553 6104599 6026386
$$ [...]
##END NTUPLES=NMR SPECTRUM
##END=
