
##TITLE=AC1311_NICAH12127_6535123_V7cxmZSgqr
##JCAMPDX= 6.0         $$ Bruker NMR JCAMP-DX V2.0
##DATA TYPE= NMR SPECTRUM
##DATA CLASS= NTUPLES
##ORIGIN= BRUKER
##OWNER= Administrator
$$ 1.72 TOPSPIN		Version 2.1
$$ 2012-07-16 23:51:08.703 -0500  Administrator@TOPSPIN
$$ Compression mode = diff/dup
##.OBSERVE FREQUENCY= 400.02188249412
##.OBSERVE NUCLEUS= ^1H
##.ACQUISITION MODE= SIMULTANEOUS (DQD)
##.ACQUISITION SCHEME= undefined
##.AVERAGES= 8
##.DIGITISER RES= 22
##SPECTROMETER/DATA SYSTEM= spect
##.PULSE SEQUENCE= zg30
##.SOLVENT NAME= COFFEE_meoh
##.SHIFT REFERENCE= INTERNAL, COFFEE_meoh, 1, 14.98509
##AUDIT TRAIL= $$ (NUMBER, WHEN, WHO, WHERE, PROCESS, VERSION, WHAT)
$$ ##TITLE= Audit trail, TOPSPIN		Version 2.1
$$ ##JCAMPDX= 5.01
$$ ##ORIGIN= Bruker BioSpin GmbH
$$ ##OWNER= Administrator
$$ $$ C:\Bruker\TOPSPIN/data/COFFEE/nmr/AC1311_NICAH12127_6535123_V7cxmZSgqr/10/pdata/1/auditp.txt
$$ ##AUDIT TRAIL=  $$ (NUMBER, WHEN, WHO, WHERE, PROCESS, VERSION, WHAT)
(   1,<2012-07-16 23:51:01.484 -0500>,<Administrator>,<TOPSPIN>,<go>,<TOPSPIN 2.1>,
      <created by zg
	started at 2012-07-16 23:49:54.578 -0500,
	POWCHK enabled, PULCHK disabled,
       configuration hash MD5:
       6B 1B 68 BB D9 2E 58 E2 7F 35 AD 54 07 DF 0E 41
       data hash MD5: 64K
       A2 6B 89 23 61 F6 03 33 CC 3C 90 C2 1E 4E 22 59>)
(   2,<2012-07-16 23:51:04.453 -0500>,<Administrator>,<TOPSPIN>,<proc1d>,<TOPSPIN 2.1>,
      <Start of raw data processing
       efp LB = 0 FT_mod = 6 PKNL = 1 PHC0 = 0 PHC1 = 0 SI = 32K 
       data hash MD5: 32K
       B2 85 5E 70 1C CB 03 4E 8E C0 D5 0D A6 98 6F 09>)
(   3,<2012-07-16 23:51:04.843 -0500>,<Administrator>,<TOPSPIN>,<proc1d>,<TOPSPIN 2.1>,
      <pk PHC0 = 182.7905 PHC1 = 0 
       data hash MD5: 32K
       DA E3 46 D5 36 57 38 08 C8 8F 75 E2 86 6F 9E CC>)
(   4,<2012-07-16 23:51:04.906 -0500>,<Administrator>,<TOPSPIN>,<proc1d>,<TOPSPIN 2.1>,
      <abs ABSG = 1 
       data hash MD5: 32K
       F0 B2 97 7F 58 97 4E AD 3F 19 67 EA 8A 8D BA 9F>)
(   5,<2012-07-16 23:51:04.937 -0500>,<Administrator>,<TOPSPIN>,<proc1d>,<TOPSPIN 2.1>,
      <abs ABSG = 2 
       data hash MD5: 32K
       4B 24 99 81 5F FA 9D 00 5F 8C E7 BD 55 22 06 01>)
(   6,<2012-07-16 23:51:04.968 -0500>,<Administrator>,<TOPSPIN>,<proc1d>,<TOPSPIN 2.1>,
      <abs ABSG = 3 
       data hash MD5: 32K
       E7 87 0C D7 9D E7 9E 29 5D 48 87 5C B2 87 FC E2>)
(   7,<2012-07-16 23:51:05.000 -0500>,<Administrator>,<TOPSPIN>,<proc1d>,<TOPSPIN 2.1>,
      <abs ABSG = 4 
       data hash MD5: 32K
       7E 92 F8 31 0A F7 43 31 C7 18 1B 24 E7 6B 97 82>)
(   8,<2012-07-16 23:51:05.031 -0500>,<Administrator>,<TOPSPIN>,<proc1d>,<TOPSPIN 2.1>,
      <abs ABSG = 5 
       data hash MD5: 32K
       D3 DD A0 C4 E9 8B EF 3C 15 82 61 4C 01 AF 6E C1>)
$$ ##END=
$$ 
$$ $$ hash MD5
$$ $$ 79 98 D7 70 E3 7A 56 93 55 70 A0 43 A8 33 B3 A9
##$RELAX= 
##$RELAX= 
##$RELAX= 
##$RELAX= 
##$RELAX= 
##$RELAX= 
##$RELAX= 
$$ Bruker specific parameters
$$ --------------------------
$$ [...]
##$TP= (0..7)
150 150 150 150 150 150 150 150
##$TP07= 0
##$TPNAME0= <>
##$TPNAME1= <>
##$TPNAME2= <>
##$TPNAME3= <>
##$TPNAME4= <>
##$TPNAME5= <>
##$TPNAME6= <>
##$TPNAME7= <>
##$TPOAL= (0..7)
0.5 0.5 0.5 0.5 0.5 0.5 0.5 0.5
##$TPOFFS= (0..7)
0 0 0 0 0 0 0 0
##$TUNHIN= 0
##$TUNHOUT= 0
##$TUNXOUT= 0
##$USERA1= <user>
##$USERA2= <user>
##$USERA3= <user>
##$USERA4= <user>
##$USERA5= <user>
##$V9= 5
##$VALIST= <valist>
##$VCLIST= <CCCCCCCCCCCCCCC>
##$VD= 0
##$VDLIST= <DDDDDDDDDDDDDDD>
##$VPLIST= <PPPPPPPPPPPPPPP>
##$VTLIST= <TTTTTTTTTTTTTTT>
##$WBST= 2048
##$WBSW= 25
##$XGAIN= (0..3)
0 0 0 0
##$XL= 0
##$YL= 0
##$YMAX_a= 509851
##$YMIN_a= -655232
##$ZGOPTNS= <>
##$ZL1= 120
##$ZL2= 120
##$ZL3= 120
##$ZL4= 120
##$ABSF1= 14.98509
##$ABSF2= -5.573092
##$ABSG= 5
##$ABSL= 3
##$ALPHA= 0
##$AQORDER= 0
##$ASSFAC= 0
##$ASSFACI= 0
##$ASSFACX= 0
##$ASSWID= 0
##$AUNMP= <proc_prof1d_extract_pilot.lims>
##$AXLEFT= 0
##$AXNAME= <>
##$AXNUC= <1H>
##$AXRIGHT= 0
##$AXTYPE= 0
##$AXUNIT= <>
##$AZFE= 0.1
##$AZFW= 0.1
##$BCFW= 0
##$BC_mod= 0
##$BYTORDP= 0
##$COROFFS= 0
##$CY= 15
##$DATMOD= 1
##$DC= 0
##$DFILT= <>
##$DTYPP= 0
##$F1P= 0
##$F2P= 0
##$FCOR= 0.5
##$FTSIZE= 32768
##$FT_mod= 6
##$GAMMA= 0
##$GB= 0
##$INTBC= 1
##$INTSCL= 1
##$ISEN= 128
##$LB= 0
##$LEV0= 0
##$LPBIN= 0
##$MAXI= 10000
##$MC2= 0
##$MEAN= 0
##$ME_mod= 0
##$MI= 0
##$NCOEF= 0
##$NC_proc= -8
##$NLEV= 6
##$NOISF1= 0
##$NOISF2= 0
##$NSP= 0
##$NTH_PI= 0
##$NZP= 0
##$OFFSET= 14.98509
##$PC= 1
##$PHC0= 182.7905
##$PHC1= 0
##$PH_mod= 1
##$PKNL= yes
##$PPARMOD= 0
##$PPDIAG= 0
##$PPIPTYP= 0
##$PPMPNUM= 2147483647
##$PPRESOL= 1
##$PSCAL= 4
##$PSIGN= 0
##$PYNMP= <proc.py>
##$REVERSE= no
##$SF= 400.02
##$SI= 32768
##$SIGF1= 0
##$SIGF2= 0
##$SINO= 400
##$SIOLD= 32768
##$SPECTYP= <>
##$SREGLST= <1H.CDCl3>
##$SSB= 0
##$STSI= 32768
##$STSR= 0
##$SW_p= 8223.68421052631
##$SYMM= 0
##$S_DEV= 0
##$TDeff= 65536
##$TDoff= 0
##$TI= <>
##$TILT= no
##$TM1= 0
##$TM2= 0
##$TOPLEV= 0
##$USERP1= <user>
##$USERP2= <user>
##$USERP3= <user>
##$USERP4= <user>
##$USERP5= <user>
##$WDW= 1
##$XDIM= 32768
##$YMAX_p= 464793475
##$YMIN_p= -667578
##$CURPLOT= <Network HP LaserJet P1505>
##$CURPRIN= <$Network HP LaserJet P1505>
##$DFORMAT= <normdp>
##$LAYOUT= <+/1D_H.xwp>
##$LFORMAT= <normlp>
##$PFORMAT= <normpl>
##$SURQMSG= 1
$$ End of Bruker specific parameters
$$ ---------------------------------
##NTUPLES= NMR SPECTRUM
##VAR_NAME=  FREQUENCY,     SPECTRUM/REAL,   SPECTRUM/IMAG
##SYMBOL=    X,             R,               I
##VAR_TYPE=  INDEPENDENT,   DEPENDENT,       DEPENDENT
##VAR_FORM=  AFFN,          ASDF,            ASDF
##VAR_DIM=   32768,         32768,           32768
##UNITS=     HZ,            ARBITRARY UNITS, ARBITRARY UNITS
##FACTOR=    0.250966925370066, 1,           1
##FIRST=     8223.43324360094, -151781,      173987
##LAST=      0,             219977,          5796
##MIN=       0,             -667578,         0
##MAX=       8223.43324360094, 464793475,    0
$$ Real data points
##PAGE= N=1
##DATA TABLE= (X++(R..R)), XYDATA
$$ [...]
19559H0550P977a46249f6961E4183i7578C9120a03392k39853C37065b61266l78644
19548f39910K83461a42889n9582j89115f5431A28296b0624l00429a18771c4796
19537f506n7619o0957j8120H7390b5316C1447c124n1777A24631l2471a01989B00495
19524A84450C324a20190C0842J76047b06150A86235f8343B82948a53139A2800
19513c41573n3261A3879K07115i9185l6890C6459b57760D2337r405i0490a1141
19501a37558o5765c1946m1639k28934a27173c7465C4803k690J41049D5140a35481
19489a53579m0867J2644a9161n7418C12946A40834b11327A5433d1391o9506I1194
19477a31314A68642H2788a84948C8581j6397M57J60569K93E6043J0707b7810j70778
$$ y = [80550, 88527, -146249, -66961, 54183, -97578, 39120, -103392, -343245, 337065, -261266, -639910, -356449, -142889, -202471, -391586, -65431, 128296, -20624, -321053, -118771, -34796, -6506, -64125, -125082, -143202, 87390, -25316, 31447, -3124, -54901, 124631, 92160, -101989, 200495, 184450, 3324, -120190, 30842, 206889, -206150, 186235, -68343, 282948, -153139, 12800, -341573, -394834, 13879, 220994, -99185, -136075, 36459, -257760, 42337, 32932, -90490, -11141, -137558, -203323, -31946, -73585, -302519, -127173, -37465, 34803, 32113, 173162, 45140, -135481, -153579, -194446, -181802, -19161, -76579, 312946, 140834, -211327, 15433, -41391, -110897, 91194, -131314, 168642, 82788, -184948, 38581, 22184, 22641, 183210, 183503, 56043, 66750, -27810, -198588]
19465a98588j36557f1210B87054c4187j03601H2547a1996A55814F801a02097A50015
19453b36908m412K2285B04495a59727k04512R0834J34840c0245k58008e5126B53017
19441B31946f7628b8991A33274l3324b3526C83362N0091a11241m2398A70903a27213
19429g3860o5774j26228O2421h2596A93877H6750c4471C4016a56251j09975a5645
19417C01075g1045a9281l6404A27810e3322p7875A99599c9399A39674d2511G4164
19405b11597A59548f2686l17665b5587B2005J90446a90645a2205j14341C07836
19394a68656G2370L4808a7198p2165d0442j46615d6919l46672A9441K5655b30402
19382B57737E5279g6026c2589E8414f9614K702j64806E0506a95666C72862A22199
$$ y = [-198588, -335145, -61210, 287054, -34187, -137788, 82547, -11996, 155814, 6801, -102097, 150015, -236908, -241320, -219035, 204495, -159727, -364239, -273405, -138565, -30245, -288253, -55126, 253017, 231946, -67628, -28991, 133274, 99950, -23526, 383362, 433453, -111241, -153639, 170903, -127213, -73860, -139634, -265862, -203441, -82596, 193877, 86750, -34471, 34016, -156251, -266226, -15645, 301075, -71045, -19281, -55685, 127810, -53322, -131197, 199599, -39399, 139674, -42511, 74164, -211597, 159548, -62686, -380351, -25587, 22005, 212451, -190645, -12205, -126546, 307836, -168656, 72370, 107178, -17198, -89363, -40442, -187057, -46919, -393591, 19441, 45096, -230402, 257737, 55279, -76026, -32589, 58414, -69614, -66912, -231718, 50506, -195666, 372862, 122199]
19370a52074n0738f3585l05306B232R5186d01089e0813I6276l4770d05806J08050
19359b97756P4574i1471P982k6936k6501k6003j48715A9334K0603i6254C4360
19347D4069A4069b66568A58110a6936C9655J00663a51712l4670A11978b01429
19336D2708a76911b5351j68042M8387a0489l4105C1852K11284a48667A89533I237
19324a04194p0274A38040A0009a54900a5628j1407m4320M963G6383J17007q1882
19313A11508c7594k36615a6191l404j7650G8320b99051K8851A7931a24984B40576
19301G8026a59832l4869A98297M0567F6647A9592b92277N7060k04209A01700d6739
19289c08674d2187m21531j37190f1499j56819Q9728A16343c4914r712J1592F20305
$$ y = [-152074, -202812, -63585, -368891, 2232, 97418, -401089, -50813, 96276, 61506, -405806, -297756, -223182, -91471, -83489, -110425, -136926, -162929, -311644, 19334, 39937, -96254, 34360, 44069, 14069, -266568, 158110, -16936, 39655, 140318, -151712, -186382, 111978, -201429, 42708, -176911, -25351, -193393, -145006, -10489, -44594, 31852, 243136, -148667, 189533, 9237, -104194, -174468, 138040, 10009, -154900, -15628, -27035, -71355, -66392, 76383, 193390, 111508, -37594, -274209, -16191, -19595, -37245, 78320, -299051, -270200, 17931, -124984, 240576, 78026, -159832, -194701, 198297, 238864, 66647, 19592, -292277, -235217, -439426, 101700, -46739, -308674, -42187, -463718, -600908, -61499, -218318, -128590, 116343, -34914, -44626, -33034, 620305]
19277H5177J13076i6475d3407p6216j11244F628J6805l879J156a13992q2156G249
19264A63259G7173g3135k0248H95M5268h1319C3528a58148m632A39679D9659N4684
19252A04343a56057O1849M1787o6794L583B00754J27380e926j61260m3390K4218
19241a86358g1325j04387e9221b1612j50672j0281j02970B958d1840k11006K893
19230b49953f4818B56336i3434E1603B4938f5177A53332a80792A33835a35671
19219c01730R8051J6547A3759Q4680f3459P778G5056J54699b11506i4616l02140
19208c96756P7662D7260f4579j81861C9929j6275c64485a61939L4779M9224j58069
19197b36005J2302D24277b12243A89531a13040A1645J16454n3514a30450A13239
$$ y = [85177, 198253, -96475, -43407, -119623, -230867, 6628, 23433, 19554, 20710, -113992, -196148, 7249, 163259, 77173, -73135, -93383, 895, 46163, -81319, 33528, -158148, -162780, 139679, 49659, 104343, -156057, -94208, -52421, -119215, -115632, 200754, 328134, -5926, -167186, -210576, -186358, -71325, -175712, -59221, -21612, -172284, -182565, -285535, 2958, -41840, -252846, -249953, -64818, 256336, -93434, 51603, 24938, -65177, 153332, -180792, 133835, -135671, -301730, -203679, -187132, 13759, 98439, -63459, -55681, 75056, 229755, -211506, -94616, -396756, -319094, 47260, -64579, -246440, 39929, 23654, -364485, -161939, -127160, -77936, -236005, -223703, 424277, -212243, 189531, -113040, 11645, 128099, 74585, -130450, 113239]
19186B03901a77259h268o5724D705a99915O1010p6050R4048L1451h388k46471
19175b54859f149k31833f5365g098j65961j1928A42936J39437a72457d2696F7610
19163A8902a89863J6283d5353k84031A8843c50964J50971e7774A75462a84529
19152a10836l91107a82101P1880L943A8135a64408F8703b49321J04548k53232
19142c98005h5415k8685B32464h5534B15837b26863m4401A49972c11257B22889
19131b05755h2844B70657a87169B55674b16080H5541b5085j98487O3248l8402
19121a98726A07068c874E6227Q7361D661c39062a67555Q0366k61215K2607a17649
19109b20930I1053K5646a0264G2029B3178f6920h899G5885a66150C08428F0221
$$ y = [203901, -177259, -8268, -73992, 4705, -199915, -138905, -214955, -120907, -89456, -8388, -254859, -6149, -237982, -65365, -7098, -173059, -184987, 142936, 282373, -172457, -42696, 67610, 18902, -189863, -173580, -45353, -329384, 18843, -350964, -199993, -57774, 175462, -184529, -110836, -501943, -182101, -110221, -106278, 18135, -164408, 68703, -249321, -144773, -398005, -85415, -114100, 232464, -85534, 215837, -226863, -271264, 149972, -311257, 222889, -205755, -82844, 270657, -187169, 255674, -216080, 85541, -25085, -223572, -160324, -198726, 107068, -3874, 56227, 143588, 4661, -339062, -167555, -87189, -348404, -325797, -117649, -220930, 91053, 116699, -10264, 72029, 23178, -66920, -8899, 75885, -166150, 308428, 60221]
19097d5585B91591a84904A07721L1603i6404j44537B5364c40525e0919A38331
19086b57575G8990d38379K06850e5631A06568f4884j2022n6815M0607r8682K9931
19075a61865b7313A80417a93493k2716l0950a7693j10776A24859N0417i7086l6327
19064a33413A41822b54138j44542h5686A06809Q3112A4569a35261A07353D4820
19053A27162d77988a03504A09309a0847k50320i2144A05287a99842B82470j23125
19043A59345b81963A04203J0235d3360k26033N9806o9190g9023B40710h3134P896
19032g5238C38237j06501B595J02534J9583e0669A80395J22657a03661A97484
19021I7256g3417E922J1449L1547a44693I2077d3923B6803a64879p2255C14600
$$ y = [-45585, 291591, -184904, 107721, 139324, -96404, -240941, 25364, -340525, -50919, 138331, -257575, 78990, -438379, -231529, -55631, 106568, -64884, -76906, -133721, -93114, -191796, -161865, -27313, 180417, -193493, -216209, -247159, -17693, -128469, 124859, 175276, -97086, -133413, 141822, -254138, -398680, -85686, 106809, 189921, 14569, -135261, 107353, 44820, 127162, -477988, -103504, 109309, -10847, -261167, -92144, 105287, -199842, 282470, 159345, -281963, 104203, 114438, -43360, -269393, -209587, -278777, -79023, 240710, -83134, -75238, 338237, 231736, 2595, 105129, 124712, -50669, 180395, 303052, -103661, 197484, 97256, -73417, 5922, 17371, 48918, -144693, 92077, -43923, 26803, -164879, -237134, 314600]
19009a64951B20185a92910O5625B9444a29943j52642A52451L5174a37903e5866
18998B27403b36478A20462b40523E6395c86745a5824k61236I1992K39552a82196
18987a07537k62982A01714Q9561b44592a06752A81432B7461b17036N0463A32684
18976G811g5978b2855l56043J36473D9796a17863E9584a86429f7458k5596D203
18964b5977I9219C5310J98756G6511N2006c87099J69481A24903c22748J24754
18954a97994B21730b39909i0912n8969a7828k68863l4124J0971A49730D0742a13863
18942b25920C7067b4796A11558b09952j47863a65744l3495f9514r9955N5093E2458
18930a16924I0735g4371j33724O0323L7115p3815A56188J17854c00147n9585J4293
$$ y = [-164951, 220185, -192910, -127285, 29444, -129943, -282585, 152451, 187625, -137903, -55866, 227403, -236478, 120462, -240523, 56395, -386745, -15824, -277060, 91992, 331544, -182196, -107537, -370519, 101714, 191275, -244592, -106752, 181432, 27461, -217036, -166573, 132684, 7811, -75978, -22855, -378898, -242425, 49796, -117863, 59584, -186429, -67458, -93054, 4203, -25977, 99219, 35310, 234066, 76511, 128517, -387099, -217618, 124903, -322748, -197994, 221730, -239909, -90912, -149881, -17828, -286691, -320815, -309844, 149730, 40742, -113863, -225920, 37067, -24796, 111558, -209952, -357815, -165744, -199239, -69514, -169469, -114376, 52458, -116924, 90735, -74371, -208095, -147772, -110657, -184472, 156188, 274042, -300147, -359732, -345439]
18919c45439k8137A46159J83390A43427b12933A0041b40178a08052F8856a95686
18908C776p62K2890J97602b13878A8523J50115D611L38249A11828a98356D3347
18896b2720F8356b38485A21844l4558G622K21869h1543A6031O9622A4835K06971
18885B21806a81656b4242r9758A19550d0262B9458i7894a1660B26008a84394q7425
18874b71819G8410c98671C564a82715A12143c35320A42336a77313M1344B3067
18863b12743N7265B16023a29141j96044C42391G8300g3637c2318C1730P529J70238
18852B09497O3592F7433M8753c1564I5375b90900g8352A45452c11153A01049h7679
18840A26053c33852J21205L1824D2312b42616g9244j87433R1836n9129C9685d57753
$$ y = [-345439, -373576, 146159, 329549, 143427, -212933, 10041, -240178, -108052, 68856, -195686, 3776, 3014, 25904, 223506, -213878, 18523, 168638, 4611, 342860, 111828, -198356, 43347, -22720, 68356, -238485, 121844, 87286, 7622, 229491, -81543, 16031, 85653, 14835, 221806, -181656, -24242, -124000, 119550, -40262, 29458, -97894, -11660, 226008, -184394, -271819, 78410, -398671, 3564, -182715, 112143, -335320, 142336, -177313, -135969, 23067, -212743, -155478, 216023, -129141, -325185, 342391, 78300, -73637, -32318, 31730, 39259, 209497, 273089, 67433, 116186, -31564, 95375, -290900, -78352, 145452, -311153, 101049, -87679, 126053, -333852, -212647, -180823, 42312, -242616, -79244, -266677, -174841, -233970, 39685, -457753]
18828F3757b3760j26136p1748g3992B3891b31427j38956B56746C0927h2213A22921
18816C9465K52125a03144j55466G9161C2229E348b3111C8116q516J55194b14306
18804A0794f9388f687j77237D28110a15593m6951N1981B21247b14515H5963b4556
18792d6668C03323b0398H599a49862D5682c6896B75042b99886A55954F0761a11380
18780c83521K4062a53669C4765l948e38476a36722b6663j92767c2124A3587g2619
18768B61871j12462a61321e0140p0369J8606l7137a1801j50691G6130j9054J36430
18757A93506C9192A0714K17542b73556A1716L3391a59432K9053j40231K0094c3144
18745H7813a60893f1032j91279A4722J13071b99127M0482a0888j36069g543A6403
$$ y = [63757, -23760, -149896, -221644, -73992, 23891, -231427, -370383, 256746, 30927, -82213, 122921, 39465, 291590, -103144, -258610, 79161, 32229, 5348, -23111, 38116, 29600, 184794, -214306, 10794, -69388, -6687, -183924, 428110, -115593, -162544, -110563, 221247, -214515, 85963, -24556, -46668, 303323, -20398, 8599, -149862, 45682, -36896, 275042, -299886, 155954, 60761, -111380, -383521, -359459, -153669, 34765, 30817, -538476, -136722, -26663, -219430, -32124, 13587, -72619, 261871, 149409, -161321, -50140, -120509, -101903, -139040, -11801, -162492, 76130, 57076, 193506, 39192, 10714, 228256, -273556, 11716, 45107, -159432, -130379, -270610, -250516, -33144, 87813, -160893, -61032, -252311, 14722, 127793, -299127, -258645, -10888, -146957, -7543, 16403]
18733i7896j5361C9401Q5917c13253e4260D4852P3623D5889a27563f554k41923
18722b48477d1714a9517l0906A14524R2209J20111d6424B33967a17543l05844
18712d23387a13110j68165J35588B6702N50g2741j2310n8715B42449d82058A7938
18700F5994B5717a48199d6496j81133A39563h8361B41137c75038L071A39847a33914
18688A71151o2780b18046A15400h6225j6062l08713A6296h2837A08879a04263
18677D2507m319K1978a93300M4005M5065A10031a05276G089i8468A28351b08041
18665g4948j61743a18004C1503d7125A830b7427k0850k1836r1093H0281b54993
18653A78471J61055E0280a08446p1137q1055J05550B19038a83861k02086C53905
$$ y = [-97896, -113257, 39401, 125318, -313253, -54260, 44852, 118475, 45889, -127563, -6554, -248477, -41714, -19517, -50423, 114524, 206733, 326844, -46424, 233967, -117543, -423387, -113110, -281275, -145687, 26702, 27252, -72741, -85051, -143766, 242449, -482058, 17938, 65994, 25717, -148199, -46496, -227629, 139563, -88361, 241137, -375038, -371967, 139847, -133914, 171151, 108371, -218046, 115400, -86225, -102287, -411000, 16296, -82837, 108879, -104263, 42507, 38188, 60166, -193300, -149295, -104230, 110031, -105276, 7089, -98468, 128351, -208041, -74948, -236691, -118004, 31503, -47125, 1830, -27427, -48277, -70113, -161206, 80281, -254993, 178471, 339526, 50280, -108446, -179583, -260638, -155088, 219038, -183861, -385947, 353905]
18642h7253k5252q6139B84943E3668K06269f40064B56884e1443A6101c09649b0420
18630a66180A4846a21019k48916J51373A78365c8956B35684j04169i3020A85931
18619A96295g9637B11208B2020a39290l9904A35514a25411L988F2262N034g9580
18607e3862l53034d7395l1525j41513R840A33723b94956F9187a53607A80356h3695
18595A85458g2648j15160e3838B94217b11973e4894i415C3425c1531A2564c30094
18583a6807j06524B9673g7674j03571A4116a53309A71390b85382i0600j73707
18573b64307i3475q5773l44A48148E59c43281a08778j93008B69991d05924a61515
18561B2966a49284A20329c53642J66624d6554j66227l9319f9094J9176j6843J5801
$$ y = [-87253, -112505, -198644, 284943, 53668, 259937, -640064, 256884, -51443, 16101, -309649, -20420, -166180, 14846, -121019, -369935, -218562, 178365, -38956, 235684, 131515, -93020, 185931, 196295, -79637, 211208, 22020, -139290, -179194, 135514, -125411, -121423, 62262, 67296, -79580, -53862, -406896, -47395, -78920, -220433, -210593, 133723, -294956, 69187, -153607, 180356, -83695, 185458, -72648, -187808, -53838, 294217, -211973, -54894, -9415, 33425, -31531, 12564, -330094, -16807, -123331, 29673, -77674, -181245, 14116, -153309, 171390, -285382, -90600, -264307, -93475, -179248, -179592, 148148, 559, -343281, -108778, -301786, 269991, -405924, -161515, 22966, -149284, 120329, -353642, -187018, -46554, -212781, -252100, -69094, -49918, -66761, -50960]
18550e0960B14471i6289q0793A36463A8637K55a26545A06608b72618J16203l2296
18539a88711h5004K1482A07003b2422A66126b88956d0336j54208g6506m9931A63002
18527A29787f5831i904A51258a18480J927r7763K5338f9164k15815a00113j24091
18516b24204A56843F4781b10594a1317F3639d0271a8124k84287c4711a0678j93278
18505b03956a7361l07600A55518F9201K120A0949J57533b77676f9067A66929a76287
18493b85880d8009A98080a9208R282k95004A13038e6620A52711k6615A2761a62036
18481a71877c0678J2556G6657L9812b47578a13952a6178B96573b7735C2550d69455
18469a11201A35393a44861k34629a22815j74389c722k3069A21171g8954A08283
$$ y = [-50960, 214471, -96289, -177082, 136463, 18637, 18892, -126545, 106608, -272618, -156415, -188711, -85004, -63522, 107003, -22422, 166126, -288956, -40336, -194544, -76506, -126437, 163002, 129787, -65831, -9904, 151258, -118480, -116553, -214316, -188978, -69164, -284979, -100113, -224204, 156843, 64781, -210594, -11317, 63639, -40271, -18124, -302411, -34711, -10678, -203956, -17361, -324961, 155518, 69201, 71321, 10949, 168482, -277676, -69067, 166929, -176287, -285880, -48009, 198080, -19208, -9926, -304930, 113038, -56620, 152711, 126096, 12761, -162036, -171877, -30678, -18122, 76657, 116469, -247578, -113952, -16178, 296573, -27735, 32550, -469455, -111201, 135393, -144861, -379490, -122815, -297204, -3722, -26791, 121171, -78954, 108283]
18458a4296A051J30521d6823n6933j75089Q2220P6142q3776c8997q8869E5868
18446C48187c0805j43160A53834A4367a07618b9372j69082N4703j78262C49968
18435b74683H3578j7923k0691a98569A68b21156f4706I2194J48860a33770D1993
18423a99132i4645A7796g1084l64676J00821a46024B41266b16105p194C9783a46636
18411A6612a5207k00435C05910o4724m9535p3608A2801a46870B00184B1650f9315
18399H9860h8381I7718a82069B20567j05942h9990k45365A15223m0893Q0438c6684
18387c3437A0058J35233C2199a27289A86106i9545A73441d6518A63283b44608
18376b0098q1212C8995b80256c4843A23285b96727I544a6934H1680c15283i6291
$$ y = [-14296, 1051, 131572, -46823, -103756, -278845, -196625, -120483, -204259, -38997, -127866, 55868, 348187, -30805, -173965, 153834, 14367, -107618, -29372, -198454, -143751, -322013, 349968, -274683, 83578, 65655, 44964, -198569, 168, -221156, -64706, 92194, 241054, -133770, 41993, -199132, -94645, 17796, -71084, -435760, -334939, -146024, 241266, -216105, -223299, 39783, -146636, 16612, -15207, -215642, 305910, 241186, 191651, 118043, 12801, -146870, 200184, 21650, -69315, 89860, -88381, 97718, -182069, 220567, 114625, -89990, -335355, 115223, 74330, 154768, -36684, -33437, 10058, 145291, 32199, -127289, 186106, -99545, 173441, -46518, 163283, -244608, -20098, -101310, 38995, -280256, -34843, 123285, -296727, 9544, -16934, 81680, -315283, -96291]
18364E0533c85714d1120j16655r7356D1063a25061K384k23340a39297j10926A90752
18352a80715j9146R6639F088b96298Q9152K5772q570j39610E2362b57688A31172
18340c38515I9617G930b32220e8868b0692A17037h8720q8864D7349a56277d7503
18328A17381a63435H5283L71275d3901A42984a68940A45416b58387C7008b1634
18317a01477d03j40601B4322b88670i8782c4912r6099J3476k63031a6231A62749
18305b2140C16747H3726a59669r9415p4195J11974F9421J2724j9607O2915g8852
18293a63907k32250G6216c475l23542a61375H8827M2767M3903a97581n1600A96133
18281I1898a55699C13R1578a31210q9904F8017J8730P5237c45363A4872c9741
$$ y = [50533, -385714, -41120, -157775, -255131, 41063, -125061, -122677, -346017, -139297, -250223, 190752, -180715, -199861, -103222, 6088, -296298, -207146, -181374, -189944, -329554, 52362, -257688, 131172, -338515, 99617, 7930, -232220, -58868, -20692, 117037, -88720, -177584, 47349, -156277, -47503, 117381, -163435, 85283, 456558, -43901, 142984, -168940, 145416, -258387, 37008, -21634, -101477, -403, -141004, 24322, -288670, -98782, -34912, -131011, -117535, -380566, -16231, 162749, -22140, 316747, 83726, -159669, -259084, -333279, -221305, 69421, 82145, 62538, 125453, -78852, -163907, -396157, 76216, -3475, -327017, -161375, 88827, 131594, 175497, -197581, -249181, 196133, 91898, -155699, 313, 91891, -131210, -221114, 68017, 86747, 161984, -345363, 14872, -39741]
18269a6340A06529a18445b9647k21985j5241N4572k66654a46774g0499j14410
18259a84909f6088k06494A36744F3029b62160B18612i0000H1635b2995D9112B0691
18247B3016b28480i5438B81250E2682a34847j6064D537a83094r033C5250a97662
18235A61234b02587A03975J22894C4661a49399E42970c7472H4432A8018h2304
18224F3354J9049J738C2076b55502L6890C81677c8154G1322B9984a24320c4107
18212a13906B18442b04008r9330C7462e5384a9769C028e781q355j2002D4616M6379
18200I0995b3250A08089c3599B32028a70378o6040a03482B14726d31240g7871
18189d19606a05971B29801b27015b520j47181P3015B2567e1346l08518a8165C0319
$$ y = [-16340, 106529, -118445, -29647, -251632, -266873, -212301, -478955, -146774, -70499, -184909, -66088, -272582, 136744, 63029, -262160, 218612, -90000, 81635, -22995, 49112, 20691, 23016, -228480, -95438, 281250, 52682, -134847, -150911, 4537, -183094, -192127, 35250, -197662, 161234, -202587, 103975, 226869, 34661, -149399, 542970, -37472, 84432, 18018, -82304, 63354, 82403, 84141, 32076, -255502, -218612, 381677, -38154, 71322, 29984, -124320, -34107, -113906, 218442, -204008, -303338, 37462, -55384, -19769, 3028, -5781, -14136, -26138, 44616, 90995, -23250, 108089, -33599, 232028, -170378, -236418, -103482, 214726, -431240, -77871, -419606, -105971, 229801, -227015, -2520, -149701, -76686, 22567, -51346, -359864, -18165, 30319]
18177a78544I2007m2097i1173j06757B36106H435g6934B17565F508a55450L7700
18166a17750b6522j59467A64052G0087n980e2877q4348O7693D5895J9555K92066
18155C57516a94210b3715B92706a7432j16591B79897b68633g5377F8785a3706
18144b15465A53684h727C7371J80904H3932F434a40555j11865A10233j3888a40457
18132a45439R404K3943C78540o2100j33258J760a12678e875D49656c57411J78162
18121a79249A36661i4333C06815F4333R672a66831Q2773A50100B5715b10630I4240
18109A3889a19489A97537L868a42182e1275B03712J36607A35304g3376j32995
18099b06371D2782c40059E5315h4020j12987j07397J8744H2923e5704p0084k7587
$$ y = [-178544, 92007, 49910, -91173, -197930, 236106, 8435, -76934, 217565, 6508, -155450, -117750, -26522, -185989, 164052, 70087, 64107, -52877, -137225, -69532, 45895, 65450, 357516, -194210, -23715, 292706, -17432, -134023, 279897, -268633, -75377, 68785, -13706, -215465, 153684, -8727, 37371, 218275, 83932, 6434, -140555, -252420, 110233, 96345, -140457, -145439, -136035, -112092, 378540, 316440, 183182, 184942, -112678, -5875, 449656, -357411, -179249, 136661, -94333, 306815, 64333, 74005, -166831, -84058, 150100, 25715, -210630, 94240, 13889, -119489, 197537, 201405, -142182, -51275, 203712, 340319, 135304, -73376, -206371, 42782, -340059, 55315, -84020, -197007, -304404, -285660, 82923, -55704, -125788, -153375]
18088a53375d8550A23172c9239H3439b85173A03755b0633C1316K7099n542j0025
18077D2848b64280b7470n8305A63264c2393B98231H4685d23633A04883K9863b39852
18065a95783a1897k49256A03299K91999a74636L3020A0419b01467Q3161C02456
18054a61758e9512j09892G7990J19639a26055C0149a19591R268m4927D3076e42599
18042b1744G7253R0486J41945c5798a5506H2164K70218e25661d1552e747n838
18031a1585j01911l54261a13992a0447k0162j7296k01638B6932a70229A45704
18020b26605E4906g1465A34600n5930K1978a50378A52176f6264L0732l06799A30755
18008a9583A62226a8386A36491d18795K07359A38866N2564a21893d0464l44285
$$ y = [-153375, -48550, 123172, -39239, 83439, -285173, 103755, -20633, 31316, 58415, 52873, 42848, -264280, -27470, -85775, 163264, -32393, 298231, 84685, -423633, 104883, 134746, -239852, -195783, -11897, -261153, 103299, 395298, -174636, -141616, 10419, -201467, -118306, 302456, -161758, -59512, -169404, 77990, 197629, -126055, 30149, -119591, -110323, -155250, 43076, -542599, -21744, 77253, 167739, 309684, -35798, -15506, 82164, 352382, -525661, -41552, -5747, -11585, -113496, -467757, -113992, -10447, -30609, -47905, -249543, 26932, -170229, 145704, -226605, 54906, -71465, 134600, 78670, 100648, -150378, 152176, -66264, -35532, -342331, 130755, -19583, 162226, -18386, 136491, -418795, -211436, 138866, 191430, -121893, -40464, -384749]
17998c84749D6512d1025j79397J630A21907a50642B8677c2509F2906a90656j05406
17987b96062A27948b25686b8366j04009A15257C4506d04433D6246e0643R293F2770
17975a4877D93617j21606D5097d532j43253F971a50646E6747a53545q1238R2445
17964a42338A00064b02q278B11226c1701C07838A31566E4202e8575A07123b24175
17952H3059k1688N9324A1942b53488r0914I4127b75554F8296a36882O6474B37615
17940F2237K02741j14562i2858j69956J26846k8462C00260G1337b2669k0281p0808
17929a13758c5789k46540H7762L3250c56468D8101a56530g6925C22355a55193
17918A7723b12095E7584a56413n9463C38036o8738A6055a38268B52603A05207
$$ y = [-384749, 46512, -41025, -220422, -218792, 121907, -150642, 28677, -32509, 62906, -190656, -296062, 127948, -225686, -28366, -132375, 115257, 34506, -404433, 46246, -50643, -41350, 62770, -14877, 493617, 372011, 45097, -4532, -147785, 6971, -150646, 56747, -153545, -234783, -142338, 100064, -202, -8480, 211226, -31701, 307838, 131566, 54202, -58575, 107123, -224175, 83059, 61371, 120695, 11942, -253488, -344402, 94127, -275554, 68296, -136882, -70408, 237615, 62237, 264978, 150416, -92858, -262814, -135968, -164430, 300260, 71337, -22669, -42950, -113758, -35789, -282329, 87762, 121012, -356468, 48101, -156530, -76925, 322355, -155193, 17723, -212095, 57584, -156413, -215876, 338036, 269298, 16055, -138268, 252603, 105207]
17907A26383m790B1341J38614A2149K31792d92735b03706P8639B8524f7320j46212
17896b13532H199L0350K81579a7383A31816P3344a10207A90782a81159l5634E2711
17884d20073A93968H9400b06169i7370C53871a81716c9268l4250j47633g216j61424
17873a68640g5806j13026A14594b09084N0197L8422C9644a55182H5946b05285
17862A40226i8382A77162O945g2763j18602A91002B5780M97f0791I7618e0160
17850a63623I7930b69760D2522J33655H633J21526b0441C5868K05092A842b39842
17838c45409B09136E1610a08975B62086d5671A9427A83J22344b484A65508i8381
17826A86212a58051B67294h7565A4883c10079C05677j00089a21174c5557M6B1046
$$ y = [126383, 121593, 21341, 159955, 12149, 243941, -492735, -203706, -125067, 28524, -67320, -213532, 8199, 38549, 320128, -17383, 131816, 205160, -110207, 190782, -181159, -216793, 52711, -420073, 193968, 89400, -206169, -97370, 353871, -181716, -39268, -73518, -221151, -7216, -168640, -75806, -188832, 114594, -209084, -158887, -120465, 39644, -155182, 85946, -205285, 140226, -98382, 177162, 184107, -72763, -191365, 191002, 25780, 26277, -60791, 97618, -50160, -163623, 97930, -269760, 42522, 176177, 8633, 130159, -20441, 35868, 240960, 1842, -239842, -345409, 209136, 51610, -108975, 262086, -45671, 19427, 183, 122527, -2484, 165508, -98381, 186212, -158051, 267294, -87565, 14883, -310079, 305677, 205588, -121174, -35557, -35511, 21046]
17814G0439j3127a18424B653P9041c43389J64849B9830K7755M048c6065l63288
17803c99353C14076C0791K06850b19522A64522c32090e903r0077H9556a06346
17792A73216k7817J46849l2275c24563A919J01851J13679a5668l2647B795a27593
17780A7482e73742e4329E2963P6739a79236E94807f899G2483b3194D62843a14246
17768b7052I1672N6948d3822A35147J64873G0466j4368a75174O7727H193c14270
17756b34107B08441c98087F3413c9915H4285i1604o6648e4215J9825a087A93175
17744e8279A41036D1613J53455b05240a01350m2177E0207d8904o9165l8609e0883
17732A1734a88148P6775l8144B4766L0791d1729k54217A602a79456B2020L9551
$$ y = [70439, 57312, -118424, 2653, 81694, -343389, -178540, 29830, 57585, 61633, -36065, -399353, 314076, 30791, 237641, -219522, 164522, -332090, -5903, -95980, 89556, -106346, 173216, 145399, 292248, 259973, -324563, 1919, 103770, 217449, -15668, -48315, 2795, -127593, 17482, -573742, -54329, 52963, 129702, -179236, 594807, -6899, 72483, -23194, 462843, -114246, -27052, 91672, 148620, -43822, 135147, 300020, 70466, 56098, -175174, -107447, 8193, -314270, -234107, 208441, -398087, 63413, -39915, 84285, -91604, -158252, -54215, -34390, -1087, 193175, -58279, 141036, 41613, 195068, -205240, -101350, -143527, 50207, -48904, -118069, -156678, -50883, 11734, -188148, -111373, -149517, 24766, 55557, -41729, -295946, 1602, -179456, 22020, 61571]
17721F1571A0575a4267q8907j13150A92086J62015j07096i5267b4543j54737I8662
17709A95092G7267j4275N683k7476c7525E1019g5983B20103i7349b7585A12163
17697D1638J96199O1340a84545B21600a9645l06413A21854b7344A16316L33224
17687D49540B07484i4985A37160a59171j5894B85511A6230M5504d4359r8201I5121
17675a44961d2763q3500D01391a46262L7939A74452a65976E4580Q4348P7960j8590
17664A98298a36976g353j65469D2222a45740A70309a53589f1264j6387B59697
17653c22895a09541j50384a04381j19187A89709l7070a73992I2561m6146J24135
17643A70550b20012D3389J2028b86278e7923C4509J14069b4209j88937Q1056M6517
$$ y = [61571, 10575, -14267, -103174, -216324, 192086, 354101, 247005, -95267, -24543, -179280, 98662, 195092, 77267, 62992, 68675, 41199, -37525, 51019, -75983, 220103, -97349, -27585, 112163, 41638, 237837, 299177, -184545, 221600, -19645, -326058, 121854, -27344, 116316, 449540, 207484, -94985, 137160, -159171, -175065, 285511, 16230, 61734, -44359, -142560, 95121, -144961, -42763, -126263, 401391, -146262, -108323, 174452, -165976, 54580, 138928, 216888, 198298, -136976, -7353, -172822, 42222, -145740, 170309, -153589, -61264, -77651, 259697, -322895, -109541, -259925, -104381, -223568, 189709, 152639, -173992, 92561, 46415, 170550, -220012, 43389, 55417, -286278, -57923, 34509, 148578, -24209, -213146, -132090, -85573]
17632h5573B49628A23163J1258J001g7211o1558H8367M8721m4247l6322e1456
17620a99102b1692k89604c7812j02620A3000L7739N3407Q4006J1622f1046a9910
17608B01919d4482A24655f1228D8141K0366Q9138b6749A41698J32032a54887B51097
17596A63583a14645p2928A50943L14024D1474a66543b592D7211P4034g7137A45269
17584C42002r1887d4170J3555R516k4583J8547A78739a20255m1004E3404K3083
17573G6487j087q424K14737C8555J78548b4014N456D75779a47110A67683b67977
17561b2630C61591c1614j64232F9668j4115J78558A10173K38007J7308A76688
17550B89038B8000K21213D3546j9425J07488Q867J98198A38352a5245k134A93500
$$ y = [-85573, 249628, 123163, 134421, 135422, -77211, -138769, 88367, 137088, 92841, 56519, -51456, -199102, -21692, -311296, -37812, -140432, 13000, 50739, 104146, 188152, 199774, -61046, -19910, 201919, -44482, 124655, -61228, 48141, 68507, 157645, -26749, 141698, 273730, -154887, 251097, 163583, -114645, -187573, 150943, 464967, 41474, -166543, -2592, 47211, 121245, -77137, 145269, 342002, 250115, -44170, -30615, -21099, -45682, -27135, 178739, -120255, -161259, 53404, 76487, 75400, 66976, 281713, 38555, 217103, -24014, -18558, 475779, -147110, 167683, -267977, -22630, 361591, -31614, -195846, 69668, 55553, 234111, 110173, 348180, 365488, 176688, 289038, 28000, 249213, 43546, 24121, 131609, 140476, 338674, 138352, -15245, -17379, 193500]
17538A41021K1613O9658g2194F0660N6364a12441c4600j78714i7757C56720a23029
17526B81815m0327E7873N1270E0160j7643N9780Q5433G3917e6561a0932A73569
17514B29396L2641g6204I4770J66628a60913l9346B2872K05892a81037H2837a70273
17502A68429h3928b0927D9617K07530r0548b19618E0833a25644G4481L21671a44506
17490A22905a56484A87929n1864Q9791G2336l5326K22442A21011m7356J88710
17480B62365r6115P2235K7246D0366K98779A27829J37170m8552p0281a1459F7548
17468C48244A21266C6310N8953I705K34853f3470I2082D3783b01443B3492a18149
17456A26844o327M40732j12178A75217J52009p6930m3271p5021J60790K13407
$$ y = [141021, 162634, 232292, -72194, 60660, 117024, -112441, -34600, -213314, -97757, 356720, -123029, 281815, 241488, 57873, 109143, 50160, 32517, 92297, 177730, 73917, -56561, -10932, 173569, 229396, 262037, -76204, 94770, 261398, -160913, -200259, 22872, 228764, -181037, 82837, -170273, 168429, -83928, -20927, 49617, 257147, 166599, -219618, 50833, -125644, 74481, 396152, -144506, 122905, -156484, 187929, 136065, 225856, 72336, 37010, 259452, 121011, 73655, 262365, 166250, 238485, 265731, 40366, 339145, 127829, 264999, 216447, 146166, -11459, 67548, 348244, 121266, 36310, 95263, 9705, 244558, -63470, 92082, 43783, -201443, 23492, -118149, 126844, 120517, 561249, 449071, 175217, 327226, 250296, 207025, 132004, 292794, 506201]
17446E06201B30032K55857A80779O3947B49a18023B55600J49104A17464L3963
17436A51427J0910L2843J27444m6169A27047L37118M3392E8792J49650b345A84457
17424D02982A92585L05635g0744B13797K40377A58769L4334K08866J94262B80219
17413a85432C45705H4394K67357r1469a43250I6283l7071K42112o5634f3004q0380
17402a43384A3208M89436A89130j6417N5831E575J82019a91391E05285a02857
17391C24119p5767A03942J82084h847a030B7239J22800N4434m619J14440C8795
17379b7109j7678l3873k35768a33176B30886q8595N6257I3647d2501A78311G2487
17367H5516l7066o96K20977A2799L31547m303m2690e6568k12392E8263Q4548b06426
$$ y = [506201, 230032, 485889, 180779, 244726, 249, -118023, 255600, 404704, 117464, 151427, 162337, 195180, 322624, 276455, 127047, 464165, 507557, 58792, 208442, -2345, 184457, 402982, 192585, 498220, -70744, 213797, 454174, 158769, 193103, 401969, 596231, 280219, -185432, 345705, 84394, 351751, 260282, -143250, 96283, 59212, 301324, 235690, -63004, -143384, 13208, 502644, 189130, 172713, 228544, 5575, 187594, -191391, 505285, -102857, 324119, 248352, 103942, 286026, -8847, -1030, 27239, 150039, 204473, 199854, 314294, 38795, -27109, -44787, -78660, -314428, -133176, 230886, 142291, 198548, 93647, -42501, 178311, 72487, 85516, 48450, 47754, 268731, 12799, 344346, 340043, 297353, -56568, -268960, 58263, 142811, -206426]
17354B18871P8418a30313C93696C9017a919A35796J20711k0120j10288d3126n8787
17343a01913C02563L2353H0640K38486j12325n563a1629B19521E2326a00756H0537
17331D42143A73717j6601c3765C13407D9111K93540A55409M7130J92430k0666
17321C74303A48082K00657l5893b74521H1314K39920k4774c566D43461A01953
17310A95227R6754k1140G3159k1708a09025B39428l5755R7918A26974M81970k36509
17299C72435p1858A35734E6497a45923C66341A57670N0772C8720L0713K31826
17289C01259G5728J05678P7167a9287A30634K72620A51903J22508J56456d6141
17278G1705L74420a5604D0728L005K69026L8097D1822J75825K259d4603r9410
$$ y = [218871, 297289, -130313, 393696, 39017, -1919, 135796, 256507, 236387, 126099, -43126, -101913, 302563, 334916, 80640, 319126, 206801, 201238, -11629, 219521, 52326, -100756, 80537, 442143, 173717, 157116, -33765, 313407, 49111, 342651, 155409, 202539, 394969, 374303, 148082, 348739, 312846, -274521, 81314, 321234, 296460, -3566, 443461, 101953, 195227, 291981, 270841, 73159, 51451, -109025, 239428, 203673, 301591, 126974, 608944, 372435, 300577, 135734, 56497, -145923, 366341, 157670, 208442, 38720, 69433, 301259, 75728, 181406, 258573, -19287, 130634, 403254, 151903, 274411, 430867, -46141, 71705, 446125, -15604, 40728, 43733, 312759, 350856, 41822, 217647, 219906, -44603, -144013]
17267a44013A53643J66650C0381M8630J92086j8125b59777B05569J2394L4260
17257B52223G5370a0663A76396J5976k3566H1898K56716D9676J20872J53820j26792
17246A97576P9898e0688B79860I8307A4206a19108D9792a25997A77320h0374B26772
17234a11828B10681r2954C8611J01011k2270J42597J00173l5730J33745e7307
17223G6014a51771c9949C36819j589a1411A99104p38L0002N2601j23627a19818
17211B10869N2969H5040J80896D3970f5025B07786J72658j51950Q1316m8800K91176
17200E52186k28654a50968B63320q4104n7167K04113I0786L76292L9346j70434
17190C35990J63568a3689m6462B78631Q7181P925A38843O1603j6383J70544p1464
$$ y = [-144013, 153643, 320293, 30381, 79011, 271097, 252972, -259777, 205569, 217963, 252223, 75370, -10663, 176396, 192372, 168806, 81898, 338614, 49676, 170548, 324368, 197576, 277474, -50688, 279860, 98307, 14206, -119108, 49792, -125997, 177320, -80374, 226772, -111828, 210681, 117727, 38611, 139622, 117352, 259949, 360122, 324392, 458137, -57307, 76014, -151771, -39949, 336819, 335230, -11411, 199104, 198366, 228368, 280969, 157342, -119818, 210869, 263838, 85040, 265936, 43970, -65025, 207786, 380444, 228494, 309810, 261010, 552186, 323532, -150968, 263320, 179216, 122049, 326162, 90786, 467078, 506424, 335990, 499558, -13689, -60151, 278631, 365812, 373737, 138843, 200446, 184063, 354607, 283143]
17179B83143A05772K33339M6985K0949j22544P2040A27093Q0823M2824J08478
17169C59218J2537n0705o1731K16962g0746E6303J46953K94118B01434J3277j162
17158B13549J06602A30771k4329Q9880m6755L30635B09937h3433B81437J75562
17148D56999F2191N43920k81770D5955L36542q3568K12897p8747C6258K80127
17138C16385J5495A28434G323M43269E575J55442M50958B38047L2087l3538K46951
17127D83547A02691M01858j88066j55910b84A18397K68907K996N4936k00729K57462
17116E01969K88504j78635k59361J86908j90319j14495K26580R1180B34394m6210
17106A88184L11150A90015L14997k20255R9657j88681M09415k37167M0514A38323
$$ y = [283143, 105772, 339111, 386096, 407045, 284501, 356541, 127093, 207916, 250740, 359218, 371755, 321050, 259319, 476281, -70746, 56303, 203256, 497374, 201434, 214711, 213549, 320151, 130771, 106442, 196322, 149567, 480202, 209937, -83433, 281437, 456999, 62191, 606111, 324341, 45955, 382497, 298929, 511826, 433079, 36258, 316385, 331880, 128434, 7323, 450592, 5575, 161017, 611975, 238047, 270134, 236596, 483547, 102691, 504549, 316483, 160573, -284, 118397, 387304, 390300, 445236, 244507, 501969, 790473, 611838, 352477, 539385, 349066, 234571, 461151, 552331, 234394, 188184, 499334, 190015, 505012, 284757, 384414, 195733, 605148, 367981, 408495, 138323]
17095B96643A06064b6545C22011K38191B76716K54504J38499j9230M3863A77985
17084B43616K41205L2594j29801L73741k17923K31344B86069L578F2320L55237
17074D17557K50097l00957Q3369n3855K30264k51963O5441o3798J66990j51463
17064C91682K20161m6243j7696N7648J25488j42005j12863o8464p4830K63875
17054E96753J64437C33477n9924J46792j23823j9028K92824k2177J03367n5925
17044E95583K41152m09299n5122q1008L84469B99174O7281J38090J72942j24359
17034E53128P4435l8529k21832J33207J23446K834J68950j33628j35241j70215
17024C56555K95697M8079l45512L09201j45688J19023j26493j57799L42933j07321
$$ y = [296643, 106064, -26545, 322011, 560202, 276716, 531220, 669719, 650489, 694352, 177985, 243616, 484821, 517415, 387614, 761355, 543432, 774776, 286069, 289647, 62320, 417557, 667654, 366697, 450066, 396211, 626475, 374512, 439953, 376155, 543145, 391682, 611843, 565600, 547904, 605552, 731040, 589035, 476172, 407708, 332878, 596753, 761190, 333477, 273553, 420345, 296522, 277494, 570318, 548141, 651508, 595583, 836735, 427436, 372314, 291306, 675775, 299174, 366455, 504545, 677487, 553128, 627563, 589034, 367202, 500409, 623855, 626689, 795639, 662011, 526770, 356555, 652252, 700331, 354819, 664020, 518332, 637355, 510862, 353063, 695996, 588675]
17014E88675J88328k76880p733N4857K69747K7546j06887j10767J27981j9693
17004G35174p5832P7126j60938Q9473K33114j98665j88905L69755k72534n9355
16994E48413K80750j17977l9439K1817J67938k71657K88826k33688K20847j39987
16984G25843r1550L58379j69338j60793K8873J23275j56717K16138l8316o3721
16974G72073J38022P011l46346K14921J94787p9756k06305K19920J7644R7373
16964A029344L49441n50709p8054K12004j03157j9905M8303k19381J96063N8315
16954I22264Q5559N4001j79589m6948J26878K52227j37703r3943L15089m57987
16944H39848Q0733J3687M46681k55990P733K22104k06941J59711n7227l40860
$$ y = [588675, 777003, 500123, 492390, 547247, 816994, 844540, 737653, 626886, 754867, 735174, 659342, 736468, 575530, 665003, 898117, 699452, 510547, 880302, 607768, 548413, 829163, 711186, 671747, 693564, 861502, 589845, 878671, 644983, 865830, 725843, 634293, 992672, 823334, 662541, 691414, 814689, 657972, 874110, 835794, 772073, 910095, 917106, 570760, 785681, 980468, 900712, 694407, 914327, 931971, 1029344, 1378785, 828076, 750022, 962026, 858869, 838964, 887267, 667886, 863949, 922264, 1007823, 1061824, 882235, 835287, 962165, 1214392, 1076689, 982746, 1297835, 839848, 920581, 934268, 1380949, 1124959, 1132692, 1354796, 1147855, 1307566, 1250339, 909479]
16934I09479L65276k73573J57472p6310M01172m4118l3654o4389j67355P6479
16924A250479K09560j02168N3523r4198j72242M4245J27840K3876J33437l22494
16914A151858L31150M64051l29412q4511N2479N21835l52984J48950k00169J38751
16904A841998k33492J42613p1419K35749l23717M28646m97028M43163J1151j87033
16894A790631L1204L68503o26441l4888L03124K41540R9151l81573J39081K06522
16884B136854j3187p4767Q2466J4843J8881J34549j63704L874L31015J50400j88411
16873B432813k83334M10272l08762k998j07674L06455L00534k16834K24775j48081
16863B607166j99659K1524M84056j76667J82191j58544j0400q2177M65961j92647
$$ y = [909479, 1274755, 1001182, 1158654, 1082344, 1483516, 1439398, 1405744, 1341355, 1174000, 1250479, 1460039, 1357871, 1411394, 1317196, 1144954, 1189199, 1317039, 1340915, 1474352, 1151858, 1483008, 1947059, 1617647, 1533136, 1585615, 2107450, 1754466, 1903416, 1703247, 1841998, 1608506, 1751119, 1679700, 1915449, 1591732, 2020378, 1523350, 1966513, 1977664, 1790631, 1821835, 2190338, 1563897, 1529009, 1832133, 2073673, 2172824, 1791251, 1930332, 2136854, 2123667, 2048900, 2131366, 2146209, 2165090, 2299639, 2135935, 2139809, 2470824, 2621224, 2432813, 2149479, 2559751, 2250989, 2247991, 2140317, 2446772, 2747306, 2530472, 2755247, 2607166, 2407507, 2429031, 2913087, 2736420, 2918611, 2760067, 2749667, 2667490, 3133451, 2940804]
16853B940804J71240j23804K8290J09995m4923j81951N28021K42451o06369L86819
16843C450573K42902j54937K3999J64369J7466J18318Q3550J28064n2005J12183
16833D134482l7115L58615k31184M82468j87964O3560L50050P8918k1202N9957
16823E050585K13561o6304R4061j09682K34847r3314L26879L23162l9257K33242
16813F167780j16055K11308Q3006L32571k71136J24744M28313L3965J99078J84786
16803G378360L32146J46059K3360J85714J08859M69682K95401K96426j90649J86389
16793I231747L49815Q5348K16403L57627M43988O7501O09266j77474P84405J54543
16783A2123169L64919M08714j5362L70739P64403L51301N47390P29164L75777
$$ y = [2940804, 3112044, 2988240, 3016530, 3126525, 3081602, 2899651, 3427672, 3670123, 3063754, 3450573, 3693475, 3538538, 3562537, 3726906, 3744372, 3862690, 3946240, 4074304, 4022299, 4134482, 4097367, 4455982, 4224798, 4707266, 4519302, 4582862, 4932912, 5011830, 4990628, 5050585, 5264146, 5197842, 5291903, 5182221, 5417068, 5323754, 5650633, 5973795, 5934538, 6167780, 6051725, 6263033, 6346039, 6678610, 6407474, 6532218, 6960531, 6994496, 7193574, 7378360, 7710506, 7856565, 7879925, 8065639, 8174498, 8644180, 8939581, 9236007, 9045358, 9231747, 9581562, 9666910, 9883313, 10240940, 10684928, 10752429, 11361695, 11184221, 11968626, 12123169, 12488088, 12896802, 12881440, 13252179, 14016582, 14367883, 14915273, 15644437, 16020214]
16774A6020214L51376L38318M12281J063131M11619L68621J035942M59321O93098
16765B1153921J161892P25424P50121J009132J048562N85345J441704Q17568J365816
16756C0059485J383201J318892J437878J547826J482621J778159K213021J602927
16748D2824010K078768K565136K345409K644319K765108K773190L157844L454320
16740F4608104L764209L604537M280225M283246M918237M945651N651545N557646
16732A01613400O009659O348806O904414O882364P121446P639250P505058P491308
16724A57515705P026662P158264O749519N696838N535755L684689K882556J553329
16716A97803317K10192j004234k294806l957605m913283n605486o322198o904103
$$ y = [16020214, 16371590, 16709908, 17122189, 18185320, 18596939, 18965560, 20001502, 20460823, 21153921, 22315813, 23041237, 23791358, 24800490, 25849052, 26434397, 27876101, 28693669, 30059485, 31442686, 32761578, 34199456, 35747282, 37229903, 39008062, 41221083, 42824010, 44902778, 47467914, 49813323, 52457642, 55222750, 57995940, 61153784, 64608104, 68372313, 71976850, 76257075, 80540321, 85458558, 90404209, 96055754, 101613400, 107623059, 113971865, 120876279, 127758643, 134880089, 142519339, 150024397, 157515705, 164542367, 171700631, 178450150, 184146988, 189682743, 193367432, 196249988, 197803317, 198013509, 197009275, 194714469, 190756864, 185843581, 180238095, 173915897, 167011794]
16708A67011794p578509p516154p946394p390983p695073p339459o842716o630911
16700A08071595o303803o027027n486535n133674n476325m104517m265052m122103
16692F7152559l847011l255601l261242k888064k926580k543174k543846k310258
16684D3576783j936035j840003k019105k012971j465567j485869j419835j236777
16676C0160621j629971q77494j419623j039247j002119j172821n22480r42245
16668B1554621j083679p30375n45423o05215q90553l52702o96726l23800n75934
16659A5750214r12463m51955K47344j118461l00580k14022m38952p2422j055824
16650A1432879j65425J07718m10610k62705l95719n96740l6196j39232l88638
$$ y = [167011794, 159433285, 151917131, 143970737, 136579754, 128884681, 121545222, 114702506, 108071595, 101767792, 95740765, 90254230, 85120556, 79644231, 75539714, 71274662, 67152559, 63305548, 60049947, 56788705, 53900641, 50974061, 48430887, 45887041, 43576783, 41640748, 39800745, 37781640, 35768669, 34303102, 32817233, 31397398, 30160621, 28530650, 27653156, 26233533, 25194286, 24192167, 23019346, 22496866, 21554621, 20470942, 19740567, 19195144, 18589929, 17699376, 17346674, 16649948, 16326148, 15750214, 14837751, 14385796, 14633140, 13514679, 13214099, 13000077, 12561125, 12488703, 11432879, 11267454, 11375172, 10964562, 10701857, 10306138, 9709398, 9673202, 9533970, 9145332]
16641I145332m29495L32870l95650j0969n75120q50852M89962l09722J60352l58067
16631G198641k48669k50726L6233j50225j83631j09319n77696O1487J6002J25305
16621E917402m76020L73302m82219j06228j53229K9336l82871k85151K04949L50973
16611D990244m30434J73559n90600L8092Q7757M2353m21159L65154m64562K07019
16601C997423k45510j14923j59693J65995k57339J9374L1000j74624m4585K74147
16591C491265k80383k4605O3121R5874k61381N4789m51811K09756l08360J81267
16581B769532J75356q1933k73676r5748M7286j47227k34603p329M64534k41797
16571B374395j62332j11800J69326l2215P3301l6937j40836K59563l56064K90798
$$ y = [9145332, 8715837, 9048707, 8653057, 8642088, 8066968, 7216116, 7706078, 7396356, 7556708, 7198641, 6949972, 6699246, 6735479, 6585254, 6401623, 6292304, 5714608, 5776095, 5792097, 5917402, 5441382, 5814684, 5332465, 5226237, 5073008, 5102344, 4719473, 4434322, 4639271, 4990244, 4559810, 4733369, 4142769, 4180861, 4268618, 4310971, 3889812, 4254966, 3790404, 3997423, 3751913, 3636990, 3477297, 3643292, 3385953, 3405327, 3436327, 3261703, 3217118, 3491265, 3210882, 3186277, 3249398, 3345272, 3083891, 3138680, 2686869, 2896625, 2588265, 2769532, 2944888, 2862955, 2589279, 2493531, 2540817, 2393590, 2158987, 2151658, 2616192, 2374395, 2212063, 2100263, 2269589, 2237374, 2310675, 2273738, 2132902, 2392465, 2036401, 2327199]
16561B327199j22086m29408M21170N0618l29807j72417J95773j1727j8896j78576
16551A731843J61154j71730j73116Q2906J41613j64135k14829J73304K4657k04102
16541A387565J99621K58636l01924L5550m4375j47422Q9555L4129o7455o8173
16531A375707Q0030k73950J14076k09898N33944n0438j27294m96362L15527R5269
16521A356611j9966J31894l02225K33331k08881j72380Q9996o531j75405J37300
16511A063744J15978k35555J03397K64559k45418K3963k44162m5560M05412k38898
16501I67460K33486l85562K90622k10602L16585l38647m2721O1042j20347L81803
16491A153119l75926L46246k91507R9608D49749K89466r183J57445K256j18498
$$ y = [2327199, 2205113, 1775705, 2196875, 2247493, 1917686, 1745269, 1941042, 1929315, 1910419, 1731843, 1892997, 1721267, 1548151, 1631057, 1772670, 1608535, 1393706, 1567010, 1591667, 1387565, 1587186, 1845822, 1543898, 1579448, 1535073, 1387651, 1477206, 1511335, 1443880, 1375707, 1455737, 1181787, 1295863, 1085965, 1619909, 1569471, 1442177, 945815, 1261342, 1356611, 1336645, 1468539, 1166314, 1399645, 1190764, 1018384, 1108380, 1101849, 926444, 1063744, 1179722, 944167, 1047564, 1312123, 1066705, 1090668, 846506, 800946, 1206358, 967460, 1200946, 815384, 1106006, 895404, 1211989, 873342, 830621, 891663, 771316, 1153119, 777193, 1123439, 831932, 931540, 449749, 739215, 730032, 887477, 889733, 771235]
16481G71235j94086L25324L8801l5324k65126J25950R81j79494N71583l49410
16471H10434l36701L27217j89760P4414k17913N8524J983O5024M2916K51018l10708
16460E76448L63114k47290k34275J98832j70857R8885J58590k27721L7868K01811
16450G55405j45613M22R7094L8025j9125k9208C34554L22676p5107J89654l02947
16439D68830k14545J5278L58622P8756B55529L83452K46930L5848l84381J28892
16429F66270N6214B34025J71879L33217C11106L53211O1205k15528l6749j70046
16419C03199R0434K49589K45306k73601M7365O9302l24596N9970n6366O7660A61845
16407H14345l36488l4159j7128A16688N33054j35557J16523j75323R2724k436
$$ y = [771235, 577149, 902473, 941274, 905950, 640824, 766774, 767755, 588261, 1159844, 810434, 473733, 800950, 611190, 685604, 467691, 526215, 528198, 593222, 636138, 887156, 576448, 939562, 692272, 457997, 656829, 485972, 584857, 743447, 515726, 553594, 755405, 609792, 610214, 707308, 745333, 726208, 697000, 334554, 657230, 582123, 771777, 468830, 254285, 269563, 628185, 706941, 255529, 638981, 885911, 921759, 537378, 666270, 722484, 234025, 405904, 739121, 311106, 664317, 725522, 509994, 473245, 303199, 393633, 643222, 888528, 614927, 662292, 731594, 406998, 466968, 410602, 478262, 161845, 814345, 477857, 443698, 426570, 116688, 649742, 514185, 630708, 455385, 548109, 545673]
16397E45673o0980L50704k72096j78703m8210j52918K44602r7102J22231K0154
16387D73355k09784j03347M52395A52648O40125l22676J14258B81752J08800L06524
16377F97076A09803L68857k01116j35656L11782B22805P3808q0893K44327j05527
16367C54520K6029K3784N4869j16913j02267J0042J12475n7709o6030A16907N1990
16356A68897b2985C8860M71071j18941j39365K71780k02131G9473N5406a3646
16345E68441i3910B57232M42134F9653L95454F6910O7394a5315A87768Q6414I0437
16333A53L30414P9851j97445R9856K8164e4421B84909L0431j47704J722P860J47447
16321C24665o9266j6541M8163N3455m1503L33950A4639d9101B47507K11351j53364
$$ y = [545673, 484693, 835397, 563301, 384598, 336388, 183470, 428072, 330970, 453201, 473355, 263571, 160224, 612619, 152648, 792773, 470097, 584355, 281752, 390552, 697076, 109803, 478660, 277544, 141888, 453670, 222805, 296613, 215720, 460047, 354520, 380549, 404333, 459202, 342289, 240022, 250064, 362539, 304830, 238800, 116907, 168897, -22985, 38860, 509931, 390990, 251625, 523405, 321274, 79473, 134879, -13646, 568441, -93910, 257232, 699366, 69653, 465107, 66910, 134304, -15315, 187768, 274182, 90437, 153, 330567, 410418, 212973, 312829, 340993, -54421, 284909, 315340, 167636, 169358, 177218, 324665, 255399, 238858, 287021, 340476, 298973, 632923, 14639, -49101, 247507, 458858, 305494]
16310C05494e0820A52298K03186j13138J82851A13377g1066C87083H1697K00109
16300B81806a8678C05570C3316J70225L69811j95076A74130D4044J96208K7192
16290B67444J0157J99105B5747h6381D2386b322B1838J35274K00800q0289N1236
16279C28859j36251f0753B8551K62667F9975L96700A86085K96620E2194J96381
16269B48575j09981l7970L6111D7392P9275J51071h0356b4725B47073c5727B08506
16257C68839D5699L46567A08254L4544n1481a00675E531a28053D4492L21124E2096
16245e6176A24837J04317p0184f1394E57850A64370J23546j9331a58744A4017
16234B88914a9662D71493a71596a0213A11554a02613a8964E8408M62660B3166
$$ y = [305494, -50820, 152298, 355484, 242346, 425197, 113377, -71066, 387083, 81697, 281806, -18678, 305570, 33316, 203541, 573352, 378276, 174130, 44044, 240252, 267444, 277601, 476706, 25747, -86381, 42386, -2322, 21838, 157112, 357912, 277623, 328859, 192608, -60753, 28551, 291218, 69975, 466675, 186085, 482705, 52194, 248575, 138594, 100624, 136735, 47392, 126667, 277738, -80356, -24725, 247073, -35727, 208506, 368839, 45699, 392266, 108254, 142798, 91317, -100675, 5531, -128053, 44492, 365616, 52096, -56176, 124837, 229154, 158970, -61394, 557850, 164370, 287916, 268585, -158744, 14017, 288914, -19662, 471493, -171596, -10213, 111554, -102613, -18964, 58408, 521068, 23166]
16223A09454b09886A75187R3750G5039r566e8073A80395G5364a0884E4381j2119
16212D2262Q3959L32716A56261K16683B8682P2310L11154A60380L59815a1077
16201G6781a37550A12709K21188j09921b31697A7512b76333C47601i2935n767
16191i8702C4564b9915D2879O8241J53716J07873A68026l5358Q7728L346a81649
16179E8169a63058B15654d0201L81A88977b94933E8351J99404b15024c4335a0269
16167e7706k5813B96794C2085a12701F6263R773c4405j84291A55947d5488H850
16155g3438b4549A43446e8489C05654j24041a53337A54671l7840f0946I942o00
16144I342P5244a30965M6262C34968b92231h5455j8766c3053D43713d5372F23
$$ y = [109454, -209886, 175187, 268937, 75039, 65473, -58073, 180395, 75364, -10884, 54381, 42262, 126221, 458937, 156261, 372944, 28682, 100992, 412146, 160380, 520195, -11077, 76781, -137550, 112709, 333897, 223976, -231697, 17512, -276333, 347601, -92935, -98702, 34564, -29915, 42879, 111120, 264836, 372709, 168026, 132668, 220396, 223742, -181649, 58169, -163058, 215654, -40201, -39820, 188977, -294933, 58351, 257755, -215024, -34335, -10269, -57706, -83519, 296794, 32085, -112701, 66263, 76036, -34405, -218696, 155947, -45488, 8850, -73438, -24549, 143446, -58489, 305654, 181613, -153337, 154671, 116831, -60946, 9942, 9342, 84586, -130965, -84703, 334968, -292231, -85455, -104221, -33053, 443713, -45372, 623]
16132B03739J8956J0919q0690g2990j0983B42236c0639A10325J05590n5286J9062
16121A79691J91709H5725Q1858a02237A52784A267K10340D7274L7533P3064a69459
16109b79993j15571a50558c6284A3494M36028A21280f2208q9002A05063N4559
16099A59622j8085E8463d6351K2457j72652B57136N9762C8945a44645A30175L6997
16088A67172F8027k782K58200b85623A89287m5618A7704f3454A03702P232k1941
16077H8993a51987C2363R2360a68752j73747a1693B34424E245J51950D4899Q0395
16066A25294m8324j514c27670D1564A4147a11957k22980b3386B33841D7800i6436
16054b2610j35054A44541a67140H1162J1461a20122E3090a88952p942e4213a0149
$$ y = [203739, 222695, 233614, 152924, -72990, -83973, 242236, -30639, 110325, 215915, 160629, 179691, 371400, 85725, 167583, -102237, 152784, 1267, 211607, 47274, 84807, 157871, -169459, -279993, -395564, -150558, -36284, 13494, 449522, 121280, -62208, -151210, 105063, 159622, 141537, 58463, -46351, -23894, -196546, 257136, 316898, 38945, -144645, 130175, 167172, 68027, 65245, 323445, -285623, 189287, 143669, 17704, -63454, 103702, 110934, 88993, -151987, 32363, 124723, -168752, -342499, -11693, 234424, 5245, 157195, 44899, 125294, 76970, 75456, -327670, 41564, 14147, -111957, -334937, -23386, 233841, 47800, -96436, -22610, -157664, 144541, -167140, 81162, 92623, -120122, 53090, -188952, -196894, -54213, -10149]
16042A89483e1744j68908d4829l15380E240R1142a55839j46611a7840I6307b07619
16030a57754B25394i8157B05750b4152q2334E9695k5799R4872J2894D0635a10427
16018B5017f8512j69495B683h2953A29286A1653f1223b3869j12327J6623d3368
16006g1796j236P541B77058a17507a9555r166j23085f3909A81734a86755P8698
15995a08057K4753m8737A75727d74648b07033m0205A67163D8977j2883a73380
15984A42781C7210j1998N85571k62117m837j1245c5806A80893J4357g1800B1240
15972b81403A90015g3167K6453R610B37845a8344p0358D02168A37882H475f0739
15960a66470F9940b9229A85203O4603d06218J92538M7907k24273a51514F9180
$$ y = [189483, -51744, -220652, -44829, -360209, 5240, 96382, -155839, -302450, -17840, 96307, -207619, -157754, 225394, -98157, 205750, -24152, -106486, 59695, 33896, 128768, 141662, 40635, -110427, 25017, -68512, -238007, 2683, -82953, 129286, 11653, -61223, -23869, -136196, -119573, -43368, -71796, -73032, -65491, 277058, -117507, -19555, -28721, -151806, -63909, 181734, -186755, -108057, -83304, -132041, 175727, -474648, -207033, -247238, 167163, 48977, 36094, -173380, 142781, 37210, 25212, 610783, 348666, 343829, 332584, -35806, 180893, 195250, -71800, 21240, -281403, 190015, -73167, -46714, -37104, 237845, -18344, -88702, 402168, 137882, 8475, -60739, -166470, 69940, -29229, 185203, 249806, -406218, -213680, -165773, -390046, -151514, 69180]
15949B1435N8570C2929b86443M7589A35728a8334B79321j14334q2188O1217a74477
15937i9625A50206a46647c1226k90594P9609g2394I3312a31035A96792C5149j1128
15926B4021K10675b912A3895J435J94252n8536a44531a0338j17234G8464J05242
15915A83706D7609j529b52421H416f8026F1395N2437b03520h9346C3470b31018
15903B0232J39191b30378A76847a41372j18148f405B14854e8838k7005B41447
15892a31128L8573m72017B09101o2147o5473a0311d2A7478b96288P4591A3832
15880f08156a94460l6091A1725a11236N1389G57f4382r5803N1312H9497Q9688
15869A79185G733j432L22871j62638k3486a1675j52761I8845b23781f4477E2342
$$ y = [21435, 80005, 32929, -286443, -238854, 135728, -18334, 279321, 164987, 82799, 144016, -174477, -99625, 150206, -146647, -31226, -321820, -242211, -72394, 93312, -131035, 196792, 35149, 24021, 234696, -2912, 13895, 15330, 209582, 151046, -144531, -10338, -127572, 78464, 183706, 47609, 46080, -252421, 8416, -68026, 61395, 113832, -203520, -89346, 33470, -231018, 20232, 159423, -230378, 176847, -141372, -259520, -6405, 214854, -58838, -85843, 241447, -131128, -92555, -564572, 209101, 146954, 81481, -10311, -42, 17478, -296288, -221697, 13832, -608156, -194460, -230551, 11725, -111236, -59847, 757, -64382, -160185, -108873, 89497, 179185, 7733, 6301, 329172, 166534, 143048, -11675, -164436, 98845, -223781, -64477, 52342]
15857A91997c58626a389n1029B32198i4931b7514G2310b34676B37262p7167a12829
15845a24978A49388D0496b01251B95893b64078M7444h2003C26480a54136b0143
15834a48275Q173A83868a96110G9941K03126d9066j77689a2772m6759F7271b89420
15822f3556A49350i6542B50696F1021a65155i383A46288G1201b37281J2649I2197
15810c93980J85664N0191B01815b66948B3029d5651A27781d4040A36058a83311
15799a46920K3639Q431B851L9384f3009r054E2636N5508J47891a11342E8155a26303
15786a08228G5540A9863c79345G372a31672J5288A55169c7613l9323D8429o953
15775D1476b60531i1657L1188n0517M6458B88867D7449i030A59341F6601b12741
$$ y = [191997, -358626, -1389, -52418, 232198, -94931, -27514, 72310, -234676, 237262, 160095, -112829, -124978, 149388, 40496, -201251, 295893, -264078, -216634, -82003, 326480, -154136, -20143, -148275, -140102, 183868, -196110, 79941, 283067, -49066, -226755, -12772, -59531, 67271, -289420, -63556, 149350, -96542, 250696, 61021, -165155, -9383, 146288, 71201, -237281, -224632, 92197, -393980, -208316, -158125, 201815, -266948, 23029, -45651, 127781, -44040, 136058, -183311, -146920, -123281, -114850, 2851, 42235, -63009, -72063, 52636, 108144, 256035, -111342, 58155, -126303, -108228, 75540, 19863, -379345, 7372, -131672, -116384, 155169, -37613, -76936, 48429, 41476, -260531, -91657, -60469, -110986, -64528, 288867, 47449, -9030, 159341, 66601, -212741]
15763b19307f9336D10182a2637A17140M501n1838a41214K5416C6682J2620j1679
15752C7623J41379C847a01728j14495J07229j723r6403b0029o9385I1662g788
15740A11803a20408e9549q9742J949I93c519m93926h6385a7772k77688b8686j39211
15728a67897b6518o636A16773i6079L024E8745a66026d5329A02720l0043a99891
15716c66301R4894B68253a26002N0048j54038E2171b7667B03894a98469N1857
15706a46612B47091C0621L43115A35644b63538B2038c77889b3427j3799A49091
15695d24691a5605k83180B18752a16818A03374K27806A25444E5095A838J72026
15685A73864K4559c05822D1602A4589a21519l42680A8079P732h8400D09883A18465
$$ y = [-219307, -69336, 410182, -12637, 117140, 121641, 69803, -141214, -115798, 36682, 49302, 37623, 179002, 3847, -101728, -216223, -108994, -110717, -207120, -20029, -89414, 91662, -7788, 111803, -120408, -59549, -149291, -147342, 993, -3519, -497445, -86385, -17772, -295460, -28686, -167897, -26518, -33154, 116773, -96079, -93055, 58745, -166026, -45329, 102720, 72677, -199891, -366301, -271407, 268253, -126002, -75954, -229992, 52171, -27667, 203894, -198469, -146612, 247091, 30621, 373736, 135644, -263538, 22038, -377889, -23427, -37226, 149091, -424691, -15605, -298785, 218752, -116818, 103374, 331180, 125444, 55095, 1838, 173864, 198423, -305822, 41602, 14589, -121519, -464199, 18079, 25811, -88400, 409883, 118465]
15673b757A1914J65016J6047D723a06303L6175k11043A76150q5841a47135J0571
15662a36564j08972N8255N0250f07A5578i4125k4461H0954j0723a02841k2753
15651a25594e7865j71576D6272O4969i2021j24955A81276k945o7782E1061P7971
15640A29032N6876o5987C7193J00543J0102D4682b01624b3328l05625J62585b2205
15628a5464B01299e595k7680K885m4083f508k4630o9398j1843c2650F2994K0688
15616H3682J80957j29124m0611O1981f8128j72160R4995N3602j5994F1698j6556
15605D5142c1881j4045j81793j7572C40922b89955J9596E8372b22909L5485Q1802
15594a05622F8616k1233e52416d8082A35101a36642C7593a00815B15121K87976
$$ y = [-2757, 11914, 176930, 192977, 4723, -106303, -70128, -281171, 176150, 90309, -147135, -136564, -245536, -187281, -137031, -607, 15578, -94125, -118586, 80954, 70231, -102841, -125594, -57865, -229441, 46272, 111241, -92021, -216976, 181276, 178331, 110549, 51061, 129032, 185908, 119921, 37193, 137736, 147838, 44682, -201624, -23328, -328953, -166368, -22205, -15464, 201299, -5595, -33275, -30390, -74473, -6508, -31138, -100536, -112379, -32650, 62994, 83682, 264639, 135515, 94904, 156885, -68128, -240288, -145293, -91691, -107685, 61698, 45142, -31881, -45926, -227719, -245291, 340922, -289955, -270359, 58372, -222909, -187424, -105622, 68616, 47383, -552416, -48082, 135101, -136642, 37593, -100815, 215121, 503097]
15584E03097a01774j6473p5953R1620a0595B74642b3119j60204A7755e4925B13880
15572A80157A1052J26520a01237l34260a81428A04004a16955c8574j15886H2028
15561a6896A56004b38557A79065l447a69211B74909a00526A38096i4969D4248
15550B47672i047A58020D5788O6100e7046j1292K1546q7088G6804b67298A70436
15538a56764a3570B4233K79611a27862b0241B68374o6507p9688a1888A84924b41214
15526B14285m0407b29961A04359f3295F8674a37887O0496B55317J21076E566a99261
15514a91593O2821J5808k94563a88147h8281A1877e88742K30297a16744A57531
15503i3478n2437F9213a96146B42323j8298a74927f3277A65359l0002b5291A4093
$$ y = [503097, -101774, -118247, -194200, -102580, -10595, 274642, -23119, -183323, 17755, -54925, 213880, 180157, 11052, 137572, -101237, -435497, -181428, 104004, -116955, -38574, -154460, 82028, -16896, 156004, -238557, 179065, 175618, -169211, 274909, -100526, 138096, -94969, 44248, 247672, -9047, 158020, 45788, 111888, -57046, -68338, -46792, -133880, 76804, -267298, 170436, -156764, -13570, 24233, 303844, -127862, -20241, 268374, 201867, 122179, -11888, 184924, -241214, 214285, 173878, -229961, 104359, -63295, 68674, -137887, -77391, 255317, 376393, 5566, -199261, -191593, -128772, -112964, -407527, -188147, -88281, 11877, -588742, -358445, -116744, 157531, -93478, -145915, 69213, -196146, 242323, 224025, -174927, -63277, 165359, 135357, -25291, 14093]
15491B1994f2974F7415b50261K3253p7647J35902j33171a44668A08326b13432
15480g1521G5012O4733D1822K21037j18795a70016E7826b00548A56294a27785
15469a6228C0269N0134l594c6455k29074A05020a7584B00386p64b91094B04862
15457A63568F7439a20379M3838B99133b91531a5431j43733G575b07140C66254
15446B77046a3122D35160C3526J86811N3582e4150j14856O0632m4966A03187a04317
15434a24402p3754i237E3845g2961j63899A46226b14099i0362J50L2510o3509
15423a21211A26585O9365B2865J67296C4860R0645K46161A10064m96D1309K25386
15412B66695f0608A374c13222A64057C6167G737b036n2020P105d531j49183F6626
$$ y = [21994, -62974, 67415, -250261, -227008, -304655, -168753, -301924, -144668, 108326, -213432, -71521, 75012, 139745, 41822, 262859, 144064, -170016, 57826, -200548, 156294, -127785, -16228, 30269, 80403, 76809, -36455, -265529, 105020, -17584, 200386, 199622, -291094, 204862, 163568, 67439, -120379, -76541, 299133, -291531, -15431, -159164, 7575, -207140, 366254, 277046, -13122, 435160, 33526, 220337, 273919, -54150, -169006, -108374, -153340, 103187, -104317, -124402, -198156, -9237, 53845, -72961, -236860, 146226, -214099, -90362, -90212, -57702, -121211, 126585, 195950, 22865, 190161, 34860, 125505, 371666, 110064, 109568, 41309, 266695, -60608, 1374, -313222, 164057, 36167, 7737, -2036, -54056, -46951, -4531, -153714, 66626]
15399a93918j10391a01713A0202a2813n8208m4846m1315I9412a33263d6223n335
15388e1558B30069b09987A34663L6349a69500A89334G1757a7167m61A52573b7474
15376b78842A52163b1736B21438h845r1826K038G5520a61937B23543k8798m5145
15365A49600k9070g2119j52322P2042B2126f9625B02242a41854E1447M3273f0807
15353a03458I9513h3513B73704a41238f8789F0696b69382c3037A45785R9969e4502
15341a36184D23259f8555l9072b9998j50092c3155A9062K9531a9101A56415f5408
15329b00727R2911I8092C8494j4273J2279e963A68273c2130A37815b46529D20501
15317D22198a09192d6355o7036A32012A7898P6982R3527c36410a5116j6882j03891
$$ y = [-193918, -304309, -101713, 10202, -12813, -71021, -115867, -157182, 99412, -133263, -46223, -51558, 230069, -209987, 134663, 171012, -169500, 189334, 71757, -17167, -17628, 152573, -27474, -278842, 152163, -21736, 221438, -8845, -100671, -98633, 75520, -161937, 223543, 194745, 149600, 120530, -72119, -224441, -152399, 22126, -69625, 202242, -141854, 51447, 94720, -60807, -103458, 99513, -83513, 273704, -141238, -68789, 60696, -269382, -33037, 145785, 245754, -54502, -136184, 423259, -68555, -107627, -29998, -180090, -33155, 19062, 48593, -19101, 156415, -65408, -200727, -107816, 98092, 38494, 24221, 36500, -5963, 168273, -32130, 137815, -246529, 420501, 422198, -109192, -46355, -113391, 132012, 17898, 94880, 188407, -336410, -15116, -31998, -135889]
15306a35889N9717B2862J0689b45077A11308d1423A03427J15654a08259A85020
15295B06024B0050J87861q3385d7866l26222g6429l7996A46875a47490F4935l0623
15284C4312N4017d3984C55935j41618g2938B29641F720a06707k92660B61111D8476
15272a92195k1109P3888M4774K9886A3410J09390E6346O7909D4430g2342k68632
15261c40974A84991C4607j2322K77259C9937L77088j0088D0441b82441A00152
15250A57419J00316P41507L22670m47272N30582j52533C84868j17214J02355O4133
15240D34142B6776K4116J29689a25945H0692e5371m0645o5507O7444n8230C06113
15228B86635E942J37641h7230j52492B13760h0039K6316B47048a2315r3352D6728
$$ y = [-135889, -76172, 22862, 33551, -245077, 111308, -41423, 103427, 219081, -108259, 185020, 206024, 20050, 207911, 124526, -47866, -374088, -76429, -114425, 146875, -147490, 64935, 34312, 88329, -43984, 355935, 214317, -72938, 229641, 6720, -106707, -399367, 261111, 48476, -192195, -213304, -139416, -94642, -64756, 13410, 122800, 56346, 124255, 44430, -72342, -340974, 184991, 34607, 22285, 299544, 39937, 417025, 406937, 40441, -282441, 100152, 157419, 257735, 999242, 1321912, 874640, 1405222, 1252689, 384868, 267654, 370009, 434142, 26776, 50892, 180581, -125945, 80692, -55371, -96016, -161523, -94079, -152309, 306113, 286635, 5942, 143583, -87230, -239722, 213760, -80039, -53723, 247048, -12315, -105667, 46728]
15216D44494j98842L539c18316A23299K14595b78488C34244I5150J96969J9503
15206C11622c8490J6304B2577J20365F7124J35198j0309H6471l9099P9466M2436
15195A69274H1939g4771p5634B72305b97279C08230F690L2720e8581E387i7378
15183E4097J34032J29854f6150A06237K56820j19321G8283L28669C6906K45431
15173B82337g9123J6376A72349h0823B51337A20301c0277D6212O8012g0489H7380
15161i0179a3702B59564n0863D0901a83068e9684A11219P6000a22789e4603B08213
15149I9318N0354J32645n3484a93185H5682C8012J65778p3454b7155B60890A7570
15137D14237A83636b58187F2108j341a78364e3141B02316l2653j9771E7624a40634
$$ y = [444494, 245652, 249191, -318316, 123299, 337894, -278488, 334244, 95150, 292119, 311622, -38490, -22186, 22577, 142942, 67124, 202322, 192013, 86471, 47372, 126838, 169274, 81939, -74771, -150405, 272305, -297279, 308230, 6690, 39410, -58581, 5387, -97378, 54097, 188129, 317983, -66150, 106237, 363057, 243736, 78283, 406952, 36906, 282337, -79123, -62747, 172349, -80823, 251337, 120301, -30277, 46212, 114224, -70489, 87380, -90179, -13702, 259564, 208701, 40901, -183068, -59684, 111219, 187219, -122789, -54603, 208213, 99318, 149672, 282317, 228833, -193185, 85682, 38012, 203790, 130336, -27155, 260890, 17570, 414237, 183636, -258187, 62108, 60767, -178364, -53141, 202316, 169663, 149892, 57624, -140634]
15125g6416p4151C25104A09100K54774l0633A12952L06004p5125c23B15284k2788
15114A92496N2806j4956Q7667f5145g998I3025M4335J71043j34891K74712k08676
15103B39548B1548a50064e7649C23546l7822a13268A3758f8542C50400j53415
15093A96985K98207j28945A70007g3534j30637N0868e7775A50470K7039A997N10786
15082E12783a6657R39D03034J8660A94344a19279C52548o8794q9421J39083F6671
15070A31388r289L02241j86676A0449K03645a9848A60807a07870A94518O8561
15060B63079b0760C51632c4034C70317h4953A46465J7668K39707E5505N0984L3334
15049A39823m47J42186A26619L2273o0188e3903B65146J44632j32918a0247B49117
$$ y = [-76416, -150567, 325104, 109100, 363874, 333241, 112952, 418956, 343831, -323, 215284, 192496, 245302, 230346, 318013, -65145, -7998, 93025, 137360, 308403, 173512, 448224, 239548, 21548, -150064, -57649, 323546, 285724, -113268, 13758, -68542, 350400, 196985, 495192, 366247, 170007, -73534, -204171, -153303, -57775, 150470, 177509, 1997, 512783, -16657, -15718, 403034, 421694, 194344, -119279, 352548, 283754, 194333, 333416, 66671, 131388, 122099, 424340, 237664, 10449, 214094, -19848, 160807, -107870, 194518, 263079, -20760, 351632, -34034, 370317, -84953, 146465, 164133, 403840, 55505, 106489, 139823, 139376, 281562, 126619, 158892, 98704, -53903, 265146, 409778, 276860, -10247, 249117]
15037A74506q7246B1209J2697E113d4922A17536J20231O6995A40870a82570H3876
15025H3363e3132B09681K18581a42192L4773A55795L37477A4654M38494F8601
15014b9185C56515A75436J62877f9484B22988j1786O3581J35441d3931A07423
15003C75660c2559A58909o4057J68147a05372I2571l726K74083P782D6891P4917
14992A21808E4636J56255R6559i5605n5084D29114j12557p8909k5344O4632j30498
14981A46438K26834A78828A7471Q1366d7319A38793F7527K20829K3283F5040M81332
14970E46372B54276J0497j24323K88878j36730A43720K3624J18595q9844f2227
14959E61401B06777r310P2119N2744j3137N1676J55847j34636A89390K60603A20431
$$ y = [174506, 87260, 21209, 33906, 5113, -44922, 117536, 237767, 304762, 140870, -182570, 83876, 83363, -53132, 209681, 428262, -142192, -107419, 155795, 493272, 14654, 453148, 68601, -29185, 356515, 175436, 338313, -69484, 222988, 211202, 274783, 410224, -43931, 107423, 375660, -32559, 158909, 94852, 262999, -105372, 92571, 88845, 362928, 370710, 46891, 121808, 54636, 210891, 307450, -95605, -150689, 429114, 316557, 237648, 212304, 276936, 146438, 373272, 178828, 17471, 98837, -47319, 138793, 67527, 288356, 311639, 65040, 546372, 254276, 264773, 140450, 429328, 292598, 143720, 167344, 285939, 196095, -62227, 561401, 206777, 197467, 269586, 322330, 309193, 360869, 516716, 382080, 189390, 449993, 120431]
14947C53440A29492J92924K02573J6861j25040A74414J19043J92780c1621E54961
14936A30263K37117j38980J02811J72335B15190M7710J62752k6978J2724j91817
14926B19581J33107P6062j34970j3301L2802L03603H4878J32102O0933R8714M6368
14915D22995P4209k35148K37554j55500j26086J84498j1318m1359A03420L79871
14905D83291r5844J29863K7273b3211B37240J45263k6226K62399H1216L22491
14895D03707L0807A65640J43749J76859R0750k81441p1175J7648L45755q4783
14885E03002j69703l6338p3405L05845j356B30891K4799J35602j80857J00670
14875C11105K6853J17368A01867L87292k39306J79771l0795N85632C21903O7884
$$ y = [353440, 129492, 322416, 524989, 541850, 416810, 174414, 293457, 486237, -31621, 554961, 130263, 367380, 228400, 331211, 503546, 215190, 262900, 425652, 398674, 411398, 219581, 352688, 428750, 293780, 280479, 313281, 616884, 84878, 216980, 277913, 376627, 422995, 497204, 262056, 499610, 344110, 218024, 402522, 391204, 349845, 103420, 483291, 387447, 517310, 544583, -23211, 237240, 382503, 356277, 618676, 81216, 403707, 434514, 165640, 309389, 486248, 576998, 295557, 224382, 242030, 587785, 503002, 333299, 296961, 223556, 529401, 528045, 230891, 255690, 391292, 210435, 311105, 337958, 455326, 101867, 489159, 249853, 429624, 398829, 984461, 321903, 389787]
14865C89787j17168k1359O4225J56903j88742r0124q1563J98094J16129R7347
14855E23529k13861q5107J13016J11352l213M7751p6067L08933l08907J39811
14845E57237j12289J83385d7064C54991r2848j03538M56794j31089B36562Q3711
14835C20273o747j02986M93460C07811q6756L57756o1236j53362K33616J35232
14825G33061l07301j98100M60662j80068p6877J51975j78151J04039k29670R4456
14815C74026m8925Q5161J01004l8921P9886q1285j0171r5662J03981k3833r5671
14804C49590J1532J89053J47740j48329K0471K4232j06322j19478j21189M67811
14794G15111l18026J65498k00595j70594P86895D41720M56467k89361P1293M7171
$$ y = [389787, 272619, 251260, 315485, 472388, 283646, 193522, 111959, 310053, 426182, 523529, 309668, 224561, 337577, 448929, 445716, 493467, 417400, 726333, 417426, 557237, 444948, 628333, -47064, 354991, 262143, 158605, 615399, 484310, 236562, 320273, 313526, 210540, 704000, 307811, 221055, 578811, 517575, 364213, 597829, 733061, 425760, 227660, 688322, 508254, 431377, 583352, 405201, 509240, 279570, 374026, 325101, 410262, 511266, 472345, 552231, 470946, 460775, 365113, 469094, 445261, 349590, 361122, 550175, 697915, 549586, 570057, 594289, 487967, 368489, 247300, 715111, 397085, 562583, 361988, 191394, 978289, 441720, 898187, 608826, 680119, 727290]
14784G27290l61075J75360L55J86465q0126j98730O8277m2367K87730k75002P9102
14773E67279L16324C86681K79556j83590j66721L25123q2776J94566o4257p9875
14763F08707J04197K87672k68245k0456j06841K4872p2740P2854K18721l66707
14753D82034K30819k30868M96583l20187K57088m12431L6735K34683J25071D31991
14742H54609q3144K5362r7166k0582L64182l34263J68319N1979j83674J59906
14732I05528j93365j28549M33484l64771K29965P1595r4062k67307K5495J60554
14722G78567O1795k44264J43484K35972j15402J1096J27532j13061k54448J86341
14712H17612N6374m02127N07287j70786L359r2858J48310J07320j8385j45814
$$ y = [727290, 366215, 541575, 541930, 728395, 648269, 449539, 517816, 475449, 763179, 488177, 567279, 883603, 386681, 666237, 482647, 315926, 641049, 558273, 752839, 688582, 608707, 712904, 1000576, 732331, 711875, 605034, 629906, 557166, 630020, 848741, 482034, 712853, 481985, 978568, 658381, 915469, 503038, 539773, 774456, 899527, 431991, 854609, 771465, 796827, 699661, 679079, 1043261, 708998, 877317, 929296, 745622, 905528, 712163, 583614, 1017098, 652327, 882292, 953887, 859825, 592518, 618013, 778567, 840362, 596098, 739582, 975554, 860152, 871248, 998780, 885719, 631271, 817612, 873986, 471859, 979146, 808360, 811719, 718861, 867171, 974491, 956106, 810292]
14702H10292j25712J24816K82193k34207L20801j08676k28384k26304N17264l982
14692A128101J08440k15420j16112O1799J91870l1405L7436k10230J5602n6536
14682I13545P2144J72408k84521M55763m36997J73824n6765J36487q7039J66020
14672A224869k27808n8539J04269l12517L39486m6051L1710J2265J43789j78771
14662A032702K92601j54609J16082n5305q4454J25762j73378n0341M15434k61627
14652A202867p1512q3432J23898m5938L35334L7117k61403j67002m6917M11441
14642A434453j6057J35387j57673Q14r468k27641J51612K80590j69336k37543
14632A185138K97624p4899l33456J43739P7175O7736K04795l58393L05372K7621
$$ y = [810292, 684580, 809396, 1091589, 857382, 1178183, 1069507, 841123, 614819, 1132083, 1128101, 1236541, 1021121, 905009, 966808, 1158678, 1127273, 1164709, 954479, 970081, 913545, 985689, 1158097, 873576, 1329339, 892342, 1066166, 1009401, 1145888, 1058849, 1224869, 997061, 938522, 1042791, 730274, 1069760, 1023709, 1055419, 1067684, 1211473, 1032702, 1325303, 1170694, 1286776, 1231471, 1147017, 1272779, 1099401, 1049060, 1464494, 1202867, 1131355, 1047923, 1171821, 1125883, 1461217, 1498334, 1236931, 1069929, 1023012, 1434453, 1418396, 1553783, 1396110, 1396924, 1387456, 1159815, 1311427, 1592017, 1422681, 1185138, 1482762, 1407863, 1074407, 1218146, 1295321, 1363057, 1567852, 1209459, 1514831, 1542452]
14622A542452j4532R2841k17108J59125K3207j22577K89947J9231m79774L21031
14612A613843n386r0284Q9851j51018R1916K75819k03792r2903M43692j52470
14602A819268k75234J42530j1311j23370J56640K82985P5589k54325j90923K65439
14592A887288m9320J72429J33329J8818l21605K18035k65111j09854L79070l1671
14582B031408R6181m0279J41200k51981J32395j83625M23890k64775m0291O22649
14572B666772n15415j07851N98333o74116O12688M1934N9937j17424j44197M09276
14562B829937K4505k73673M07984R6529j82008J34492L33883J09037M37193K25186
14552D143065M80880J27793J356653J799921M014364R300491J8164225N125665
$$ y = [1542452, 1527920, 1620761, 1403653, 1562778, 1585985, 1463408, 1753355, 1772586, 1292812, 1613843, 1608457, 1518173, 1608024, 1457006, 1548922, 1824741, 1620949, 1528046, 1971738, 1819268, 1544034, 1686564, 1675253, 1551883, 1708523, 1991508, 2067097, 1812772, 1621849, 1887288, 1837968, 2010397, 2143726, 2162544, 1840939, 2058974, 1793863, 1684009, 2063079, 2031408, 2127589, 2087310, 2228510, 1976529, 2108924, 1925299, 2349189, 2084414, 2044123, 2666772, 2151357, 2043506, 2641839, 1967723, 2580411, 2622345, 2682282, 2564858, 2420661, 2829937, 2854442, 2580769, 2988753, 3085282, 2903274, 3037766, 3371649, 3480686, 3917879, 4143065, 4623945, 4751738, 6108391, 7908312, 11922676, 21223167, 39387392, 44513057]
14544D4513057B0120940I009519l791830j418914r77016n00046j29255K04917
14536B397375J70802k36605k22732J12641K11311k3771k31039K41583k1573k3330
14526B374662K74235j48670O8657k92430M03607m78366L93954j11300j27608O71160
14516C027901N5312l08909K701k81561N14878k19766K39885K11700O244l47548
14506B900837J07195j89218J89477K62759l11375P04623m21831J52735j14460
14497C280742K76289j18971n8664L78888l57477L51225j16308k53465N92372j71799
14487C802832j11252q3205L14423j6822J02717J30876K54707j72401l91302M32836
14477D263409R864j5641O2832K41699l94720M84470j37608r0661K1271J41694
$$ y = [44513057, 20120940, 9009519, 5217689, 3798775, 2821759, 2321713, 2192458, 2397375, 2568177, 2331572, 2108840, 2221481, 2432792, 2409021, 2177982, 2419565, 2397992, 2374662, 2648897, 2500227, 2568884, 2276454, 2680061, 2201695, 2595649, 2484349, 2356741, 3027901, 3083213, 2774304, 2777005, 2495444, 3010322, 2790556, 3030441, 3242141, 3248385, 2900837, 3008032, 2818814, 3008291, 3271050, 2959675, 3664298, 3242467, 3395202, 3280742, 3557031, 3438060, 3379396, 3758284, 3400807, 3752032, 3635724, 3382259, 3974631, 3802832, 3691580, 3608375, 3922798, 3905976, 4008693, 4139569, 4394276, 4221875, 3830573, 4263409, 4273273, 4257632, 4320464, 4562163, 4167443, 4651913, 4514305, 4423644, 4444915, 4586609]
14467D586609K33583P6134J45752l38527J29967J13049K64115p1676J31606l01693
14457D968919O30513l95171L64313l29815M55634p7038N9446R4444o2745O2492
14447E770992P2899j43954N05642j64930K38084L676k84060L41203K22537L10896
14437F872985q7641j85335N00534j50196J82669J41290j93786K17736J73593J44570
14427G616419j51299P2137N7757M91355l28667O18900l9239o922k30864L38150
14417H437727N73198k16685L15784L01709j52518K78914j11202p9406k4217O76618
14407I999922M5256j11986P03278o4064j45388O42501J71882j91496M67568j44895
14397A1372578L91034Q036L12488K21534J40931K26468L15037j57960O83428Q3191
$$ y = [4586609, 4820192, 4896326, 5042078, 4703551, 4833518, 4946567, 5210682, 5139006, 5270612, 4968919, 5599432, 5204261, 5568574, 5238759, 5694393, 5617355, 5676801, 5771245, 5708500, 5770992, 5843891, 5699937, 6205579, 6040649, 6278733, 6282409, 5998349, 6339552, 6562089, 6872985, 6785344, 6600009, 7100543, 6950347, 7133016, 7274306, 7080520, 7298256, 7471849, 7616419, 7465120, 7537257, 7595014, 8086369, 7757702, 8376602, 8337363, 8330441, 8099577, 8437727, 9010925, 8794240, 9110024, 9411733, 9259215, 9538129, 9426927, 9347521, 9323304, 9999922, 10045178, 9933192, 10636470, 10572406, 10427018, 11069519, 11241401, 11049905, 11517473, 11372578, 11763612, 11771648, 12084136, 12305670, 12446601, 12673069, 12988106, 12830146, 13513574, 13596765]
14387A3596765K27900J19526N07077R7040L60711K72616J22830M95158J47492
14378A5947115J30613M90240J52020N12545J15876M72865K95099L76329N82228
14369A9074930K69799m3049R37533L41035J21297M34790M35505N76689Q64061
14360B3012590O9504N14319O09835P59606K66213M47242P07708P52270K05146
14351B7344433R97651M93031R07497P53093N38284J130482L77155J214553R40152
14342C4696331J026254N36771J193425P75676J161773R10436J376652R75169J549298
14333D4201785R57616J382855J563827J105410J508829K056160J283691J928704
14325E5988877J825423K104213J542576K298449J869022K623707K272812K346217
$$ y = [13596765, 13824665, 13944191, 14451268, 14548308, 14909019, 15181635, 15304465, 15799623, 15947115, 16077728, 16567968, 16719988, 17232533, 17348409, 17821274, 18116373, 18492702, 19074930, 19344729, 19301680, 20239213, 20580248, 20701545, 21136335, 21571840, 22148529, 23012590, 23082094, 23596413, 24206248, 24965854, 25232067, 25679309, 26387017, 27139287, 27344433, 28342084, 28835115, 29742612, 30495705, 31033989, 32164471, 32541626, 33756179, 34696331, 35722585, 36259356, 37452781, 38228457, 39390230, 40300666, 41677318, 42652487, 44201785, 45159401, 46542256, 48106083, 49211493, 50720322, 52776482, 54060173, 55988877, 57814300, 59918513, 61461089, 63759538, 65628560, 68252267, 70525079, 72871296]
14317G2871296K668150K899053L171532K893052L209269L400572L544839L456901
14309I8114664M529320L813308M531091M740948M804030N095570N930440N798115
14301A37357486N635206O788104O848329P573416P304467Q595768Q276468R067389
14293A97446633R446457J0441891J0315851J1219693J1628795J2478917J2435764
14286B75414001J3318485J3749661J4050008J4157735J4263220J4899288J4520164
14279C74372562J4015380J3878395J3217756J2585607J1598854R492664P582023
14272D56743241M542491K018388J489355l91549k706107m545006o493709q137085
14264D42520019r194614j0694932j2250104j3224948j4118835j4717256j5464930
$$ y = [72871296, 75539446, 78438499, 81610031, 84503083, 87712352, 91112924, 94657763, 98114664, 102643984, 106457292, 110988383, 115729331, 120533361, 125628931, 131559371, 137357486, 142992692, 149780796, 156629125, 164202541, 171507008, 180102776, 188379244, 197446633, 206893090, 217334981, 227650832, 238870525, 250499320, 262978237, 275414001, 288732486, 302482147, 316532155, 330689890, 344953110, 359852398, 374372562, 388387942, 402266337, 415484093, 428069700, 439668554, 449161218, 456743241, 461285732, 463304120, 464793475, 464401926, 461695819, 457150813, 450657104, 442520019, 433325405, 422630473, 410380369, 397155421, 383036586, 368319330, 352854400]
14257C52854400j5226151j5258731j3899012j4355869j3855208j3399106j2794284
14250B54066039j2180685j1684839j1296626j0311190j0247233r190375q575163
14243A80579928q641976p873030p440570p088957o755079n863699n713361n842320
14235A25360936n534233n315952m034975m805362l864600l858700l726196m052081
14227I0168837l442574l145871l245900k969776k764125k607054k218618k484918
14219F7290001j923077k467100k064117k241380j568255j872060j046347k003969
14211E2103696j457502j823261j625185j030574l05872j664590j605213j209448
14203D1382051j442578r14006p47263o80121j272489o40557j248342j070479j071247
$$ y = [352854400, 337628249, 322369518, 308470506, 294114637, 280259429, 266860323, 254066039, 241885354, 230200515, 218903889, 208592699, 198345466, 189155091, 180579928, 171937952, 164064922, 156624352, 149535395, 142780316, 136916617, 131203256, 125360936, 119826703, 114510751, 110475776, 105670414, 101805814, 97947114, 94220918, 90168837, 86726263, 83580392, 80334492, 77364716, 74600591, 71993537, 69774919, 67290001, 65366924, 62899824, 60835707, 58594327, 57026072, 55154012, 54107665, 52103696, 50646194, 48822933, 47197748, 46167174, 45861302, 44196712, 42591499, 41382051, 39939473, 39025467, 38278204, 37598083, 36325594, 35685037, 34436695, 33366216, 32294969]
14194C2294969m05914o72697n15474q01385q32312j285160m76695n80142l07319
14185B6417871j035803p7898p59093q13957j29355j038967m7027m78873j36328
14176B1900570r39437j22534m99789k57282n51840m79222l38931j85595m95930
14167A8030010o01992o5173j20230l28684l71946o69431l04634n1656J4306o13448
14157A4917122J00156k89923l89153l83403k27561l46758J8002j09845m35069
14148A2853568k5501n81201P107j13739k65226p5778k11934r0321l41672p2888
14138A1082415j13013l68883P7287m34624N9087j07606k5605p6498l21309j70765
14128I600486m87082K06015k15292j49833O8992l27185j43637j70127J3515J22823
$$ y = [32294969, 31889055, 31216358, 30700884, 29899499, 29067187, 27782027, 27305332, 26725190, 26417871, 25382068, 25304170, 24545077, 23731120, 23601765, 22562798, 22515771, 22036898, 21900570, 20961133, 20838599, 20338810, 20081528, 19529688, 19050466, 18711535, 18525940, 18030010, 17428018, 17362845, 17242615, 16913931, 16541985, 15872554, 15567920, 15516264, 15530570, 14917122, 15017278, 14727355, 14338202, 13954799, 13727238, 13380480, 13398482, 13288637, 12853568, 12828067, 12246866, 12253973, 12140234, 11875008, 11799230, 11587296, 11496975, 11155303, 11082415, 10969402, 10600519, 10677806, 10243182, 10302269, 10194663, 10169058, 10092560, 9771251, 9600486, 9113404, 9319419, 9104127, 8954294, 9023286, 8696101, 8552464, 8382337, 8395852, 8518675]
14118H518675l11156m67009K44182k8820m0191o09548L26643R0268l90952J11343
14108G443435k34878m1783k58306N3212j44609n3910j46876l9888k67877K21478
14098F529998J67303j50087j3971k78426k19422J36143j60091J92773l97850K83066
14088F089436l84213N6233j7754j83663N3804k10878m3128l68343j8071k6717
14078D946706N1445J61505p3941k14125L9899K04051j84746l00246J5171J70880
14068D816599j57023j18776J18365n41429K28011J53978r4541k14371L1367L3885
14058D256065J50052j5527j74521j71519j1097j22306k68890L07209L11098k00746
14048D059818m0163l35773N7161m19374n8479L61838j12930O429N12262l41337
$$ y = [8518675, 8207519, 7740510, 7984692, 7955872, 7915681, 7306133, 7632776, 7723044, 7332092, 7443435, 7208557, 7166774, 6908468, 6961680, 6817071, 6763161, 6616285, 6576397, 6308520, 6529998, 6697301, 6547214, 6533243, 6254817, 6035395, 6171538, 6011447, 6204220, 5806370, 6089436, 5705223, 5761456, 5743702, 5560039, 5613843, 5402965, 5359837, 4991494, 4973423, 4946706, 4998151, 5159656, 5085715, 4871590, 4911489, 5115540, 4930794, 4630548, 4645719, 4816599, 4659576, 4540800, 4659165, 4117736, 4345747, 4499725, 4405184, 4190813, 4222180, 4256065, 4406117, 4390590, 4216069, 4044550, 4033453, 3911147, 3642257, 3949466, 4260564, 4059818, 4019655, 3683882, 3741043, 3321669, 3263190, 3625028, 3512098, 3518527, 4030789, 3689452]
14038C689452j37732l65162L51196l21589L4443J81502q7254k0494J45441n7385
14028C412418j15261l37614J86880O8331l22699l4973o2894J78760o8113K05315
14018C110150m18956L02247j68490L35285k23855k02370J34550k70560j49094
14009B448907Q8575K03603O5331q7352k62071J1590J1317l4123J90225j39470
13999B496532J1101k90427Q7147n977M6219r3066K28283K60618j18521J071570
13989C693479P64678K263645P039423J8466221J3696951k1019004j1431455m527635
13981H946303k436792j406421k95940j010820K70880q40682J16243j74443j17920
13972C050408O8297m12756j9242K4577n58466O93568n76301K60299m35352M27031
$$ y = [3689452, 3551720, 3186558, 3537754, 3216165, 3250608, 3432110, 3344856, 3324362, 3469803, 3412418, 3297157, 2959543, 3146423, 3214754, 2892055, 2857082, 2794188, 2972948, 2904835, 3110150, 2691194, 2993441, 2824951, 3160236, 2936381, 2734011, 2868561, 2598001, 2448907, 2537482, 2741085, 2806416, 2719064, 2456993, 2468583, 2479900, 2445777, 2636002, 2496532, 2507633, 2217206, 2304353, 2298376, 2344595, 2251529, 2479812, 2740430, 2621909, 3693479, 4458157, 6721802, 13761225, 32227446, 45924397, 24905393, 13473938, 8946303, 6509511, 5103090, 4807150, 3796330, 4067210, 3226528, 3342771, 3168328, 3050408, 3118705, 2705949, 2686707, 2711284, 2152818, 2846386, 2270085, 2530384, 2095032, 2522063]
13962B522063j99946j2289j355l475k5736l18402P2708k0242J67694K54073p23987
13951A711106M81122J23682k93252K50184l03174K26923j08711K90395k95310
13942B082965k28980M378m988R657J09123J84858l41497J86801k20383o3483r7786
13931A620665L10548l20686J30570L0634k80660K17418r1761N5716p6780p4171
13921A521493J65162j8080j11853j33928N3952K82246k72517K50284N922m16812
13911A325869N90201k9266l46794J9998K2290j49403J39395p4864n578j37609
13901A354239k8909J10856J40349M0300r7200J2677n9410l65713L19494J43857
13891A570540m77458J49742K51709N9935k27687j08736J22358O3608L39407j76959
$$ y = [2522063, 2322117, 2309828, 2308473, 2304998, 2279262, 1960860, 2033568, 2013326, 2181020, 2435093, 1711106, 2192228, 2315910, 2022658, 2272842, 1969668, 2196591, 2087880, 2378275, 2082965, 1853985, 1858363, 1853375, 1863032, 1972155, 2157013, 1815516, 2002317, 1781934, 1718451, 1620665, 1931213, 1610527, 1741097, 1771731, 1491071, 1708489, 1616728, 1672444, 1595664, 1521493, 1686655, 1668575, 1556722, 1422794, 1476746, 1758992, 1486475, 1736759, 1742681, 1325869, 1916070, 1886804, 1540010, 1560008, 1582298, 1432895, 1572290, 1497426, 1491848, 1354239, 1325330, 1436186, 1576535, 1616835, 1519635, 1532312, 1472902, 1107189, 1426683, 1570540, 1093082, 1242824, 1494533, 1554468, 1326781, 1218045, 1340403, 1404011, 1743418, 1566459]
13881A566459m96329M19035j19161k21176J28480j81218K66556R9919l10550L24229
13871A476244K8907k78889q8795M24844k1390k28152J0793l93900K19325j75835
13861I73152K82774r1993L23957l05331p4031k65585K65467n137j3742m2685j83425
13850H63421M40557j72111o909N9022j49559J12834n09725J28069J82193R4217
13840A042009O8030m89690K83553j50984J06704L58727K2k03070J54398p736j44018
13829A017945j70829M03220l03087l53862L49507L0683j3336p5623M6905r7577
13819H33946l24229M85227k22246J7425j51001K79677L5989J28013j94839k59531
13809F28431J13244K59525m44495P25192n21506K08676r3415j87516J18891j87506
$$ y = [1566459, 1070130, 1489165, 1370004, 1148828, 1277308, 1096090, 1362646, 1462565, 1152015, 1476244, 1505151, 1226262, 1137467, 1562311, 1540921, 1312769, 1323562, 929662, 1148987, 973152, 1255926, 1163933, 1487890, 1182559, 1108528, 842943, 1108410, 1103273, 1089531, 1046846, 863421, 1303978, 1131867, 1124958, 1183980, 1034421, 1147255, 637530, 765599, 947792, 1042009, 1110039, 620349, 903902, 752918, 859622, 1218349, 1218371, 1015301, 1169699, 1161963, 1017945, 847116, 1250336, 947249, 593387, 942894, 973577, 960241, 884618, 931523, 833946, 509717, 994944, 772698, 790123, 639122, 918799, 954788, 1082801, 887962, 628431, 741675, 1001200, 556705, 1281897, 760391, 969067, 875652, 688136, 807027, 619521]
13799F19521K36223J35941k190k34471L58145j79118j77538k15259P8996J32491
13789G52741J68462Q2080j02908k314j76770K81511L0768n5402m41331K37434
13779G74271m0784j15115K80838j5900l25448J97185k18023K16987J32422l05856
13769E80577J43625K33924k84971k4242R1128q3282O0468J96925j02914j67191
13759F44047J4949j14673J13160j13349j23229N95856l64598j6925Q3873j16501
13749F02610J19989K09176l41770r0115O3489o618J34684J30938j07714j07480
13739F07189k50233K06825J28155J12710r0033l8298B26681M59303K5043K9436
13729G40463j83001k59149M22841P658l56957K40864K24356o6177j47580K04343
$$ y = [619521, 855744, 991685, 989495, 755024, 1113169, 934051, 756513, 541254, 620250, 752741, 921203, 1003283, 900375, 898061, 721291, 1002802, 1033570, 978168, 536837, 774271, 733487, 618372, 899210, 883310, 557862, 755047, 537024, 754011, 886433, 580577, 724202, 958126, 673155, 648913, 740041, 656759, 717227, 914152, 811238, 644047, 658996, 544323, 657483, 544134, 420905, 1016761, 652163, 635238, 719111, 602610, 722599, 931775, 590005, 499890, 563379, 556761, 691445, 822383, 714669, 607189, 356956, 563781, 691936, 804646, 714613, 676315, 226681, 685984, 711027, 740463, 557462, 298313, 721154, 728812, 371855, 612719, 837075, 770898, 623318, 827661]
13719H27661k60884j40923R4754m6028J90624k63429K77237Q072l40925O03241
13709I49400m44257j59800L65901l05384K72900K8108j81091M41473C55732K5598
13699C81330L42273l57180K51350R0395k17812J02364O1805O6190L5593n8009
13689F98299j51506J30379j91399j2945M6922k8912p34o8294K37259A95508J92807
13678C88315K49824k57002L38769k73111j1732K2281J64520O6060l41816I8501
13667C30112K15172p0915J6363j39947L08308A96699K48866J75491B93861K06040
13657D99901K44823k36011J63940j669j96227r5476j35065M82886C16741O3064
13647C79805M10317C94597J40174j75537k4984J32316L2894J31018k30266K13022
$$ y = [827661, 566777, 425854, 520608, 474580, 665204, 401775, 679012, 687084, 346159, 949400, 505143, 345343, 711244, 405860, 678760, 706868, 525777, 967250, 355732, 381330, 723603, 366423, 617773, 708168, 490356, 592720, 654525, 720715, 756308, 698299, 546793, 677172, 485773, 472828, 519750, 490838, 490104, 421810, 659069, 195508, 388315, 638139, 381137, 719906, 446795, 435063, 457344, 621864, 687924, 346108, 98501, 330112, 545284, 474369, 490732, 350785, 659093, 196699, 445565, 621056, 293861, 499901, 744724, 508713, 672653, 670984, 474757, 379281, 244216, 727102, 316741, 379805, 790122, 394597, 534771, 359234, 334250, 466566, 499460, 630478, 400212, 613234]
13637F13234j44752J63628k26130O2631k16382M08335B33182Q0718J51168j53459
13627C11609K3330L00570k68034K99429j95130Q3840k26584I3655Q3848J46102
13617C23605L23237k01791k21812K98980j9179j38506L79123l62779R2264A20647
13606G91305C19643O4026L08247C09186A36996M66821k25791c9772B04566K76381
13596D80947q5910J58515k10178J38500K5652k32992J02521A36690J60523J40007
13586D37220A64905J18640N1544J88191j04850J9708q8088L7265l9107R9114l5951
13575D11371K43405j86873p3854K80218k79439r2886h1481D18972j15935J82584
13565D85621O505k32164J2456c0994C30179J46453I9888K65667j11408J94751
$$ y = [613234, 468482, 632110, 405980, 468611, 252229, 660564, 233182, 313900, 465068, 311609, 334939, 635509, 367475, 666904, 471774, 555614, 329030, 93655, 177503, 323605, 646842, 445051, 223239, 522219, 503040, 364534, 743657, 380878, 473142, 120647, 791305, 319643, 383669, 691916, 309186, 136996, 603817, 378026, -39772, 204566, 480947, 395037, 553552, 343374, 481874, 507526, 274534, 377055, 136690, 297213, 437220, 164905, 283545, 335089, 523280, 418430, 438138, 350050, 387315, 348208, 447322, 411371, 654776, 467903, 394049, 674267, 394828, 301942, -81481, 418972, 303037, 485621, 492126, 259962, 272418, -30994, 330179, 476632, 99888, 365555, 254147, 448898]
13555D48898j81644Q3882k8577j3361J8585j37969L15553D1814J80008e1452B56443
13543D18162O2765k6391q2286j05225G7312J02998Q1644A01471Q5934D2924K99211
13532C42135L3061m6997M3864j34635p2705J92602J50236J28087C13933L0218
13522C44151m5161q8869L71681k18486o187K66522C8912K61612j3986A38243l7985
13511A00258L53664k16922J1299J22526j13643Q7644A66515J07797J71745B12684
13500a5605B45516L00047j42650j85461J73483j54286K20798L6851J09102k89420
13490C13980j45290M16634a5071A99626r4327L9152J36004M3140K8789a27731
13479B37545j16367K54403k4946J48K53725A13815J9054K67686j85303H8770O6493
$$ y = [448898, 267254, 351136, 322559, 309198, 327783, 189814, 505367, 41814, 221822, -51452, 256443, 418162, 480927, 454536, 372250, 267025, 77312, 180310, 261954, 101471, 187405, 42924, 342135, 375196, 328199, 372063, 237428, 164723, 357325, 507561, 635648, 313933, 344151, 298990, 210121, 581802, 363316, 357129, 623651, 38912, 300524, 286538, 138243, 100258, 453922, 237000, 248299, 370825, 257182, 344826, 166515, 274312, 446057, 212684, -15605, 245516, 545563, 402913, 217452, 390935, 236649, 457447, 494298, 603400, 313980, 168690, 585324, -15071, 199626, 105299, 144451, 280455, 323595, 352384, -127731, 237545, 121178, 375581, 350635, 350783, 604508, 113815, 132869, 400555, 215252, 88770, 155263]
13468A55263K04241j00998A24156M6409J3221J4839J2923o0865N2506K15919j48643
13457B70465D4128d0870C83276A34142J87573j6685Q6056q4399k3968O6651G1484
13445H306K62046N7819o0419K2660g6289J9718A91834N0162D3522a492B03008
13433A34843n1070K74064j02337I4815K58019A33279L52906B01752J17775I1187
13422A17688b09593e3017B95936P7429D6683J59249D1737M1417N1136J97140J71793
13411E03223i2460B20808G5872L48667b7951B59087p5343n3080P2624q6599J1764
13400A28453L3452A0108K84257j17287L32003A93896j8019J33908k8691R0957
13390C72051a47765B08852c5932r229B95707l7116k8841I8237J86047E7131a71848
$$ y = [155263, 359504, 258506, 124156, 170565, 183786, 198625, 211548, 150683, 203189, 419108, 270465, 44128, -40870, 383276, 134142, 321715, 305030, 391086, 306687, 282719, 349370, 71484, 8306, 270352, 328171, 267752, 290412, -76289, -56571, 191834, 241996, 43522, -1492, 203008, 134843, 83773, 357837, 255500, 94815, 352834, 133279, 486185, 201752, 319527, 91187, 117688, -209593, -53017, 295936, 373365, 46683, 205932, 41737, 83154, 134290, 331430, 503223, -92460, 220808, 75872, 424539, -27951, 259087, 183744, 130664, 203288, 116689, 128453, 161905, 10108, 294365, 177078, 509081, 193896, 175877, 309785, 281094, 372051, -147765, 208852, -35932, -45161, 295707, 258591, 229750, 98237, 284284, 57131, -171848]
13378A02572L2080M72451B99082n2072N5055A34040L68284j47562j9044J5351
13368C51069N2758j46043l6228J36848l0427q4606J76893H7892L29432D2496J60895
13357B03391K7630m8019m9076j5831L90961j48461g3642C4946N23688A16419K72874
13346C89293j6410n7668k1384j08722K3081j01588K79635j24035K91211j90768
13336C62645h1266E0868d8852B80631A13423L33398A80143K44318E5493K59405
13326C14898A18564L57672A24257Q7661p7686K23459k3615J4302c8822C08469
13315a28790E5072K745b07882A93494N7011n9323k3353E0100M57283A44116i3433
13303A46282Q4124A03483a5035l5462I5540L1068P9001a28840A76466a8803C35847
$$ y = [102572, 134652, 607103, 299082, 247010, 302065, 134040, 502324, 354762, 335718, 351069, 403827, 257784, 221556, 358404, 327977, 243371, 420264, 87892, 417324, 42496, 203391, 231021, 183002, 133926, 118095, 509056, 360595, -73642, 34946, 558634, 116419, 389293, 372883, 315215, 293831, 185109, 208190, 106602, 386237, 262202, 553413, 362645, -81266, 50868, -48852, 280631, 113423, 446821, 180143, 424461, 55493, 314898, 118564, 476236, 124257, 211918, 134232, 357691, 334076, 348378, -38822, 308469, -128790, 55072, 57817, -207882, 193494, 250505, 191182, 167829, 50100, 507383, 144116, -93433, 146282, 230406, 103483, -15035, -50497, 95540, 126608, 205609, -128840, 176466, -18803, 335847]
13291C71292A05317e2583G20370B22928L58421B59921c3542A98406N4182N3788
13281C06376q9017a46574C38089H1557J58177F8304J66378L33114B80747M983
13271B85730J86020M0134A26048J13631A08698i9553B058g344C58195a52618j07605
13260b60223A88422o9024e6551B62378R2036F7001Q8627D2066b6709j32111C01211
13248E7807J13533M048j196k2035J4088E5748N4285b82422A42307E8626O28168
13237F86794b96442B92079e68B58266M2384j41299K9715c65023E0704K58681j18648
13226A90737a84943E9178a9873j05925C9488A0841a23233F7319a67871B51148
13215D2668h8433C1152K67606b6486E9010J93296L8796O5859G7130J25183a82567
$$ y = [371292, 105317, -52583, 720370, 222928, 581349, 259921, -33542, 198406, 252588, 306376, 217359, -146574, 338089, 81557, 239734, 68304, 234682, 567796, 280747, 285730, 471750, 511884, 126048, 239679, 108698, -99553, 2058, -7344, 358195, -152618, -260223, 188422, 119398, -56551, 262378, 354414, 67001, 155628, 42066, -26709, -158820, 301211, 57807, 171340, 175388, 174192, 152157, 166245, 55748, 110033, -282422, 142307, 58626, 686794, -296442, 292079, -568, 258266, 300650, 159351, 189066, -365023, 50704, 309385, 190737, -184943, 59178, -19873, -125798, 39488, 10841, -123233, 67319, -167871, 251148, 42668, -88433, 31152, 298758, -26486, 59010, 252306, 291102, 356961, 77130, 202313, -182567]
13203H2749J44951a7852B49130A12721O8154L2945E2780a02813G1022J07490J0388
13192A88900h7628B80621l9390o2259J11411Q4887A80164G9672M4484P4881j3713
13181A85324m4923e5983A09032e5732A53998J90463Q970A03001J24227d6143A73474
13169b97156b0269C35255a55119A11424A1058O3697N2616L0472N7034d1015C13333
13157i2725B54230K07237a6543j48256j4777B69643E0914k587g085A88174J2113
13146B00287p2067a66662E2210K4403a62207G8710K74584F0276N7488J13959j15041
13135A16682b01073B43095a8865A71853b45717Q3794j42664C13215F1227J84395
13125B45622K42423a1256j05913B79396E6813H673J80008J11897Q3321d2724B97112
$$ y = [82749, 227700, -17852, 249130, 112721, 180875, 213820, 52780, -102813, 71022, 178512, 188900, -87628, 280621, 241231, 178972, 290383, 375270, 180164, 79672, 124156, 199037, 185324, 140401, -55983, 109032, -55732, 153998, 344461, 353431, 103001, 227228, -46143, 173474, -297156, -20269, 335255, -155119, 111424, 11058, 74755, 127371, 157843, 214877, -41015, 313333, -92725, 254230, 461467, -16543, -164799, -179576, 269643, 50914, 48327, -7085, 188174, 200287, 128220, -166662, 52210, 76613, -162207, 78710, 353294, 60276, 117764, 231723, 116682, -201073, 243095, -18865, 171853, -245717, -161923, -304587, 313215, 61227, 245622, 488045, -11256, -117169, 279396, 56813, 8673, 188681, 300578, 383899, -42724, 297112]
13113B12072a62231C95131a29039j9098M8974n00910C13664a15182B50285e6183
13102A2477K9062a35461A15687J74108b41753A11142a11952K0723b2061A53128
13091d63820C1707a28266F1960K36744j07781c11804b418A97746F3522J10951
13081A74473q4340J39423c011B09645E6004J01188J97110B6446J22744J04491
13071B53681K4080b142k08109A93081O2624m1479P6805F6634B5817J3950M01756
13060D41523j89747F1518M12887j98772C9821L4788J62125j09924A5193J45050
13050A60243M2008n138J19646D0099A5203K26836I8467J49337C1237M7293Q5751
13039A64281a90982D84953f4570I4013J66501K07344A49965h8275C64850A25530
$$ y = [212072, -162231, 395131, -129039, -148137, -99163, -600073, 313664, -115182, 250285, -56183, 12477, 41539, -135461, 115687, 289795, -241753, 111142, -111952, -91229, -22061, 153128, -463820, 31707, -128266, 61960, 298704, 190923, -311804, -2418, 197746, 63522, 174473, 90133, 229556, -3011, 209645, 56004, 157192, 354302, 26446, 149190, 253681, 277761, -2142, -210251, 193081, 255705, 214226, 291031, 66634, 25817, 39767, 441523, 251776, 61518, 474405, 275633, 39821, 74609, 236734, 126810, 15193, 160243, 202251, 197113, 316759, 40099, 15203, 242039, 98467, 247804, 31237, 78530, 164281, -190982, 484953, -64570, 94013, 260514, 467858, 149965, -88275, 364850, 125530]
13028A39872K6219K42420j2600A7963J69451q2860L0367K20959A50078C9648a38282
13016e3571B28557K13852M2160a66763m1036C644M67288j49456q8822B9466J56650
13005A86116c4191m3682C68207j72415b62510D75439I007b07503F9519P0029J79292
12994C18840a70325O5588B70788A10466J3559B3755a44681O7754B1910a30527
12983f985r4501k41419a38901A99514C1746P8321C3024L98534b45183E7910J69062
12972B26972b47229B20172i954C74190g8979B45365A1642a82910A73099K35168
12962D08267C3742P9724B512b59701j20115A57453A6713h4774A12537m7785M8700
12951A13452a48297c6515F0272b20697e21B5231N76767i5763A59419A1977R0168
$$ y = [139872, 166091, 408511, 395911, 17963, 187414, 104554, 134921, 355880, 150078, 39648, -138282, -53571, 228557, 442409, 484569, -166763, -207799, 3644, 470932, 321476, 232654, 29466, 186116, -34191, -77873, 368207, 195792, -262510, 475439, 9007, -207503, 69519, 139548, 318840, -170325, -104737, 270788, 110466, 124025, 23755, -144681, -76927, 21910, -130527, -6985, -101486, -342905, -138901, 199514, 31746, 110067, 33024, 431558, -245183, 57910, 226972, -247229, 220172, -9954, 374190, -78979, 245365, 11642, -182910, 173099, 408267, 33742, 113466, 2512, -259701, -379816, 157453, 16713, -84774, 112537, 64752, 113452, -148297, -36515, 60272, -220697, -521, 25231, 601998, -95763, 159419, 11977, 102145]
12940A02145h9474c0206B23714b9425j24516N5061c5367A58728N8463J6826M5792
12929B79809a94269g9324A21571a8668D3786J21843H0048a607A3232a03921D1216
12917b29666A52081a27199A54067b8028G9429l1804L6954H158e5704B12605I9347
12905a5724A66079i6812H0575J25690i1150K6916n2246k20176g3725B00449K91690
12894D92139A67179J85980b370j31430C4489K15793J47138F4349L7898G722e9172
12882b07366A44834d3344a485A64742R2140d3496D0574a66260L8243A9304J81050
12871B00354J1120J84427N7532a3812D6972K18021a39054r000C3636c1032k52102
12860b83134A04690a41862I3193d1292j61578F3171d3695l50970A14384C3357
$$ y = [102145, -89474, -30206, 223714, -29425, -153941, -98880, -35367, 158728, 217191, 234017, 279809, -194269, -79324, 121571, -18668, 43786, 165629, 80048, -1607, 13232, -103921, 41216, -229666, 152081, -127199, 154067, -28028, 79429, 47625, 84579, 8158, -55704, 212605, 99347, -15724, 166079, -96812, 80575, 206265, -91150, -64234, -116480, -336656, -73725, 200449, 492139, 167179, 353159, -2370, -133800, 34489, 250282, 397420, 64349, 102247, 7722, -59172, -207366, 144834, -43344, -1485, 164742, 256882, -43496, 40574, -166260, -128017, 19304, 200354, 211474, 395901, 453433, -13812, 46972, 264993, -139054, -148054, 33636, -31032, -283134, 104690, -141862, 93193, -41292, -202870, 63171, -43695, -394665, 114384, 33357]
12849i8284D2383R4828a49609A202K40051c03882A34449i1180J4196B31786D5309
12837A70908f9851q4694A173g8219d221E935a00385H3013g021j06699H1716b91100
12824a41732A84183B8253c3655C613a78836B43219I0250a32801B40730j3869j08785
12813A18076c01481A04047K67851Q6364a1315C27750I2798a04194a7486p8288
12803i5774o2003a24o3281G0762J44521d8029b901n0109A76975k7645L7943n3193
12791A34080b19982h3335A75333H6834d1098C7940C236b53866a00945A06728O3581
12780A70309b56291b6897A63716M8329j1714a49431A67046N8778h7746H7286A0247
12768a92243A87563N7400H1448J62602m4540J21160b64737A17909b18229g960
$$ y = [-98284, 42383, 137211, -149609, 1202, 241253, -303882, 134449, -91180, -76984, 231786, 45309, 170908, -69851, -154545, 1173, -78219, -4221, 5935, -100385, 83013, -7021, -113720, 81716, -291100, -141732, 184183, 28253, -33655, 3613, -178836, 243219, 90250, -132801, 240730, 226861, 118076, -301481, 104047, 371898, 458262, -11315, 327750, 92798, -104194, -17486, -95774, -157777, -124, -63405, 70762, 215283, -48029, -2901, -53010, 176975, 149330, 187273, 134080, -219982, -83335, 175333, 86834, -41098, 37940, 3236, -253866, -100945, 106728, 170309, -256291, -26897, 163716, 212045, 200331, -149431, 167046, 225824, -87746, 87286, 10247, -192243, 187563, 244963, 81448, 244050, 199510, 320670, -264737, 117909, -218229, -7960]
12757b28447d105B24690r1282j665K9889A4195K31951i5982F4533B9275a04213
12745A27433a2676M0D35360e3116C29373b46397D0088J52176b95999C56317c24688
12733A00898e0040a110A22467D9086K14171j22522M8340o4598a8614l10597d5837
12721A02472a4265G1648b6906r6675C28603C7339A1436b13498C26790G7236K0185
12710I7421a70270C67855A32229K55858b5723B2632J01789J03272j5216J90250
12700D02727b64090d9219B95436d0864m20122D151h408p1407c596C92269A21026
12688f9294C29519D2973Q8077E042M6620K38570H3038J27829a9965j43372A86461
12676c0477A7842J76334k649J3042H2433J05435J01344C8994L89541c0817j90763
$$ y = [-228447, -4105, 224690, 133408, 131743, 161632, 14195, 246146, -95982, 64533, 29275, -104213, 127433, -12676, -12636, 435360, -53116, 329373, -246397, 40088, 192264, -295999, 356317, -324688, 100898, -50040, -1110, 122467, 49086, 263257, 140735, 189075, 124477, -18614, -329211, -45837, 102472, -14265, 71648, -26906, -123581, 328603, 37339, 11436, -213498, 326790, 77236, 97421, -170270, 367855, 132229, 388087, -25723, 22632, 124421, 227693, 212477, 402727, -264090, -49219, 295436, -40864, -460986, 4151, -8408, -79815, -3596, 392269, 121026, -69294, 329519, 42973, 131050, 5042, 51662, 290232, 83038, 210867, -19965, -163337, 186461, -30477, 17842, 194176, 191527, 204569, 82433, 187868, 289212, 38994, 428535, -30817, -221580]
12665b21580j4950K4215A44647b13538f829B65448j04130K31140j00455G4445
12654C2831K72220g8203A17389B5941L01501a8635A91309q6701m7935J61376D8948
12642a7413d520I3629b7905B18891P7108M9304I1780a10296j07684Q6509A47148
12630a0023B21647j03757K56045C4712J55857K22390E9407k3720j0631K70240
12620B95296r0966j206j5353h012j30231j394m7386a7403j81072h5238j98391
12609b83629R9736A71168A4653L4530J5566J63058b54583A2465J9827a3224m35927
12598d49151B34658p0251E0745d2778A05787L12574G4265K60296A14381c63551
12587I5414L7030R8304a6187F5642k6432J89224f1018R893m8593A1614a09191
$$ y = [-221580, -236530, -212315, 144647, -213538, -6829, 265448, 161318, 392458, 292003, 74445, 32831, 305051, -78203, 117389, 25941, 327442, -18635, 191309, 104608, 56673, 218049, 48948, -17413, -4520, 93629, -27905, 218891, 295999, 345303, 91780, -110296, -217980, -131471, 147148, -10023, 221647, 117890, 373935, 34712, 190569, 412959, 59407, 35687, 25056, 295296, 204330, 203124, 187771, -8012, -138243, -139637, -187023, -17403, -198475, -85238, -283629, -183893, 171168, 14653, 49183, 64749, 227807, -254583, 12465, 32292, -13224, -449151, 234658, 164407, 50745, -42778, 105787, 418361, 74265, 334561, 114381, -363551, 95414, 132444, 230748, -16187, 65642, 39210, 228434, -61018, -51125, -99718, 11614, -109191]
12575a32020A38296b5277k89513B99440h1974K9264n1143A20350K1207c6421E5471
12563B39410J15280F9768b52988B28030i5034A55696m2471c25497b2951H3088
12552A26951c9150a2277A83214F0166K4521b10064C4574g2456j55178k00607d3749
12540b08974N1950I8907N5781h0204B60233d11293J38528A84397J44696d00466
12529I8961i1157j63029B84809J9771m9074a39189F2492Q931a70317B00072J27353
12518C27425j51186a42715C49298o0264a57329C6302O6287j5645b5304A33222
12507E5761e3204A36411O8487a13667A79685B4837J72700b97290H9988j9868a07543
12495D6324M65443a4751B0394J7110L49521a49469A32803c62121J37972f0443
$$ y = [-132020, 138296, -25277, -314790, 299440, -81974, -52710, -103853, 120350, 141557, -36421, 55471, 239410, 354690, 69768, -252988, 228030, -95034, 155696, 113225, -325497, -22951, 83088, 126951, -39150, -12277, 183214, 60166, 84687, -210064, 34574, -72456, -227634, -428241, -43749, -208974, -157024, 98907, 154688, -80204, 260233, -411293, -272765, 184397, 329093, -400466, 98961, -91157, -254186, 284809, 304580, 255506, -139189, 62492, 71423, -170317, 200072, 327425, 176239, -142715, 349298, 289034, -157329, 36302, 102589, 86944, -25304, 133222, 55761, -53204, 136411, 204898, -113667, 179685, 24837, 197537, -297290, 89988, 70120, -107543, 46324, 511767, -14751, 20394, 37504, 387025, -149469, 132803, -362121, -224149, -60443]
12484c56505I26L43200o2970h3316n4224B1816K45357i193m9810m7478J9542d066
12471a06700A38587b34404N7360A35302A6952M8631c8090C8851M8854A0742K61491
12460B72233H067P577a81595g8433A8948L82864j15932e3272a2683D6074L51993
12449C98067G7354K22488a52815A28638b08318B39991a67683B39243i3117B05210
12438a82087c5145B20139h0017F5927G31K27760r2770c10884D7124a0249j89941
12427b00190A1776l711R3549J0276g7409A37021Q1321e0472G4472A9314a97625
12415B63610H3264M8380b2852p2065E6175K24819j28428b16718A2712a19074C67912
12403H5482a49933k2827q5369K2128A29597c317A25994q656K43156a13246q1811
$$ y = [-356505, 926, 344126, 281156, -83316, -137540, 21816, 267173, -9193, -59003, -106481, -86939, -4066, -106700, 138587, -234404, -177044, 135302, 16952, 65583, -38090, 38851, 87705, 10742, 272233, 8067, 15644, -181595, -78433, 18948, 401812, 285880, -53272, -12683, 46074, 398067, 77354, 299842, -152815, 128638, -208318, 239991, -167683, 239243, -93117, 205210, -182087, -35145, 220139, -80017, 65927, 731, 228491, 135721, -310884, 47124, -10249, -200190, 11776, 8065, 101614, 111890, -77409, 137021, 218342, -50472, 74472, 19314, -197625, 263610, 83264, 131644, -22852, -94917, 56175, 280994, 152566, -216718, 12712, -119074, 367912, 85482, -149933, -172760, -258129, -236001, 129597, -3317, 125994, 117338, 360494, -113246, -195057]
12392a95057H6407c22605A05133a4120A24944K1854O3924B7406i6564k9117B59361
12380b21836g2535d213B28389a53684A0859K54519c33863B22353n7261c0977C1281
12368d016j45555A07342e7364A08643a32983k5509k1834A19683L96656e3362C8748
12356A01973M09616D1644K04780F9735d7814C359O1489g6708A38175l154b72548
12344B99320e42864e3570j75755A16318J58122a31047G9822a72725G627b16632
12333b2112j93834A31619b011B23273a79380Q8042A9022b12457G6254a43554A04791
12321A22686c8326H4124i6724j3459C04580h8127b1273A08463a69470B9488J04108
12310A33596B0907o442R8853n4854g8137H47J53823B9807N3376l658d5573k4350
$$ y = [-195057, 86407, -322605, 105133, -14120, 124944, 146798, 210722, 27406, -96564, -125681, 259361, -221836, -72535, -4213, 228389, -153684, 10859, 265378, -333863, 222353, 165092, -30977, 31281, -4016, -149571, 107342, -57364, 108643, -132983, -158492, -180326, 119683, 516339, -53362, 38748, 101973, 511589, 41644, 246424, 69735, -47814, 3359, 64848, -76708, 138175, 135021, -272548, 299320, -542864, -53570, -229325, 116318, 274440, -131047, 79822, -172725, 7627, -216632, -22112, -215946, 131619, -2011, 223273, -179380, -91338, 19022, -212457, 76254, -143554, 104791, 122686, -38326, 84124, -96724, -110183, 304580, -88127, -21273, 108463, -169470, 29488, 133596, 20907, 14465, 113318, 58464, -78137, 847, 154670, 29807, 83183, 79525, -45573, -69923]
12298f9923b0471B36986G1905a70199c0129q7262A02922C082a40438B53011B7492
12286h2926a7229j87598a0022k43644B73873q2288a87485B00813F2675J74286
12276B36961d3200C20050a69618D8724R6793K28226A54689K12112j65620M3006
12266B44187k9000k3450J8932o6047c24050a26861k41528B70559H1902J40546
12256B22448r7350J04205h8402A82146D5717e7793B13167F2229m924f5276A67766
12244C09250e4914B66864A18651j4730J86582D448f1881J606I4770I976Q5984
12233I5960L1398m1405M0610L6376k2071f4719B44699B7355J48643e8905B57245
12221C11931l9711O6546G4303j6076K06867H5030Q5206e9474G3006k0295q96L5396
$$ y = [-69923, -20471, 236986, 71905, -170199, -30129, -117391, 102922, 3082, -140438, 253011, 27492, -82926, -17229, -204827, -10022, -253666, 273873, 191585, -187485, 200813, 62675, 236961, -43200, 320050, -169618, 48724, 145517, 373743, 154689, 366801, 201181, 244187, 215187, 191737, 210669, 144622, -324050, -126861, -368389, 270559, 81902, 222448, 125098, 229303, -88402, 182146, 45717, -57793, 213167, 62229, 57305, -65276, 167766, 309250, -54914, 266864, 118651, 103921, 290503, 4448, -61881, -60275, 94770, 9976, 95960, 127358, 85953, 126563, 162939, 140868, -64719, 244699, 27355, 175998, -58905, 257245, 311931, 272220, 338766, 74303, 58227, 265094, 85030, 170236, -59474, 73006, 52711, 51815, 87211]
12209H7211Q6794n4205O1492n001b1491A93575r0893d3435D31612l6619m7338
12198C47655j58390K27996G7253J21493A084N14970G5061J98393f1977C8664b32454
12186a2814B94091b17042A8744e4172j56954A18537J7951J36204c6596q499B02163
12174a1006A14420b7603B64207K0696A40928b5203I6824c0192H7067B2873P8689
12163A01562J8739K0819K17347g1802j4388B09637d515j4631j3161D9587d3322
12151a48798B59724A16104h1123I0515j0442M5718a73892c049C42290G4922P6358
12140A51280m1187c779E6828a74289A55047a03701D40084A23878c0098a1776D603
12128B18982i8695l54389b23380A25036d4598k33485G7562b02323A53033e1319
$$ y = [87211, 174005, 119800, 181292, 176291, -21491, 193575, 102682, -43435, 431612, 394993, 347655, 189265, 417261, 77253, 198746, 1084, 516054, 75061, 273454, -61977, 38664, -232454, -12814, 294091, -217042, 18744, -54172, -211126, 118537, 136488, 272692, -36596, -45095, 202163, -11006, 114420, -27603, 264207, 284903, 140928, -25203, 96824, -30192, 87067, 22873, 101562, 120301, 141120, 358467, -71802, -86190, 209637, -4515, -19146, -32307, 49587, -43322, -148798, 259724, 116104, -81123, 90515, 80073, 125791, -173892, -3049, 342290, 74922, 151280, 110093, -3779, 56828, -174289, 155047, -103701, 440084, 123878, -30098, -11776, 4603, 218982, -98695, -453084, -223380, 125036, -44598, -278083, 77562, -202323, 153033, -51319]
12117a14723A92291m8466l7929J27591n7255R182C9302b42249B79273c998r6346
12106a00344J7786D11678H7767d48491B36312b19251O8518j2455j12608a7403
12095i3350A29993j796J67971C9559J09908c12381A3410c57507B20882b6348C32272
12083A05028m680f1746B39614I9809L9647a10607n973I5223c21155D16780A23334
12071A47081Q7208L54235J215369G11769B42935a1541p6126A08597c1630B18656
12060a02702D15649G2999K34880g7284B39173c48037g1701c1740j87619c2184
12049a26632A05250b23415o984d5364j24099k0485C08482E8219J21575K9388a86983
12037e6773A16884b46225k6612L4112g0883j79591k0983H5085a86898C8492L26437
$$ y = [-114723, 192291, 143825, 105896, 233487, 176232, 185414, 39302, -242249, 279273, -3998, -100344, -82558, 411678, 87767, -448491, 236312, -219251, -150733, -163188, -275796, -17403, -93350, 129993, 128197, 296168, 39559, 149467, -312381, 13410, -357507, 220882, -26348, 332272, 105028, 100348, -61746, 239614, 99809, 139456, -110607, -116580, 95223, -321155, 416780, 123334, 147081, 234289, 588524, 1803893, 711769, 242935, -11541, -87667, 108597, -31630, 218656, -102702, 415649, 72999, 307879, -77284, 239173, -348037, -71701, -31740, -219359, -32184, -126632, 105250, -223415, -230399, -45364, -169463, -189948, 308482, 58219, 179794, 209182, -186983, -56773, 116884, -246225, -272837, -238725, -70883, -250474, -271457, 85085, -186898, 38492, 364929]
12026C64929a87472d0700M468p2207B86798c3299d21j65483A5773b05417c7907
12014A93912C5278b09517A63439b62100G0116J70013b30405C5017b751j5647r6583
12003a14981j00997I1065a44356d2377A6438L6636L8075K9802a48332I5401N3464
11992A48865a4371k75593a44653G7928K0357l6141J26568b8944l9099E2161J13867
11981A66028A5432b09209A48577A063O2882a18757E0366h0736q5962P6218B18581
11969a32581I7622a98756A99385i7844B96970A13360B6408N385a14734B77923
11958b74413k05241h7708c0735j27021j64576c0028j08310c5700k02905l9589
11948b78194B22581p2448a47114M8874j80389B53546C0072J07618K626c64382
$$ y = [364929, -187472, -40700, -36232, -108439, 286798, -33299, -421, -165904, 15773, -205417, -37907, 193912, 35278, -209517, 163439, -262100, 70116, 240129, -230405, 35017, -2751, -18398, -114981, -215978, 91065, -144356, -42377, 16438, 53074, 91149, 120951, -148332, 95401, 148865, -14371, -289964, -144653, 77928, 98285, 62144, 188712, -28944, -68043, 52161, 166028, 15432, -209209, 148577, 1063, 63945, -118757, 50366, -80736, -166698, -90480, 218581, -132581, 97622, -198756, 199385, -97844, 296970, 113360, 26408, 31793, -114734, 277923, -274413, -479654, -87708, -30735, -157756, -322332, -30028, -138338, -35700, -238605, -278194, 222581, 150133, -147114, -98240, -278629, 253546, 30072, 137690, 140316, -364382]
11937a11489c499I3994c7476G4311J61055b35617A49689b15563A03368b10845
11926b64580A0849K6262a23950A7259J50396b1512m9718n2952B5463e5484l117
11915e8601B01691a93367L7391C07894e8898j5228A47926b7278A52575g1248a0941
11903B8455J7982L8394N246M6867c26988a15900a1250j98330B54806i4773M4893
11892d9880H5833J25115G4627P9971b27065F9837a32037q8525P7329m9039j7711
11881b09983A36569K2527P5729F7601b80671a32740B69587b9436j57350B12487
11870a06714k70870F9704a66416b3762j95667A3445K20298a78993h0043q2384
11860a62427N4014l9113q6192B05266a81342c9004q1160a7578l2241A90167b60426
$$ y = [-111489, -3499, 93994, -37476, 74311, 235366, -235617, 149689, -215563, 103368, -210845, -264580, 10849, 37111, -123950, 17259, 167655, -21512, -71230, -124182, 25463, -55484, -58601, 201691, -193367, -155976, 307894, -58898, -74126, 147926, -27278, 152575, -71248, -10941, 28455, 46437, 84831, 90077, 136944, -326988, -115900, -11250, -209580, 254806, -94773, -49880, 85833, 210948, 74627, 154598, -227065, 69837, -132037, -220562, -143233, -192272, -209983, 136569, 159096, 234825, 67601, -280671, -132740, 269587, -29436, -186786, 212487, -106714, -377584, 69704, -166416, -23762, -219429, 13445, 233743, -178993, -80043, -162427, -108413, -147526, -233718, 205266, -181342, -39004, -120164, -17578, -49819, 190167, -260426]
11848b32234M5588G1253b16316B25825J70095d7147B4605b02331f391I0199a96945
11836G3710B7954b812A89103a82283A62019F650J63655q110F6783b88710l311
11825b92021A5260a17776M9928r8217k6319A72597o5050l8539J899K9933a26099
11813C99311E9885b11027P1289G6942a05423m7323A24973a36597d034A29144a46485
11801a42489A84326N1889D414J86803a70509I7612c09895J10575Q6159a8828m2297
11790f1125C33220j37869H3270a57967N4041n3137A0790K83307A34686n2546a84286
11778c71921A40601a14626b2359p4975Q769l0123b251D34535B13073h0150K8886
11767e1264b4973C2425b8483B19499f6988k02498A60799M2310n0464C3725a12113
$$ y = [-232234, -186646, 71253, -216316, 225825, 395920, -47147, 24605, -202331, -6391, 90199, -196945, 73710, 27954, -2812, 189103, -182283, 162019, 6650, 170305, 162195, 66783, -288710, -292021, 15260, -117776, -67848, -166065, -192384, 172597, 107547, 69008, 70907, 100840, -126099, 399311, 59885, -211027, -139738, 76942, -105423, -152746, 124973, -136597, -4034, 129144, -146485, -142489, 184326, 236215, 4414, 191217, -170509, 97612, -309895, -199320, -113161, -18828, -61125, 333220, 195351, 83270, -157967, -103926, -157063, 10790, 294097, 134686, 82140, -184286, -371921, 140601, -114626, -22359, -97334, -88565, -118688, -2251, 434535, 213073, -80150, -51264, -24973, 32425, -28483, 219499, -66988, -269486, 160799, 203109, 152645, 33725, -112113]
11755f3130n1331G135P9262e5444B6619c9124a2843A24243B220J8771J24598b4325
11742D5587K16355d9967D2791J03594J18522j3693C0504F608M1453J78488n7022
11731A69527b19553l2367j5747A25321a15121B3189a8371I4161a64399E3307L6537
11720H9844g9298J1347l72698D5305a9060j67618F5494L2976j6472M3066J6141
11709A41205E5283R0699a27240D4996Q5435e9279O504B38533l8877c9896B7644
11697B12919j7011c2931B21024R921H1899c7731F9927b02556J01017D8215L64832
11686D13047k03719n2989K12536j84196c6725C385J21776E1576c2073G9036B8378
11674G7784P4786a4979N147l23488B9464b4737o0292I3013B2042a47416B72029
$$ y = [-63130, -114461, 7135, 86397, -55444, 26619, -39124, -12843, 124243, 2220, 20991, 145589, -24325, 45587, 261942, -49967, 42791, 146385, 264907, 251214, 30504, 6608, 48061, 226549, 169527, -219553, -251920, -267667, 125321, -115121, 23189, -18371, 94161, -164399, 53307, 89844, -79298, -67951, -440649, 45305, -19060, -186678, 65494, 98470, 81998, 125064, 141205, 55283, 145982, -127240, 44996, 130431, -59279, -52775, 238533, 199656, -39896, 27644, 212919, 195908, -32931, 221024, 230945, 81899, -37731, 69927, -202556, -101539, 48215, 413047, 209328, 156339, 368875, 184679, -36725, 3385, 125161, 51576, -32073, 79036, 28378, 77784, 152570, -14979, -9832, -333320, 29464, -24737, -85029, 93013, 22042, -147416, 272029]
11662h4171p5175B55280b90360A50040g3710p6824H8601J49973l7705a17283D15390
11650G586a30023O4739H8911n414N5306o2456P5274o4805j9051J2669M8403E4588
11637G0405a84442A20903J26203r2071J93886A08846K54600j19737f8769A54652
11626A82161R535C0481O8217B0692J94625A02533J92050a23694L5817K5393E8931
11614D5941b5003k46595E3481R8595b69245c9865A44686d2140C41349a5570j1134
11603b6704k5182A637b36328a12175B6122c63339A22063d1298q0902n8626n7434
11592b38260C6572b2755n240m8286E9316J00681b25111c5175r5878N7319A14362
11580C48394I3648f5358D28127a33777A06349A2361b009A88087J6861a51861B23123
$$ y = [-84171, -159346, 255280, -290360, 150040, -73710, -150534, 88601, 238574, 200869, -117283, 415390, 7586, -130023, -65284, 88911, 83497, 138803, 76347, 151621, 86816, 67765, 80434, 128837, 54588, 70405, -184442, 120903, 247106, 155035, 348921, 108846, 363446, 243709, -68769, 154652, 182161, 191696, 30481, 98698, 20692, 215317, 102533, 294583, -123694, -87877, -62484, 58931, 45941, -25003, -271598, 53481, 152076, -269245, -39865, 144686, -42140, 341349, -15570, -26704, -51886, 1637, -236328, -112175, 26122, -363339, 122063, -41298, -122200, -180826, -238260, 36572, -22755, -27995, -76281, 59316, 159997, -225111, -35175, -131053, -73734, 114362, 348394, 93648, -65358, 428127, -133777, 106349, 12361, -2009, 188087, 204948, -151861, 223123]
11568a41187e9492l03530i528B34018J3182p6210c6561A79214a04562A64349b24882
11556A28201f9007k62894a07524B92862b31543A25385c5224j27222F883c07177
11545A16026L7637N7278E1538K54971a04657B63680J38775C8546M9250a24011
11534C7214M7050M7174j6351K72465b13218A16484L719C8417N16054f1858a0978
11522A82111M4473l4448r1528J40623a3588I5835M7853a3119B01461b9456G0752
11510F22128k96237j12368b53832R2095A85849b26138e7651F2660a8341A82071
11499A3954M71503d4382B83156P3524j5241B5228a18854a2790p6955I0567M0096
11488A30663J16742A5989N9370N210d3719E7118N6261L69392A23041J67610I7357
$$ y = [-141187, -59492, -363022, -9528, 234018, 247200, 170990, -36561, 179214, -104562, 164349, -224882, 128201, -69007, -331901, -107524, 292862, -231543, 125385, -35224, -162446, 6883, -307177, 116026, 153663, 210941, 51538, 306509, -104657, 263680, 402455, 38546, 87796, -124011, 37214, 84264, 131438, 115087, 387552, -213218, 116484, 120203, 38417, 554471, -61858, -10978, 182111, 226584, 192136, 100608, 241231, -13588, 95835, 143688, -13119, 201461, -29456, 70752, 622128, 325891, 213523, -253832, -161737, 185849, -226138, -57651, 62660, -18341, 182071, 13954, 485457, -44382, 283156, 356680, 341439, 25228, -118854, -12790, -89745, 90567, 130663, 247405, 15989, 75359, 80569, -43719, 57118, 113379, 482771, 123041, 290651, 97357]
11476C08383R5720A61720a67557A5876a54659k6021f6889A3554K76666F5229J16373
11465A81602d16047g7223B17845a6900D90880B41242I7883N2383a27288e0474
11454d114A37497c2948B75664K40287B22529j04317K08472D8544J41825r5158
11444I5211K3278R7722D5761K34764l7888C5331M0220a58919C0505h3569E374
11432c42334C11640a34343I8956i6415A24661d6805Q190k57180n3085a35799N6427
11421g9372N378A95418i629B37573a31516A15146J74845a89399o593D4015A9900
11409h4595B05067b20011I0639J0370D1035P4802B1011c00000J02409E4500R4733
11398A49233o376i3252E40047j84725b33097F1205a8119j59434m7612e3533j42182
$$ y = [308383, 404103, 161720, -167557, 15876, -154659, -180680, -66889, 13554, 290220, 65229, 181602, -416047, -77223, 217845, -16900, 490880, 241242, 97883, 150266, -127288, -50474, -4114, 137497, -32948, 275664, 515951, 222529, 118212, 326684, 48544, 190369, 95211, 118489, 216211, 45761, 280525, 242637, 35331, 75551, -158919, 30505, -83569, 5374, -342334, 311640, -134343, 98956, -96415, 124661, -46805, -38615, -295795, -348880, -135799, -79372, -73994, 195418, -9629, 237573, -131516, 115146, 289991, -189399, -195992, 44015, 19900, -84595, 205067, -220011, 90639, 101009, 41035, 115837, 21011, -300000, -197591, 54500, 149233, 142857, -93252, 540047, 355322, -233097, 61205, -18119, -177553, -225165, -53533, -195715]
11387a95715g1940j25109B50445A4010K06360b68427k3402c1835j57316n9349
11377b48500A74853J55208j41585c59685F3975L02869A15086D7536a03270A47309
11366C83362A89109p2412H500b09682b3121G1506P3071a94144A60935b27056A52948
11354H6392R777j8712a96063H699a08404I5012a29478p4634O3630A55777a49838
11342A68677o0293M6212f2132E5174J08733c19474e4461k7802L9563r07D13113
11330a64241P9395B6009L9727a5382m7783b2469k05491h5681l13581b2586n3724
11319g6310A97392c05955L0934a7790A32933E9694d0200C9553Q2859b69021A3185
11307a11834A8759b82529a04876C12690a7345A77335a25260j85904F867a19799
$$ y = [-195715, -71940, -197049, 250445, 14010, 220370, -268427, -291829, -31835, -189151, -248500, 174853, 330061, 188476, -359685, 63975, 366844, 115086, 47536, -103270, 147309, 383362, 189109, 116697, 8500, -209682, -23121, 71506, 144577, -194144, 160935, -227056, 152948, 86392, 96169, 77457, -196063, 8699, -108404, 95012, -129478, -204112, -140482, 155777, -149838, 168677, 108384, 154596, -62132, 55174, 163907, -319474, -54461, -82263, -42700, -43607, 413113, -164241, -84846, 26009, 65736, -15382, -63165, -22469, -227960, -85681, -399262, -22586, -76310, 197392, -305955, -275021, -17790, 132933, 59694, -40200, 39553, 122412, -269021, 13185, -111834, 18759, -282529, -104876, 312690, -17345, 177335, -125260, -311164, 6867, -119799]
11296d31811a31952B51291f7320k49047P5480A44510J03347b76567m6141F6047
11285A21116D2626a74963O9010o2061E637f1808j03430a6645o8729I4017B9834
11273A09329g6496H6958a11364r5562A27169c4277m8870j05426j72713A74883
11262I0843b48351m0085F4401E297M30459g833j43012p715l3088A38223I246a48216
11249B5949l88a01119H2905A7238b03827D8915j9853a60301K3567e3717E747O9247
11237G4994k7109b96885g0192j3764I7640b01794k35578K06744E9779j6718J08592
11226A51653b25943A95050b93058j5113a04702a4233A34421R3184a72456O2144
11216a10312B5337R875J48954a21128r7768i2693A24200n9425a17151o228M6169
$$ y = [-431811, -131952, 251291, -67320, -316367, -240887, 144510, 247857, -276567, -322708, 66047, 121116, 42626, -174963, -105953, -168014, 5637, -61808, -165238, -16645, -85374, 94017, 29834, 109329, -76496, 86958, -111364, -206926, 127169, -34277, -83147, -188573, -361286, 174883, 90843, -248351, -288436, 64401, 5297, 435756, -7833, -150845, -158560, -191648, 138223, 9246, -148216, 25949, 25561, -101119, 82905, 17238, -203827, 48915, 29062, -160301, -136734, -53717, 5747, 74994, 47885, -296885, -70192, -83956, 97640, -201794, -437372, -230628, 59779, 43061, 151653, -225943, 195050, -293058, -308171, -104702, -14233, 134421, 227605, -172456, -110312, 25337, 35212, 184166, -121128, -218896, -92693, 124200, 64775, -117151, -123379, -77210]
11205g7210A55564n5536L08001b79486N1141a06276A37013A8800a57602O6029
11195i1573O737o3050r4927c3878A08473h7208B16686b69182A05068C3565a03239
11183E5741M8000J11615l675a16085k98366b6913Q077j7059m48399G5656K1139
11172I6795a50271C13755j15126q6932d11113a85041M2168g285C68230a22180
11161A01824i1075A22618D6663a32191f5396b8408n0579o2223E7532c20260J16516
11150b03744E0522q552a51044j76552A78452E0844a41022m3148j2070C09815b07207
11138c18413J57887b751E7129P6345a9833o9079J502D7050J0368M4177K96411
11127C98006a15036D50825B0438N0407H552a35826H4419J16679J64562a13752
$$ y = [-77210, 155564, 100028, 408029, -279486, -228345, -106276, 137013, 18800, -157602, -91573, -84836, -147886, -242813, -33878, 108473, -87208, 216686, -269182, 105068, 33565, -103239, 55741, 103741, 215356, 211681, -116085, -414451, -26913, -18836, -35895, -484294, 75656, 96795, -150271, 313755, 198629, 111697, -411113, -185041, -142873, -7285, 368230, -122180, 101824, -91075, 122618, 46663, -132191, -65396, -28408, -78987, -141210, 57532, -320260, -203744, 50522, 41970, -151044, -327596, 178452, 50844, -141022, -184170, -196240, 309815, -207207, -318413, -160526, -2751, 57129, 133474, -19833, -88912, -87410, 47050, 57418, 101595, 398006, -115036, 450825, 20438, 70845, 8552, -135826, 84419, 201098, 365660, -113752]
11116G5890I309Q8011a27695A79634m3132a8523E8764L6566J1727J33949C538
11104H2529J30114q2589J37862B5880K55079a98698B33697j4015I7274d82C0432
11092A45245j6216J12879K0543f0781F110Q4545L55022a36911A74461n9726M12535
11081E27270j54129A51285L03798e3290C19702j57207B7388P6212J81349J27141
11071D12090j76661L58198j75964j27390J9060J61170n6726L6271A85829N06744
11061F92573j74763p1935O2935p2755M77458B87789N08666j16152O6277B69277
11050D21454K32016j06686K2410R4492j86622L76088j48314R1526k39992P3431
11040F29803K3921q5202O272l451J0778J38509M7764k84479j46573K45079L9892
$$ y = [75890, 9309, 97320, -127695, 179634, 136502, -18523, 58764, 95330, 107057, 241006, 3538, 82529, 212643, 130054, 267916, 25880, 280959, -198698, 233697, 219682, 97274, -482, 30432, 145245, 129029, 241908, 262451, -60781, 6110, 90655, 445677, -136911, 174461, 114735, 527270, 373141, 151285, 455083, -53290, 319702, 162495, 27388, 103600, 284949, 412090, 235429, 593627, 417663, 290273, 309333, 470503, 413777, 450048, 185829, 692573, 517810, 445875, 508810, 436055, 913513, 287789, 796455, 680303, 746580, 269277, 421454, 653470, 546784, 569194, 663686, 477064, 853152, 704838, 796364, 556372, 629803, 653724, 568522, 574794, 571343, 582121, 720630, 768394, 483915, 337342, 582421, 622313]
11029F22313k87172N37051l03635M09659m867l35620L4674n725P856J18297l92792
11018D00039J08567P8250K89498C93107L79451l04429o4730K46740m2904o8209
11008E39026q1540L16083k08592R0236k78056N00537l21423J69207j20883k1881
10998E82714L22959k19747j97367M18684l10624k42627M39353p5720k15239K15622
10988G18008O5755l21L42831m80278L06559N03156j94912l2902J69997j00386
10978A297507L59099k62798O69960j64136N60007M08379R8832k15235J90242o63671
10968B278186N23090p29446r371l29414l1994L14582l5996Q1640l9332q5535J07031
10957B043441L47487n86621j79801j72448P5010G18996L42986C39894O19086l67434
$$ y = [622313, 335141, 872192, 568557, 978216, 973349, 637729, 672403, 666678, 674534, 792831, 400039, 508606, 586856, 876354, 393107, 772558, 468129, 403399, 650139, 607235, 539026, 457486, 773569, 564977, 655213, 377157, 877694, 556271, 725478, 604595, 582714, 905673, 685926, 488559, 907243, 596619, 353992, 793345, 717625, 502386, 718008, 783763, 783442, 1126273, 645995, 952554, 1455710, 1260798, 1227896, 1397893, 1297507, 1656606, 1393808, 2063768, 1899632, 2459639, 2868018, 2966850, 2751615, 2941857, 2278186, 2801276, 2071830, 2062459, 1733045, 1701051, 2015633, 1979637, 2061277, 2021945, 1936410, 2043441, 2390928, 1804307, 1624506, 1452058, 1527068, 718996, 1061982, 339894, 958980, 591546]
10947E91546B62414K28563A45544K42989j57904A03968m2817L89199A9984Q0475
10937A00459K57027G3819K94450j70132i4782J7551J5295b8700I8079J60041G0439
10925D04515A26904J00256a16993B758L5998h461n4586l5085B87413c95618g4677
10913a19367j25304A78216l6109a55588g6576B48245a49803J3420c9644B78888
10902A19779f2601C5310A4713a6490k95836J4795H3872b6650j0271G6409K06071
10891B82480d7656A29381b72597J09784e6874A76223C2377j0372a57903P5575
10881h2328A09954M769b25184F8138j3509J23986a91567D9713L7980e62B45285
10869g1322G7450a33253e9565G5571J01860a8640A55164a68607A4410b25534A1505
$$ y = [591546, 262414, 490977, 145544, 388533, 230629, 103968, 61151, 450350, 19984, 100459, 357486, 73819, 368269, 198137, -94782, -77231, -61936, -28700, 98079, 258120, 70439, 404515, 126904, 227160, -116993, 2758, 38756, -8461, -63047, -98132, 287413, -395618, -74677, -119367, -244671, 178216, 142107, -155588, -76576, 248245, -149803, -136383, -39644, 278888, 119779, -62601, 35310, 14713, -16490, -312326, -297531, 83872, -26650, -36921, 76409, 282480, -47656, 129381, -272597, -162813, -56874, 176223, 32377, 22005, -157903, -82328, 109954, 114723, -225184, 68138, 54629, 178615, -191567, 49713, 87693, -562, 245285, -71322, 77450, -133253, -59565, 75571, 177431, -18640, 155164, -168607, 14410, -225534, 11505]
10857A13922J22895b37698R4856A92299a72089b046B09581N5453r7858q2091B1532
10845B1117a001q9038l90889E1515c6045H3867h0326c6491C94793d9235k825B36245
10832A02783d77011A93984a95024m3208A44453R9058I527k151i9078B57664A7200
10820A3945e9103D4493g0928l81L147k43884A5662a47891G4780L0376B8333R7200
10808A25533i4735c8209A72678B9568K24765D3114a78095I5698c7040j51635K7855
10797a60820o1648B5870J64831p0883O7074g3889A63055b35536o939H2304a3123
10785b5942q7866j33340f7832C3987f5921j91908C6140J9200M0970c3633p4607
10774a08240q8791j37679i9290C19238i7538i643j8270r4738B3442r851Q1637
$$ y = [113922, 236817, -237698, -142842, 192299, -172089, -2046, 209581, 265034, 167176, 85085, 21532, 21117, -1001, -90039, -480928, 51515, -36045, 83867, -80326, -36491, 394793, -49235, -52060, 236245, 102783, -477011, 193984, -195024, -238232, 144453, 243511, 9527, 7376, -99078, 257664, 17200, 13945, -59103, 44493, -70928, -71309, -68162, -312046, 15662, -147891, 74780, 105156, 28333, 125533, -94735, -38209, 172678, 29568, 254333, 43114, -178095, 95698, -37040, -188675, -160820, -222468, 25870, 190701, 119818, 186892, -73889, 163055, -235536, -242475, 82304, -13123, -25942, -113808, -247148, -67832, 33987, -65921, -257829, 36140, 55340, 96310, -33633, -108240, -197031, -334710, -99290, 319238, -97538, -9643, -27913, -122651, 23442, 13591, 95228]
10763I5228J12192e2453k02687A20729n7044f0193C0819g2867l4028r311j28717
10752b44923B70661n7350J03343c07507h2843D0666a08759A65493J1943B876c97812
10740e21852A12172D7216M9584a29410B5009A2285K0242a51749f7814p2897A91412
10728c18732L9484C69079j25883d1055B775a35104o7152f5755j13379j64356A13925
10716A26427a70055G1446d52786a66707J3627m2231B709b62963a07388K6633j30399
10705b11154R2985J3469H3517a74213F5514c55129A60869F9755l1714a96135c5179
10693A27104k889e3626l45887a28505p8227A07169g581A02919D9063b65396g0360
10681b09372B52279b79875c5903k1901A88801a375n6379D2833J33250C8333a63471
$$ y = [95228, 207420, -52453, -255140, 120729, 63685, -60193, 30819, -72867, -106895, -116206, -244923, 270661, 213311, 316654, -307507, -82843, 40666, -108759, 165493, 177436, 2876, -397812, -521852, 112172, 47216, 96800, -129410, 25009, 12285, 32527, -151749, -67814, -140711, 191412, -318732, -279248, 369079, 243196, -41055, 2775, -135104, -202256, -65755, -179134, -343490, 113925, 126427, -170055, 71446, -452786, -166707, -153080, -195311, 2709, -262963, -107388, -80755, -211154, -118169, -104700, 83517, -174213, 65514, -355129, 160869, 69755, 38041, -196135, -35179, 127104, 124215, -53626, -399513, -128505, -206732, 107169, -7581, 102919, 49063, -265396, -70360, -209372, 252279, -279875, -35903, -57804, 188801, -1375, -57754, 42833, 176083, 38333, -163471]
10669I5889k3835P7995K34359b06524g0836p0776E9280b42164h3433E889J54345
10658A60234E6079J88176a02997B12539H3804l7170a3672j30539j38011a4217
10647B46389F7614J49427A05015m8504J94336k9909c6373H7123g1331n4062B4347
10635g3870j11353d9629B1511b10386j78230a73603Q2272K4155J2979j61539c0103
10623A57909D3372d43980b03927a0575B5183R2924c09572A06227b87277L0529
10613b56748m4455G567c22725q2215A8245c779k86350m2564I4403N3053b15152
10601c14353E9097M627c8227D678g7188m72245b8184h736H9620E155h1964n8577
10589a40541d9541o3752l8039A93092H5261i5994c4378B09424F0189a42871j6698
$$ y = [95889, 72054, 150049, 384408, -206524, -70836, -141612, 59280, -242164, -83433, 5889, 160234, 56079, 244255, -102997, 212539, 83804, 46634, -13672, -144211, -282222, -14217, 246389, 67614, 217041, 105015, 56511, 250847, 220938, -36373, 87123, -71331, -125393, 24347, -73870, -185223, -49629, 21511, -210386, -388616, -173603, -91331, -67176, -54197, -215736, -30103, 157909, 43372, -443980, -203927, -10575, 25183, 118107, -309572, 106227, -287277, -256748, -301203, 7567, -322725, -404940, 18245, -3779, -290129, -332693, 94403, 147456, -215152, -314353, 59097, 63724, -38227, 4678, -77188, -549433, -28184, -8736, 89620, 5155, -81964, -140541, -49541, -113293, -151332, 193092, 85261, -95994, -34378, 209424, 60189, -142871, -159569]
10578a59569E5479b87893e2352j21149a7742B7778J1629e3010B00293a31479C32486
10566G6047K8780f7713j45170C12806c41220A48090b54829i3975k7279c0306H8062
10554f8367d199D4971a41713O1992A85628e6175A73733g7214K6196K4329B15743
10542e2276O288j58128K7797A46355b27091N949N6766k19323G574h5124j34326
10531b19450A40399o6645j4375K3948k2121c75664D1327b20510a06039o1236K7019
10520a40256D2340B0674b43197F3846q735P7372a77055n8731A7101a3599A4167
10508h1386a9532j83847L0256c7408A58592A428M5397Q6507J93243g5279H957
10496e71995C130b91038n5039a15691j77294B21473a49784e1773E1774e1115j04540
$$ y = [-159569, 55479, -287893, -52352, -173501, -17742, 27778, 39407, -53010, 200293, -131479, 332486, 76047, 104827, -67713, -212883, 312806, -341220, 148090, -254829, -93975, -121254, -30306, 88062, -68367, -4199, 44971, -141713, -79721, 185628, -56175, 173733, -77214, -51018, -26689, 215743, -52276, -45988, -204116, -176319, 146355, -227091, -221142, -164376, -383699, 7574, -85124, -219450, 140399, 73754, 59379, 83327, 61206, -375664, 41327, -220510, -106039, -167275, -140256, 42340, 20674, -243197, 63846, 55111, 132483, -177055, -235786, 17101, -13599, 14167, -81386, -19532, -203379, -173123, -37408, 158592, 1428, 46825, 133332, 326575, -75279, 8957, -571995, 3130, -291038, -346077, -115691, -292985, 221473, -149784, -51773, 51774, -51115, -155655]
10485a55655n8973A80152n9672K27998j267Q512K07939A17652g6089G7102J05571
10474A82673a72410d2231p8092C6457a00292b5452j16336c0499l5019C35218a43954
10462D1076O1711d3831E0282c466k72083F2803a7767k91054A44835b25565A29086
10450c45519D268c82376B83207j37596c1162A42296L38557i877B98986a22017
10439A63024a87944B30490h3151I5973d3846F3894d08916C32g2317L0680C74915
10427b17607I1365d34958A98811a79839f917k6920A31158n6028e645B23761c46236
10415b05227I1346b76381A27227R348K9644A5760J73195a56308A42050d1617j1683
10404e3300p496B50598f7766j92767e1405E4159P1343a70795K9459M6116c8120
$$ y = [-155655, -214628, 180152, 120480, 348478, 347211, 355723, 563662, 117652, -76089, 77102, 182673, -172410, -42231, -120323, 36457, -100292, -25452, -141788, -30499, -65518, 335218, -143954, 41076, 102787, -43831, 50282, -3466, -275549, 62803, -17767, -308821, 144835, -225565, 129086, -345519, 4268, -382376, 283207, 145611, -31162, 142296, 480853, -9877, 298986, -122017, 163024, -187944, 230490, -83151, 95973, -43846, 63894, -408916, 332, -72317, -41637, 374915, -217607, 91365, -434958, 198811, -179839, -6917, -33837, 131158, 75130, -5645, 223761, -346236, -205227, 91346, -276381, 127227, 136575, 166219, 15760, 188955, -156308, 142050, -41617, -53300, -60796, 250598, -67766, -260533, -51405, 54159, 125502, -170795, -141336, -95220, -38120]
10392a09397H8778M6190K62539a88045e9840A16771J97225b06953L5229C17846
10381A81140g3757A23107g9613A4027K43158C1650L9384K49880A20763J09994
10371B30757J61726j55056K3126L8797L27412j47732m513A83547G6469K34985
10361C11454L633a21219C74531A26973M6042R7460j19819L1685J57310m8008O59
10350B92302L79581k62197A74278J80897O7704i3702B81687K38050B26919J42829
10340C69748A62964j8314M9036J43498K15419A93502L0598I0990K40697A09457
10329C73853A39955a26457H9107b04409A07170e29E4497J67610o6770n9439f871
10317B47047a5860B40618n1433a36211I9270a68482B4753a37038D1064c41909
$$ y = [-109397, 88778, 134968, 397507, -188045, -59840, 116771, 313996, -206953, -171724, 317846, 181140, -73757, 123107, -79613, 14027, 257185, 31650, 71034, 320914, 120763, 230757, 392483, 237427, 260553, 299350, 626762, 479030, 474517, 183547, 76469, 311454, 315087, -121219, 374531, 126973, 173015, 270475, 150656, 182341, 339651, 291643, 292302, 671883, 409686, 174278, 355175, 422879, -93702, 281687, 519737, 226919, 369748, 162964, 144650, 193686, 337184, 552603, 193502, 224100, 90990, 331687, 109457, 373853, 139955, -126457, 89107, -204409, 107170, -529, 54497, 222107, 155337, 95898, -6871, 247047, -15860, 240618, 189185, -136211, 99270, -168482, 24753, -137038, 41064, -341909]
10306A09429a37928K8855L9772L2061B74314j04603d6852G8249h4397k60030l4794
10295c79221d9797C6290i2875d2597D6175b60621J25761e2791H7861h0266B08483
10283B40447n1900b2711k09655C9471J9912A2629i9273C18536f7526b5240n0719
10272g5959A31102J01219B2088P8134a43992A97757B659J48988Q7096l6261K18694
10261D21176r4487j55325N4936J70617A54770N9617J41260G8258a83786D23269
10250C21912G0439a08701J9200A46405a13657b2993j7958C94151a73322j86808
10240c60130g542j64768E9573i8971P41A44508g2054j03825B15981b8934k17693
10229b46627D0822K25616g3467j32410O3578E3699d0449n6491m8308e7400k5812
$$ y = [109429, -137928, -109073, -69301, -37240, 274314, 169711, -46852, 78249, -84397, -344427, -379221, -49797, 36290, -92875, -42597, 46175, -260621, -134860, -52791, 87861, -80266, 208483, 240447, 188547, -22711, -232366, 39471, 59383, 12629, -99273, 318536, -67526, -25240, -75959, 131102, 232321, 22088, 100222, -143992, 197757, 2659, 151647, 238743, 202482, 421176, 326689, 171364, 226300, 396917, 154770, 214387, 355647, 78258, -183786, 423269, 321912, 70439, -108701, -89501, 146405, -113657, -22993, -40951, 394151, -173322, -360130, -7542, -172310, 59573, -98971, -98230, 144508, -72054, -175879, 215981, -28934, -246627, 40822, 266438, -73467, -205877, -142299, 53699, -40449, -96940, -145248, -57400, -83212]
10218h3212j42620G8797l0020a56746k4322d4748j76506Q6701H1432a67387L6889
10207a30498A51167a8349A77690b03073B555b7467G6507G617a11613q8622A41309
10195a26469E3718e7035j43368A27640P8158C4967a82727B84649e092j878j52457
10184a59427J6679j52177g6472A64174f7581l04145B30185i8703k18921J15044
10174b02580I9914h5727K8438B09165c82666d3355o1974J20A63060p9648N4127
10163A37539k0394l8418c35930D0922f9439B801a69287B32981a90k51056a08876
10151b27445j0615C6248h3505b4244j27927k78241a54919j34752Q7254Q1411a0361
10139F7725M0473R3080i5664C2304a82330g8179j69311g5248b1048k32826L5404
$$ y = [-83212, -225832, 78797, 48777, -156746, -181068, -44748, -221254, -134553, 81432, -167387, -130498, 151167, -18349, 177690, -203073, 2555, -27467, 76507, 7617, -111613, -200235, 141309, -126469, 53718, -57035, -200403, 127640, 205798, 34967, -182727, 284649, -5092, -6970, -159427, -142748, -294925, -76472, 164174, -67581, -371726, 230185, -98703, -317624, -202580, 99914, -85727, -57289, 209165, -382666, -43355, -105329, -105209, 163060, 83412, 137539, 117145, 78727, -335930, 40922, -69439, 2801, -169287, 232981, -190, -251246, -108876, -227445, -238060, 36248, -83505, -24244, -152171, -430412, -154919, -289671, -202417, -121006, -10361, 67725, 108198, 201278, -95664, 32304, -182330, -78179, -247490, -75248, -21048, -253874, -218470]
10128b18470o5664F273d54940C98984b18088P831G3719c3020G787b40961J08530
10117a32431o8286B57600a75546Q1132q4566E0258M407b0241B21265A4558K46942
10106B61500h7647F70170c46364G7539i2479D7332a06388b3459F1753c15842A05291
10094b24539C0159c3735j55641M8491j86627A78938b74707A73556a2053j57843
10084a69896k44744A64960b29034F447a72866D09684a86153E1999J36021J0785
10074A98805f6301m6111M8197B52341c20174A35032E9321b62537N8187c3961A49592
10062h1528o9303j125c1765a3320D58578B19884c08018J33957I4793C4570g2450
10050c28941c1878q395E6262A7654j867L86967E8492a26298r5192A21302K5633
$$ y = [-218470, -284134, 6273, -454940, 398984, -218088, -210257, 73719, -33020, 7787, -240961, -132431, -200717, 257600, -175546, -94414, -178980, 50258, 54665, -20241, 221265, 14558, 261500, -87647, 670170, -346364, 77539, -92479, 47332, -106388, -23459, 61753, -315842, 105291, -224539, 30159, -33735, -189376, -140885, -327512, 178938, -274707, 173556, -12053, -169896, -414640, 164960, -229034, 6447, -172866, 409684, -186153, 51999, 188020, 198805, -66301, -112412, -64215, 252341, -320174, 135032, 59321, -262537, -204350, -33961, 149592, -81528, -150831, -151956, -31765, -13320, 458578, 219884, -308018, -174061, 94793, 34570, -72450, -328941, -31878, -40273, 56262, 17654, 15787, 402754, 58492, -126298, -221490, 121302, 146935]
10039A46935j1385a26334K7273A11313m0639N2136d31992C4874g4903b221A66376
10027h2232B49775b6416J229A12549a72375E6493g2860K9431o4552k46356J42495
10016b11842d9507B51884q0421b81523G4083j5133N2027A1391a56452b2643B01608
10004e339l24589I8235c1682B26967d87310B20383a83734g1411F6468a65327j25419
9993b90746J21935m4347A19999m1817N0587b50991A09520a06494p1871j0247E1398
9981c14116F6171b70460N3996A01756b98626J39464g0911k42930A26914h7056
9970E6103b94685B2513e08966a23895G4669b25033i9947C99750h102l22751B22489
9958E7936e13239h9445R092D2828a25577q7513k15903j16512d9434k78919i419
$$ y = [146935, 135550, -126334, -99061, 111313, 70674, 122810, -431992, 34874, -74903, -2221, 166376, -82232, 249775, -26416, -25187, 112549, -172375, 56493, -72860, -43429, -107981, -354337, -211842, -49507, 251884, 171463, -281523, 74083, 58950, 110977, 11391, -156452, -22643, 201608, -5339, -329928, 98235, -31682, 226967, -487310, 220383, -183734, -71411, 66468, -165327, -290746, -168811, -213158, 119999, 78182, 128769, -250991, 109520, -106494, -178365, -188612, 51398, -314116, 66171, -270460, -216464, 101756, -298626, -159162, -70911, -313841, 126914, -87056, 56103, -294685, 22513, -508966, -123895, 74669, -225033, -99947, 399750, -8102, -330853, 222489, 57936, -513239, -89445, -80353, 42828, -125577, -213090, -428993, -545505, -49434, -328353, -9419]
9946B65888E0559J10486J80302c55446R2720f240A16379R2961b65913J25614a9217
9934e0582k29470e3018l8029G520a97602C9027a86038g2423A80399i0365j9375
9923a09740k2062B38309m4193e4225E7408d48687B13869D5632R3186a89609l0400
9912b20009L4015L7678B07085a65987c0382A5298b59625k428J26009J5850j66115
9901b86309a38812J471G7810A0814b7402m2650C115a20864A11282b65863A44818
9889h1962j83899A31943b44988C59428I8336m1870a28046G6793b32467a13517
9878B03563j9250o2195b7157A00944g271D4242i6304B60160c56522a6255H0974
9866c19245a46289l70768a77887g6343B77256h6589q6127A77999d0635A85458
$$ y = [265888, 50559, 161045, 341347, -355446, -262726, -6240, 116379, 209340, -265913, -140299, -19217, -50582, -280052, -53018, -91047, 7520, -197602, 39027, -186038, -72423, 180399, -90365, -109740, -131802, 238309, 194116, -54225, 57408, -448687, 213869, 45632, 138818, -189609, -220009, -185994, -148316, 207085, -165987, -30382, 15298, -259625, -262053, -136044, -120194, -286309, -138812, -137341, 77810, 10814, -27402, -70052, 3115, -120864, 111282, -265863, 144818, -81962, -265861, 131943, -244988, 359428, 98336, 56466, -128046, 76793, -232467, -113517, 203563, 184313, 122118, -27157, 100944, -7271, 44242, -96304, 260160, -356522, -16255, 80974, -319245, -146289, -517057, -177887, -76343, 277256, -86589, -172716, 177999, -40635, 185458]
9855d13758h5966d2429H9306J82177b3212D96818b05525L0067C3540a68030F9886
9843B5091J18851a34155I0586b11717E09274c51813e3666j83516c6371k07825
9833b44196K5451K2372B1887a75557a339n50562a70295o7315O6781I5637a73902
9821F2136i6545l43707C6698d9832o7565a8613m5660l26057a71052a3670l20815
9810c34485Q4915A09444k3682f3398j61511d1992m9361g54k1238B88452d15193
9798G3213a49396A24084c9758k62554a27203b9869l7318m06295G3079c12747A7123
9786e4925k06180h8190I6447c25351a06397n9263j22389B2776P0853a97714N8345
9775a39369A28259c21265k0119D7662a93630A21785D0125b52129f4645A49949
$$ y = [-413758, -85966, -42429, 89306, 271483, -23212, 496818, -205525, -175458, 33540, -168030, 69886, 25091, 143942, -134155, 90586, -211717, 509274, -351813, -53666, -237182, -36371, -244196, -218745, -196373, 21887, -175557, -1339, -551901, -170295, -237610, -170829, 95637, -173902, 62136, -96545, -440252, 36698, -49832, -117397, -18613, -64273, -390330, -171052, -13670, -334485, -249570, 109444, 85762, -63398, -224909, -41992, -91353, -754, -21992, 288452, -415193, 73213, -149396, 124084, -39758, -302312, -127203, -29869, -67187, -473482, 73079, -312747, 17123, -54925, -261105, -88190, 96447, -325351, -106397, -165660, -288049, 22776, 93629, -197714, -139369, 128259, -321265, -341384, 47662, -193630, 121785, 40125, -252129, -64645, 149949]
9764E9155A6989b05623k8218A83594a49820J0131k32796B7843b34957J10484R971
9753a14502C8770f6217A52257A7733M2242a11179L8919j74559B21670d65359K25311
9742b40048a5687j156A7277i7245A67480a67397e161m35856R9381J46773g0469
9730G3526K9753e7562p8872c7709F3641N2989K60768A4015b16462Q8307H9206
9718a3990k10889L0473A9726a20945n2720j1135a9372C5281a9477p6123A91998
9706a42957A777J28497A0150N437h3614A20705b55977B07755b00119d4491j5873
9695f0364j02437D2456J46153a40870O6903q8871B56115c94252N3310J23769A71645
9683h950C5415h0429E3343M6801b34565B7388J65525D0872R8092J79169a90854
$$ y = [59155, 16989, -205623, -233841, 183594, -149820, -139689, -372485, 27843, -234957, -124473, -114502, 38770, -66217, 152257, 17733, 59975, -111179, -72260, -246819, 221670, -465359, -240048, -15687, -16843, 17277, -97245, 167480, -167397, -5161, -441017, -341636, -194863, -70469, 73526, 103279, -57562, -136434, -37709, 63641, 116630, 377398, 14015, -216462, -128155, 89206, -13990, -224879, -194406, 19726, -120945, -173665, -184800, -19372, 35281, -19477, -95600, 191998, -142957, 1777, 130274, 10150, 15587, -83614, 120705, -255977, 207755, -200119, -44491, -60364, -162801, 42456, 188609, -140870, -73967, -162838, 256115, -394252, -340942, -217173, 171645, -8950, 35415, -80429, 53343, 100144, -234565, 27388, 192913, 40872, 138964, 318133, -190854]
9671a17616J8735e31j88386e9832G6667J5522c3074o1731n6161k9589I1765d8253
9658b25455d4888A85136L7894b18597c3997j67138A34749b17865H9731g7917r8810
9647a76727D0376b11161a02944l8629M5960k968J0747A33068a81615a9865j64283
9636a84148B07391b730l2876j44117B25255a08360r5887K8470C48219C9380a63972
9624C3415a32046O3301j91647R220J15810p077A08218a19207g885m26433A13792
9612d49811A69467b05525q9332J40729B08648d29238J36096l2416a17802k89807
9602d07609a05060L111j90030c4545B32038b52553d0186B0511b9430k72816a08861
9590b62977P4624C2186a64219M0768C0721J35436j4293fA49596e5768D2504d6675
$$ y = [-117616, -98881, -531, -188917, -59832, 76667, 92189, -33074, -94805, -150966, -180555, 91765, -48253, -225455, -44888, 185136, 223030, -218597, -33997, -201135, 134749, -217865, 89731, -77917, -176727, 40376, -211161, -102944, -141573, -95613, -98581, -87834, 133068, -181615, -19865, -184148, 207391, -2730, -35606, -179723, 225255, -108360, -204247, -175777, 348219, 39380, -163972, 33415, -132046, -68745, -260392, -251172, -135362, -142439, 108218, -119207, -7885, -434318, 113792, -449811, 169467, -205525, -294857, -154128, 208648, -429238, -293142, -325558, -117802, -407609, -105060, -101949, -291979, -34545, 232038, -252553, -40186, 20511, -29430, -302246, -108861, -262977, -188353, 32186, -164219, -123451, 30721, 166157, 151864, -6, 149596, -55768, 42504, -46675]
9577I532A921a94706d2771A39949i0419A10702a36845p6647n5992A4940N7078
9566G2018i3933d1939j14081j15768f4680J3266A20063c1421j2768B8620A0579
9554c0487j46153A15045d4479A5721L7921e15000B27153A4566J32182h1382F6375
9542A74662J9992a00730M082L6777k2473b658A05802E2341a46791L5947B85910
9530b42920J03141n4782j3651O153b7169n2339k11520a00360j96151j14451A30737
9518C6792b85875A52306a46602A55930B0955N9433c37416a32684A57420F9597
9507B53648a07539l97912a86450k04657a48804H0647B464d6178A30598b70545
9496g1190B17591a29624F3130b46394J06387F8355a06289L5611n5706e1020A53293
$$ y = [9532, 1921, -194706, -42771, 139949, -90419, 110702, -136845, -213492, -269484, 14940, 72018, -93933, -41939, -156020, -271788, -64680, -51414, 120063, -31421, -44189, 28620, 10579, -30487, -176640, 115045, -44479, 15721, 53642, -515000, 227153, 14566, 146748, -81382, 66375, 174662, 194654, -100730, -96648, -59871, -82344, -2658, 105802, 52341, -146791, -110844, 285910, -242920, -139779, -194561, -208212, -202059, -27169, -79508, -291028, -100360, -296511, -410962, 130737, 36792, -285875, 152306, -146602, 155930, 20955, 80388, -337416, -132684, 157420, 69597, 253648, -107539, -505451, -186450, -391107, -148804, 80647, 2464, -46178, 130598, -270545, -71190, 217591, -129624, 63130, -246394, -140007, 68355, -106289, -70678, -126384, -51020, 153293]
9484f8757a5139l6179k62082J21616c1436A7918a19899R348N1598a8676j25887
9473a44563p8490A6202i5348j60497A92992a55531B2719e2389j67240e8418k7433
9462h5851n8323c9024D3255i224n153L073m75A08461c9941B5048f2140A11449
9449C1061b47813k88521E7812M37647h9892j9003j46947j9521A16113f267C45983
9437G1056o483b12536B7568i7805L535k9670j87446a31472l0250A71568c3538
9425e7125j89270N8270A4502h2751B03715a10840k3192j39911A58820h8443c2924
9413a45603L271C22213E7344O1939b1614n7225j84739a14131p1616A48930a34048
9401A3753b13490G1708a16341j6572k00271g4454A88642L5464a42193d9960j73112
$$ y = [-68757, -15139, -51318, -313400, -191784, -31436, 17918, -119899, -110551, -58953, -18676, -144563, -223053, 16202, -95348, -255845, 192992, -155531, 22719, -52389, -219629, -58418, -85851, -144174, -39024, 43255, -9224, -14377, -11304, -11779, 108461, -39941, 25048, -62140, 111449, 31061, -247813, -536334, 57812, 495459, -89892, -108895, -255842, -275363, 116113, -6267, 345983, 71056, 64573, -212536, 27568, -97805, -94270, -123940, -311386, -131472, -161722, 171568, -33538, -57125, -246395, -188125, 14502, -82751, 203715, -110840, -134032, -273943, 158820, -88443, -32924, -145603, -142332, 322213, 57344, 119283, -21614, -78839, -263578, -114131, -185747, 148930, -134048, 13753, -213490, 71708, -116341, -132913, -333184, -74454, 188642, 224106, -142193, -49960, -223072]
9390b23072R9598I2870J848b65170C34129c84429D6157A1234a29592A25451a13978
9378b80107C5128J7537f0904K8768A40645A8358a99452i2978C5854b15150A30447
9366b70503J1032D8813L6396a2236k01069C5096e4137j8939B09584g7758k48039
9355c25797A34058b06857l9907K7753H5680e29104D31517g8881p8103A41087a16859
9343G4863c66499e6930r8196A6496J3643M3669k3232L4506q28K5385K43098A07783
9330e2618q2112I4953a07151e1500G2614a19582k00973J02773j92226A98463a31080
9318h8343l0728A17337c06374B15124A5751F994Q8945c8612k91362a9298A16928
9306a92657A25471j8401D5185b15431q1647A62161a8880k88160J43034e0033B5643
$$ y = [-223072, -123474, 92870, 94718, -265170, 334129, -384429, 46157, 11234, -129592, 125451, -113978, -280107, 35128, 52665, -60904, -32136, 140645, 18358, -199452, -92978, 35854, -215150, 130447, -270503, -259471, 48813, 85209, -12236, -213305, 35096, -54137, -73076, 209584, -77758, -325797, 134058, -206857, -246764, -219011, 85680, -529104, 431517, -78881, -156984, 141087, -116859, 74863, -366499, -56930, -155126, 16496, 30139, 73808, 50576, 85082, 84254, 109639, 352737, 107783, -52618, -134730, 94953, -107151, -51500, 72614, -119582, -320555, -217782, -410008, 198463, -131080, -88343, -119071, 117337, -306374, 215124, 15751, 6994, 95939, -38612, -329974, -19298, 116928, -192657, 125471, 107070, 45185, -215431, -297078, 162161, -18880, -307040, -164006, -50033, 25643]
9294a09913j20228D5645c2037m7688c5450r0664j40811J04238C896N5941a29097
9282b59907H8772K48517a90043B04466a08335B7116i8317b1143j58276N0062q9939
9271b19296b4501A61960h2727k51961A13879E2488J7735a06889k2411q401j23303
9260b61004a3992p6467n5861a0141l08998g1485j31053j23665C5926b95318J38974
9249a56344f5352h034k96776a36190N7527B3967b26831Q1543F4884q864i8272
9237H0223b95132a34628I692a5773a110j62503j74218L4256i3040A73482g9697
9225A71686c15161B9006P578b0599k4106K1760A42665b53265B3302J93136c85102
9213g5077a8708l64988a09182p408e5511D4247c17086d8951k14949B40599h7273
$$ y = [-109913, -230141, 45645, -32037, -79725, -35450, -126114, -266925, -162687, 3896, 59837, -129097, -259907, 88772, 337289, -190043, 204466, -108335, 27116, -98317, -21143, -179419, -129357, -219296, -24501, 161960, -82727, -334688, 113879, 52488, 70223, -106889, -129300, -137701, -261004, -13992, -90459, -146320, -10141, -319139, -71485, -202538, -326203, 35926, -295318, -156344, -65352, -8034, -304810, -136190, -78663, 23967, -226831, -145288, 64884, 56020, -98272, 80223, -295132, -134628, 9692, -15773, -1110, -163613, -337831, -303575, -93040, 173482, -79697, 171686, -315161, 29006, 36584, -20599, -44705, -22945, 142665, -253265, 23302, 216438, -385102, -75077, -18708, -383696, -109182, -116590, -55511, 44247, -317086, -48951, -263900, 240599, -87273]
9201e05881A27111b16172N1669k962j99283p7018C22548a49071f02D8187a43720
9189A14248a11915N5035D3705b54862b5489A69559e3816k15815J02425j31673
9179b98879b6848G0899j0075Q8732b11619H627Q472P039c8127l37863F7055c126
9166i0933K2942L945h441j26650F8312b80406B8273o503e4013A2014b4751j31250
9154a56001j8478g3412B67289i140j68441E1318a39510C3849J3164g8056E2883
9142b95343c8557J330m5826k85195b3329A17284J9520C5746h5004c0121l7965
9131f8086r6651D199R6157b24431H7049h0186j03817j39956L5693e1874k88983
9120c40857c2187k4908m1634k95953B90630a29724A63749h359D2811i4334p5857
$$ y = [-505881, 127111, -216172, -164503, -167465, -366748, -443766, 322548, -149071, -602, 48187, -143720, 114248, -111915, -56880, 43705, -254862, -25489, 169559, -53816, -269631, -167206, -298879, -26848, 70899, 60824, 149556, -211619, 8627, 17099, 24138, -38127, -375990, 67055, -3126, -90933, -67991, -64046, -8441, -135091, 68312, -280406, 28273, 21770, -54013, 12014, -24751, -156001, -174479, -73412, 267289, -9140, -177581, 51318, -139510, 33849, 47013, -78056, 52883, -295343, -38557, -37227, -83053, -368248, -23329, 117284, 136804, 35746, -85004, -30121, -68086, -164737, 4199, 100356, -224431, 87049, -80186, -184003, -323959, -288266, -51874, -340857, -32187, -57095, -98729, -394682, 290630, -129724, 163749, -8359, 42811, -94334, -170191]
9109a70191J249a4852A09324a06771q0829a9440B3877d72248A14425a06204G970
9097a97435c4130l89293b2219j22572A51415C5005a84575F2901a48629A13105
9086H9637c9345o2300L2006j1532C2365a28966n3044B75252K2763E0285a6369
9074b22663a2908j22904N6518j77206a06240l0308I8110l7481q696j5926b0438
9062B21142a56190P1148j26374b2807A06444O93j3360l7122J05770b13801P5558
9051a38243I5807a4064A50797J49188b45042B41139i1060J8821j18028A49776
9040a1136j26521l2200c378A758c17679b1861k5128H8968a58138A75950L3573
9029B09523I3458c55327a37910B6273K64873F2894m624a73708O657A10627m0613
$$ y = [-170191, -168942, -14852, 109324, -106771, -187600, -19440, 23877, -472248, 114425, -106204, 7970, -197435, -34130, -423423, -22219, -144791, 151415, 35005, -184575, 62901, -148629, 113105, 89637, -39345, -101645, -69639, -81171, 32365, -128966, -182010, 275252, 298015, 50285, -16369, -222663, -12908, -135812, -79294, -256500, -106240, -136548, 98110, 60629, 51933, 36007, -20438, 221142, -156190, -85042, -211416, -22807, 106444, 107137, 93777, 56655, 162425, -213801, -138243, 95807, -14064, 150797, 299985, -245042, 241139, -91060, -72239, -190267, 149776, -11136, -137657, -169857, -3378, 1758, -317679, -21861, -46989, 88968, -158138, 175950, 209523, 93458, -355327, -137910, 26273, 291146, 62894, 58270, -173708, -167051, 110627, 70014]
9018G0014H55b39623J12568B5413a09041C231e23506a86641f4176j16089G0840
9006E8878g1835k27114A52533b51297H5976b64883B49134a44644D9866j0242Q2533
8995A22157f1140A9236a09930E3076b31629A38067a10201I9658D3969P1063d3996
8983c18926A73515c48821B22257a88350j0631I4177d08282a54933A14500d17444
8972d0887k31353d6530n925a3303B5649i1180A99382N1589a40234l90966a52241
8960F2112d9215E2466g1292K8999B07006B0935K6620L93280E5001L72379a8779
8948D666a92633j25447i6823j06621o4158a3828j71084e5953j10354E4022a32108
8936B16225M0105J10066r1206a80944Q8527c2901p1569B3711J78814m9830M61660
$$ y = [70014, 855, -239623, -127055, 25413, -109041, 3231, -523506, -186641, -64176, -180265, 70840, 58878, -71835, -298949, 152533, -251297, 85976, -264883, 249134, -144644, 49866, 39624, 122157, -61140, 19236, -109930, 53076, -231629, 138067, -110201, 99658, 43969, 115032, -43996, -318926, 173515, -348821, 222257, -188350, -198981, 94177, -408282, -154933, 114500, -417444, -40887, -272240, -46530, -52455, -13303, 25649, -91180, 199382, 250971, -140234, -531200, -152241, 62112, -49215, 52466, -71292, -42293, 207006, 20935, 47555, 440835, 55001, 427380, -18779, 4666, -192633, -318080, -96823, -203444, -267602, -13828, -184912, -55953, -166307, 54022, -132108, 216225, 256330, 366396, 275190, -180944, -92417, -32901, -104470, 23711, 202525, 152695, 614355]
8925F14355B00691M79951J419298P216428C915519A001272C53278J12811A95459
8915A26022e7562I3541d83837L9813I6798g2494B28603e416k6612N22q0401j08411
8903b20318D9151j5271J16827D2413b19777h234j07645A8713a24050A40286a12422
8891A53559P1010b07580c3771o0274d2175j26989n5689K9344g5123E4047J96144
8880B50191e3248k59840A49171a48868O777G2199a74822H2673c31873J17355j13564
$$ y = [614355, 200691, 680642, 2099940, 9316368, 3915519, 1001272, 353278, 466089, 195459, 126022, -57562, 93541, -483837, -444024, 96798, -72494, 228603, -5416, -32028, -31506, -111907, -220318, 49151, 33880, 150707, 42413, -219777, -8234, -115879, 18713, -124050, 140286, -112422, 153559, 224569, -207580, -33771, -94045, -42175, -169164, -224853, -195509, -75123, 54047, 250191, -53248, -313088, 149171, -148868, -142091, 72199, -174822, 82673, -331873, -214518, -328082]
$$ [...]
##END NTUPLES=NMR SPECTRUM
##END=
