
##TITLE=AC1311_NICAH12127_6535123_V7cxmZSgqr
##JCAMPDX= 6.0         $$ Bruker NMR JCAMP-DX V2.0
##DATA TYPE= NMR SPECTRUM
##DATA CLASS= NTUPLES
##ORIGIN= BRUKER
##OWNER= Administrator
$$ 1.72 TOPSPIN		Version 2.1
$$ 2012-07-17 00:04:11.531 -0500  Administrator@TOPSPIN
$$ Compression mode = diff/dup
##.OBSERVE FREQUENCY= 400.02188249412
##.OBSERVE NUCLEUS= ^1H
##.ACQUISITION MODE= SIMULTANEOUS (DQD)
##.ACQUISITION SCHEME= undefined
##.AVERAGES= 64
##.DIGITISER RES= 22
##SPECTROMETER/DATA SYSTEM= spect
##.PULSE SEQUENCE= noesygpps1d.comp
##.SOLVENT NAME= COFFEE_meoh
##.SHIFT REFERENCE= INTERNAL, COFFEE_meoh, 1, 14.96073
##AUDIT TRAIL= $$ (NUMBER, WHEN, WHO, WHERE, PROCESS, VERSION, WHAT)
$$ ##TITLE= Audit trail, TOPSPIN		Version 2.1
$$ ##JCAMPDX= 5.01
$$ ##ORIGIN= Bruker BioSpin GmbH
$$ ##OWNER= Administrator
$$ $$ C:\Bruker\TOPSPIN/data/COFFEE/nmr/AC1311_NICAH12127_6535123_V7cxmZSgqr/12/pdata/1/auditp.txt
$$ ##AUDIT TRAIL=  $$ (NUMBER, WHEN, WHO, WHERE, PROCESS, VERSION, WHAT)
(   1,<2012-07-17 00:04:06.750 -0500>,<Administrator>,<TOPSPIN>,<go>,<TOPSPIN 2.1>,
      <created by zg
	started at 2012-07-16 23:52:36.406 -0500,
	POWCHK enabled, PULCHK disabled,
       configuration hash MD5:
       6B 1B 68 BB D9 2E 58 E2 7F 35 AD 54 07 DF 0E 41
       data hash MD5: 64K
       1D 5F 3F 8C DD B8 AF E4 F7 D2 A6 DA 51 9C E4 70>)
(   2,<2012-07-17 00:04:09.640 -0500>,<Administrator>,<TOPSPIN>,<proc1d>,<TOPSPIN 2.1>,
      <Start of raw data processing
       efp LB = 0.3 FT_mod = 6 PKNL = 1 PHC0 = 0 PHC1 = 0 SI = 128K 
       data hash MD5: 128K
       0D 0A 26 10 FE 00 63 86 F4 67 3B 34 EB E2 D0 AD>)
(   3,<2012-07-17 00:04:10.781 -0500>,<Administrator>,<TOPSPIN>,<proc1d>,<TOPSPIN 2.1>,
      <pk PHC0 = 5.482178 PHC1 = 0 
       data hash MD5: 128K
       F4 33 5C F7 38 48 3C EF FC 16 64 7D 85 71 79 B9>)
(   4,<2012-07-17 00:04:11.015 -0500>,<Administrator>,<TOPSPIN>,<proc1d>,<TOPSPIN 2.1>,
      <abs ABSG = 1 
       data hash MD5: 128K
       08 8B 0F 22 9A 11 D7 A3 AA BE 9C FC 2B 0F 54 1F>)
(   5,<2012-07-17 00:04:11.078 -0500>,<Administrator>,<TOPSPIN>,<proc1d>,<TOPSPIN 2.1>,
      <abs ABSG = 2 
       data hash MD5: 128K
       64 57 96 21 7B 6F 64 AD 61 D0 BC 92 7A 41 22 F9>)
(   6,<2012-07-17 00:04:11.140 -0500>,<Administrator>,<TOPSPIN>,<proc1d>,<TOPSPIN 2.1>,
      <abs ABSG = 3 
       data hash MD5: 128K
       AB ED A9 CA AF 89 D2 5A 76 EC 00 D0 7B C2 0C 34>)
(   7,<2012-07-17 00:04:11.390 -0500>,<Administrator>,<TOPSPIN>,<proc1d>,<TOPSPIN 2.1>,
      <abs ABSG = 4 
       data hash MD5: 128K
       53 C9 3E 10 46 26 39 50 DC 7F 1D 26 80 46 64 E7>)
(   8,<2012-07-17 00:04:11.437 -0500>,<Administrator>,<TOPSPIN>,<proc1d>,<TOPSPIN 2.1>,
      <abs ABSG = 5 
       data hash MD5: 128K
       65 44 EA 99 BE FD 17 56 07 A8 83 26 97 FB 91 84>)
$$ ##END=
$$ 
$$ $$ hash MD5
$$ $$ 47 34 1A 58 C9 38 4F 86 06 E7 4B 0C 2F 01 9C B7
##$RELAX= 
##$RELAX= 
##$RELAX= 
##$RELAX= 
##$RELAX= 
##$RELAX= 
##$RELAX= 
##$RELAX= 
$$ Bruker specific parameters
$$ [...]
##$TP07= 0
##$TPNAME0= <>
##$TPNAME1= <>
##$TPNAME2= <>
##$TPNAME3= <>
##$TPNAME4= <>
##$TPNAME5= <>
##$TPNAME6= <>
##$TPNAME7= <>
##$TPOAL= (0..7)
0.5 0.5 0.5 0.5 0.5 0.5 0.5 0.5
##$TPOFFS= (0..7)
0 0 0 0 0 0 0 0
##$TUNHIN= 0
##$TUNHOUT= 0
##$TUNXOUT= 0
##$USERA1= <user>
##$USERA2= <user>
##$USERA3= <user>
##$USERA4= <user>
##$USERA5= <user>
##$V9= 5
##$VALIST= <valist>
##$VCLIST= <CCCCCCCCCCCCCCC>
##$VD= 0
##$VDLIST= <DDDDDDDDDDDDDDD>
##$VPLIST= <PPPPPPPPPPPPPPP>
##$VTLIST= <TTTTTTTTTTTTTTT>
##$WBST= 2048
##$WBSW= 25
##$XGAIN= (0..3)
0 0 0 0
##$XL= 0
##$YL= 0
##$YMAX_a= 11750797
##$YMIN_a= -8688691
##$ZGOPTNS= <>
##$ZL1= 120
##$ZL2= 120
##$ZL3= 120
##$ZL4= 120
##$ABSF1= 14.96073
##$ABSF2= -5.597452
##$ABSG= 5
##$ABSL= 3
##$ALPHA= 0
##$AQORDER= 0
##$ASSFAC= 0
##$ASSFACI= 0
##$ASSFACX= 0
##$ASSWID= 0
##$AUNMP= <proc_prof1d_extract.lims>
##$AXLEFT= 0
##$AXNAME= <>
##$AXNUC= <1H>
##$AXRIGHT= 0
##$AXTYPE= 0
##$AXUNIT= <>
##$AZFE= 0.1
##$AZFW= 0.1
##$BCFW= 0
##$BC_mod= 0
##$BYTORDP= 0
##$COROFFS= 0
##$CY= 15
##$DATMOD= 1
##$DC= 0
##$DFILT= <>
##$DTYPP= 0
##$F1P= 0
##$F2P= 0
##$FCOR= 0.5
##$FTSIZE= 131072
##$FT_mod= 6
##$GAMMA= 0
##$GB= 0
##$INTBC= 1
##$INTSCL= 1
##$ISEN= 128
##$LB= 0.3
##$LEV0= 0
##$LPBIN= 0
##$MAXI= 10000
##$MC2= 0
##$MEAN= 0
##$ME_mod= 0
##$MI= 0
##$NCOEF= 0
##$NC_proc= -2
##$NLEV= 6
##$NOISF1= 0
##$NOISF2= 0
##$NSP= 0
##$NTH_PI= 0
##$NZP= 0
##$OFFSET= 14.96073
##$PC= 1
##$PHC0= 5.482178
##$PHC1= 0
##$PH_mod= 1
##$PKNL= yes
##$PPARMOD= 0
##$PPDIAG= 0
##$PPIPTYP= 0
##$PPMPNUM= 2147483647
##$PPRESOL= 1
##$PSCAL= 4
##$PSIGN= 0
##$PYNMP= <proc.py>
##$REVERSE= no
##$SF= 400.020009743101
##$SI= 131072
##$SIGF1= 0
##$SIGF2= 0
##$SINO= 400
##$SIOLD= 131072
##$SPECTYP= <>
##$SREGLST= <1H.CDCl3>
##$SSB= 0
##$STSI= 131072
##$STSR= 0
##$SW_p= 8223.68421052631
##$SYMM= 0
##$S_DEV= 0
##$TDeff= 65536
##$TDoff= 0
##$TI= <>
##$TILT= no
##$TM1= 0
##$TM2= 0
##$TOPLEV= 0
##$USERP1= <user>
##$USERP2= <user>
##$USERP3= <user>
##$USERP4= <user>
##$USERP5= <user>
##$WDW= 1
##$XDIM= 131072
##$YMAX_p= 424915337
##$YMIN_p= -11865
##$CURPLOT= <Network HP LaserJet P1505>
##$CURPRIN= <$Network HP LaserJet P1505>
##$DFORMAT= <normdp>
##$LAYOUT= <+/1D_H.xwp>
##$LFORMAT= <normlp>
##$PFORMAT= <normpl>
##$SURQMSG= 1
$$ End of Bruker specific parameters
$$ ---------------------------------
##NTUPLES= NMR SPECTRUM
##VAR_NAME=  FREQUENCY,     SPECTRUM/REAL,   SPECTRUM/IMAG
##SYMBOL=    X,             R,               I
##VAR_TYPE=  INDEPENDENT,   DEPENDENT,       DEPENDENT
##VAR_FORM=  AFFN,          ASDF,            ASDF
##VAR_DIM=   131072,        131072,          131072
##UNITS=     HZ,            ARBITRARY UNITS, ARBITRARY UNITS
##FACTOR=    0.0627417313425164, 1,          1
##FIRST=     8223.62146879497, 6910,         -55507
##LAST=      0,             6934,            -54851
##MIN=       0,             -11865,          0
##MAX=       8223.62146879497, 424915337,    0
$$ Real data points
##PAGE= N=1
##DATA TABLE= (X++(R..R)), XYDATA
$$ [...]
63942A616002J61521J77190J91896K04963K16007K24993K31759K35580K35325
63933C495236K29881K18364K00333J76226J47556J16234Q3627N0303J6463j7727
63923D716496n2156q6525j19855j50454j76600j97165k11731k20436k23958k23339
63913C054277k19539k13113k04298j93180j79824j64580j48449j32827j18530
63904A479937j05376r2942q1472p1555o3056n5034m6912l9236l2984k8410k4925
63893H38035k1944j9410j7438j5882j4444j3090j2043j1446j1234j1318j1663
63882F78123j1988j1663j0200p890n608l869k285j13K895O415J0123J3844J7141
63869F74925J9349K0341K0931K2060K3727K5097K5621K5495K5048K4218K2903
$$ y = [1616002, 1777523, 1954713, 2146609, 2351572, 2567579, 2792572, 3024331, 3259911, 3495236, 3725117, 3943481, 4143814, 4320040, 4467596, 4583830, 4667457, 4717760, 4734223, 4716496, 4664340, 4577815, 4457960, 4307506, 4130906, 3933741, 3722010, 3501574, 3277616, 3054277, 2834738, 2621625, 2417327, 2224147, 2044323, 1879743, 1731294, 1598467, 1479937, 1374561, 1281619, 1200147, 1128592, 1065536, 1010502, 963590, 924354, 891370, 862960, 838035, 816091, 796681, 779243, 763361, 748917, 735827, 723784, 712338, 701104, 689786, 678123, 666135, 654472, 644272, 636382, 630774, 626905, 624620, 624507, 627402, 633817, 643940, 657784, 674925, 694274, 714615, 735546, 757606, 781333, 806430, 832051, 857546, 882594, 906812, 929715]
63858I29715K1336J9655J7434J4260J0505O970L828N28l166o762r870j2782j5824
63845I75827j8725k1209k3714k6715k9566l0972l0659k9868k9838l0476l0821
63834F73264l0365k9359k8195k7022k5846k4562k2982k1093j9301j8051j7251
63823D09237j6373j5147j3794j2537j1263r813q401p413o934o686o379n947n478
63810B83072n069m792m631m404l893l105k327j870j764j828j892j934k013k157
63796B41393k244k020j318m29p2o93j859k623k601k327k361k460k074j465j566
63781B15281k601l464k930j185M02R01O47L91K69k0m64p75r68j301j545j000M44
63764B02082J730J701N00o26q63n04j34J59M06K11p88k124k800k350j214p7P33
$$ y = [929715, 951051, 970706, 988140, 1002400, 1012905, 1019875, 1023703, 1024231, 1021065, 1014303, 1004433, 991651, 975827, 957102, 935893, 912179, 885464, 855898, 824926, 794267, 764399, 734561, 704085, 673264, 642899, 613540, 585345, 558323, 532477, 507915, 484933, 463840, 444539, 426488, 409237, 392864, 377717, 363923, 351386, 340123, 330310, 321909, 314496, 307562, 300876, 294497, 288550, 283072, 278003, 273211, 268580, 264176, 260283, 257178, 254851, 252981, 251217, 249389, 247497, 245563, 243550, 241393, 239149, 237129, 235811, 235382, 235310, 234617, 232758, 230135, 227534, 225207, 222846, 220386, 218312, 216847, 215281, 212680, 209216, 206286, 205101, 205503, 206404, 207051, 207442, 207711, 207691, 207227, 206452, 205484, 204183, 202638, 201638, 202082, 203812, 205513, 206013, 205387, 204524, 204020, 203886, 204045, 204451, 204662, 203874, 201750, 198950, 196600, 195386, 195309, 196042]
63747A96042J185J355J465J747K120K252K086K013K310K731K833K530K058J619
63733B24346J333J348J659J955J985J974K258K660K694K410K473L204M060M423
63719B58782M398M438M502M263L853L691L615K951J646N33J15k20j159k204k364
63704B86840j810j771k728l650l455k411j488r25j99Q69J828K367K684K953K978
63689B82082K667K394K525K863K871K337J575J074J075J414J584J139J82o36p98
63674C04348n58o37j253j699j120M47J993K588K302J948K005K133J771R38J01
63659C15307n63j348k445l567m339m725m864m709m239l791l765l966l620k330
63645B67036p25R1k99j142j239j47J352K041J619J059J474K749L724L691L183
$$ y = [196042, 197227, 198582, 200047, 201794, 203914, 206166, 208252, 210265, 212575, 215306, 218139, 220669, 222727, 224346, 225679, 227027, 228686, 230641, 232626, 234600, 236858, 239518, 242212, 244622, 247095, 250299, 254359, 258782, 263180, 267618, 272120, 276383, 280236, 283927, 287542, 290493, 292139, 292672, 292787, 292567, 291408, 289204, 286840, 285030, 283259, 280531, 276881, 273426, 271015, 269527, 268602, 268403, 269272, 271100, 273467, 276151, 279104, 282082, 284749, 287143, 289668, 292531, 295402, 297739, 299314, 300388, 301463, 302877, 304461, 305600, 305782, 305146, 304348, 303790, 303153, 301900, 300201, 299081, 299528, 301521, 304109, 306411, 308359, 310364, 312497, 314268, 315206, 315307, 314744, 313396, 310951, 307384, 303045, 298320, 293456, 288747, 284508, 280717, 276952, 272986, 269366, 267036, 266311, 266402, 266103, 264961, 263722, 263575, 264927, 266968, 268587, 269646, 271120, 273869, 277593, 281284, 284467]
63630B84467L111L670M495N427O473P280P337O777O423O870P952R182J0298J1237
63616C80999J2073J3178J4943J7133J8969K0120K1140K2626K4465K6343K8375
63605F00364L0687L2743L3765L3440L1598K7641K1298J3693O688J140l309o719
63593H23029q321p866o511n717n965p056q946j1614j4647j7662k0737k3768k5882
63580F58337k6258k5255k3952k2763k1204j8950j6380j3987j1879r998q276o432
63568D53003m127j520O94K022K730L504M730O187P314P812Q035Q642R768J0845
63554E19639J1529J2356J3966J5999J7612J8941K1147K4754K8872L2519L5958
63543G53292L9841M3307M3889L9576L0660J9507Q824K54n834r710j1707j2094
$$ y = [284467, 287578, 291248, 295743, 301170, 307643, 314923, 322260, 329037, 335460, 342330, 350282, 359464, 369762, 380999, 393072, 406250, 421193, 438326, 457295, 477415, 498555, 521181, 545646, 571989, 600364, 631051, 663794, 697559, 730999, 762597, 790238, 811536, 825229, 831917, 833057, 829748, 823029, 814708, 806842, 800331, 794614, 788649, 781593, 772647, 761033, 746386, 728724, 707987, 684219, 658337, 632079, 606824, 582872, 560109, 538905, 519955, 503575, 489588, 477709, 467711, 459435, 453003, 448876, 447356, 448050, 450072, 452802, 456306, 461036, 467223, 474537, 482349, 490384, 499026, 508794, 519639, 531168, 543524, 557490, 573489, 591101, 610042, 631189, 655943, 684815, 717334, 753292, 793133, 836440, 880329, 919905, 950565, 970072, 978896, 979150, 973316, 963606, 951899, 939805]
63531I39805j1198r455p380n637n042o204r075j2996j7377k2107k7193l2078l5679
63518G38384l7196l6746l5114l2973l0511k7742k4907k2362k0285j8610j7157
63507D34781j5668j3858j1758r847q600p890p205o377n663n114m368l244k131
63494C33058j547j683k374l123l075j696L10J451J240Q07J198J916J920J393J442
63479C31237K401L527M194M440M366L964L607L771M097L596J978N2j385k356l203
63464C64286m022m838n680o190n830m726l708l209k724j687k96Q54J467J525J174
63449C26396Q91J275K282L166L465L614M355N924Q017J0029J1234J1444J1617
63436D03709J3036J5663J8321K0736K4141K8935L2900L3117K9034K2587J5816
$$ y = [939805, 928607, 919152, 911772, 906135, 901093, 894889, 885814, 872818, 855441, 833334, 806141, 774063, 738384, 701188, 664442, 629328, 596355, 565844, 538102, 513195, 490833, 470548, 451938, 434781, 419113, 405255, 393497, 383650, 375050, 367160, 359955, 353578, 347915, 342801, 338433, 335189, 333058, 331511, 329828, 327454, 324331, 321256, 319560, 319870, 321321, 322561, 323368, 324566, 326482, 328402, 329795, 331237, 333638, 337165, 341359, 345799, 350165, 354129, 357736, 361507, 365604, 369200, 371178, 371230, 369845, 367489, 364286, 360264, 355426, 349746, 343556, 337726, 333000, 329292, 326083, 323359, 321672, 321376, 322230, 323697, 325222, 326396, 327287, 328562, 330844, 334010, 337475, 341089, 345444, 351368, 359385, 369414, 380648, 392092, 403709, 416745, 432408, 450729, 471465, 495606, 524541, 557441, 590558, 619592, 642179, 657995]
63425F57995R688M914K340K100L422N690Q996J3385J8329K3272K8093L2647L6366
63412H47237L8669L9410L8493L5333K9280K0665J1179K940k957o867r543j0934
63400A032905j0531q778p402p941j0472j4154j8455k3213k7966l2028l5086l7051
63388G99828l7543l6192l3464l0466k7867k5492k3065k0733j8721j6875j4778
63377E14632j2130r027o068l953k673j293R60L617N570O576P520R142J1178J3039
63363E37090J4708J6641J9085K1762K4162K6037K7699K9753L2361L4931L6824
63352H21053L7973L8478L7869L5407L0975K5034J7963J0185K778k975o799r435
63340A038506j1242j1741j0907j0004j0441j2404j5220j8603k2767k7596l2318
$$ y = [657995, 667683, 672597, 674937, 677037, 680459, 686149, 695145, 708530, 726859, 750131, 778224, 810871, 847237, 885906, 925316, 963809, 999142, 1028422, 1049087, 1060266, 1063206, 1060249, 1053382, 1043839, 1032905, 1022374, 1013596, 1006194, 998253, 987781, 973627, 955172, 931959, 903993, 871965, 836879, 799828, 762285, 726093, 692629, 662163, 634296, 608804, 585739, 565006, 546285, 529410, 514632, 502502, 493475, 487407, 483454, 480781, 479488, 480448, 484065, 489635, 496211, 503731, 512873, 524051, 537090, 551798, 568439, 587524, 609286, 633448, 659485, 687184, 716937, 749298, 784229, 821053, 859026, 897504, 935373, 970780, 1001755, 1026789, 1044752, 1054937, 1057715, 1054740, 1047941, 1038506, 1027264, 1015523, 1004616, 994612, 984171, 971767, 956547, 937944, 915177, 887581, 855263]
63329H55263l5934l7629l7015l4459l1072k7870k4981k1952j8599j5042j1135
63318E59575o667k416m07k332p664j3729j7833j9176j8677j7449j5904j4145j2463
63305D10713j1067r843q654p646o878o089n217m701m715m537l482k106j622k134
63291C32022k496j989j222j016j320j638j794j788j557j348j709k577l015k447
63277C06106j531j102r02k17P03R25L11l27n35p55j276j560r81K72J496K250K502
63260C05379K372K076J937K104K394K537K550K679L120L835M545M881M705M362
63246C49476M387M901N488N823O184P094Q521R781J0295J0269J0470J1450J3107
63233D57246J4991J6755J8197J9123J9439J9359J9248J9230J9112J8770J8320
$$ y = [855263, 819329, 781700, 744685, 710226, 679154, 651284, 626303, 604351, 585752, 570710, 559575, 552908, 550492, 550085, 547753, 540089, 526360, 508527, 489351, 470674, 453225, 437321, 423176, 410713, 399646, 389803, 381149, 373503, 366625, 360536, 355319, 350618, 345903, 341366, 337884, 335778, 334156, 332022, 329526, 327537, 326315, 325299, 323979, 322341, 320547, 318759, 317202, 315854, 314145, 311568, 308553, 306106, 304575, 303473, 302571, 302354, 303057, 303982, 304293, 303966, 303431, 302676, 301400, 299840, 298859, 299131, 300627, 302877, 305379, 307751, 309827, 311764, 313868, 316262, 318799, 321349, 324028, 327148, 330983, 335528, 340409, 345114, 349476, 353863, 358764, 364252, 370075, 376259, 383353, 391874, 401655, 411950, 422219, 432689, 444139, 457246, 472237, 488992, 507189, 526312, 545751, 565110, 584358, 603588, 622700, 641470, 659790]
63222F59790J7924J7656J7611J7949J8646J9407J9982K0410K0713K0561J9382
63211H70031J6825J2967Q223L149j830o603j1240j5568j9132k1607k3084k3766
63199G88365k3667k2787k1352j9585j7377j4481j0962p172l452o0K798N218P784
63186F63270J0991J4544J7591J9752K1420K2950K4065K4462K4588K5242K6502
63175H95377K7532K7567K6727K5679K4816K4066K3286K2409K1233J9295J6179
63164A154166J1741O048o94q027j5252k1833k7697l2953l7450m0769m2645m3132
63152I01503m2463m0937l8959l6897l4846l2657l0189k7387k4220k0862j7890
63141E54196j5874j4633j3313j1399r355p949p213o466n301m130l543l480l257
$$ y = [659790, 677714, 695370, 712981, 730930, 749576, 768983, 788965, 809375, 830088, 850649, 870031, 886856, 899823, 908046, 911195, 909365, 902762, 891522, 875954, 856822, 835215, 812131, 788365, 764698, 741911, 720559, 700974, 683597, 669116, 658154, 650982, 647530, 647470, 650268, 655486, 663270, 674261, 688805, 706396, 726148, 747568, 770518, 794583, 819045, 843633, 868875, 895377, 922909, 950476, 977203, 1002882, 1027698, 1051764, 1075050, 1097459, 1118692, 1137987, 1154166, 1165907, 1171955, 1171261, 1163234, 1147982, 1126149, 1098452, 1065499, 1028049, 987280, 944635, 901503, 859040, 818103, 779144, 742247, 707401, 674744, 644555, 617168, 592948, 572086, 554196, 538322, 523689, 510376, 498977, 489622, 481673, 474460, 467994, 462693, 458563, 455020, 451540, 448283]
63128D48283k427j255k41N46J351K045K203J979K252L372M311L876K498J846K621
63113D73260L758M089L798L629L508K943K229K151K643K762K114J430J429J793
63099E11536J706R26j14r10j206r21j90N85J012J080J026R55Q03O00M54K41l53
63082E17230j226j558m77J870M211N291M994M233L883M067M440M848N503O588
63068E63897P866Q852R343R639J0160J0999J2040J3409J5340J7589J9493K0873
63056G19500K2407K4673K7296K9554L1472L3685L6422L9335M2163M4830M6926
63045A098263M7958M8104M7998M7710M6787M5448M4677M4894M5448M5925M6845
63034A610057M8402M9453M8768M6515M3559L9871L4705K7872J9702J0139r74j2784
$$ y = [448283, 445856, 444601, 444360, 444906, 446257, 448302, 450505, 452484, 454736, 458108, 462419, 466295, 468793, 470639, 473260, 477018, 481107, 484905, 488534, 492042, 494985, 497214, 499365, 502008, 504770, 506884, 508314, 509743, 511536, 513242, 514168, 514054, 513144, 511938, 511017, 510827, 511412, 512424, 513504, 514530, 515485, 516288, 516888, 517342, 517583, 517230, 516004, 514446, 513969, 515839, 520050, 525341, 530335, 534568, 538451, 542518, 546958, 551806, 557309, 563897, 571763, 580615, 589958, 599597, 609757, 620756, 632796, 646205, 661545, 679134, 698627, 719500, 741907, 766580, 793876, 823430, 854902, 888587, 925009, 964344, 1006507, 1051337, 1098263, 1146221, 1194325, 1242323, 1290033, 1336820, 1382268, 1426945, 1471839, 1517287, 1563212, 1610057, 1658459, 1707912, 1756680, 1803195, 1846754, 1886625, 1921330, 1949202, 1968904, 1979043, 1978069, 1965285]
63022A965285k3793l3340m1735m8830n3649n5726n5890n5215n3825n1154m6789
63011A445339m0824l3859k6772j9983j2946n015L203J0338J6160K1885K8145L3844
62999A419515L7807M0576M3453M6489M8593M9287M9212M9009M8742M8507M8646
62988A929836M9083M9101M8022M5590M1583L5669K7885J8782Q784k178j4204k6925
62976B211028l9667n1765o2536p1381p8121q2929q5704q5992q3831q0157p5908
62965A413037p1091o5317n9033n3443m9214m5842m2516l9011l5562l2302k9212
62954H90494k6369k3933k2059k0940k0617k0599k0095j8910j7747j7252j7147
62943F64826j6771j6019j5198j4259j2956j1640j0983j0906j0566r588q521p778
$$ y = [1965285, 1941492, 1908152, 1866417, 1817587, 1763938, 1708212, 1652322, 1597107, 1543282, 1492128, 1445339, 1404515, 1370656, 1343884, 1323901, 1310955, 1305940, 1309143, 1319481, 1335641, 1357526, 1385671, 1419515, 1457322, 1497898, 1541351, 1587840, 1636433, 1685720, 1734932, 1783941, 1832683, 1881190, 1929836, 1978919, 2028020, 2076042, 2121632, 2163215, 2198884, 2226769, 2245551, 2254335, 2252157, 2237953, 2211028, 2171361, 2119596, 2057060, 1985679, 1907558, 1824629, 1738925, 1652933, 1569102, 1488945, 1413037, 1341946, 1276629, 1217596, 1164153, 1114939, 1069097, 1026581, 987570, 952008, 919706, 890494, 864125, 840192, 818133, 797193, 776576, 755977, 735882, 716972, 699225, 681973, 664826, 648055, 632036, 616838, 602579, 589623, 577983, 567000, 556094, 545528, 535940, 527419, 519641]
62931E19641p012n935m936m310l547k206r46q05j758k787l172k986k434j603q07
62916D74397m59m73l57n3j0l88q18j071j378j853k243k525l120m127m893m783
62900D45846m022l312k939k692k340j792r58J18J068J533J579J560J661J773J688
62885D38771J190J58j111j875j630p40o3L7ML94J223K019K308J937J131L31j64
62868D43920m36o99q82o93j90M1m27j233j567j151m67LL52Q60J336J341Q99N46
62850D41553O75J137J600J856J736J134L14k19m06p11j282j471p76K06L94l49
62834D45391j098j133o95l82m23p05j016j057n96J51O22O09N20Q09J427K013K343
62817D46780K387K250K173K377K680K610K109J872K597M069N280N452M794M177
$$ y = [519641, 512629, 506694, 501758, 497448, 493901, 491695, 490749, 489944, 488186, 485399, 482227, 479241, 476807, 475204, 474397, 473938, 473465, 473108, 473055, 473045, 472657, 471839, 470768, 469390, 467537, 465294, 462769, 459649, 455522, 450629, 445846, 441824, 438512, 435573, 432881, 430541, 428749, 427791, 427909, 428977, 430510, 432089, 433649, 435310, 437083, 438771, 439961, 440119, 439008, 437133, 435503, 434763, 434700, 434737, 434741, 435135, 436358, 438377, 440685, 442622, 443753, 444084, 443920, 443484, 442785, 441903, 441210, 441020, 441061, 440634, 439401, 437834, 436683, 436216, 436219, 436571, 437431, 438767, 440108, 441007, 441553, 442228, 443365, 444965, 446821, 448557, 449691, 450005, 449786, 449380, 448669, 447387, 445916, 445140, 445346, 445740, 445391, 444293, 443160, 442465, 442083, 441660, 440955, 439939, 438882, 438286, 438437, 439059, 439668, 440188, 440997, 442424, 444437, 446780, 449167, 451417, 453590, 455967, 458647, 461257, 463366, 465238, 467835, 471904, 477184, 482636, 487430, 491607]
62803D91607M191M567M673M509M914O470Q570R965J0200R972J0189J1134J2582
62790E93543J4153J5451J6372J7514J9775K3317K7373L1260L5118L9440M4328
62779H77644M9572N5029O0507O5602O9945P3367P5608P6223P4986P2019O7313
62768A617815O0551N1742M1445L0098J7600M072r562k2295l3896m4444n3412o0038
62756A599676o4376o7212o9027o9608o8736o6645o3813o0686n7563n4364n0707
62745I06939m6573m2568l9032l5365l0976k6616k3746k2549k1556j9467j6461
62734E82030j3414j0699q285o416n412n081m826m207l151j817m76O69J713K881
62720E23509M096N043N792O846Q388R911J0989J2015J3714J6137J8612K0676K2625
$$ y = [491607, 495798, 500365, 505038, 509547, 514461, 520931, 529501, 539466, 549666, 559638, 569827, 580961, 593543, 607696, 623147, 639519, 657033, 676808, 700125, 727498, 758758, 793876, 833316, 877644, 927216, 982245, 1042752, 1108354, 1178299, 1251666, 1327274, 1403497, 1478483, 1550502, 1617815, 1678366, 1730108, 1771553, 1801651, 1819251, 1823323, 1813761, 1791466, 1757570, 1713126, 1659714, 1599676, 1535300, 1468088, 1399061, 1329453, 1260717, 1194072, 1130259, 1069573, 1012010, 957646, 906939, 860366, 817798, 778766, 743401, 712425, 685809, 662063, 639514, 617958, 598491, 582030, 568616, 557917, 549632, 543216, 537804, 532723, 527897, 523690, 520539, 518722, 518246, 518915, 520628, 523509, 527605, 532648, 538440, 545286, 553674, 563585, 574574, 586589, 600303, 616440, 635052, 655728, 678353]
62707F78353K5157K8614L2731L6987M1138M5362M9906N4867O0381O6741P3787
62696A194024Q0490Q5808Q9894R3734R7405R9534R8804R5222Q9316Q0857O9231
62685B174319N4628L7995J9989Q85j8502l6753n2917o6942p8865q8158r4331r7644
62673A753704r8790r8140r5708r1679q6597q1031p5269o9385o3464n7753n2543
62662H83345m7859m3367l8767l4202l0062k6498k3379k0703j8610j7029j5644
62651E67225j4340j3287j2504j1775j1109j0801j0760j0270q883p082n633m601
62639D46180l648k868k589k532j992r87l40m40p24p41r47j827k838l047k421j740
62623D16499j394j024l04O04J460K167K494K161J453J188J738K603L236L816M721
$$ y = [678353, 703510, 732124, 764855, 801842, 842980, 888342, 938248, 993115, 1053496, 1120237, 1194024, 1274514, 1360322, 1450216, 1543950, 1641355, 1740889, 1839693, 1934915, 2024231, 2105088, 2174319, 2228947, 2266942, 2286931, 2287816, 2269314, 2232561, 2179644, 2112702, 2033837, 1945679, 1851348, 1753704, 1654914, 1556774, 1461066, 1369387, 1282790, 1201759, 1126490, 1057105, 993641, 935888, 883345, 835486, 792119, 753352, 719150, 689088, 662590, 639211, 618508, 599898, 582869, 567225, 552885, 539598, 527094, 515319, 504210, 493409, 482649, 472379, 463496, 456414, 450781, 446180, 442532, 439664, 437075, 434543, 432551, 431564, 431224, 430784, 430060, 429319, 428372, 426545, 423707, 420660, 418239, 416499, 415105, 414081, 413777, 414381, 415841, 418008, 420502, 422663, 424116, 425304, 427042, 429645, 432881, 436697, 441418]
62608D41418N660O050O026O389P465Q662R418J0049J1221J2961J4699J6234J8109
62595E74361K0834K4156K7398L0274L2958L5458L7337L8145L7751L6122L3123
62584I27917K8782K3493J7601J1076L881l520j0469j6706k2250k6802k9889l1656
62572H71458l2837l3787l4036l3135l1430k9643k8001k6250k4282k2314k0527
62561E55216j8882j7237j5450j3499j1568r862q205o192l967k455k356l222l986
62548D38335m121l793l121k048q96l06l72l85K66J320K067K247K210K377K785
62533D36565L131L115K818K702L116L864M571N336O628Q511J0474J2208J4046
62520E17085J6355J8965K1630K4695K8643L3152L7239M0477M3536M7248N1510
$$ y = [441418, 447078, 453128, 459154, 465543, 473008, 481670, 491088, 501137, 512358, 525319, 540018, 556252, 574361, 595195, 619351, 646749, 677023, 709981, 745439, 782776, 820921, 858672, 894794, 927917, 956699, 980192, 997793, 1008869, 1012750, 1009230, 998761, 982055, 959805, 933003, 903114, 871458, 838621, 804834, 770798, 737663, 706233, 676590, 648589, 622339, 598057, 575743, 555216, 536334, 519097, 503647, 490148, 478580, 468718, 460513, 454321, 450354, 447899, 445543, 442321, 438335, 434214, 430421, 427300, 425252, 424356, 424050, 423678, 423293, 423559, 424879, 426946, 429193, 431403, 433780, 436565, 439696, 442811, 445629, 448331, 451447, 455311, 459882, 465218, 471846, 480357, 490831, 503039, 517085, 533440, 552405, 574035, 598730, 627373, 660525, 697764, 738241, 781777, 829025, 880535]
62509H80535N5329N7749N8374N7196N4288M9719M3569L5976K7226J7807Q196j432
62497A344532j0978j9888k7144l2199l5580l8153l9765l9295l6172l1358k6362
62486A007638k1703j6872j1537o068q80M083Q912J3322J7052K0303K3362K5888
62474A063500K7017K6108K3150J8513J2760O681J068l960r278j5931k3929l1935
62462A093764l8327m2406m4538m5419m5464m4836m3604m1711l9053l5777l2317
62451F40312k8969k5645k2232j8949j6068j3430j0652p730n121l198j942j118
62439D85258m59L29J400K543L403L960M425M645M112K749J228J56p08k013l868
62424E07160n748p219q264q967r275r232r009q645q017p195o475n943n320m427
$$ y = [880535, 935864, 993613, 1051987, 1109183, 1163471, 1213190, 1256759, 1292735, 1319961, 1337768, 1345964, 1344532, 1333554, 1313666, 1286522, 1254323, 1218743, 1180590, 1140825, 1101530, 1065358, 1034000, 1007638, 985935, 969063, 957526, 951458, 950578, 954661, 963573, 976895, 993947, 1014250, 1037612, 1063500, 1090517, 1116625, 1139775, 1158288, 1171048, 1177729, 1178797, 1174837, 1165559, 1149628, 1125699, 1093764, 1055437, 1013031, 968493, 923074, 877610, 832774, 789170, 747459, 708406, 672629, 640312, 611343, 585698, 563466, 544517, 528449, 515019, 504367, 496637, 491516, 488318, 486376, 485258, 484799, 485128, 486528, 489071, 492474, 496434, 500859, 505504, 509616, 512365, 513593, 513749, 513041, 511028, 507160, 501412, 494193, 485929, 476962, 467687, 458455, 449446, 440801, 432784, 425589, 419114, 413171, 407851, 403424]
62410D03424l536k957k534j919j225r07j062j240j129r63r97r83n79J0K72K15
62394C83890L50R04J543J988K415K880K915K134J007M76Q65J622K143K438K882
62379D10452L613M401N000N471O115P023P798P929P560P545Q454R832J0825J1361
62365E13379J2190J3856J6111J8468K0797K3291K6220K9895L4438L9413M4010
62354G92068M7833N1180N4381N7137N8725N8423N5592M9841M1612L2324K3379
62343A322495J5103O986j163q831j5548k1559k7462l3404l8761m2657m4730m5381
62331A065088m5164m4028m1490l7649l3481k9818k6418k2721j9145j6852j6167
62320G32155j6058j5512j4743j4598j5299j6366j7430j8379j8875j8390j6964
$$ y = [403424, 399888, 396931, 394397, 392478, 391253, 390346, 389284, 388044, 386915, 385952, 384955, 383972, 383393, 383403, 383675, 383890, 384240, 385144, 386687, 388675, 391090, 393970, 396885, 399019, 400026, 400502, 401367, 402989, 405132, 407570, 410452, 414065, 418466, 423466, 428937, 435052, 442075, 449873, 457802, 465362, 472907, 481361, 491193, 502018, 513379, 525569, 539425, 555536, 574004, 594801, 618092, 644312, 674207, 708645, 748058, 792068, 839901, 891081, 945462, 1002599, 1061324, 1119747, 1175339, 1225180, 1266792, 1299116, 1322495, 1337598, 1344584, 1343421, 1334590, 1319042, 1297483, 1270021, 1236617, 1197856, 1155199, 1110469, 1065088, 1019924, 975896, 934406, 896757, 863276, 833458, 807040, 784319, 765174, 748322, 732155, 716097, 700585, 685842, 671244, 655945, 639579, 622149, 603770, 584895, 566505, 549541]
62309E49541j5308j4023j3013j1912j0608r158p542n907m715m183l780k877j781
62296D44734j465k127k712k218r77k8L83R03J839K545K406J783J589K144K985
62281D51784L615M000M256M286L999L695L912M795N844O463O630O836P401Q137
62267E25653Q801R549J0702J2203J3732J5264J7221J9956K3397K7285L1510L6013
62255G51286M0633M5228M9839N4447N8615O1539O2456O0929N6782N0020M1030
62244A332804L0812K0784J2037M624k364r867j7988k6150l3856m1077m7791n3487
62232A168481n7346n8911n8399n6387n3344m9531m5273m1064l7228l3548k9577
62221F47873k5353k1534j8660j6502j4468j2435j0789r733q940p919o474m742
$$ y = [549541, 534233, 520210, 507197, 495285, 484677, 475519, 467977, 462070, 457355, 453172, 449392, 446515, 444734, 443269, 441142, 438430, 436212, 435235, 435207, 435590, 436493, 438332, 440877, 443283, 445066, 446655, 448799, 451784, 455399, 459399, 463655, 467941, 471940, 475635, 479547, 484342, 490186, 496649, 503279, 510115, 517516, 525653, 534454, 544003, 554705, 566908, 580640, 595904, 613125, 633081, 656478, 683763, 715273, 751286, 791919, 837147, 886986, 941433, 1000048, 1061587, 1124043, 1184972, 1241754, 1291774, 1332804, 1363616, 1384400, 1396437, 1401061, 1398697, 1388830, 1370842, 1344692, 1310836, 1269759, 1221968, 1168481, 1111135, 1052224, 993825, 937438, 884094, 834563, 789290, 748226, 710998, 677450, 647873, 622520, 600986, 582326, 565824, 551356, 538921, 528132, 518399, 509459, 501540, 495066, 490324]
62209D90324l099k018j638j457p60N41J857K781L594M693N946O988P896R082J0580
62194E35310J1747J1844J0783R270Q265Q245Q932R642R837R319Q188O929O273
62181F54584O558P208P282O485N255L908K340P24k19k8R69K319M165O853J0323
62166G18726J4351J9042K4379K9730L4414L8466M2165M4970M5757M3989L9974
62155A095963L4139K6819J8841J1356M813j169o716j1333j5037j8996k4229l0148
62143A084303l5130l8182l9346l8799l6524l3002k9337k6295k3684k0958j8027
62132G45019j5115j2205r182o333m249l118k503j878j104j71J112K854M729O220
62118G04076P125P483P073N524L024M34j519k757l296k771j184K71k2k373n474
$$ y = [490324, 487225, 485207, 483569, 482112, 481352, 481893, 483750, 486531, 490125, 494818, 500764, 507752, 515648, 524730, 535310, 547057, 558901, 569684, 578954, 587219, 595464, 604396, 614038, 623875, 633194, 641382, 648311, 654584, 661142, 668350, 675632, 682117, 687372, 691280, 693620, 694344, 694125, 694097, 695066, 697385, 701550, 708403, 718726, 733077, 752119, 776498, 806228, 840642, 879108, 921273, 966243, 1012000, 1055989, 1095963, 1130102, 1156921, 1175762, 1187118, 1191931, 1190762, 1184046, 1172713, 1157676, 1138680, 1114451, 1084303, 1049173, 1010991, 971645, 932846, 896322, 863320, 833983, 807688, 784004, 763046, 745019, 729904, 717699, 708517, 702184, 697935, 694817, 692314, 690436, 689332, 689161, 690273, 693127, 697856, 704076, 711201, 718684, 725757, 731281, 734305, 734739, 733220, 730463, 727167, 724396, 723212, 723483, 723461, 721088, 715614]
62103G15614p933r501j0553j1034j0513q920o674m226j857J46J614K728L782M750
62089F57423N396N854O577P677Q699R287R681J0311J1174J2012J2845J3974J5521
62076G86431J7321J9233K1215K3110K4643K5709K6304K6212K5202K3664K2530
62065A041574K2293K2534K2794K3462K5257K8000L0548L1816L1405K9293K5610
62054A334586K0784J5371R655L835j462n612r011j2883j7777k3048k8128l3341
62042A252969l8783m3305m5751m6622m7283m7767m6781m3896m0463l7858l5915
62031G78545l3702l0968k7996k4781k1243j7925j5592j4242j3229j2285j1733
62020E54849j1587j1173j0056q816q431q989r519r126q025p194p106p167o485
$$ y = [715614, 707681, 698180, 687627, 676593, 666080, 657160, 650486, 646260, 644403, 644549, 646163, 648891, 652673, 657423, 662819, 668673, 675250, 682927, 691626, 700913, 710594, 720905, 732079, 744091, 756936, 770910, 786431, 803752, 822985, 844200, 867310, 891953, 917662, 943966, 970178, 995380, 1019044, 1041574, 1063867, 1086401, 1109195, 1132657, 1157914, 1185914, 1216462, 1248278, 1279683, 1308976, 1334586, 1355370, 1370741, 1380396, 1384231, 1382769, 1377157, 1368146, 1355263, 1337486, 1314438, 1286310, 1252969, 1214186, 1170881, 1125130, 1078508, 1031225, 983458, 936677, 892781, 852318, 814460, 778545, 744843, 713875, 685879, 661098, 639855, 621930, 606338, 592096, 578867, 566582, 554849, 543262, 532089, 522033, 513217, 504786, 495797, 486278, 477152, 469127, 461933, 454827, 447660, 441175]
62007D41175m937l173j734n75N17J479K113K438K638K913L440M236M906M816L829
61992D64081K561J685J223Q69N98M41q3j612l919n940o982p383p725p920p538
61977D22356o603n560m613l625k598j762j194p28l40k13l51m54l76l48n31o89
61961C92371n44k15P9M80J206J929K002J350O96O87J210J788K270K787L278L545
61945D14919L715M258N388O785Q038R196J0681J2647J4594J5752J5823J5240J4648
61932E51684J4271J3993J3769J3595J3161J2050J0449R104Q330P508N966L848
61920F77728J687n03k990n477p234q072q381q235p194n223l015j013J204M002
61906F27284O809Q808J0133J1497J2814J3015J1417Q593N693L246R76j504m178
$$ y = [441175, 436238, 433065, 431331, 430756, 431273, 432752, 434865, 437303, 439941, 442854, 446294, 450530, 455436, 460252, 464081, 466642, 468327, 469550, 470419, 471017, 471458, 471375, 469763, 465844, 459904, 452922, 445539, 437814, 429894, 422356, 415753, 410193, 405580, 401955, 399357, 397595, 396401, 395673, 395333, 395120, 394769, 394315, 393939, 393591, 393060, 392371, 391827, 391612, 391691, 392171, 393377, 395306, 397308, 398658, 399354, 400041, 401251, 403039, 405309, 408096, 411374, 414919, 418634, 422892, 428280, 435065, 443103, 452299, 462980, 475627, 490221, 505973, 521796, 537036, 551684, 565955, 579948, 593717, 607312, 620473, 632523, 642972, 652076, 660406, 667914, 673880, 677728, 679415, 678912, 675922, 670445, 663211, 655139, 646758, 638523, 631329, 626106, 623091, 622078, 623282, 627284, 634093, 642901, 653034, 664531, 677345, 690360, 701777, 710370, 716063, 719309, 720285, 718781, 714603]
61893G14603o753r061j1153j3015j4237j4288j3216j1833j0939j0527j0078r435
61881E80068q935q769q779q922r452j0397j1258j1575j1409j0951r989q220n929
61868D55483l896k606j900j369q33l39N5M89J381L186N771Q205R567J0043J0700
61853D93937J2197J4188J6140J8162K0506K2791K4359K5287K6264K7417K7902
61842G29150K6974K4998K2876K0711J7650J3151P948L376j56l440p052j0114j1019
61829H35053r352o438l825j774L53K860N464P988J0406J2335J3164J2776J1450
61816H90460R010M876q72p143j2977j8245k2881k6152k7544k7732k7809k7818
61804G05173k6938k4932k2538k0392j8397j6366j4560j3289j2527j2078j1752
$$ y = [714603, 707850, 698789, 687636, 674621, 660384, 646096, 632880, 621047, 610108, 599581, 589503, 580068, 571133, 562364, 553585, 544663, 535211, 524814, 513556, 501981, 490572, 479621, 469632, 461412, 455483, 451587, 448981, 447081, 445712, 444879, 444540, 444595, 445084, 446465, 449651, 455422, 463627, 473194, 483237, 493937, 506134, 520322, 536462, 554624, 575130, 597921, 622280, 647567, 673831, 701248, 729150, 756124, 781122, 803998, 824709, 842359, 855510, 863458, 866834, 866678, 863238, 856186, 846072, 835053, 825701, 819263, 815438, 813664, 814017, 816877, 822341, 830329, 840735, 853070, 866234, 879010, 890460, 899470, 904346, 903474, 896331, 883354, 865109, 842228, 816076, 788532, 760800, 732991, 705173, 678235, 653303, 630765, 610373, 591976, 575610, 561050, 547761, 535234, 523156, 511404]
61793E11404j1130r787p917o309n406m875m349m044m163m208l558k452j796j996
61779D39414k515k642k279j852j738j926k094j943j531j235j273j391j243q68
61765D14884n79m45k32J91O89J113J413J521J430J423J809K372K517K172J992
61750D32270K341K514J653J38p36m99j40p10k017l104l573l681l552k960j978
61735D15966j071m64P4O34Q62N71K54N88J591K650L249L376L245K981K634K362
61719D39502K425K929L553L643K861J708J062J179J453J341J032Q64N07o43k375
61704D61041l622l624k825k329k757l720m351m146l384k748k601k757k904l025
61690D16248l153l072k587k024j964k447k791k385j472r43j359k306k721j939
$$ y = [511404, 500274, 490487, 482570, 476261, 470855, 465980, 461631, 457587, 453424, 449216, 445658, 443206, 441410, 439414, 436899, 434257, 431978, 430126, 428388, 426462, 424368, 422425, 420894, 419659, 418386, 416995, 415752, 414884, 414305, 413860, 413628, 413819, 414508, 415621, 417034, 418555, 419985, 421408, 423217, 425589, 428106, 430278, 432270, 434611, 437125, 438778, 438916, 438180, 437681, 437541, 436831, 434814, 431710, 428137, 424456, 420904, 417944, 415966, 414895, 414431, 414505, 415139, 416001, 416572, 416826, 417414, 419005, 421655, 424904, 428280, 431525, 434506, 437140, 439502, 441927, 444856, 448409, 452052, 454913, 456621, 457683, 458862, 460315, 461656, 462688, 463552, 464059, 463416, 461041, 457419, 453795, 450970, 448641, 445884, 442164, 437813, 433667, 430283, 427535, 424934, 422177, 419273, 416248, 413095, 410023, 407436, 405412, 403448, 401001, 398210, 395825, 394353, 393410, 392051, 389745, 387024, 385085]
61676C85085m46N59L99m84j217j492j572j610j468j211j222j675k177k198j703
61661C67568j137q68q04o20k30J02J71J53K90M30K84N8L42J208J967K145K098
61644C73157K278K422K124J726J861K355K474K124J960K199K166J302m1j142j761
61629C95204k118k354k348j915j081l63n56j831l235l616k996k355k151j859j128
61614C65298m37k61l22k46l07r47k056l213m254n104n506n402n185n043m512l273
61598C19230k020j770k539l367l555l255k895k672k642k765k690k044j047m90
61584B85479q25j622k113k077j880j803j689j332r75j126j822k370k121j283n94
61569B61847k90P4P29J124O02o87j870k145j369r0Q19Q20K10k22n6M82J044J513
$$ y = [385085, 384639, 385198, 385597, 385113, 383896, 382404, 380832, 379222, 377754, 376543, 375321, 373646, 371469, 369271, 367568, 366431, 365563, 364759, 364139, 363909, 364011, 364182, 364335, 364625, 365055, 365339, 365397, 365739, 366947, 368914, 371059, 373157, 375435, 377857, 379981, 381707, 383568, 385923, 388397, 390521, 392481, 394680, 396846, 398148, 398107, 396965, 395204, 393086, 390732, 388384, 386469, 385388, 385025, 384469, 382638, 379403, 375787, 372791, 370436, 368285, 366426, 365298, 364861, 364600, 364278, 364032, 363725, 362778, 360722, 357509, 353255, 348151, 342645, 337243, 332058, 327015, 322503, 319230, 317210, 315440, 312901, 309534, 305979, 302724, 299829, 297157, 294515, 291750, 289060, 287016, 285969, 285479, 284654, 283032, 280919, 278842, 276962, 275159, 273470, 272138, 271163, 270037, 268215, 265845, 263724, 262441, 261847, 261557, 261631, 262360, 263484, 264086, 263399, 261529, 259384, 258015, 257925, 258744, 259564, 259774, 259552, 259496, 259978, 261022, 262535]
61551B62535J761J632J338J337J594J499Q48K37J26J47j18k97J85J100J748J871
61535B77543J619R76L3n70k47N81R91Q19O84Q64R82P83M44Qp14j574k071k008
61517B79143j648j140n08j46n33j276j345n34J29j29p27p28k41m8k93l35J65P66
61499B70572Q74M20j76m59l10k0Kl30o76o97l81N9L45J66n89j418j403j93J458
61480B67244K424K358J814J444J380J353J128P62O06R32J530J761J257L67k77
61465B86083m91n80p47q25o06j53L51Q57J344J622J472R84N88N90Q23R17Q15P75
61447B93819Q88R65R56J082J302J085J83p20p67j71R9j56jJ135K464K954K780
61430C07897K845L298L456L023K482K093J427K64p31p91r2N29O75O75R11J334
$$ y = [262535, 264296, 265928, 267266, 268603, 270197, 271696, 272544, 272781, 272907, 273054, 272936, 272639, 272824, 273924, 275672, 277543, 279162, 280138, 280171, 279601, 279354, 279935, 280926, 281745, 282429, 283293, 284275, 285058, 285502, 285510, 284796, 283222, 281151, 279143, 277495, 276355, 275847, 275701, 275168, 273892, 272547, 272013, 272142, 272013, 271286, 270558, 270317, 270269, 269976, 269641, 269806, 270572, 271446, 271866, 271690, 271231, 270921, 270901, 270903, 270573, 269897, 269200, 268819, 268878, 269223, 269389, 268800, 267382, 265979, 265786, 267244, 269668, 272026, 273840, 275284, 276664, 278017, 279145, 279907, 280513, 281445, 282975, 284736, 285993, 286360, 286083, 285592, 285012, 284265, 283440, 282834, 282681, 283032, 283889, 285233, 286855, 288327, 289311, 289899, 290489, 291312, 292229, 293044, 293819, 294707, 295672, 296628, 297710, 299012, 300097, 300280, 299560, 298793, 298622, 298721, 298565, 298564, 299699, 302163, 305117, 307897, 310742, 314040, 317496, 320519, 323001, 325094, 326521, 326785, 326054, 325263, 325171, 325700, 326375, 327050, 327961, 329295]
61414C29295J675J757J530J108P74O85O42M07J40J48K67j1p30j310j375j250j316
61397C32436j396j210j012j168j399j082k32M71O03M02K11J06K18Q09J737K272
61381C31766J872Q66P8n9J93L08jn35q01m71K87J014J467J664J555J055L76l7
61363C40597L6M90J140J716J704R34K66Q42K487L718L734L488M144N340N955N934
61347C82525O168O825P069O501N803N527N148M014K630K220L145M392M753M070
61333D50790L056K254J564P80J23j07j07l78j044j745k130k107j709j151r76j447
61317D45666j852j096P97K560L285L438L827M450M972N667P005Q663R826J0266
61303E07474J0497J0988J1788J2619J2909J1919R491O432L733J583l19j936l024
$$ y = [329295, 330970, 332727, 334257, 335365, 336139, 336824, 337466, 337873, 338013, 338161, 338428, 338417, 337687, 336377, 335002, 333752, 332436, 331040, 329830, 328818, 327650, 326251, 325169, 324937, 325408, 326011, 326413, 326624, 326730, 326948, 327757, 329494, 331766, 333638, 334504, 334582, 334523, 334716, 335024, 335023, 334488, 333687, 333216, 333503, 334517, 335984, 337648, 339203, 340258, 340634, 340597, 340633, 341123, 342263, 343979, 345683, 346617, 346883, 347725, 350212, 353930, 357664, 361152, 365296, 370636, 376591, 382525, 388693, 395518, 402587, 409088, 414891, 420418, 425566, 429580, 432210, 434430, 437575, 441967, 446720, 450790, 453846, 456100, 457664, 458444, 458567, 458460, 458353, 457975, 456931, 455186, 453056, 450949, 449240, 448089, 447113, 445666, 443814, 442718, 443515, 446075, 449360, 452798, 456625, 461075, 466047, 471714, 478719, 487382, 497208, 507474, 517971, 528959, 540747, 553366, 566275, 578194, 587685, 594117, 597850, 599433, 599114, 597178, 594154]
61290E94154l805m776n963o911p434p775q144q535q919r169q992q278p313o321
61276D91819n170l859k786k011r26P30K134K481K198K144K157J562O67N36J379
61261D93055K402L152L872M596N066N552O529P457P137N523L979L324K904K001
61247E56549J053P09P44O57N89Q60J157Q82m8j298k495l163k791j465j07M05J17
61230E52355k05J00J120K350L081L097K991L369M003M360M663N529O631O874O050
61215F06368N279N462O186O566O285N473M333L322K918K841K289J234O10Q56J242
61200F61264J158J120J868L291M935O832R081J1256J2931J4202J5132J5240J4151
61187G72461J2168R715O869L985K001J339J164M18r11k160l081l806m316m641
$$ y = [594154, 590349, 585573, 579610, 572699, 565265, 557490, 549346, 540811, 531892, 522723, 513731, 505453, 498140, 491819, 486649, 482790, 480004, 477993, 477067, 477797, 479931, 482412, 484610, 486754, 488911, 490473, 491140, 491676, 493055, 495457, 498609, 502481, 507077, 512143, 517695, 524224, 531681, 538818, 544341, 548320, 551644, 554548, 556549, 557602, 558311, 559055, 559712, 560301, 561161, 562318, 563200, 563152, 561854, 559359, 556196, 553405, 551940, 551833, 552238, 552355, 552150, 552250, 553370, 555720, 558801, 561898, 564889, 568258, 572261, 576621, 581284, 586813, 593444, 600318, 606368, 611647, 617109, 623295, 629861, 636146, 641619, 645952, 649274, 652192, 655033, 657322, 658556, 659166, 660022, 661264, 662422, 663542, 665410, 668701, 673636, 680468, 689549, 700805, 713736, 727938, 743070, 758310, 772461, 784629, 794344, 801213, 805198, 807199, 808538, 809702, 810120, 809209, 807049, 803968, 800162, 795846, 791205]
61173G91205n121n817o166n886n649o174p159p875q252q632q949r058r374j0293
61159F86800j1314j1648j1412j1323j1406j0990r912q795q011p082n424l144r48
61146E75391M68Q70N71j5r33k563m726o420o875o470o090n901n327m037k359q23
61130E24761K77Q93J205J656K654M236O058P664Q801R635J0573J1771J2957J4081
61116F17222J5698J8129K0579K1929K2276K2692K3551K4197K4288K4307K4398
61105H59266K3949K2738K1399K0224J8535J5819J2534R206N661J756k001n129
61093A003957p683r735j1325j3159j6119j9543k1448k1118k0139k0072k0479k0297
61081H02840j9689j9291j8782j7609j6151j5043j4108j3050j2213j1654j0552
$$ y = [791205, 786084, 780267, 774101, 768215, 762566, 756392, 749233, 741358, 733106, 724474, 715525, 706467, 697093, 686800, 675486, 663838, 652426, 641103, 629697, 618707, 608795, 600000, 591989, 584907, 579483, 576339, 575391, 575859, 576729, 577300, 577285, 576352, 573789, 569063, 562643, 555768, 549298, 543208, 537307, 531980, 527943, 525584, 524761, 525038, 525931, 527136, 528792, 531446, 535682, 541740, 549404, 558205, 567840, 578413, 590184, 603141, 617222, 632920, 651049, 671628, 693557, 715833, 738525, 762076, 786273, 810561, 834868, 859266, 883215, 905953, 927352, 947576, 966111, 981930, 994464, 1003670, 1009331, 1011087, 1009086, 1003957, 996274, 986539, 975214, 962055, 945936, 926393, 904945, 883827, 863688, 843616, 823137, 802840, 783151, 763860, 745078, 727469, 711318, 696275, 682167, 669117, 656904, 645250, 634698]
61070F34698q573o735n804n077l871k856k519j750L47K545L207K869L141M134
61056F13756M846N328O378P776Q720R524J1009J2791J3883J4442J5232J6060J6455
61043G56200J7169J9160K1780K3819K5511K7658K9692L0783L1847L4253L7329
61032A055201L9614M1642M4861M8545N0607N0983N1334N1936N1811N1673N3690
61021A591897N8480O5052P3299Q3476R3776J01915J08895J17908J30165J45598
61011B570461J66958J98429K40525K91475L53182M29961N21944O27690P54042
61002F154667R14256J114986J356057J641414J961019K236753K307143K021731
60994A9708026J386572O05398m9151m11601m76315l13678O528L87892O54289O03469
$$ y = [634698, 626125, 619390, 613586, 608509, 604638, 601782, 599263, 597513, 597860, 600405, 603612, 606481, 609622, 613756, 618602, 623930, 630308, 638084, 646804, 656328, 667337, 680128, 694011, 708453, 723685, 739745, 756200, 773369, 792529, 814309, 838128, 863639, 891297, 920989, 951772, 983619, 1017872, 1055201, 1094815, 1136457, 1181318, 1229863, 1280470, 1331453, 1382787, 1434723, 1486534, 1538207, 1591897, 1650377, 1715429, 1788728, 1872204, 1965980, 2067895, 2176790, 2294698, 2424863, 2570461, 2737419, 2935848, 3176373, 3467848, 3821030, 4250991, 4772935, 5400625, 6154667, 7068923, 8183909, 9539966, 11181380, 13142399, 15379152, 17686295, 19708026, 21094598, 21699996, 21650845, 21239244, 20762929, 20449251, 20455779, 20843671, 21497960, 22101429]
60984B2101429J56025n57975j280971j800402k049078k074038j953328j751437
60976A0790225j518437j291661j088957r11557p57517o27705n20862m31883l57392
60967C284254k97771k52257k16727j87741j64759j46971j31664j17227j04714
60958A664423r4849q6031p6617o6936n7834m9372m1964l6932l4692l3925l3220
60947A052051l2211l0757k8625k6326k4636k3034k0317j6904j4599j3795j2945
60936H07902j1234r784r548r900j0029j0031r917r245q326q186q730q676p830
60923F86466p512q036p819n969l854k856k385j517q89j316j807q01J456L428M519
60908F51108N379O489P717R032J0614J2412J4231J6011J7523J8420J9029K0357
$$ y = [22101429, 22257454, 21699479, 20418508, 18618106, 16569028, 14494990, 12541662, 10790225, 9271788, 7980127, 6891170, 5979613, 5222096, 4594391, 4073529, 3641646, 3284254, 2986483, 2734226, 2517499, 2329758, 2164999, 2018028, 1886364, 1769137, 1664423, 1569574, 1483543, 1406926, 1339990, 1282156, 1232784, 1190820, 1153888, 1119196, 1085271, 1052051, 1019840, 989083, 960458, 934132, 909496, 886462, 866145, 849241, 834642, 820847, 807902, 796668, 786884, 777336, 767436, 757407, 747376, 737459, 728214, 719888, 711702, 702972, 694296, 686466, 678954, 670918, 663099, 657130, 653276, 650420, 648035, 646518, 645629, 644313, 642506, 641705, 643161, 646589, 651108, 656487, 662976, 670693, 679725, 690339, 702751, 716982, 732993, 750516, 768936, 787965, 808322]
60896H08322K2688K4889K5848K5845K5813K5874K5465K4342K2707K0745J8672
60885A071210J6707J4524J1315O940K404j474n155r415j3938j7697k0281k2000
60873A033140k3094k3643k3993k4487k4895k4745k4035k3115k1980k0304j8100
60862G80749j5872j4154j3149j2727j2645j2833j3518j4702j5639j5406j4070
60851F26034j2632j1589j0380q719p544p817r000r709r606r596j0087j0162q968
60838E00225p230o545p343q354q358p741p684q214q121o875n445m715m134k913
60824D06553j628j367j812j629n73K03M6l63l49j65j25J01P42J396J705J816J769
60807D06320J333P89R56J866K336J493k0j025j215r74n07L8K31j01l82q6M17M70
$$ y = [808322, 831010, 855899, 881747, 907592, 933405, 959279, 984744, 1009086, 1031793, 1052538, 1071210, 1087917, 1102441, 1113756, 1120696, 1123100, 1121626, 1116471, 1107056, 1093118, 1075421, 1055140, 1033140, 1010046, 986403, 962410, 937923, 913028, 888283, 864248, 841133, 819153, 798849, 780749, 764877, 750723, 737574, 724847, 712202, 699369, 685851, 671149, 655510, 640104, 626034, 613402, 601813, 591433, 582714, 575170, 567353, 558353, 548644, 539038, 529442, 519355, 509193, 500225, 492995, 486450, 479107, 470753, 462395, 454654, 446970, 438756, 430635, 423760, 418315, 413600, 409466, 406553, 404925, 403558, 401746, 400117, 399544, 399747, 399793, 399430, 399081, 398916, 398791, 398892, 399634, 401030, 402735, 404551, 406320, 407653, 408442, 409398, 411264, 413600, 415093, 415073, 414048, 412833, 411859, 411352, 411390, 411621, 411520, 411138, 411052, 411469, 411939]
60789D11939R3k86p50j707k986l776l545k595j773j771k602l542l828l520l291
60774C76060l382l293k752k291k437k841k727j856p08M7qp17j317j124m22j61
60758C50071o53j168j057n74j98J43O91J282J739K264K999L579L655L478L547
60743C69798L995M593M922M414K824Q79k70n14r38k093l167l445l526m261n226
60728C67985n436m955m684m893n005m642l983l159k229j641j916k781l380l364
60714C15917l164l117k950k348j486q86r19j540k239k357j724q86m46l76k56J1
60698B91234J43K0r8Q8N97J133J280Q85L25K11O89J331J727J865J875J835J902
60681C07042K177K396K261K197L023M666N941N979N195M500M284M583N374O101
$$ y = [411939, 412032, 411746, 410996, 409289, 406303, 402527, 398982, 396387, 394614, 392843, 390241, 386699, 382871, 379351, 376060, 372678, 369385, 366633, 364342, 361905, 359064, 356337, 354481, 353773, 353820, 353812, 353095, 351778, 350654, 350232, 350071, 349418, 348250, 347193, 346619, 346421, 346564, 347255, 348537, 350276, 352540, 355539, 359118, 362773, 366251, 369798, 373793, 378386, 383308, 387722, 390546, 391425, 391155, 390641, 389703, 387610, 384443, 380998, 377472, 373211, 367985, 362549, 357594, 352910, 348017, 343012, 338370, 334387, 331228, 328999, 327358, 325442, 322661, 319281, 315917, 312753, 309636, 306686, 304338, 302852, 301966, 301047, 299507, 297268, 294911, 293187, 292301, 291855, 291479, 291223, 291234, 291377, 291397, 291299, 291387, 291984, 293117, 294397, 295282, 295607, 295818, 296507, 297838, 299565, 301430, 303305, 305140, 307042, 309219, 311615, 313876, 316073, 319096, 323762, 329703, 335682, 340877, 345377, 349661, 354244, 359618, 365719]
60667C65719N651L626J217l7P4N63O35L11j2J3M40Q58P42K86K17N95N65k36r40
60648C80287q37n13p70j242j126o26m81p10r58j509k741l972m224l822l953m754
60632C48049n119m430l285k378j794j496j525j540j105n24n16r93j101n05L05
60617C22043J005J715K163J691M05o38p52l12J14M78P59O42R7l95n30n12m63j46
60599C27364M89J119J553J842J795J204N50O25J277J538J171J070J688K151J504
60584C46940l6j625k733k990j997j17J333J504J088J230J993K714L286M155N323
60569C60068O331P104Q066R408J0821J1914J2398J2005J0673Q660O166L037p15
60556D65936m357o932q098q098p170n496l585k043j029k23O82J792L108M435N424
$$ y = [365719, 371370, 374996, 376213, 376176, 376250, 376813, 377448, 377759, 377747, 377760, 378200, 379058, 379800, 380086, 380303, 380898, 381463, 381227, 380287, 379450, 378937, 378167, 376925, 375799, 375173, 374692, 373982, 373024, 371515, 368774, 364802, 360578, 356756, 352803, 348049, 342930, 338500, 335215, 332837, 331043, 329547, 328022, 326482, 325377, 324853, 324337, 323344, 322243, 321738, 322043, 323048, 324763, 326926, 328617, 329022, 328384, 327632, 327320, 327434, 327912, 328671, 329313, 329410, 329015, 328485, 327973, 327510, 327364, 327853, 328972, 330525, 332367, 334162, 335366, 335916, 336541, 337818, 339356, 340527, 341597, 343285, 345436, 346940, 346904, 345279, 342546, 339556, 337559, 337442, 338775, 340279, 341367, 342597, 344590, 347304, 350590, 354745, 360068, 366399, 373503, 381569, 390977, 401798, 413712, 426110, 438115, 448788, 457448, 463614, 466651, 465936, 461579, 454647, 446549, 438451, 431281, 425785, 422200, 420157, 419128, 418905, 419587, 421379, 424487, 428922, 434346]
60541D34346O061O901Q367J0109J1549J2757J4089J5196J5162J3643J1114P928
60529E67222L983m01m051o008o528o547o463o048n274m579m234m000l569k986
60515E10517k485k133j837j506j008j73R06J773K047K076K688M341O705R230J1790
60500E42931J4568J7618K0908K4558K8637L2776L6359L9087M0978M1769M0857
60489H81046L8041L3843K8748K2426J4210M243o306j6267k5296l3411m0043m4050
60477H57184m4868m3339m1053l8894l6528l3395k9735k6337k3522k0862j7946
60466E00705j4972j2495j0797r727q922q099p263o731o753p044o954o228n352
60453C89368m842m505l773k655j868j888k344k525k204j629r82k62L80O63O08
$$ y = [434346, 440407, 447308, 455675, 465784, 477333, 490090, 504179, 519375, 534537, 548180, 559294, 567222, 571205, 570804, 566753, 560745, 554217, 547670, 541207, 535159, 529885, 525306, 521072, 517072, 513503, 510517, 508032, 505899, 504062, 502556, 501548, 501375, 502281, 504054, 506101, 508177, 510865, 515206, 521911, 531141, 542931, 557499, 575117, 596025, 620583, 649220, 681996, 718355, 757442, 798420, 840189, 881046, 919087, 952930, 981678, 1004104, 1018314, 1022557, 1016251, 999984, 974688, 941277, 901234, 857184, 812316, 768977, 727924, 689030, 652502, 619107, 589372, 563035, 539513, 518651, 500705, 485733, 473238, 462441, 452714, 443792, 435693, 428430, 421699, 414946, 407902, 400948, 394720, 389368, 384526, 380021, 376248, 373593, 371725, 369837, 367493, 364968, 362764, 361135, 360153, 359891, 360271, 360934, 361542]
60438C61542N58O09M06l02j195j751j874j805j691j584j714k200k573k136q75
60423C43415M20J068J149J103J117J080Q75M73m2m11l48R8N99R80J286J383R82
60406C55227J88m06l92L6N14R87J481J902K262K790L471L874L729L273K756K076
60390C83768J194M89K46K40K17L80R47J682K268K762L183L166K637K266K568L072
60374D11085L135L085L570M184L922K869K239K512K759K139J121N66M93L87K04
60359D44270K88O35Q77R35J170J846K738L393L639L759M200N039N845O095N670
60344D90399M859L986L117K040N05j418l178m222m634m943n231n014m121l096
60330D69049k391j814j276j339k316l479l992m147m688n317m991l572k127j497
$$ y = [361542, 362100, 362709, 363115, 362813, 361618, 359867, 357993, 356188, 354497, 352913, 351199, 348999, 346426, 344290, 343415, 343835, 344903, 346052, 347155, 348272, 349352, 350227, 350700, 350658, 350247, 349899, 349997, 350596, 351576, 352862, 354245, 355227, 355415, 355009, 354617, 354653, 355167, 356154, 357635, 359537, 361799, 364589, 368060, 371934, 375663, 378936, 381692, 383768, 384962, 385451, 385697, 385937, 386154, 386534, 387481, 389163, 391431, 394193, 397376, 400542, 403179, 405445, 408013, 411085, 414220, 417305, 420875, 425059, 428981, 431850, 434089, 436601, 439360, 441499, 442620, 443186, 443679, 444066, 444270, 444558, 445193, 446070, 447005, 448175, 450021, 452759, 456152, 459791, 463550, 467750, 472789, 478634, 484729, 490399, 495258, 499244, 502361, 504401, 504906, 503488, 500310, 496088, 491454, 486511, 481280, 476266, 472145, 469049, 466658, 464844, 463568, 462229, 459913, 456434, 452442, 448295, 443607, 438290, 433299, 429727, 427600, 426103]
60316D26103j418j260p92q1P62J542K205L091M463N966P151Q402J0585J3890J7613
60301D98222K0886K2830K2439J9338J4604R703M660j515q616j4758j8468j9984
60289E49341k0113j9019j6757j3956j1171q357n612l615k720k420k225k347k861
60276D38168l053k399j486j150j334j550j836k363k653k162j331j151j851k760
60262D11089l332l543l452l012k433k109k099j986j359k24R28J440J129O45Q01
60247C92483J453J621R02M2k50k11k40N5J087K161K128R55k48p00n78j92N52J583
60229D02603K250J996J174P46J238K161K552K020J154Q40J262J854K137K228K460
60214D28675K895L435M053M692N183N486N770O159O539O772O812O611O186N776
$$ y = [426103, 424685, 423425, 422633, 422552, 423314, 424856, 427061, 430152, 434615, 440581, 447732, 456134, 466719, 480609, 498222, 519108, 541938, 564377, 583715, 598319, 608022, 612682, 611167, 602551, 587793, 569325, 549341, 529228, 510209, 493452, 479496, 468325, 459968, 454356, 450741, 448021, 445601, 443376, 441029, 438168, 435115, 432716, 431230, 430080, 428746, 427196, 425360, 422997, 420344, 418182, 416851, 415700, 413849, 411089, 407757, 404214, 400762, 397750, 395317, 393208, 391109, 389123, 387764, 387540, 388468, 389908, 391037, 391682, 392483, 393936, 395557, 396459, 396501, 396251, 396040, 395800, 395855, 396942, 399103, 401231, 402186, 401938, 401238, 400660, 400468, 401020, 402603, 404853, 406849, 408023, 408769, 410007, 412168, 414720, 416740, 417894, 418734, 419996, 421850, 423987, 426215, 428675, 431570, 435005, 439058, 443750, 448933, 454419, 460189, 466348, 472887, 479659, 486471, 493082, 499268, 505044]
60200E05044N661N819O098O539P047O956N656L629K113J594J460J190R83R36N91
60185E61316k17r08j154j553k691m170n219n722n997o043n673n006m264l407k446
60170E06846j751j610j798j951j993j899j554j137j141j678k319k785l129l070
60156D79031k088n43L69L18M23J418K385K254J525J361J771J941J694J443J185
60141D94487O96L54O96J560K557L778N066N418M372L362M083N988O970O262M962
60126E50611L811K278J75j456j742j032l7R95J805J909J433J274J850K476K436
60111E66786J935J523J288J077R53R40Q01L97j51q28j767k809l548l917m162m237
60095E54281l834l079k525k310k034j549j197j128j030p14k48N51J986L620M406
$$ y = [505044, 510705, 516524, 522622, 529161, 536208, 543164, 548820, 552449, 554562, 556156, 557616, 558806, 559789, 560725, 561316, 561099, 560191, 559037, 557484, 554793, 550623, 545404, 539682, 533685, 527642, 521969, 516963, 512699, 509292, 506846, 505095, 503485, 501687, 499736, 497743, 495844, 494290, 493153, 492012, 490334, 488015, 485230, 482101, 479031, 476943, 476400, 476769, 477087, 477510, 478928, 481313, 483567, 485092, 486453, 488224, 490165, 491859, 493302, 494487, 495183, 495537, 496233, 497793, 500350, 504128, 509194, 514612, 518984, 522346, 526429, 532417, 539387, 545649, 550611, 554422, 556700, 556875, 555419, 553677, 552645, 552608, 553603, 555408, 557317, 558750, 560024, 561874, 564350, 566786, 568721, 570244, 571532, 572609, 573562, 574502, 575303, 575700, 575549, 574721, 572954, 570145, 566597, 562680, 558518, 554281, 550447, 547368, 544843, 542533, 540499, 538950, 537753, 536625, 535595, 534881, 534633, 535184, 537170, 540790, 545196]
60080E45196L916K846J992J444R80N00j92j343k671l503l822m446n826p350q210
60065E19511q325p987p307o493o067o195o256n598m407l415l072l250l469l137
60051D44533k006n96K15K44J40L98Q65J411K348L669M605M555M032M049M801N552
60035D78815N583M860L850L079K748K593K148J228l0j486l007m231m818n014n381
60020D80937n958o272o263o464p007p158o324m871l593k827k493k501k637k609
60006D13960k553l017l952m360l476j859p01m59p14j008j125q53j28O56J088J348
59990C92847J842K417K572K378K544L356M130M001L055K281K424L131L310K359
59976D32647P30p58j865k779l348l138k310j708j767j956j619r29m84m01k73J68
$$ y = [545196, 549112, 551958, 553950, 555394, 556374, 556874, 556682, 555339, 552668, 549165, 545343, 540897, 535071, 527721, 519511, 511186, 503199, 495892, 489399, 483332, 477137, 470881, 465283, 460876, 457461, 454389, 451139, 447670, 444533, 442527, 441931, 442146, 442390, 442530, 442928, 443793, 445204, 447552, 451221, 455826, 460381, 464413, 468462, 473263, 478815, 484398, 489258, 493108, 496187, 498935, 501528, 503676, 504904, 504874, 503388, 500381, 496150, 491332, 486318, 480937, 474979, 468707, 462444, 455980, 448973, 441815, 435491, 430620, 427027, 424200, 421707, 419206, 416569, 413960, 411407, 408390, 404438, 400078, 396602, 394743, 394042, 393583, 392869, 391861, 390736, 389883, 389755, 390411, 391499, 392847, 394689, 397106, 399678, 402056, 404600, 407956, 412086, 416087, 419142, 421423, 423847, 426978, 430288, 432647, 433377, 432619, 430754, 427975, 424627, 421489, 419179, 417471, 415704, 413748, 412129, 411200, 410716, 410315, 410042, 410210]
59960D10210Q39J537K018K034J619J227J227J485J630J561J360R89M80K02N30
59945D28948J218J568J250O67M20N94P70O20L40L98Q28J040M68o79j599j766j353
59928D33732q15m16k11j58j33L0L80R20J719K694L416L503L206L185L696M378
59912D59126M846N088N215N230N084M634L592J957M18k43j77l21j144k128k606
59897D88571k476j950j213n89m50o07l70N41J628K408L026L746M450M933N253
59882E06901N467N498N459N611N753N355M488L892L765L330K084O54k76j066k364
59867E54551l873m834n176n276m969l879k507j922k274k562j957o58P11J805K482
59852E19662K697K838L669N528P812R441R663Q384N965K999J36k027k969k435
$$ y = [410210, 411049, 412586, 414604, 416638, 418257, 419484, 420711, 422196, 423826, 425387, 426747, 427736, 428216, 428418, 428948, 430166, 431734, 432984, 433651, 434071, 434665, 435435, 436055, 436395, 436793, 437621, 438661, 439129, 438450, 436851, 435085, 433732, 432917, 432501, 432290, 432132, 431999, 432029, 432409, 433329, 435048, 437742, 441158, 444661, 447867, 451052, 454748, 459126, 463972, 469060, 474275, 479505, 484589, 489223, 492815, 494772, 495190, 494947, 494770, 494449, 493305, 491177, 488571, 486095, 484145, 482932, 482343, 481893, 481286, 480916, 481457, 483085, 485493, 488519, 492265, 496715, 501648, 506901, 512368, 517866, 523325, 528936, 534689, 540044, 544532, 548424, 552189, 555519, 557603, 558257, 557981, 556915, 554551, 550678, 545844, 540668, 535392, 530423, 526544, 524037, 522115, 519841, 517279, 515322, 514664, 515375, 517180, 519662, 522359, 525197, 528866, 534394, 542206, 551647, 561310, 569694, 575659, 578658, 578794, 576767, 573798, 571363]
59838E71363p66R85J597N08j812m275o001o862p257p336o784n480m044l158k621
59823E18057j781q27p60j918l392m270m622m825m666l845k740j934j337n19M21
59808D81042R42P95J04j037k414l373l266k243j158p71j246k221k997k960k188
59793D57009j423j184j230j185j109j067o80K29J004R37K85j04L5L64O58Q23M74
59776D53836n60j545j508o44j24m35q24n41J39N60O26O44P66R79J277J468J138
59759D55252K30n73m44O69J984K734K845K727K698K816L192M026N075N515M852
59744D93598L798L591M424N262N321M939M656M339L786L448L668L747K735R22
59730E48234l88n11J2L45K10k44p10q15m03J30K69P8K8J36q5q45j634j807j243
$$ y = [571363, 570597, 571582, 573179, 573687, 571875, 567600, 561599, 554737, 547480, 540144, 533360, 527880, 523836, 520678, 518057, 516276, 515449, 514689, 512771, 509379, 505109, 500487, 495662, 490996, 487151, 484411, 482477, 481140, 480621, 481042, 481984, 482779, 482883, 481846, 479432, 476059, 472793, 470550, 469392, 468621, 467375, 465154, 462157, 459197, 457009, 455586, 454402, 453172, 451987, 450878, 449811, 449131, 449360, 450364, 451301, 451586, 451482, 451517, 451881, 452539, 453362, 453836, 453276, 451731, 450223, 449579, 449455, 449020, 448196, 447655, 447794, 448354, 448980, 449624, 450390, 451369, 452646, 454114, 455252, 455482, 454909, 454465, 455134, 457118, 459852, 462697, 465424, 468122, 470938, 474130, 478156, 483231, 488746, 493598, 497396, 500987, 505411, 510673, 515994, 520933, 525589, 529928, 533714, 537162, 540830, 544577, 547312, 548234, 547846, 547335, 547347, 547692, 547902, 547658, 546948, 546133, 545730, 545860, 546129, 546207, 546235, 546371, 546286, 545441, 543807, 542000, 540757]
59711E40757l50L26M91K98J43J52Q0j57k75j76k22n24m24O51K199L150L175K836
59693E52130K689K906L447L959L607J893m40k069k626k827l097k931j949p46l33
59678E53613j065k456l668m097l811l553l997m995n864o208o070n487m545l730
59664D94067l517l554k996j807r53j039j446j266n23R2L83Q80J979L282M001L865
59648D91448L355L054K849K185R50k74j030j506k001k374k467k526k728k735k316
59633D83884j928j959j947j362p61j019j752j736q94n32j328k306k395j960j988
59618D60017k498k702k370k236l043m639o038o171m756k568p55J72N24Q05J228
59603D24970J833K553L064K940K219J426R78Q19P19O17N66N71N80M90K41O2L89
$$ y = [540757, 540407, 540733, 541224, 541522, 541665, 541817, 541897, 541740, 541465, 541289, 541067, 540543, 540119, 540770, 542969, 546119, 549294, 552130, 554819, 557725, 561172, 565131, 568738, 570631, 570191, 568122, 565496, 562669, 559572, 556641, 554692, 553946, 553613, 552548, 550092, 546424, 542327, 538516, 534963, 530966, 525971, 520107, 513899, 507829, 502342, 497797, 494067, 490550, 486996, 484000, 482193, 481240, 480201, 478755, 477489, 476966, 477058, 477441, 478321, 480300, 483582, 487583, 491448, 494803, 497857, 500706, 502891, 503841, 503567, 502537, 501031, 499030, 496656, 494189, 491663, 488935, 486200, 483884, 481956, 479997, 478050, 476688, 475927, 474908, 473156, 471420, 470526, 469994, 468666, 466360, 463965, 462005, 460017, 457519, 454817, 452447, 450211, 447168, 442529, 436491, 430320, 425564, 422996, 422241, 422413, 422937, 423742, 424970, 426803, 429356, 432420, 435360, 437579, 439005, 439983, 440802, 441521, 442138, 442704, 443275, 443855, 444345, 444586, 444648, 445037]
59586D45037J245J921J667N54p12j636k150k324k385k708l302l495k854k015j886
59571D24957k256k103j183k95O6K41M49K76m59j128j191r62j021j293j221n31
59555D12346N18J409J679J230N28K57P24J676K626L123L046K920L619N314P072
59540D48087Q088Q776J0017J1970J4518J8059K2173K3981J9974J0145j155r227
59528E85406j2794j3317j2253j0115p303m342j496J021K717L289L161K946K710
59515E39630K096R38o53k464m100n086n366n475n959o831p660p910p312o240n570
59500D72038n633n630m734l430k778k672k084r09k09m49r26j169j512j821j158
59485D36924N43J891J989J701K055K712L117L893N630P303P470O425N723N963
$$ y = [445037, 446282, 448203, 449870, 450424, 449712, 448076, 445926, 443602, 441217, 438509, 435207, 431712, 428858, 426843, 424957, 422701, 420598, 419415, 419120, 419186, 419427, 419876, 420152, 419693, 418565, 417374, 416412, 415391, 414098, 412877, 412346, 412864, 414273, 415952, 417182, 417710, 417967, 418691, 420367, 422993, 426116, 429162, 432082, 435701, 441015, 448087, 456175, 464951, 474968, 486938, 501456, 519515, 541688, 565669, 585643, 595788, 594633, 585406, 572612, 559295, 547042, 536927, 529624, 525282, 523786, 524807, 527524, 530813, 533974, 536920, 539630, 541726, 542664, 542011, 539547, 535447, 530361, 524995, 519520, 513561, 506730, 499070, 491160, 483848, 477608, 472038, 466405, 460775, 456041, 452611, 449833, 447161, 445077, 444168, 443959, 443510, 442584, 441415, 439903, 438082, 436924, 437467, 439358, 441347, 443048, 445103, 447815, 450932, 454825, 460455, 467758, 475228, 481653, 487376, 493339]
59471D93339O378O287N665M461K607P02l97p49j161j838k012j066O81K394L512
59456E18803M039M520N596P219Q521Q789Q353Q123Q545R335R919R761Q639O894
59442F27056N066L051K65l181o220q123r209r815r512q101o479n676n701o079
59428E57342o728p382p062n221k769r35L93K102M304O419Q313J0198J1991J3682
59414E84647J5835J8653K1494K4351K8509L3704L5674K9334J4737k194j5146k1860
59402G67738k3229k0678j5663r687l157M570J2569J6923J3662K885j0938k2490
59390G12505k8839l0044k8033k4955k1837j8477j4651j0995q324o612n176l615
59378E10947k055o93M13J201J676K054K631L439M171M346L693K555J848K185L131
$$ y = [493339, 499717, 506004, 511669, 516130, 518737, 519439, 519042, 518293, 517132, 515294, 513282, 512216, 512897, 515291, 518803, 522842, 527362, 532958, 540177, 548698, 557487, 565840, 573963, 582508, 591843, 601762, 611523, 620162, 627056, 632122, 635173, 635438, 632257, 626037, 617914, 608705, 598890, 589378, 581277, 574798, 569122, 563421, 557342, 550614, 543232, 536170, 530949, 528180, 527245, 527638, 529740, 534044, 540463, 548776, 558974, 570965, 584647, 600482, 619135, 640629, 664980, 693489, 727193, 762867, 792201, 806938, 804744, 789598, 767738, 744509, 723831, 708168, 698481, 695324, 699894, 712463, 729386, 743048, 745933, 734995, 712505, 683666, 653622, 625589, 600634, 578797, 560320, 545669, 534674, 526350, 519738, 514562, 510947, 508892, 508199, 508612, 509813, 511489, 513543, 516174, 519613, 523784, 528130, 531823, 534378, 536226, 538411, 541542]
59363E41542L710L688L748M359N035N122M825M959N903P203Q231Q909R668J0744
59349F27646J1694J1915J1605J1755J2856J4119J4447J3861J3310J3266J3189
59338G69663J2344J0560Q141N536L114Q29j761m725p275q658r323j0353j1889
59325G56203j3069j3517j3849j4338j4195j2775j0712r137q309p732p129o615
59313F24826o066n083l565j822j57J305K431L094L526M358O204R228J3097J7079
59299F68455K0059K0506J7002R334p47j0200j6560j9259j9264j7869j6010j4221
59287F21226j2609j0901q890o810n037l637k504j715j370j249r89m73L11J463
59273E66816K864L980M514N026O233P991R413R945R739R183Q628Q349Q103O954
$$ y = [541542, 545252, 548940, 552688, 557047, 562082, 567204, 572029, 576988, 582891, 590094, 598325, 607234, 616902, 627646, 639340, 651255, 662860, 674615, 687471, 701590, 716037, 729898, 743208, 756474, 769663, 782007, 792567, 800708, 806244, 809358, 810187, 808426, 803701, 796426, 787768, 778445, 768092, 756203, 743134, 729617, 715768, 701430, 687235, 674460, 663748, 654611, 646302, 638570, 631441, 624826, 618760, 613677, 610112, 608290, 608133, 609438, 611869, 614963, 618489, 622847, 629051, 638279, 651376, 668455, 688514, 709020, 726022, 735356, 734609, 724409, 707849, 688590, 669326, 651457, 635447, 621226, 608617, 597716, 588826, 582016, 576979, 573342, 570838, 569123, 567753, 566504, 565515, 565042, 565353, 566816, 569680, 573660, 578174, 583200, 589433, 597424, 606837, 616782, 626521, 635704, 644332, 652681, 660784, 667738]
59259F67738M233O34k411m314n588o660p359p683q127q883r372q892p380n403
59245E90533l809l274l602l578k248k43R27Q84O93J135J745J916J919K239K728
59230E87965L021L106K957K211Q88k26m88l28o32j674l116m617n808o101n253
59215E71905l914l058k914k899k424j328J73J534J985J162l33j352j241l27N52
59200E57521P87L86j34k49K4K04J8k48j42L85R85J313J210P50K47O9K61N01N61
59181E64449N74P43R91J093J027R75J020J107J226J564K255L054L462L338L298
59166E90176M089N592O876P387P470P515P226O362N559N584O063N919M850L468
59152F74136K075K97j900l824n031n847o506o586n825m893m646n046n396n379
$$ y = [667738, 671971, 672605, 670194, 665880, 660292, 653632, 646273, 638590, 630463, 621580, 612208, 603316, 595936, 590533, 586724, 583450, 579848, 576270, 574022, 573779, 574706, 575590, 576283, 577418, 579163, 581079, 582998, 585237, 587965, 590986, 594092, 597049, 599260, 600148, 599922, 599434, 599106, 598474, 596800, 593684, 589067, 583259, 577158, 571905, 567991, 564933, 562019, 559120, 556696, 555368, 555541, 557075, 559060, 560222, 559889, 558537, 557296, 556969, 557521, 558308, 558694, 558560, 558311, 558335, 558539, 558557, 558309, 558167, 558552, 559537, 560850, 562060, 562810, 563057, 563126, 563387, 563888, 564449, 565023, 565766, 566757, 567850, 568877, 569852, 570872, 571979, 573205, 574769, 577024, 580078, 583540, 586878, 590176, 594265, 599857, 606733, 614120, 621590, 629105, 636331, 642693, 648252, 653836, 659899, 665818, 670668, 674136, 676211, 676508, 674608, 670784, 665753, 659906, 653400, 646814, 640989, 636096, 631450, 626404, 621008, 615629]
59138F15629n329n605o194o890p520p920p863p202o057m896m138l677l012k092
59124E37234j530j606j515k88J795L560M470M971N386N463N236N385O264P328
59110E82153P965Q280Q649Q958Q736P715O015M254L485M323N871O274M775K559
59096F70012J097L92m69j669k570k881l030l272l173k216n87Q71J331O11p64k129
59080F51554l300m484n708o649p148p489p958q398q413p825o830n867n405n549
59066E60531n806n534m705l943l679l670l424k830k181j873k159k950l741l972
59052E10064l521k649j571m35L78M78K8l05j76R2N0l03o57p90o89m99l33j10L99
59033D99451J157J765J997K163K606L181L667M250N085N762N933O141P155Q731
$$ y = [615629, 610300, 604695, 598501, 591611, 584091, 576171, 568308, 561106, 555049, 550153, 546015, 542338, 539326, 537234, 535704, 534098, 532583, 532295, 534090, 537650, 542120, 547091, 552477, 557940, 563176, 568561, 574825, 582153, 590118, 598398, 607047, 616005, 624741, 632456, 638471, 642725, 646210, 650533, 656404, 662678, 667453, 670012, 671109, 671501, 671032, 669363, 666793, 663912, 660882, 657610, 654437, 652221, 651634, 652505, 653836, 654447, 653683, 651554, 648254, 643770, 638062, 631413, 624265, 616776, 608818, 600420, 592007, 584182, 577352, 571485, 566080, 560531, 554725, 549191, 544486, 540543, 536864, 533194, 529770, 526940, 524759, 522886, 520727, 517777, 514036, 510064, 506543, 503894, 502323, 501888, 502266, 502744, 502772, 502467, 502291, 502383, 502433, 502130, 501473, 500683, 499994, 499495, 499162, 499052, 499451, 500608, 502373, 504370, 506533, 509139, 512320, 515987, 520237, 525322, 531084, 537017, 543158, 550313, 559044]
59019E59044R857J0149J0213J0589J1143J1421J0972R332O520L450J180j95j249
59006F52426k067k306k148k160k241j735n99N85J677L043M454N131M949M548M132
58991F67689L305K173J438J191Q09J80k00n67j843l890n251n177m548m208l671
58976F47430k285m39J272L017N040O921Q246R287J0373J1399J2346J3318J3730
58963G39655J2691J0648R384R713J0381R957Q536O836M945K778O33j601m570p992
58949H11994j0461j1504j2416j4032j5264j5079j4350j4217j3996j2483j0146
58938F68046q283o924n379m031l762m194m176l550k957k377j461p57j011j670
58924F17514j565p45k02j61j49k89j067j985j986j059j10N18J083J354Q73J54
$$ y = [559044, 568901, 579050, 589263, 599852, 610995, 622416, 633388, 642720, 649240, 652690, 653870, 653675, 652426, 650359, 648053, 645905, 643745, 641504, 639769, 639170, 639755, 641432, 644475, 648929, 654060, 659009, 663557, 667689, 670994, 673167, 674605, 675796, 676605, 676785, 676585, 676018, 674175, 670285, 665034, 659857, 655309, 651101, 647430, 645145, 644706, 645978, 648995, 654035, 660956, 669202, 678489, 688862, 700261, 712607, 725925, 739655, 752346, 762994, 772378, 782091, 792472, 802429, 810965, 817801, 822746, 825524, 826157, 824556, 819986, 811994, 801533, 790029, 777613, 763581, 748317, 733238, 718888, 704671, 690675, 678192, 668046, 659763, 652839, 647460, 643429, 639667, 635473, 631297, 627747, 624790, 622413, 620952, 620195, 619184, 617514, 615949, 615204, 615002, 614841, 614692, 614403, 613336, 611351, 609365, 608306, 608196, 608714, 609797, 611151, 612024, 612178]
58908F12178J76Q87J488K046L382N553P728R500J1030J2097J2332J2213J2459
58895G03069J2591J1518R466P899P496P646P961Q845J0404J2093J3731J5611J7384
58882H45714J8037J7210J5529J3456J0878P929N155K691J60k547n297q293j1591
58869I09031j4242j5174j4786j4435j4393j3747j2286j0992j0405r921r091q317
58857G61242p900p508p038o933p284p550p537p668q056q183p766p130o549o019
58843F58121n702n705n585n011m712n547o778o760n425m501m977n818n725m847
58829E81028m032l513l092k765k489k007j274n39K03J162K099K572K801L389M221
58814E77764M628M588M690M952M840M465M417M460L771K577J998K066J500j17
$$ y = [612178, 612354, 613241, 614729, 616775, 620157, 625710, 633438, 642938, 653968, 666065, 678397, 690610, 703069, 715660, 727178, 736644, 744543, 752039, 759685, 767646, 776491, 786895, 798988, 812719, 828330, 845714, 863751, 880961, 896490, 909946, 920824, 928753, 933908, 936599, 936759, 934212, 928915, 920622, 909031, 894789, 879615, 864829, 850394, 836001, 822254, 809968, 798976, 788571, 778650, 769559, 761242, 753342, 745834, 738796, 731863, 724579, 717029, 709492, 701824, 693768, 685585, 677819, 670689, 664140, 658121, 652419, 646714, 641129, 636118, 631406, 625859, 619081, 612321, 606896, 602395, 597418, 591600, 585875, 581028, 576996, 573483, 570391, 567626, 565137, 563130, 561856, 561317, 561520, 562682, 564781, 567353, 570154, 573543, 577764, 582392, 586980, 591670, 596622, 601462, 605927, 610344, 614804, 618575, 621152, 623150, 625216, 626716, 626599]
58800F26599j590k143k555l532m439m652m754n391o052o072n834n954o144n880
58786E61607n355m880m056k541r05J64R62K133L523M513N033N433N641N179L897
58771E80348K122K45j503l000m198m949m969m333l816m075m653m621m030l774
58757E34794l998l878l075k222j676r70O3P55P80Q06J339J894J918J683J655J779
58741E31647J962K502L389L974L919L775M061M433M372M056L987M203M337M082
58727E84699L365K495K205K895L804L719K557J378Q01M18l0m7P02J864L151M671
58711F18647O185O996O935O601O237N375L772J811k57k427m117m552m305n163
58697F41738p844j0958j2810j3184j2782j2030j1106j0279r493q299o640n059
$$ y = [626599, 625009, 622866, 620311, 616779, 612340, 607688, 602934, 597543, 591491, 585419, 579585, 573631, 567487, 561607, 556252, 551372, 547316, 544775, 543870, 544034, 544996, 547129, 550652, 555165, 560198, 565631, 571272, 576451, 580348, 582470, 582715, 581212, 578212, 574014, 569065, 564096, 559763, 555947, 551872, 547219, 542598, 538568, 534794, 530796, 526918, 523843, 521621, 519945, 518975, 519038, 519793, 520573, 521379, 522718, 524612, 526530, 528213, 529868, 531647, 533609, 536111, 539500, 543474, 547393, 551168, 555229, 559662, 564034, 568090, 572077, 576280, 580617, 584699, 588064, 590559, 592764, 595659, 599463, 603182, 605739, 607117, 607918, 608336, 608306, 608259, 608961, 610825, 613976, 618647, 624832, 631828, 638763, 645364, 651601, 656976, 660748, 662559, 662302, 659875, 655758, 651206, 646901, 641738, 633894, 622936, 610126, 596942, 584160, 572130, 561024, 550745, 541252, 532953, 526313, 521254]
58685E21254l989l526l857m872n555m964l772l366l566k928j370m59p88j074n01
58670D76667Q6J62O51K077L441M042M728O139P408P829Q099Q595Q117N805K830
58655E46676O10j148l121m545m447l563l291l728m200m671n167m907l552k248
58641D98698j966j907j086k60m94r78k56J236J923J676J678K217K545K539K658
58626E08223K533J382k71j006n86j38l27o83p27m22M57K123L973N072N419N786
58610E30808O396O751O534N813M580L009J849J635J811J503Q09L98K20l91j509
58595E70216k430k608k142j444r61q62p62j36R01J838K826M397O059O637O311
58580E87840O697Q219R174Q355O885O251O260O185O360P051P331O707O438P552
$$ y = [521254, 517265, 513739, 509882, 505010, 499455, 494491, 490719, 487353, 483787, 480859, 479489, 479030, 478242, 477168, 476667, 476753, 476915, 477566, 479643, 483084, 487126, 491854, 497993, 505401, 513230, 521329, 529924, 538041, 543846, 546676, 547286, 546138, 543017, 538472, 534025, 530462, 527171, 523443, 519243, 514572, 509405, 504498, 500946, 498698, 496732, 494825, 493739, 493479, 492985, 492007, 491751, 492987, 494910, 496586, 498264, 500481, 503026, 505565, 508223, 510756, 512138, 511867, 510861, 510275, 510137, 509810, 509127, 508400, 507978, 508435, 510558, 514531, 519603, 525022, 530808, 537204, 543955, 550489, 556302, 560882, 563891, 565740, 567375, 569186, 570689, 571498, 571896, 572116, 571725, 570216, 567786, 565178, 563036, 561592, 560631, 559769, 559007, 558871, 559772, 561610, 564436, 568833, 574892, 581529, 587840, 594537, 602756, 611930, 620285, 627170, 633421, 639681, 645866, 652226, 659277, 666608, 673315, 679753, 687305]
58566F87305Q949R286R358J0683J2970J5009J6895J9258K1387K2222K2291K2510
58554H78123K2024J9423J5274J1212P345K923j219l415l967m623n590n505m266
58541I27739l495m032n210o759r274j2503j5160j6823j8231j9478j9633j8408
58529G78733j6655j4968j3169j1281r626p896n585l240j916j488r17QO21P89R12
58514F94322P61j73j409k027k121k319k337j572o67p28j452j780j871k605l512
58499F70510l268j985j046q41n89j85k76o36l82L16O00P60J791L298L942L814
58483F75823M279N552O517O975P928R556J0936J1949J3417J5171J5952J5408J4291
58470H13754J2593R508N376J680j149l955o736q291q277p666o893n415l308j469
$$ y = [687305, 696254, 705540, 714898, 725581, 738551, 753560, 770455, 789713, 811100, 833322, 855613, 878123, 900147, 919570, 934844, 946056, 953401, 956324, 955105, 951690, 947723, 943100, 937510, 932005, 927739, 924244, 920212, 915002, 908243, 898969, 886466, 871306, 854483, 836252, 816774, 797141, 778733, 762078, 747110, 733941, 722660, 713034, 705138, 699553, 696313, 694397, 692909, 691992, 692000, 692621, 693410, 694322, 695083, 694910, 693501, 691474, 689353, 687034, 684697, 683125, 682458, 681730, 680278, 678498, 676627, 674022, 670510, 667242, 665257, 664211, 663370, 662781, 662596, 662320, 661684, 661302, 661618, 662218, 662978, 664769, 668067, 672009, 675823, 680102, 685654, 692171, 699146, 707074, 716630, 727566, 739515, 752932, 768103, 784055, 799463, 813754, 826347, 835855, 841231, 842911, 841762, 837807, 831071, 822780, 814503, 806837, 799944, 794529, 791221, 789752]
58456G89752L7K018M355O027P096Q711J0895J2227J2012J0935R320O586K708j407
58442H81272n240q735j1148j1598j0716r946r322p766n409l502k188m35J768L295
58428H00330M011M900O106O861P339Q487J0102J1106J1511J1943J1660R439O080
58415I09875L456J430j487m757o212n802n820p056p882p487o991o815n912m201
58401H44339k993k415j219L92P02j86rK009M057M987N701O560O383M985L890L701
58385H80884L353K660K738L347K851J421J198K518L247K594K328L243L763L183
58371I19328L026M045M976N432O805R150J0457J0225J0481J2059J3178J2953J2913
58358A035028J3715J3773J2610J2108J2919J3017J1300R282P843N840L401K741
$$ y = [789752, 789789, 791807, 796162, 802189, 809285, 817996, 828891, 841118, 853130, 864065, 873385, 879971, 882679, 881272, 876032, 867297, 856149, 844551, 833835, 823889, 814567, 806801, 801392, 797890, 795702, 795267, 797035, 800330, 804341, 809241, 815347, 822208, 829547, 838034, 848136, 859242, 870753, 882696, 894356, 903795, 909875, 913331, 914761, 913274, 908517, 902305, 896503, 890683, 883627, 875745, 868258, 861267, 854452, 848540, 844339, 841346, 838931, 837712, 838104, 838806, 838620, 838611, 840620, 844677, 849664, 855365, 861925, 868308, 873293, 877183, 880884, 884237, 886897, 889635, 892982, 895833, 897254, 898452, 900970, 904217, 906811, 909139, 912382, 916145, 919328, 922354, 926399, 931375, 936807, 943612, 952762, 963219, 973444, 983925, 995984, 1009162, 1022115, 1035028, 1048743, 1062516, 1075126, 1087234, 1100153, 1113170, 1124470, 1133752, 1141595, 1147435, 1150836, 1153577]
58346A153577M113M773L763L800O409R119R829J0071J1457J2606J2308J2268J3943
58333A268036J5752J5997J5643J5842J5759J5061J5392J7160J7999J6589J4775
58322A444005J3937J2698J0249Q349P939P364O070O158Q144R271Q334Q063J0211
58309A560792J2586J3489J4713J7254J8649J7641J7090J8958K0772K0348J9652
58298A751944K0610K1503K1011K1377K3871K5667K4959K4611K6865K9063K8699
58287B020180K8064K9614L1332L1122L1202L3553L5566L4897L4160L6090L8493
58276B384273L8799L9051M1531M4040M4414M5086M8168N0873N0921N1474N5383
58265B894013N9602O0869O1779O5505O9720P1682P4017P9320Q4300Q5664Q6386
$$ y = [1153577, 1157690, 1162463, 1166226, 1170026, 1176435, 1185554, 1195383, 1205454, 1216911, 1229517, 1241825, 1254093, 1268036, 1283788, 1299785, 1315428, 1331270, 1347029, 1362090, 1377482, 1394642, 1412641, 1429230, 1444005, 1457942, 1470640, 1480889, 1489238, 1497177, 1504541, 1510611, 1516769, 1524913, 1534184, 1542518, 1550581, 1560792, 1573378, 1586867, 1601580, 1618834, 1637483, 1655124, 1672214, 1691172, 1711944, 1732292, 1751944, 1772554, 1794057, 1815068, 1836445, 1860316, 1885983, 1910942, 1935553, 1962418, 1991481, 2020180, 2048244, 2077858, 2109190, 2140312, 2171514, 2205067, 2240633, 2275530, 2309690, 2345780, 2384273, 2423072, 2462123, 2503654, 2547694, 2592108, 2637194, 2685362, 2736235, 2787156, 2838630, 2894013, 2953615, 3014484, 3076263, 3141768, 3211488, 3283170, 3357187, 3436507, 3520807, 3606471, 3692857]
58254C692857Q9759R2847R2496R2014R4923R8088R8304R9517J05864J13721J18653
58243D789043J23821J33185J43005J48929J54871J65651J77474J85374J93192
58234F214545K06105K20290K30528K40921K57111K75168K89817L05928L29650
58225H570063L55927L77879M00644M32268M68991N03944N41995N90613O44670
58216A2886994O96676P53268Q24434R05692R89259J083024J198888J332809J477732
58207B2148776J645015J849722K086739K347748K650246L022487L473880M012129
58199D3236742M675251N511410O543292P792376R318930J1189623J3427967J6056923
58191A17752514J9165945K2855359K7120923L1834780L6688855M0842853M2554079
$$ y = [3692857, 3782616, 3875463, 3967959, 4059973, 4154896, 4252984, 4351288, 4450805, 4556669, 4670390, 4789043, 4912864, 5046049, 5189054, 5337983, 5492854, 5658505, 5835979, 6021353, 6214545, 6420650, 6640940, 6871468, 7112389, 7369500, 7644668, 7934485, 8240413, 8570063, 8925990, 9303869, 9704513, 10136781, 10605772, 11109716, 11651711, 12242324, 12886994, 13583670, 14336938, 15161372, 16067064, 17056323, 18139347, 19338235, 20671044, 22148776, 23793791, 25643513, 27730252, 30078000, 32728246, 35750733, 39224613, 43236742, 47911993, 53423403, 59966695, 67759071, 77078001, 88267624, 101695591, 117752514, 136918459, 159773818, 186894741, 218729521, 255418376, 296261229, 338815308]
58184C38815308L9568959L0483135J6047935q62219j6680491k8761738l6075313
58177C42535576l8940149l8409901l5733823l1986503k7899415k3901321k0239723
58170A25424741j7039802j4316174j2021395j0108930q539136p253098o184367
58163D9961839n291886m554258l941664l420752k978178k612651k309609k046664
58155B2806177j817265j626394j467757j325821j195874j082766r83559q89420
58147A2417321q01213p26284o62568o01304n42538m93314m53381m16640l83861
58138G336218l60345l43420l25117l04918k87862k72672k53831k32999k16612
58129D738442k04183j90197j75404j65145j58401j49363j38257j30187j24786
$$ y = [338815308, 378384267, 408867402, 424915337, 424053118, 407372627, 378610889, 342535576, 303595427, 265185526, 229451703, 197465200, 169565785, 145664464, 125424741, 108384939, 94068765, 82047370, 71938440, 63399304, 56146206, 49961839, 44669953, 40115695, 36174031, 32753279, 29775101, 27162450, 24852841, 22806177, 20988912, 19362518, 17894761, 16568940, 15373066, 14290300, 13306741, 12417321, 11616108, 10889824, 10227256, 9625952, 9083414, 8590100, 8136719, 7720079, 7336218, 6975873, 6632453, 6307336, 6002418, 5714556, 5441884, 5188053, 4955054, 4738442, 4534259, 4344062, 4168658, 4003513, 3845112, 3695749, 3557492, 3427305, 3302519]
58120C302519j17301j08444j03123j00510r5293q7725q2821q0480p5989o9623
58110B381210o6334o6096o3710n8340n4612n3912n2791n0307m9134m9064m6915
58099A769995m3283m2142m3506m3420m1269m0154m0021l7600l3306l1182l1497
58088A342615l0244k6553k3955k3604k2762k0773k0325k1767k2141k0812k0450
58077A089229k1543k1449j9660j8735j9236j8930j7561j7359j8235j7627j5529
58066H83365j4665j5265j4795j3141j2821j3630j2473r139p010p277p637p421
58054G48091q695j1308j2138j0495r392j0069j0186q715p815q324q082o343n399
58041F31130o237o769o052o031p516q485p995p885q916r080p479o241o828p820
$$ y = [3302519, 3185218, 3076774, 2973651, 2873141, 2777848, 2690123, 2607302, 2526822, 2450833, 2381210, 2314876, 2248780, 2185070, 2126730, 2072118, 2018206, 1965415, 1915108, 1865974, 1816910, 1769995, 1726712, 1684570, 1641064, 1597644, 1556375, 1516221, 1476200, 1438600, 1405294, 1374112, 1342615, 1312371, 1285818, 1261863, 1238259, 1215497, 1194724, 1174399, 1152632, 1130491, 1109679, 1089229, 1067686, 1046237, 1026577, 1007842, 988606, 969676, 952115, 934756, 916521, 898894, 883365, 868700, 853435, 838640, 825499, 812678, 799048, 786575, 777436, 770426, 763149, 755512, 748091, 739396, 728088, 715950, 705455, 696063, 685994, 675808, 667093, 659278, 650954, 642872, 636529, 631130, 624893, 618124, 612072, 606041, 598525, 590040, 582045, 574160, 565244, 556164, 548685, 542444, 535616, 527796]
58027E27796p940q042q586q415p427p305q311q435o978n803n850n715m775m520
58013D29694n414n661m359k926k302j657q84j207k281j980p2J031K50o90p67j120
57997C99655j979j636Q2Q37k89j236q25p71k142l205k697k080k586l021k442k152
57981C73513l053l801l397k986l315l225k355k473m168n135l828k049j692j691
57967C30345m67J042J300Q49P61N43k22k57J130K216J489J88PK43n69j922k495
57950C34181k476k591k411j575j134j730k002p61Q45J326J396K466M093N066N745
57935C40438P205R095J0318J0849J1227J1168J0240Q902P573N767L371J433M33
57922D38019p40k810m711n491n983p072p995p936p628p800p718o887o439p015
$$ y = [527796, 519856, 511814, 503228, 494813, 487386, 480081, 471770, 463335, 456357, 450554, 444704, 438989, 434214, 429694, 424280, 418619, 414260, 411334, 409032, 407375, 406491, 405284, 403003, 401023, 400951, 401982, 402232, 401542, 400775, 399655, 397676, 396040, 396122, 396959, 396670, 395434, 394609, 393838, 391696, 388491, 385794, 383714, 381128, 378107, 375665, 373513, 370460, 366659, 363262, 360276, 356961, 353736, 351381, 348908, 344740, 339605, 335777, 333728, 332036, 330345, 329878, 330920, 332220, 333069, 333830, 334373, 334151, 333894, 335024, 337240, 338729, 338917, 338924, 339167, 338598, 336676, 334181, 331705, 329114, 326703, 325128, 323994, 322264, 320262, 319501, 320346, 321672, 323068, 325534, 329627, 334693, 340438, 347643, 356738, 367056, 377905, 389132, 400300, 410540, 419442, 427015, 432782, 436153, 437586, 438019, 437279, 434469, 429758, 424267, 418284, 411212, 403217, 395281, 387653, 379853, 372135, 365248, 358809, 351794]
57908C51794p056n224k882k035k364k441k422l234m313m539m353m705m937l878
57894B97411k180j372j370r76r9M91R28J771K533K468K169K525K990K645K124
57879C12058K473L020K454J260Q54R30qj888l053k886k409k326k337k373k748
57864C03021l168l084k856l026k898j531K33P30J82M43K008L291L217K602K442
57849C01606K478K170J757J631J585J302Q26K34n83j600k618l490l950l570k499
57834B95279j730j846k036j327k94k76j289j995j683j082j053j381j144K57K441
57819B80841M179M501L939L977M855M896K830k61k438l445m418n702o462o175
57805B81117n282m441l996l969l799k698r32j8o91j545r26O80J548J321J060J190
$$ y = [351794, 344738, 339514, 336632, 334597, 332233, 329792, 327370, 324136, 319823, 315284, 310931, 306226, 301289, 297411, 295231, 293859, 292489, 291513, 291414, 291905, 292833, 294604, 297137, 299605, 301774, 304299, 307289, 309934, 312058, 314531, 317551, 320005, 321265, 322119, 323049, 323041, 321153, 318100, 315214, 312805, 310479, 308142, 305769, 303021, 299853, 296769, 293913, 290887, 287989, 286458, 286691, 287421, 287603, 288046, 290054, 293345, 296562, 299164, 301606, 304084, 306254, 308011, 309642, 311227, 312529, 313355, 313589, 313006, 311406, 308788, 305298, 301348, 297778, 295279, 293549, 291703, 289667, 288340, 288046, 287770, 286481, 284486, 282803, 281721, 280668, 279287, 278143, 278400, 280841, 285020, 289521, 293460, 297437, 302292, 307188, 310018, 309757, 307319, 303874, 299456, 293754, 287292, 281117, 275835, 271394, 267398, 263429, 259630, 256932, 256000, 255982, 255291, 253746, 252820, 253500, 255048, 256369, 257429, 258619]
57789B58619J078N79L88P42J014P44J96k06j62N97J912K977L242L133L212L216
57773B81281K816K511K730K798K019J033P15N31m92j810k106j581j684k783l809
57758B82169m158m232m040k948j052O24J610K364L039L175K799K556K558K223
57744B86687J501J002Q35L88m53j108j421j894k554k714k103j314q36n96n54q39
57728B74027j183j117p59n23j95O11J294P81p31j840j904j637j567j236l67M12
57712B64066N65L69J84j61p84j398j894k548l265l403k686j609o47K97J390K457
57696B50933L291L786L720L004K114J559R59n50k955n247o574o774n858l985k019
57681B35404j045j047q97K23K114M362O910R608J2091J4471J7420K1353K6095
$$ y = [258619, 259697, 260276, 260664, 261406, 262420, 263164, 263360, 263154, 262992, 263589, 265501, 268478, 271720, 274853, 278065, 281281, 284097, 286608, 289338, 292136, 294155, 295188, 295903, 296434, 295942, 294132, 292026, 290445, 288761, 285978, 282169, 278011, 273779, 269739, 266791, 265739, 266363, 267973, 270337, 273376, 276551, 279350, 281906, 284464, 286687, 288188, 289190, 290025, 290413, 289960, 288852, 287431, 285537, 282983, 280269, 278166, 276852, 276016, 275420, 274866, 274027, 272844, 271727, 270968, 270445, 270250, 270861, 272155, 272936, 272205, 270365, 268461, 266824, 265257, 264021, 263654, 264066, 264631, 265000, 265184, 265023, 264239, 262841, 260947, 258399, 255134, 251731, 249045, 247436, 246789, 247086, 248476, 250933, 254224, 258010, 261730, 264734, 266848, 268407, 269366, 268816, 265861, 260614, 254040, 247266, 241408, 237423, 235404, 234359, 233312, 232415, 232638, 234752, 239114, 246024, 255632, 267723, 282194, 299614, 320967, 347062]
57668C47062L1564L8087M5616N2741N6448N2924L9676J8089o259k6882m0291m6633
57656E62142m7601m4947m0418l5388l0182k4730j9767j6310j4143j2087r744p776
57644B59049o504n482m489l689k783j290K67Q10M58L99R29J077N11J90O43J071
57628B41167Q27M50N03N68J84l60q55j714k952l649l219k291j575q38K28R94P30
57611B28198j87q14r15r61j228j579j811j784j428r62p55q58j005j115j295j380
57595B10121j126q54j084j625j820j704j966k728l318l324l001k525j892j443
57581A81711j483j427n72M29K36j032j895j844j854k278k138j153n70j071j558
57566A63501j071m29o48j195j053l81J94Q31J716K087J319J78k66j79k23j31P13
$$ y = [347062, 378626, 416713, 462329, 515070, 571518, 624442, 664118, 682207, 675948, 649066, 608775, 562142, 514541, 469594, 429176, 393788, 363606, 338876, 319109, 302799, 288656, 276569, 266825, 259049, 252545, 247063, 242574, 238885, 236102, 234812, 235079, 235889, 236347, 236746, 237675, 238752, 239263, 239453, 240096, 241167, 241994, 242444, 242947, 243515, 243699, 243339, 242484, 240770, 237818, 234169, 230950, 228659, 227084, 226246, 226474, 227468, 228198, 228011, 227197, 226282, 225321, 224093, 222514, 220703, 218919, 217491, 216529, 215774, 214916, 213911, 212796, 211501, 210121, 208995, 208141, 207057, 205432, 203612, 201908, 199942, 197214, 193896, 190572, 187571, 185046, 183154, 181711, 180228, 178801, 178229, 178658, 178894, 177862, 175967, 174123, 172269, 169991, 167853, 166700, 166130, 165059, 163501, 162430, 162001, 161353, 160158, 159105, 158724, 158918, 159749, 161465, 163552, 164871, 165049, 164783, 164604, 164381, 164250, 164963]
57549A64963J945K709K880K681J860L84p70p90l96p07j329r42O00K159L017L320
57533A81584K980J590l80j567j245j38N65L79l49r10p59J9P39R63R72J192J538
57516A87173J838K334L184L854L719K919K099J600J474J809K475K938K894K696
57502B23006K605K190J074k58j150j742k485l148l180k708k336k144j703q90l9
57487B07092N67Q13N75l8n36n56k61J05O00J116J155O00J51L48P21N50k6l77l73
57468B12226l59n20q82j473j944j575k84R69J355J153R27N88O6N2J013K089K079
57451B15480J131L99L90O59Q16Q98J014J330K122L083L206K179J239J608K644
57436B38198K787J870J126J242J730K133K574K972K836K110J354R85J023J432
$$ y = [164963, 166908, 169617, 172497, 175178, 177038, 177422, 176652, 175862, 175466, 174759, 173430, 172488, 173088, 175247, 178264, 181584, 184564, 186154, 185774, 184207, 182962, 182824, 183389, 183768, 183419, 182509, 181750, 181769, 182508, 183471, 184443, 185635, 187173, 189011, 191345, 194529, 198383, 202102, 205021, 207120, 208720, 210194, 212003, 214478, 217416, 220310, 223006, 225611, 227801, 228875, 228617, 227467, 225725, 223240, 220092, 216912, 214204, 211868, 209724, 208021, 207131, 207092, 207659, 208472, 209047, 209009, 208473, 207917, 207656, 207761, 208361, 209477, 210632, 211232, 211383, 211731, 212452, 213002, 212976, 212599, 212226, 211867, 211347, 210465, 208992, 207048, 205473, 205189, 206158, 207513, 208666, 209593, 210181, 210247, 210299, 211312, 213401, 215480, 216611, 217010, 217400, 218059, 218875, 219773, 220787, 222117, 224239, 227322, 230528, 232707, 233946, 235554, 238198, 240985, 242855, 243981, 245223, 246953, 249086, 251660, 254632, 257468, 259578, 260932, 261917, 262940, 264372]
57422B64372K026K231J742J210J383J851J647Q44M68Q79J391J551J773K478L409
57407B89255M054M142L642K848K382K529K759K507K050J937J963J664J389J780
57393C24901K480K539K020J969K701L330L222K859K955L552M343N095N541N453
57379C72960N044M684M279L525K675K341K550K731K601K394K323K459K939L562
57365D17067L508K335J006R01K015L187L876M575N471O017N973N771N591N133
57351D72426M485M234M491M721M771N109N869O548O928P276P445O801N414M403
57337E50921M599N587O453O766O544N932N288N000M989M917M885N254N766N776
57323F28677N409N593O690P905Q354P984P259O644O563P138P798P809P283P033
$$ y = [264372, 266398, 268629, 270371, 271581, 272964, 274815, 276462, 277306, 277774, 278653, 280044, 281595, 283368, 285846, 289255, 293309, 297451, 301093, 303941, 306323, 308852, 311611, 314118, 316168, 318105, 320068, 321732, 323121, 324901, 327381, 329920, 331940, 333909, 336610, 339940, 343162, 346021, 348976, 352528, 356871, 361966, 367507, 372960, 378004, 382688, 386967, 390492, 393167, 395508, 398058, 400789, 403390, 405784, 408107, 410566, 413505, 417067, 420575, 422910, 423916, 424817, 426832, 430019, 433895, 438470, 443941, 449958, 455931, 461702, 467293, 472426, 476911, 481145, 485636, 490357, 495128, 500237, 506106, 512654, 519582, 526858, 534303, 541104, 546518, 550921, 555520, 561107, 567560, 574326, 580870, 586802, 592090, 597090, 602079, 606996, 611881, 617135, 622901, 628677, 634086, 639679, 646369, 654274, 662628, 670612, 677871, 684515, 691078, 698216, 706014, 713823, 721106, 728139]
57309G28139P387P923Q298Q485Q297P628P140P614Q540Q529P376O535P095Q382
57295H37368R112R064Q975R427J0409J1511J2218J2324J2183J2209J2326J2424
57283I69550J2901J3913J4588J4077J3051J2877J3523J3723J3177J2953J3623
57272A117956J4482J4996J5453J5832J5463J4334J3377J2992J2663J2365J2864
57261A272777J4074J4742J4418J4167J4594J4755J4011J3348J3735J4542J4877
57250A430040J5191J6204J7338J7601J7157J6769J6517J6203J6240J6965J7765
57239A613990J7987J7993J8343J8738J8787J8969J9709K0349K0203J9858K0144
57228A825070K0605K0283J9454J9180J9580J9877J9796J9732J9772J9684J9651
$$ y = [728139, 735526, 743449, 751747, 760232, 768529, 776157, 783297, 790911, 799451, 807980, 815356, 821891, 828986, 837368, 846480, 855544, 864519, 873946, 884355, 895866, 908084, 920408, 932591, 944800, 957126, 969550, 982451, 996364, 1010952, 1025029, 1038080, 1050957, 1064480, 1078203, 1091380, 1104333, 1117956, 1132438, 1147434, 1162887, 1178719, 1194182, 1208516, 1221893, 1234885, 1247548, 1259913, 1272777, 1286851, 1301593, 1316011, 1330178, 1344772, 1359527, 1373538, 1386886, 1400621, 1415163, 1430040, 1445231, 1461435, 1478773, 1496374, 1513531, 1530300, 1546817, 1563020, 1579260, 1596225, 1613990, 1631977, 1649970, 1668313, 1687051, 1705838, 1724807, 1744516, 1764865, 1785068, 1804926, 1825070, 1845675, 1865958, 1885412, 1904592, 1924172, 1944049, 1963845, 1983577, 2003349, 2023033, 2042684]
57217B042684J9982K0396K0456K0403K0639K0846K0585K0338K0847K1770K2057
57206B271003K1478K0743K0318K0063J9912J9939J9847J9197J8126J7153J6411
57195B484190J5755J5356J5478J5850J5945J5712J5526J5570J5735J5823J5555
57184B656495J4822J4243J4751J6266J7530J7755J7470J7256J6728J5671J4935
57173B833922J5093J5209J4180J2459J1160J0302R329Q519Q339Q023O499M269
57161B957303K774K114J063q13k617l765m639n485n954n965n865n651n031m275
57147B913194l964l919l480k708k206j804o58J327L354N007O509P664P824P129
57133B933269O544O386N894M594L114K305K337K974M003N230O608Q445J0857J3216
$$ y = [2042684, 2062666, 2083062, 2103518, 2123921, 2144560, 2165406, 2185991, 2206329, 2227176, 2248946, 2271003, 2292481, 2313224, 2333542, 2353605, 2373517, 2393456, 2413303, 2432500, 2450626, 2467779, 2484190, 2499945, 2515301, 2530779, 2546629, 2562574, 2578286, 2593812, 2609382, 2625117, 2640940, 2656495, 2671317, 2685560, 2700311, 2716577, 2734107, 2751862, 2769332, 2786588, 2803316, 2818987, 2833922, 2849015, 2864224, 2878404, 2890863, 2902023, 2912325, 2921654, 2930173, 2938512, 2946535, 2953034, 2957303, 2960077, 2962191, 2963254, 2962441, 2959824, 2956059, 2951420, 2945935, 2939981, 2934016, 2928151, 2922500, 2917469, 2913194, 2909230, 2905311, 2901831, 2899123, 2896917, 2895113, 2894455, 2895782, 2899136, 2904143, 2910652, 2918316, 2926140, 2933269, 2939813, 2946199, 2952093, 2956687, 2959801, 2962106, 2964443, 2967417, 2971420, 2976650, 2983258, 2991703, 3002560, 3015776]
57119C015776J4831J5962J7368J9208K1301K4147K8496L4171M0444M7370N5562
57108C334636O4907P4880Q6054R9892J17011J37036J60247J88057K21700K61783
57098D746203L09305L65831M32362N09130N96374O93996Q00312R12478J028147
57089A0394138J145282J260563J369695J469194J555759J623773J665338J671788
57081B2155530J630517J518975J308190R81184N52328O8660m08785q28026j159147
57072B5819426j395031j544726j624416j649814j632814j582157j505277j409267
57064A3475924j300898j186145j069795r55664q47302p47823o58856n80269n11498
57055E617674m52455m02728l60675l24259k92424k64941k41370k20868k02780
$$ y = [3015776, 3030607, 3046569, 3063937, 3083145, 3104446, 3128593, 3157089, 3191260, 3231704, 3279074, 3334636, 3399543, 3474423, 3560477, 3660369, 3777380, 3914416, 4074663, 4262720, 4484420, 4746203, 5055508, 5421339, 5853701, 6362831, 6959205, 7653201, 8453513, 9365991, 10394138, 11539420, 12799983, 14169678, 15638872, 17194631, 18818404, 20483742, 22155530, 23786047, 25305022, 26613212, 27594396, 28146724, 28215384, 27806599, 26978573, 25819426, 24424395, 22879669, 21255253, 19605439, 17972625, 16390468, 14885191, 13475924, 12175026, 10988881, 9919086, 8963422, 8116120, 7368297, 6709441, 6129172, 5617674, 5165219, 4762491, 4401816, 4077557, 3785133, 3520192, 3278822, 3057954, 2855174]
57046B855174j86735j72360j59407j47786j37051j26258j14935j03680r3227q3416
57036A530319p3818o4768n6763m9165m0646l0924k0844j0541J098J3812K3459
57025A221219K3735J1429j0193l3533n1972o3036o7395o6625o2554n7310n2388
57014G91377m7685m2416l6769l1832k8046k4926k2185k0035j8226j6030j3499
57003D89728j1625j0792j0142r052q163q235q821q941q357p436o339n093m005
56990C82727l239k389j114L09J606L228N608Q107R438Q977P021L963l7m557q730
56975D10918j1752j3331j3636j2985j1675r984q297o972n887m406k281k70Q09
56962C10251J507L274O526J0088J2821J4739J6079J6147J3924R266K983l805r902
$$ y = [2855174, 2668439, 2496079, 2336672, 2188886, 2051835, 1925577, 1810642, 1706962, 1613735, 1530319, 1456501, 1391733, 1334970, 1285805, 1245159, 1214235, 1193391, 1182850, 1183948, 1197760, 1221219, 1244954, 1256383, 1246190, 1212657, 1160685, 1097649, 1030254, 963629, 901075, 843765, 791377, 743692, 701276, 664507, 632675, 604629, 579703, 557518, 537483, 519257, 503227, 489728, 478103, 467311, 457169, 448117, 439954, 431719, 422898, 413957, 405600, 398164, 391825, 386732, 382727, 379488, 377099, 375985, 376294, 377900, 381128, 386736, 394843, 404281, 413258, 420279, 424242, 424205, 419648, 410918, 399166, 385835, 372199, 359214, 347539, 337555, 329258, 322286, 316399, 311993, 309712, 309442, 310251, 311758, 315032, 321558, 331646, 344467, 359206, 375285, 391432, 405356, 414622, 417605, 413800, 403898]
56949D03898j4198j6256j6504j5611j4015j2206j0776r745q402o248l616r93J678
56936B77006M601P630J0573J3588J6842K0157K3091K4775K3582J7972Q296k805
56924D45308j2341j8882k2475k3671k3213k1928k0176j7843j5143j2791j1089
56913B45756r602q181p335p061o346m617k782j978k032k013j656j283r41m92l8
56898A89399M69J442K800L605L485L597N144P605R551J0720J2061J4194J6883
56885B80955J9657K1647K1184J7004J0005K695l229p890j1755j4338j4767j2940
56873C08228r673o094k998m54K051M893P872J0758J3881J7763K2463K7727L3448
56860D29865L9391M4601M7488M6290L9500K6742R924p064k0693k9656l4224l4768
$$ y = [403898, 389700, 373444, 356940, 341329, 327314, 315108, 304332, 294587, 286185, 279937, 276321, 275328, 277006, 281607, 289237, 299810, 313398, 330240, 350397, 373488, 398263, 421845, 439817, 448113, 445308, 432967, 414085, 391610, 367939, 344726, 322798, 302622, 284779, 269636, 256845, 245756, 236154, 227973, 220638, 213577, 207231, 202614, 199832, 197854, 195822, 193809, 192153, 190870, 189929, 189437, 189399, 189868, 191310, 194110, 197715, 201200, 204797, 209941, 217546, 227097, 237817, 249878, 264072, 280955, 300612, 322259, 343443, 360447, 370452, 373147, 369918, 362028, 350273, 335935, 321168, 308228, 298555, 292461, 289463, 289009, 291060, 295953, 303825, 314583, 328464, 346227, 368690, 396417, 429865, 469256, 513857, 561345, 607635, 647135, 673877, 683801, 676737, 656044, 626388, 592164, 557396]
56848E57396l1856k7020k2016j7293j2108o029M29O598J2373J8207K4837L2789
56836E36307M1775N0923N9886O8732P5842P6832O7198M6325J8326j0698l5552
56825I95896n3130o2655o5432o3658n9000n2388m4581l6240k7726j9453j2071
56814D99562n630R03Q453J6577K4245L1414L8788M6207N2024N3739M8720L5276
56802H50278J4608q582k8763m3024n1443n4911n4129n0294m4975l9028l2633k6344
56790D30760k0923j6158j1215o108j573K502P111J2444J7565K2024K6152K9192
56778D91773K8544K2055J0419l271j5763k5081l0734l3310l3697l2417k9865k6858
56766C21795k4159k1614j8582j5219j2438j0604r297q306p810p451o508n153m379
$$ y = [557396, 525540, 498520, 476504, 459211, 447103, 441074, 441503, 448101, 460474, 478681, 503518, 536307, 578082, 629005, 688891, 757623, 833465, 910297, 977495, 1023820, 1042146, 1031448, 995896, 942766, 880111, 814679, 751021, 692021, 639633, 595052, 558812, 531086, 511633, 499562, 493932, 494835, 503288, 519865, 544110, 575524, 614312, 660519, 712543, 766282, 815002, 850278, 864886, 856304, 827541, 784517, 733074, 678163, 624034, 573740, 528765, 489737, 457104, 430760, 409837, 393679, 382464, 376356, 374783, 377285, 384396, 396840, 414405, 436429, 462581, 491773, 520317, 542372, 552791, 549520, 533757, 508676, 477942, 444632, 410935, 378518, 348653, 321795, 297636, 276022, 257440, 242221, 229783, 219179, 209882, 201576, 193766, 186315, 179807, 174654, 170275]
56753A70275m338l952k691j535j476k073k270j881j464j325j323j261r65l79R7
56738A43439j05q80j422j339j083j030q60k85K97M11K66L52P01R53R11P26P04
56721A41756J122J837K185J628N21k51l32n2L07O93P80K28n33n59L23J310J790
56704A52753J926J926J557P77N0l17n26p14o72l74j74k31l17l40m44m88j18N48
56686A54822R28Q31O13M72K89J83L87N64J52o09q93n84k90j10M63J187J069Qq06
56667A58676o50k19j97j16N44J299J529J516J672J625J032N05P63J403J502R17
56651A71801J93m39j054j486j515j394j473j621j562j481j620j609q93L30J270
56636A57447J555J519J501J368R37N57R65K407L962M128K372j23j670j753j105
$$ y = [170275, 165937, 161985, 159294, 157759, 156283, 154210, 151940, 150059, 148595, 147270, 145947, 144686, 143721, 143342, 143439, 143334, 142454, 141032, 139693, 138610, 137580, 136720, 136435, 136732, 137143, 137409, 137761, 138462, 139415, 140326, 141052, 141756, 142878, 144715, 146900, 148528, 149049, 148798, 148466, 148414, 148721, 149414, 150194, 150422, 149889, 149330, 149653, 150963, 152753, 154679, 156605, 158162, 158939, 158989, 158672, 158146, 157432, 156760, 156386, 156212, 155981, 155664, 155324, 154880, 154392, 154274, 154822, 155750, 156581, 157194, 157666, 157955, 158138, 158525, 159089, 159241, 158632, 157739, 157155, 156865, 156755, 157218, 158405, 159474, 159482, 158676, 158026, 157807, 157610, 157494, 158038, 159337, 160866, 162382, 164054, 165679, 166711, 167216, 167979, 169382, 170884, 171801, 171994, 171555, 170501, 169015, 167500, 166106, 164633, 163012, 161450, 159969, 158349, 156740, 155847, 156177, 157447, 159002, 160521, 162022, 163390, 164327, 164884, 165849, 168256, 172218, 176346, 178718, 178595, 176925, 175172, 174067]
56621A74067n08k46m77j229j996k130j725j480j665j846j630r76QR63J140K21
56605A60491r70j365j027o74l55K15M56l66j488j368n5R34J128J561K484K608
56589A62209J375N0l34l78p24p76j52K00l80q84k73P54J024P60Q49J203J247J179
56571A66949J376J397Q39M55J113K328L129L707M822O221O969P050P339Q241R367
56556B31302J0264J0501R434O867L723J216l14j070r89j45N90M01l64p80o62m64
56540B69510l80m43j033k263l277l180k365j947k174k320k031j774j977k489k951
56525B38906l170l106k918k885l055l139k961k660k302j796j379j517k092k402
56511B03524k202j978j947j688j078o86q04j034j121j297j390p73L96J049Q34
$$ y = [174067, 173559, 173313, 172836, 171607, 169611, 167481, 165756, 164276, 162611, 160765, 159135, 158159, 158167, 159130, 160270, 160491, 159521, 158156, 157129, 156455, 156100, 156315, 156771, 156405, 154917, 153549, 153494, 154428, 155556, 157117, 159601, 162209, 163584, 163634, 163300, 162922, 162198, 161422, 161270, 161470, 161090, 160206, 159933, 160687, 161711, 162471, 163320, 164523, 165770, 166949, 168325, 169722, 170561, 171016, 172129, 174457, 177586, 181293, 186115, 192336, 199305, 206355, 213694, 221935, 231302, 241566, 252067, 261501, 268368, 272091, 273307, 272993, 271923, 270934, 270789, 271379, 271780, 271416, 270636, 269974, 269510, 269130, 268687, 267654, 265391, 262114, 258934, 256569, 254622, 252448, 250128, 248097, 246323, 244346, 241857, 238906, 235736, 232630, 229712, 226827, 223772, 220633, 217672, 215012, 212710, 210914, 209535, 208018, 205926, 203524, 201322, 199344, 197397, 195709, 194631, 193945, 193141, 192107, 190986, 189689, 188299, 187526, 187922, 188971, 189805]
56496A89805O09P93O94P8j07N32Q82K03m96k12K67k36j241j466p93m9L51M21Q5
56477A90120k88J67J308J614M62n72n3R78P16n21r66p6J209K253K999L089K264
56460B04703J283J043J165P37j27o35o36m13N2N67L97m81q33p7N41N3m06M19J504
56441B08856J154j22o03k37k78p08m00O29J205J020P53N13m4m51n2N56L81k08
56423B11964k81j82p01j204n58O65J046P33Q44J176O99j45r0N07K62n84n65K33
56405B13819L39k62p3J085J697J256Q87R80O21k26k10J071K258K332J747J133
56389B28454N65L06O05P05k17j296j061L9L29k02q9P54R86N51P75J592J496N91
56371B34883P89K386L266K369J286J362J774J609J487J903K046J470J003J006
$$ y = [189805, 190414, 191207, 191901, 191979, 191872, 192404, 193286, 193489, 192993, 192781, 193048, 192812, 191571, 190105, 189312, 189263, 189614, 190035, 190120, 189832, 189999, 191307, 192921, 193383, 192811, 192758, 193736, 194452, 193931, 192965, 192889, 194098, 196351, 199350, 202439, 204703, 205986, 207029, 208194, 208931, 208804, 208169, 207533, 207120, 207172, 207739, 208136, 207655, 206822, 206745, 207286, 207339, 206933, 207352, 208856, 210010, 209888, 209285, 209048, 208770, 208062, 207662, 208291, 209496, 210516, 211269, 211782, 211738, 211287, 211235, 211791, 212172, 211964, 211683, 211501, 210800, 209596, 209038, 209703, 210749, 211482, 212326, 213502, 214201, 214056, 213966, 214473, 214735, 214151, 213586, 213819, 214158, 213896, 213823, 214908, 216605, 217861, 218748, 219728, 220349, 220123, 219913, 220984, 223242, 225574, 227321, 228454, 229019, 229325, 229930, 230635, 230418, 229122, 228061, 228100, 228429, 228227, 228138, 228892, 229878, 230429, 231204, 232796, 234292, 234883, 235672, 238058, 241324, 243693, 244979, 246341, 248115, 249724, 251211, 253114, 255160, 256630, 257633, 258639]
56357B58639O26l02n76K33R29Q35Q43J447J705J114O02O82N08k55n40K37J146
56340B67873J482J719K018J707R54J037K122K804K583K651L414L466K131Q25P46
56325B97532J272J641K191K812K426J098N68J469K174J612R26J113J236N49J02
56310C18721O60J168R10J104K565L906L829L307L613M109L946M109N589P090O738
56295C71364M856L111K126J680K016L120L803L214K287K252K836L294L965N300
56281D15224O580P071P248P662P787P320P245Q251R411R789R956J0679J1566J2276
56267E38065J3581J5768J7526J7874J7777J8467J9686K0982K3138K6662L0452
56256G59978L3606L7113M2144M8056N3770N9752O6966P5049Q3124R1349J00193
$$ y = [258639, 259265, 258963, 258387, 258620, 259549, 260384, 261227, 262674, 264379, 265493, 266095, 266777, 267285, 267030, 266490, 266727, 267873, 269355, 271074, 273092, 274799, 275753, 276790, 278912, 281716, 284299, 286950, 290364, 293830, 295961, 296786, 297532, 298804, 300445, 302636, 305448, 307874, 308972, 309540, 311009, 313183, 314795, 315721, 316834, 318070, 318619, 318721, 319381, 320549, 321459, 322563, 325128, 329034, 332863, 336170, 339783, 343892, 347838, 351947, 357536, 364626, 371364, 376220, 379331, 381457, 383137, 385153, 388273, 392076, 395290, 397577, 399829, 402665, 405959, 409924, 415224, 421804, 428875, 436123, 443785, 451572, 458892, 466137, 474388, 483799, 493588, 503544, 514223, 525789, 538065, 551646, 567414, 584940, 602814, 620591, 639058, 658744, 679726, 702864, 729526, 759978, 793584, 830697, 872841, 920897, 974667, 1034419, 1101385, 1176434, 1259558, 1350907, 1451100]
56245A451100J09302J18141J26517J33449J37199J37577J36491J34899J30953
56236B615628J22519J09661R3218P3032M9421K4612Q13k1759m3360o2923p9364
56225B881498r3044j04341j12473j17155j19683j20892j19930j16514j12217j07970
56215A757279j02533r5216q7760q1575p5543o8665o2417n8110n4299m9394m4587
56204I77180m1472l8927l5208l1177k8549k6677k3980k0871j8540j6461j3837
56193F81481j1820j1478j1251r331o910o120o353n701m458m095m138l194j862
56180E94770j556j642o78O19O48mL00J218J381J179J740K384J993J638K833M464
56164F11287M534L738M218N865O965P398Q127Q665Q168P928R569J1851J2524J2220
$$ y = [1451100, 1560402, 1678543, 1805060, 1938509, 2075708, 2213285, 2349776, 2484675, 2615628, 2738147, 2847808, 2941026, 3014058, 3063479, 3088091, 3088904, 3067145, 3023785, 2960862, 2881498, 2788454, 2684113, 2571640, 2454485, 2334802, 2213910, 2093980, 1977466, 1865249, 1757279, 1654746, 1559530, 1471770, 1390195, 1314652, 1245987, 1183570, 1125460, 1071161, 1021767, 977180, 935708, 896781, 861573, 830396, 801847, 775170, 751190, 730319, 711779, 695318, 681481, 669661, 658183, 646932, 637601, 630691, 624571, 618218, 612517, 608059, 603964, 599826, 596632, 594770, 593214, 591572, 590894, 591513, 592161, 592157, 592457, 593675, 595056, 596235, 597975, 600359, 602352, 603990, 606823, 611287, 615821, 619559, 623777, 629642, 636607, 644005, 652132, 660797, 668965, 676893, 686462, 698313, 710837, 723057]
56150G23057J3286J5802J8073K0055K2973K6438K9354L2830L8857M6876N4767
56139A042368O2385P0848P9266Q5404Q8719Q9538Q6334P7537O5312N4131M6086
56128A847928M0628L7764L7788L8472L6167K9651K0378R790p64q811j2913j5187
56116B060891j8824k4349l1127m0474n3396o6868p6457q1402q3409q2068p5873
56105A426644o6531n7791n0607m3420l6228l0293k4959j8829j3115r830p922n196
56093A061923k545k022k338r64J022J003J67J541M194M842L997M866P181P867
56079A090734P087P859J0164J1165J0883J1973J4197J4745J3755J3972J5299J5249
56067A237082J4378J5508J7954J8368J6990J7102J8713J8830J7723J8564K1047
$$ y = [723057, 736343, 752145, 770218, 790273, 813246, 839684, 869038, 901868, 940725, 987601, 1042368, 1104753, 1175601, 1254867, 1340271, 1428990, 1518528, 1604862, 1682399, 1747711, 1801842, 1847928, 1888556, 1926320, 1964108, 2002580, 2038747, 2068398, 2088776, 2098566, 2097802, 2088991, 2076078, 2060891, 2042067, 2017718, 1986591, 1946117, 1892721, 1825853, 1749396, 1667994, 1584585, 1502517, 1426644, 1360113, 1302322, 1251715, 1208295, 1172067, 1141774, 1116815, 1097986, 1084871, 1075041, 1067119, 1061923, 1059378, 1057356, 1055018, 1054054, 1055076, 1056079, 1056246, 1057787, 1061981, 1066823, 1070820, 1075686, 1082867, 1090734, 1097821, 1105680, 1115844, 1127009, 1137892, 1149865, 1164062, 1178807, 1192562, 1206534, 1221833, 1237082, 1251460, 1266968, 1284922, 1303290, 1320280, 1337382, 1356095, 1374925, 1392648, 1411212, 1432259]
56056A432259K1724K0673K1355K3824K4519K3019K2518K3438K3017K1430K1836
56045A679612K4085K4904K4398K5735K8454K8962K7642K8413L1295L2646L2613
56034A988759L4804L8628L9841L8760L9938M3553M5382M5455M8078N2864N4730
56023B470792N3429N4142N7729N9625N9267O1273O6164O9275P0081P3053P8285
56012C173115Q1010Q1434Q4935R1536R5636R7171J01935J09788J14192J14896
56002D145648J19088J28233J36051J41348J50004J62149J70619J74729J82072
55993E509941J94145K04105K11283K23274K40848K56074K68444K86776L11894
55984G706784L34343L53029L78320M12472M45599M75743N13407N60947O08024
$$ y = [1432259, 1453983, 1474656, 1496011, 1519835, 1544354, 1567373, 1589891, 1613329, 1636346, 1657776, 1679612, 1703697, 1728601, 1752999, 1778734, 1807188, 1836150, 1863792, 1892205, 1923500, 1956146, 1988759, 2023563, 2062191, 2102032, 2140792, 2180730, 2224283, 2269665, 2315120, 2363198, 2416062, 2470792, 2524221, 2578363, 2636092, 2695717, 2754984, 2816257, 2882421, 2951696, 3021777, 3094830, 3173115, 3254125, 3335559, 3420494, 3512030, 3607666, 3704837, 3806772, 3916560, 4030752, 4145648, 4264736, 4392969, 4529020, 4670368, 4820372, 4982521, 5153140, 5327869, 5509941, 5704086, 5908191, 6119474, 6342748, 6583596, 6839670, 7108114, 7394890, 7706784, 8041127, 8394156, 8772476, 9184948, 9630547, 10106290, 10619697, 11180644, 11788668]
55975A1788668O53297P09316P79711Q53989R31501J026571J142971J269285J407265
55966B0562574J576973J785627K021968K291163K622489L032640L518689M099570
55958D1511693M824060N725141O813256Q128633R744393J1700137J3999812J6698945
55950A19146070J9909067K3668906K7869117L2246234L6148110L8104247L5953923
55943C33045674K8080463J4946899o50743j5074550k5754920l1955548l4247114
55936B68390161l3670879l1284486k7996786k4452327k1006390j7837571j5052176
55929I7089546j2684995j0694022r020724p633638o499843n561740m770734m110997
55921C6112853l569427l113462k717241k380323k102301j864254j650901j466622
$$ y = [11788668, 12441965, 13151281, 13930992, 14784981, 15716482, 16743053, 17886024, 19155309, 20562574, 22139547, 23925174, 25947142, 28238305, 30860794, 33893434, 37412123, 41511693, 46335753, 52060894, 58874150, 67002783, 76747176, 88447313, 102447125, 119146070, 139055137, 162724043, 190593160, 222839394, 258987504, 297091751, 333045674, 361126137, 376073036, 375422293, 360347743, 334592823, 302637275, 268390161, 234719282, 203434796, 175438010, 150985683, 129979293, 112141722, 97089546, 84404551, 73710529, 64689805, 57056167, 50556324, 44994584, 40223850, 36112853, 32543426, 29429964, 26712723, 24332400, 22230099, 20365845, 18714944, 17248322]
55913A7248322j314335j180663j055793r46990q59000p80627p03310o34629n81122
55904I191853n34815m88328m47204m16059l87640l56263l28046l07783k89153
55895E636562k67186k47449k33794k19738k00760j82974j71067j59490j44005
55886C810099j30299j22743j15846j05492r7974r8976j03276j03826j02069j01249
55876B728349r8410r0989q3313p9041p4807o8102o3531o4514o6422o4551o1480
55865A913189o0197n7611n1433m6063m5033m4562m1048l7970l8878m0255l8017
55854A412122l4805l4280l4135l1247k8119k7891k8320k6666k5293k6694k8014
55843A086658k6337k4300k4891k5581k3207j9918j8774j8130j5775j4021j5262
$$ y = [17248322, 15933987, 14753324, 13697531, 12750541, 11891541, 11110914, 10407604, 9772975, 9191853, 8657038, 8168710, 7721506, 7305447, 6917807, 6561544, 6233498, 5925715, 5636562, 5369376, 5121927, 4888133, 4668395, 4467635, 4284661, 4113594, 3954104, 3810099, 3679800, 3557057, 3441211, 3335719, 3237745, 3138769, 3035493, 2931667, 2829598, 2728349, 2629939, 2538950, 2455637, 2376596, 2301789, 2233687, 2170156, 2105642, 2039220, 1974669, 1913189, 1852992, 1795381, 1743948, 1697885, 1652852, 1608290, 1567242, 1529272, 1490394, 1450139, 1412122, 1377317, 1343037, 1308902, 1277655, 1249536, 1221645, 1193325, 1166659, 1141366, 1114672, 1086658, 1060321, 1036021, 1011130, 985549, 962342, 942424, 923650, 905520, 889745, 875724, 860462]
55832H60462j6792j5411j3001j2479j2412j0642r041r665j0339q986q180j0350
55820G23164j2671j1897j0324j1492j3732j3394j1276j0414j0416r151p443p267
55808E93687p654o795n766o129o429m921k997k235j131J515L261K069L41Q29J785
55793E59430M71j743k266k095l234m179k709m78r0k15J633L660K072k925p892
55778E39440j1362j4012j5237j3733j0399p090l665P36N201Q699J1966J4595J2978
55765E18117M958n698j3306j6734j8260j8511j6741j4175j2637j1249q398n529
55753C81837n136o360o569n967o717q546r087p900o630n809m708l629l398l337
55739B98044k401j316j152j088j83K50j196l141l527k985l174l543k813k024k811
$$ y = [860462, 843670, 828259, 815258, 802779, 790367, 779725, 770684, 761019, 750680, 741694, 733514, 723164, 710493, 698596, 688272, 676780, 663048, 649654, 638378, 627964, 617548, 608397, 600954, 593687, 586033, 579238, 573472, 567343, 560914, 555993, 552996, 550761, 549630, 551145, 554406, 556475, 556816, 557645, 559430, 559901, 558158, 555892, 553797, 550563, 546384, 543675, 543197, 543107, 542892, 544525, 548185, 550257, 547332, 539440, 528078, 514066, 498829, 485096, 474697, 467607, 463942, 464678, 469879, 478578, 490544, 505139, 518117, 523075, 517377, 504071, 487337, 469077, 450566, 433825, 419650, 407013, 395764, 387366, 381837, 376701, 370341, 363772, 357805, 351088, 342542, 333455, 325555, 318925, 313116, 308408, 304779, 301381, 298044, 295643, 294327, 293175, 292087, 291904, 292154, 290958, 287817, 284290, 281305, 278131, 274588, 271775, 269751, 266940]
55724B66940m127l944k865k874l780l982l516l297k717r66O54P12M72J780L703
55709B42193M355M300M874M895K702j79j100p14j547l451m404m662o036p802p522
55694B25902n465m286m516m151k647j732k007k130j586j267j161l05R62J386J313
55679A98310K187L738M360L943L716L600K445N36p37j387k362l100k260m95K16
55664B12710l28p53q45j367j693m71J602K488K009J686J840J554J044J225J316
55649B22017j73k396l066k112j455j444o81O59O18j127k668l158l785m946n280
55634A91003m314l599m239n364n776n447m796l919k886j648K7J535J313p37k062
55619A49091p20J541J901P38L11N33m93k481l160k246j782k488l042l058l503
$$ y = [266940, 262813, 258869, 256004, 253130, 249350, 245368, 241852, 238555, 235838, 234872, 235526, 236238, 236710, 238490, 242193, 246548, 250848, 255722, 260617, 263319, 263140, 262040, 261326, 259779, 256328, 251924, 247262, 241226, 233424, 225902, 220437, 216151, 211635, 207484, 204837, 203105, 201098, 198968, 197382, 196115, 194954, 194649, 195611, 196997, 198310, 200497, 204235, 208595, 212538, 216254, 219854, 222299, 222835, 222098, 220711, 218349, 215249, 212989, 212494, 212710, 212382, 211629, 210784, 209417, 207724, 207253, 208855, 211343, 213352, 215038, 216878, 218432, 219476, 220701, 222017, 221844, 219448, 216382, 214270, 212815, 211371, 210690, 211349, 211967, 210840, 208172, 205014, 201229, 196283, 191003, 186689, 183090, 178851, 173487, 167711, 162264, 157468, 153549, 150663, 149015, 149042, 150577, 151890, 151153, 149091, 148371, 149912, 151813, 152551, 152862, 153395, 152902, 150421, 147261, 145015, 143233, 140745, 137703, 134645, 131142]
55604A31142l981k804k63J246Q15l3l31p51j283q13L67M16j016k163k091j739
55588A16718j564p47O78J398J143J096J548J568J296K056L777M803M682M701N252
55573A48405N293M785N075O337P217P391P867Q366P283M715K612J396n53l403
55559B12786n104n084n509p518r215q943p845p405p050n948m945m842m707l577
55545A25094k229j717j745j716j837k066j551j65R28J104J113J420J421R61Q15
55530A19830J016O69o0J40J169J170m37j887j973j757k298k838k510j806j205
55515A07223k90P45O84n12j117l29M19o2r83j430j912k771l100k487j983k121
55499H9974j852o55K35q1p00p74r26j606j886j157k66J30O16J353J356M87J70
$$ y = [131142, 127161, 124357, 124094, 125340, 126155, 126122, 125791, 125040, 123757, 122944, 123311, 123727, 122711, 120548, 118457, 116718, 115154, 114407, 115085, 116483, 117626, 118722, 120270, 121838, 123134, 125190, 128967, 133770, 138452, 143153, 148405, 153698, 158483, 163558, 169895, 177112, 184503, 192370, 200736, 208019, 212734, 215346, 216742, 216189, 212786, 207682, 202598, 197089, 189571, 180356, 171413, 163568, 156163, 149113, 143165, 138220, 133378, 128671, 125094, 122865, 121148, 119403, 117687, 115850, 113784, 112233, 112068, 112996, 114100, 115213, 116633, 118054, 119015, 119830, 120846, 121515, 121455, 121595, 122764, 123934, 123497, 121610, 119637, 117880, 115582, 112744, 110234, 108428, 107223, 106933, 107678, 108362, 107850, 106733, 106404, 106823, 106761, 105778, 104348, 102436, 99665, 96565, 94078, 92095, 89974, 88122, 87467, 87702, 87621, 86921, 86147, 85221, 83615, 81729, 80572, 80306, 80436, 81052, 82405, 83761, 84248, 84418]
55482H4418R68J568J181P97Q78K25j447k238j000O72J104R14J053P87m39j342
55466H8099j064r87k133k898j667J88M51m80p70k92j65l83k54j35n17n27N76J572
55448G8614J057j47m23m8k34o44j99N99M77k26k34K89J88m07l08N69J182J129
55430H1234Q30L66l01m86L35J405J728J603J744J796J188N03N01P33O06Q19K043
55413I6647L273L199K169J163q5j966l257k683j346j255k177k271j237n45q33
55398H8796j257j353j473j504r83l70m71q30m04M21L43n48p91J08J057J157O10
55381H2508j25p41p38M8P44N58J40N10J155P68n68j586j906k166k395j960j070
55364G3176o83q78q76n73o18r20o34K90R12P35J78l58p52o01L93J539J844J401
$$ y = [84418, 85386, 86954, 88135, 88932, 89810, 90035, 88588, 86350, 85350, 86022, 87126, 88040, 89093, 89880, 89441, 88099, 87035, 86048, 83915, 81017, 79350, 79538, 79989, 79509, 78739, 78447, 78282, 77899, 77645, 77510, 76993, 76466, 77042, 78614, 79671, 79524, 79101, 79053, 78819, 78175, 77976, 78575, 79052, 78826, 78592, 78881, 79069, 78662, 78354, 78923, 80105, 81234, 82064, 82430, 82129, 81643, 81978, 83383, 85111, 86714, 88458, 90254, 91442, 91945, 92446, 93179, 93785, 94604, 96647, 99920, 103119, 105288, 106451, 106366, 104400, 101143, 98460, 97114, 95859, 93682, 91411, 90174, 89629, 88796, 87539, 86186, 84713, 83209, 82226, 81856, 81385, 80555, 80151, 80572, 80915, 80367, 79576, 79684, 80741, 81898, 82508, 82383, 81642, 80904, 80952, 81696, 82254, 82394, 82904, 84059, 84827, 84259, 82673, 80767, 78601, 76206, 74246, 73176, 72493, 71615, 70739, 70166, 69548, 68628, 67994, 68284, 69196, 69931, 70109, 69751, 68999, 68398, 68791, 70330, 72174, 73575]
55346G3575J039R14O30L46N45R13P50K07j04k54o37q71m77r5n69j318j178m12
55328G3004k21n90l85N50J158R60N33J81l08n58J16J299J778J356R13P11J32q04
55310G9825j251j036r37j194j113m07K83N33N66M55j2n13l92K17N13L04J19J19
55292G6079K1l4L05O78N27L44J024K126K225J028l08r69j177r87l9J250J658Q23
55274H4574k59p26p01m43J11O25L64o45j377j174n12j64l26p42r89o41K02P34
55256G7911M94J84O13J328J391R52Q35R52N92j44n56p55j334j932j666q13n02
55239G7550q04p50j62J28j00k51k79o53r49k28J122J682J210P80N97k71j638j848
55221G5136m06R95R23O8l24k61k24k0N06P18K05l64k87J27K53J30J39M06R11J508
$$ y = [73575, 74614, 75528, 76158, 76504, 77049, 77962, 78712, 78919, 78815, 78561, 77924, 77053, 76576, 76481, 75912, 74594, 73416, 73004, 72783, 72193, 71808, 72358, 73516, 74476, 75009, 75190, 74882, 74324, 74440, 75739, 77517, 78873, 79786, 80497, 80629, 79825, 78574, 77538, 76601, 75407, 74294, 73887, 74170, 74703, 75269, 75724, 75712, 75199, 74807, 75024, 75537, 75841, 75960, 76079, 76100, 76066, 76371, 77049, 77576, 77920, 78944, 81070, 83295, 84323, 84015, 83046, 81869, 80882, 80843, 82093, 83751, 84574, 84315, 83589, 82888, 82445, 82556, 83181, 83545, 82900, 81523, 80349, 79837, 79673, 79347, 78605, 77616, 76975, 77177, 77911, 78405, 78589, 79202, 80530, 81921, 82873, 83708, 84660, 85252, 85108, 84552, 83797, 82463, 80531, 78865, 78052, 77550, 76746, 75996, 75834, 75962, 75862, 75611, 75332, 74679, 73730, 73502, 74624, 76306, 77516, 78296, 78893, 78622, 76984, 75136, 74730, 75725, 76648, 76716, 76392, 76131, 75907, 75887, 76393, 77111, 77316, 76952, 76665, 76792, 77045, 77175, 77314, 77720, 78631, 80139]
55201H0139J704J184N35M02J87j056k605k678j211j17l31n40L64J453J451P34
55185G9615L79M92O24Q27J198J199M55n45j184j406j228n26K32J71n44o85P5M84
55167G9633j53o43K50J817K478J902R29J46l51m40k20k96r58j547j327m67M17
55150H1170J072J410J247P66N59O56L54n07r60l77M78O10K14N3J65J23N7M03R39
55131H8432R39K21n47o39o3M65K91l60n62kM29j05r97j102m90j20j42O3M02J90
55111H6303l30j63N82P22N4k89J40M96L92M29N50j80j488j628o9J414J433Q42
55093H9210P95Q19K95J4O40J134M70m18k01O23P90M85O53J038P31o1n16q23j608
55074I4070k346j969o62N27J332K108K451J679L70j04M50R94R99R24J000P93J14
$$ y = [80139, 81843, 83027, 83562, 83964, 84151, 83095, 80490, 77812, 76601, 76484, 76153, 75613, 75977, 77430, 78881, 79615, 79994, 80486, 81110, 81937, 83135, 84334, 84789, 84244, 83060, 81654, 80426, 79900, 80132, 80303, 79759, 79074, 79149, 79633, 79480, 78837, 79087, 80904, 83382, 85284, 86213, 86359, 86008, 85568, 85348, 85052, 84094, 82547, 81220, 80753, 81170, 82242, 83652, 84899, 85665, 86224, 86880, 87234, 86727, 85767, 85390, 85868, 86478, 86692, 86745, 86910, 87033, 87090, 87493, 88432, 89371, 89592, 89045, 88406, 88343, 88808, 89099, 88739, 88177, 88175, 88604, 88499, 87502, 86400, 85910, 85790, 85648, 85711, 86113, 86303, 85973, 85810, 86392, 87114, 87168, 86879, 87019, 87515, 87907, 88336, 88886, 88706, 87218, 85590, 85521, 86935, 88368, 89210, 90005, 90824, 91119, 91133, 91773, 92907, 93377, 92959, 92758, 93381, 94171, 94656, 95309, 96347, 97078, 97017, 96501, 95678, 94070, 91724, 89755, 89093, 89620, 90952, 93060, 95511, 97190, 97560, 97456, 97906, 98900, 99899, 100823, 101823, 102616, 102730]
55057A02730o92j374j833j683p03L61L98o30j633j767j204o01l75m88n61k75J20
55040H9790J66M8M10J079J051J20n78l51m0m72r44m71M82P48K40k35l50k79j7
55021I0397L19J54n92r36k79M43J83n09n26q7j15m33j86M42N66K72M22J029J272
55002I1836R47N93L14j92n62r7R30J457J119M84m6m30l83L27J072J012L59n4k07
54983I8479o44j117q07J74Q07P23N82Q18J089J071Q48M86O1l8L12M20k79j068
54965A01917q53J40P57P27Q08J267J525J232N91l10j368j847j149lL23j62m42
54948A03153l03m24p84n72J85N04J50K3M13M00n22j502j590r18r4N72Q41N24R3
54929A00149M15J494K326K238J554P66M9k52L20J477K335K661L144M173N327O170
$$ y = [102730, 102038, 100664, 98831, 97148, 96445, 96806, 97204, 96574, 94941, 93174, 91970, 91369, 90994, 90506, 89945, 89670, 89790, 89956, 90004, 90414, 91493, 92544, 92664, 92086, 91735, 91695, 91223, 90279, 89808, 90290, 91038, 91278, 91043, 90693, 90414, 90397, 90716, 90870, 90278, 89342, 89063, 89506, 89689, 89180, 88654, 88567, 88452, 88019, 87833, 88275, 88841, 89113, 89535, 90564, 91836, 92783, 93376, 93690, 93498, 92936, 92839, 93769, 95226, 96345, 96829, 96783, 96353, 95970, 96297, 97369, 98381, 98740, 98686, 98479, 97835, 96718, 95911, 96085, 96892, 97615, 98197, 99015, 100104, 101175, 102023, 102509, 102570, 102532, 102844, 103264, 102985, 101917, 101064, 101204, 101961, 102688, 103496, 104763, 106288, 107520, 108111, 107801, 106433, 104586, 103437, 103434, 103757, 103595, 103153, 102850, 102426, 101642, 101070, 101255, 101759, 101909, 101932, 102345, 102745, 102223, 100721, 99131, 98213, 98119, 98691, 99532, 100056, 100149, 100564, 102058, 104384, 106622, 108176, 108942, 108991, 108739, 109059, 110536, 112871, 115532, 118676, 122849, 128176, 134346]
54913A34346O572O188M673K640J271P21Jj366k713l549m233m904m981m256l425
54898A26985k969k519j848j461j586j607j117o17n60o05m50n25j072j441j033
54883A07575k58K34O07J369K351K887K744K287K047K427L511M783N443N270M720
54868A47997M163L515K733J968J104j38j487k343k808l619m755n188m404l240
54854A33498k703k752k827k742k508k012j453j384j860k200k071j998k262k203
54840A02523j257m0M43J28k71k94M5N60Q87O03p9k36N38J319R88k66j192j045
54822A03354k84J62p7n64n73O1O47N05o6k34N9M4n60j057q79k95K38O37P77M20
54802A02315o7J14Q32Q94j11r57n90K45K75k81k43N43J099R42N88M24J81l00o50
$$ y = [134346, 140918, 147106, 151779, 154419, 155690, 156411, 156412, 155046, 152333, 148784, 144551, 139647, 134666, 130410, 126985, 124016, 121497, 119649, 118188, 116602, 114995, 113878, 113261, 112701, 112096, 111646, 111121, 110049, 108608, 107575, 107317, 107551, 108158, 109527, 111878, 114765, 117509, 119796, 121843, 124270, 127781, 132564, 138007, 143277, 147997, 152160, 155675, 158408, 160376, 161480, 161342, 159855, 157512, 154704, 151085, 146330, 141142, 136738, 133498, 130795, 128043, 125216, 122474, 119966, 117954, 116501, 115117, 113257, 111057, 108986, 106988, 104726, 102523, 101266, 101226, 101669, 101797, 101526, 101232, 101277, 101837, 102724, 103327, 103248, 103012, 103550, 104869, 105857, 105591, 104399, 103354, 103070, 103232, 103155, 102591, 102018, 102079, 102726, 103231, 103165, 102931, 102990, 103034, 102474, 101417, 100538, 100243, 100481, 101118, 101895, 102315, 102248, 102362, 103194, 104088, 103977, 103020, 102430, 102675, 102950, 102669, 102426, 102969, 104068, 105010, 105598, 106022, 106203, 105903, 105253]
54783A05253n60k38k8K8J63O38J458K134K038J241O69R63J677K025J990K096K476
54766A24023K863L283L921M513M581M293M359N019N675N733N203M258K720M34
54752A80878k131m053m808m738m615m825n129n221n202n236m971l879k185r19
54738A22966p46j197j351r77n96o91j186j640j660j129k30P35J545K025K029J669
54722A19566J423J632K028K170K261K946M232N267N349M630L554K183M88j163
54708A56566k306k955l490m077m455m286l547k613j983j833j893j890j921k137
54694A17180k332k172j681j084m09L03O54L80n8l8J87j39r91j472j082k91K92
54677A07247N38M51k9o67r51p41l10K07Q03J055M92m79r14o97o55j133j443j042
$$ y = [105253, 104693, 104455, 104427, 104455, 104618, 105256, 106714, 108848, 110886, 112127, 112796, 113759, 115436, 117461, 119451, 121547, 124023, 126886, 130169, 134090, 138603, 143184, 147477, 151836, 156855, 162530, 168263, 173466, 177724, 180444, 180878, 178747, 174694, 169886, 165148, 160533, 155708, 150579, 145358, 140156, 134920, 129949, 126070, 123885, 122966, 122220, 121023, 119672, 118695, 118099, 117408, 116222, 114582, 112922, 111793, 111563, 112298, 113843, 115868, 117897, 119566, 120989, 122621, 124649, 126819, 129080, 132026, 136258, 141525, 146874, 151504, 155058, 157241, 157729, 156566, 154260, 151305, 147815, 143738, 139283, 134997, 131450, 128837, 126854, 125021, 123128, 121238, 119317, 117180, 114848, 112676, 110995, 109911, 109502, 109805, 110459, 110839, 110781, 110743, 110930, 110791, 109800, 108328, 107246, 106955, 107247, 107785, 108236, 108207, 107540, 106589, 105848, 105538, 105745, 106548, 107603, 108095, 107616, 106702, 106005, 105350, 104217, 102774, 101732]
54659A01732k92L07P50J039R27N42M35O52O12J80q4j9j57n38l97L65P00J13k93
54640A06574N07J759K073J410P55M29p1r00j564j698j338o25J41M15p2q75j351
54623A05569j219n03N14J020K44j241j762o76P15J050O62N53O36K72k85k86J00
54606A05363P2m00n81j58M38P88O75o8j158j656j010P3N88O05Q19J241J351J138
54588A08120R12M88m18j226j101l49n9m42n75Q7R83J328R49J40o18p89k40M40
54570A07630O34M88M78N54M08J70R2r9n83o63L17J645J942J037J3m68o51o47j73
54551A12124N05N53j59p83p62m22q3M68J240J715J680J614J862K098J942J497
54535A25089R82M34l9k75m79r87j509j383p15m30r45j522j385o85k5L45L39k41
$$ y = [101732, 101440, 101747, 102497, 103536, 104463, 105005, 105440, 106092, 106704, 106884, 106800, 106781, 106624, 106086, 105689, 106054, 106754, 106867, 106574, 107081, 108840, 110913, 112323, 113078, 113507, 113436, 112536, 110972, 109274, 107936, 107311, 107452, 107867, 107795, 106920, 105569, 104350, 103847, 104361, 105381, 105625, 104384, 102622, 101946, 102661, 103711, 104373, 104926, 105562, 105834, 105549, 105263, 105363, 105435, 105035, 104454, 104296, 104734, 105522, 106197, 106129, 104971, 103315, 102305, 102378, 102966, 103571, 104390, 105631, 106982, 108120, 109032, 109520, 109102, 107876, 106775, 106426, 106367, 105925, 105350, 105437, 106420, 107748, 108697, 108837, 108219, 107430, 107190, 107630, 108264, 108752, 109230, 109784, 110192, 110362, 110454, 110355, 109772, 109109, 109426, 111071, 113013, 114050, 114063, 113595, 112944, 112297, 112124, 112629, 113182, 113023, 112240, 111478, 111056, 110973, 111441, 112681, 114396, 116076, 117690, 119552, 121650, 123592, 125089, 126071, 126505, 126466, 126191, 125712, 124725, 123216, 121833, 121118, 120688, 119743, 118221, 116836, 116151, 116126, 116471, 116810, 116569]
54517A16569j189j645r78L62J385J640J314N87m63j483j896j530q07k10J68M32
54501A12256M50J3o06p08o8N73M04k43l19M10J045J012Q78J228J613J299M51k66
54483A19422p19j118j228o83J99P72J018J326J527J041k9p44m28O41J608J737
54467A24342R32l5j05P58J355Q13j94n37k91k85n51l85K30N43K60j93n85j039
54449A25033j315r62k59L1j30q8K62K78k69q58j164j368j313m89Q35J523J016
54432A20763P4l43j52K17N60Q26Q75O90M51K31M6Q0M02O37N10M17O79P06j09j034
54412A26526q85%K10l74l58P45J628J328O26M42L10l99r56l58R61J760J752J591
54394A34549J460Q48l17j247j142J4J431K040J312j30r82o38J89M05k47j149j603
$$ y = [116569, 115380, 113735, 112757, 113119, 114504, 116144, 117458, 118045, 117582, 116099, 114203, 112673, 111866, 111656, 111824, 112256, 112706, 112719, 112113, 111405, 111337, 111910, 112314, 112071, 111752, 112162, 113207, 114219, 115097, 116325, 117938, 119237, 119688, 119422, 118703, 117585, 116357, 115674, 115873, 116645, 117663, 118989, 120516, 121557, 121528, 120784, 120356, 120997, 122605, 124342, 125274, 125239, 125134, 125892, 127247, 128060, 127866, 127329, 127038, 126753, 126202, 125817, 126047, 126590, 126850, 126657, 126072, 125033, 123718, 122756, 122497, 122528, 122398, 122310, 122572, 122850, 122581, 121723, 120559, 119191, 117878, 117389, 118224, 119747, 120763, 120837, 120494, 120342, 120559, 121119, 121945, 122820, 123510, 123961, 124192, 124238, 124318, 124720, 125357, 125867, 126284, 126963, 127669, 127560, 126526, 125641, 125641, 125851, 125477, 125119, 125864, 127492, 128820, 129446, 129888, 130198, 129799, 128843, 128485, 129446, 131206, 132958, 134549, 136009, 136857, 136540, 135293, 134151, 134165, 135596, 137636, 138948, 138818, 137836, 137198, 137387, 137792, 137545, 136396, 134793]
54377A34793j435j028q41p62j34J156K115J835Q94N67R52J054O16M38P75Q39L11
54360A42145n6J45K12l14q01p09m58l30K51J452K218J815J229J797L268M323M397
54343A60584L853K965J808P87J81m05j381k343k763k900l238l543l370k982k786
54328A44467k435j530p51j048k006k211j135L40J281J568J425R65L97l0l97r10
54312A37990j348j304q41m23k88l75o57j009j015m85O6Jn64j037j161j033o14
54295A25903P9N71M20q6l01j25R4K63N27P89Q56Q86J045J075P91O41J018J374
54277A35820R23n2n31k74k5k15m16k36J22L88N93O61L59j51k56L12J120J674J971
54258A41787K199K297K091J591R84M65J04j66m30n33k43J99J04p18j503j474q50
$$ y = [134793, 133358, 132330, 131489, 130727, 130593, 131749, 133864, 135699, 136593, 137160, 138112, 139166, 139782, 140220, 140995, 141834, 142145, 142089, 142234, 142446, 142132, 141331, 140622, 140164, 139834, 140085, 141537, 143755, 145570, 146799, 148596, 151864, 156187, 160584, 164437, 167402, 169210, 169997, 170178, 169773, 168392, 166049, 163286, 160386, 157148, 153605, 150235, 147253, 144467, 142032, 140502, 139751, 138703, 136697, 134486, 133351, 133691, 134972, 136540, 137965, 138930, 139327, 139297, 138900, 137990, 136642, 135338, 134497, 134074, 133786, 133411, 132754, 131745, 130730, 130245, 130311, 130312, 129748, 128711, 127550, 126517, 125903, 125982, 126553, 126973, 126887, 126586, 126461, 126555, 126818, 127345, 128134, 128990, 129876, 130921, 131996, 132787, 133428, 134446, 135820, 136743, 136691, 136160, 135886, 135861, 135646, 135230, 134994, 135116, 135504, 136097, 136758, 137117, 136966, 136710, 137022, 138142, 139816, 141787, 143986, 146283, 148374, 149965, 150949, 151414, 151518, 151352, 150922, 150389, 150146, 150345, 150449, 149731, 148228, 146754, 145904]
54241A45904l86k84k58l57q72j504j490o71K09M40P3m10p09q36r61j160j157n21
54223A35050N88J246Q20j09m90j56K20K99L82O25P30N26K19p6m84r03r72n78K3
54204A36960N76Q69N46m66j399j231o9Q11M93n81j362j357p96q4M03L72j17o02
54186A32966o63l21J54O84J379K203K714K320R41o22j303r47m66n73q83o77j13
54169A36793Q8j53k11J78M98K52m38j156j602j573j059m59k63m10m07o3L33N89
54151A30937Q38J047Q88K65m49q86j019r14n14Q0N48P73J021J466J797J534O27
54134A38039m24r55o53K30J094J526J509J151N07j78m68l34l51p87r11M9J540
54117A40584K122J295J59m3O78J345J218L59o41j168j006m61O7N41J090J504J406
$$ y = [145904, 145518, 145234, 144976, 144619, 143747, 142243, 140753, 140082, 140291, 140731, 140804, 140394, 139685, 138849, 137888, 136728, 135571, 135050, 135638, 136884, 137704, 137595, 137105, 136949, 137169, 137468, 137850, 138475, 139205, 139731, 139950, 139874, 139390, 138487, 137515, 136937, 136960, 137536, 138405, 138951, 138485, 137086, 135855, 135786, 136597, 137090, 136509, 135147, 133790, 132994, 132910, 133313, 133685, 133568, 132966, 132303, 131982, 132136, 132820, 134199, 136402, 139116, 141436, 142377, 141755, 140452, 139505, 139039, 138466, 137583, 136906, 136793, 136881, 136728, 136517, 136695, 137193, 137445, 137007, 135851, 134249, 132676, 131617, 131158, 130895, 130485, 130078, 130015, 130348, 130937, 131775, 132822, 133710, 133975, 133526, 132640, 131621, 130707, 130193, 130273, 130821, 131594, 132615, 134081, 135878, 137412, 138039, 137615, 136660, 136007, 136237, 137331, 138857, 140366, 141517, 142024, 141846, 141378, 141044, 140693, 139906, 138995, 139044, 140584, 142706, 144001, 144160, 144117, 144795, 146140, 147358, 147717, 147076, 145908, 144902, 144441, 144508, 145049, 146139, 147643, 149049]
54100A49049Q94N62P00R35Q15L67q6l51l92j98J12K47Qm47o39j49R77K105K482
54081A56991J942R97J76l69m88J23J258J904J327J83k16M37J209J296Q62N03N75
54064A68710J190K180K948K902K339K256L083M160M773N133N837O710O808N486
54050B24515L100O33j150k142k612k664k132j065k6L97K68K50R04K202L634M605
54034B28717M931N100N795O949P622P105N840M780M221L762L110K374J752J433
54020B93491J614K081K074J114k67j275k002l047m261m793m462m129m455n049
54006B66634n190m864m655m902n258n017l902k621k282k973l448k720j395p36
53992B16671r18j195j372j901k655k871k418j987j827j400n77j01l79q13q87r76
$$ y = [149049, 149943, 150505, 151205, 152140, 152955, 153322, 153236, 152885, 152493, 152295, 152407, 152654, 152662, 152215, 151576, 151427, 152404, 154509, 156991, 158933, 159930, 160106, 159737, 159249, 159372, 160630, 162534, 163861, 164044, 163828, 164265, 165474, 166770, 167632, 168135, 168710, 169900, 172080, 175028, 177930, 180269, 182525, 185608, 189768, 194541, 199674, 205511, 212221, 219029, 224515, 227615, 228248, 227098, 224956, 222344, 219680, 217548, 216483, 216457, 216854, 217122, 217372, 218276, 220478, 224112, 228717, 233648, 238748, 244543, 251492, 259114, 266219, 272059, 276839, 281060, 284822, 287932, 290306, 292058, 293491, 295105, 297186, 299260, 300374, 300107, 298832, 296830, 293783, 289522, 284729, 280267, 276138, 271683, 266634, 261444, 256580, 251925, 247023, 241765, 236748, 232846, 230225, 227943, 224970, 221522, 218802, 217407, 216671, 215753, 214558, 213186, 211285, 208630, 205759, 203341, 201354, 199527, 198127, 197550, 197449, 197070, 196257, 195370, 194394]
53976A94394j488j945j670q58k80k05k09K15J140K132K546K176J583J474J800
53961B00805K024K098K473L167L711M015M459N007N070M495L750K961J657j39
53947B45553j499j716j072j55P32J251J044N49Q73K291L802M608N075N659N935
53932B72930N484M846M672M681M305L687L203K731K274K528L873N403O012N981
53918C32610O445P663Q887R635J0162J0844J1862J3350J5102J6438J7029J7422
53906D77449J7855J7056J3299O539j358q304j3059j5112j4764j3383j2499j2315
53894D41404j1914j0912j0042r940j0296j0517j0502j0374j0076r584r075q643
53882C19529q162p576o991o404n739n166m945m914m584l836l071k641k523k599
$$ y = [194394, 192906, 190961, 189291, 188433, 188153, 187948, 187739, 187954, 189094, 191226, 193772, 195948, 197531, 199005, 200805, 202829, 204927, 207400, 210567, 214278, 218293, 222752, 227759, 232829, 237324, 241074, 244035, 245692, 245553, 244054, 242338, 241266, 241111, 241843, 243094, 244138, 244687, 245560, 247851, 251653, 256261, 261336, 266995, 272930, 278414, 283260, 287932, 292613, 296918, 300605, 303808, 306539, 308813, 311341, 315214, 320617, 326629, 332610, 339055, 346718, 355605, 365240, 375402, 386246, 398108, 411458, 426560, 442998, 460027, 477449, 495304, 512360, 525659, 532198, 530840, 522536, 509477, 494365, 479601, 466218, 453719, 441404, 429490, 418578, 408536, 398596, 388300, 377783, 367281, 356907, 346831, 337247, 328172, 319529, 311367, 303791, 296800, 290396, 284657, 279491, 274546, 269632, 265048, 261212, 258141, 255500, 252977, 250378]
53868B50378k837l183l508l774l924l749l192k608k328k148j721j249j168j351
53854B13638j277r47q29r00o04P9L22l03j057j039m47j70n08r60j120j216j560
53837B01102j947j794q43M01J022N47n43j278j162n07J41N84Q90J039R40O58L76
53820A99626J31j84n38o23j54P85J742K287K354K229K258K578L057L470L733L980
53804B26731M335M728N116N793P030Q327Q560P295N509M417L930L012J430K25
53790B96438L05J310K182K270J578N24k40k23K69K79p32k317l738m683n071m787
53774B83364m122l862m332m867m755m349m460n026n172m490l552l071l092l232
53760B24982l199k969k656k379k124j768j275q11n88p11j155j677j794j190k50
$$ y = [250378, 247541, 244358, 240850, 237076, 233152, 229403, 226211, 223603, 221275, 219127, 217406, 216157, 214989, 213638, 212361, 211414, 210585, 209685, 209081, 209160, 209482, 209179, 208122, 207083, 206636, 206466, 205958, 204998, 203878, 202662, 201102, 199155, 197361, 196518, 196919, 197941, 198488, 197945, 196667, 195505, 194998, 195139, 195723, 196613, 197652, 198592, 199250, 199626, 199757, 199573, 199035, 198412, 198258, 199043, 200785, 203072, 205426, 207655, 209913, 212491, 215548, 219018, 222751, 226731, 231066, 235794, 240910, 246703, 253733, 262060, 270620, 277915, 283424, 287841, 291771, 294783, 296213, 296438, 296743, 298053, 300235, 302505, 304083, 304607, 304367, 304144, 304413, 304692, 303960, 301643, 297905, 293222, 288151, 283364, 279242, 275380, 271048, 266181, 261426, 257077, 252617, 247591, 242419, 237929, 234377, 231306, 228214, 224982, 221783, 218814, 216158, 213779, 211655, 209887, 208612, 207801, 207213, 206502, 205347, 203670, 201876, 200686, 200436]
53745B00436K66J19k40m88p47r71p18M2N72L70n6PL55L27r3l02n7L13N67Q22J178
53724B01702J503J654J616J489J454J602J712J534J371J758K392K164P78m82k78
53709B21969J041K101K381K483K823K999K539J578O99M93J181K268K835K588K287
53694B52265K695L522L937L720L233K625J865J196Q35M93j18o01m63p4j37n54
53678B74439p26p65j358k432k995k473j379m62M4J50j69p26j178j452j677j674
53662B55167j096q7O90P83K45n94j208r88Q0J037R55J24m64n05m32l37P5N32L18
53643B54295m96r21l99N74J421K125K680K768K403K167K401K761K826K572K020
53628B79197J128K85K21J114K302L161L678L961L845L337K888K846L049L189L238
$$ y = [200436, 200702, 200821, 200581, 200093, 199346, 198375, 197657, 197699, 198271, 198641, 198585, 198592, 198947, 199274, 199181, 198879, 198822, 199135, 199702, 200524, 201702, 203205, 204859, 206475, 207964, 209418, 211020, 212732, 214266, 215637, 217395, 219787, 221951, 222729, 222247, 221969, 223010, 225111, 227492, 229975, 232798, 235797, 238336, 239914, 240613, 241106, 242287, 244555, 247390, 249978, 252265, 254960, 258482, 262419, 266139, 269372, 271997, 273862, 275058, 275893, 276386, 276268, 275667, 275204, 275130, 274993, 274439, 273713, 272948, 271590, 269158, 266163, 263690, 262311, 261849, 261893, 262043, 261874, 261148, 259970, 258518, 256841, 255167, 254071, 253984, 254674, 255457, 255702, 255108, 253900, 252912, 252992, 254029, 254984, 255108, 254644, 254139, 253707, 253370, 253445, 253977, 254295, 253799, 252878, 252479, 253053, 254474, 256599, 259279, 262047, 264450, 266617, 269018, 271779, 274605, 277177, 279197, 280325, 280610, 280831, 281945, 284247, 287408, 291086, 295047, 298892, 302229, 305117, 307963, 311012, 314201, 317439]
53613C17439L386L813M550N204N103M192L440L602M032L659K842K859L716L943
53599C71780K957K122K772M391N554N630M741K966O10j418k430k799l319m114
53585C89443m756m983m717l860k668j886j980k580l103l393l380k743j520m99
53571C47375l60q19j120r63n02M4K88k22j222j602p30O19J324J383J497J688J307
53554C47985L14m11j96O57J408J694J703J860K404L162L721L879L762L494L163
53539C78599L160L923N196O080O237O363P018P674P614P203P416Q449R673J0723
53525D75328J1813J2960J3694J3804J3703J3824J4081J4183J4209J4543J5458
53514F27600J6882J8602K0429K2125K3236K3346K2656K2097K2458K3533K4437
$$ y = [317439, 320825, 324638, 329188, 334392, 339495, 343687, 347127, 350729, 354761, 358420, 361262, 364121, 367837, 371780, 374737, 376859, 379631, 384022, 389576, 395206, 399947, 402913, 403523, 402105, 399675, 396876, 393557, 389443, 384687, 379704, 374987, 371127, 368459, 366573, 364593, 362013, 358910, 355517, 352137, 349394, 347874, 347375, 347015, 346196, 345076, 344113, 343611, 343655, 343943, 343721, 342499, 340897, 340167, 340786, 342110, 343493, 344990, 346678, 347985, 348299, 347888, 347692, 348349, 349757, 351451, 353154, 355014, 357418, 360580, 364301, 368180, 371942, 375436, 378599, 381759, 385682, 390878, 396958, 403195, 409558, 416576, 424250, 431864, 439067, 446483, 454932, 464605, 475328, 487141, 500101, 513795, 527599, 541302, 555126, 569207, 583390, 597599, 612142, 627600, 644482, 663084, 683513, 705638, 728874, 752220, 774876, 796973, 819431, 842964, 867401]
53503H67401K4674K4442K4039K3489K2784K1951K0863J9445J8071J7239J6826
53492A101224J6316J5724J5577J5983J6425J6631J6824J7014J6904J6622J6692
53481A281936J7038J6997J6535J6341J6359J5430J2983R996P500N252K670O9k115
53468A416991m346p108r778j1534j2763j4302j5823j6229j5411j4444j4235j4925
53456A266093j6374j8284j9955k0833k1131k1243k0938j9937j8820j8384j8434
53445A051760j8205j7568j6864j5892j4196j2050j0046q047n746l910l567m097
53433I21572l711j928n3J088K255L983N288N263M830N654P922J0301J1732J2400
53419I86596J3133J4532J6672J9106K1186K2598K3513K4222K4951K6115K8184
$$ y = [867401, 892075, 916517, 940556, 964045, 986829, 1008780, 1029643, 1049088, 1067159, 1084398, 1101224, 1117540, 1133264, 1148841, 1164824, 1181249, 1197880, 1214704, 1231718, 1248622, 1265244, 1281936, 1298974, 1315971, 1332506, 1348847, 1365206, 1380636, 1393619, 1403615, 1411115, 1416367, 1419037, 1419106, 1416991, 1412645, 1405537, 1395759, 1384225, 1371462, 1357160, 1341337, 1325108, 1309697, 1295253, 1281018, 1266093, 1249719, 1231435, 1211480, 1190647, 1169516, 1148273, 1127335, 1107398, 1088578, 1070194, 1051760, 1033555, 1015987, 999123, 983231, 969035, 956985, 946939, 938892, 933146, 929236, 925669, 921572, 917861, 915933, 915880, 916968, 919223, 923206, 928494, 933757, 938587, 944241, 952163, 962464, 974196, 986596, 999729, 1014261, 1030933, 1050039, 1071225, 1093823, 1117336, 1141558, 1166509, 1192624, 1220808]
53408A220808L0970L3467L4854L5394L6080L7580L9813M2305M4623M6523M7936
53397A650353M8919M9656N0523N1866N3560N4895N5248N4724N3855N2916N1845
53386B228360N0634M9258M7422M4913M2153L9850L8085L6189L3439K9439K4109
53375B663851J7984J2408Q514N854K742j854p494j3446j9775k6706l3653l9663
53363B568762m4474m8387n1304n2637n2369n1576n1440n1935n1937n0646m8486
53352B013571m6278m4085m1545l9215l8478l9720m1475m2097m1645m1265m1197
53341A556571m0446l8327l5369l2551l0355k8683k7144k5253k2826k0297j8310
53330A237010j7037j6208j5599j5045j4304j3471j3175j3702j4189j3528j1884
$$ y = [1220808, 1251778, 1285245, 1320099, 1355493, 1391573, 1429153, 1468966, 1511271, 1555894, 1602417, 1650353, 1699272, 1748928, 1799451, 1851317, 1904877, 1959772, 2015020, 2069744, 2123599, 2176515, 2228360, 2278994, 2328252, 2375674, 2420587, 2462740, 2502590, 2540675, 2576864, 2610303, 2639742, 2663851, 2681835, 2694243, 2702757, 2708611, 2711353, 2709499, 2702005, 2688559, 2668784, 2642078, 2608425, 2568762, 2524288, 2475901, 2424597, 2371960, 2319591, 2268015, 2216575, 2164640, 2112703, 2062057, 2013571, 1967293, 1923208, 1881663, 1842448, 1803970, 1764250, 1722775, 1680678, 1639033, 1597768, 1556571, 1516125, 1477798, 1442429, 1409878, 1379523, 1350840, 1323696, 1298443, 1275617, 1255320, 1237010, 1219973, 1203765, 1188166, 1173121, 1158817, 1145346, 1132171, 1118469, 1104280, 1090752, 1078868]
53319A078868j0459r842r479q739p601o157m350k361o01R19K451L799M517M899
53305A035864N847P638R652J1493J3391J5295J6635J7416J8540K0540K2715K4174
53293A219200K4970K5709K6648K7720K8754K9221K8344K6071K3348K1035J9087
53282A500107J7195J5462J3924J2113R721P097M513J540k188o110r381j1859j3829
53269A538305j5295j6272j7379j9301k1874k4262k5831k6393k6010k5184k4797
53258A295707k5309k6238k6903k7252k7375k6865k5533k4243k4082k4869k5458
53247A011580k5359k5106k5072k4975k4685k4588k4738k4459k3262k1660k0476
53236G47200j9721j8675j6968j5115j3882j3331j2840j1924j0856j0151r782r386
$$ y = [1078868, 1068409, 1058567, 1049088, 1040349, 1032748, 1026591, 1022241, 1019880, 1019279, 1020198, 1022649, 1026448, 1030965, 1035864, 1041711, 1049349, 1059001, 1070494, 1083885, 1099180, 1115815, 1133231, 1151771, 1172311, 1195026, 1219200, 1244170, 1269879, 1296527, 1324247, 1353001, 1382222, 1410566, 1436637, 1459985, 1481020, 1500107, 1517302, 1532764, 1546688, 1558801, 1568522, 1575619, 1580132, 1581672, 1579484, 1573374, 1563993, 1552134, 1538305, 1523010, 1506738, 1489359, 1470058, 1448184, 1423922, 1398091, 1371698, 1345688, 1320504, 1295707, 1270398, 1244160, 1217257, 1190005, 1162630, 1135765, 1110232, 1085989, 1061907, 1037038, 1011580, 986221, 961115, 936043, 911068, 886383, 861795, 837057, 812598, 789336, 767676, 747200, 727479, 708804, 691836, 676721, 662839, 649508, 636668, 624744, 613888, 603737, 593955, 584569]
53224E84569r084r331r903r899r222r153j0660j2809j3860j3470j2761j2427j1941
53211D40049j0767r317q323p961p965p992p594o417m834l852m022m831n441n677
53197C45056n869o162o399o410o041n103l747k639k407k906l416l487l254k996
53183B84220k757k514k360k313k168j769j279r75q93r24j154j716k323k328j566
53168B57181p75q37j671k348k184j378n68j60k23o45j079j093n99m1P1l21q65
53151B42465j150r37l35J14j74j096j817j746j252j060j218j121m64L51Q09Q26
53135B32195O00K97O2J09N01J011J302J214P98K15k92m82l58k55m69q42r25n76
53117B34105j82m1J14P29J618K077J823J397J316J276O29n53j445j499j088r78
$$ y = [584569, 575485, 566154, 556251, 546352, 537130, 527977, 517317, 504508, 490648, 477178, 464417, 451990, 440049, 429282, 419965, 411642, 403681, 395716, 387724, 380130, 373713, 368879, 365027, 361005, 356174, 350733, 345056, 339187, 333025, 326626, 320216, 314175, 309072, 305325, 302686, 300279, 297373, 293957, 290470, 287216, 284220, 281463, 278949, 276589, 274276, 272108, 270339, 269060, 268085, 267192, 266268, 265114, 263398, 261075, 258747, 257181, 256406, 255569, 253898, 251550, 249366, 247988, 247420, 247260, 247037, 246392, 245313, 244220, 243621, 243580, 243651, 243330, 242465, 241315, 240378, 240043, 240157, 239983, 238887, 237070, 235324, 234072, 233012, 231794, 230673, 230209, 230560, 231369, 232195, 232795, 233092, 233154, 233263, 233764, 234775, 236077, 237291, 238089, 238304, 238012, 237530, 237172, 236917, 236448, 235606, 234681, 234105, 233923, 233882, 233996, 234725, 236343, 238420, 240243, 241640, 242956, 244232, 244861, 244308, 242863, 241364, 240276, 239298]
53101B39298j494k291k762k551j808j008m98k83l18o56j159j335q72j00M51O78
53085B23292P25M38l42j105j059j64P95J269J375J202M65q02j878k129j696j071
53069B19315m84m5Ol42n64j55P47J525J720J286N30p6k14j08j95m31l21K42P07
53050B23143O78M74N52Q11Q28M31k46q90j056n71m0l62j425k059j653j052j208
53033B16355j670j359k76N12M22j8o2L69Q29Q41K86l17j24J103K519K991K197
53016B24598O85q07j714j818j504j501j871j758o21P73J321J052Q04Q32P02L30
53000B19503J14J43J07R4N41J325J684J243M01l25o71l46Q10K141K542J793Q51
52983B31950N01M94L35K07M74Q63Q28M37K40L94N09L20R8K10O24J047J408J943
$$ y = [239298, 237804, 235513, 232751, 230200, 228392, 227384, 226886, 226603, 226285, 225629, 224470, 223135, 222263, 222163, 222614, 223292, 224017, 224455, 224113, 223008, 221949, 221785, 222580, 223849, 225224, 226426, 226891, 226089, 224211, 222082, 220386, 219315, 218831, 218786, 218792, 218450, 217886, 217731, 218478, 220003, 221723, 223009, 223539, 223463, 223249, 223141, 222946, 222515, 222194, 222436, 223143, 223821, 224295, 224847, 225658, 226486, 226917, 226671, 225781, 224725, 224154, 224114, 223752, 222327, 220268, 218615, 217563, 216355, 214685, 213326, 213050, 213562, 213984, 213966, 213904, 214273, 215102, 215943, 216229, 215912, 215788, 216891, 219410, 222401, 224598, 225283, 224476, 222762, 220944, 219440, 217939, 216068, 214310, 213689, 214462, 215783, 216835, 217639, 218471, 219173, 219503, 219617, 219760, 219867, 219961, 220502, 221827, 223511, 224754, 225155, 224830, 224159, 223813, 224623, 226764, 229306, 231099, 231950, 232451, 232945, 233280, 233487, 233961, 234824, 235652, 236089, 236329, 236723, 237232, 237552, 237650, 237860, 238484, 239531, 240939, 242882]
52965B42882K665L033K493J338N36N65Q68P50K59k58r18j940k871k989k312j517
52949B42584r64n27k83n53j259j913k325k581k380j277K64J005M73m15o67m34
52933B28748m48q65j283j373j027k79M96O71Q2p07j202j630k328k975k933k056
52917B10891p04P35J876K255J800J104P13L18p51k245k922j907K23J984K400J729
52901B17499R25N74M72J99j71k57r6j67n82p81l64K96O35P20J014J494J650J320
52883B24380R75J038J246R91J27q02j148q72n47n57n79o8Q25J335J103O36N32
52866B28615P28Q19P94R24J183J207Q74M54J92J5k44n82q31q22n86m08o34j238
52848B30460j775j920j900k151k697l117l034k409j471o47m66j127k104k529k085
$$ y = [242882, 245547, 248580, 251073, 252411, 252947, 253512, 254380, 255130, 255389, 255131, 254213, 252273, 249402, 246413, 244101, 242584, 241620, 241093, 240810, 240257, 238998, 237085, 234760, 232179, 229799, 228522, 228786, 229791, 230264, 229849, 229182, 228748, 228300, 227435, 226152, 224779, 223752, 223473, 223969, 224640, 224722, 224015, 222813, 221183, 218855, 215880, 212947, 210891, 210187, 210922, 212798, 215053, 216853, 217957, 218670, 218988, 218237, 215992, 213070, 211163, 211386, 213370, 215770, 217499, 218424, 218998, 219470, 219669, 219498, 219241, 219145, 218978, 218396, 217615, 217251, 217547, 218182, 218902, 219916, 221410, 223060, 224380, 225355, 226393, 227639, 228630, 228757, 227955, 226807, 225935, 225388, 224831, 224252, 224184, 225009, 226344, 227447, 228083, 228615, 229343, 230162, 230956, 231880, 233063, 234270, 235144, 235598, 235790, 235805, 235561, 234979, 234148, 233326, 232740, 232332, 231698, 230460, 228685, 226765, 224865, 222714, 220017, 216900, 213866, 211457, 209986, 209339, 208873, 207746, 205642, 203113, 201028]
52833B01028j312r00r07q35l13N09J241J696J980K167J980J064l54j336j146j88
52817B04374L29j71r55r94k39N24R01J283J986K576K475J836J331J151P26m74
52801B16659k084l020k562j209l61r06k145k510j433m0L27k51o90n28k04J20Q47
52784B00010J889K271J429J48m12j02M84J053J671K105J966J365Q00M52J16k99
52768B14946p54j323j909j941j028J89N99K5o56q27p65q56r42p68m61j78J94O19
52750B04164P04K47l48n90m59j60L37J112J899K294K221J971J825J832J836J630
52734B20515J239J059J508K452L220L246K501J365M00J04M69O73j77j846k980
52719B33748k652j417n22m45p10p72n70l36l21o86j334j816j679r64k16L6k59
$$ y = [201028, 199716, 198816, 197909, 197074, 196761, 197270, 198511, 200207, 202187, 204354, 206334, 207398, 207044, 205708, 204562, 204374, 204703, 204532, 203577, 202583, 202344, 202868, 203769, 205052, 207038, 209614, 212089, 213925, 215256, 216407, 217133, 216659, 214575, 211555, 208993, 207784, 207423, 206517, 204372, 201862, 200429, 200389, 200716, 200465, 199775, 199247, 199043, 199163, 200010, 201899, 204170, 205599, 205747, 205335, 205233, 205717, 206770, 208441, 210546, 212512, 213877, 214677, 215129, 215245, 214946, 214192, 212869, 210960, 209019, 207991, 208180, 208779, 208804, 208148, 207321, 206556, 205700, 204758, 203990, 203529, 203351, 203545, 204164, 204868, 205115, 204767, 204177, 203718, 203558, 203895, 205007, 206906, 209200, 211421, 213392, 215217, 217049, 218885, 220515, 221754, 222813, 224321, 226773, 229993, 233239, 235740, 237105, 237505, 237609, 238078, 238751, 238574, 236728, 233748, 231096, 229679, 229157, 228712, 228002, 227230, 226660, 226324, 226003, 225317, 223983, 222167, 220488, 219524, 219308, 219344, 219085]
52702B19085o97q05m36J37N30N74L45K6o9M15J393K123J876R00J62J75M99N46
52684B26779L52K35K21J73K11M49N76J34p86j543j676j332r09n44j35K50K87j50
52666B22592o48o44j35L26M41N53R63J298J065N29M11Q53J296J390J405J598J785
52649B35078J718J433R95K86o43j381j523j067l16L29N21K18j85k89k51m83r58
52632B33482j256j242j068n99M56J695K238J970J789K167K336J424k14j516k002
52617B39660j923j529r24l69r1Q7M23P81Q98Q60Q70P26J24p25j191r84l58L44
52599B36679R54J362J480J334J035O93M66N05O97O87L58N9J05K94J71l94j080
52582B45405j400r95J12J378K102K079J665J201P18K82J15J71J06j34k03r2l52
$$ y = [219085, 218388, 217583, 217147, 217284, 217814, 218388, 218733, 218759, 218690, 219105, 220498, 222621, 224497, 225397, 225559, 225734, 226233, 226779, 227131, 227366, 227587, 227760, 227971, 228420, 228996, 229130, 228344, 226801, 225125, 223793, 222884, 222340, 222205, 222455, 222742, 222592, 221944, 221300, 221165, 221491, 221932, 222485, 223448, 224746, 225811, 226340, 226751, 227604, 228900, 230290, 231695, 233293, 235078, 236796, 238229, 239224, 239510, 238867, 237486, 235963, 234896, 234580, 234909, 235430, 235648, 235463, 235174, 234923, 234440, 233482, 232226, 230984, 229916, 229317, 229773, 231468, 233706, 235676, 237465, 239632, 241968, 243392, 243178, 241662, 239660, 237737, 236208, 235284, 234915, 234824, 234911, 235334, 236115, 237013, 237873, 238743, 239469, 239593, 238868, 237677, 236693, 236335, 236679, 237633, 238995, 240475, 241809, 242844, 243537, 244003, 244508, 245205, 245892, 246250, 246309, 246414, 246708, 246879, 246485, 245405, 244005, 243010, 243122, 244500, 246602, 248681, 250346, 251547, 252265, 252547, 252662, 252833, 252939, 252805, 252602, 252510, 252158]
52565B52158j239k139k352j948j404r00m07n0J00K12K55j64j037j563j124j76
52549B38222M54O77Q40Q51M46L4K96J064J419R35J08m49n80l22K37P17O62J49
52531B45760k39j69J24L10L52L11J09l46r55j402j355q06k87l59q20q70k04N72
52513B39726R15J067J406J731J838K149K948L621L561L330L810M476L772J275
52499B75625j639l438l895l662l270k931k661k250j533q23o14q68j074j067j064
52484B44836r64l48O44J188Q58K53J74O33J038J006O99N06N93O60K14o77j174
52467B50139n65Q23K040K644K866K893K717K634L077L854M134L417J955K62j259
52452B81631k211k400k245k401k863k991k466j611p81j20Q9m11j202j470j083
$$ y = [252158, 250919, 248780, 246428, 244480, 243076, 242176, 241769, 241719, 241819, 242031, 242286, 242122, 241085, 239522, 238398, 238222, 238676, 239353, 240193, 241044, 241490, 241524, 241820, 242884, 244303, 245238, 245346, 244897, 244317, 243995, 244232, 244949, 245611, 245760, 245521, 245352, 245476, 245786, 246138, 246449, 246558, 246212, 245257, 243855, 242500, 241694, 241407, 241048, 240228, 239358, 239154, 239726, 240641, 241708, 243114, 244845, 246683, 248832, 251780, 255401, 258962, 262292, 266102, 270578, 274350, 275625, 273986, 270548, 266653, 262991, 259721, 256790, 254129, 251879, 250346, 249523, 248909, 248041, 246967, 245900, 244836, 243872, 243524, 244168, 245356, 246214, 246467, 246641, 247274, 248312, 249318, 250017, 250523, 251116, 251776, 251990, 251313, 250139, 249574, 250397, 252437, 255081, 257947, 260840, 263557, 266191, 269268, 273122, 277256, 280673, 282628, 282890, 281631, 279420, 277020, 274775, 272374, 269511, 266520, 264054, 262443, 261662, 261542, 261631, 261220, 260018, 258548, 257465]
52437B57465p42q59j046r29p17o59o35o05q45j339j587j312p90k05O49J678K204
52420B49726J824J037O18P86J367K206L014L334L123K951L224L674L941M198M790
52405B89813N784P160Q915J0474J0541Q168L789j167n320p831q439p652o554n933
52391C01748n703n334m550l339j868o13j14k27j53M18Q70P51O41J273K339K955
52375B89094K911K746K801K895K881K872L079L697M848O213O985O612N324L687
52361C46645K025N87k21m00o70j565k534k603j613k18J052K015K405K111J705
52346C48721J954K716L054K531J836J919K971M428N546N950N871N910O327O736
52332D06470O857P190Q456J0545J2661J4377J5826J6951J7435J7564J8305K0086
$$ y = [257465, 256723, 255864, 254818, 253889, 253172, 252513, 251878, 251273, 250428, 249089, 247502, 246190, 245400, 245195, 245844, 247522, 249726, 251550, 252587, 253205, 253991, 255358, 257564, 260578, 263912, 267035, 269986, 273210, 276884, 280825, 285023, 289813, 295597, 302757, 311672, 322146, 332687, 340855, 344644, 343477, 338157, 330326, 321887, 314235, 307681, 301748, 296045, 290711, 286161, 282822, 280954, 280341, 280227, 280000, 279847, 280265, 281135, 281886, 282527, 283800, 286139, 289094, 292005, 294751, 297552, 300447, 303328, 306200, 309279, 312976, 317824, 324037, 331022, 337634, 342958, 346645, 348670, 349257, 349036, 348636, 347966, 346401, 343867, 341264, 339651, 339433, 340485, 342500, 344905, 347016, 348721, 350675, 353391, 356445, 358976, 360812, 362731, 365702, 370130, 375676, 381626, 387497, 393407, 399734, 406470, 413327, 420517, 428973, 439518, 452179, 466556, 482382, 499333, 516768, 534332, 552637, 572723]
52320E72723K2030K2881K2319K1030J9795J8908J8228J7376J6040J4410J3152
52309G78892J2716J2795J2749J2423J2171J2097J1720J0551Q808P264O450O285
52297I04921O386O443O139N030K935K77k238m312o126p787r032r583r524r135
52283H74394q571p726o347m304j939O2J496L059N406P938R321R331R273J0300
52269I01693J2068J3535J4368J4854J5070J4889J4468J3963J3033J1353R459Q420
52257A057173Q616R426J0002R881R017P779O839O546O369N449L671J709R9j270
52243A141306k775m619o729q658r644r322q307p642p661p858p748p290o477n232
52229A041344l830k836k325j759q05K16R74J612K255K542K251J990K629M146N597
$$ y = [572723, 594753, 617634, 639953, 660983, 680778, 699686, 717914, 735290, 751330, 765740, 778892, 791608, 804403, 817152, 829575, 841746, 853843, 865563, 876114, 884922, 892186, 898636, 904921, 911307, 917750, 923889, 928919, 931854, 932131, 929893, 925581, 919455, 911668, 902636, 893053, 883529, 874394, 865823, 858097, 851750, 847446, 845507, 845569, 847065, 850124, 855530, 863468, 872789, 882120, 891393, 901693, 913761, 927296, 941664, 956518, 971588, 986477, 1000945, 1014908, 1027941, 1039294, 1048753, 1057173, 1065789, 1075215, 1085217, 1095098, 1104115, 1111894, 1118733, 1125279, 1131648, 1137097, 1140768, 1142477, 1142576, 1141306, 1138531, 1133912, 1127183, 1118525, 1108881, 1099559, 1091252, 1083610, 1075949, 1068091, 1060343, 1053053, 1046576, 1041344, 1037514, 1034678, 1032353, 1030594, 1029789, 1030005, 1030979, 1032591, 1034846, 1037388, 1039639, 1041629, 1044258, 1048404, 1054001]
52214A054001O257O318O344O475O492O401O564P128P714P822P425O919O534O145
52200A148539N621N069M591M136L774L827M435N199N601N590N449N255M816M136
52186A216038L503L027K422J348j44j741l292m957o864q670r699r661r030q520
52172A163760q285p988p556p285p162o627n334l635k073q42L3M87P63J369K223
52157A111848K499J889J304J601K145J724M63l86m33o81j814l054l255k335j072
52142A110443r0L78J95n78j542k263k561k295j236N06K267L449M265N518P686
52127A124142J0497J3285J5652J7694J9768K2018K4187K5861K6820K7151K7166
52116A354241K7315K7827K8196K7364K4884K1673J9127J7578J6156J4034J1188
$$ y = [1054001, 1060258, 1066576, 1072920, 1079395, 1085887, 1092288, 1098852, 1105980, 1113694, 1121516, 1128941, 1135860, 1142394, 1148539, 1154160, 1159229, 1163820, 1167956, 1171730, 1175557, 1179992, 1185191, 1190792, 1196382, 1201831, 1207086, 1211902, 1216038, 1219541, 1222568, 1224990, 1226338, 1226194, 1224453, 1221161, 1216204, 1209340, 1200670, 1190971, 1181310, 1172280, 1163760, 1155475, 1147487, 1139931, 1132646, 1125484, 1118857, 1113523, 1109888, 1107815, 1106973, 1107006, 1107493, 1108256, 1109625, 1111848, 1114347, 1116236, 1117540, 1119141, 1121286, 1123010, 1123473, 1123087, 1122654, 1121973, 1120159, 1117105, 1113850, 1111515, 1110443, 1110353, 1110731, 1110926, 1110348, 1108806, 1106543, 1103982, 1101687, 1100451, 1100957, 1103224, 1106673, 1110938, 1116456, 1124142, 1134639, 1147924, 1163576, 1181270, 1201038, 1223056, 1247243, 1273104, 1299924, 1327075, 1354241, 1381556, 1409383, 1437579, 1464943, 1489827, 1511500, 1530627, 1548205, 1564361, 1578395, 1589583]
52105A589583P975M650J574o94j891k313k373k254k196k685l983n639o840p245
52091A565669p302p832r293j1310j2913j3439j3162j2774j2376j1382r414o871
52079A437601m427k391o01J354L842O741R205J0364J0439J0665J1933J3914J5742
$$ y = [1589583, 1597558, 1602208, 1603782, 1603088, 1601197, 1598884, 1596511, 1594257, 1592061, 1589376, 1585393, 1579754, 1572914, 1565669, 1558367, 1550535, 1541242, 1529932, 1517019, 1503580, 1490418, 1477644, 1465268, 1453886, 1444472, 1437601, 1433174, 1430783, 1430182, 1431536, 1435378, 1442119, 1451324, 1461688, 1472127, 1482792, 1494725, 1508639, 1524381]
$$ [...]
##END NTUPLES=NMR SPECTRUM
##END=
