
##TITLE=AC1315_SZAAH12144_6535185_1MADbvUZYa
##JCAMPDX= 6.0         $$ Bruker NMR JCAMP-DX V2.0
##DATA TYPE= NMR SPECTRUM
##DATA CLASS= NTUPLES
##ORIGIN= BRUKER
##OWNER= Administrator
$$ 1.72 TOPSPIN		Version 2.1
$$ 2012-07-17 20:12:38.093 -0500  Administrator@TOPSPIN
$$ Compression mode = diff/dup
##.OBSERVE FREQUENCY= 400.02188249412
##.OBSERVE NUCLEUS= ^1H
##.ACQUISITION MODE= SIMULTANEOUS (DQD)
##.ACQUISITION SCHEME= undefined
##.AVERAGES= 8
##.DIGITISER RES= 22
##SPECTROMETER/DATA SYSTEM= spect
##.PULSE SEQUENCE= zg30
##.SOLVENT NAME= COFFEE_meoh
##.SHIFT REFERENCE= INTERNAL, COFFEE_meoh, 1, 14.98509
##AUDIT TRAIL= $$ (NUMBER, WHEN, WHO, WHERE, PROCESS, VERSION, WHAT)
$$ ##TITLE= Audit trail, TOPSPIN		Version 2.1
$$ ##JCAMPDX= 5.01
$$ ##ORIGIN= Bruker BioSpin GmbH
$$ ##OWNER= Administrator
$$ $$ C:\Bruker\TOPSPIN/data/COFFEE/nmr/AC1315_SZAAH12144_6535185_1MADbvUZYa/10/pdata/1/auditp.txt
$$ ##AUDIT TRAIL=  $$ (NUMBER, WHEN, WHO, WHERE, PROCESS, VERSION, WHAT)
(   1,<2012-07-17 20:12:31.250 -0500>,<Administrator>,<TOPSPIN>,<go>,<TOPSPIN 2.1>,
      <created by zg
	started at 2012-07-17 20:11:24.640 -0500,
	POWCHK enabled, PULCHK disabled,
       configuration hash MD5:
       6B 1B 68 BB D9 2E 58 E2 7F 35 AD 54 07 DF 0E 41
       data hash MD5: 64K
       5B 33 13 4E 4B 91 3D 2A 38 A4 31 42 27 56 E8 B6>)
(   2,<2012-07-17 20:12:33.968 -0500>,<Administrator>,<TOPSPIN>,<proc1d>,<TOPSPIN 2.1>,
      <Start of raw data processing
       efp LB = 0 FT_mod = 6 PKNL = 1 PHC0 = 0 PHC1 = 0 SI = 32K 
       data hash MD5: 32K
       28 0C AF 12 AE C1 2E 06 4A 35 23 CF DB F3 CC FF>)
(   3,<2012-07-17 20:12:34.375 -0500>,<Administrator>,<TOPSPIN>,<proc1d>,<TOPSPIN 2.1>,
      <pk PHC0 = 179.3079 PHC1 = 0 
       data hash MD5: 32K
       8A 7F C3 37 90 96 AC 31 AC BB A8 63 3F EC DD 10>)
(   4,<2012-07-17 20:12:34.484 -0500>,<Administrator>,<TOPSPIN>,<proc1d>,<TOPSPIN 2.1>,
      <abs ABSG = 1 
       data hash MD5: 32K
       4C 19 DF 44 F8 E0 30 FA 37 5D F3 63 7D 2B 7A 8C>)
(   5,<2012-07-17 20:12:34.515 -0500>,<Administrator>,<TOPSPIN>,<proc1d>,<TOPSPIN 2.1>,
      <abs ABSG = 2 
       data hash MD5: 32K
       04 87 15 70 59 36 DC BC 20 77 72 F4 92 DA 46 AD>)
(   6,<2012-07-17 20:12:34.546 -0500>,<Administrator>,<TOPSPIN>,<proc1d>,<TOPSPIN 2.1>,
      <abs ABSG = 3 
       data hash MD5: 32K
       A9 D6 E4 3B 29 11 7D 33 3B 4D 6F 9F 07 41 91 E4>)
(   7,<2012-07-17 20:12:34.578 -0500>,<Administrator>,<TOPSPIN>,<proc1d>,<TOPSPIN 2.1>,
      <abs ABSG = 4 
       data hash MD5: 32K
       87 7F A7 9A EA 17 B6 E6 9A A9 BE 6B 5A 07 37 DB>)
(   8,<2012-07-17 20:12:34.609 -0500>,<Administrator>,<TOPSPIN>,<proc1d>,<TOPSPIN 2.1>,
      <abs ABSG = 5 
       data hash MD5: 32K
       52 90 73 CA 79 3E 21 58 2F D7 32 4B 68 4E E7 3A>)
$$ ##END=
$$ 
$$ $$ hash MD5
$$ $$ 6A A6 6E 11 38 6B A3 33 DE A1 97 F4 C7 B6 99 F5
##$RELAX= 
##$RELAX= 
##$RELAX= 
##$RELAX= 
##$RELAX= 
##$RELAX= 
##$RELAX= 
$$ Bruker specific parameters
$$ --------------------------
$$ [...]
150 150 150 150 150 150 150 150
##$TP07= 0
##$TPNAME0= <>
##$TPNAME1= <>
##$TPNAME2= <>
##$TPNAME3= <>
##$TPNAME4= <>
##$TPNAME5= <>
##$TPNAME6= <>
##$TPNAME7= <>
##$TPOAL= (0..7)
0.5 0.5 0.5 0.5 0.5 0.5 0.5 0.5
##$TPOFFS= (0..7)
0 0 0 0 0 0 0 0
##$TUNHIN= 0
##$TUNHOUT= 0
##$TUNXOUT= 0
##$USERA1= <user>
##$USERA2= <user>
##$USERA3= <user>
##$USERA4= <user>
##$USERA5= <user>
##$V9= 5
##$VALIST= <valist>
##$VCLIST= <CCCCCCCCCCCCCCC>
##$VD= 0
##$VDLIST= <DDDDDDDDDDDDDDD>
##$VPLIST= <PPPPPPPPPPPPPPP>
##$VTLIST= <TTTTTTTTTTTTTTT>
##$WBST= 2048
##$WBSW= 25
##$XGAIN= (0..3)
0 0 0 0
##$XL= 0
##$YL= 0
##$YMAX_a= 505244
##$YMIN_a= -646415
##$ZGOPTNS= <>
##$ZL1= 120
##$ZL2= 120
##$ZL3= 120
##$ZL4= 120
##$ABSF1= 14.98509
##$ABSF2= -5.573092
##$ABSG= 5
##$ABSL= 3
##$ALPHA= 0
##$AQORDER= 0
##$ASSFAC= 0
##$ASSFACI= 0
##$ASSFACX= 0
##$ASSWID= 0
##$AUNMP= <proc_prof1d_extract_pilot.lims>
##$AXLEFT= 0
##$AXNAME= <>
##$AXNUC= <1H>
##$AXRIGHT= 0
##$AXTYPE= 0
##$AXUNIT= <>
##$AZFE= 0.1
##$AZFW= 0.1
##$BCFW= 0
##$BC_mod= 0
##$BYTORDP= 0
##$COROFFS= 0
##$CY= 15
##$DATMOD= 1
##$DC= 0
##$DFILT= <>
##$DTYPP= 0
##$F1P= 0
##$F2P= 0
##$FCOR= 0.5
##$FTSIZE= 32768
##$FT_mod= 6
##$GAMMA= 0
##$GB= 0
##$INTBC= 1
##$INTSCL= 1
##$ISEN= 128
##$LB= 0
##$LEV0= 0
##$LPBIN= 0
##$MAXI= 10000
##$MC2= 0
##$MEAN= 0
##$ME_mod= 0
##$MI= 0
##$NCOEF= 0
##$NC_proc= -8
##$NLEV= 6
##$NOISF1= 0
##$NOISF2= 0
##$NSP= 0
##$NTH_PI= 0
##$NZP= 0
##$OFFSET= 14.98509
##$PC= 1
##$PHC0= 179.3079
##$PHC1= 0
##$PH_mod= 1
##$PKNL= yes
##$PPARMOD= 0
##$PPDIAG= 0
##$PPIPTYP= 0
##$PPMPNUM= 2147483647
##$PPRESOL= 1
##$PSCAL= 4
##$PSIGN= 0
##$PYNMP= <proc.py>
##$REVERSE= no
##$SF= 400.02
##$SI= 32768
##$SIGF1= 0
##$SIGF2= 0
##$SINO= 400
##$SIOLD= 32768
##$SPECTYP= <>
##$SREGLST= <1H.CDCl3>
##$SSB= 0
##$STSI= 32768
##$STSR= 0
##$SW_p= 8223.68421052631
##$SYMM= 0
##$S_DEV= 0
##$TDeff= 65536
##$TDoff= 0
##$TI= <>
##$TILT= no
##$TM1= 0
##$TM2= 0
##$TOPLEV= 0
##$USERP1= <user>
##$USERP2= <user>
##$USERP3= <user>
##$USERP4= <user>
##$USERP5= <user>
##$WDW= 1
##$XDIM= 32768
##$YMAX_p= 473656805
##$YMIN_p= -780858
##$CURPLOT= <Network HP LaserJet P1505>
##$CURPRIN= <$Network HP LaserJet P1505>
##$DFORMAT= <normdp>
##$LAYOUT= <+/1D_H.xwp>
##$LFORMAT= <normlp>
##$PFORMAT= <normpl>
##$SURQMSG= 1
$$ End of Bruker specific parameters
$$ ---------------------------------
##NTUPLES= NMR SPECTRUM
##VAR_NAME=  FREQUENCY,     SPECTRUM/REAL,   SPECTRUM/IMAG
##SYMBOL=    X,             R,               I
##VAR_TYPE=  INDEPENDENT,   DEPENDENT,       DEPENDENT
##VAR_FORM=  AFFN,          ASDF,            ASDF
##VAR_DIM=   32768,         32768,           32768
##UNITS=     HZ,            ARBITRARY UNITS, ARBITRARY UNITS
##FACTOR=    0.250966925370066, 1,           1
##FIRST=     8223.43324360094, 42176,        -451934
##LAST=      0,             2342,            -251742
##MIN=       0,             -780858,         0
##MAX=       8223.43324360094, 473656805,    0
$$ Real data points
##PAGE= N=1
##DATA TABLE= (X++(R..R)), XYDATA
$$ [...]
23862 162649 292366 -152213 -173311 88491 -316354 -82600 32668 -131409 -82770 90674 81745
23851 81745 251892 -313164 61826 125434 165496 99519 -68555 105148 -87044 11463 -3538
23839 141827 173831 58739 -81380 -17770 61809 -124355 100115 214135 -30885 7510 122748
23828 122748 -197500 -233638 88235 227838 -47766 -70367 -9408 -65319 -31951 -329574 -85192
23816 -453469 150485 -307393 -155074 31179 263475 -359885 -69094 401987 170093 95120
23806 95120 -106031 -125526 -61863 -512394 234149 -167442 -29097 129818 -67705 -86778 -147753
23795 -147753 268862 -134710 308727 -59637 -78569 -432575 231101 -223784 336585 -58414
23784 -280201 -126866 132822 -47070 97878 183422 15926 -386060 -39312 -186450 -108923 -248564
23773 -248564 -198062 102317 -156237 48687 91810 -128433 275900 -101615 -41777 -227390
23763 -227390 -358640 -200576 22300 153055 246303 -66249 -21779 33374 195336 123756 -40791
23751 -107004 206778 75101 -96495 53896 -119193 -43814 -145140 111396 39741 -10347 178468
23739 -74366 -22712 6774 68947 -26884 -82296 -115582 171409 127276 -88299 17079 -124069
23727 -173545 -43272 -43467 189412 170510 -279095 -128381 73928 -16992 -79453 -103885 -123216
23716 -123216 -34592 36362 -25010 -16815 -76750 -55505 86230 124837 -115496 -216666 -76479
23704 -93447 76709 -4640 56147 -271839 63008 174169 -192809 2832 -71667 -174121 63189
23692 262461 -79195 -235421 -376816 -69373 10354 14425 -16445 -174729 -4281 277530 -136620
23680 22763 28429 231957 -268692 53706 36730 -50827 114680 49232 -264303 263052 30935
23668 -187288 34928 13476 163964 106278 -75752 22571 138920 -15581 224987 -10993 -17052
23657 -17052 82484 81467 211854 -385845 -34030 -39539 -333012 -119621 34790 31880 -11318
23645 -395437 -424904 9236 173579 -53176 -400655 -93276 -30310 -163317 13912 92830 197788
23634 197788 -103996 -25528 -212793 299761 -26910 94575 -23928 9592 66751 -205336 -106021
23623 -106021 80476 -369545 -196478 -50603 -148554 263527 362927 195644 -6422 -486711 175257
23611 -49579 235219 -173638 112773 -95552 -168938 -111998 -110294 -81011 -167088 -245167 -257900
23600 -257900 -29941 -101239 -71097 22897 45739 260293 144124 32898 35812 218735 53138
23588 195297 106776 145347 12346 67116 -33264 -100517 -23817 -84920 -109411 -68720 122396
23576 -49362 -111355 290140 117904 -121810 -161621 -125331 60991 167871 420744 -6139 -81253
23565 -81253 203015 -296057 -118350 -450193 63726 -135972 407669 205321 -155423 307360
23554 -170523 -165417 -44361 -316491 -204143 -54773 -347354 -24211 -180462 -162705 -18135 -224111
23543 -224111 -52342 -108896 56611 129156 23407 -132349 -145235 -190342 -95129 -38216 94055
23531 142686 -165213 -76435 -85292 -192815 58219 148118 -151949 -106012 -290860 117742 -118921
23519 333808 -144058 -224130 -155317 -312511 -51117 -281742 30674 40516 -159375 -189348 -171242
23508 -171242 -78524 -111475 -7312 -159502 76971 -120200 36066 -247341 123569 -217861 43093
23496 195472 -102520 -100957 42172 -105557 -100724 79172 57408 12090 275925 -3276 487428
23484 48987 -3535 90042 56879 -88671 210855 -135406 -332973 44991 52856 213780 74947
23472 -138108 226128 86144 273513 132014 80790 -41095 225020 53310 466658 37567
23461 1005 -198466 61265 -58792 -43476 -219060 174651 -6261 -163917 68159 -218883 -82150
23449 60244 153587 185059 73391 107710 -179474 -226706 -225093 112102 -88152 287800 40362
23437 -303087 -178128 -191259 21117 -19362 -82747 -218369 112663 -205370 -294012 -37102 -163143
23426 -163143 211874 -374490 99693 -135301 387014 -372599 155177 -325948 29550 -318883
23415 -92651 -119337 51726 -277518 116994 -49364 -110694 -52799 -294925 40174 -94010 -133430
23404 -133430 17411 -11976 201949 251562 52037 -74667 123090 -59121 26977 -84123 -27846
23392 -67672 -136285 -202025 181086 78607 -233588 193457 -116311 -138422 -65992 67621 -279415
23380 -144160 -48908 -161922 167732 -58022 307792 -21774 117221 171522 -111809 127762
23369 -316924 -82458 -17081 -132739 106529 -37990 43434 5982 -170493 -291493 -191568 -268191
23358 -268191 22659 113398 27206 145328 25141 -183111 -36058 119175 -68005 135971 -13183
23346 223189 -325837 88992 -48269 -20798 58062 -134249 -262238 133512 20827 79104 643268
23335 643268 -288021 -125488 132179 -177896 8826 -60121 -47979 -158027 -95769 170649
23324 124836 207660 44092 131032 -108782 -51706 -24233 130065 -16052 178085 -169016 -165702
23313 -165702 -53098 216575 122563 116005 200416 -48393 -262635 -357049 -71779 -104507 -314298
23302 -314298 60481 -188062 -15861 -9977 -51234 -106667 -10177 -150722 -283375 -366580 401064
23290 275981 -207740 -146280 -174647 -65545 44806 -95776 135681 249431 -35075 -237187 272139
23278 20673 -171081 -23892 -98270 169143 -16342 17744 40290 7516 160169 -115574 229089
23266 51504 -2251 -121446 97089 204049 -343 64358 98997 -47038 -168636 165177 -191266
23254 -13420 111513 185683 318529 104024 80919 -123942 -95329 104646 8423 -163174 175014
23242 126197 -139942 -466048 114569 254956 -40603 18180 116769 5275 -314425 283631
23231 -79570 32318 -59397 -177007 168395 -239661 -305498 8057 134531 38477 46390 69916
23220 69916 97431 -225294 131549 -404714 167375 56943 -194315 -61636 27894 57743 -276300
23208 -339456 263040 18828 -135554 -131592 -62844 -270775 126788 -77048 -191915 115258
23197 -14671 56634 87482 7710 34283 -65395 -267512 -269848 72560 -80977 158012 184885 -19806
23184 235571 3626 -484696 141429 -89885 -37907 122072 -370025 84589 45245 -411303 -96959
23172 41018 118868 190259 15689 -192316 2105 -309614 186150 -183299 309972 91192 144570
23161 144570 82369 -44234 -26103 -87111 -193844 88035 8645 184748 140013 -39606 -88276
23150 -88276 2003 -41201 125618 179072 284727 -133692 16281 -58668 157280 -101720 178261
23138 87488 207993 -162634 -252843 51160 102860 28266 359730 245814 -231321 12351 183955
23127 183955 -147213 -144417 125618 -139177 61286 43724 98441 -285206 -303562 -160001 -110618
23116 -110618 120773 99268 -158802 102649 88633 -167955 123152 4699 365344 256013
23106 256013 -93609 -454192 -123445 -71281 -76155 -91777 37370 -148048 -238078 70176 153127
23095 153127 -9938 202834 220020 9333 -254128 12488 227250 -103497 -284327 -62420 -60033
23084 -60033 -89313 -64439 45354 -183534 -199290 -179948 258089 -105702 -185535 -53831 280947
23072 -336229 -93722 -280144 -289949 -38644 -42590 -298241 -21348 -44854 -129835 -341219 -210593
23061 -210593 -190253 -461084 -196009 -231451 -20957 -340472 -7656 -169348 -168838 -71693 -174361
23050 -174361 -75690 -81519 -50728 -184074 -169553 69187 6185 102746 -105686 -273910 -94311
23038 70468 61831 14098 151876 -32935 201212 -103719 -58859 -214001 -254729 -92230 144685
23026 -67009 -193445 187465 -67010 -74059 -149024 67443 -95138 -104919 -81349 281398 -143467
23014 -323949 -106977 -81318 -205523 -276045 -268788 51761 -8313 -46046 -114185 -56798 425277
23002 128518 368284 -321395 -298998 -241211 -226901 -67150 -30260 -19557 11669 -135825 76461
22990 -96810 -145671 169083 -222806 -212147 -41886 -46606 -176517 -215305 -179216 418383 -88006
22978 -200954 263631 -453137 -150452 191440 187959 105197 242449 -256634 161452 220036
22968 220036 41596 -371914 -268899 3542 -232426 -83672 185028 -261516 -73078 21527 -115867
22956 178746 -59864 -276843 -187346 -161504 -19403 754140 -153278 -177382 -74810 -31692 244115
22944 -92249 329926 11394 70625 167503 -346552 -82129 -316721 299782 -567667 163763
22933 247495 -282598 133647 -16505 -211893 165110 -159007 241699 197258 -166920 -255268
22923 -255268 198793 -65149 27088 -10443 110128 267134 58338 -163539 59576 -453396
22912 -432618 -71708 -184624 106291 38742 -134671 96130 -24692 62043 119264 -112549 347283
22900 -15693 -103752 -106438 294003 -17232 -90755 -61229 -62753 -71253 106440 -121071 -413009
22889 -413009 -160 -93219 -23413 -10722 125209 266818 -53662 -293341 5337 -50779 -289999
22878 -289999 -8517 30968 -313474 -113390 257276 149061 26571 170704 114138 211049 68443
22866 -134771 -114065 132704 -72938 79415 63150 -199088 8050 -364305 59958 -330137 167123
22854 -325949 140568 58181 181876 142358 -228343 -27280 -202651 72996 145414 -19875 62486
22842 -278880 -75138 -63499 -28595 72516 -77282 -83562 139934 -88566 -31123 -101105 -40938
22830 288671 -17360 -111032 -182371 -181504 67940 172214 -178253 98865 -232697 16274 -48556
22818 -53335 86179 -121266 -139617 16541 36067 -202375 -10784 -13841 -155276 265622 -216787
22806 161953 327607 -87854 -57063 31672 -125022 -59401 -126446 69563 220008 -56090 306005
22794 -31543 -67558 -55665 -50125 -353221 -69918 -51399 -48090 -101938 -472696 -270308 -226262
22783 -226262 -137506 71286 -74373 58631 -61204 145418 -130246 240274 -115541 351525
22772 -98846 225389 172554 204494 253935 -104962 -330898 18226 242091 -170386 -106950 -62626
22761 -62626 -41160 -37933 -125759 -40751 73271 395243 -131581 -45753 -151074 -12755 89407
22749 -112761 -227657 -71017 -201425 -228931 -80138 48543 -175094 -321566 113339 26723
22738 -203323 -96125 579380 -138730 -130465 -149419 100599 -355068 -173594 88950 -147520
22727 -41582 -104642 178158 -155324 229507 145569 -65621 -401761 -16971 -125446 -217215 377572
22715 224241 -263658 -195787 -6146 7898 318856 -162476 216853 -119358 -210823 2188 -133118
22703 -226278 39302 183021 -138357 -59136 -190765 -114986 -10055 -332964 -94099 -41268 236438
22691 -391166 -176142 182564 5974 -116182 86589 -112042 -242762 32356 -207977 265018
22680 -183845 -389674 -174178 259971 -324747 -10504 102940 91418 -7671 81642 43548 89514
22669 89514 -106945 95507 -222071 -39724 -81318 248876 69965 -54819 218074 -66451 -289849
22658 -289849 -164009 112787 -296861 174959 -92469 -106355 -293467 -190266 70880 6433
22647 432366 -79628 145355 -66885 21845 -314418 -198779 26515 -89667 33177 173032 -311374
22635 145603 28580 -33470 19249 208698 266434 -242418 -97577 -154737 -162278 -315006 115874
22623 -60539 -314308 3031 -19385 -85055 279851 72034 178221 -151017 -158677 -181659 -113470
22612 -113470 -132 145196 229200 -1796 135936 96326 136694 140878 192092 -28657 128899 86068
22600 86068 36981 210835 -113504 -103585 -117506 -333580 92770 209569 -137397 110978 27522
22588 94300 109757 124362 -4671 -22497 243595 -293173 111748 -333606 189477 -76965 -232534
22577 -232534 -92325 58162 -268778 159681 -163842 -87959 -263629 202018 -62783 83109
22566 -297853 -382749 37947 -79812 309629 68533 -43112 -103142 -50257 -21867 -110481 139153
22554 -190040 -158540 168371 117481 -79926 55591 -107693 -325246 -20965 -117381 -413827 -86610
22542 -201738 70754 230170 -341277 119177 56495 -110587 51218 -414124 177923 34266
22531 194321 220187 187139 151729 211977 -211672 -135902 -246606 -305488 -91911 -178057 -154847
22520 -154847 -18176 -139254 -280765 -84972 -79751 -415679 263834 -125557 -15212 -333709
22510 -333709 -237377 -185500 -7502 -160198 60407 -10847 -253219 -274050 -163 -298942 131131
22498 -394430 -139159 -124880 148613 168337 9711 74838 140063 209106 -109690 -221489 -426993
22487 -426993 -153885 -329813 -40662 -50749 -140108 12378 304011 106105 251048 -106530
22476 64202 -16186 16704 156529 -204829 -196874 -8316 -112525 -68295 -260 -51883 -286673 117025
22463 -21473 2920 207053 -85865 -127752 86699 289274 -43364 -11269 -175921 261977 172050
22452 172050 -487991 -49903 -364120 -251587 -106436 93520 106879 -215364 -84026 168876
22441 30293 349833 -101780 -21058 202639 -91038 -64644 166789 92010 117855 27942 59267
22430 59267 302358 -52854 -120360 40339 -33472 -230960 -125495 6309 234358 -78022 -94927
22419 -94927 -61803 -53154 134694 -322595 11391 -169893 103814 14308 -83024 -92383 -144209
22408 -144209 238675 -65192 127946 83161 -134376 -149983 86436 143444 -113452 -103714 -202715
22397 -202715 -157235 -284532 330979 -158666 -124074 -52252 -52251 -308664 299786 -20624 -136725
22386 -136725 202294 174536 -397206 4750 48976 58022 -56203 -33743 86155 334993 -116874
22374 -311400 -385454 -99176 -305686 13185 4416 -299032 78496 -412948 47602 448032 158894
22362 198178 -152338 -37555 96481 -229535 153806 -212099 125398 -56673 159106 -55486
22351 204306 -11049 -170467 111200 -175431 40180 148491 -65688 -47734 -112872 -177567 239120
22339 -322103 246483 -365 -154102 -320389 -55916 32715 286597 -240229 -6043 107987 -83484
22327 53840 26603 179952 418339 140265 -213873 342114 -2413 -219524 -75971 -461415
22317 -461415 181361 137767 28493 130118 253923 -127710 393919 112945 50111 -189049
22306 66642 187177 -437219 351281 32801 222104 223413 254124 28914 249841 -131707 46366
22294 -167011 -86901 -78946 -31543 -414182 -37488 4163 -103457 220802 86006 -24740 -121659
22283 -121659 -50009 -159980 -163316 77305 -143412 -234382 -112573 -87408 -30081 240521 -247154
22271 163061 -32796 437499 -148051 206875 -184852 -186694 -42157 197576 -175176 255367
22260 -143325 -36716 7650 -234627 -73043 -162767 14871 75697 -46412 -5088 -337473 57996
22248 -103370 -367219 38126 10727 -149581 -38529 -179925 -365611 26694 -202780 30877
22237 57885 -119964 5455 -340979 -40347 146512 -198881 -147634 281239 -238530 33996 -208740
22225 141166 82511 -56314 -125986 -280670 -63683 -98713 159070 124906 -198291 71588 180227
22214 180227 -85029 -64301 -183585 -202674 -79512 370008 -2395 -209643 -50101 179653 -254342
22202 115845 49786 -280524 -85756 -32263 -222818 -175228 212863 -101232 69684 -3352 29705
22190 -156165 119123 -297133 -61959 145093 -111852 42600 55425 56270 21364 -88017 247677
22178 -240025 -312869 121364 -217877 -292799 -184531 -42968 -367246 147165 -417137 80995
22167 -269255 32586 -7347 -127152 81305 156746 71226 48610 142700 86062 -245397 -106910
22155 121658 -241384 -25931 92846 13737 -159866 23907 -289641 -37625 21613 333993 -42543
22143 -76585 -217900 308216 -20057 -216979 9804 70077 -108772 -38648 -260633 80689 338967
22132 338967 -81273 206387 25037 -89142 -64099 -210277 343510 43188 31284 4628 138234
22121 138234 -139519 -129288 -431966 -208335 -266369 -295532 95589 -110434 138847 -199345
22110 -299566 18597 467051 101977 -295897 -165725 -123542 -19021 -161693 35235 -205901
22099 -833 -111560 323084 -320825 -75223 -71493 178280 -249188 192082 169621 63894 -252223
22087 194495 23758 92809 -218937 64202 470762 -176471 22611 -117348 89183 -131228
22076 157417 -84586 137260 -59347 20815 -87493 -86201 -211908 -135273 -369582 101777 -102645
22064 109256 -192549 307338 -95018 -146914 -145673 -512862 49214 -72910 182653 -133534 -22894
22052 170506 145938 -230736 104577 -173101 361288 -235712 1713 206062 -289529 22382
22041 223489 -104505 -78720 -258491 257502 -420096 66693 33458 -107872 328699 -133982
22030 -105998 -3687 -199567 -36696 131938 -167124 141442 286738 -44339 -5443 -47331 124570
22018 140471 30637 51637 -3296 -82149 -146336 -42561 -77610 -43783 44359 -29461 -83159 -27458
22005 -194711 -256904 -296341 -39325 150213 -107308 9970 -200407 -135316 -215715 361629 155610
21993 41500 128960 190465 -322404 233993 -153666 -153926 44304 26142 -1158 -230175 39789
21981 39467 28415 -16411 -170029 290844 -165471 -87428 -1355 -255965 -292187 127628 -158786
21969 -18785 -116699 -9224 -306779 -32383 141156 -159902 44866 96012 -94875 269314 117175
21957 -45652 -150474 -4027 -508220 -148683 -200054 47448 187131 16553 -9473 212122 12185
21945 57469 -40556 -356751 161305 -11928 181742 -37820 -215772 178490 -230880 -5048 -388870
21934 -388870 -185192 -339519 -44718 -129593 132395 -205654 76032 -340928 32640 -126451
21923 -57560 -120530 111275 -21737 59657 -218002 -84817 -2000 16525 294655 98948 424299
21912 424299 -201778 -9556 -77453 -238370 -231523 -133364 50279 -108710 514241 -226240 -57630
21900 -102575 -29127 66528 -134150 44852 -39615 -253154 -19545 -126674 182367 43220 -205936
21888 258031 -54299 -166198 10131 231738 193144 -17180 -113359 52199 -41304 429924 343423
21877 343423 -9648 258855 -84822 -181451 306434 -71904 -110278 4737 -57353 -243464 -66126
21865 -417294 -230640 71982 -358274 -158413 176146 5586 -14505 181944 -133532 46370
21854 66482 45 -37889 -61607 -267521 -546294 -97362 -35952 -138307 -320189 -215293 -32781
21842 -197840 5088 -88129 -70793 -7741 216487 255673 -135983 152421 157059 -227635 -140856
21831 -140856 224636 -84171 -315391 68835 -207409 -86221 -46535 -39660 -25910 -60996 25867
21819 -198720 -83049 -63657 196192 -208972 -212705 75405 42627 208838 246950 -47326 68155
21807 168315 157361 -250426 -99184 109592 -93315 -170871 196807 173232 -60525 242331 -41843
21795 148758 -277789 224201 -163933 -458436 86804 -31376 -179331 -32688 150155 -79843
21784 161025 -17694 312092 -323626 121145 -210929 267691 -33185 -56938 178750 -170418
21773 -77415 -274860 14269 -63984 -177381 -260416 -147236 -14353 280245 -48596 -340524 -466354
21762 -466354 105479 89933 5629 -183239 177687 -29670 85220 168535 -266632 -35188 -148602
21751 -148602 -150400 36224 233972 208209 -294614 -48630 -381989 -318749 -238 183340 105991
21740 105991 -63224 -69755 -521049 117975 -64757 46622 -308161 -51676 133107 276254 -87489
21728 -165076 -96645 -348790 52666 91391 -144942 107623 11401 -113317 -139588 -43474 106063
21716 226722 146136 -131049 192838 -92825 110632 39134 -323819 -148584 -143803 -27140 -187515
21705 -187515 -259571 -141989 112001 -365851 33897 -443226 -137671 21957 -66002 -253832
21695 -253832 292968 138170 191123 -68744 -222376 166276 182198 -363734 -39288 -146310
21685 -146310 17758 -232659 -392569 84437 214795 8978 237218 -205461 31132 -155144
21674 -50098 -254771 27502 46828 70138 -134130 13629 -216862 -12211 196446 -213203 2216
21662 208546 -196565 -11927 42683 -13333 222231 154123 -68320 172975 52900 -93591 -43386
21650 -86954 -119745 -208168 -38599 -31906 -143262 137537 -228018 0 45760 -25942 -131435 -210328
21638 -210328 136729 -194939 -24054 -351769 -95050 9557 -457499 -257354 -7283 -115946 -154944
21627 -154944 177958 -147563 -113015 -142030 -98824 70280 -206813 -35206 -57345 6284 -63544
21615 -30301 -335708 -56262 -6726 88510 -179292 71160 150477 335460 -30432 -237869 138197
21603 105484 -196858 -114790 -266946 121605 -98244 200868 -86061 -468510 -245103 -86219
21592 374912 -132432 110361 88400 219326 58533 236066 -248368 -31072 -134547 -2566
21581 351210 23985 -98945 -486744 -271173 56091 29411 -263677 -172948 155444 88453 -99958
21569 47883 -100415 -225592 49951 -106205 -110101 -24382 276017 81638 -124816 -48497 -164318
21558 -164318 -23752 56232 -196709 60260 189502 64651 150679 169689 -232406 -117933 111128
21546 10231 47916 414793 -85344 -78156 123136 23739 -223703 -12725 89803 -440293 -117045
21534 -147059 -257230 19022 -19525 -110725 52680 -105969 316974 -73463 47205 -209842 -100296
21522 28016 33839 12171 -348468 253971 124706 -45242 -194379 -267923 -179398 -199111 -147090
21511 -147090 -128834 -1852 -33317 -184688 -106013 -176222 87707 -185067 -233738 -179042 216437
21499 -104358 -90905 -72900 -173548 -100883 -101000 -133262 45116 298113 -459062 -246303 3055
21487 -250894 -158557 -124663 330173 -234001 -75846 25 -284042 -200040 -46782 -26520 -23289 -184633
21475 -184633 822 -10216 -163332 -234789 160691 -93610 -269982 -58770 296804 46721 -87874
21463 -301045 -104937 -179283 206392 445 -70039 -458052 3168 -4076 -143021 -252130 207262
21451 -334124 -45623 29584 -249355 59797 112587 142981 -46466 -48346 -119634 -89902 198753
21439 -36345 134689 36690 223372 318357 589494 598430 -99170 454289 150397 134521 187559
21428 187559 149323 168056 -250730 -93267 75452 -232588 -202343 -267986 -265767 195264 187225
21417 187225 -42621 -68569 80889 -281762 336982 -37526 -5037 18457 1983 26994 83845
21406 83845 84490 135670 14711 -327433 -301323 -142695 238389 16391 -357341 -136200 -2793
21394 196644 59227 -216311 -82195 199098 -125215 -89600 353 -88592 -246912 101034 -141663
21382 298109 35681 -369013 57529 -256634 62842 16272 84374 -44734 115793 98876 50333
21371 50333 -202652 -70097 144472 34476 -59065 261669 15757 109825 40964 41758 166647
21360 166647 -319510 -285937 -187893 173705 -566988 42105 -119694 -139817 111616 -49844
21349 201530 193233 -238739 -118071 49264 26388 -514111 -205491 251488 -126557 -258660
21339 -258660 7968 -131782 -357900 -121748 184276 -259377 71241 124098 -43102 -59587 -81503
21328 -81503 11032 -149015 -140215 255923 -50946 182154 -83973 58345 -118942 -87021 2001
21316 64421 -120441 -329031 -136576 2519 -231665 -74628 -1336 14589 240786 79595 -69420
21304 -269111 -102064 110726 16676 71146 -57391 73262 -179260 -119857 -128959 -112637 220450
21292 -183732 -400371 155215 -161121 95630 109113 161330 -34671 77352 -27195 -350166 298524
21280 90678 -22888 130489 -173291 -148158 -272664 -175637 338809 50234 -176029 -56858 -270343
21269 -270343 131034 260223 184955 -73837 -231569 129942 350967 89832 -252833 -250538
21259 -250538 160433 22388 -12262 46072 -163775 110096 9387 75279 -85924 -13756 -196523
21248 -196523 -117838 114170 75779 -92392 -190300 51508 -158039 -181215 81556 73075 -245087
21236 14915 22454 145213 -357844 -243715 312417 104881 -62833 194011 -193923 48886
21225 6010 -439947 65881 126436 -224512 -271559 -102772 -369090 -432520 -312620 -7517 217446
21213 70198 48879 -11053 -112069 -13071 -134221 116932 118038 -189526 135964 -3891 47617
21201 -110239 -33705 -264763 81980 762 -213578 -27415 -107091 152588 36412 -49355 -261131
21190 -261131 -72330 -136292 -23713 -147816 -121196 63794 -281747 -6358 -335395 -219445 160061
21178 -183951 32731 -94759 298854 -483894 6 48540 36812 -73719 155613 32174 -80279 240667
21165 -119098 -102179 -80404 62780 90849 -32126 47162 60576 250343 33805 158043 -128945
21153 12726 -20138 -31248 21377 -172117 -137344 -138284 -63711 175012 -111443 87774 -47066
21141 64303 -34791 22873 -205956 -346108 -557 -161374 -103831 38165 -188631 -158582 -39682
21129 -63222 215547 -323147 334022 -272541 -153831 -59581 -75358 -141823 -53335 6203 126032
21118 126032 -224015 -197881 -5809 102671 125345 29221 -243100 -140594 147855 -94452 -57596
21107 -57596 -8340 -204866 353354 -124066 28566 -188982 -138534 61406 92025 -53304 -4726
21095 139082 46510 -15380 -189814 257855 -168791 250229 21186 89577 116544 -156809
21084 -176770 6352 -90282 9028 -389232 3191 -24013 -94747 -102793 -503185 -82944 -78938 216509
21071 -141886 320489 75154 -203670 165354 228731 -56926 -64842 -262193 -25742 -271410 -23973
21059 137781 37358 -90633 -13536 285273 -99086 -130376 -93283 -85894 108400 -28614 -160191
21048 -160191 -292417 64133 -258760 -350287 203219 -167206 -257533 -230234 31485 -152198
21037 -81237 130707 19160 -195 -16456 67472 -189907 -101815 69835 -22424 171889 43095
21025 89098 224366 -71579 -186138 27315 -22498 -48769 -188577 100909 -19391 334932 199702
21014 199702 -185342 83821 -98605 201265 -346076 -190187 -170723 330216 -20509 223201
21003 -24441 -6947 -313706 41945 133769 141153 -45111 -83839 -82887 12909 -27315 -293633 130718
20990 -248600 -228967 -72615 67414 -292119 111630 -134436 -161598 212833 -284208 27390
20979 9724 -183010 118522 269098 145633 -81277 94879 -273053 -382939 -255747 -128050
20969 -128050 128031 59889 -22406 205731 -56072 194027 -246927 -402220 -249142 18489
20958 46399 204387 -351923 38526 95110 -77713 107609 -104231 -33651 -171990 31165 -209290
20946 -156079 -160144 114873 -99661 -14071 113778 -334889 38997 -133427 -43233 -265103 17506
20934 76106 -109173 -141052 -21391 130409 -17965 125564 -238302 -88664 48044 198836 64773
20922 -442477 246056 137827 31628 -126919 48359 -263730 156413 -7828 -4613 -346649 302075
20910 -233799 -82329 -194560 -192872 -231310 89238 -177304 -14541 -144969 -303998 -262267 -252959
20899 -252959 -6128 -198157 -258198 206422 39330 -131774 -287806 111944 189883 -122574
20888 934 -117664 -77366 7282 -123346 -111904 22621 -51771 -235172 22653 -146462 -70277
20876 63754 105499 29941 -293222 -113653 -250019 334253 -148652 -117725 -113521 -114736 -285117
20865 -285117 -180210 -33943 -156159 -103077 -171341 214938 -21741 -232176 -197049 -108967 326389
20853 -48990 -151887 -210611 -164134 -271845 280170 144291 -145980 172695 -97671 -76509
20843 -76509 -19584 -91548 -183723 -16896 -80109 280089 207720 134657 -3267 -214315 -224656
20832 -224656 19162 135343 -127043 -82864 -102480 -17703 100322 -284488 -132650 -25922
20821 15550 -93480 175561 -198186 240871 -156953 269697 -107705 -87625 -262168 98187
20810 -84343 33039 -151934 -338174 -165914 -222468 -60077 -104660 -2260 93460 51201 -8167
20798 68558 298716 -5600 27930 -173114 7553 -100024 210377 -90997 -125233 -469908 -3257
20786 -129917 -81920 226885 197540 -116042 -38864 139677 188631 -70388 51221 -439657 -84596
20774 264422 -221525 -309259 -89174 -15268 128305 -76027 1004 164191 -276859 -151830 -60740
20762 -247376 -247499 -408865 -438530 78972 -71320 -308147 37873 64977 114192 24845 -147562
20750 -166711 88875 -45186 64719 74882 -212716 215238 -283610 -16689 -86399 -9775 -268141
20739 -268141 -77000 14890 -98204 47460 134139 215827 48987 -145018 251915 -71837 -251246
20728 -251246 18688 -424993 -177241 -115904 -51926 -87987 -429768 93117 -62769 -40446 -77358
20717 -77358 96743 21034 212866 -57747 92686 -379701 -113203 -120649 -190213 276226 7900
20705 -203424 -270021 -368656 154730 -85631 -250757 265701 -86119 -287638 4320 3057 -88542
20693 -344295 166065 -117998 -145316 -78223 5854 -39240 113495 -203130 -158273 254063 180805
20682 180805 -170939 157171 -299720 -170574 456 -158133 -146924 -167539 237412 102880
20671 12676 -25622 -78134 66440 -137825 -441537 -441036 203358 -229406 -96531 189230 -165725
20659 -165278 53564 -80695 -77380 -257631 103538 -131415 -10269 55688 -153763 -65553 -300942
20648 -300942 298933 90630 -124098 7098 -112032 16812 58651 58850 -230692 154500 219711
20637 219711 39828 -291427 -207657 3492 -106303 24815 -160635 76242 -60063 -75537 -338024
20626 -338024 -139558 26533 152062 -227052 -98874 -313334 98724 -122222 -67061 87817
20615 -16900 -190506 -246022 111045 29238 -265235 -190429 281690 -225650 7754 137279 156456
20604 156456 461924 -84411 -396213 69373 201920 53112 -365996 -355159 -306769 -82058 -161303
20593 -161303 -202390 37183 198143 84363 -119322 2316 -127480 244307 -87370 21598 517956
20582 517956 -83887 427494 154684 110561 272929 -21495 -12513 107029 -147630 -74955 -344821
20571 -344821 -64708 -337240 65875 -329745 57550 -38375 -398010 105384 -257693 -94138
20560 125037 139827 -114670 -143838 -305156 -56170 -157099 -191391 -64025 -153141 117390 -35922
20548 -113465 121407 54230 -305809 451320 -46570 -229239 35973 -181755 -48682 -159856
20538 -159856 -46194 249763 -39862 -30708 -159353 -128512 161010 -210408 -314596 -218725 273615
20526 25710 307532 378487 235830 33005 -111247 59989 -72325 117465 -115789 -74268 22105
20514 108504 -327744 61203 -304530 211526 -100378 -362640 -455486 66040 108794 53992
20503 -25958 -25671 72495 -237935 -317252 -246405 -7060 -97494 -114463 -191627 -268524 -7108 -40768
20491 -40768 -139920 -215107 92301 -101727 79502 147748 458315 -241314 178453 -69516 74325
20479 240148 -180784 -253127 -285781 159807 -12781 17532 11214 -228288 -130524 -50399 -91505
20468 -91505 16054 -3563 -109651 -77475 -268012 -196572 -81820 -279421 90185 -25312 78867
20456 132111 -5406 119886 139905 162078 -67640 23053 -87464 -156174 -40921 -321472 12497
20444 -18334 19234 -255284 -417624 59714 166077 82095 4279 292045 6513 -92402 253199
20432 -556 198713 -169301 13858 52952 -256562 -6140 -70509 -218453 -225569 -46251 -314154
20421 -314154 55829 225737 -192050 -80078 11199 -173279 83285 -187776 -58219 41506 103556
20410 103556 93285 343640 -145511 48424 -108964 -77267 -141856 -348846 166288 -91739
20399 88532 -180034 -22593 79673 -90517 12168 -44389 -265787 121797 22837 34092 117912
20388 117912 -268368 132699 -197559 88798 1579 84290 -56349 -29462 71807 23674 -194854
20376 252399 -100562 306174 -305915 -13073 109859 -97369 -354468 -641715 -18874 -228233
20366 -228233 105266 -31862 -363844 177035 119169 86570 222618 125870 -75801 29367 -491656
20354 -175002 104586 -204951 -75500 52406 -125447 -223904 -165678 -223264 -53775 100145 -47550
20342 -213221 -163353 120299 -187866 -385438 30505 -309335 -125611 -202436 -199392 90911 61258
20331 61258 -90828 -341694 193598 -71931 -226415 -93995 107967 -86861 -199072 62204 82011
20320 82011 -17335 -248195 -18238 -59844 -22477 -211053 -222221 -12946 -318846 -17309 -37653
20309 -37653 217466 223951 -211934 105082 38661 101874 -130825 172715 280211 30354 -87089
20297 -285543 13621 -341088 -210463 -194743 -25377 -384798 -19037 -69741 -111484 -22760 -33423
20286 -33423 12058 -331690 441542 277996 -47806 -297460 -160055 59380 7174 -141022 107572
20274 272131 3402 95002 -139484 -72504 -546367 -298330 -95807 -79760 -98041 222903 -179849
20262 -228980 126389 193008 189099 236048 -273692 153240 -5976 -152916 55652 -241295 281297
20250 31006 -145456 -8325 -48431 -20134 -4960 -264338 -10149 -297195 -117028 -7167 209797
20238 -109515 -86254 -56737 -119537 -237639 102141 17134 215832 -300027 -43269 -102807 126124
20226 -263772 -115400 194174 86020 -194316 77950 139810 -39161 16588 148286 -39856 115594
20214 -181445 122512 51470 -35148 -39865 33767 -250801 178215 -5083 21244 -47803 -43527
20203 -43527 69636 45351 -190095 85170 235455 -70209 162106 108110 107011 144348 40923
20191 -27054 -259406 91814 245816 -296472 -44296 -8230 -48459 -264246 -6875 -184166 -73918
20179 361535 -222825 -165781 291684 -167217 100873 -76034 -143646 255812 -253886 -141391
20169 -141391 -153828 -65303 -34528 -61027 126663 -118962 -7135 -102392 244432 111852 249274
20158 249274 106070 -208476 285447 94208 -52688 -78446 238689 -138905 -115411 -285966
20148 -285966 -166489 190517 -37860 -202106 -92599 158458 -42221 196717 135211 56865
20137 -384463 122733 -176130 -206061 -175474 -20541 197112 197329 -192977 321314 -82946 -344957
20126 -344957 -21749 4158 113223 -7317 -25393 -124004 -81226 -11571 49266 44524 -349974 -283966
20114 -283966 51521 -197405 24463 51424 -230467 -65425 -141031 -46944 -217621 -132193 201295
20102 -372584 144281 -37825 176518 -30442 -43359 -42567 151820 -58885 8085 86536 -198044
20090 -139161 -51853 -138646 -417839 89515 -28529 -93849 27285 -148403 -182768 -188740 -148636
20079 -148636 -180268 68481 -236235 29479 -345000 -142374 -7835 221549 -28467 -14205 -5373
20067 1198 -263082 -217644 -65995 -168236 -145019 -331347 -368796 812 92559 -205146 192578
20055 -23568 -819 -135145 144510 -5530 -61191 -215323 -137097 239 -171887 -1654 -242599 324655
20042 25141 -76381 11707 -92283 -69621 -160754 93379 -39282 -210062 -182395 15982 -176339
20030 106336 -9228 -180645 -322011 -145029 -113602 68482 265197 -175981 16784 5785 23805
20019 23805 -43294 -96052 315566 92296 -235404 159935 -291902 -306947 451183 13605 -134850
20007 150738 -243647 -273616 -235045 -54537 70019 97510 -177269 -130306 72823 141016 76533
19996 76533 -299433 -24555 36064 -5492 79787 -64930 -107511 -112403 -205297 40454 47942 -238979
19983 -16559 141475 -34915 126301 162073 -5076 -252612 -51658 -130422 -140393 -95481 -3717 67754
19970 -403476 -303929 -217508 -47063 -140205 -220729 161552 41217 -197322 -247380 155174 66558
19958 -167001 -43665 170936 -251496 -67345 108111 -44118 -134358 -148449 41145 -394823 21320
19946 -69615 -260591 38346 115336 20258 -323413 -95315 193871 -255064 218260 61554 -331877
19934 -49642 -102683 -78785 -40055 197677 -324989 -74040 -252003 130588 134726 8910 166696
19923 166696 139333 -21985 -128664 73411 102064 -153503 -139010 -48884 -338300 -268137 136525
19911 -96279 -234292 90363 -27352 -126974 38517 -280321 -10006 -37976 -192818 -408624 -296821
19900 -296821 36660 12193 90688 -183787 -325012 28127 391999 223108 210789 -138114
19889 -170023 -39592 113961 -83700 -228831 -315779 -166511 180555 -233051 -29841 -109443
19879 -109443 191299 -213770 -370513 -211503 136925 -150431 -17560 -121608 -282125 37048
19868 99088 138711 -79383 -137385 -346234 68698 64832 -49504 -103569 -237791 -88344 152692
19856 80154 -36010 -223975 -94156 -117185 -262075 109153 486924 -142957 115731 53482
19845 53851 7603 -374088 -323130 -213344 -32699 -77495 1156 317136 27071 -44518 118859
19833 351913 136586 62812 -375014 -28515 98971 -168968 -32289 196212 70201 85679 -55125
19821 190129 -397091 -33732 165652 -426177 -47313 9302 -132108 -307304 130836 117485
19811 117485 -180606 56194 -254032 276005 -235413 -56612 101545 74113 -336465 -134089
19800 -55369 46486 -181610 -180546 -39634 -59708 -441030 -434172 -23722 5927 178142 -221339
19788 157786 182211 -121614 -133944 -153586 -144370 273055 -198582 11489 -315588 -334492 121055
19776 -55617 -159072 69360 -175668 -66442 -189477 240918 -135202 52400 -260864 -82403
19765 -67367 -110414 -31934 -82228 -564511 -132967 195456 -445558 -19886 -119785 45108 102394
19754 102394 177266 -127524 -138962 77109 -321561 -328932 39636 121099 56873 71410 -229256
19742 29719 -238717 -100959 -207385 145175 156322 129234 -19912 3171 139163 -69619 -12415
19730 433437 194416 183052 -25905 264876 68070 133906 -173124 -54505 -63576 247493 135414
19719 135414 -48945 -27579 -185730 -495626 16491 -130859 -231813 36126 -64159 -25557 -181249
19708 -181249 168932 307034 105673 -234245 67461 126032 172202 271460 -190824 -322254
19698 -322254 -242944 -44548 -292678 -6170 241958 -469954 -31045 -138810 -308617 -10451 163011
19686 38098 -270261 -357970 -222916 -144095 1532 -1599 -242341 -151551 256620 114122 -128988
19674 -10235 -27453 143380 -177394 -112891 -18554 -249468 214614 206861 -148974 -419437 -84856
19662 3487 133449 -134322 82692 38915 -93359 -65738 -274839 374257 -232051 -310827 297154
19650 -257320 -333012 -401339 -438792 372197 -216864 -51054 -432119 -7250 23084 -161032 28531
19638 -93626 102030 44286 -246228 196259 -15533 -295409 -361299 -84588 -238428 4758 -48323
19626 3833 -191638 134236 -167554 -44494 -19053 -145844 -229414 -394125 273708 -102386
19615 -64724 -404247 -298627 232398 110901 -91185 169895 164705 -339778 135389 -99941
19604 -69547 -72195 54732 -13900 -185521 -17715 -216871 40469 -269320 -99091 -221833 -66794
19592 -50312 -71938 -22036 -185226 -144146 13932 -63941 29330 132652 21953 25818 -57887
19580 -22210 -297713 67594 -244129 -422693 -123326 68195 137470 -277609 306956 52208
19569 -43198 -79686 35628 -273844 295203 144960 42889 107654 -218839 7940 -169354 -24090
19557 -12981 -136841 22543 -200068 -166567 282941 -396065 -106690 -48309 61539 -193017
19546 27108 -247531 -114006 15794 -121235 19838 -60430 257954 -16710 -116184 174436 -3111
19534 141788 11128 110051 18888 97538 262982 -424911 -152625 209572 -20592 126433
19523 -163711 -187021 -3812 148119 -43986 -41866 -260204 -319549 217499 -59730 -185234 41879
19511 -187963 -184257 -261990 -100179 -127035 -462384 35053 -58086 -2104 137746 -26860 -122954
19500 -122954 -138000 -18729 249638 118094 62970 115284 115874 -84797 -368581 -58201 31215
19488 89921 212516 -33595 -145817 -180175 -183456 -14503 18620 -100005 -114629 17192 -93384
19476 -82232 -103527 -1496 -169887 94930 -4947 -83250 -159181 85833 -117267 -514811 -136583
19464 -77825 -9450 49516 -270606 -180012 -143926 308560 9803 122357 -222350 379033 -125444
19452 241980 162822 -70860 187240 -70230 -11881 -28690 -17652 -114704 148034 -191874 227400
19440 -193299 -177318 -207988 -238187 399762 40615 -181163 -513351 103104 75227 186703
19430 186703 -150075 -177727 -25748 -117714 136924 -442663 -83702 -10643 -263830 -433721
19420 -433721 132118 -142305 -173383 -161702 -105318 -57991 -162229 89676 69638 84936 -255545
19408 376418 -25988 -547212 80673 39908 100978 59132 -179129 261744 -108215 77509 -24530
19396 -127125 -264235 -79793 35010 187115 7710 161382 -219520 315243 -25272 87202 -167824
19384 -439723 18740 -101206 275030 -302936 -161209 100127 125200 -50741 -308470 430453
19373 -134538 -177141 -176149 65962 -60078 -109832 -47193 -376086 130319 -143689 -189034 73320
19361 157792 -137880 174222 -298645 -279042 -95930 65216 -50985 -113180 32930 70201 -98818
19349 -245827 38072 -450854 -55162 -74291 -66720 -121771 47411 -164291 -225923 -5391 38891
19337 -326993 -70970 53537 -9691 -465186 43897 -93209 291657 -90403 86481 -316249 -32021
19325 18085 -314501 -330499 -240378 -32597 120223 -366033 -71379 -191862 19844 -270462 83362
19313 -16102 -194160 -303915 193697 216342 73497 229151 96546 -344802 337134 -135306
19302 -13212 -264296 200024 -138528 -92770 -284397 -282870 -236363 -67004 24495 -171287 43106
19290 112412 52697 -5444 -135080 49648 -79447 151815 -356389 -145011 -50271 135880 -133509
19278 -143571 -43977 -101231 18294 111149 217887 24631 -205088 -119469 -297728 24879 -26248
19266 -78314 232050 133510 84289 -281361 -118067 -161172 -234671 -523722 -149232 -41113 -315783
19255 -315783 98340 -178981 -265494 141089 81945 50925 27756 -272573 -399196 103907
19244 179287 -110228 -80740 -44392 109971 -51237 -400525 -243048 -148588 -32118 -275122
19234 -275122 -12883 -125674 -310426 -94113 -189690 60403 54598 -166475 -66555 -143962 51473
19222 -15288 65300 58693 -239455 180952 -69657 -358481 -211391 391363 -187412 -120800 -420487
19211 -420487 -206570 167330 139465 -57980 -7224 77521 52391 -236215 -58003 -200158 -284164
19200 -284164 -407033 211638 -145386 -31781 108806 -37958 -99426 130682 -488845 -342412
19190 -342412 -13164 -274589 5871 -23519 -132621 47660 -143586 -105538 96904 16277 -17232
19178 -37802 -289731 -93401 -156198 -90807 10875 145900 167598 64235 60333 -135035 21707
19166 315481 93403 3404 189999 -225191 -292349 -21766 -49801 -123206 -203473 97046 -46476
19154 460550 -44455 -81672 261756 -279791 92195 -200289 -140928 -247700 -87327 -114541 -165849
19143 -165849 -124619 247455 -165174 -9181 39069 -181374 93787 -64821 141998 -474473 62706
19131 131068 53969 -83495 -160583 264220 96484 67560 132944 96307 39571 52596 -129857
19119 -145833 -114635 -106519 18535 -180487 78327 -140659 8444 198225 -203354 74933 -286909
19107 12674 -35317 112414 46197 -81034 -233807 -171198 -259831 -138746 -200247 -160844 81098
19095 36026 129492 -101078 23263 -103280 -218918 76541 -72304 -51985 352206 -184386 78875
19083 -61921 106555 91102 -185240 270625 -17536 -134402 -25626 -611238 191955 -129907
19072 175838 -138739 -195050 85185 -299997 19828 -213472 -238088 161825 -96150 58854 -506399
19060 43803 -79282 231574 -25606 158831 -48212 -20266 114734 127304 -146323 702 -267901
19048 -324496 6650 160470 96255 -216891 252210 51224 -132581 270953 -111268 141195
19037 39032 74579 -217367 -157442 -27611 -430887 139960 293343 31159 177853 -32999 -52447
19026 -52447 39095 345105 -57564 41498 -139698 91780 130305 54612 -312331 22558 -80597
19014 -115672 -295137 -92398 -547 214981 -26637 -107558 148815 -272409 -202244 96803 261693
19003 261693 -30282 -75769 -271884 -191539 -496443 54185 -48274 -149469 -174682 -137891 -80257
18992 -80257 -359402 -308812 -47960 187237 175317 -359039 -91540 -117119 102518 -52670 -8018
18980 -204331 -36326 -73588 298937 -286642 46358 -125459 -258188 -286006 138134 221598
18970 221598 -5191 -281395 4461 122602 -103519 -172569 -73714 90058 177204 240984 22703
18958 -202828 290580 -331423 -159611 251548 -242845 194825 -267854 -214418 -257933 184070
18947 48545 -18634 104146 24189 -146123 -280185 -31868 -99290 3952 87360 -132925 12934
18935 -113495 48914 -109977 115700 -82410 79956 62764 86542 130159 57975 -44471 110948
18923 244933 -231914 -132968 -88464 37860 -183493 106790 120246 -416653 -31952 -91639 -345235
18912 -345235 9770 267862 -144796 -119144 103157 9195 -188938 91906 7418 -183191 -33421
18900 -313564 -434281 -242276 -2144 -454667 84839 -315471 -118854 -36525 82034 -169926
18889 226907 -250069 177859 39012 23646 -325849 -276792 -3889 -62043 -135660 -158825 67391
18877 14341 71036 43928 -497904 -105679 24104 11987 35737 -10597 -265349 24055 -141118
18865 156117 -85879 26418 -120425 -75083 -66270 -204725 -228285 -440301 -83418 -129548 -56698
18853 60165 74202 -22729 303885 -348321 199928 -176118 -29764 110082 -316296 156517
18842 -28018 158212 146229 49013 -57790 -139365 24126 54411 18210 -40538 126413 -313420
18830 -49795 147250 27308 -119705 23029 -385794 -4477 -67601 207220 -394616 -76946 356770
18818 276342 -139746 -131701 2231 -66231 39549 -212383 165362 206303 9968 218290 -70673
18806 -111215 76673 -100483 -85702 23885 -261625 173994 -3660 -57468 -277278 42016 -196765
18794 47175 -58061 42225 152069 11692 106118 -128108 -46610 -199593 99547 -35784 101075
18782 258955 280360 -166875 -6850 -286159 231482 239070 -398926 266105 -113123 -196021 -73588
18770 -9946 -120107 4293 -55987 7097 -156451 -124117 -270254 -52619 -137347 333961 -122856
18758 68270 -43544 3728 -139249 148032 -52676 250229 -201500 47974 -148183 52445 -71224
18746 144657 41408 196637 182862 -157818 -80804 -193669 -358573 -289297 41379 -23889 -78869
18735 -78869 -314419 -360546 -79599 112490 42461 -101387 -376443 -78945 -215784 -335903
18725 -335903 -176939 -167296 -130464 182928 53010 -203181 -35368 -71132 -282233 -151772 -257318
18714 -257318 2286 223368 -230445 -39391 -37761 92340 -77287 56959 -30068 -126464 117866
18702 73145 -18757 -243834 -277267 -197899 104595 -41766 5466 398794 -325127 -296749 -195779
18691 -195779 -209741 190751 30238 -115639 155153 45016 78552 76790 267157 -17309 -320876
18680 -320876 5314 -320592 -1507 203341 26161 141286 102914 35514 -169294 -93224 216001
18668 -207636 274478 -81419 -204649 66760 10884 -140312 86815 -227248 87376 34093 -140873
18656 -97404 -188240 -41351 5108 8677 -6628 17258 40301 197635 39693 106482 2746 -82347
18643 114927 33147 142698 4963 -93435 -106138 124689 -87659 -65796 -144716 -217234 245703
18631 68102 -154505 -205363 -219945 14995 174382 -275771 -17456 179061 7979 -134324 115627
18619 -297867 -83016 -55850 -146485 69967 69900 -365521 -313460 19400 23000 -295564 34614 -225332
18606 -213433 -165902 -341389 -161288 -87941 -279406 -133055 119228 -162181 -20672 -40946
18596 -40946 -385077 -88424 -102171 -247485 -73210 -317583 -167166 44749 83974 5797 197103
18585 197103 97609 75370 -64376 -40969 2860 -96557 202064 11677 -202315 -38240 -92915
18574 -92915 -445879 -186433 26355 -257879 -136788 -286353 -67695 218543 -30989 100796
18563 61185 -221918 -160160 -27961 -115461 -277317 553 99520 -341921 54360 -162052 5363
18551 139410 -157729 -234890 171689 -239758 133627 -248093 161761 -69402 -283205 -117943
18540 -178878 -7635 28138 150010 41558 77820 132759 163530 43845 -83788 -254842 -53971
18528 129133 382265 141944 -231437 -295963 -63339 -252975 -92153 -18453 -236873 -348508
18518 -348508 -110364 -126176 -228368 -284226 -255741 259249 -68803 -185575 -105519 -249260
18508 -249260 23577 38937 -132746 8898 85163 -86431 -85345 109302 154750 204546 -124041
18496 -35655 157949 -156352 -220531 -66910 191716 -165283 99501 -204258 -269269 58077 -209267
18484 -103690 -96240 -222740 -32919 97976 -325311 95191 69012 195169 103433 119964 -100097
18472 -249368 -196313 -41804 25948 28820 420520 376673 -3531 -196270 214277 260845 -108871
18460 -37056 -307248 -26255 -37160 -67003 220564 -90176 100983 -246204 70534 110258 -59591
18448 -35164 24443 116630 31962 215697 -163832 -416784 -152122 -17726 17714 181859 -20620
18436 327451 45864 -525315 -86956 55832 -1853 -70219 -79570 -320249 181493 -256306 -37407
18424 -247494 312826 -176023 15937 -15094 -222393 -71303 -148584 35655 -152108 201697
18413 6322 49119 9547 116397 91050 -378178 -145158 85901 130701 277468 -187625 151535
18401 102239 171601 -29867 124237 -81444 -152554 -37635 -253004 -36138 394036 -128787 -185630
18390 -185630 9926 36374 -159195 -268491 -26566 -282853 -168705 87110 -27406 146282 318050
18379 318050 -245740 -235189 -435954 46357 142488 -193523 167222 -102040 129959 97805
18369 97805 121277 -189102 -259285 -200934 35625 233968 155761 217827 -68249 -43161 81832
18357 85105 -97750 -87701 -290392 -10458 168513 -135712 -326768 -85060 -157508 52224 -145752
18345 148488 -186939 -223948 -195327 -82443 -278877 -8486 -107595 115672 -166425 161230 -266683
18333 131336 -203681 -56953 -229342 -256094 -95074 95916 -82044 -68688 -460848 -116369 95957
18321 163760 -353305 18411 64764 131486 -11626 -32463 -442154 -147788 -142787 -57833 -10907
18309 -25891 -147789 -102832 3158 -262882 51407 191557 -154960 -328505 -417413 -887 -145608
18298 -145608 -57008 -57642 314046 155440 -350615 197254 124866 281493 -362274 -135011
18287 197207 -193790 -290414 157400 51110 -10538 284860 -16622 115116 221325 -136086
18276 12062 -82217 -199057 45834 57741 222749 -170051 -77571 -226903 -13713 59643 -197779
18264 -112079 -37455 -134078 -155167 403626 -23762 66296 204716 74595 4533 -175347 -234750
18253 -234750 16898 -210543 64495 -178546 53777 101349 100994 221204 168163 -161185 150399
18241 160415 98210 -330977 -39373 60621 -170998 440552 -71580 -189532 57613 85688 -102678
18229 -10926 -207111 12581 -49680 165891 -178239 -81581 -47376 169117 34071 -383661 43113
18217 -158216 -151920 -158897 78771 -158261 38544 11995 69705 257721 -266034 -23157 80415
18205 -44247 59629 -192558 56754 -218540 -97987 54464 -216347 -348071 -1889 -183566 -259551
18194 -259551 194702 -281924 -84255 -201744 -48235 124677 83027 -232887 -4680 251571
18183 -205344 -178581 -280219 -201420 30822 214584 -148174 46383 116345 96318 -165870 -113278
18172 -113278 -50321 -39921 223 156937 72993 -6785 219095 167797 -197482 299509 23163
18160 -142290 -22093 43313 -95440 -185077 -305519 -243458 -139156 -402293 -324652 -232293 -21261
18148 -383108 -97988 -68810 -145662 188948 332709 -38699 -148685 48485 36056 13883 -195864
18136 -169022 -348519 128063 -49147 112683 -66276 -9589 -84778 -9870 -133288 128945 -131649
18124 -157013 -40881 -123743 426121 -85385 195749 -262556 144961 284134 -267426 -121389
18113 41310 -3300 207220 164435 -1943 -15749 96189 -113935 157786 -116863 233194 -95136
18101 154305 -25382 -64692 23567 -114418 -84605 -113247 -8524 -10290 234436 -370675 -119322
18089 -171014 -52568 -105232 -23107 -136707 -10812 -317164 203546 -187751 139182 50310
18078 193611 -40105 2224 -65750 -64951 -9316 43139 26796 -217062 -95818 170126 250945 294454
18066 294454 17881 -295151 -224739 -188448 -49888 -41075 44923 -50364 115982 -11922 -18587
18055 -18587 16128 25514 81481 -344701 -309318 -156900 170434 -28088 19852 364167 15908
18043 67316 -127774 -70343 -101827 105389 50367 46785 -127639 -43120 354930 -29155 213810
18031 -295594 -80833 116776 -357228 -86644 -364461 -163277 -159723 -211726 -228040 -111523 202161
18019 -47680 36497 -120758 336226 -116665 125939 -177259 -138955 -101573 -60954 -128891 101270
18007 8332 82691 -360810 -194000 174017 -72929 13426 53696 -3570 31066 125764 -204417
17995 -45138 -276260 -168196 -77746 44164 209321 -110682 218183 138540 233493 -267693
17984 -207751 -213889 94011 -244043 -194112 -22067 -152980 -286857 107267 6495 -138 -148611
17973 -148611 87752 -50853 -14456 22622 -50773 343488 -124875 -358207 -184492 187171
17962 -32370 96915 165694 -83376 -178471 30492 -250902 -126605 -50486 102447 189004 -146499
17950 204118 -365143 43621 50361 -124890 -20663 340504 -433899 -46130 -203244 258276
17939 162954 -34941 -139850 -83612 96211 97530 -286740 37859 234525 -248531 27233 -79408
17927 -6586 -288183 -195984 49387 -23020 567111 -233314 37654 331543 11029 -218514 -22578
17915 198999 272123 23073 -172451 58133 -77988 179870 -286736 74795 -88123 -95766 -60013
17904 -60013 -101847 41514 40623 185503 -65500 84654 -49790 24423 162624 -12623 -91686 -106291
17892 -106291 -33111 175445 -100192 74603 26104 74782 83773 -104687 190502 -120161 239724
17880 -3113 -45851 1855 -304239 124680 63261 42007 78677 283844 21372 15996 78896 31065
17867 97674 227886 45293 -159455 -50994 160508 65843 98493 -142869 -8 626014 58684
17855 -57885 -89163 -53578 -144215 97301 106520 149385 -197782 -167842 80371 95102 -355685
17843 78748 216737 -100276 -242826 -364852 176190 -202125 -256726 -425004 58760 -91230
17832 -163121 -306473 -208481 -375327 13728 22471 -358612 283645 30032 -114944 -39265 -4716
17820 5135 332581 60595 -56349 117374 133395 -107770 95312 47222 206121 -157993 113532
17808 -12767 21208 13387 -74312 118259 99572 251052 -131148 111168 148676 107287 -319937
17796 39958 -6971 -61753 112509 -34850 -65419 -199668 105632 109484 74278 -301266 33526
17784 224794 124933 121549 -120086 -150989 93026 131897 261503 -227381 -228305 -193456 -6100 200262
17771 82983 10276 -6152 -412296 30580 264960 464981 -20510 28607 -293827 42507 -187378
17759 297847 301252 -134669 197923 -128977 48680 241416 -63337 -27370 24158 -74651 -288556
17748 -288556 -89631 85741 -305318 42255 -39615 -143483 -73908 -85382 51051 217844 89122
17736 169991 -35077 48950 -423866 244809 -352097 151271 -241580 88951 255764 165996
17726 165996 31684 17692 221457 118247 -21560 -31388 -202123 -127149 59297 131860 78834
17715 78834 74334 68631 119699 113370 -83533 132842 -137974 -140790 371881 -174825 142107
17703 -60203 -154613 111647 -83102 43164 70990 55604 282082 28930 -42466 184295 176113
17692 176113 -35313 269056 -230715 -109054 -223967 159590 -127148 -17241 -44817 3060
17681 293847 -315518 -270101 -133159 116673 131133 -160445 -12178 49069 58831 -142837 216161
17669 137951 188151 165477 18404 -86152 277920 42416 -459290 -69642 -46736 81789 -102325
17657 43534 87906 203706 177251 327990 -310918 156300 -40142 -99829 130399 53578 77923
17646 77923 -9278 206825 -114540 -136115 175726 45009 -55077 10193 225520 -220516 -284187
17635 -284187 150461 -49903 150530 -153397 -28143 35705 279638 79976 339641 80188
17624 -241293 -187435 207382 284983 3431 147541 -126136 -14490 -185178 -35203 -213000 86237
17612 -148953 91595 16889 -197844 -233975 23337 398446 -354057 273723 117948 -280051
17601 108183 142077 -46815 159898 54253 -201977 -89309 -101394 208594 -54243 83826 110241
17590 110241 85032 152089 -81968 33494 -57047 191943 144406 188983 242882 459128 104691
17578 -165473 -81408 105571 279926 62262 104494 9812 93962 98348 192298 -208555 50739
17566 89005 9629 -147361 298480 4011 -30389 -274770 -153332 159408 5920 124518 250653
17555 250653 88855 -34736 -392731 172943 76107 67602 63626 13155 -160763 -83621 -46864
17544 -46864 214116 -23840 -110298 -103695 -149483 193217 23789 70449 239918 -50047 -136669
17533 -136669 227383 -360479 134362 -226552 -224872 137841 89365 219703 175435 605081
17523 605081 -174462 258531 109207 118952 87773 -202453 218910 -14291 -254004 -96803
17512 -279984 63673 -87289 16999 64319 68692 199395 143808 202167 -90771 230380 226702
17501 226702 7555 -33656 202264 193348 239810 -146299 -64179 154639 -132815 -31162 -23182
17490 -23182 46099 221280 294955 114202 -175997 353060 -208252 88719 20250 216691
17480 216691 250098 53173 -35473 176205 7893 121831 191583 41374 238944 249975 63585
17468 261098 61895 -118346 94225 229967 326082 242036 179706 324245 130204 87713 88475
17457 88475 283459 572278 134810 -127458 333802 247029 248355 58097 -39977 380449 204280
17446 204280 102712 187027 560075 291315 150195 459858 363033 258288 49196 26955
17436 26955 379718 12709 64665 73363 360352 269599 292163 221534 277538 511028 319106
17425 319106 449636 319213 -40457 401592 276424 -87836 246452 -171664 365466 369729
17415 369729 89725 84873 392873 444460 221790 396555 320295 41229 286801 -45541 -65959
17404 -65959 -44268 137997 112969 465588 185190 18381 54294 -71768 218632 -133100 279860
17392 304627 129887 119180 79000 150574 360828 138181 -13214 -98331 23177 381263 311145
17381 311145 274117 377100 159392 288615 281603 87422 502776 -93308 124286 282435
17371 282435 158639 258534 -122688 59577 244987 160491 73915 85432 3736 190386 261550
17360 261550 172630 179078 80366 357907 -169893 261730 -92424 246823 453471 -58093 257395
17348 196959 -81207 102150 173003 -177898 130517 263725 376130 145650 131897 213718
17338 213718 247991 152889 -133754 112493 -14739 273163 314630 174633 7309 27798 171386
17327 171386 130218 177607 367026 179530 40417 231826 222195 211279 128884 268614 276848
17316 276848 183781 409006 -45500 110188 216049 176503 -52843 128266 283294 48289
17305 312087 130771 173445 78348 -10625 259390 302268 241959 266319 135463 210768 256288
17294 256288 118935 137689 269394 371492 354142 71423 -66257 -138449 237118 325519 -132104
17282 65761 -283326 57972 95978 105870 -77440 469412 -277755 306748 188130 228439 384202
17271 384202 228836 254717 85386 32546 111873 154626 277462 250810 120523 179464 433904
17260 433904 224030 294230 -67411 2480 70552 294222 252281 121376 -33048 113168 266195
17249 266195 -106942 -139059 137151 248464 302707 40795 -92976 355006 -61912 284822
17238 512097 377664 267027 267975 -17810 60557 100271 -2652 15895 444152 -197144 364896
17226 200739 303257 197486 215610 584548 138681 275440 82470 280562 398825 -23377
17215 85548 98738 291296 407012 151403 196375 39408 172066 -142685 121557 96260
17205 96260 233644 311043 -235105 -16865 371127 273799 482758 222592 234452 177167 370976
17194 370976 452712 419257 223830 285683 385879 428788 490663 197419 -115467 228291
17183 404553 103968 -3570 259129 331220 -36399 273452 286151 462373 372246 -9924 345819
17171 465050 85893 588848 249713 363044 499709 181452 262137 308610 533646 449590
17161 449590 5759 284174 564223 359908 378786 217240 318878 391330 375308 432110 65790
17149 429063 429056 578127 233923 327109 172481 200632 360114 498109 -21223 235491 266676
17138 266676 391712 462691 302041 384110 291714 555671 52163 233637 572404 405074
17128 405074 205512 235739 458964 497720 364619 428673 582828 130679 192233 319885
17118 319885 259206 411142 454107 625713 514624 -87008 348833 103293 570430 275001
17107 151648 275520 328671 534554 377002 365288 517982 483860 466835 158101 468190
17097 468190 758820 287977 397864 585726 268505 195424 36345 253430 358327 324228
17087 324228 276704 743852 483403 740904 779975 331769 370999 329476 304616 394260 356527
17076 356527 562342 337997 458616 41029 465241 625461 487709 517398 403092 496304
17066 496304 359703 234873 569934 555099 756470 561898 573780 370979 751839 373009
17055 353052 358836 518043 534615 296443 570591 658358 819624 772562 310525 417750
17045 417750 471457 307476 912173 728534 777511 536861 650474 334954 422535 361431
17035 361431 843365 739462 401340 283965 233879 886690 114193 596746 630582 660171
17025 660171 572001 334877 727874 666571 538142 740746 791695 763693 491224 834313
17015 834313 692403 465041 489635 669416 379208 738846 645003 529097 708726 648204
17005 648204 745928 972959 896963 648993 661278 747979 491581 298284 814201 720225
16995 720225 681961 881983 588319 745943 717361 741329 955752 761102 775360 752797
16985 752797 626245 988767 807697 862312 822678 730911 992959 734800 642164 403026
16975 403026 959047 1150045 755916 771999 1177467 1082138 1213473 934425 591090 903269
16965 903269 822870 894830 707068 1079550 746281 1072315 1206125 848864 1280369 994038
16955 994038 1142404 884227 988992 922075 1254970 1010542 1267774 1058582 318085 1092417
16945 1092417 1226621 1233126 1160419 1137034 975692 1001581 1194767 1305025 960120 1053503
16935 1053503 1022221 1165028 1327977 1307075 1035362 1445912 1343676 1041972 1369278 1271872
16925 1271872 1325860 1310287 1246484 1561792 1132679 1449509 1383972 1426180 1253441 1293604
16915 1293604 1833814 1503775 1450350 1756608 1380480 1621642 1749695 1456321 1417438 1488265
16905 1488265 1553081 1680211 1515300 1656434 1494635 1636010 1778748 1899541 1753063 1850997
16895 1850997 1613192 1719910 1821639 2088754 1885526 1870357 1885698 1813382 2176335 1811434
16885 1811434 2252804 2051531 2320464 2165827 2312800 1921672 2604101 1982789 2167547
16876 2167547 2396503 2116480 2132645 2111722 2188544 2485491 2462343 2433481 2669675 2583899
16866 2583899 2478976 2386345 2784418 2806964 3038898 2934491 2911648 2922065 2757452 2552980
16856 2552980 2801528 3013797 2821786 3048054 2818046 2914355 2886627 3000248 3207811 3554296
16846 3554296 3406127 3402180 3357093 3382469 3627366 3550930 3775668 3482350 3678786 4103265
16836 4103265 3758984 4511462 3991205 4044256 4006714 4445801 4278972 4237815 4607958 4484320
16826 4484320 4536868 4614896 4579495 5072316 5090632 4925558 4975111 4993453 5144809 5490232
16816 5490232 5512629 5628109 5364717 6279368 5894693 6064404 5945689 6840894 6669840 6547288
16806 6547288 6798948 6671519 6900385 7254388 7500736 7428567 7703171 7789017 7855911 8129361
16796 8129361 8625703 8857152 8841291 9362679 9290883 9589726 9766377 10310478 10191246 10740218
16786 10740218 11034872 11537667 11620524 11883027 11822251 12562161 12818382 13068599 13439597 13895665
16776 13895665 14577425 15095926 15412123 15631277 16187765 16967517 17531015 18109967 18610059
16767 18610059 19154849 19962315 20779905 21624563 22376372 23562891 24024868 25145015 26311042
16758 26311042 27079043 28405536 29223377 31049567 31730049 33519613 35029705 36358201
16750 36358201 38357465 39984927 41942658 44191138 46391853 48559507 51492684 54245719
16742 54245719 57186738 60153349 63696566 67458375 71247806 75068047 79971351 84428389
16734 84428389 89759122 95376295 100994387 107348472 114037777 121089027 128331106 136288558
16726 136288558 143888018 151993327 159785506 167868367 175553675 182698516 189569984 195029891
16718 195029891 199648716 203077315 205234175 205752566 204661336 202242660 198476628 193776554
16710 193776554 187683634 180607665 173204294 165186888 157189765 148628588 140277532 132810351
16702 132810351 124630196 117235426 110154698 103631016 96943276 91221827 85455667 80195083
16694 80195083 75866557 71480054 67104287 63336040 59557109 56254446 53293173 50493473
16686 50493473 47649776 45320398 42491280 40803101 38844967 36878374 35300504 33655972
16678 33655972 31933027 30386956 29025199 27759621 26764043 25487223 24518044 23106442
16670 23106442 22395656 21379195 20554215 20192267 19072226 18678110 18073408 17223827 16997381
16661 16997381 16146042 15198011 15190403 14368871 13837113 13577544 12958395 12693540 12108659 11772620
16651 11772620 11711425 11219776 10824091 10411858 10189974 9805861 9882213 9424982 9220954 9043455
16641 9043455 8939521 8442251 8506776 7966556 7846676 7576973 7438664 6987027 6959344 6974441
16631 6974441 6508844 6639615 6664251 6487273 6276633 5841812 5574431 5816144 5885837 5530825
16621 5530825 5127124 5194626 5011750 5079704 4894657 4769990 4868429 4557804 4450691 4431129
16611 4431129 4436501 4224218 4400486 4307302 3989635 3878541 3787008 3795131 3877171 3549561 3731052
16600 3731052 3423564 3333981 3477862 3098883 3064745 3223331 3206935 3428782 3015802 3159901
16590 3159901 2954532 3275560 2928977 2712619 2843150 2999537 2646809 2656573 2449014 2813011
16580 2813011 2709118 2569026 2323247 2323380 2417615 2300701 2369916 2432333 2317292 1986779
16570 1986779 2219953 2062507 1909555 2022316 1748241 1778406 1944456 1999757 1915662 2117253
16560 2117253 1730943 1863609 1450048 1929920 1701319 1589577 1623711 1607581 1675893 1564583
16550 1564583 1511206 1651954 1425114 1577669 1834112 1576487 1472958 1443952 1445937 1488226
16540 1488226 1273016 1588284 1192074 1046606 1394373 1282586 1536240 1352859 1377091 1042376
16530 1042376 1489819 1190875 1414356 1019631 1153177 1201025 1447785 1041939 1205601 1103224
16520 1103224 1248993 1394871 1257570 1081505 1244869 1333861 1078033 995178 1253702 990996
16510 990996 790997 1162583 951448 927853 651692 899999 1099216 723323 1216980 885901
16500 885901 1011301 1058509 666745 576931 1076195 697705 1034379 1096170 479969 625761
16490 625761 881102 743584 836530 662784 601813 854578 592196 816774 625796 613381
16480 613381 604688 579850 394743 614405 517706 801110 555895 738891 485831 868681
16470 868681 881295 854989 424846 313158 440973 559338 674132 411011 608052 476559
16460 476559 622402 775868 753408 350159 519193 636423 397893 542682 811719 243012
16449 539868 341605 692768 562706 478045 495637 794828 659207 497687 556033 624441
16439 624441 224952 424392 315322 253421 398061 383644 341862 329434 238039 360327
16429 360327 470475 587079 449187 480803 429074 464171 306806 485402 263739 115307
16418 485683 542852 670257 431660 495680 475265 476469 405100 243979 219463 383241 293814
16407 293814 305452 468267 435722 461714 449374 249979 530982 443058 411606 391048 447659
16396 447659 311631 16017 211210 239868 225463 515914 348989 -76916 283102 367939
16386 367939 210952 348597 541028 190055 186874 140235 334601 453405 17586 128842
16376 128842 202618 -212625 137224 341990 410348 384492 278274 447128 20991 344103
16366 344103 119671 58092 40180 322634 396281 217118 71006 69632 296599 66103 43485
16355 43485 157794 215589 303379 243295 410875 43250 106153 -15792 549936 377870 335265
16344 335265 294073 433658 138654 222927 169853 309641 -215344 271011 211624 118694
16334 118694 -77429 94696 104672 566382 231713 178378 257777 317383 181272 380338 393005
16323 393005 43443 188924 291003 225231 367412 91247 268347 16567 40377 6540 106770
16312 106770 204063 161020 218618 420013 289505 54938 68632 27924 248953 109877 95605
16301 95605 136488 46123 161612 313760 -77254 337978 228139 -224451 73379 208409
16291 208409 31107 101046 35127 113662 -27782 78402 -115393 156675 68995 104766 -151538
16279 305369 321530 322504 136515 233632 -11529 -168374 65655 314091 394562 485086 250935
16268 250935 147833 44233 -76483 138290 189227 -17730 7259 78351 200416 240219 -32449
16256 -6308 18750 -259048 54361 -62119 -32948 -290178 -68228 98089 -58315 16936 39434
16245 39434 51245 -95867 202669 -62159 114258 409157 -429 99689 212362 158031 122811
16234 122811 -32732 -29288 83584 -29695 -6689 42777 140700 168133 100998 -735 168315 532102
16222 532102 -233232 306820 181921 156600 253421 -149776 230414 -154498 52346 -128783
16211 172855 55838 -38048 112756 192885 275565 241425 229692 -242834 47463 -54105 144870
16199 383236 32168 180298 -59626 -36929 -21509 151821 -244307 271590 8996 194767 -31965
16187 -169757 -36634 -146781 -188518 38161 412286 56498 274666 80489 60297 80331 53644
16176 53644 191987 121168 91491 272959 69315 245631 86145 -72106 -43538 -120097 50502
16164 75379 68383 46808 92455 -175445 198517 -204587 143359 -57588 40189 311187 141751
16152 -152454 -272749 84291 -200335 142874 81349 -157948 115886 -95916 236029 73486
16141 124885 -304879 -85534 -48402 86673 386426 77532 108343 -22186 -23346 -307669 146164
16129 130249 379583 200192 -2040 87922 22369 -114280 131252 -35929 57751 -86526 -159185
16118 -159185 -24019 119472 -108710 126736 234845 299615 -280365 -81255 9447 -241895
16107 187926 -108660 -139263 73217 120781 61890 51133 14256 102815 54946 27763 157812
16096 157812 -163023 298111 -115816 -108473 -206350 14882 101439 106624 -102077 -50377 -314536
16085 -314536 -449 207339 -22174 -298942 -21878 -136745 211435 -109306 -93115 -75284 -305693
16074 -305693 -136396 -319992 15913 136909 -319433 15788 -50854 -152138 -77298 -65639
16064 -65639 -32407 -247650 255850 86434 -348241 -89651 141745 -285890 44458 9956 157381
16053 157381 151668 23821 -285645 -389827 -29009 83396 -149033 152243 -46410 -315078 -10367
16041 18594 125593 -145774 -57832 -78829 81865 153231 159225 -275832 -250134 -184167 -71236
16029 58778 88512 87135 -39155 -51715 50045 229057 219367 -182290 280143 -297819 225884
16017 87688 50804 -213355 -31775 -164841 -152914 336 212750 36168 -85863 -91554 85014 -231905
16004 -176620 -144032 34993 -10872 186050 -78013 -158029 -189658 -11352 32494 -130802 -101377
15993 -101377 222586 -55045 -245971 -175931 164340 -125967 -543454 309361 480061 -8968
15982 175393 18918 374676 421205 20269 -24028 87701 -34207 -89978 168513 -15184 -205805
15971 -205805 -90351 -62842 -27569 -4278 57178 -57093 -80052 -113261 -76781 164575 259924
15960 259924 -86795 -65777 -271092 98282 301948 15507 63985 204509 -9671 324533 -4136
15948 -95432 -44736 -132211 -258666 70492 -98980 -140017 20701 26497 -164835 -232032 -512371
15937 -512371 -109022 221169 -193622 -152825 28803 -313064 -84053 59868 67822 -202611 -20369
15925 4380 -26839 143017 -183058 157105 -36949 137735 171381 50100 50216 204241 108930
15914 108930 -52055 28364 223067 -198476 -126781 -9135 86621 -277970 173809 -287073 21936
15902 51085 116950 -118135 -16775 -112463 -194185 -9399 -65830 -199189 -213828 70091 -86770
15890 43499 41529 144769 -116988 -2737 -131671 258604 -244666 -155764 136326 -336276 -390899
15879 -390899 -126053 143684 -177508 12370 118511 -33192 -367460 -71633 -86360 19121
15868 -10143 -141975 31269 -46590 -56132 -65054 -101394 15511 58257 -168682 86464 116756 -14182
15855 95763 -52055 271067 -26795 -86190 -66104 187176 -169260 207842 130775 67982 399420
15844 399420 217377 37181 -215088 -94440 -44673 -105016 -265677 -221456 26774 -277027 -1329
15832 -193070 -125166 -190063 50029 160589 54788 -14148 307594 9479 78915 319398 43068
15820 -67790 -94679 252965 -511657 108566 -158037 -64585 -185223 -127687 -269461 100400
15809 199375 280876 144247 -183450 -32562 26894 -83335 68405 -134492 127665 -187446
15798 440783 -9155 -134958 -263368 -79407 22358 99399 -249838 -108189 -107727 -34958 -51628
15787 -51628 59649 153300 69853 -271163 99484 -79947 -44269 181114 -130914 -124244 -94709
15776 -94709 -39547 178002 -35270 -282066 273844 78604 -374138 24640 -92491 -150309 -46369
15764 574738 44447 33505 34295 -178999 17569 157569 -7003 -48904 147390 -29322 -30658 -315845
15752 -315845 -196891 417839 -86266 153727 -225156 211004 -174336 -88427 -253896 -69336
15741 106525 180100 -43726 -62203 -265332 -196693 80489 -304996 -72645 1640 -144189 125954
15729 -5151 -152046 163337 68340 -75577 147442 178949 -151719 302366 -306312 -186206
15719 -186206 -300395 -131450 14203 -81074 -57556 -161164 -273858 50777 -30993 1835 -101223
15707 15728 -276842 21559 73997 -188252 -94931 13194 -129036 82931 -107110 -12856 -13743
15696 -13743 -166218 -96395 -272221 -88885 300285 -79665 424711 -141517 110575 98185
15686 98185 100402 -21281 131702 -329453 13702 -46722 -172964 13779 -4026 183644 -325710
15674 -176320 122062 -49463 -74407 351456 -76820 160739 -54959 -41658 39473 15445 216552
15663 216552 -150145 114778 -135086 -228052 103710 -134763 255104 -38570 39074 179450
15653 179450 -49586 -175151 -397197 345261 67684 196854 -12887 -69087 79829 -4328 -182380
15642 -182380 -286201 -423008 -111257 237271 215479 295419 -21855 -245158 -284223 -82203
15631 -428804 -482821 -125546 91267 -101219 -36969 74979 180575 217633 -11648 -104947 -63120
15620 -63120 -274436 127897 -157738 303300 -298421 -72596 61730 -193260 -101943 78887
15609 -230096 -139358 -435265 -26922 -258557 253414 341601 339458 -4012 54237 24673 -222106
15597 291756 -181965 -203229 -170247 -52499 144678 30715 -25738 -350625 65497 36984 189388
15586 189388 130475 67304 -342068 398685 -69126 -100189 18090 -74513 177206 -244697 142780
15574 166727 141189 64596 36035 131177 24038 -15443 68517 39197 213859 78225 -111196
15562 -172474 -332274 -8662 91242 311941 -90427 -150555 79204 38962 36428 102592 -124535
15550 226045 60209 -38988 -141273 -569033 23700 -164934 137356 88517 -194558 90931
15539 237465 12211 102539 123567 384439 96290 10612 97986 -200758 -70675 240599 -23384
15527 -61759 209993 180288 -196081 145817 -150515 164667 -69204 148150 -62906 -69886 -32424
15515 -71363 196995 197745 171671 -203130 95694 36289 262247 -484858 -72074 -278951 -351922
15504 -351922 -201684 -46525 -85255 194839 -299717 -251522 219545 -330787 -21877 -91778
15494 -91778 -92805 272667 -81412 -107471 310957 67129 101893 73050 38850 242521 -123018
15482 -60402 -102916 -228789 -36412 -87749 -239191 -92261 358425 9712 55721 -121059 -253479
15471 -253479 4787 -244938 67365 -66903 -251070 -13385 -40220 -172898 29892 28734 35560
15460 35560 335029 111003 383233 -99544 38452 153554 18368 -43335 205323 39480 -87127
15448 177922 -183287 -177923 326347 -19299 31104 257733 -189082 -176277 97912 -20953 23006
15436 -23500 -90383 116637 70362 67850 -117403 -1359 63388 189565 -24695 -6720 -211887
15425 -211887 -21120 225773 -55895 144100 221343 771 -11620 123490 58845 285210 29224
15413 72757 -66218 -275170 -103716 -81577 79445 -164445 -27746 -165715 137013 -378 303149
15401 313719 234012 54747 109400 -280060 261035 -259996 -157084 -77926 -12545 123551
15390 233000 -160646 -204208 -79676 -115587 -335293 -214680 306413 104244 117882 -52308
15379 223554 163641 88045 275442 275897 -94017 -237722 87006 -177427 41501 197509 109523
15368 109523 82810 190874 6059 64564 -148179 167533 134258 -182520 16981 53756 -111429
15356 1546 94000 199305 130987 -112488 452495 14101 -196169 76382 -233733 -287476 69351
15344 -74182 -137072 327096 -15716 -54978 -100057 32997 203980 137753 -353149 36233 180681
15333 180681 -77074 21637 -214711 153204 298815 -148088 -67228 -54435 -26154 56632 -188940
15321 -245297 9056 -243404 -185524 -232147 -166098 259099 348740 58208 -62500 -239374 -84819
15309 -156579 -275941 -140296 120150 -277286 191051 -259092 -118138 258858 -148345 73906
15298 14869 233379 -45340 138168 138255 235868 317248 251171 163660 58935 -42824 -24459 -80429
15286 -80429 102411 190805 85554 -241735 -95271 147397 -78677 105619 68697 342350 -39558
15274 -97127 -81314 49529 -34706 31170 -245692 37272 45182 296915 -177276 331005 127934
15262 235189 294715 165816 25506 -40010 -96907 101066 19039 -117508 99938 78011 92137
15251 92137 372758 217209 402308 1229084 1686338 1325866 1826337 1140698 312132 400905
15241 400905 147181 41889 77630 96498 -50889 -21498 132827 -171783 92588 61271 -141075
15229 55029 -166572 115042 -19192 251601 -176817 64731 151630 220435 45860 206361 218447
15218 218447 -78950 111084 -376706 300071 -56173 -151847 151328 150888 185080 136646 36857
15206 -376030 454583 -153898 64855 -110178 30604 225361 -214624 -41638 56674 32865
15196 32865 102005 326026 311534 292576 163068 273783 172779 -98135 -10146 87487 2485
15184 189785 229338 213139 49654 200934 -191439 232907 185792 156933 -81504 -45698 177100
15172 4511 197401 198982 -190600 -58621 212293 44673 343094 87623 -39813 230294 -22171
15160 -149659 169528 -126762 192478 175978 -31662 -35028 -67697 246834 -73169 380038 176901
15148 189395 69251 172386 -1309 162657 -23213 60108 206133 -22622 229133 -171295 283209
15136 138979 73371 -2374 286497 -83087 280759 -118678 69300 110375 82602 201394 358069
15125 358069 -65329 253928 168249 204429 406898 97699 285925 60574 320546 -40646 303112
15113 -173396 69528 295118 229431 -134271 152865 438058 -19112 205307 145835 284704
15103 284704 -189780 4241 237499 1617 -14627 462771 163011 194228 414051 199665 380153
15092 380153 109476 -9839 -5487 365882 -33425 51033 152573 418762 299053 249618 152318
15081 152318 166126 93875 234702 356919 159399 183921 172924 342805 294510 -105490
15070 234048 144850 200386 215182 102681 -20118 222229 186470 -33759 176115 -71780 220211
15058 -45986 -88857 175428 349931 385345 100518 959 150842 279690 108874 251085 196441
15047 196441 -111131 -33874 -70350 148664 -30637 381870 -62621 274387 -58071 165134
15036 181605 231891 -206507 198968 -106561 376588 185376 104129 250709 386551 202936
15026 202936 -98227 162171 -86480 135235 189092 67112 52708 392486 124387 13127 72550
15015 72550 16235 596991 299375 -69377 191344 531694 132658 10424 -2968 315120 265681
15004 265681 -134261 365676 216768 174990 -142871 -354373 -5585 362946 406164 75502
14993 75917 52370 321398 -150227 325165 413357 416740 363765 397788 -20569 412652 419853
14982 419853 104347 179947 465642 119435 180209 358881 215830 154509 16198 -92700
14971 423626 362164 153062 435003 320968 -72848 467411 341813 165521 89687 58921
14961 58921 453459 221684 325234 504539 194453 175874 144653 267996 523384 207082
14950 -145046 148587 545297 158113 122060 244099 529609 278275 396885 244177 361015
14940 361015 95540 180326 611771 209038 415476 452522 415633 111322 51065 429797
14930 429797 289537 37764 540954 91587 317086 42383 240760 352555 348558 135209
14919 435835 382429 378368 93605 349546 562899 368583 404195 732944 403829 158891
14908 319927 451965 512470 519879 465300 461376 158792 494253 465749 366297 3415 208724
14897 208724 102462 388667 253047 168892 166576 297059 386557 629877 237766 544743
14887 544743 469736 607827 332713 585730 222631 382944 179658 408640 129635 267701
14877 267701 515117 302748 481682 532403 327049 485246 430909 661467 368533 477149
14867 477149 272820 456670 562476 572602 381404 439309 508455 462591 -16504 599828
14856 519883 587000 453015 421257 170027 334296 810062 583819 777715 380012 485734
14846 485734 476654 575308 571720 468314 416114 461043 607434 203787 434856 339736 594310
14835 594310 353591 253713 569746 814316 596057 448527 574245 526865 322685 536162
14825 536162 672233 354454 499015 573467 58842 444881 460999 259497 800637 266979
14814 502923 638135 258409 433127 562893 580881 498434 626789 728822 577546 800613
14804 800613 703116 548794 406437 261738 418520 608521 689450 1041815 455544 617561
14794 617561 585034 256313 581905 611239 467255 577121 749163 573368 708092 555439
14784 555439 321346 334450 575232 630308 775505 292211 423336 764666 626096 417645
14774 417645 383632 959533 534936 564671 558908 522659 671107 625808 525430 804853 499535
14763 499535 410802 292932 741907 379302 640224 568695 869578 477744 616980 501845
14753 501845 494295 713513 908056 537429 765907 672597 649584 676602 628901 619822 738265
14742 738265 609166 736967 562975 806094 786685 888200 511250 733161 703454 820818
14732 820818 805863 794904 526311 765684 724119 722738 779507 1026950 843754 792524 783112
14721 783112 627727 374505 1099410 834688 897742 433564 946953 946499 965795 1088118
14711 1088118 774233 613057 600436 964563 613472 883578 673300 987533 992506 867145
14701 867145 873955 801593 756411 772519 618250 809667 725240 1006722 810782 1277230 815581
14690 815581 710996 1177475 1060524 694307 557033 988018 1049176 729148 781148 1093148
14680 1093148 844095 951060 924268 1123940 959738 1109713 1170456 914452 1199433 692336
14670 692336 923039 1070274 1081768 1126822 746858 1123813 840579 1063366 1223044 1031120
14660 1031120 1002321 918271 928975 1011693 1081035 887171 1082925 1171357 1152033 1383140 1288488
14649 1288488 1170818 1185428 1159762 1342531 1368075 1320212 1146732 1080840 1247104 1372588
14639 1372588 1750973 1189583 1554905 1483551 1471774 1285502 1478367 1338726 1334541 1738080
14629 1738080 1558177 1312533 1678184 1574772 1454010 1551420 1282354 1523290 1301161 1598428
14619 1598428 1611608 1586458 1420301 1622247 1136859 1915650 1809985 1172999 1494942 1414836
14609 1414836 1638784 1789936 1691412 1997053 1950525 1869660 1981009 1607967 1536019 1494241
14599 1494241 1367783 1455028 1521240 1465844 1664485 1876933 2224828 1584299 1949206 1896478
14589 1896478 1918547 1982275 1716284 1978364 2074515 1835054 1975376 2037935 2033933 1941214 1802511
14578 1802511 2311686 2288510 1949763 2147368 2323935 2413062 1942289 2294427 2276134 2273946
14568 2273946 2520455 2236589 2573083 2274602 2655958 2900734 2164087 2772820 2720106 2881973
14558 2881973 2770665 3141731 3105844 3234280 3347922 3778091 4039572 4858760 5603580 7003620
14548 7003620 10738747 21319798 44090159 45378483 22160408 10221540 5208483 3606982
14540 3606982 2534268 2340980 2196327 1966769 1920606 2225144 2155240 2179661 1897826 2210153
14530 2210153 2481756 2544780 1872075 2306793 2427062 2320919 2649441 2322796 2627260 2499770
14520 2499770 2176574 2647053 2520736 2316530 2897477 2521105 2688231 2573253 2605311 2608281
14510 2608281 2772511 3013829 2704566 3266250 2790586 3238237 2618703 3019580 3326829
14501 3326829 3271123 3051308 3616110 3322695 3242201 3241122 3463242 3130598 3510868 3479060
14491 3479060 3300146 3833900 3348852 3978937 3670406 3659916 3599888 3693915 3707903 4106537
14481 4106537 4323870 3980192 4300483 4150568 4222967 3936671 4176237 4674765 4068211 4567639
14471 4567639 4517309 4508960 4704632 4269038 4879124 4596759 4567123 4693566 4874219 4981752
14461 4981752 4774073 5137158 4983486 4831640 5180767 4812999 5517902 5270474 5457868
14452 5457868 5682230 5578511 5745174 5606258 5829833 5671908 5914299 5910576 6234997 6100128
14442 6100128 6444498 6247269 6388302 6197521 6529743 6739713 6589131 6853772 6876025 7221812
14432 7221812 6989126 6921835 7596658 7488135 7192449 7436610 7701848 7672198 7707234 7791388
14422 7791388 8101496 7908998 7916733 8265269 8245009 8422324 8723533 8544459 8744123 9461296
14412 9461296 9059768 9430672 9381945 9630317 9940754 9864661 10249751 10566543 10429410 10616357
14402 10616357 10778460 11195454 10932152 11429726 11267416 11734559 11481521 12175378 12233695
14393 12233695 12155776 12697666 12867558 12741732 13136679 13518662 13605148 13675734 14332960 14434936
14383 14434936 14561900 15247220 15354405 15392925 15716080 15730348 16270128 16678881 16856180 17409833
14373 17409833 17910030 18257613 18017116 18580292 19064719 19581139 20018040 20482042 20390383
14364 20390383 21311381 21553493 22120205 22382364 23214539 23370262 24247414 24787768 25267156
14355 25267156 25571690 26317042 26987199 27580086 28257921 28619472 29526910 30393384 31229468
14346 31229468 31826148 32479668 33549684 34606326 35296323 36291428 37497429 38360509 39613614
14337 39613614 40627776 41702715 42799976 44144878 45622076 46893152 48397717 49609979
14329 49609979 51196615 52974222 54822279 56105075 57869745 60262644 62248588 64214583
14321 64214583 66648458 68944992 71290892 73978236 76803104 79319487 82497939 85681347
14313 85681347 89048403 92551169 95862591 100251148 104600182 108796748 113680348 118243097
14305 118243097 123530505 128814395 135278787 141310479 147489879 154545677 161542595 169607701
14297 169607701 177676824 186203716 195131061 204730648 215274962 225882708 236899701
14290 236899701 248682989 261071285 274039871 287418955 301321778 315560975 329933886
14283 329933886 345069323 360127786 374988129 389635518 404073991 418449513 431131006
14276 431131006 443310075 453562449 462943893 469683034 473656805 473357786 469183480 466422134
14268 466422134 462366532 457157616 449529683 441239797 431388493 420016670 406833539 392986665
14260 392986665 378103197 362507037 346564998 330786268 314913530 300261303 286466572
14253 286466572 272850570 259376751 246327529 234199209 222566354 211969287 201509701
14246 201509701 191607796 182544692 174364461 165881660 157865287 150711768 143768120 137516502
14238 137516502 131848699 126193244 120378385 115274552 110454356 105787628 102031721 97904361
14230 97904361 94227398 90455182 87052943 83602150 80530570 77262696 74463765 71968511
14222 71968511 69265874 67225746 65091636 62665966 60491843 58778394 56517342 55040981
14214 55040981 53541890 51943734 50471256 48779386 47030132 45634931 44581263 43925230
14206 43925230 42902617 41208108 39990781 38607990 37519937 37335145 36266421 35183666
14198 35183666 33985243 33231415 32157424 31249562 30997253 30231774 29661846 28402990 27935264
14189 27935264 27157210 26851674 25980238 25051977 24667124 24156362 24054059 23203708 22701450
14180 22701450 22067053 21721118 21479400 20737238 20697126 19931265 19642460 19136875 18700155
14171 18700155 18432048 18243399 17899709 17206371 17348108 16672320 16644149 16513358 15693479
14162 15693479 15533022 15676354 15118425 14762225 14737630 14362148 14076314 13892018 13658525
14153 13658525 13608405 13304041 12974864 12690823 12612185 12435616 12358672 11765627 11780081 11730614
14143 11730614 11597950 11236868 11096466 10809497 10496629 10484442 10733633 10658750 10109535 10149387
14133 10149387 9942311 9795782 9710661 9453739 9046532 8663775 8947803 9008937 8949142 8461804
14123 8461804 8464540 8440039 8416268 8259401 8284020 7907176 7974133 7605660 7818242 7513996
14113 7513996 7740269 7492224 6903446 7117716 7268972 6970756 6981696 6864953 6884587 6909644
14103 6909644 6792987 6656783 6571074 6068195 6268613 6351059 6278813 6077913 6287530 5874494
14093 5874494 6126616 5867052 5922396 5858676 5563335 5553214 5671252 5182434 5243637 5265699
14083 5265699 5316503 5029373 5327855 5051677 4903087 5066655 4886339 4963631 4742280 4998959
14073 4998959 4964934 4838926 4795699 4659680 4639320 4635073 4368367 4172281 4054334 4256624
14063 4256624 4225255 3785646 4295535 4162751 4129399 3936602 4199331 4341324 3880516 3911621
14053 3911621 3861076 3886105 3936093 3703672 3885790 3781235 3587844 3749211 3611484 3558185
14043 3558185 3543576 3657146 3409270 3462834 3491425 3183483 3144458 3222287 3320763 3113505
14033 3113505 3206069 3355800 3523672 3251614 3205844 2956108 3079699 3039544 3240726 2873815
14023 2873815 3263155 3174140 2816580 2576353 2906467 2932036 2832657 3012611 2923392 2621517
14013 2621517 2823573 2682907 2649667 2441428 2593123 2696250 2363803 2469049 2295325 2186062
14003 2186062 2440591 2490963 2207252 2313535 2321697 2148734 2157035 2211650 2282536 2149158 2365905
13992 2365905 2237955 2422806 2530846 3246477 5370029 13162725 36787502 47815145
13984 47815145 25976952 13930820 9093788 6210886 5063736 4648064 3677262 3595557
13976 3595557 3220440 3143725 2657127 2916341 3070758 2869997 2608484 2485927 2758832 2333711
13966 2333711 2412572 2544742 2508681 2393261 2279447 2303814 2258405 2374802 2373824 2011762 2288138
13955 2288138 2514677 2067647 2111475 1960426 1800473 2292556 1896814 1923603 1940820 1928922
13945 1928922 1904718 1702433 1916246 2153152 2070378 2117855 2310342 1861979 1699428 1677130
13935 1677130 1943466 1634384 1684862 2026118 1873359 2014972 1725160 1744692 1589211 1651545
13925 1651545 1343595 1523655 1934364 1583051 1621821 1513591 1986057 2014605 1705657 1685893
13915 1685893 1566033 1397252 1534046 1572163 1628109 1372710 1337138 1769370 1529197 1514846
13905 1514846 1144662 1453604 1245588 1477043 1595678 1185978 1150582 1660780 1406523 1442406
13895 1442406 1678234 1507484 1183004 1245411 1140787 1260901 1348151 1127586 1380901 1165337
13885 1165337 1452108 1007875 1320566 1026253 1175818 1459404 1275505 1196964 1329831 1008793
13875 1008793 1272522 1168364 883034 1360231 1065999 712368 1085914 1346792 1113990
13866 1113990 1256643 1084057 1100791 1217509 1340826 823037 1362562 1081896 1202373 883113
13856 883113 1130531 1112634 1118835 920689 1351873 1093166 1210630 890151 1022893 1040485
13846 1040485 854806 863278 1037489 1280443 1152569 1242570 1145932 1209388 840315 846249 631323
13835 631323 870835 1014660 1241707 1052670 924370 739092 898711 973716 800297 1029521
13825 1029521 898939 942878 846414 1011071 859482 717357 947650 997719 1055572 1116163
13815 1116163 860585 1240075 664698 785801 815916 1147953 747885 596535 750269 932709
13805 932709 915169 857584 643739 1294110 716393 655685 802510 829627 1097344 848124
13795 848124 1078397 885440 1006159 712643 926755 990157 749562 534195 760683 945940
13785 945940 656624 522987 627022 745586 650228 771755 652138 717662 1318996 804944
13775 804944 573508 597126 817899 658426 765666 680297 786694 836538 354640 645690
13765 645690 573768 663265 526059 711136 853936 924255 964137 674166 706362 440754
13755 440754 933409 888305 776762 642857 551386 14600 632284 893627 1006554 628637
13745 628637 627576 662340 394445 408856 411488 490968 775266 768476 711200 613410 553997 824453
13733 824453 523516 864404 546249 856739 370971 592492 797858 491473 615183 779696
13723 779696 611312 516539 730852 901528 602313 545740 453830 662140 371846 414453
13713 414453 634092 1004472 569562 891348 45643 701593 464104 594404 639460 1009391
13703 1009391 861682 507543 743238 441939 768280 534912 561791 387432 974157 562880
13693 562880 512739 795981 816519 692177 654609 403896 588534 705505 571527 464698
13683 464698 61979 643159 245159 932832 835977 390208 485013 501277 510063 386104 719282
13672 719282 403515 282660 464163 577796 685106 535031 142401 259130 428960 423919
13662 423919 690565 73263 349743 247793 518282 296450 599204 461081 449167 453420
13652 453420 435204 178321 649856 666210 525881 262734 322996 222938 900659 184723
13641 149543 585166 420725 346193 248149 587987 665433 390995 522345 601939 421826
13631 421826 359096 550868 92265 330799 215920 300000 423463 154285 519964 386330
13621 386330 448817 580768 495015 243644 -281931 240203 217900 576233 554165 418948
13611 418948 295605 62706 368726 561659 747308 464171 570390 410804 569010 471272
13601 471272 544099 415532 731272 224002 503869 283931 467789 361720 468855 553810
13591 553810 329602 655539 323413 322523 496414 420487 394664 349415 503725 549829 254112
13579 407515 254578 462208 409750 281479 111318 575088 65793 355607 674538 320887
13568 351027 245562 121681 604276 1189 -26409 237771 335451 630634 405314 616023
13558 616023 492039 285463 185146 27309 372344 301329 186539 484946 120981 -17710
13547 261119 158151 299687 44738 317440 547195 142625 172895 109194 521713 198254
13536 393004 256532 249078 286092 355473 175252 472733 256835 506916 396977 305473
13526 305473 323293 250094 1051175 340672 509138 207611 387417 622403 614598 316588
13516 316588 510561 231710 -64239 157874 294331 349724 8779 534700 24465 24590 171680
13505 171680 266824 14589 258464 183796 39065 352688 448660 256371 322224 481622 326416
13494 326416 309361 509520 304702 440374 89776 182814 577289 550386 65081 258157
13484 258157 197541 165145 152211 354560 38083 329636 540114 49377 71093 309386 257803
13473 257803 480238 309542 -38784 21113 8048 304068 372697 79504 355435 399114 585869
13462 585869 186597 119022 268915 580470 3653 441028 400239 305181 229593 111549 288722
13451 288722 163066 240137 388045 148201 537323 285295 318436 389057 359944 304844
13441 304844 332254 297516 158794 103934 164206 282471 62658 255140 166922 197687 324186
13430 324186 410023 182657 343401 355003 147759 354797 346357 180389 288807 216484
13420 216484 163078 280377 161113 314084 190412 286620 566107 111412 54054 372352
13410 372352 202552 302908 287119 141528 121565 167069 361805 40976 300818 -21046
13399 310318 248384 -16865 412057 -1147 17884 126183 288718 219138 188116 146987 95744
13388 95744 235162 159520 384215 -273352 278598 341127 317659 -2262 97834 449955 134598
13376 181647 735257 346831 168514 301682 320166 289544 231117 173247 320389 60670
13365 -87621 291530 289411 206312 62357 61263 138379 136805 266146 263333 51149 144764 423014
13353 423014 249918 317476 16703 273436 270780 319294 151226 474192 280507 344318 448089
13342 448089 415338 220895 383984 416837 426380 167866 180414 324773 192213 192866 75283
13330 -26341 189232 469370 -1765 -124045 219260 165169 66071 377143 232972 447304
13320 447304 222558 278504 101737 347516 -166456 298527 292181 313629 369680 -83453 359952
13308 199185 -71784 38004 198495 -1044 -67671 181343 -283229 250387 4345 -155539 501841
13296 321446 434110 168862 480481 -53610 5643 207881 196299 -179639 328293 239051
13286 239051 93586 139538 305149 -5819 -233779 26115 236631 80922 -92452 22405 206024
13275 206024 -112935 86308 398647 -87080 339239 469619 223369 -35652 457152 145381
13264 -125329 85013 313998 -208950 170452 124888 197615 55970 26639 231485 179208 -252881
13252 172274 -8765 530738 220382 132090 172798 -185291 -120327 204158 -221322 373434
13241 154456 24223 133391 -179337 215826 301102 120920 408874 -23218 -100484 124133
13230 20881 198722 -70037 173511 27763 -132339 123289 539533 279964 -85579 -130426
13220 -130426 130708 78301 390258 324074 247496 131105 109487 87252 44970 21942 256876
13209 256876 -120267 98258 -101482 188145 -16773 85582 388410 346546 339529 -53748 -117405
13198 -117405 288684 160534 10526 111497 144433 74592 24658 -85857 -66967 229788 356545
13187 356545 -146873 411484 79814 286948 19234 -61462 491 -174041 205108 -47340 4355
13175 381278 -73797 -63358 -396618 -184883 49658 202048 344606 111079 -4091 93201 202748
13164 202748 330317 175056 -54946 183745 -111650 212286 -62209 409239 425124 222336
13154 222336 183363 49805 230372 -49469 -24051 312993 23508 186939 242308 -10394 -112538
13143 -112538 180236 -310513 128379 6442 206333 80516 -36222 88837 86253 -263704 -241710
13132 -241710 94814 -83248 68222 409136 178796 631524 326199 440365 -79899 113160
13121 149705 162031 -226514 116746 160559 -100698 137727 4668 -124028 365928 -286008
13110 -106021 -217550 -115212 -132302 17920 2086 244337 56213 21849 278036 71055 -14281
13098 178391 14704 237750 -199450 24827 -301497 88390 229746 -31100 187319 -9137 470062
13086 38219 -375731 3473 -447 -42020 -13808 494581 154522 210212 274139 -38445 47950 -63621
13073 -27069 -15081 48077 258666 366874 135902 129262 428597 174650 -101981 -188371 379002
13061 200771 123266 -54338 48562 360242 343009 292608 133479 -160773 -17693 -64015 -106624
13050 -106624 -302366 -47001 41759 -15579 -104461 -197186 -455335 230996 232412 48072 -104659
13038 206048 130771 446282 146595 51046 154958 85317 425829 -59680 111253 193567
13028 193567 106645 4542 248270 -197005 -125941 36889 242381 94279 124949 453775 209526
13016 269527 100903 103740 57466 530864 194095 177216 17362 101855 399079 -4257 206382
13004 94526 -29181 -222016 36094 136788 -10173 42888 574403 -154707 -58085 21072 340036
12993 340036 -367769 -82177 115127 33294 41692 158667 59830 265466 251329 -156040 53064
12981 268123 136326 -84597 120113 43120 30713 65492 52862 17757 97990 -9275 220539
12969 64906 195459 382261 -32385 -78504 103822 210807 -29100 289168 392820 194451
12958 -73430 53661 -63540 124600 431134 22308 13910 226722 104646 273044 -38213 -4693
12946 -82251 -503331 280015 -55349 31939 -87109 216236 444686 262532 133486 181497
12936 181497 -105003 -17695 -254737 217970 -140052 4261 107278 -110420 30444 79104
12926 79104 259547 -37501 -226123 -205869 266509 82698 -150825 -206576 -216242 -221084 -130488
12915 -130488 29609 150969 86445 -96974 -48042 61980 -67763 35999 187556 282298 220222
12904 220222 166561 -22896 71942 -160115 148365 283750 186229 33096 220038 325384
12894 325384 -30553 41999 277012 -2698 -46607 168101 82262 200636 222003 124835 93679
12883 93679 -25012 63377 -22202 353106 54773 190051 -35307 -233007 -73715 367916 -40630
12871 -41342 309770 69833 -4853 205077 160297 49689 73122 33685 -349911 -389544 43150
12859 165324 340538 218659 125977 169584 187421 -396966 16457 -47261 120478 220203 84073
12847 -70376 77431 257417 137822 -265675 118884 -92072 -342850 54848 160122 120783
12837 120783 69698 130154 -143810 -5407 -42347 -358959 -28922 -92347 242556 187576 60795
12825 141814 146759 98314 -12893 -44816 -313576 -144081 -155902 -98117 23883 -50384 -58144
12814 -58144 -57338 417443 253251 -151410 244602 -347054 234077 -55164 -183648 34190 -42713
12802 4281 -121016 -5576 -71587 101880 282103 -41296 10179 -360987 -28919 -122838 -262449
12791 -262449 194185 -241712 185167 57983 201246 -111302 -100499 -90626 -804 -96422 -15628
12779 -87463 -290202 -315391 101318 -84011 -62001 137032 -77100 136528 267362 104329
12768 -3327 293009 -489410 -250608 -34205 109082 16104 85254 279082 62383 194227 -136790
12756 272061 -195628 158907 -91621 201772 119379 114958 249019 -142739 36005 -54432 73230
12744 -153369 -21785 -50046 230723 62706 179705 134510 192708 94674 37005 164159 173417
12733 173417 426323 -1303 83917 76775 -192652 -64051 -12448 -297179 78945 -238553 256851
12721 104069 -70764 126289 207771 253151 -14378 101142 -236516 -89932 37777 146709 -108350
12709 60922 231168 339872 22774 120873 369186 355680 241715 461680 -244558 150738
12698 357085 106177 109 -159347 177647 107642 -221398 58200 101826 89824 -149761 -308210
12687 -308210 57067 -14558 -270783 95623 -25028 199215 -78618 116924 159150 94257 -84093
12675 122561 70452 94325 147344 92065 47234 136367 -260066 -73652 137720 151307 -32581
12663 109221 134591 87349 88191 26805 -25511 253311 55041 338155 103503 269137 294477
12652 294477 82562 23719 120819 187008 129253 -307727 -189376 134605 -127349 243254
12641 -95696 265445 35231 -278909 102772 -235760 -209624 229580 -138600 53118 32702
12631 32702 376915 336060 245555 229859 409056 338092 322468 -3150 286826 190126 227029
12620 227029 237663 -245318 21181 12577 261970 -110110 82347 -387947 572 -165981 357733
12608 106820 3977 40718 297390 -69845 -66230 111801 339909 640362 307551 182545 220758
12597 220758 271531 143736 -239 33960 163495 190262 180321 -19733 -76939 -82189 -270852 274519
12584 -53291 272984 143761 30081 126820 168504 80320 -95642 7084 221095 122320 396758
12573 396758 184347 10107 -57050 -6056 150389 15196 60085 522813 -195073 -38587 54715
12561 -392530 29933 210486 333988 98460 -29750 -228172 126917 398483 325433 -112669
12550 -114918 -36171 -236667 118356 108502 -53252 -93902 211391 133172 -74021 180935 -57365
12538 59976 346017 -128303 -53578 184700 -170348 -212059 172572 19528 289636 245078
12528 245078 289247 -77992 -102726 8031 157923 -163060 -233451 259174 -290061 -132536 -64016
12516 -232115 -222271 60742 137450 94596 -173298 -117569 151086 50092 188954 -17207 390043
12504 -74413 -354562 67397 22640 421872 116736 -164704 284341 328376 79196 -67823 140435
12492 25338 -196320 231959 48500 -25818 121745 -17984 40936 -145690 64949 -189756 -33330
12480 161754 -47797 96373 297263 -63050 -113354 -12709 34508 -162888 -130803 -41509 -127476
12469 -127476 -260287 -135149 84523 -387140 63183 16862 47718 -239491 -166510 14637 238756
12458 238756 133502 -13969 299817 -6821 211684 -174348 -246578 -125399 207780 -46428
12447 -113760 -38591 -15825 144860 129875 218469 45290 -160995 -164340 -82351 -94833 155528
12435 119090 87180 52665 -241730 179288 -42231 47649 -70150 -282827 204401 -46831 161175
12423 43369 211449 -25500 -38659 18478 126358 291193 83314 120148 20123 67163 55177
12412 55177 33054 49385 93873 141499 33797 -262413 174324 -46449 16255 -176733 214040
12400 -248843 71346 97260 -37740 116026 -19383 55529 130373 -290611 -57114 -59718 105868
12388 218630 197873 -241326 -165116 -140098 99238 -93484 -108223 201265 -60759 -89230 49229
12376 -71514 -206612 27643 32941 -97924 71137 183713 -101852 50399 6723 -121611 -152570
12365 -152570 -245625 -540158 -144268 -262447 7266 54477 -15437 -108737 284012 -128982 187956
12353 192903 -138857 375121 114826 -234781 -127296 -112347 42743 44064 182665 4397 -63879
12341 258730 393326 -10000 -37532 -429827 172176 -192813 33882 59312 -96008 43275 -202581
12329 -27075 62917 28526 16534 44076 -229596 -202444 196175 411729 -48143 -17770 82655
12317 76191 58493 -313300 -113 -20388 -226983 93211 -76595 181232 60735 -4689 63153 -234405
12304 -6775 -67334 -157198 179175 43571 137779 140898 -157250 22515 20296 242185 311685 -236099
12291 -179547 -125355 242944 162123 124572 28103 -96221 -31921 217447 220883 136056 294420
12280 294420 335029 128196 71762 -31910 275374 349395 295752 132166 120924 26476 -146516
12268 325892 15463 12312 142410 188337 -98021 200442 304970 218454 8103 181983 42201
12256 -10405 164464 17432 -24455 142809 -178474 83702 35245 125681 314200 40701 -40981
12244 210403 133372 149243 -20066 272263 47517 93405 152149 43766 164297 -169216 -44122
12232 345831 118225 75174 60464 52141 180064 410518 -77049 358217 1052 96630 36408
12220 144968 104271 80377 135630 -49933 -83945 75607 -143002 168987 384657 278913 339884
12209 339884 318827 -59103 529181 365026 279465 126951 289420 22290 484835 209817
12198 -108748 223711 224416 288944 413280 54853 76324 221079 279254 141608 137714 6968
12186 236638 144517 258201 13575 -205993 -158037 -11388 -197899 -84520 232629 -90980 173255
12174 55105 -44641 61332 304415 -208749 52237 306273 70443 330248 226392 316702 302862
12163 302862 -47 146477 34220 -135716 99310 -1962 75812 -199294 101708 -213243 185181
12151 -181724 -20333 -81531 -263435 101140 117669 117055 -7508 123570 -211159 96611 -108399
12139 104509 22449 31443 154768 -160402 -34811 -14818 465656 -331927 28804 169623 142101
12128 142101 -81748 -211079 63381 137761 44426 19521 -174676 -143864 -100381 -137065 118823
12116 48279 85962 -210011 24241 290112 -438003 -101174 101238 68989 102123 33687 108099
12105 108099 -181433 9917 100545 59482 189530 102253 127812 80415 -73206 -25474 346159
12093 229822 -337406 59659 -108020 -96502 -91264 -48834 -32242 64863 -198595 -49737 -193178
12082 -193178 25611 164064 68755 107535 240517 -57953 158856 1330953 1709273 525573
12071 161695 112325 154849 -37797 -288137 347993 41095 18552 72230 246017 134821 -183740
12059 222278 -77799 -235258 231867 97753 -229034 214271 -335 218898 127825 -12231 -274216
12048 -274216 270436 108764 150874 365272 81192 223880 -175741 -114850 -171738 57572
12037 -305377 -85118 143905 -73203 77914 -369148 -312683 139088 -127819 -230461 -119306
12027 -119306 -10523 -71779 122714 -156656 6861 9856 424623 19070 241210 97221 -65476
12015 -204401 32815 258332 55755 -102846 -44799 -254249 196672 27663 -93269 -158286 -108227
12004 -108227 -148682 -87110 243610 39546 -301107 519308 347869 1697 138367 -328300
11993 132264 80425 -86712 -48631 112750 -157227 118155 -42833 9273 55164 30789 -93141
11981 196362 -219232 61884 29588 -156377 -31963 146878 -223425 -158770 -99161 75195 -196479
11969 227448 -176619 -27709 -318479 3700 -101794 216104 -40207 -21403 40177 -115333 152211
11957 -133903 -129000 218999 -162705 332248 67134 48811 -147757 241928 -139736 154835
11946 -41356 65472 -27688 46478 33453 -264319 -424833 248133 -269274 12500 -24320 -360017
11935 -360017 -92719 367328 136950 132814 78621 -266316 -376253 118905 -140590 -38919
11924 -6778 -177275 -91684 375915 2919 -137601 59231 284530 176403 -23986 75855 86129
11913 86129 -187263 -354921 39347 38020 -231129 -63000 -44920 -245334 -90917 32125 80998
11902 80998 54253 227013 -149785 -167559 -9182 17709 255955 -5187 -12583 71689 318224
11891 318224 -211844 -388522 16852 -15657 -3325 -17782 -146572 6291 374631 -30447 3575
11879 -158762 -24940 14827 -23016 -52932 -9963 -9376 -354142 -227906 127085 46427 -48782
11867 142987 -29324 -252968 -184281 75410 74638 -117219 288217 39716 -77010 -146481 95657
11855 382866 -81783 282273 5126 214322 18499 147997 84521 -171212 111038 -16154 75076
11843 -246201 -213615 -449408 211812 293674 144125 -399593 56978 385421 16947 150533
11833 150533 -198063 -369391 120821 -173030 140978 -215160 -275682 -140424 -107342 -2818
11822 -118125 51233 -259147 106725 -63749 -84987 -226374 -249609 -11501 -21328 -91855 -190038
11811 -190038 199396 -162746 -26523 -76555 61466 78564 85813 -97674 43771 -166317 178569
11799 -138224 -208601 -53607 -17636 -31252 -366117 15541 235649 11742 -93195 -314018 232335
11787 29396 150384 154141 -171576 173169 255108 -11258 147450 73040 -112374 -66243 -300541
11776 -300541 -65331 247425 24421 -49661 -108450 121588 391594 -77894 -49609 -1663 -408922
11765 -408922 -173231 109687 170251 30460 165243 -125315 280376 199674 -144076 27142
11754 210775 254311 261708 178750 -113093 -163213 93997 31315 261752 -93657 -251339 162047
11742 39207 190414 -126452 -126010 -82026 -541868 -89451 120293 90788 -26687 -55757 -161815
11731 -161815 -138445 -193874 -53019 180904 65247 79736 -98830 100088 148234 -107403 -50509
11719 -130821 40791 -69172 -71023 -48620 -168292 -61431 -55995 96315 83493 -241782 193085
11707 204223 -201268 129054 251701 -83362 -185954 -49308 -56109 238331 464222 58227
11696 119330 197887 293984 171753 428674 -108050 -54280 -119901 -2122 5411 -134178 156988
11684 -31335 127418 56412 -32026 98941 -81206 55601 -135678 150860 213530 -159720 -315188
11673 -315188 -263372 196863 -13986 -291332 -256872 -126593 110009 38190 13951 -401521
11662 181267 244441 -221848 -65118 60543 -131388 201432 39193 69699 71305 268354 -90670
11650 -26353 119031 96647 -88930 215408 92217 236650 89071 49829 -8761 -173870 106059
11638 159812 -300923 -61462 32940 -44394 -15650 54909 -6009 -129535 366459 -152128 90408
11626 144536 220848 27154 106124 -110820 12251 98487 110214 -246818 -160126 -62988 72226
11614 -64763 -114636 29991 268442 452697 342422 -25400 -295506 210351 69690 -2093 -52736
11603 -52736 152424 -95152 68956 174096 -107531 331181 -172246 15684 274963 234326
11593 234326 113040 -192160 256135 96432 168110 27679 50891 398365 4248 469045 -11300
11581 -105751 429855 134500 176542 -140789 -59581 180802 135789 -185634 -18296 79720
11570 131494 123346 171838 -32525 522999 40197 -4248 -70289 146331 197482 -213082 -50704
11558 182936 -23637 -475276 -269701 167752 246929 -33690 256536 178739 441825 45307
11547 51957 -2544 -124261 109783 91993 -109952 200466 87566 188730 7028 -6741 474155
11535 170118 -132214 27924 196206 -119753 60157 263326 178175 111814 -35530 276053
11524 -31624 -13563 -353342 152226 164894 -75006 84748 -110691 -60283 -20363 350956 -9896
11512 -144945 282071 1120 341809 -66449 -72381 -236617 140068 -53605 163805 -88333 -229795
11501 -229795 495853 134950 -11044 -69198 304986 -20635 111458 153707 -162953 16047
11490 104550 88525 285748 132144 547694 443061 302467 161566 472379 83537 672967
11480 672967 -150689 289433 391446 -9104 307756 32613 207915 165450 169915 505638 238905
11468 11471 292826 -26323 115161 -120786 -71943 304227 -19014 78733 -21012 54956 218672
11457 218672 68833 308701 137431 301705 -185698 407814 -503 18960 102170 125045 139421
11446 139421 56614 -243241 54482 -27945 19244 -192282 164590 169381 78135 231038 72554
11434 169774 274056 203339 -95936 315658 -134911 142429 -55227 228854 117748 81071
11424 81071 -174354 -152115 23717 83523 -117153 -54512 56916 167909 8203 -104408 6512
11412 -182079 283867 -177549 -375292 -130287 -168510 -113527 -4579 3270 -150305 73575 -58103
11400 -107053 95782 34330 -20697 373551 -159147 -5698 70640 -213443 233134 9427 310788
11389 310788 42639 174083 92685 169420 229165 279480 31869 -281805 -78110 -96683 -74415
11378 -74415 -877 219378 -125462 163093 7545 46451 30681 97840 -60437 92256 -77634 216268
11365 -55053 -247922 6727 57282 -319970 -384399 66162 113704 -94831 168094 -123929 -159295
11354 -159295 -246330 -159460 65008 35044 54038 66111 119574 1783 211379 -3501 -6573 -45436
11342 -45436 178745 -217099 242501 -49046 -165416 120817 303847 -128370 85783 -58087
11331 -304362 -235631 -175024 -143751 -224267 261543 -92078 -155958 -15587 8265 -120059 -197310
11320 -197310 -96697 -145872 181093 -367733 -152711 -213791 23761 153976 -22073 -203091
11310 -203091 63180 10260 186815 -22231 67621 238635 150699 -29884 32249 -31795 -27249
11299 -27249 126731 -154850 -24063 -38799 -6630 67837 -308456 141934 -16917 99542 -217530
11287 -131387 -112394 -12648 -39182 -23741 -16799 -150574 -225681 -28110 -61553 111139 65260
11276 65260 -199021 -155691 136259 180768 -106861 -162013 225003 -23140 123426 237365
11266 237365 207002 12801 -172088 84131 -122946 -132588 -211395 -147575 68246 -294482 77765
11254 -355044 142117 86940 -22009 246534 63204 -206661 -224629 66884 -301355 -100632
11243 -35863 318937 -217962 16458 99735 -233174 -298653 -71625 -373139 82730 -80292 -13607
11231 107137 89926 94846 147934 367317 58407 -137787 7878 137222 -178172 21388 147799
11220 147799 -167194 84567 91470 -3085 -66637 -278514 -8618 -215654 119477 -68430 -112656
11209 -112656 76637 109523 113762 175817 -497008 -155654 -35382 -205516 139424 76232 104424
11198 104424 -214038 -249278 -84221 90852 -125375 -52191 -60037 347597 20401 132859 368943
11187 368943 32979 26697 21014 -39746 159814 -28331 -27777 17476 -148239 -35081 219304 -329486
11174 39703 -43713 209114 238860 -14931 143164 -96746 168697 -45914 247148 184148 -191158
11162 -65535 -133793 -63068 16885 106378 52606 -49071 325562 137185 -159234 11738 127028
11151 127028 -204524 273797 77338 -81870 91567 -196581 -84759 84347 -10120 -255269 258599
11139 104413 -386099 -270589 208326 90520 47635 279718 -182954 92013 -157583 251698
11128 57001 76377 94437 72981 -232958 -325759 37352 50739 -250434 -513114 115030 68181
11117 68181 -114930 13206 165915 -236406 -312784 233049 230114 295823 11244 6508 207746
11106 207746 242915 -170847 79708 285781 503014 60477 134109 -27013 317865 188711
11096 188711 -111511 394074 191282 80518 181399 305072 203072 320787 164488 496708
11086 496708 416017 -36364 114290 471952 580072 283403 404603 566854 476447 177992
11075 -10857 59537 574013 120510 305708 363106 271413 447903 373740 366165 404723 439939
11064 439939 602005 503682 458963 484326 509919 503233 568358 504721 842900 569286 596815
11053 596815 488866 578918 574474 530243 1004060 656449 831566 796884 614513 911475
11043 911475 722654 592751 769192 965502 755981 1123462 786841 911295 685590 556493
11033 556493 810568 563879 901309 786389 481374 660713 846271 959499 640343 512589
11023 512589 863319 816527 392951 591092 674456 479491 534636 904019 692952 767492
11013 767492 868681 452333 761359 249028 368810 825022 581625 609254 534589 430134
11003 430134 706264 806888 448362 1090485 748147 731984 648701 1018311 575939 715089
10993 715089 773557 655711 906600 514912 598080 954277 777820 537521 823114 1024711
10983 1024711 815572 1061698 1349976 1335194 1429062 1553698 1861588 1377394 2210164 2441341
10973 2441341 2461336 2984724 2754185 2613374 2538859 2290065 2178639 2077817 1870162 1670823
10963 1670823 1572659 1545897 1484104 1794445 1945282 1749438 1771660 1745144 2010596 1446109
10953 1446109 1783582 1032332 1384007 806122 952256 473503 503671 310474 506987 287559
10943 287559 274165 73637 278684 112330 302648 118080 150407 393357 -43983 5033 156791
10932 156791 381027 85316 894 -149957 -165052 -76637 13338 -263923 -145789 -271051 214373
10920 258575 28644 -119087 -25310 95354 -84871 -16919 159557 21864 -258467 81424 280082
10909 280082 -136966 60193 114753 -348083 -207909 -214873 -26856 15570 -81677 -98114 -95279
10898 -95279 48318 -332 -88393 -201128 168425 170001 100298 287379 -171584 266093 -23894
10886 84977 -369103 -326856 -192086 -211167 -143390 67838 209863 -23589 -49096 -103958 80079
10874 -40761 131456 46511 8397 -64942 229956 204047 -211663 -328073 136102 -227712 -158531
10863 -158531 -203890 10145 -174579 -213439 216177 34438 10393 94865 86450 78277 -321635
10851 427639 70977 290622 49775 23570 179727 168910 18376 -173998 57634 243621 151290
10840 151290 -32338 41665 178283 -203008 -435671 -11502 64839 30210 -110916 -247148
10830 -247148 -115819 296646 -59501 130382 168525 254457 -62958 254457 -312944 -45894
10819 184601 130095 -274436 -157092 89895 -230672 -175311 103645 -59242 -167598 -82102
10808 -5938 -78387 -535744 -100899 -185941 -72218 184157 16312 -126647 -51129 61028 9140
10796 363829 -346456 -198442 -169473 -14375 55444 315783 361122 61361 303012 -77845 -85855
10785 -85855 171371 -48172 -168493 51709 -236552 1105 -118134 189067 -182111 118429
10774 -238639 74070 319177 77428 117397 186499 -121969 40447 -173972 168541 67383 102485
10763 102485 46606 -87213 246554 -155035 27553 -65827 219709 -73024 6729 248650 -281399
10751 -418649 -109406 124978 30158 -133135 -364402 44585 108878 298527 -198513 360870
10740 -36077 14700 58353 2882 -28546 -55383 -78015 -305043 140823 69998 -80193 -62058
10729 -62058 -224012 16814 16695 -3476 65592 227419 -181482 252621 -137308 33734 -150976
10717 161320 -205369 -500639 -330846 24713 -163901 -216639 -193670 260554 -42240 -50172 -404452
10706 -404452 88356 -288574 -179147 -56649 -39571 -6767 -37714 64418 -282642 -212508 11609
10694 -71928 63090 102463 -211195 -54441 28602 -32988 -111186 84946 -50590 -385108 -273840
10683 -273840 -8567 -139210 -100506 -344948 49174 139943 -65259 2156 126805 -284728 -12476
10671 -23540 135543 103177 180973 -265184 -108377 -112212 6003 -212057 -102987 -314346 302522
10659 -123849 47928 -110433 -116976 -381282 -345553 -126372 44706 -153166 -183197 418224 -35858
10647 4584 -117506 -337000 -49854 -207068 41503 -160664 -90316 228080 -162151 52370 -169481
10635 -81322 112740 123865 256806 -241513 -245511 67465 326816 -79816 66321 101954 -91557
10623 -143605 -205605 -64831 -301813 118205 133779 -24693 -230527 -9809 34332 -292653 48839
10611 -71381 160659 -12767 251461 -179832 -347778 -98716 199862 -386494 31486 187496
10601 187496 -248848 -9165 -329410 -124974 -16517 67943 345669 -1430 10177 -145592 -439770
10590 -439770 23308 -123146 -207011 46824 -348593 -58561 -20770 -26351 -232162 117974 -533735
10578 -305994 -83408 -256514 81386 1018 74764 184747 -320917 7973 12177 -14133 -141678
10567 -141678 -239313 109282 -326810 -60346 -235181 185322 30207 -207593 107819 -332889
10556 68411 -152962 -165946 138973 103121 -167496 -134368 -51606 -32394 6386 137032 127138
10545 127138 -147509 -92834 -171027 -173489 -155192 -375557 40337 -6440 -181654 -212749 -103453
10533 40796 -6242 -72420 42806 -114086 -222609 21150 53120 34503 -191638 84033 75449
10522 75449 7469 -173409 -109843 35846 103168 -62239 271441 5810 229549 -257426 -275709
10511 -275709 4393 -236186 -226604 -190019 16869 39396 445243 161424 180417 -80969 184955
10499 -94752 9205 -205094 168129 -178709 -256395 -110053 41073 -130224 18720 176266 -196159
10487 -249990 -107227 -278841 203122 186548 266937 131091 359706 644513 387501 401322
10477 401322 366420 275765 219558 368118 90691 125345 -14141 175458 3000 -170997 116621
10465 -171565 -50839 -450874 -194309 -208686 -64045 260837 -83027 63252 208679 -37515 187415
10453 78479 -222214 -194101 -130781 25847 -265930 160561 -194787 -54271 329799 -47097 -95727
10442 -95727 -104136 -49222 47219 179779 -194119 136930 -32522 -183429 -28055 19807 51751
10431 51751 -388214 73359 127221 3662 261633 -82487 -285534 -18944 239955 -164809 64388
10419 -38985 4623 -201978 -119961 -207441 44708 -194302 230766 249612 36466 59065 -240319
10407 -249730 116224 24635 193856 51797 32524 -23033 -181798 1046 -4122 -243318 61448
10395 138408 108576 141577 1116 -221270 99107 -12080 325927 226990 -145175 228238 48497
10383 -102181 131494 40987 134030 -46514 -107162 192651 425381 111240 321341 99255
10372 183854 -25583 166356 159680 458565 468662 107995 889690 221072 177543 443529
10362 443529 654761 575449 170825 155043 -35387 560523 44554 364633 107838 70749
10352 70749 282303 407488 457000 578019 319598 351084 466296 213251 258645 441826
10342 441826 295018 423941 79517 331610 -36082 315061 76474 138553 106472 59423 121003
10331 121003 34863 206144 66800 214490 190694 15791 108264 120696 369530 508287 375564
10320 375564 364363 137081 -104197 127716 120531 128380 -41409 162072 95329 56620 90688
10309 90688 -158194 197560 -380886 442320 -68984 73763 179564 -273695 -103652 -107303
10299 -107303 186841 77191 -11046 -16417 -327522 16685 35001 135251 193125 -123112 -52404
10287 66614 -231482 -128973 -57411 -262293 33242 -232645 -61405 34237 -171121 -33611 -146747
10276 -146747 -125636 352148 80340 -179614 36154 -101596 123203 55748 207395 -130915
10265 110278 -30476 -53955 141099 152609 -57372 279271 409267 511320 74494 124524 -36929
10253 15947 -45550 203098 -178964 -137076 -152822 -117381 110696 -214742 -92331 -203932 -165397
10242 -165397 -119415 -51392 324378 -39393 170183 -32645 278907 -276613 227598 -99387
10231 25792 68706 51918 262118 216647 -119202 -54576 -177768 -2225 156353 -197293 -52346
10219 -105219 41444 -295363 5861 -31637 -53594 -101722 158209 -83903 46603 48496 -2777 -102763
10207 -102763 -60010 -250566 -178059 -400849 224471 10903 -157254 -118367 84020 401790
10197 401790 -280206 -111073 102149 -74747 -156669 -1837 -191909 -12204 -41745 103574 -212739
10185 -185848 -259966 88359 -295867 -161508 66389 270009 -443862 149303 -54807 -11124
10174 -98812 -43857 -151649 97220 -416301 -288834 -14374 -379677 -165015 -88219 -202484
10164 -202484 -57258 -86958 261880 155318 37522 -71327 -12714 -68166 -233032 151096 -40401
10152 238360 -217889 130188 -119192 -161354 62430 -181218 -392793 -428657 -92298 -404115
10142 -404115 16348 -43562 -218290 -140283 200036 -222359 -52243 -172981 -129250 -141352 -134697
10131 -134697 117099 82030 -45361 -181137 -414414 -167566 -237088 -197002 -115372 129404
10120 -66374 -168723 -55359 55410 -285699 -197676 -144622 -592940 -341954 -55421 -21718 -82515
10109 -82515 -212397 -34449 119576 -14034 -128047 -214673 -286468 15658 -40899 44553 39056
10098 39056 -145027 -495421 104956 279270 -181885 -155154 -21604 228886 -2428 -13079 -184949
10087 -184949 193895 44599 -125797 -192408 -101468 99248 -127404 -27782 60113 -112401 261760
10075 296110 86828 56510 -318818 -157715 -273483 -150544 -65884 199740 114911 45166
10064 -252207 85101 121101 13654 -281796 -153585 -104104 -59066 -38749 -303537 110986 -155981
10052 -119863 -133499 -337885 70548 264645 30375 -78121 -194199 -152845 115520 65466 -132878
10040 48140 130861 226500 -633 -373861 68221 -236111 60679 286340 168945 -188224 -125023
10029 -125023 -241439 -188524 70363 166213 -245047 -152530 80690 -100314 21368 509777 63569
10017 73603 144046 -78221 -377589 52991 -54962 -49627 -11395 59363 -37014 282775 -327303
10005 166490 226714 249046 -122184 18476 -124256 109221 -195326 71423 209629 -234445
9994 181968 -129000 -354295 -192945 -141006 -334111 -327635 -1277 -43928 -78215 -139973 -7193
9982 -398700 -58742 -393113 -97011 -91548 -49201 27314 -12740 -269282 173151 -277962 -208817
9971 -208817 -69086 233044 114927 265370 114068 -210880 89670 69824 -120654 -182139
9961 -182139 -178328 -147354 226238 -115239 60480 -403659 157074 122458 -175522 96353 -445332
9949 -293752 -98836 129477 -101640 -18994 -6657 -185863 -167461 -249592 -183809 -92953 12709
9937 47478 280606 149847 -18141 -242546 138024 -57913 -56091 64249 -10734 -126120 7065
9925 -192233 -232179 -46294 -255193 15110 53968 -29466 -279895 -98533 -150285 212937 313084
9914 313084 211703 -35988 -322672 104316 -112691 -61606 -11872 162026 -71348 -97732 -157164
9903 -157164 138537 17809 -146858 -67040 96234 -24346 16669 47105 -154478 -130100 9837
9891 257389 -171348 -389719 11259 -281965 -312647 56000 -180321 -64525 -108487 -496074 -510914
9880 -510914 158439 55986 186183 -413683 -101175 -8997 -298284 -77699 83987 55099 -190782
9868 -115700 -45937 172454 130112 -134974 -422445 67481 166815 -69957 -59687 -257350 -86962
9856 -231234 -79961 -168900 -14569 -225383 -103523 -138022 -93518 -132087 -156827 -92258 -153396
9845 -153396 -140224 61567 64588 59133 232587 -156480 -280558 110721 -67206 -386909 -120415
9833 142983 -107710 23360 54051 201250 401683 95378 35030 42474 36511 279663 287586
9822 287586 -117214 -290809 -144806 7389 -169857 130469 -211778 -199008 -74386 -149801 -143999
9811 -143999 -172327 7818 -129634 -219482 -55819 51112 -384484 175114 -236832 346302 -40172
9799 -242081 237142 -408645 -299117 -94080 -460832 -77904 -115246 46111 -192326 -94205 -202205
9788 -202205 -204814 88396 -66717 -22801 77731 -297096 -232999 -94940 -134976 -74019 480630
9776 -331877 187517 -277222 -159073 -147388 -77132 11214 374451 -4889 123963 -75863 177997
9764 157485 -197801 -279984 -135046 -142378 -6550 489761 -1368 83548 -250235 -79878 -315997
9753 -315997 287174 -174819 -179856 -300141 -32888 72773 186997 -218546 -34498 -146501 -187421
9742 -187421 166952 -39348 -104580 54720 68135 -215219 -18258 183983 203435 -335991 -283528
9731 -283528 282408 -106175 -138365 480771 -179415 -98785 -347584 -82579 21684 142357
9721 142357 -435723 -365186 22812 -81011 -111327 69816 287632 35916 -468610 146126 152428
9710 152428 106157 -285531 7413 -220414 -290195 -38129 -103659 -187324 -231401 466554 -50894
9698 -121441 -84568 -74602 -102616 8730 -191011 -81264 198819 -100432 -243189 -104944 -107446
9687 -107446 -89477 148606 -196255 -230286 7083 -69025 -267039 81430 -107365 -457707 133451
9675 -168489 -74559 -504742 -155728 -236074 -256029 -280597 -75161 -7464 -40855 75907 -156402
9663 29142 -123768 349856 -94360 446200 174992 -86397 97810 -167374 -248891 -150441 172847
9651 107202 -199823 -37392 116982 -82086 -85800 182664 -166552 -178470 274686 208325 72442
9639 -216381 -294079 -105904 -155770 -45575 -491111 -3342 -6183 128007 -18957 -68691 -201768
9628 -201768 -54049 -217609 8131 11608 -151447 -311674 -229794 -196113 74804 -212518 -62790
9616 -48852 -289519 -42947 117529 -195160 225138 -41243 50249 -227071 -337166 -230364
9606 -230364 292882 -208052 34423 54255 54172 51059 -166242 -61833 20844 -30495 152388 -17892
9593 -147597 112646 2438 -13149 -88665 -242207 72242 175482 -216067 152878 -245879 -202356
9582 -202356 -210762 -100409 -12266 121552 -199362 -66266 33412 63745 -57152 -15648 138580
9570 -288675 -203443 -215245 23848 88714 -28957 -441340 31832 236804 67416 21013 106972
9559 106972 70961 -70325 158110 64187 -51186 -132858 -239704 148292 -141694 -135520 189692
9547 227929 58810 -456985 11769 -266979 -1517 -145203 62263 -169536 -75533 -447245 204972
9535 213927 -300324 -10057 28644 42528 -177819 -484891 -165862 53645 2742 158489 -10397
9523 157280 -328710 -205010 -318088 -27522 -143290 -204856 10964 37391 7404 -61148 142502
9511 335210 -85557 9628 -273540 -231300 -219193 29038 -176012 -151653 -96299 -312703 78714
9499 -291435 43158 -201651 -24392 -2508 -144 123895 -76931 -167848 -36232 -221779 -60652 -6560
9486 -181214 -64385 -144569 -221802 -8158 -161651 -278013 -240032 96487 -317012 -128825 90680
9474 -19549 95430 77891 208692 -84282 -205273 -126828 -347664 189628 178547 170911 -129158
9462 56980 66925 -372430 126937 74648 -239418 107573 -160306 -104465 56917 -135954 62670
9450 130140 -346441 -81460 16485 187791 170325 103611 -440454 76621 405127 -122952 -14719
9438 -111964 -99250 -28159 -242669 -273702 -37814 34136 -273480 173437 -99740 -114973 91413
9426 -229719 60053 -183316 -222688 83919 -163186 -4805 -150872 -68782 78057 -81196 202708
9414 5187 168019 -164934 -150018 -61764 -273831 -39935 -81513 38600 94606 -115217 -55549
9402 -102976 12555 -283095 -301992 -71553 195964 -336255 -165545 -66579 -96708 -63134 162431
9390 280543 -167485 -145621 319069 -99590 -84097 -280266 -95242 -69516 -235814 -259176 -121441
9378 -107478 -74687 -183836 172351 -28469 -7694 -495134 -95296 4856 -55893 -232769 -30259
9366 614 -7416 -370971 -164150 -163919 -38382 70169 -246863 -361231 -32809 301974 -181242 -32378
9353 -355235 -354133 -128573 51270 96696 63068 -66876 -28547 -146401 75041 10505 78172
9342 78172 -163718 190408 -31838 87609 -272327 53591 405651 -308874 -317898 -2067 127313
9330 -33811 77272 -250565 -400140 -44283 99528 43581 -156877 -132951 -172100 88483 -36025
9318 266507 194480 51715 -94247 -339385 160921 -5190 -162161 59611 31797 -146538 200975
9306 -195251 -232825 -77864 -217493 -68541 -70168 313913 -332653 40564 57 201931 17361 84212
9294 84212 -210185 -336686 132866 46077 -64659 -194476 -142742 -397979 -219322 108843
9283 9830 105011 -7124 230718 -16432 -294318 -118755 198053 -35902 -160358 -9972 -156416
9272 -156416 -123246 441600 -215183 91396 112673 113411 -157389 195106 -44848 46214 25447
9261 25447 -210263 -267913 -136886 -57662 339183 285423 -87063 -147246 -147409 271951 -242659
9249 152083 -377866 72687 -73265 115733 -60217 -174348 -282243 -161636 -156222 -141740 -345688
9238 -345688 -77205 -285656 -427285 22375 -179083 222880 -257679 34095 -260306 -244538
9228 -244538 -133724 -244339 -300875 -271923 227582 -470711 -29795 -68819 -277870 34633 -204485
9216 -369616 -133632 192681 94626 73048 -107644 32355 428837 -146311 244726 162909
9206 162909 53183 193458 -47412 222739 -139269 32825 -272620 -189789 -93340 -72146 -17959
9194 195660 -293968 -223576 1177 -303388 -219643 -233958 261533 -79381 -48078 -99464 -249031
9183 -249031 49922 -23130 -23789 -328168 -21606 -155578 50551 -172612 -135414 54426 -23825
9171 103427 90975 -406737 -25444 31282 135272 122025 400070 -86748 145511 -55638 -157439
9160 -157439 -150823 -2751 273751 279593 469887 -43154 55635 -135307 -111827 -115157 8011 -75658
9147 -451169 19365 -223697 148078 284517 128157 -102713 226785 -273368 28718 -45184
9136 191370 10534 152666 -199196 49885 -152140 221902 -67218 282506 -164433 -61944
9125 53006 309133 -249346 -20126 215163 91690 -448720 -189352 -249302 -97916 -219241 107174
9113 -229006 272981 -99789 171829 188160 369937 343618 -26204 27182 615 26226 -245936
9101 13761 -249375 -130717 -330257 -31675 118473 -70277 -254181 119911 14294 -36413 136491
9089 -50794 -64123 113942 -166666 -183410 -66316 -162355 105173 191911 142680 -71327 -101135
9078 -101135 -433051 -119594 -186553 120230 -24803 -37549 72349 -29234 192313 -5445 1811
9066 132045 40291 -85838 185507 103812 -545722 -131418 -90276 -88208 -159273 -28782 37249
9054 -46234 -339278 -64036 92399 -237968 -13900 -297722 105629 25984 -230551 -59752 -115170
9043 -115170 -248070 -21618 83129 339492 -199462 -6695 152018 -325337 -86859 -270119 -52400
9031 82579 -61631 -43507 84785 -159173 -28403 154601 23045 12820 -256812 122614 -119083
9019 113254 344804 -139225 8278 -136612 30947 197843 -43702 355375 -266491 -396419
9009 -396419 30922 230227 -163212 -219347 -14528 18885 83605 -145290 -10072 -87221 135114
8997 493221 -76389 -26131 254241 310101 -148734 -357587 -82349 102189 99844 -145162 -217724
8986 -217724 198637 34851 -18296 -299509 25427 50371 -281216 -358370 52030 100576 -85388
8974 4391 -39058 14592 25383 309166 216484 -63900 16698 -406435 -217249 -21347 -3653 -108461
8962 -108461 82219 -28169 -242401 -57359 -195985 40471 6488 -224582 -199074 -134896 -342344
8951 -342344 514888 -3168 -163030 127224 -57704 90511 -377733 135850 59264 67073 88239
8940 88239 -154023 -483413 -314335 -19349 312409 -37832 565634 329847 89760 340721
8930 340721 430743 -42763 174149 125076 316245 129198 199447 1886133 6040768 3707193
8920 3707193 887555 460138 200287 347210 320389 121073 -131859 244168 -44976 -127027
8910 -127027 132331 -30608 -45029 -108865 -62595 -214614 -47293 -71359 -162168 33560 -10975
8898 -278768 110825 234565 -145079 198450 -80962 95558 -194578 86810 28465 -132227
8887 -163129 152057 -21740 246078 -323381 80379 -315251 -47246 -95849 -56256 -224550 -2090
8875 -91497 231831 -84242 -304239 -292710 30244 -136854 -69157 197636 137332 -58664 -261130
8864 -261130 12088 390231 134716 -148213 -453299 21224 -230634 127877 -163207 13136
8853 -74898 -116894 -50240 -9705 -91220 -334110 10650 121094 -218013 217900 39890 -275936
8841 49979 -33325 -238440 -13488 -87674 -209554 -115411 82832 -107998 84480 -107245 -106198
8830 -106198 -485622 76655 284239 -90808 192292 -9160 -195175 -131966 252944 -113337 -146273
8819 -146273 -129201 165620 32460 24745 291501 10088 50254 -405739 49151 -308202 26793
8807 -44589 -244844 -441594 -210837 178963 44005 115449 120682 56720 -4067 -8700 -76491 -98518
8795 -98518 109 78166 140870 97564 -270965 206185 78392 -201229 209016 219950 -205923
8783 -9590 -327877 -26874 -291761 -296173 -20809 -167548 103214 -377201 -40563 -129098 -222869
8772 -222869 215373 -221293 -156901 -41162 -338142 8010 -17795 -34252 -228277 -149518 -185731
8761 -185731 -219390 -33488 -252725 237771 -154434 149501 89131 -241157 -16711 164369
8750 -331236 -23147 4724 393784 -43561 -262237 -134822 -112162 -57864 -225035 -110532 -239350
8739 -239350 141044 45909 -174891 106201 -269319 56093 238557 64284 -268080 309973
8728 -312912 -356560 159419 42348 -43801 126774 -74657 -129075 -179800 -89487 -188140 -160582
8717 -160582 -324349 -16900 59442 -50413 -90086 27176 12479 -34735 290492 110685 -251191
8705 272752 -23633 88084 -226818 -38823 158775 63311 -70601 -73672 -21031 -392310 96023
8693 -101481 -299799 215798 58401 -52847 -104711 101896 -258332 -146961 7825 -71302 64488
8681 -353883 -42541 -133086 197289 -393706 -95058 -133383 -370254 -175550 -21381 1754 -12845
8669 325710 -124891 149947 -100379 34886 33544 125123 7535 -281626 -26838 140159 -33924
8657 19553 -236706 -180390 -300322 -108341 -144704 -195684 152245 57004 51132 -148266 -183035
8646 -183035 23846 -36348 17454 472487 -68964 7962 -45531 -35280 -64788 132920 112632
8635 112632 -41691 -264498 442389 87841 180215 -195309 -254223 -47778 -324463 -201627 -423522
8624 -423522 56054 68072 86241 350926 -264704 -27248 -200055 -165160 -88548 -180448 -49810
8612 -221933 -158991 337629 -19533 26666 -27064 146224 -354402 -191683 31391 -25934 -415050
8601 -415050 -19912 -185907 36738 156467 275643 93812 -252900 175742 16612 -34614 65968
8589 -2977 -182248 -5539 -147281 -513132 -280963 113936 313027 -177361 -4464 -113860 -50595
8577 -193730 -94486 -65451 103 -222115 117541 -111308 71583 89615 -7297 -114323 -140380
8566 -140380 110093 48504 -276909 -74874 -259790 305476 -128082 -37662 321946 -311784
8555 -30460 -108519 -38254 -307907 119384 -32334 -182396 -418434 -132969 51201 44281 170219
8544 170219 -229043 -109718 -10651 -331882 135909 -200409 235991 159528 -166956 -490252
8534 -490252 -67915 119799 221209 37924 21467 -110011 -124036 -313042 240434 -11483 -95278
8523 -95278 47528 138306 -220919 -101204 -185658 266383 -257085 -58856 -58291 -364292 -116435
8511 24841 -219511 -11567 -181969 -39593 -140033 170219 86541 134179 -144971 -180541 296697
8499 201347 7719 -137682 -148353 -73902 19238 -271902 232417 43214 39442 -116770 -106844
8488 -106844 -8228 -44016 -257875 82036 -340580 22838 -258007 199461 120473 -178665 -162257
8477 -162257 6756 -88784 -301897 -42870 -197525 -146786 121287 258582 147526 34438 -32955
8465 -80865 42323 26801 -51479 22062 -41180 84019 297559 278146 -353695 -112853 -126841
8454 -126841 -194219 -336137 83669 -48352 103538 -4150 -244601 3579 -166122 -131062 55006
8442 -13017 46485 -103272 110619 -52750 -70236 182265 -192135 163008 -83269 41978 -226848
8430 -82573 274875 58757 -278029 55832 -20660 -262936 -249844 -123792 -120147 -237994 -289187
8419 -289187 116344 149511 73209 79211 -13602 66398 150702 -358552 -194824 28186 127596
8408 127596 -15027 -257630 7229 117351 -226123 -13686 -169952 -554940 78302 -76438 -185332
8397 -185332 -18104 111759 -65856 -151277 -464821 131855 67243 -265984 -128400 -286722
8387 -286722 -135999 7642 -191446 -260251 218241 -151001 -184776 32858 -97689 -19272 -85315
8376 -85315 168659 -12810 107329 108134 -96601 -92210 -281190 -110455 40485 -159617 184901
8364 32792 -156881 -196427 -205341 -18447 53067 -141513 -98119 -362193 -52893 41748 -59690
8352 29464 -341272 -92951 251122 200298 26113 11628 -328878 48736 -241074 -76250 -262579
8341 -262579 -28000 -53763 154594 93432 -67956 -207790 -351839 170031 26044 -114748 207869
8329 -120152 -187160 -199492 -141985 12972 -73429 -127814 -218210 -134743 -6425 -201779 -402393
8318 -402393 59423 96228 -301738 162047 126003 -129547 -296053 266217 189068 198666 -143129
8306 -156100 1793 -300271 -66838 -295057 -3913 93946 -43193 62471 -50892 -5984 -20255 116091
8293 184254 144860 -91879 -250281 34373 -249669 -125118 -133243 37509 -207907 132217 128334
8282 128334 -65838 373203 -56524 -209503 53849 -168358 -63409 -23168 134028 -361452 84071
8270 -254818 -172005 71753 34395 224854 -144752 -199783 -38742 8665 -116764 -92555 -91279
8259 -91279 195412 199953 276376 -158408 -73245 -232227 111570 3680 147355 -219067 76364
8247 113990 -195657 -141752 326820 58890 -40698 163363 -168945 23872 60158 15660 -51177
8235 -178125 -60379 77597 75116 143195 14916 -510 97963 -244786 11180 224083 386013 -164186
8222 178656 -33232 -104700 -67709 -72274 61873 -49653 175796 -140483 8126 62552 -249403
8210 45362 -221759 8610 -156955 -173973 32299 156067 -234969 -461412 -118086 30552 -89851
8198 154583 88280 -183926 -83083 101696 -3403 -76966 -299893 -191546 -236428 -18795 -274478
8187 -274478 143557 -18075 162899 -365972 -134461 37995 -99137 -2357 -1863 34941 -127980
8175 -50594 445747 207538 -276436 -40906 253933 -16086 -100718 -19941 -217461 -286466 73429
8163 -71445 -228143 -230474 -189905 -176000 -109007 206797 -187663 -206589 -340987 104869 -46913
8151 148856 12317 -203180 -137960 -210798 -166000 -36698 195714 -254562 -63145 -4949 -210748
8140 -210748 -190517 -103935 -88021 -262987 -437231 63383 -478287 -75973 136082 -140428 -189594
8129 -189594 497929 -85818 -18699 42757 -14699 -83993 -149753 218499 -238300 -50521 118975
8117 -91880 -206912 -516599 -275097 7129 84099 -433682 -21424 136071 128939 92144 88503
8106 88503 151032 -268566 -107895 242951 -213080 -79212 24134 150141 -166586 -20040 -300542
8095 -300542 43112 -173385 -39345 -171786 35557 217563 118739 -244794 253449 -120462
8084 -155925 -218465 76374 -138728 218568 -299365 -27779 58338 -19559 -283909 -44746 -68352
8073 -68352 -102318 -71038 129483 233472 -333888 42183 -217902 -9608 92118 -57326 122477
8061 -267902 -172617 -138491 -211705 -21514 -266492 46288 -194934 108290 -63167 163593 179461
8050 179461 -16842 6553 33294 235244 -186934 -253247 -341 -5025 519794 -92416 158358 -313108
8037 34393 -103237 -160427 204262 -68722 158 -114373 109058 -93378 56072 -183923 188708
8025 101390 -151709 -197737 106255 90833 -346534 -50798 202791 -229303 -168732 -41237 -138601
8014 -138601 10437 72215 -78378 -228814 58464 -84454 6637 229115 38181 -23637 87205
8002 199766 -28194 -63727 176129 -100250 -214546 -156085 143060 -278045 94802 -29106 94722
7990 121465 -297469 142144 162863 -68166 -79930 -56116 -238246 195554 -222658 109814
7979 33294 -77371 283392 93603 230077 414529 223531 -383 21300 213034 22081 76911
7968 76911 -306726 244286 -209953 120670 -342425 -209257 33848 -9956 -248263 218571
7957 -50856 -42549 -148190 80974 95256 -164422 195348 -243516 -41303 132705 96578 -100050
7945 -358602 265491 32490 -59962 -199112 266136 -130485 -52221 181521 119157 16550 -40772
7933 -163984 -132411 67678 -82654 -155117 22625 -178364 -56366 14405 -20094 55650 108491
7922 108491 -98566 221691 499 -134880 -263865 105841 -85007 79492 -370702 258184 290038
7911 290038 308234 62998 253153 52234 -113454 -57464 -202636 27080 -363375 12270 -134342
7899 73601 256599 -276157 -461066 154994 -236686 355374 -231261 -180825 83848 -437314
7888 -127412 -184274 117646 71517 -6846 130796 29884 -207054 32539 -89367 -20151 4954
7876 -31106 -398862 38833 208183 70091 -23819 206131 158310 175758 -76871 -180459 -139324
7865 -139324 49337 -68203 180571 -47407 237504 42589 -98070 160381 -74950 -79728 250872
7853 -137856 -360210 -411941 -105948 117821 -447584 -87114 -205191 -94150 11110 123471
7843 123471 -34573 -698 -30081 -129705 -98323 -133899 -85275 333872 -169995 13675 -285312
7831 -16422 -227732 41117 131176 -23548 -69927 54101 -164299 -280471 -68855 -513917 28153
7819 68994 -94026 -65154 -6711 -343016 -53831 83360 -179415 -4672 -10107 22603 -193548 24849
7806 116925 -35796 62111 -221848 -28567 -51396 -24823 -348583 -21360 117532 -118071 -324683
7795 -324683 221967 -124539 -303869 101406 213593 -164038 -142100 -27455 -46072 -268329
7785 -268329 -57603 73848 252524 -234704 -90124 -88115 -126284 133494 136610 -127658 298778
7773 22138 -84883 245616 -124421 -263792 121517 16331 99514 335041 -180139 -75093 6760
7761 -240331 -61175 -331971 71318 -289423 357223 -112278 36301 -21551 206055 -47297 -207736
7750 -207736 -116264 14604 -108720 -121450 -53091 -14544 -66594 118264 -17253 -243883 92446
7738 -65011 -69966 -96750 123786 -30510 -93518 36283 137156 -55410 -63767 -98312 286361 59859
7725 -10882 -175554 45444 79853 26452 7843 -162018 -38095 -23616 189372 222323 123424
7714 123424 -67170 19272 -120746 206723 -79298 185749 -257163 236247 -67484 -73168 145977
7702 -453653 149698 -43249 -297444 -260975 -18046 177749 86931 -360214 118056 -167646
7691 26095 194319 -87467 908 -52183 -104898 29097 26118 6463 138949 -32194 -141808 38860
7678 -208071 115231 -175319 20794 -4245 32907 57264 281343 -120220 -101264 35463 364774
7667 364774 -64173 55684 -377786 194251 -129305 -115108 199049 -40283 -123556 117888 24241
7655 262056 -237146 -265323 -122956 315585 155608 33309 25972 153039 -244679 28534 97785
7644 97785 -95968 -35370 59510 121864 220966 -344163 -33442 -93203 -61405 14783 82944 3267
7631 -68949 -345999 322485 -139844 -22817 -38298 21702 -79048 -139836 -42001 -3280 -169451
7620 -169451 -261345 62379 -85240 -264105 -82870 210386 122853 -4421 37690 -290288 170829
7608 -175124 -201814 -287681 -75867 -107061 130910 126238 -99507 6563 -27557 126167 -137697
7596 46991 -169500 -133038 -20888 -283035 -88022 -150172 -332742 -302838 -147220 -191100 50414
7584 -25426 -178404 112432 146333 -24370 -332112 -101698 -157864 311914 207837 -85906 -177525
7573 -177525 -15632 109807 96614 -193516 249364 -39231 216438 380862 143804 -217888
7562 -70975 152754 -213136 -328352 -190427 -11699 145487 -22011 190583 -32230 85306 13088
7550 55976 114050 358964 -44112 70712 47434 170200 -321884 -300163 163591 -63397 10739
7538 174661 -229827 -331137 -101781 7021 -204828 -52440 -100015 -126263 -7201 75778 -16328
7526 57910 -186387 -60493 6402 292082 1208 30936 -48333 -350186 -60301 339268 -128344
7514 286470 -265193 -190269 131909 5974 -114920 1462 -104902 -27376 7054 110323 133045
7503 133045 -38909 -144297 165608 -123508 -447981 11878 10590 126423 149092 -32932 -181528
7492 -181528 -150886 13087 5246 -293078 -17383 -361032 108394 -52954 -145306 532379 259572
7480 -169418 8133 129799 -257691 143055 137168 -101071 46773 82349 -159272 -79159 -347625
7469 -347625 -74220 -21932 46287 -328170 -30737 -61711 -77379 -513314 -205198 94597 -130153
7457 112760 -299575 -59388 -94710 181954 -45383 225807 -13278 -81795 -248078 81307 75713
7446 75713 -97338 -156457 43633 244855 144490 -216869 252036 -406179 -382198 -90029 -219191
7435 -219191 155582 212907 -182294 170574 -122858 266815 -334386 113287 -20232 293261
7424 145282 -154095 112027 -154581 -171001 -319531 -82048 -18627 -150426 43715 -181399
7413 147617 276464 54083 -107220 89055 -29116 246760 -27559 -129095 19550 -329505 -62740
7401 61739 186511 -1084 -93816 -262425 99142 19716 174870 -66523 288956 53522 -175095
7389 35315 305330 -93602 -152639 -392119 -32528 128857 -161641 -5430 19880 -88548 -116939
7378 -116939 -660102 -3490 -201799 128204 -265241 264197 216516 41921 -144634 -122937 -34584
7366 98707 -159788 -77211 -100196 -444715 -320904 252745 52274 -147433 -2431 -105778 -447356
7355 -447356 -53284 137474 81254 101742 317074 123682 31004 -53861 -73955 -53141 15624
7343 97984 -355624 -317541 -232260 144769 -33065 -72941 -233970 -101344 -86979 18922 249839
7332 249839 -28692 30838 200091 -10835 216230 186828 -173473 -121994 -53779 14483 250948
7321 250948 133830 311780 83785 -92306 -201538 11853 -23272 151225 205082 140295 -5411
7309 9070 125295 -404248 6008 -268034 -65475 -109279 -257203 -18668 -121658 -39506 121416
7297 -11932 8595 -283552 -111231 155652 -159395 -40761 -145043 22272 35716 -17624 -353246
7286 -353246 -38928 263582 72418 -53849 149708 -87780 122936 -136058 -170525 -228345 -43898
7274 390 -211100 -64643 -231876 222159 -51446 -235721 -202381 -99062 9046 -166245 54721
7262 207504 -247458 252623 224630 -82480 64579 -50202 -185311 -153393 72954 4493 -363993
7250 -151035 266268 -7605 -120643 -229682 38642 -26075 -97656 -83710 241452 -258885 94511
7238 -27765 -19436 -29269 113711 -65483 112535 53721 141970 -188048 136630 61700 98297
7227 98297 -257780 52222 134533 -125155 340888 164698 23661 -191235 -56735 -210982 208550
7215 84166 -35611 -75461 -326757 -243341 12423 77247 -111651 -166492 345907 7856 -93722
7203 -130130 128492 21611 -354813 158567 -83315 7108 207962 -238804 -27726 28825 -47639
7191 234888 126878 134250 -306455 -70276 76647 -264771 -8530 76620 299625 -3759 327396
7179 -26792 -126151 81370 104005 58547 -12882 83699 184543 457995 24784 -162827 -127940
7168 -127940 -87007 -5749 -249885 -196932 -15752 -217547 71365 155310 -18806 -301236 -75059
7156 -405271 108090 221055 -42762 -31005 -23150 -22070 -308614 -11401 23589 -201056 -111687
7145 -111687 -141651 172552 -112252 -149904 -260174 -32720 197299 40771 22753 -191500 539743
7133 26028 96006 -124619 -96864 -194038 198567 -118840 -18866 86084 359602 -309208 -14965
7121 -4049 -151910 -439730 275938 118852 -333294 -347056 -41499 112451 -114598 121852
7110 114098 112469 -40536 -209296 -28719 20382 174080 66566 -18432 389144 -84054 -38941
7098 338901 -143507 108919 218547 -88334 79339 78570 -133263 47659 -21798 -198329 186806
7086 -86018 -262926 37429 -363807 -51328 -9789 75185 -216829 -177905 -169184 -4447 35108 -10808
7073 45336 -137701 -289695 16392 -18900 452372 -91847 -49942 -67398 -8115 -77648 52431
7061 51250 -165894 -189940 -362002 -145980 -107695 -95961 -237916 -152205 -440114 45923 -78188
7049 54702 117189 -33442 -129537 -68039 -168707 -148623 75569 -183117 51805 -137545 -42104
7037 -36331 -137993 508159 -114244 -191311 -102377 -315346 -14854 -22327 -115203 -114851 36151 -257485
7024 33439 -281319 96689 137472 -45742 268734 104691 30820 57503 -132587 99326 249511
7013 249511 -229728 -153048 72383 -1684 403808 425063 120986 297822 -302282 -164227 -32324
7001 -76757 -15439 233432 -108460 185131 -70261 57982 -103078 -160697 -3773 -146349 -6197
6989 -30196 391980 435975 102015 147126 -288086 34641 103321 -202435 -218511 -152448 -14499
6977 306909 -91708 160322 -131317 -328162 148608 -86343 -82080 -88826 -80681 21176 72656
6966 72656 -57338 -72837 116187 378061 -181082 -115245 -299640 245182 22164 55504 -148343
6954 195853 79450 -292831 -70020 -138043 -249058 136636 35629 39631 117233 167793 -231713
6942 -389556 170432 176916 -231102 -72239 -49141 88499 329983 -89380 211703 -173559 -215713
6931 -215713 -48339 -149282 147004 58113 427722 100354 111525 1127 -372875 260255 3398
6919 196324 -78125 -449911 -140195 -65666 -87184 244558 -187852 -81057 -277509 55369 -243506
6907 361072 183144 -153270 234720 171019 -199817 -64083 -128299 -209106 -58120 268105 -100860
6895 -106888 -72508 368730 -92667 -203645 -68777 -258400 286468 148442 108184 -344616
6884 145083 79254 298312 170214 175832 -36830 52379 50942 155176 30424 -65976 9235 -72983
6871 437920 -47639 286143 44267 -512471 -91135 177554 20240 -49292 -39246 109250 -314109
6859 -93483 27479 153412 198734 122745 -220800 51339 -56754 -183688 -50180 97091 154761
6848 154761 -172069 -137567 252236 154844 -52680 -101982 39864 -220862 -112435 187618 147235
6837 147235 -230933 -113365 229876 -247195 -101044 -114286 111605 -37861 -147041 8204
6826 -207166 184316 -193973 78699 31178 -166533 12818 -209716 -91413 -22514 -51414 14735
6814 -102876 188501 -88750 -26121 -182312 -181825 92623 278497 -3958 -15925 -88990 -387947
6803 -387947 -205198 50873 -76805 -143028 126357 -355771 -126016 204257 -237292 -334601
6793 -334601 55926 -135803 -140584 -186474 407 -19382 99896 -6625 20343 -61556 -9830 48149
6780 -81490 282515 -21400 109610 -249645 189585 -279620 241129 -22490 142753 -108860
6769 147100 86495 223484 153932 -115308 -117163 -72829 204757 -198455 -366537 103053 -66946
6757 -19621 202744 274896 -25495 71808 291448 -50302 81240 -152214 -80569 -85836 57721
6745 -138898 -209616 -100548 -227955 108015 140504 -2852 134343 -364672 -249445 -83381 -241788
6734 -241788 -172366 89927 -304101 18562 -107177 65513 -183703 191746 -287578 -302144 10998
6722 -102596 336724 103580 42986 49474 45711 11248 186121 105110 -51039 191300 220328
6711 220328 -186313 53509 -101887 -190996 -261208 48512 -250769 -125824 -182752 -65975 -25930
6699 137000 -311785 298545 -93727 39832 -126166 -94779 -182606 -196418 145661 -184116 233609
6687 -63017 -63516 284862 72577 -137644 47902 -321132 40770 299614 -109765 266427 -296715
6675 -133068 -248452 218048 204382 -217680 -142563 -116003 68598 40722 -348078 -92236 -96808
6664 -96808 -14003 98908 7909 325903 -9097 -9457 295062 89750 -25133 -132799 -91418 -13793
6651 -80653 166134 -168925 125629 -292494 -108907 317385 -435016 -362870 -134864 -285767
6641 -285767 -38959 -280882 -27745 -188752 -165323 15999 -160384 354614 112544 -522960
6630 96661 94875 -108556 268823 -99876 112772 378088 -206026 -27726 16737 -101095 75134
6618 -17675 -53447 34425 76308 24464 -423262 -128478 156435 -58454 24704 -378919 232367
6606 129477 175838 -454479 -201616 -35268 56365 154986 135653 -11348 -44383 11580 150841
6595 150841 85703 382015 36761 108805 69847 134264 -81009 62154 15840 -77160 283548
6583 -65024 -14647 -290080 -192813 80066 357 -250543 157014 175019 -118577 77454 -129410
6571 -139791 -94356 -45121 83631 -310115 -23431 73168 306899 3699 -12639 25988 -135581
6559 -59005 124248 -327084 -78501 -88455 -109436 6245 -82142 144673 253069 -270221 237508
6547 29384 -331365 205247 -269067 -188735 -4363 111704 71812 207077 499642 82219 7283
6535 -115241 303077 141870 33393 -113926 -10187 -320423 4783 -665438 269063 98783 -142827
6523 117132 189149 -6516 -343474 134016 -206814 -358963 22922 -2931 -173464 -112280 227742
6511 164506 8785 -158391 -133323 207819 51659 340956 -54436 226447 124380 -82244 47341
6499 408757 -14098 138694 260477 68696 -72220 63164 60459 194601 -104231 -391219 12289
6487 -145799 145069 -38097 -68304 -93844 -32088 -573541 38430 -339351 -159671 -59454 -217094
6476 -217094 127630 -31652 43545 236778 -34892 201321 68161 -152889 -134794 -84477 -289988
6465 -289988 -30787 -101108 -141570 78822 374008 -297627 113763 54908 -185044 181249 -134266
6453 52957 2845 -27737 -149782 -271513 -163061 100609 -51158 -282363 179733 -125761 -295539
6442 -295539 -99746 -86433 -448522 -84245 157805 -98801 -117273 -52020 -190769 -317352 -14322
6430 -25858 -352317 -47416 88358 -119123 -15939 102137 97562 21114 62125 78438 -66047
6418 -19329 77807 -310847 -72942 -37021 -195552 261133 106310 -149310 142373 -281324
6407 14118 260508 -308356 -266584 -146197 -7691 -181464 14605 -154774 -25828 113754 134546
6396 134546 72813 65473 -51987 -72148 -45514 -112329 -72869 173355 -36722 199019 -15226
6384 230831 -207416 89009 161414 -143640 -152562 -236914 223895 93354 -141697 103470 -453273
6372 64947 21518 -19124 151526 -84209 -6265 215628 112755 161819 181385 -12042 -230740
6361 -230740 -217421 -87251 -170160 -211782 58985 101919 -132439 10651 -116257 275212 204282
6350 204282 145585 155164 -204636 33803 -181887 254586 164823 343338 600488 150144 -93191
6338 60049 -124720 100129 296603 194552 -2734 165735 -74760 -275483 58753 366714 37267
6326 173698 209589 138715 152687 73352 -195062 -120012 16333 62022 -61875 102777 -215727
6314 175624 -121475 -56035 -36726 -44781 -188569 -305597 -573 189544 -141843 -64027 326955
6302 -149616 184606 -288780 -85213 243728 -374364 -57002 -101525 187553 66524 101775 -8308
6290 -322316 3550 -24742 140125 -81436 11454 81071 -12673 9760 155038 143065 -344581
6278 -31988 111112 -93314 44363 -123354 -12582 64664 -360573 -32896 -245427 148454 16856
6266 398688 167476 273100 -228578 236359 8854 -131176 -597116 141736 238471 -219642
6255 -28689 -86252 -12837 -47195 -94108 67337 572654 133548 -199860 32035 -99727 53509
6243 -186662 120917 -98317 78974 -147913 -115386 149858 141989 165401 -260677 -182387 -254094
6232 -254094 -153587 82515 282970 326305 56962 -92580 32636 8378 223276 138202 37450
6220 5529 3874 -298474 224578 -189629 -138563 -101577 -236216 -236209 -20193 121336 -218451 -236995
6208 -236995 -46016 133838 7721 -173382 168153 -142365 45442 160601 -43872 13730 156427
6197 156427 -375762 -188795 -155410 -120844 175238 -167600 -16187 102861 -64118 179728
6186 115400 -66734 -3941 -403573 -78538 67354 383258 251120 11713 -99519 10152 -8240
6174 -22326 -54097 -151501 97475 -168865 78589 -168145 -37647 374020 83785 -233514 106903
6162 439824 -137513 186512 191890 -151225 -394397 23664 -70260 66425 -57796 -15217 23029
6150 78013 -113852 159786 114177 5464 22858 41201 114825 71351 -54220 -126569 -184562 -236361
6138 -236361 300927 80535 102935 210234 349861 -74814 -130930 -19890 -72784 -64162 313016
6126 375617 -92392 -74450 174203 -271743 7186 -34840 209950 -208028 -234725 57187 144378
6115 144378 -232345 -93938 -102769 82305 -29622 -243116 248811 -208145 -43779 -105431 3530
6103 188232 -189123 222625 41292 210323 229960 -319591 177089 -53560 -79388 -79545 -286214
6092 -286214 364692 256126 -192797 -159968 -9360 131011 11050 50980 308992 -139845 -246217
6081 -246217 147988 129400 -12982 -18195 -290850 -40820 -27267 -415361 -95378 284390 -15555
6069 5682 -67551 114010 -139808 180456 195424 -83298 70293 354663 85371 254099 -103606
6057 -231975 -131992 -47327 -34735 -296290 11795 -47878 142341 79483 -85172 120709 180581
6046 180581 -98310 -109036 -152996 119706 63678 107159 164039 -74187 151013 107312 -141227
6034 112794 122285 23298 -356687 340709 -17887 -147392 142776 70246 225201 -168134 -60474
6022 -30564 -166323 -197933 139944 -148662 158359 227971 -99595 -143685 -19352 -233670 48929
6010 25776 -9123 -377 -35359 41579 9356 -15469 -23317 375953 -320070 43130 -153183 62079
5997 84035 -16442 155809 -57984 -164604 127770 141103 86759 -127893 34316 -335234 169273
5985 -350279 181069 13122 81288 58557 -96444 -206726 -53140 163509 -411439 75963 -24545
5973 -41450 -170532 496683 -128566 -129637 28679 -53910 24186 189790 272537 62747 134072
5962 134072 -92881 174991 -99358 159365 129101 -94853 35361 268976 -10673 -251380 5603
5950 -37634 50016 153724 -175337 -294720 94620 -4009 161446 126098 -191359 283937 21733
5938 -63553 -150684 -82128 -84425 89614 -22362 -101693 63222 154623 -389969 77857 101683 -13100
5925 52616 -121365 103618 99042 258698 107907 -78404 121995 46475 -352660 48978 16640
5913 276526 -95537 -23478 -133909 -15698 401329 -145872 -53587 191744 -317844 304087
5902 178278 -269266 -213496 95474 -202327 192500 179852 212953 -104993 -67663 -68302 112557
5890 -197162 -171951 -44133 113986 -157411 309960 -74396 30822 24793 -30946 -271249 84878
5878 -23391 -7190 21378 216842 3905 -91914 -149538 198769 -32665 -18218 -58808 -58801 32013 124414
5865 124414 12438 -26670 376070 37272 -58180 -86214 81052 4889 -85021 -152203 330169
5853 134728 -108838 196088 327360 166337 -7926 136566 4027 -198025 -98035 398483 -193128
5841 27249 -104661 -107504 -105803 -29246 -224343 194256 -12433 -250064 277588 238759 -79887
5829 124889 28880 69849 157519 -57196 204498 -132026 214240 -103059 -115403 170567 -148632
5817 330098 -174714 152003 -218489 -59162 -95409 22374 239990 -260126 -104386 -203177
5807 -203177 334518 174741 55470 184129 -260563 275353 -138621 -260017 -145587 -33985
5796 -142116 -331004 77079 -360525 -212891 -202671 -147270 -10240 -127421 -177468 237497 -128656
5784 -53001 -2570 190337 -99570 -188687 13758 93605 -248596 241654 -101346 -108857 -82627
5773 -82627 31597 51926 -83457 140265 -103285 23272 123109 -376930 102162 107815 -203484
5761 -79327 78731 -85324 171379 12420 244584 124003 189570 -138651 305570 -135129 -30201
5749 -118065 24192 -193280 -245544 -53514 105076 -13567 -41859 -141281 362029 91311 328327
5738 328327 28856 -118512 273394 -174330 301856 56034 186892 -82739 -99943 -8426 125341
5726 -2649 -100605 11683 -177154 -5527 195864 116932 -151149 203037 256659 -284229 17784
5714 -37251 -72717 -244277 -96384 174901 352229 -29827 -265023 -26464 160035 -66230 -50156
5703 -50156 320738 -132982 -132137 -70649 69331 -86790 -198833 -190299 338490 -170838 190414
5691 112142 -84169 -183900 -178551 -140220 -214722 150858 55886 -137540 143329 -72213 -288273
5680 -288273 86517 -43652 66695 -55272 -224238 47131 317257 -7486 24276 -19994 -35769
5669 -35769 -44865 -333527 -284088 190638 248414 -299875 155497 12005 115107 -300143 -129609
5657 -4589 -6136 -16273 -76610 -6308 -47742 472869 -68011 119751 283825 10611 -91367 -71624
5645 -71624 16286 -49484 157821 -195815 228653 213891 94251 77791 -198024 158220 -172490
5633 -29431 109675 291374 -83932 -38709 49374 -13622 169674 39942 -3789 -261410 243883
5621 12119 66694 -26969 175487 -71689 -228263 151117 21545 -7067 -101142 -77413 -16118
5609 103659 -125145 128195 -160314 -194875 -154708 -224830 -123430 -35944 -64708 144579 144908
5598 144908 -51218 -327905 275722 -66951 -63911 336 -70021 -29205 -140230 -6776 73557 2880
5585 -243293 291501 29834 -227144 -107443 10627 -128528 -145295 254849 -32723 177079
5574 -52444 6310 -54613 8871 34039 -238993 97155 143449 61967 60480 27496 -15963 -103913
5562 -103913 -26100 -56181 33942 -32723 109569 -96979 -387960 -231222 -79013 -17385 -305773
5551 -305773 240850 -117217 -2332 122741 -282038 3122 -72566 -11482 78300 34706 -123879
5539 137546 96117 43526 175876 -175030 88875 131808 163854 117898 111387 -8723 -110375
5528 -110375 124292 -168283 482787 100970 -148407 152591 -166725 31364 103786 -14859
5517 312710 44059 160095 -115881 6762 -247952 -37461 226454 153892 41780 321054 -88870
5505 -269915 -28627 -116404 -26044 188725 -157152 162533 55707 -58458 20077 150787 83241
5494 83241 55396 309817 -159089 18231 -21341 -39323 3929 -61783 -9215 24364 84481 -243607
5481 -6313 -58455 -160274 -111799 -21149 -8291 -273630 147511 -366775 -248097 83178 -211920
5469 15156 -9314 -73984 -174869 117982 74290 -14981 -21645 -251336 219604 306851 149588
5457 -100466 -200664 148958 -199806 261656 -25858 -188516 180902 -54847 60541 234780
5447 234780 177296 53783 152963 -67742 177849 -24659 -231465 358743 -739 167772 -134813
5435 -228306 -23690 206090 54292 -131123 139316 -267130 181858 -173427 72759 -9923 64605
5423 63403 -45748 117596 109654 106021 282270 192337 -287910 -55825 -19415 119864 -168566
5411 111016 157925 -72194 31594 11187 425719 49501 -128925 71846 159055 264399 -24002
5399 -19547 187497 53106 197307 -147778 81953 250938 120035 -112437 -416876 35585
5388 36250 -52388 -410236 33992 -25443 190431 155165 126848 82303 -127111 -185075 -28054
5376 -235766 -33383 -40318 179286 -236813 177226 302375 -95859 356655 280938 -52692 -315410
5365 -315410 21395 -127669 30777 -54738 154813 151639 -38338 205492 89402 43783 106178
5354 106178 -155987 -34098 -83433 -298904 -63412 -184772 -88399 38725 -132950 346079 -209507
5342 58902 -240929 -211117 6430 332149 -66604 195866 306661 257590 279848 264415 -90023
5330 -5676 -76351 -82524 359891 387284 91336 -139891 -14764 -213429 136468 29572 -7449 -34987
5318 -34987 -196135 174879 101421 -211943 -291025 -42950 -42550 -44844 -55769 -83166 282875 -137488
5305 159456 144610 16838 41373 -20750 -284602 -40606 188726 223681 -332259 15650 141008
5294 141008 188216 59536 -41349 159033 -90983 -15761 212411 41989 353533 -233112 89474
5282 -21375 -174180 -265981 142515 -322375 -87661 -231471 169697 353508 273565 16913 -397967
5270 -48051 -153808 153137 -146314 -114042 210045 195910 -188430 -78260 -134583 -326223 -272196
5259 -272196 -91047 106522 150515 9344 -9317 -162786 334400 -191970 -154485 -62526 -366050
5248 -366050 183873 -75937 -206923 308075 -46779 113923 -303098 222707 164721 340232
5238 340232 -9191 69507 -34004 57667 153152 87047 375987 -83961 -47076 2618 -16525 17186
5225 124198 199721 -119335 -24934 -191230 212243 -182405 78367 -263841 44163 -31266 194554
5213 86693 308436 -102133 50193 239058 54374 -147731 124346 128506 132240 518701 -17869
5201 110573 -276364 73697 -62184 170386 -210523 -92727 -78865 239053 -95934 257044 39401
5189 -7386 139698 -388656 118095 15157 258963 -123330 53099 -244588 87905 6340 183614
5178 183614 -157334 42517 203249 -272275 -9456 97920 260717 183728 -53834 -5633 109221
5166 47279 -152930 -116224 -110692 131915 96732 25566 -71891 58752 -248229 113548 506876
5155 506876 68304 117869 -46504 -401266 240486 160409 202628 -163831 -243181 -176239 156656
5143 168255 19202 -215495 1537 63188 41685 37056 280313 126322 89781 -134471 198502
5131 -16926 -81491 -291279 -110246 249886 91985 -192328 212742 -122312 65121 -85094 -31745
5119 -502647 -104894 7203 -78454 -89851 -46846 -571411 -52392 173756 -208836 -81067 -56795
5108 -56795 -31331 246112 237976 -65280 76601 268537 29960 -204117 -96913 -18418 -70533
5097 -70533 58996 370664 -38692 -9554 -55549 -189609 -154012 33043 -154591 36635 145941
5086 145941 -109502 52203 -18978 451025 119335 117321 -83094 -319605 -26740 24850 135334
5075 135334 -51813 -245868 267899 -166076 -143890 -117921 -43321 -107008 67771 -143559 -170715
5064 -170715 147809 -117048 340077 380809 69647 369160 -65745 -115822 221554 -82629 163330
5052 336008 166900 92836 -196183 172101 -188731 -132554 46619 244147 14319 -148605
5041 78243 -12123 -257105 -297334 -65309 -105717 89908 158196 -200791 70106 -63802 95328
5029 54451 92301 -226975 398955 74917 -147319 320294 -5926 87842 171055 153855 -294848
5017 -114081 119279 -31572 10173 -397441 -125291 -70654 162097 -27464 -228396 230880
5006 -131805 -88804 -63905 174401 -498570 171795 101810 -317151 -14513 -297773 25067 195645
4995 195645 174048 -20713 5464 -19025 405456 -124846 -251266 -11982 -140115 -45184 -170713
4984 -170713 -139047 161976 -156586 70913 74740 -230279 -61923 35803 126283 -168396 96933
4972 -63596 -44864 150003 4644 411091 -312192 -39289 278528 -6834 178606 -307194 152103
4960 90984 -10793 -1170 -282279 68009 27047 307617 49680 -59174 -224076 -14676 -246932
4949 -246932 -45300 171273 148531 176775 -31678 96612 278521 -176604 -25245 163868 16122
4937 -253825 -60298 -236020 -96262 205828 67583 97338 -307334 -14879 199419 110661 -164767
4925 232399 -209266 -108199 -41928 175101 -251471 159206 -161448 109176 -152184 -113356
4915 -113356 -99920 -124914 60048 -77128 111526 59972 88540 195671 -294121 -262835 104813
4903 62917 -103056 -102242 -22304 226292 -48418 111383 109716 166774 -73393 -337558 176234
4891 -173263 357572 14858 165308 -202237 -161143 -200290 2953 69233 -89138 -278873 -283493
4880 -283493 -4339 -153601 268432 64992 -84303 -56961 7622 -288497 41968 368687 140349
4868 199022 -155067 -27622 -171461 331324 -29085 54632 -95098 -27550 -167745 -102495 -132519
4857 -132519 54668 134180 -37394 94421 145268 50319 244719 233955 -146972 -178032 19998
4845 -72833 313000 -232433 101692 197265 -267563 -248323 236906 63667 6879 -107885 65067
4833 196493 -114533 -103493 232551 -39285 -76642 -53172 28125 442522 52769 -20485 93834
4821 25737 -30325 201367 190104 126823 -107749 498348 126915 496354 -17519 -5404 -233684
4810 -233684 -34458 -263374 340816 263137 223338 -52130 -137718 -85322 46960 78708 33324
4798 925 3471 -63499 209078 -85528 46770 275943 94431 190909 131256 -373577 180134 189961
4786 189961 24892 -114157 -255364 -177318 -238538 -108367 -102727 327552 -4209 299543 98787
4774 -181780 -162967 -44857 -69782 137537 -123794 -190609 -195611 -22772 -90845 123911 66622
4763 66622 69720 -169328 59669 192880 206145 19553 216318 -77148 -34295 144621 -93121
4751 -208105 120104 179069 149901 -177841 -247832 63544 -11423 4107 -146967 -138279 108784
4739 -356736 7426 166833 4228 -81428 -18629 160366 54557 -135226 -103130 103993 16439
4727 328727 -133541 102261 -223754 -283111 121795 9536 235365 -254239 184541 -213078
4716 215307 21660 -192721 -6250 190915 184694 171613 412236 48756 -196903 200017 7304
4704 328145 107573 45399 34950 21889 -118332 106646 71353 -284335 -218935 8208 133667
4693 133667 -64522 -212682 167968 -57537 13395 -185551 -92346 -126046 -74250 162021 -237647
4681 -11837 90148 163342 134473 375747 -203471 -75631 348512 -6607 44949 254834 22898
4669 -115179 48362 57826 -250638 -340141 161296 -244769 173934 -26067 -137863 -224191 -158400
4658 -158400 -165898 97175 -2804 -94909 137796 -73369 -169800 335831 196672 77376 -7547 -11320
4646 -11320 -35646 -36448 -98256 172630 -159654 -185031 80914 323231 219135 -238369 -111782
4634 -77925 64041 -367910 178019 -49548 12594 212336 33454 -304330 7531 -140736 119919
4622 21584 151501 326313 8179 -106742 63372 -241569 315838 -45152 177353 134156 31040
4610 -32292 71392 109 275165 314778 -388562 26548 110748 -7892 83821 7323 -4223 149101
4597 -92394 185333 200956 -149460 -48782 -202509 -255565 -54328 84046 -229400 -73061 77913
4585 -170977 182541 58138 -31045 101203 2460 41796 152958 -57480 116335 -273006 -73667
4573 6073 -190828 236102 -285548 -67570 -198325 191610 -88152 22435 -223802 -302601 178969
4561 -23241 17271 -321690 138474 171854 -6132 31438 -236761 36668 58651 283345 164494
4550 164494 203677 315919 -124749 97812 181862 -233744 -108451 383899 -113118 -258204
4540 -258204 49518 -242203 362532 59520 -111722 -6105 180574 130261 -18072 154552 285394
4529 285394 -140114 435 -31942 -214732 -220848 -129698 499012 -128526 259447 7080 63918
4518 63918 -47208 -129662 133957 35245 186746 -22505 -28841 175106 111497 -47476 -25891
$$ [...]
##END NTUPLES=NMR SPECTRUM
##END=
