
##TITLE=AC1315_SZAAH12144_6535185_1MADbvUZYa
##JCAMPDX= 6.0         $$ Bruker NMR JCAMP-DX V2.0
##DATA TYPE= NMR SPECTRUM
##DATA CLASS= NTUPLES
##ORIGIN= BRUKER
##OWNER= Administrator
$$ 1.72 TOPSPIN		Version 2.1
$$ 2012-07-17 20:25:42.312 -0500  Administrator@TOPSPIN
$$ Compression mode = diff/dup
##.OBSERVE FREQUENCY= 400.02188249412
##.OBSERVE NUCLEUS= ^1H
##.ACQUISITION MODE= SIMULTANEOUS (DQD)
##.ACQUISITION SCHEME= undefined
##.AVERAGES= 64
##.DIGITISER RES= 22
##SPECTROMETER/DATA SYSTEM= spect
##.PULSE SEQUENCE= noesygpps1d.comp
##.SOLVENT NAME= COFFEE_meoh
##.SHIFT REFERENCE= INTERNAL, COFFEE_meoh, 1, 14.96075
##AUDIT TRAIL= $$ (NUMBER, WHEN, WHO, WHERE, PROCESS, VERSION, WHAT)
$$ ##TITLE= Audit trail, TOPSPIN		Version 2.1
$$ ##JCAMPDX= 5.01
$$ ##ORIGIN= Bruker BioSpin GmbH
$$ ##OWNER= Administrator
$$ $$ C:\Bruker\TOPSPIN/data/COFFEE/nmr/AC1315_SZAAH12144_6535185_1MADbvUZYa/12/pdata/1/auditp.txt
$$ ##AUDIT TRAIL=  $$ (NUMBER, WHEN, WHO, WHERE, PROCESS, VERSION, WHAT)
(   1,<2012-07-17 20:25:37.125 -0500>,<Administrator>,<TOPSPIN>,<go>,<TOPSPIN 2.1>,
      <created by zg
	started at 2012-07-17 20:14:06.890 -0500,
	POWCHK enabled, PULCHK disabled,
       configuration hash MD5:
       6B 1B 68 BB D9 2E 58 E2 7F 35 AD 54 07 DF 0E 41
       data hash MD5: 64K
       74 3A E5 04 06 E8 E9 AF E4 B1 6C 3B 50 A3 A9 8D>)
(   2,<2012-07-17 20:25:40.062 -0500>,<Administrator>,<TOPSPIN>,<proc1d>,<TOPSPIN 2.1>,
      <Start of raw data processing
       efp LB = 0.3 FT_mod = 6 PKNL = 1 PHC0 = 0 PHC1 = 0 SI = 128K 
       data hash MD5: 128K
       A6 B9 91 D1 E1 50 BD 07 87 B7 32 5D F3 52 79 08>)
(   3,<2012-07-17 20:25:41.187 -0500>,<Administrator>,<TOPSPIN>,<proc1d>,<TOPSPIN 2.1>,
      <pk PHC0 = 1.768799 PHC1 = 0 
       data hash MD5: 128K
       8A F1 44 9C 45 96 DC 49 6A FF 20 45 F9 A6 53 12>)
(   4,<2012-07-17 20:25:41.906 -0500>,<Administrator>,<TOPSPIN>,<proc1d>,<TOPSPIN 2.1>,
      <abs ABSG = 1 
       data hash MD5: 128K
       3D A7 0A B8 FD 55 E2 61 47 CE 5D 75 B3 D9 95 5A>)
(   5,<2012-07-17 20:25:41.984 -0500>,<Administrator>,<TOPSPIN>,<proc1d>,<TOPSPIN 2.1>,
      <abs ABSG = 2 
       data hash MD5: 128K
       A3 50 60 55 D6 56 2A 47 F3 6E F1 AF AE D1 0F F2>)
(   6,<2012-07-17 20:25:42.062 -0500>,<Administrator>,<TOPSPIN>,<proc1d>,<TOPSPIN 2.1>,
      <abs ABSG = 3 
       data hash MD5: 128K
       51 EB 4A CC A0 07 8B 2E 3B 54 C6 4F 86 8D D9 CD>)
(   7,<2012-07-17 20:25:42.125 -0500>,<Administrator>,<TOPSPIN>,<proc1d>,<TOPSPIN 2.1>,
      <abs ABSG = 4 
       data hash MD5: 128K
       F0 03 BE 72 F2 1F 3C C7 C2 B0 83 54 1B 8E 32 15>)
(   8,<2012-07-17 20:25:42.218 -0500>,<Administrator>,<TOPSPIN>,<proc1d>,<TOPSPIN 2.1>,
      <abs ABSG = 5 
       data hash MD5: 128K
       DB E8 CC BC 75 38 CA B9 E0 7C 4F B2 D4 1D 68 BF>)
$$ ##END=
$$ 
$$ $$ hash MD5
$$ $$ B4 B0 C1 18 80 E3 41 FA 0E 6D 95 B6 62 94 09 3E
##$RELAX= 
##$RELAX= 
##$RELAX= 
##$RELAX= 
##$RELAX= 
##$RELAX= 
##$RELAX= 
##$RELAX= 
$$ Bruker specific parameters
$$ [...]
##$TP07= 0
##$TPNAME0= <>
##$TPNAME1= <>
##$TPNAME2= <>
##$TPNAME3= <>
##$TPNAME4= <>
##$TPNAME5= <>
##$TPNAME6= <>
##$TPNAME7= <>
##$TPOAL= (0..7)
0.5 0.5 0.5 0.5 0.5 0.5 0.5 0.5
##$TPOFFS= (0..7)
0 0 0 0 0 0 0 0
##$TUNHIN= 0
##$TUNHOUT= 0
##$TUNXOUT= 0
##$USERA1= <user>
##$USERA2= <user>
##$USERA3= <user>
##$USERA4= <user>
##$USERA5= <user>
##$V9= 5
##$VALIST= <valist>
##$VCLIST= <CCCCCCCCCCCCCCC>
##$VD= 0
##$VDLIST= <DDDDDDDDDDDDDDD>
##$VPLIST= <PPPPPPPPPPPPPPP>
##$VTLIST= <TTTTTTTTTTTTTTT>
##$WBST= 2048
##$WBSW= 25
##$XGAIN= (0..3)
0 0 0 0
##$XL= 0
##$YL= 0
##$YMAX_a= 12285125
##$YMIN_a= -9306964
##$ZGOPTNS= <>
##$ZL1= 120
##$ZL2= 120
##$ZL3= 120
##$ZL4= 120
##$ABSF1= 14.96075
##$ABSF2= -5.597432
##$ABSG= 5
##$ABSL= 3
##$ALPHA= 0
##$AQORDER= 0
##$ASSFAC= 0
##$ASSFACI= 0
##$ASSFACX= 0
##$ASSWID= 0
##$AUNMP= <proc_prof1d_extract.lims>
##$AXLEFT= 0
##$AXNAME= <>
##$AXNUC= <1H>
##$AXRIGHT= 0
##$AXTYPE= 0
##$AXUNIT= <>
##$AZFE= 0.1
##$AZFW= 0.1
##$BCFW= 0
##$BC_mod= 0
##$BYTORDP= 0
##$COROFFS= 0
##$CY= 15
##$DATMOD= 1
##$DC= 0
##$DFILT= <>
##$DTYPP= 0
##$F1P= 0
##$F2P= 0
##$FCOR= 0.5
##$FTSIZE= 131072
##$FT_mod= 6
##$GAMMA= 0
##$GB= 0
##$INTBC= 1
##$INTSCL= 1
##$ISEN= 128
##$LB= 0.3
##$LEV0= 0
##$LPBIN= 0
##$MAXI= 10000
##$MC2= 0
##$MEAN= 0
##$ME_mod= 0
##$MI= 0
##$NCOEF= 0
##$NC_proc= -2
##$NLEV= 6
##$NOISF1= 0
##$NOISF2= 0
##$NSP= 0
##$NTH_PI= 0
##$NZP= 0
##$OFFSET= 14.96075
##$PC= 1
##$PHC0= 1.768799
##$PHC1= 0
##$PH_mod= 1
##$PKNL= yes
##$PPARMOD= 0
##$PPDIAG= 0
##$PPIPTYP= 0
##$PPMPNUM= 2147483647
##$PPRESOL= 1
##$PSCAL= 4
##$PSIGN= 0
##$PYNMP= <proc.py>
##$REVERSE= no
##$SF= 400.020009735748
##$SI= 131072
##$SIGF1= 0
##$SIGF2= 0
##$SINO= 400
##$SIOLD= 131072
##$SPECTYP= <>
##$SREGLST= <1H.CDCl3>
##$SSB= 0
##$STSI= 131072
##$STSR= 0
##$SW_p= 8223.68421052631
##$SYMM= 0
##$S_DEV= 0
##$TDeff= 65536
##$TDoff= 0
##$TI= <>
##$TILT= no
##$TM1= 0
##$TM2= 0
##$TOPLEV= 0
##$USERP1= <user>
##$USERP2= <user>
##$USERP3= <user>
##$USERP4= <user>
##$USERP5= <user>
##$WDW= 1
##$XDIM= 131072
##$YMAX_p= 431239867
##$YMIN_p= -11225
##$CURPLOT= <Network HP LaserJet P1505>
##$CURPRIN= <$Network HP LaserJet P1505>
##$DFORMAT= <normdp>
##$LAYOUT= <+/1D_H.xwp>
##$LFORMAT= <normlp>
##$PFORMAT= <normpl>
##$SURQMSG= 1
$$ End of Bruker specific parameters
$$ ---------------------------------
##NTUPLES= NMR SPECTRUM
##VAR_NAME=  FREQUENCY,     SPECTRUM/REAL,   SPECTRUM/IMAG
##SYMBOL=    X,             R,               I
##VAR_TYPE=  INDEPENDENT,   DEPENDENT,       DEPENDENT
##VAR_FORM=  AFFN,          ASDF,            ASDF
##VAR_DIM=   131072,        131072,          131072
##UNITS=     HZ,            ARBITRARY UNITS, ARBITRARY UNITS
##FACTOR=    0.0627417313425164, 1,          1
##FIRST=     8223.62146879497, 1508,         -56797
##LAST=      0,             2017,            -56914
##MIN=       0,             -11225,          0
##MAX=       8223.62146879497, 431239867,    0
$$ Real data points
##PAGE= N=1
##DATA TABLE= (X++(R..R)), XYDATA
$$ [...]
$$ plain form
63908 2199834 2023318 1864479 1722443 1596058 1484369 1386396 1300690 1225437 1159017 1100294
63898 1100294 1048476 1002952 963183 928362 897191 868318 841095 815586 791798 769251 747476
63887 747476 726568 706979 689004 672627 657626 643605 630201 617573 606558 598055 592322 589066
63875 589066 588087 589548 593605 599990 608111 617530 628299 640770 655054 670789 687564 705375 724354
63862 724354 744103 763678 782294 799694 815781 830281 842964 853855 862912 869770 874036 875680
63850 875680 874881 871628 865709 857026 845804 832490 817478 800843 782395 762130 740516 718061
63838 718061 694748 670324 645092 619939 595479 571646 548237 525330 502999 481207 460312
63827 460312 441167 424331 409531 396220 384212 373362 363110 352939 343012 333866 325668 318246
$$ packed form
63908B199834j76516j58839j42036j26385j11689r7973q5706p5253o6420n8723
63898A100294n1818m5524l9769l4821l1171k8873k7223k5509k3788k2547k1775
63887G47476k0908j9589j7975j6377j5001j4021j3404j2628j1015q503n733l256
63875E89066r79J461M057O385Q121R419J0769J2471J4284J5735J6775J7811J8979
63862G24354J9749J9575J8616J7400J6087J4500J2683J0891R057O858M266J644
63850H75680p99l253n919q683j1222j3314j5012j6635j8448k0265k1614k2455
63838G18061k3313k4424k5232k5153k4460k3833k3409k2907k2331k1792k0895
63827D60312j9145j6836j4800j3311j2008j0850j0252j0171r927r146q198p422
$$ plain form
63815 318246 311561 305675 300426 295647 291553 288451 286153 284132 282144 280335 278839 277679 276923 276493 275953
63800 275953 274861 273279 271536 269699 267759 266103 265185 264737 263917 262317 260250 257967 255312 252393 249978
63785 249978 248673 248020 246972 245133 243133 241724 240841 239748 238007 236036 234590 233810 233146 232278 231690 231999
63769 231999 232945 233565 233346 232796 232730 233299 233894 233894 233353 232916 233055 233436 233254 232230 230984 230269 230158 230252 230289 230188
63749 230188 229813 229298 229355 230625 232732 234592 235709 236600 237884 239603 241676 244343 247670 251059 253785
63734 253785 255844 257829 260124 262618 265111 267588 270004 272136 273818 275256 276968 279449 282906 287286
63720 287286 292464 298328 304684 311159 317288 322652 326909 329801 331227 331272 330073 327750 324549 320850 316924
63705 316924 312805 308628 304889 302070 300086 298427 296841 295603 295065 295197 295651 296107 296536 297314 299094 302305
$$ packed form
63815C18246o685n886n249m779m094l102k298k021j988j809j496j160p56m30n40
63800B75953j092j582j743j837j940j656r18m48q20j600k067k283k655k919k415
63785B49978j305o53j048j839k000j409q83j093j741j971j446p80o64q68n88L09
63769B31999R46O20k19n50o6N69N95%n41m37J39L81j82j024j246p15j11R4L7j01
63749B30188l75n15N7J270K107J860J117Q91J284J719K073K667L327L389K726
63734B53785K059J985K295K494K493K477K416K132J682J438J712K481L457M380
63720B87286N178N864O356O475O129N364M257K892J426M5j199k323l201l699l926
63705C16924m119m177l739k819j984j659j586j238n38J32M54M56M29P78J780L211
$$ plain form
63689 302305 306680 311399 315719 319346 322272 324562 326363 327858 328968 329289 328566 327230 326224 326157 326715
63674 326715 327105 327128 327527 329083 331568 334008 335911 337737 340084 342947 345978 348951 351531 353055 353066 351741
63658 351741 349247 345052 338624 330725 323252 317594 313630 310357 306944 303081 298893 294863 291484 288777
63644 288777 286412 284415 283297 283313 283999 284780 285719 287331 289850 292970 296210 299331 302468 306001 310266
63629 310266 315304 320913 326878 332999 339025 344848 350808 357562 365607 375072 385838 397548 409661
63616 409661 422013 435375 450933 469024 488853 509687 531919 556621 584446 615373 649176
63605 649176 685504 723478 761560 797925 830825 858683 880223 894697 902008 902711 898050 889931
63593 889931 880510 871389 863013 854836 846111 836498 825806 813274 797537 777623 753858 727565 700045
$$ packed form
63689C02305M375M719M320L627K926K290J801J495J110L21p23j336j006o7N58
63674C26715L90K3L99J556K485K440J903J826K347K863L031K973K580J524J1j325
63658C51741k494m195o428p899p473n658l964l273l413l863m188m030l379k707
63644B88777k365j997j118J6O86P81R39J612K519L120L240L121L137L533M265
63629C10266N038N609N965O121O026N823N960O754Q045R465J0766J1710J2113
63616D09661J2352J3362J5558J8091J9829K0834K2232K4702K7825L0927L3803
63605F49176L6328L7974L8082L6365L2900K7858K1540J4474P311P03m661q119
63593H89931r421r121q376q177q725r613j0692j2532j5737j9914k3765k6293k7520
$$ plain form
63580 700045 672148 644611 618287 593889 571845 552560 536458 523588 513385 505078 498331 493368
63568 493368 490530 489787 490708 492917 496496 501682 508130 514881 521322 527872 535353 543895 552896 561883 571019
63553 571019 580941 592555 606836 624285 644738 668290 696176 730007 770103 815253 863943 914680
63541 914680 964729 1009549 1044421 1066540 1075544 1072946 1061746 1045921 1029188 1013896 1001019 990655
63529 990655 982126 974166 965621 955760 943607 927491 905965 878943 847433 812562 775435 737587
63517 737587 700627 665347 631764 600027 570696 544122 520178 498737 479895 463511 449010
63506 449010 435912 424244 414163 405477 397752 390765 384601 379396 375110 371449 367953 364272 360521
63493 360521 357311 355316 354700 354946 355298 355424 355575 356090 356916 357813 358858 360347 362222 364045 365642 367442
$$ packed form
63580G00045k7897k7537k6324k4398k2044j9285j6102j2870j0203q307o747m963
63568D93368k838p43R21K209L579N186O448O751O441O550P481Q542R001Q987R136
63553E71019R922J1614J4281J7449K0453K3552K7886L3831M0096M5150M8690N0737
63541I14680N0049M4820L4872K2119R004k598j1200j5825j6733j5292j2877j0364
63529I90655q529p960q545r861j2153j6116k1526k7022l1510l4871l7127l7848
63517G37587l6960l5280l3583l1737k9331k6574k3944k1441j8842j6384j4501
63506D49010j3098j1668j0081q686p725o987o164n205m286l661l496l681l751
63493C60521l210j995o16K46L52J26J51N15Q26Q97J045J489J875J823J597J800
$$ plain form
63477 367442 369994 373426 377526 381960 386268 389958 392837 394896 395793 394955 392505 389523 386856 384073 380186
63462 380186 375161 370160 366329 363804 361846 359539 356468 353070 350360 349100 349357 350929 353764 357649
63448 357649 361968 366368 371288 377224 383732 389902 395689 402090 410004 419580 430701 443443 457991
63435 457991 474688 494312 517735 545125 575809 608767 642434 674038 700184 718942 731078
63424 731078 738908 744414 748855 753670 760901 772544 789720 812464 840203 872531 909553 951202
63412 951202 996032 1040924 1082183 1116875 1143244 1160458 1168490 1168217 1161380 1150304 1137401 1124386
63400 1124386 1111679 1098720 1084958 1070230 1054088 1035231 1012107 984056 951737 916551 879806
63389 879806 842313 804628 767652 732791 701114 672464 645889 621054 598638 579227 562535
$$ packed form
63477C67442K552L432M100M434M308L690K879K059Q97q38k450k982k667k783l887
63462C80186n025n001l831k525j958k307l071l398k710j260K57J572K835L885
63448C57649M319M400M920N936O508O170N787O401P914R576J1121J2742J4548
63435D57991J6697J9624K3423K7390L0684L2958L3667L1604K6146J8758J2136
63424G31078P830N506M441M815P231J1643J7176K2744K7739L2328L7022M1649
63412I51202M4830M4892M1259L4692K6369J7214Q032k73o837j1076j2903j3015
63400A124386j2707j2959j3762j4728j6142j8857k3124k8051l2319l5186l6745
63389H79806l7493l7685l6976l4861l1677k8650k6575k4835k2416j9411j6692
$$ plain form
63378 562535 548182 536533 528046 522254 518298 516232 516861 520262 525353 531236 538191 546919 557397 569117
63364 569117 582091 596969 614215 633707 655281 679258 706237 736521 769988 806491 846191
63353 846191 889284 935234 982229 1027462 1068068 1101865 1127451 1144015 1151374 1150255 1142331 1129897
63341 1129897 1115414 1101037 1088080 1076566 1065299 1052606 1037185 1018357 995713 968812 937464
63330 937464 902296 864874 827153 790744 756578 725020 696193 670315 647940 629910 616903
63319 616903 608932 605284 604827 606033 606547 603251 593607 577368 556848 535216 514552 495357 477386
63306 477386 460458 444693 430560 418810 409971 403713 398948 394655 390459 386406 382572 379082 376166
63293 376166 373879 371851 369520 366592 363192 359681 356379 353294 350056 346329 342377 338999 336788 335642
$$ packed form
63378E62535j4353j1649q487n792l956k066O29L401N091N883O955Q728J0478J1720
63364E69117J2974J4878J7246J9492K1574K3977K6979L0284L3467L6503L9700
63353H46191M3093M5950M6995M5233M0606L3797K5586J6564P359j119p924j2434
63341A129897j4483j4377j2957j1514j1267j2693j5421j8828k2644k6901l1348
63330I37464l5168l7422l7721l6409l4166l1558k8827k5878k2375j8030j3007
63319F16903p971l648m57J206N14l296r644j6239k0520k1632k0664j9195j7971
63306D77386j6928j5765j4133j1750q839o258m765m293m196m053l834l490k916
63293C76166k287k028k331k928l400l511l302l085l238l727l952l378k211j146
$$ plain form
63279 335642 335046 334558 333898 332985 332068 331482 331097 330449 329626 329433 330252 331358 331996 332588 334007 336050 337723
63262 337723 338898 340529 343070 345751 347888 349960 352791 356428 360453 364796 369467 374019 378122 382388
63248 382388 387797 394392 401307 408074 415228 423477 432963 443579 455485 468882 483659 499714 517483
63235 517483 537700 560558 585365 611162 637605 665119 694198 724658 755614 786052 815291
63224 815291 843090 869708 895938 922702 950302 978229 1005885 1033337 1061174 1089801 1119072
63213 1119072 1148288 1176092 1200504 1219608 1232421 1238838 1238757 1231654 1217197 1195887 1168851 1137217
63201 1137217 1101965 1064154 1024934 985322 946263 908896 874411 843468 815938 791433 769956
63190 769956 751884 737395 726275 718442 714390 714789 719576 727606 737299 747627 758522 770548 784265
$$ packed form
63279C35642n96m88o60r13r17n86l85o48q23j93Q19J106O38N92J419K043J673
63262C37723J175J631K541K681K137K072K831L637M025M343M671M552M103M266
63248C82388N409O595O915O767P154Q249R486J0616J1906J3397J4777J6055J7769
63235E17483K0217K2858K4807K5797K6443K7514K9079L0460L0956L0438K9239
63224H15291K7799K6618K6230K6764K7600K7927K7656K7452K7837K8627K9271
63213A119072K9216K7804K4412J9104J2813O417q1p103j4457k1310k7036l1634
63201A137217l5252l7811l9220l9612l9059l7367l4485l0943k7530k4505k1477
63190G69956j8072j4489j1120p833m052L99M787Q030R693J0328J0895J2026J3717
$$ plain form
63177 784265 799779 816675 834206 851541 867986 883260 897741 912210 927032 941582 954739
63166 954739 965955 975463 983355 988797 990442 987338 979145 965778 947375 924653 898850 871153 842377
63153 842377 813207 784413 756626 730027 704420 679567 655538 632918 612683 595551 581333
63142 581333 569087 558038 548133 539559 532080 525194 518791 513266 508898 505454 502544 500186 498810 498734
63128 498734 499748 501248 502812 504622 507270 511156 516151 521861 527984 534278 540377 545980 551144 556105
63114 556105 560834 565092 568953 572882 577091 581093 584215 586396 588249 590409 592964 595466 597303 598132
63100 598132 598123 597801 597593 597607 597797 598085 598272 598114 597741 597704 598345 599367 600301 601085 601826 602240 601952 601297 601235 602381
63080 602381 604538 607226 610186 613327 616742 620923 626454 633190 640227 646985 653913 661802 670812 680653
$$ packed form
63177G84265J5514J6896J7531J7335J6445J5274J4481J4469J4822J4550J3157
63166I54739J1216R508P892N442J645l104q193j3367j8403k2722k5803k7697k8776
63153H42377k9170k8794k7787k6599k5607k4853k4029k2620k0235j7132j4218
63142E81333j2246j1049r905q574p479o886o403n525m368l444k910k358j376p6
63128D98734J014J500J564J810K648L886M995N710O123O294O099N603N164M961
63114E56105M729M258L861L929M209M002L122K181J853K160K555K502J837Q29
63100E98132rl22k08J4J90K88J87j58l73l7O41J022R34P84P41M14k88o55o2J146
63080F02381K157K688K960L141L415M181N531O736P037O758O928P889R010R841
$$ plain form
63066 680653 691396 703633 717901 734273 752443 772041 793076 816269 842673 872711 905900
63055 905900 941784 980792 1023801 1071200 1122891 1178946 1239617 1304681 1373165 1443688 1514782
63044 1514782 1585163 1654215 1722174 1789446 1855829 1920840 1984671 2048246 2112298 2176886 2241850
63033 2241850 2307171 2372597 2437145 2499047 2555958 2605247 2644484 2671814 2685759 2684867 2667969 2634734
63021 2634734 2585669 2521773 2444841 2358013 2265250 2169868 2073950 1979248 1888033 1802657 1724626
63010 1724626 1654409 1591924 1536987 1489608 1450151 1419103 1396559 1382079 1374967 1374408 1379349 1388697
62998 1388697 1401766 1418133 1437082 1457682 1479537 1502904 1527844 1553820 1580394 1607697 1635736
62987 1635736 1663663 1690303 1715102 1738050 1758743 1775995 1788276 1794294 1793215 1784569 1767901 1742560
$$ packed form
63066F80653J0743J2237J4268J6372J8170J9598K1035K3193K6404L0038L3189
63055I05900L5884L9008M3009M7399N1691N6055O0671O5064O8484P0523P1094
63044A514782P0381O9052O7959O7272O6383O5011O3831O3575O4052O4588O4964
63033B241850O5321O5426O4548O1902N6911M9289L9237K7330J3945q92j6898l3235
63021B634734m9065o3896p6932q6828r2763r5382r5918r4702r1215q5376p8031
63010A724626p0217o2485n4937m7379l9457l1048k2544j4480p112n59M941R348
62998A388697J3069J6367J8949K0600K1855K3367K4940K5976K6574K7303K8039
62987A635736K7927K6640K4799K2948K0693J7252J2281O018j079q646j6668k5341
$$ plain form
62975 1742560 1708186 1665567 1616681 1563649 1507921 1450555 1392781 1335897 1280970 1228866 1180225
62964 1180225 1135069 1092906 1053574 1017488 984700 954334 925611 898944 875225 854299 834952
62953 834952 816257 798128 780609 763440 746469 729838 713530 697261 680980 665093 650001
62942 650001 635735 622093 608770 595480 582398 570455 560601 552722 545814 539278 533401 528361 523550
62929 523550 518421 513582 510345 509238 509316 509011 507467 505101 503030 502041 502116 502804 503688 504305 504009 502494 500318
62912 500318 498319 496490 493977 490330 486182 482482 479552 477124 474849 472428 469636 466619 463894 461788
62898 461788 460099 458526 457106 455974 455146 454866 455730 457909 460486 462135 462377 461737 460842 459863 458824 457941
62882 457941 457552 457953 459276 461166 462623 462725 461649 460618 460589 461286 461662 461035 459542 457740 456142 455061
$$ packed form
62975A742560l4374m2619m8886n3032n5728n7366n7774n6884n4927n2104m8641
62964A180225m5156m2163l9332l6086l2788l0366k8723k6667k3719k0926j9347
62953H34952j8695j8129j7519j7169j6971j6631j6308j6269j6281j5887j5092
62942F50001j4266j3642j3323j3290j3082j1943r854p879o908o536n877n040m811
62929E23550n129m839l237j107P8l05j544k366k071r89P5O88Q84O17k96j515k176
62912E00318j999j829k513l647m148l700k930k428k275k421k792l017k725k106
62898D61788j689j573j420j132q28k80Q64K179K577J649K42o40q95r79j039q83
62882D57941l89M01J323J890J457J02j076j031k9O97L76o27j493j802j598j081
$$ plain form
62866 455061 454570 454461 454353 453938 453160 452128 450932 449607 448291 447326 446997 447198 447545 447934 448745 450297 452282
62849 452282 454056 455437 456883 458878 461400 463983 465991 466745 465786 463325 460308 457819 456380 455815 455579
62834 455579 455082 453960 452291 450564 449279 448654 448744 449633 451294 453422 455633 457735 459676 461414 463178
62819 463178 465644 469348 473918 478323 482064 485683 489933 494836 499878 504750 509439 513836 517934 522431
62805 522431 528509 536628 545896 555023 563741 572877 583137 594359 606166 618839 632947 648252 663683
62792 663683 678775 694672 713212 735238 760332 788123 819203 854619 895107 941209 993635
62781 993635 1053003 1119521 1193374 1275183 1365512 1464044 1569716 1681518 1798477 1918806 2039669
62770 2039669 2157995 2270998 2375704 2468559 2546093 2605786 2646048 2665714 2664175 2641973 2600858
$$ packed form
62866D55061m91j09j08m15p78j032j196j325j316r65l29K01L47L89Q11J552J985
62849D52282J774J381J446J995K522K583K008P54r59k461l017k489j439n65k36
62834D55579m97j122j669j727j285o25R0Q89J661K128K211K102J941J738J764
62819D63178K466L704M570M405L741L619M250M903N042M872M689M397M098M497
62805E22431O078Q119R268R127Q718R136J0260J1222J1807J2673J4108J5305J5431
62792F63683J5092J5897J8540K2026K5094K7791L1080L5416M0488M6102N2426
62781I93635N9368O6518P3853Q1809R0329R8532J05672J11802J16959J20329J20863
62770B039669J18326J13003J04706R2855P7534N9693M0262J9666j539k2202m1115
$$ plain form
62759 2600858 2543106 2470934 2386521 2292299 2190979 2085274 1977560 1869800 1763695 1660798
62749 1660798 1562324 1468875 1380593 1297624 1220269 1148681 1082713 1022259 967497 918573 875127
62738 875127 836333 801390 769821 741329 715533 692012 670660 651919 636378 623868 613140
62727 613140 602794 592573 583424 576272 571099 567311 564512 562653 561746 561773 562686 564251 566135 568461 572019
62712 572019 577588 585141 594053 604023 615502 629303 646061 666036 689216 715536 745250 779017
62700 779017 817438 860390 906999 956387 1008512 1064224 1124403 1188878 1256234 1324731 1393211
62689 1393211 1460862 1526288 1587259 1641352 1686382 1720275 1741307 1748839 1743314 1725253 1694849 1652987
62677 1652987 1602004 1544690 1482845 1417401 1349589 1281184 1213717 1148111 1085083 1025297 969128
$$ packed form
62759B600858n7752p2172q4413r4222j01320j05705j07714j07760j06105j02897
62749A660798r8474r3449q8282q2969p7355p1588o5968o0454n4762m8924m3446
62738H75127l8794l4943l1569k8492k5796k3521k1352j8741j5541j2510j0728
62727F13140j0346j0221r149p152n173l788k799j859r07K7R13J565J884K326L558
62712E72019N569P553Q912R970J1479J3801J6758J9975K3180K6320K9714L3767
62700G79017L8421M2952M6609M9388N2125N5712O0179O4475O7356O8497O8480
62689A393211O7651O5426O0971N4093M5030L3893K1032P532n525j8061l0404m1862
62677A652987n0983n7314o1845o5444o7812o8405o7467o5606o3028n9786n6169
$$ plain form
62666 969128 916835 868969 826061 787891 753559 722287 693708 667452 643096 620618 600339
62655 600339 582334 566373 552498 540987 531609 523474 515856 508579 501361 493475 484507 475047 466128
62642 466128 458320 451702 446369 442491 440068 438947 438862 439218 439261 438900 439023 440406 442444 443554 442848 440958
62626 440958 439098 437789 436737 435617 434574 433984 433978 434378 434999 435928 437453 439844 443258 447778 453348 459724
62610 459724 466644 474094 482232 491074 500467 510401 521067 532521 544552 557163 571110 587782 608460
62597 608460 633671 663157 696429 733420 774561 820199 870025 923261 979263 1037555 1097105
62586 1097105 1155837 1211164 1261004 1304176 1339808 1366554 1382583 1386514 1378393 1359643 1332035 1296911
62574 1296911 1255399 1209007 1159557 1108611 1057234 1006199 956182 907792 861674 818486 778567
$$ packed form
62666I69128n2293m7866m2908l8170l4332l1272k8579k6256k4356k2478k0279
62655F00339j8005j5961j3875j1511r378q135p618p277p218p886q968r460q919
62642D66128p808o618n333l878k423j121q5L56M3l61J23J383K038J110p06j890
62626D40958j860j309j052j120j043n90oM00O21R29J525K391L414M520N570O376
62610D59724O920P450Q138Q842R393R934J0666J1454J2031J2611J3947J6672K0678
62597F08460K5211K9486L3272L6991M1141M5638M9826N3236N6002N8292N9550
62586A097105N8732N5327M9840M3172L5632K6746J6029L931q121j8750k7608l5124
62574A296911m1512m6392m9450n0946n1377n1035n0017m8390m6118m3188l9919
$$ plain form
62563 778567 741762 707840 676934 649304 624824 603052 583650 566442 551247 538012 526866
62552 526866 517605 509435 501760 494882 489268 484422 479410 474297 470063 467042 464537 462215 460696 460306
62538 460306 460301 460031 459984 460826 462070 462552 461743 459884 457361 454834 453523 454415 457282 461186 465762 471356 478226
62521 478226 486440 496402 508681 523323 540054 559074 580940 605705 632986 662931 696325 733458
62509 733458 773553 815520 858627 902056 944356 983855 1019416 1050533 1076915 1098130 1113468
62498 1113468 1122094 1123619 1118617 1108363 1094142 1077188 1059186 1042105 1027234 1014888 1005381 999863
62486 999863 999753 1005649 1017270 1034351 1057189 1086350 1122116 1164177 1211512 1262416 1314783 1366516
62474 1366516 1415658 1460157 1497697 1526084 1544036 1551539 1549198 1537136 1514720 1481422 1437707 1385006
$$ packed form
62563G78567l6805l3922l0906k7630k4480k1772j9402j7208j5195j3235j1146
62552E26866r261q170p675o878n614m846n012n113m234l021k505k322j519l90
62538D60306nk70m7Q42J244M82q09j859k523k527j311Q92K867L904M576N594O870
62521D78226Q214R962J2279J4642J6731J9020K1866K4765K7281K9945L3394L7133
62509G33458M0095M1967M3107M3429M2300L9499L5561L1117K6382K1215J5338
62498A113468Q626J525n002j0254j4221j6954j8002j7081j4871j2346r507n518
62486I99863j10N896J1621J7081K2838K9161L5766M2061M7335N0904N2367N1733
62474A366516M9142M4499L7540K8387J7952P503k341j2062k2416l3298m3715n2701
$$ plain form
62462 1385006 1325246 1260757 1194231 1128049 1063539 1001189 941514 885374 833560 786624 745155
62451 745155 709666 679999 655185 634166 616420 601795 590089 580975 574086 569014 565478 563605
62439 563605 563696 565548 568306 571206 574172 577466 580987 584226 586677 587966 587665 585368 581021 575066 568172
62424 568172 560818 553010 544407 534896 525051 515764 507315 499095 490447 481481 472854 464985 457825 451252
62410 451252 445285 439950 435193 431026 427531 424743 422593 420919 419297 417068 413924 410533 408199 407714
62396 407714 408717 410394 412532 415555 419621 424044 427778 430263 431702 432720 433994 436017 438860 442108
62382 442108 445308 448617 452780 458297 464806 471542 478257 485351 493130 501332 509612 518240 528007 539473
62368 539473 552439 566245 580453 595202 611023 628508 648251 670911 697062 726972 760772
$$ packed form
62462A385006n9760o4489o6526o6182o4510o2350n9675n6140n1814m6936m1469
62451G45155l5489k9667k4814k1019j7746j4625j1706r114o889n072l536j873
62439E63605R1J852K758K900K966L294L521L239K451J289l01k297m347n955o894
62424E68172p354p808q603r511r845r287q449q220q648q966q627p869p160o573
62410D51252n967n335m757m167l495k788k150j674j622k229l144l391k334m85
62396D07714J003J677K138L023M066M423L734K485J439J018J274K023K843L248
62382D42108L200L309M163N517O509O736O715P094P779Q202Q280Q628R767J1466
62368E39473J2966J3806J4208J4749J5821J7485J9743K2660K6151K9910L3800
$$ plain form
62357 760772 798923 842284 891560 946798 1007413 1072345 1139917 1207796 1273453 1334559 1388731
62346 1388731 1433347 1466397 1487665 1498616 1500924 1495396 1482336 1462336 1436232 1404559 1367511 1325422
62334 1325422 1279195 1230442 1181405 1134513 1091523 1052917 1018130 986360 957210 930740 907083
62323 907083 885923 866346 847363 828597 810167 791807 772524 751524 729223 706959 685736
62312 685736 665567 645923 626475 607407 589354 573106 559085 547011 536278 526667 518472 511954
62300 511954 506921 502907 499502 496433 493636 491369 489994 489503 489449 489479 489696 490392 491677 493565 496146 499413
62284 499413 503192 507466 512543 518528 524899 531061 537148 543742 550887 557983 564781 571901 580117 589593
62270 589593 600150 611810 624647 638440 652996 668752 686685 707676 732133 760014 790949
$$ packed form
62357G60772L8151M3361M9276N5238O0615O4932O7572O7879O5657O1106N4172
62346A388731M4616L3050K1268J0951K308n528j3060k0000k6104l1673l7048m2089
62334A325422m6227m8753m9037m6892m2990l8606l4787l1770k9150k6470k3657
62323I07083k1160j9577j8983j8766j8430j8360j9283k1000k2301k2264k1223
62312F85736k0169j9644j9448j9068j8053j6248j4021j2074j0733r611q195o518
62300E11954n033m014l405l069k797k267j375m91n4L0K17O96J285J888K581L267
62284D99413L779M274N077N985O371O162O087O594P145P096O798P120Q216R476
62270E89593J0557J1660J2837J3793J4556J5756J7933K0991K4457K7881L0935
$$ plain form
62259 790949 824575 861153 901680 947050 997360 1052449 1112688 1178355 1248121 1318865 1387171
62248 1387171 1450436 1506450 1552920 1588206 1612164 1625644 1629350 1623709 1609469 1587583 1558309 1521092
62236 1521092 1475718 1423303 1365841 1304927 1241341 1175950 1110678 1048182 990449 937963 890328
62225 890328 847382 809323 775995 746698 720865 698430 679279 662708 647709 633591 620167
62214 620167 607609 596304 586569 578250 570797 563878 557609 552117 547350 543529 541228 540530 540597 540651 541019
62199 541019 542586 545422 548661 551668 554739 558641 563945 570777 578746 587143 595650 604781 615119 626282
62185 626282 637301 648027 659419 672204 685872 699281 711722 723063 733315 742532 750824 758151
62173 758151 764357 769658 774885 781074 789090 799910 814839 835091 861250 893347 931162 974084
$$ packed form
62259G90949L3626L6578M0527M5370N0310N5089O0239O5667O9766P0744O8306
62248A387171O3265N6014M6470L5286K3958J3480L706n641j4240k1886k9274l7217
62236A521092m5374n2415n7462o0914o3586o5391o5272o2496n7733n2486m7635
62225H90328m2946l8059l3328k9297k5833k2435j9151j6571j4999j4118j3424
62214F20167j2558j1305r735q319p453o919o269n492m767l821k301o98O7N4L68
62199E41019J567K836L239L007L071L902N304O832P969Q397Q507R131J0338J1163
62185F26282J1019J0726J1392J2785J3668J3409J2441J1341J0252R217Q292P327
62173G58151O206N301N227O189Q016J0820J4929K0252K6159L2097L7815M2922
$$ plain form
62161 974084 1020851 1069852 1119655 1169001 1216202 1258795 1293988 1319697 1335470 1342570 1343011 1338326
62149 1338326 1329099 1315353 1296994 1273962 1246430 1215082 1180952 1144893 1107548 1069893 1033383
62138 1033383 999339 968529 941509 918875 900725 886225 874251 864319 856507 850641 846069 842218
62126 842218 838956 836328 834283 832730 831605 830793 830304 830664 832929 838028 846034 855990 866370 875663 882675
62111 882675 886500 886558 882955 876803 869823 863363 857791 852834 848191 843499 837952 830486 820558 808673
62097 808673 796182 784664 775391 768986 765377 764095 764632 766507 769147 772023 774993 778312 782229 786679
62083 786679 791482 796660 802397 808800 815915 823949 833240 843924 855842 868978 883843 901099 920757
62070 920757 941993 963862 985999 1008430 1031034 1053683 1076984 1102392 1131187 1163414 1198019
$$ packed form
62161I74084M6767M9001M9803M9346M7201M2593L5193K5709J5773P100M41m685
62149A338326r227j3746j8359k3032k7532l1348l4130l6059l7345l7655l6510
62138A033383l4044l0810k7020k2634j8150j4500j1974r932p812n866m572l851
62126H42218l262k628k045j553j125q12m89L60K265N099Q006R956J0380R293P012
62111H82675L825N8l603o152o980o460n572m957m643m692n547p466r928j1885
62097H08673j2491j1518r273o405l609j282N37J875K640K876K970L319L917M450
62083G86679M803N178N737O403P115Q034R291J0684J1918J3136J4865J7256J9658
62070I20757K1236K1869K2137K2431K2604K2649K3301K5408K8795L2227L4605
$$ plain form
62059 1198019 1233829 1269963 1305162 1337165 1363412 1382549 1394961 1401650 1402915 1398484 1388569 1373983
62047 1373983 1355090 1331324 1302184 1268225 1230517 1189511 1145191 1098288 1050663 1004261 960038
62036 960038 918020 878033 840205 805008 772944 744038 717697 693273 670701 650271 631885
62025 631885 615013 599422 585482 573619 563837 555797 548930 542290 534868 526466 517933 510230 503473
62012 503473 497139 490926 485045 479911 475859 473068 471489 470925 471374 473108 476241 480417 485194 490549 496711
61997 496711 503540 510342 516338 521212 525233 528927 532557 535869 538361 539695 539637 537703 533328 526530 518154
61982 518154 509255 500421 491779 483319 475021 466866 458884 451080 443386 435991 429634 425013 421831 419027
61968 419027 416177 413933 412723 411708 409736 406803 403818 401293 399121 397425 396669 396822 397225 397626 398702
$$ packed form
62059A198019L5810L6134L5199L2003K6247J9137J2412O689J265m431r915j4586
62047A373983j8893k3766k9140l3959l7708m1006m4320m6903m7625m6402m4223
62036I60038m2018l9987l7828l5197l2064k8906k6341k4424k2572k0430j8386
62025F31885j6872j5591j3940j1863r782q040o867o640p422q402q533p703o757
62012E03473o334o213n881n134m052k791j579n64M49J734L133M176M777N355O162
61997D96711O829O802N996M874M021L694L630L312K492J334n8j934m375o798q376
61982E18154q899q834q642q460q298q155p982p804p694p395o357m621l182k804
61968D19027k850k244j210j015j972k933k985k525k172j696p56J53M03M01J076
$$ plain form
61953 398702 401121 404478 407557 409522 410628 411902 414290 418045 422832 428392 434979 442978 452284 462366
61939 462366 472935 484184 496283 508991 521949 535141 548788 562820 576683 589795 602114
61928 602114 614016 625523 635900 644343 650950 656509 661252 664356 664944 663142 659762 655354 650073 644239
61914 644239 638530 633714 630597 629976 632164 636625 642549 649716 658426 668784 680558 693536 707332
61901 707332 720823 732433 741161 746847 749451 748719 744764 738313 729980 719808 707902 695059 682287
61888 682287 670003 658202 647169 637500 629422 622493 616008 609514 602916 596247 589293 581442 572103
61875 572103 561449 550494 540196 530625 521306 512183 503838 496786 490953 486010 481971 479236 478189
61862 478189 478936 481362 485265 490441 496734 504109 512653 522440 533402 545465 558839 574072 591633
$$ packed form
61953C98702K419L357L079J965J106J274K388L755M787N560O587P999R306J0082
61939D62366J0569J1249J2099J2708J2958J3192J3647J4032J3863J3112J2319
61928F02114J1902J1507J0377Q443O607N559M743L104N88j802l380m408n281n834
61914F44239n709m816l117o21K188M461N924P167Q710J0358J1774J2978J3796
61901G07332J3491J1610Q728N686K604p32l955o451q333j0172j1906j2843j2772
61888F82287j2284j1801j1033r669q078o929o485o494o598o669o954p851r339
61875E72103j0654j0955j0298r571r319r123q345p052n833m943m039k735j047
61862D78189P47K426L903N176O293P375Q544R787J0962J2063J3374J5233J7561
$$ plain form
61849 591633 611439 632968 655876 680290 706268 733129 759589 784592 807669 828345 845571
61838 845571 858173 865815 869051 868366 863629 854850 843161 830607 818979 809148 801400 796012 793377
61825 793377 793848 797621 804644 814608 827041 841166 855522 868042 877017 881856 882508 878475 869167 855103
61811 855103 837811 818346 796807 773630 750349 728391 707897 688530 670705 655035 641054
61800 641054 627597 614253 601467 589366 577582 566221 555969 546973 538569 530451 523287 517715
61788 517715 513433 509767 506535 503853 501569 499456 497561 495903 494164 492150 490267 489072 488564 488338 488173
61773 488173 488015 487597 486604 485166 483685 482225 480556 478867 477917 478255 479611 481303 482983 484723 486590
61758 486590 488575 490888 493939 497782 501836 505401 508341 511001 513556 515716 517110 517622 517265 516026 514014
$$ packed form
61849E91633J9806K1529K2908K4414K5978K6861K6460K5003K3077K0676J7226
61838H45571J2602P642L236o85m737q779j1689j2554j1628r831p748n388k635
61825G93377M71L773P023R964J2433J4125J4356J2520Q975M839O52m033r308j4064
61811H55103j7292j9465k1539k3177k3281k1958k0494j9367j7825j5670j3981
61800F41054j3457j3344j2786j2101j1784j1361j0252q996q404q118p164n572
61788E17715m282l666l232k682k284k113j895j658j739k014j883j195n08k26j65
61773D88173j58m18r93j438j481j460j669j689r50L38J356J692J680J740J867
61758D86590J985K313L051L843M054L565K940K660K555K160J394N12l57j239k012
$$ plain form
61743 514014 511523 508752 505658 502287 499017 496211 493798 491410 488830 486177 483894 482642 482805 483842
61729 483842 484594 484669 485066 486836 489516 491655 492657 493246 494140 495207 496152 497217 498801 500992 503856 507552
61713 507552 511722 515280 517339 518058 518077 517507 516021 513720 511288 509232 507393 505271 502562 499314 495802
61698 495802 492348 489165 486307 483692 481119 478260 474909 471270 467813 464677 461419 457555 453257 449276
61684 449276 446164 443692 441098 437855 434151 430590 427539 424973 422895 421498 420676 419739 418077 415959 414230
61669 414230 413286 412716 411929 410753 409444 408526 408547 409562 410828 411456 411371 411242 411481 411913 412481 413647 415805
61652 415805 418750 421982 425127 427837 429714 430718 431354 432231 433613 435473 437638 439738 441354 442442 443266
61637 443266 443883 444098 444051 444248 444778 444977 444212 442614 440788 439186 437972 437043 435891 433884 430966 427664
$$ packed form
61743E14014k491k771l094l371l270k806k413k388k580k653k283j252J63J037
61729D83842P52P5L97J770K680K139J002N89Q94J067R45J065J584K191K864L696
61713E07552M170L558K059P19J9n70j486k301k432k056j839k122k709l248l512
61698D95802l454l183k858k615k573k859l351l639l457l136l258l864m298l981
61684D49276l112k472k594l243l704l561l051k566k078j397q22r37j662k118j729
61669D14230r44n70p87j176j309r18K1J015J266O28q5j29K39M32N68J166K158
61652D15805K945L232L145K710J877J004O36Q77J382J860K165K100J616J088Q24
61637D43266O17K15m7J97N30J99p65j598j826j602j214r29j152k007k918l302
$$ plain form
61621 427664 424211 420301 416038 412406 410171 408879 407568 406006 404483 402817 400477 397554 394785 392530
61607 392530 390357 387704 384406 380504 376057 371330 366812 362876 359578 356742 354077 351287 348333 345485
61593 345485 342958 340629 338311 336064 333973 331873 329599 327320 325304 323564 321992 320591 319303 317920
61579 317920 316484 315401 314795 314160 313160 312349 312455 313177 313334 312114 309712 306932 304704 303733 303953 304416
61563 304416 304269 303707 303471 303695 304008 304506 305755 307825 310150 312430 314870 317408 319535 321099 322529 324047
61547 324047 325360 326398 327551 328822 329511 329260 328727 328626 328741 328571 328475 329373 331525 334321 337168 339936
61531 339936 342543 344692 346174 347099 347678 348008 348118 348007 347559 346602 345072 343061 340729 338278 335991 334157
61515 334157 332940 332318 332092 331997 331942 332109 332700 333575 334261 334312 333562 332156 330551 329355 328789 328393 327588 326490
$$ packed form
61621D27664l453l910m263l632k235j292j311j562j523j666k340k923k769k255
61607C92530k173k653l298l902m447m727m518l936l298k836k665k790k954k848
61593C45485k527k329k318k247k091k100k274k279k016j740j572j401j288j383
61579C17920j436j083o06o35j000q11J06P22J57j220k402k780k228r71K20M63
61563C04416j47n62k36K24L13M98J249K070K325K280K440K538K127J564J430J518
61547C24047J313J038J153J271O89k51n33j01J15j70r6Q98K152K796K847K768
61531C39936K607K149J482R25N79L30J10j11m48r57j530k011k332k451k287j834
61515C34157j217o22k26r5n5J67N91Q75O86N1p50j406j605j196n66l96q05j098
$$ plain form
61497 326490 325757 325643 325672 325373 324803 324223 323778 323792 324793 326761 328766 329896 330307 330878 332034 333461 334873
61480 334873 336485 338536 340787 342700 344007 344932 345928 347181 348412 349263 349873 350786 352150 353307 353524 352906
61464 352906 352223 351929 351755 351306 350649 350183 350177 350602 351266 351946 352439 352595 352350 351796 351278 351287 352092 353475 354911
61445 354911 356010 356742 357351 358166 359355 360732 361915 362859 364084 366100 368708 371114 372737 373625 374115 374453
61429 374453 374806 375341 376135 377154 378384 379698 380553 380271 378947 377772 378026 379826 382219 384373 386246 388033
61413 388033 389506 390260 390374 390463 390968 391620 391704 390810 389184 387275 385068 382223 378952 376352 375434 376010 376977
61396 376977 377583 377789 377470 376111 373737 371426 370246 370073 370110 370163 370596 371274 371562 371455 371832 373171 374721
61379 374721 375439 375332 375451 376872 379935 384103 388234 391327 393358 395145 397242 399399 401314 403264 405463
$$ packed form
61497C26490p33j14K9k99n70n80m45J4J001J968K005J130M11N71J156J427J412
61480C34873J612K051K251J913J307R25R96J253J231Q51O10R13J364J157K17o18
61464C52906o83k94j74m49o57m66oM25O64O80M93J56k45n54n18RQ05J383J436
61445C54911J099P32O09Q15J189J377J183R44J225K016K608K406J623Q88M90L38
61429C74453L53N35P94J019J230J314Q55k82j324j175K54J800K393K154J873J787
61413C88033J473P54J14Q9N05O52Q4q94j626j909k207k845l271k600r18N76R67
61396C76977O06K06l19j359k374k311j180j73L7N3M33O78K88j07L77J339J550
61379C74721P18j07J19J421L063M168M131L093K031J787K097K157J915J950K199
$$ plain form
61364 405463 407295 407908 407357 406586 406474 407452 409795 413483 417781 421655 424804 427869 431560 436106 441593
61349 441593 448212 455880 464061 472246 480282 488019 494967 500626 504942 508214 510728 512683 514356 516115
61335 516115 518269 520877 523620 525905 527287 527710 527221 525642 522916 519583 516363 513266 509679 505481 501468
61320 501468 498399 496154 494251 492758 492134 492399 493051 493795 494946 497058 500525 505528 512082 520028 529193
61305 529193 539663 551726 565426 580233 595177 609185 621284 630647 636709 639398 639268 637264 634177
61292 634177 630310 625691 620454 614801 608668 601785 594179 586349 578766 571410 564058 556833 550187 544462
61278 544462 539793 536410 534672 534654 535946 538033 540700 543909 547488 551224 555095 559006 562310 564102 564327
61263 564327 564288 565638 568950 573613 578966 585043 592138 600120 608382 616136 622562 627083 629798 631473 632887
$$ packed form
61364D05463J832O13n51p71j12R78K343L688M298L874L149L065L691M546N487
61349D41593O619P668Q181Q185Q036P737O948N659M316L272K514J955J673J759
61335E16115K154K608K743K285J382M23m89j579k726l333l220l097l587m198m013
61320E01468l069k245j903j493o24K65O52P44J151K112L467N003O554P946R165
61305E29193J0470J2063J3700J4807J4944J4008J2099R363O062K689j30k004l087
61292F34177l867m619n237n653o133o883p606p830p583p356p352p225o646n725
61278E44462m669l383j738j8J292K087K667L209L579L736L871L911L304J792K25
61263E64327l9J350L312M663N353O077P095P982Q262P754O426M521K715J675J414
$$ plain form
61248 632887 634345 635904 637607 639147 639721 638718 636403 633475 630282 626912 623818 621551 619813 617453
61234 617453 613686 608971 604464 600961 598508 596695 595113 593794 593393 594733 597999 602529 607463 612379
61220 612379 617289 622337 627704 633557 639909 646605 653495 660449 667179 673327 678759 683552 687600 690512
61206 690512 692055 692490 692367 692231 692613 694035 696711 700361 704524 709139 714795 722463 732952 746466 762570
61191 762570 780452 799042 816942 832705 845583 855775 863624 868934 871592 872573 873478 874934 876145
61178 876145 876159 874911 872760 869709 865623 860748 855476 849822 843570 836693 829246 821049 811778 801266
61164 801266 789537 776828 763755 751052 738807 726309 713038 699508 686699 674950 663938
61153 663938 653564 644317 636802 631321 627892 626255 625852 626112 626755 627494 627562 625927 622010 615989 608530
$$ packed form
61248F32887J458J559J703J540N74j003k315k928l193l370l094k267j738k360
61234F17453l767m715m507l503k453j813j582j319m01J340L266M530M934M916
61220F12379M910N048N367N853O352O696O890O954O730O148N432M793M048K912
61206F90512J543M35j23j36L82J422K676L650M163M615N656P668J0489J3514J6104
61191G62570J7882J8590J7900J5763J2878J0192P849N310K658R81R05J456J211
61178H76145J4j248k151l051m086m875n272n654o252o877p447q197r271j0512
61164H01266j1729j2709j3073j2703j2245j2498j3271j3530j2809j1749j1012
61153F63938j0374r247p515n481l429j637m03K60O43P39O8j635l917o021p459
$$ plain form
61138 608530 600569 593166 586998 581925 577424 573509 570771 569548 569590 570701 573066 576591 580450 583915 587511
61123 587511 592824 601135 612442 625817 640461 656337 673971 693707 715216 737867 761480 786378
61111 786378 812574 839314 865810 892095 918578 944888 969829 992636 1013710 1033719 1052393
61100 1052393 1068666 1081730 1091446 1097726 1100094 1098043 1091542 1080990 1066953 1050186 1031754 1012730
61088 1012730 993631 974266 954158 933070 911190 889001 867091 845957 825786 806488 788094
61077 788094 771114 756189 743336 731840 721103 711284 702756 695348 688770 683576 680778 680385 681171
61064 681171 682310 684409 688346 693764 699507 705042 710669 716808 723971 733044 744498 757462 770609
61051 770609 783939 798624 815103 832475 850092 868649 889215 912049 936868 963505 991785
$$ packed form
61138F08530p961p403o168n073m501l915k738j223M2J111K365L525L859L465L596
61123E87511N313Q311J1307J3375J4644J5876J7634J9736K1509K2651K3613K4898
61111G86378K6196K6740K6496K6285K6483K6310K4941K2807K1074K0009J8674
61100A052393J6273J3064R716O280K368k051o501j0552j4037j6767j8432j9024
61088A012730j9099j9365k0108k1088k1880k2189k1910k1134k0171j9298j8394
61077G88094j6980j4925j2853j1496j0737r819q528p408o578n194k798l93P86
61064F81171J139K099L937N418N743N535N627O139P163R073J1454J2964J3147
61051G70609J3330J4685J6479J7372J7617J8557K0566K2834K4819K6637K8280
$$ plain form
61040 991785 1021407 1052363 1084887 1118713 1153081 1187754 1223300 1260178 1298451 1338657 1381868
61029 1381868 1428326 1477012 1527110 1578963 1632945 1688387 1744272 1800166 1856021 1912181 1970252
61018 1970252 2032844 2101833 2177940 2262237 2356164 2459281 2569136 2684756 2808622 2944406
61008 2944406 3095646 3268624 3473793 3721908 4021983 4386996 4839572 5409588 6132009
60999 6132009 7054783 8243186 9758345 11617677 13771144 16104428 18443725 20553868
60991 20553868 22172421 23113415 23386079 23217307 22937066 22815841 22977075 23408604 23998053
60982 23998053 24539633 24753064 24373938 23284133 21575084 19485511 17273135 15125496
60974 15125496 13148738 11393906 9875935 8583068 7490234 6572188 5805758 5166270
$$ packed form
61040I91785K9622L0956L2524L3826L4368L4673L5546L6878L8273M0206M3211
61029A381868M6458M8686N0098N1853N3982N5442N5885N5894N5855N6160N8071
61018A970252O2592O8989P6107Q4297R3927J03117J09855J15620J23866J35784
61008B944406J51240J72978K05169K48115L00075L65013M52576N70016P22421
60999F132009R22774J188403J515159J859332K153467K333284K339297K110143
60991B0553868J618553R40994K72664j68772k80241j21225J61234M31529N89449
60982B3998053N41580K13431l79126j089805j709049k089573k212376k147639
60974A5125496j976758j754832j517971j292867j092834r18046p66430o39488
$$ plain form
60966 5166270 4629419 4176581 3794535 3470985 3193785 2953626 2743960 2558561 2391960
60957 2391960 2241777 2107780 1988653 1881899 1786362 1702311 1629128 1565094 1509112 1460291
60947 1460291 1416013 1372850 1329587 1287303 1246491 1206334 1166960 1130086 1096746 1066185 1037401
60936 1037401 1010017 983317 956274 929163 903536 880017 857552 835282 813634 793135 773684
60925 773684 755593 739864 726742 715209 704482 694821 686376 678566 671127 664583 659057 653774 648300
60912 648300 643216 639078 635764 633301 632160 632256 632777 633500 635124 637794 640472 642330 643618 644604 644874 644434
60896 644434 644291 645007 645618 644846 642628 639750 636769 633932 631316 628356 624009 618019 611205 603984 595573
60881 595573 585401 574356 563817 554291 545756 538469 532401 526618 520228 513496 507212 501496 496059
$$ packed form
60966E166270n36851m52838l82046l23550k77200k40159k09666j85399j66601
60957B391960j50183j33997j19127j06754r5537q4051p3183o4034n5982m8821
60947A460291m4278m3163m3263m2284m0812m0157l9374l6874l3340l0561k8784
60936A037401k7384k6700k7043k7111k5627k3519k2465k2270k1648k0499j9451
60925G73684j8091j5729j3122j1533j0727r661q445p810p439o544n526n283n474
60912F48300n084m138l314k463j141R6N21P23J624K670K678J858J288R86K70m40
60896F44434j43P16O11p72k218k878k981k837k616k960m347n990o814p221q411
60881E95573j0172j1045j0539r526q535p287o068n783o390o732o284n716n437
$$ plain form
60868 496059 491111 487057 483660 480372 477301 475155 474413 475064 476939 479773 483171 486871 490769 494432 497100
60853 497100 498501 499231 500011 501076 502570 504848 507909 511088 513760 515904 517734 519363 521117 523330 525442
60838 525442 526092 524588 521547 517661 512762 506796 500844 496279 493419 491690 490479 489212 487343 485097
60824 485097 483633 483622 484200 484034 482884 481345 479696 477913 476237 474756 472770 469490 465108 460420 455715
60809 455715 450768 445594 440407 435170 429917 425191 421461 418469 415755 413352 411161 408297 404076 399296
60795 399296 395477 393064 391409 390215 389797 389927 389586 388117 385846 383398 381202 379755 379508 380167 380776 380847
60779 380847 380941 381882 383787 385973 387519 387894 387390 387004 387664 389611 392670 396732 401551 406418 410597 413958
60763 413958 416809 419385 421870 424497 427026 428529 428405 427313 426363 425656 424445 422525 420526 418847 417225
$$ packed form
60868D96059m948m054l397l288l071k146p42O51J875K834L398L700L898L663K668
60853D97100J401P30P80J065J494K278L061L179K672K144J830J629J754K213K112
60838E25442O50j504l041l886m899n966n952m565k860j729j211j267j869k246
60824D85097j464j1N78j66j150j539j649j783j676j481j986l280m382m688m705
60809D55715m947n174n187n237n253m726l730k992k714k403k191k864m221m780
60795C99296l819k413j655j194m18J30l41j469k271k448k196j447k47O59O09P1
60779C80847R4R41J905K186J546L75n04l86O60J947L059M062M819M867M179L361
60763D13958K851K576K485K627K529J503j24j092r50p07j211j920j999j679j622
$$ plain form
60748 417225 415552 414355 414164 414926 416243 417695 418808 419154 418661 417497 415541 412354 407663 401603 394609
60733 394609 387433 381088 376249 372729 369863 367277 364911 362600 360239 358189 356923 356309 355749 354937 353975
60718 353975 352907 351715 350702 350304 350554 351211 352214 353467 354409 354581 354490 355137 356688 358388 359812 361402
60702 361402 363592 366233 369099 372250 375540 378402 380506 382175 383853 385630 387506 389630 391933 393974
60688 393974 395509 396834 398292 399759 400929 401787 402472 402953 403231 403707 404981 407185 409635 411246 411421 410598
60672 410598 409841 409828 410432 411338 412564 413910 414374 412882 409552 405563 401768 398070 394242 390570 387349 384411
60656 384411 381659 379650 379046 379676 380608 381161 381559 382597 384843 388179 391902 395211 397692 399403 400535
60641 400535 401042 400617 399066 396630 393823 390869 387533 383760 380283 378065 377143 376527 375411 373999 372913
$$ packed form
60748D17225j673j197j91P62J317J452J113L46m93j164j956l187m691o060o994
60733C94609p176o345m839l520k866k586k366k311k361k050j266o14n60q12r62
60718C53975j068j192j013l98K50O57J003J253R42J72r1O47J551J700J424J590
60702C61402K190K641K866L151L290K862K104J669J678J777J876K124K303K041
60688C93974J535J325J458J467J170Q58O85M81K78M76J274K204K450J611J75q23
60672D10598p57j3O04R06J226J346M64j492l330l989l795l698l828l672l221k938
60656C84411k752k009o04O30R32N53L98J038K246L336L723L309K481J711J132
60641D00535N07m25j551k436k807k954l336l773l477k218r22o16j116j412j086
$$ plain form
60626 372913 372348 372110 372041 371977 371736 371562 372154 373792 375824 377458 378622 379537 379978 379740 379443 380018 381515 383130
60608 383130 384312 385175 385947 386688 387526 388463 388974 388426 386958 385408 384406 384053 384386 385481 387066 388631
60592 388631 390034 391511 393144 394828 396698 398921 401049 402215 402144 401483 401051 401192 401914 403124 404613 406137
60576 406137 407617 409067 410544 412471 415629 420303 425818 431562 438108 446550 457065 469023 482235
60563 482235 496885 512229 526553 538709 548670 556320 560818 561658 559432 554887 548129 539487 530475
60550 530475 522929 517434 513308 509984 507810 507481 509171 512443 516865 522542 529913 539090 549810 562231
60536 562231 577302 595784 617133 639779 662166 682985 700961 715319 726219 733765 736926 734614
60524 734614 727711 718719 709226 698995 687704 676146 665098 654369 643846 634439 627061 621539 617368
$$ packed form
60626C72913n65k38o9o4k41j74N92J638K032J634J164R15M41k38k97N75J497J615
60608C83130J182Q63P72P41Q38R37N11n48j468j550j002l53L33J095J585J565
60592C88631J403J477J633J684J870K223K128J166p1o61m32J41P22J210J489J524
60576D06137J480J450J477J927L158M674N515N744O546Q442J0515J1958J3212
60563D82235J4650J5344J4324J2156R961P650M498Q40k226m545o758q642r012
60550E30475p546n495m126l324k174l29J690L272M422N677P371R177J0720J2421
60536E62231J5071J8482K1349K2646K2387K0819J7976J4358J0900P546L161k312
60524G34614o903q992r493j0231j1291j1558j1048j0729j0523r407p378n522m171
$$ plain form
60511 617368 614752 613923 614196 614757 615887 618356 621994 625976 630396 636692 646498 660788 680044 704511
60497 704511 734118 768664 808132 852484 901107 952784 1006101 1059647 1111949 1161536 1206951
60486 1206951 1246447 1277860 1299110 1308838 1306595 1292737 1268278 1234470 1192290 1142687 1087486 1029591
60474 1029591 971949 916584 864697 817091 774052 735244 700215 668793 640811 615948 594154
60463 594154 575728 560534 547593 535930 525431 516368 508458 500978 493567 486395 479703 473583 468039
60450 468039 462931 458045 453475 449597 446409 443361 440214 437591 436085 435270 434280 433066 432317 432221 432050 431096
60434 431096 429446 427695 426287 425381 425011 425127 425495 425675 425241 424128 422740 421507 420430 419295 418242 417612
60418 417612 417301 416903 416628 417342 419367 421905 424094 425992 427956 429708 430815 431696 433261 435680 438228
$$ packed form
60511F17368k616q29K73N61J130K469L638L982M420O296R806J4290J9256K4467
60497G04511K9607L4546L9468M4352M8623N1677N3317N3546N2302M9587M5415
60486A206951L9496L1413K1250R728k243j3858k4459l3808m2180m9603n5201n7895
60474A029591n7642n5365n1887m7606m3039l8808l5029l1422k7982k4863k1794
60463E94154j8426j5194j2941j1663j0499r063p910p480p411p172o692o120n544
60450D68039n108m886m570l878l188l048l147k623j506q15r90j214p49r6j71r54
60434D31096j650j751j408r06l70J16L68J80m34j113j388j233j077j135j053o30
60418D17612l11l98k75P14K025K538K189J898J964J752J107Q81J565K419K548
$$ plain form
60403 438228 440272 441806 443014 443952 444770 445754 446976 448203 449265 450322 451700 453618 456012 458549 460966
60388 460966 463435 466370 469762 473081 475952 478518 480890 482746 483931 485036 486852 489490 492487 495565
60374 495565 498864 502567 506690 511095 515394 519044 521869 524229 526377 528034 529037 530065 532053 535036
60360 535036 538125 540542 542225 543507 544815 546745 549938 554604 560384 566770 573557 580894 589028 597895
60346 597895 606870 614997 621593 626465 629553 630673 629765 627060 622811 617226 610834 604543 598965 594014
60332 594014 589429 585328 581859 578678 575230 571385 567427 563638 560117 556774 553228 549028 544285 539758
60318 539758 536021 532935 530333 528744 528870 530615 533250 536525 541170 548259 558294 570917 585453 601773
60304 601773 620457 641726 664449 686877 708241 728589 746878 760471 767209 767021 760752 748485
$$ packed form
60403D38228K044J534J208R38Q18R84J222J227J062J057J378J918K394K537K417
60388D60966K469K935L392L319K871K566K372J856J185J105J816K638K997L078
60374D95565L299L703M123M405M299L650K825K360K148J657J003J028J988K983
60360E35036L089K417J683J282J308J930L193M666N780O386O787P337Q134Q867
60346E97895Q975Q127O596M872L088J120r08k705m249n585o392o291n578m951
60332E94014m585m101l469l181l448l845l958l789l521l343l546m200m743m527
60318E39758l737l086k602j589J26J745K635L275M645P089J0035J2623J4536J6320
60304F01773J8684K1269K2723K2428K1364K0348J8289J3593O738j88o269j2267
$$ plain form
60292 748485 730270 707757 683711 660089 637695 617420 600488 587312 577135 569011 562475 557181
60280 557181 552703 548870 545664 542766 539786 536890 534449 532092 528892 524681 520431 517089 514608 512335
60266 512335 509792 506822 503468 500002 496781 493903 491248 488857 486944 485544 484492 483718 483156 482426 481117
60251 481117 479456 478271 478127 478802 479703 480529 481420 482608 484028 485288 486138 486921 488153 489651 490624 490800
60235 490800 490794 490967 490696 489491 488206 488229 489833 492145 494518 497032 499747 502264 504112 505051 505108 504887 505560
60218 505560 507873 511356 515174 519464 524980 531687 538649 545320 552005 558989 566060 573048 580107 587260
60204 587260 594266 601066 607862 614816 622150 630250 639030 647442 654456 660321 665908 671024 674519 676096
60190 676096 676839 677668 678298 678031 676677 674316 671038 667266 663540 659600 654472 647895 640881 634496 628817
$$ packed form
60292G48485j8215k2513k4046k3622k2394k0275j6932j3176j0177q124o536n294
60280E57181m478l833l206k898k980k896k441k357l200m211m250l342k481k273
60266E12335k543k970l354l466l221k878k655k391j913j400j052p74n62p30j309
60251D81117j661j185j44O75R01Q26Q91J188J420J260Q50P83J232J498R73J76
60235D90800oJ73k71j205j285K3J604K312K373K514K715K517J848R39N7k21O73
60218E05560K313L483L818M290N516O707O962O671O685O984P071O988P059P153
60204E87260P006O800O796O954P334Q100Q780Q412P014N865N587N116L495J577
60190F76096P43Q29O30k67j354k361l278l772l726l940n128o577p014o385n679
$$ plain form
60175 628817 623467 618453 613985 610063 606653 603708 600741 597088 592939 589340 586803 584683 582419 580516
60161 580516 579631 579402 579075 578799 579429 581231 583471 585192 585899 585613 584783 584080 583985 584504 585376 586324 587071 587527
60143 587527 588142 589687 592390 595584 598474 601009 603856 607867 613723 621706 631477 642204 653027 663355
60129 663355 672853 681445 689164 695685 700253 702616 703715 704716 705617 705669 705006 704738 705374 706340 707338 709034
60113 709034 711870 715197 718227 720949 723483 725374 726269 726494 726198 724663 721346 717000 712800 708794 704130
60098 704130 698482 692414 686558 681216 676621 672866 669683 666865 664771 663809 663619 663391 662895 662631 663114 664551
60082 664551 667125 670859 675094 678683 681025 682692 684813 687884 691140 693040 692460 689437 684678 678489
60068 678489 670617 661116 650744 640236 629700 619069 608662 598919 589981 581972 575306 570193 566073
$$ packed form
60175F28817n350n014m468l922l410k945k967l653m149l599k537k120k264j903
60161E80516q85k29l27k76O30J802K240J721P07k86q30p03r5N19Q72R48P47M56
60143E87527O15J545K703L194K890K535K847M011N856P983R771J0727J0823J0328
60129F63355R498Q592P719O521M568K363J099J001R01N2o63k68O36R66R98J696
60113G09034K836L327L030K722K534J891Q95K25k96j535l317m346m200m006m664
60098G04130n648o068n856n342m595l755l183k818k094r62j90k28m96k64M83J437
60082F64551K574L734M235L589K342J667K121L071L256J900n80l023m759o189
60068F78489p872r501j0372j0508j0536j0631j0407r743q938q009o666n113m120
$$ plain form
60055 566073 562010 557520 552795 548347 544718 542250 540796 539893 539392 539655 540970 543242 546427 550752 556125
60040 556125 561888 567573 573472 579884 586294 591883 596623 601247 606274 611428 615866 618673 619427 618620 617230
60025 617230 615563 612831 608205 601845 594528 586713 578519 570207 562100 554198 546330 538428 530352 521864
60011 521864 513230 505333 498658 492612 486485 480637 475990 472717 470284 468508 467651 467601 467857 468398 469665
59996 469665 471552 473144 473827 474077 474832 476436 478415 480089 481265 482535 484875 488710 493485 498358 503059
59981 503059 507609 511520 513999 514975 515270 515556 515592 514737 512835 510380 508022 506039 504112 501670 498715 496230
59965 496230 495401 496429 498476 500813 503601 507418 512410 518135 523967 529409 534168 538192 541650 544661
59951 544661 547019 548203 547799 545989 543554 541217 539002 536460 533506 530703 528595 527070 525592 523747
$$ packed form
60055E66073m063m490m725m448l629k468j454r03n01K63J315K272L185M325N373
60040E56125N763N685N899O412O410N589M740M624N027N154M438K807P54q07j390
60025F17230j667k732m626o360p317p815q194q312q107p902p868p902q076q488
60011E21864q634p897o675o046o127n848m647l273k433j776q57n0K56N41J267
59996D69665J887J592O83K50P55J604J979J674J176J270K340L835M775M873M701
59981E03059M550L911K479R76K95K86L6q55j902k455k358j983j927k442k955k485
59965D96230q29J028K047K337K788L817M992N725N832N442M759M024L458L011
59951E44661K358J184m04j810k435k337k215k542k954k803k108j525j478j845
$$ plain form
59937 523747 521373 518446 515182 512053 509370 507002 504830 503248 502808 503501 504831 506647 509453 513685 519015
59922 519015 524670 530359 536546 543616 550970 557231 561390 563538 564398 564608 564710 565405 567128 569522 571925
59907 571925 574415 577812 582570 588232 594120 600001 605852 611423 616332 620311 623196 624941 625717 625702 624901
59892 624901 623631 622975 624002 626481 629155 631424 634018 637806 642806 648652 655180 662136 669063 675967
59878 675967 683366 691245 698702 705100 710726 715793 719656 721756 722493 722333 720848 717638 713578 710003 707077
59863 707077 703981 700388 696798 693584 690670 688055 685783 683446 680451 676821 673127 669825 667202 665801
59849 665801 666205 668480 672359 677790 684786 692912 701359 709190 715138 717792 716828 713741 710658 708691 707954
59834 707954 708489 710075 711499 711214 708715 704539 699143 692722 685926 679669 674158 668956 664005 659730 656071
$$ packed form
59937E23747k374k927l264l129k683k368k172j582m40O93J330J816K806M232N330
59922E19015N655N689O187P070P354O261M159K148Q60K10J02O95J723K394K403
59907E71925K490L397M758N662N888N881N851N571M909L979K885J745P76j5q01
59892F24901j270o56J027K479K674K269K594L788N000N846O528O956O927O904
59878F75967P399P879P457O398N626N067L863K100P37j60j485l210m060l575k926
59863G07077l096l593l590l214k914k615k272k337k995l630l694l302k623j401
59849F65801M04K275L879N431O996Q126Q447P831N948K654r64l087l083j967p37
59834G07954N35J586J424k85k499m176n396o421o796o257n511n202m951m275l659
$$ plain form
59819 656071 652305 647951 643065 637581 631126 623740 616169 609294 603683 599553 596557 593705 590219 586416
59805 586416 583162 580622 578267 575922 573927 572375 571065 570145 569829 569487 568024 565406 562860 561318 560520
59790 560520 559941 559705 560066 560689 561027 560993 560911 561101 561734 562714 563583 563835 563378 562410 561034 559451 558282 557964
59772 557964 557981 557436 556310 555468 555472 556192 557522 559656 562553 565916 569725 574064 578454 582262 585748 589785
59756 589785 594542 599516 604950 611910 620627 630002 639367 649584 661531 674486 687032 698954 711223
59743 711223 724411 737945 750821 762400 772529 781259 788457 793623 796343 796927 796145 794287 791091
59730 791091 786749 782292 778546 775225 771527 767231 762839 758945 755770 753019 749944 745862 740758 735133
59716 735133 729300 723258 717157 711225 705229 698792 692419 687368 684185 682105 680288 678841 678141 677887 677540
$$ packed form
59819F56071l766m354m886n484o455p386p571o875n611m130k996k852l486l803
59805E86416l254k540k355k345j995j552j310r20l16l42j463k618k546j542p98
59790E60520n79k36L61O23L38l4q2J90O33R80Q69K52m57r68j376j583j169l18
59772E57964J7n45j126q42MP20J330K134K897L363L809M339M390L808L486M037
59756E89785M757M974N434O960Q717R375R365J0217J1947J2955J2546J1922J2269
59743G11223J3188J3534J2876J1579J0129Q730P198N166K720N84p82j858l196
59730G91091m342m457l746l321l698m296m392l894l175k751l075m082n104n625
59716G35133n833o042o101n932n996o437o373n051l183k080j817j447p00k54l47
$$ plain form
59701 677540 677212 677462 678558 680471 683235 686713 690262 693175 695362 697247 699101 700787 701969 702368 702002
59686 702002 701343 700951 700812 700342 699184 697638 696189 695003 694034 693137 691750 688903 684004 677501 670513 663938
59670 663938 658008 652469 646971 641378 635802 630394 625326 621053 618134 616430 614955 613137 611818 612213
59656 612213 614223 616683 619013 621549 624316 626756 628852 631395 634712 638137 641127 643898 646435 647846
59642 647846 647287 644778 640569 634592 627171 619461 612383 605796 599435 593967 590268 588185 586911 586189 586222
59627 586222 586637 586421 584955 582500 579637 576665 573563 570184 566406 562272 557951 553515 548969 544497 540373
59612 540373 536603 533051 530025 528222 527940 528737 529971 531304 532632 534017 535715 537753 539543 540525 541124
59597 541124 542260 543944 545348 546354 547887 550281 552433 553274 553218 553358 553913 554244 553940 553132 552049 550773
$$ packed form
59701F77540l28K50J096J913K764L478L549K913K187J885J854J686J182L99l66
59686G02002o59l92j39m70j158j546j449j186r69q97j387k847m899o503o988o575
59670F63938n930n539n498n593n576n408n068m273k919j704j475j818j319L95
59656F12213K010K460K330K536K767K440K096K543L317L425K990K771K537J411
59642F47846n59k509m209n977p421p710p078o587o361n468l699k083j274p22L3
59627E86222M15k16j466k455k863k972l102l379l778m134m321m436m546m472m124
59612E40373l770l552l026j803k82P97J234J333J328J385J698K038J790R82N99
59597E41124J136J684J404J006J533K394K152Q41n6J40N55L31l04q08j083j276
$$ plain form
59581 550773 549230 547145 544351 541284 538654 536519 534337 532009 530057 528581 527015 525248 523951 523327
59567 523327 522614 521462 520751 521204 522075 522151 521365 520552 520170 520099 520165 520084 519377 518033 516772 516069 515500 514668 514107
59548 514107 514517 515728 517127 518619 520450 522661 525380 529197 534738 542373 552717 566566 583809 603267
59534 603267 624003 645448 665378 679365 683942 679787 670623 659799 649171 640176 633893 630207 628506
59521 628506 629101 632547 637767 642428 645364 647332 649181 650483 650259 648055 643980 638401 631795 624315 615567
59506 615567 605505 595300 586463 579189 572433 565515 558817 552923 547918 543640 539952 536778 534316 533001
59492 533001 532727 532559 531878 531276 531529 532318 533007 534075 536490 540011 543506 546747 550551 555140 559739 563918
59476 563918 568102 572578 577145 581957 587517 593489 598528 601712 603329 604050 604220 604143 604141 604017 603277 602164
$$ packed form
59581E50773j543k085k794l067k630k135k182k328j952j476j566j767j297o24
59567E23327p13j152p11M53Q71P6p86q13l82p1O6q1p07j344j261p03n69q32n61
59548E14107M10J211J399J492J831K211K719L817N541P635J0344J3849J7243J9458
59534F03267K0736K1445J9930J3987M577m155r164j0824j0628q995o283l686j701
59521F28506N95L446N220M661K936J968J849J302k24k204m075n579o606p480q748
59506F15567j0062j0205q837p274o756o918o698n894n005m278l688l174k462j315
59492E33001k74j68o81o02K53P89O89J068K415L521L495L241L804M589M599M179
59476E63918M184M476M567M812N560N972N039L184J617P21J70p7kj24p40j113
$$ plain form
59460 602164 601655 602253 603571 605289 607646 610789 614580 619377 626093 634986 645038 654941 664158 672771
59446 672771 680899 688557 695537 701108 704282 704508 701807 696354 688576 679562 670619 662310 654520 647367
59432 647367 641261 636108 631337 626805 622931 619856 617291 615324 614637 615775 618844 623911 631007 639825
59418 639825 650222 662903 678731 697504 718444 741744 768391 798422 830502 862984 893624
59407 893624 918078 930928 929759 917408 899464 880606 863970 852214 847164 848796 855876 867143
59395 867143 880548 891703 894944 886893 868691 844701 819445 795657 774263 755394 739216 725956
59383 725956 715481 707226 700690 695803 692774 691786 692746 695056 697675 699879 701909 704484 707761 711233
59369 711233 714522 717568 720126 721857 723046 724419 726011 726987 726892 726364 726242 726669 727554 729304 732484 737150
$$ packed form
59460F02164n09N98J318J718K357L143L791M797O716Q893J0052R903R217Q613
59446F72771Q128P658O980N571L174K26k701n453p778r014q943q309p790p153
59432F47367o106n153m771m532l874l075k565j967o87J138L069N067P096Q818
59418F39825J0397J2681J5828J8773K0940K3300K6647L0031L2080L2482L0640
59407H93624K4454J2850j169j2351j7944j8858j6636j1756n050J632P080J1267
59395H67143J3405J1155L241q051j8202k3990k5256k3788k1394j8869j6178j3260
59383G25956j0475q255o536m887l029r88R60K310K619K204K030K575L277L472
59369G11233L289L046K558J731J189J373J592R76r5n28j22M27Q85J750L180M666
$$ plain form
59353 737150 743004 749910 757881 766840 776748 787734 799891 813152 827526 843105 859662 876582
59341 876582 893310 909611 925327 940201 953928 965932 975149 980593 982261 981021 977557 971921 964069
59328 964069 954233 942695 929793 916202 902589 888902 874671 860085 846108 833424 821952 811451
59316 811451 801817 792665 783508 774620 766854 760288 753908 747032 740185 734059 728498 723224 718836 716279
59302 716279 715843 717411 721312 728144 737955 750183 764117 778679 791743 800274 801610 794797 780963
59289 780963 762602 742360 722225 703556 687377 674179 663693 655366 648999 644528 641434 639095
59277 639095 637703 638185 641156 646487 653826 662919 673460 685283 698588 713307 728439 742880 756789
59264 756789 771075 785540 798626 809132 816995 822182 824045 822366 817947 811622 803608 794383 785126
$$ packed form
59353G37150N854O906P971Q959R908J0986J2157J3261J4374J5579J6557J6920
59341H76582J6728J6301J5716J4874J3727J2004R217N444J668j240l464n636p852
59328I64069r836j1538j2902j3591j3613j3687j4231j4586j3977j2684j1472j0501
59316H11451r634r152r157q888p766o566o380o876o847o126n561n274m388k557
59302G16279m36J568L901O832R811J2228J3934J4562J3064Q531J336o813j3834
59289G80963j8361k0242k0135j8669j6179j3198j0486q327o367m471l094k339
59277F39095j392M82K971N331P339R093J0541J1823J3305J4719J5132J4441J3909
59264G56789J4286J4465J3086J0506P863N187J863j679m419o325q014r225r257
$$ plain form
59251 785126 776539 768102 759300 750837 743873 738712 735031 732792 732113 732627 733764 735446 737977 741482 745815
59236 745815 750683 755632 760329 765064 770383 776051 781026 784746 787644 790096 791637 791609 789810 786130 780406
59221 780406 773124 765331 757314 748288 738045 727895 719136 711490 704025 696790 690412 684653 678601 672016
59207 672016 665512 659581 654288 649742 646025 642797 639653 636795 634781 633773 633506 633758 634323 634742 634646 634201
59191 634201 633912 634183 635307 637475 640465 643796 647511 652269 658269 664682 670653 676271 682018 687849 693469
59176 693469 698985 704598 710066 715113 720015 725186 730506 735584 740326 744837 749218 753906 759617 766386
59162 766386 773109 778592 782508 784873 785329 783705 780644 776779 771767 764940 756527 747329 737551 726771
59148 726771 714927 702602 690531 679339 669494 660913 652927 645171 638062 631865 625877 619327 612636
$$ packed form
59251G85126q587q437q802q463o964n161l681k239o79N14J137J682K531L505M333
59236G45815M868M949M697M735N319N668M975L720K898K452J541k8j799l680n724
59221G80406p282p793q017r026j0243j0150q759p646p465p235o378n759o052o585
59207F72016o504n931n293m546l717l228l144k858k014j008k67K52N65M19r6m45
59191F34201k89K71J124K168K990L331L715M758O000O413N971N618N747N831N620
59176F93469N516N613N468N047M902N171N320N078M742M511M381M688N711O769
59162G66386O723N483L916K365M56j624l061l865n012o827q413r198r778j0780
59148G26771j1844j2325j2071j1192r845q581p986p756p109o197n988o550o691
$$ plain form
59135 612636 606874 602306 598367 594834 592011 589831 587741 585694 584541 585159 587560 590998 594677 598393
59121 598393 602678 608261 615177 622691 630237 638035 646536 655735 665384 675400 685598 695392 704223 712017
59107 712017 718969 725329 731612 738413 745616 752287 757715 761998 765301 767344 768121 768291 768249 767487 765598
59092 765598 763221 761190 759358 757107 754595 752692 751983 752392 753389 754053 753424 751276 748070 743765 737529
59077 737529 729172 719954 711202 702961 694835 687224 680686 674821 668917 663121 657878 652840 647452 642131
59063 642131 637721 634148 630701 627198 623803 620160 615899 611703 608637 606619 604682 602545 600774 599486
59049 599486 598043 596130 594191 592704 591802 591596 592137 593072 593919 594569 594937 594539 593110 591266 589857 589032
59033 589032 588690 589385 591827 595886 600957 606950 614011 621798 630060 639608 651570 665937 681834 698920
$$ packed form
59135F12636n762m568l939l533k823k180k090k047j153O18K401L438L679L716
59121E98393M285N583O916P514P546P798Q501R199R649J0016J0198R794Q831P794
59107G12017O952O360O283O801P203O671N428M283L303K043P77J70m2p62j889
59092G65598k377k031j832k251k512j903p09M09R97O64o29k148l206m305o236
59077G37529q357r218q752q241q126p611o538n865n904n796n243n038n388n321
59063F42131m410l573l447l503l395l643m261m196l066k018j937k137j771j288
59049E99486j443j913j939j487r02k06N41R35Q47O50L68l98j429j844j409q25
59033E89032l42O95K442M059N071N993P061P787Q262R548J1962J4367J5897J7086
$$ plain form
59019 698920 717388 736734 755659 773213 789046 802579 812828 819117 821267 819283 813605 805514
59007 805514 796491 787296 778263 770048 763303 757969 753746 750941 750041 750865 752964 756403 761231 766615 771429
58992 771429 775311 778331 780186 780648 780194 779200 777168 773804 770048 766781 763284 758496 753136 748960 746395
58977 746395 744600 743456 743722 745403 747757 750985 756264 763962 773232 783492 794923 807406 820348
58964 820348 833589 847245 860689 873042 884593 896307 907954 918164 926269 932535 936486 936592
58952 936592 931931 922914 910270 894652 877287 859580 841922 824151 807056 791928 778643 765905
58940 765905 753489 742601 733851 726578 720467 716025 713043 710287 707363 705398 705286 706651 708917 711924
58926 711924 715020 717068 717905 718396 718632 717598 715088 712346 710132 707690 704321 700537 696947 693385 689880
$$ packed form
59019F98920J8468J9346J8925J7554J5833J3533J0249O289K150j984n678q091
59007H05514r023r195r033q215o745n334m223k805r00Q24K099L439M828N384M814
58992G71429L882L020J855M62m54r94k032l364l756l267l497m788n360m176k565
58977G46395j795j144K66J681K354L228N279P698R270J0260J1431J2483J2942
58964H20348J3241J3656J3444J2353J1551J1714J1647J0210Q105O266L951J06
58952I36592m661r017j2644j5618j7365j7707j7658j7771j7095j5128j3285j2738
58940G65905j2416j0888q750p273o111m442k982k756k924j965j12J365K266L007
58926G11924L096K048Q37M91K36j034k510k742k214k442l369l784l590l562l505
$$ plain form
58911 689880 687133 685351 683892 682717 682802 684523 687096 690286 695192 702557 711716 722029 733856 747265
58897 747265 761213 774978 788983 803229 816381 827649 838291 850070 863379 877975 894313
58886 894313 912792 932659 952993 973894 995445 1016291 1034528 1049474 1061522 1070788 1076866 1079415
58874 1079415 1078184 1072998 1064392 1053606 1041386 1027596 1012611 998089 985530 974870 965336 956905
58862 956905 950022 944531 939665 934588 928490 920865 912171 903382 894468 884319 872642 860793 850079
58849 850079 840447 831594 824122 818471 813786 808921 803803 798767 793284 786370 777700 767518 756065 743810
58835 743810 731585 719820 708290 697109 687130 678832 671746 665522 660533 656779 653355 649841 647153
58822 647153 646153 646390 647099 648392 650557 653149 655782 658909 662890 667109 670905 674467 678001 681008 683300
$$ packed form
58911F89880k747j782j459j175Q5J721K573L190M906P365R159J0313J1827J3409
58897G47265J3948J3765J4005J4246J3152J1268J0642J1779J3309J4596J6338
58886H94313J8479J9867K0334K0901K1551K0846J8237J4946J2048R266O078K549
58874A079415j231n186q606j0786j2220j3790j4985j4522j2559j0660r534q431
58862I56905o883n491m866n077o098p625q694q789q914j0149j1677j1849j0714
58849H50079r632q853p472n651m685m865n118n036n483o914q670j0182j1453j2255
58835G43810j2225j1765j1530j1181r979q298p086o224m989l754l424l514k688
58822F47153j000K37P09J293K165K592K633L127L981M219L796L562L534L007K292
$$ plain form
58807 683300 685707 688682 691182 691995 691319 689928 687653 683926 679097 674089 669310 664879 661209 658359 655405
58792 655405 651409 646478 641129 635387 629418 624271 621011 619689 619841 621251 623479 625651 627646 630644
58778 630644 635494 641409 647237 653123 659741 666567 672051 674989 674889 671616 665644 658160 650105 641580
58764 641580 632645 623918 615865 608469 602137 597830 595582 594181 593117 593562 596405 600590 604618 608583
58750 608583 613393 618957 624356 628959 632275 633590 632875 631307 629992 629144 629296 631895 637429 644176 650164
58735 650164 655340 660608 665962 671017 676280 682317 688570 694379 700281 706888 713448 718955 723777 728770
58721 728770 733712 738071 742409 747516 753070 758573 764752 772574 781782 791813 803119 815968 828834
58708 828834 839578 847391 852189 853247 850129 843956 836003 825952 813179 798568 783145 766033 746015
$$ packed form
58807F83300K407K975K500Q13o76j391k275l727m829n008m779m431l670k850k954
58792F55405l996m931n349n742n969n147l260j322J52J410K228K172J995K998
58778F30644M850N915N828N886O618O826N484K938j00l273n972p484q055q525
58764F41580q935q727q053p396o332m307k248j401j064M45K843M185M028L965
58750F08583M810N564N399M603L316J315p15j568j315q48J52K599N534O747N988
58735F50164N176N268N354N055N263O037O253N809N902O607O560N507M822M993
58721G28770M942M359M338N107N554N503O179P822R208J0031J1306J2849J2866
58708H28834J0744P813M798J058l118o173p953j0051j2773j4611j5423j7112k0018
$$ plain form
58695 746015 724231 703115 683364 664209 646065 630457 617592 606283 596146 587871 581362 575590
58683 575590 570258 565794 561746 556914 551206 545853 541785 538997 537197 535803 533800 530938 528509 527633
58669 527633 527645 527715 528996 533210 540021 547953 557166 568985 583101 597387 610174 620634 627433 629439
58655 629439 627675 624417 620401 614891 608215 601974 596721 591566 586148 581049 576237 571068 565837 561443
58641 561443 557592 553289 548960 546070 544739 543855 543458 544751 547656 550586 552821 555025 557163 558153 557918
58626 557918 557688 557772 557003 554866 552268 549768 546915 543887 541924 541574 542075 543013 545079 548770 553747 559744
58610 559744 566713 573849 579878 584463 588068 590620 591802 592404 593671 595487 596891 597991 599454 600383 598944
58595 598944 595119 590813 587231 584195 581924 581225 581760 582340 583174 585773 590509 596414 603488 612891 624588
$$ packed form
58695G46015k1784k1116j9751j9155j8144j5608j2865j1309j0137q275o509n772
58683E75590n332m464m048m832n708n353m068k788j800j394k003k862k429q76
58669E27633J2P0J281M214O811P932R213J1819J4116J4286J2787J0460O799K006
58655F29439j764l258m016n510o676o241n253n155n418n099m812n169n231m394
58641E61443l851m303m329k890j331q84l97J293K905K930K235K204K138R90k35
58626E57918k30Q4p69k137k598k500k853l028j963l50N01R38K066L691M977N997
58610E59744O969P136O029M585L605K552J182O02J267J816J404J100J463R29j439
58595E98944l825m306l582l036k271o99N35N80Q34K599M736N905P074R403J1697
$$ plain form
58580 624588 637018 649371 661965 674162 684374 692573 700390 708204 714548 719048 723619 729867 737459
58567 737459 745995 756426 769726 785864 804927 827576 853735 882401 913078 945732 979122 1010976
58555 1010976 1039953 1065522 1085995 1099131 1104994 1105915 1103327 1097067 1088051 1078841 1070725 1062711 1054198
58542 1054198 1046250 1039333 1032075 1023106 1011972 997609 978359 954476 928473 902266 876102 850763
58530 850763 828167 808926 791720 776014 762940 752745 743983 736217 730845 728115 725932 722898 720010
58517 720010 718043 715816 712476 709060 706299 703190 699236 695874 694131 693000 691507 690219 689334 687566
58503 687566 684460 681687 680556 680294 680121 680693 681974 682003 679578 676234 673929 672688 671983 672410 674370 677006
58487 677006 679966 684307 690307 696409 701779 707883 716147 726150 737534 751389 768116 786101 804169
$$ packed form
58580F24588J2430J2353J2594J2197J0212Q199P817P814O344M500M571O248P592
58567G37459Q536J0431J3300J6138J9063K2649K6159K8666L0677L2654L3390L1854
58555A010976K8977K5569K0473J3136N863R21k588o260r016r210q116q014q513
58542A054198p948o917p258q969j1134j4363j9250k3883k6003k6207k6164k5339
58530H50763k2596j9241j7206j5706j3074j0195q762p766n372k730k183l034k888
58517G20010j967k227l340l416k761l109l954l362j743j131j493j288q85j768
58503F87566l106k773j131k62j73N72J281K9k425l344k305j241p05M27J960K636
58487F77006K960M341O000O102N370O104Q264J0003J1384J3855J6727J7985J8068
$$ plain form
58474 804169 823190 843486 862759 878422 890046 897875 900996 898885 892880 884372 873348 860261
58462 860261 847341 836287 826556 817587 810779 807602 807644 810226 816108 825918 838680 853283 869473
58449 869473 886032 900174 910255 916988 920660 919652 913352 903994 893733 882205 868847 855236
58437 855236 843140 832442 822958 816100 812771 811708 811707 813305 816621 820020 822815 826902 833705 841908
58423 841908 850086 859090 869814 880985 891164 900416 908199 912295 911880 908946 904741 897800 887560
58410 887560 876691 867287 857890 846920 835957 826766 818207 809123 801339 796559 793138 789190 786197
58397 786197 786223 788203 790324 793391 798461 803764 807542 811456 817570 824312 829055 832392 836259 840055 842259
58382 842259 843775 846129 848339 848924 848829 849123 848324 845580 843882 846242 851067 855134 858814 864349 871322
$$ packed form
58474H04169J9021K0296J9273J5663J1624P829L121k111o005q508j1024j3087
58462H60261j2920j1054r731q969o808l177M2K582N882R810J2762J4603J6190
58449H69473J6559J4142J0081O733L672j008o300r358j0261j1528j3358j3611
58437H55236j2096j0698r484o858l329j063jJ598L316L399K795M087O803Q203
58423H41908Q178R004J0724J1171J0179R252P783M096m15k934m205o941j0240
58410H87560j0869r404r397j0970j0963r191q559r084p784m780l421l948k993
58397G86197K6J980K121L067N070N303L778L914O114O742M743L337L867L796K204
58382H42259J516K354K210N85r5K94p99k744j698K360M825M067L680N535O973
$$ plain form
58367 871322 878042 885367 895005 905922 916343 927292 940319 953930 966338 979480 996066 1014654
58355 1014654 1031834 1047169 1061747 1074084 1081998 1086714 1090795 1093831 1094354 1093932 1095034 1096908 1097935
58342 1097935 1099854 1105183 1112626 1119595 1127008 1136924 1147889 1157616 1167961 1182015 1198424 1213879 1229151
58329 1229151 1247150 1266939 1285165 1301712 1318408 1333791 1344712 1351718 1357615 1362311 1364247 1365120
58317 1365120 1367774 1371244 1373232 1375485 1381166 1389000 1395835 1402799 1412919 1424800 1435034 1444815 1457694
58304 1457694 1472737 1486534 1500111 1517005 1536250 1554150 1571316 1590895 1611581 1629680 1646539
58293 1646539 1666489 1688796 1709142 1727785 1748638 1771535 1793172 1814539 1839491 1866910 1892242
58282 1892242 1915967 1942667 1972559 2001986 2031392 2064626 2101159 2137027 2172510 2210644 2249420
$$ packed form
58367H71322O720P325R638J0917J0421J0949J3027J3611J2408J3142J6586J8588
58355A014654J7180J5335J4578J2337P914M716M081L036N23m22J102J874J027
58342A097935J919N329P443O969P413R916J0965R727J0345J4054J6409J5455J5272
58329A229151J7999J9789J8226J6547J6696J5383J0921P006N897M696J936Q73
58317A365120K654L470J988K253N681P834O835O964J0120J1881J0234R781J2879
58304A457694J5043J3797J3577J6894J9245J7900J7166J9579K0686J8099J6859
58293A646539J9950K2307K0346J8643K0853K2897K1637K1367K4952K7419K5332
58282A892242K3725K6700K9892K9427K9406L3234L6533L5868L5483L8134L8776
$$ plain form
58271 2249420 2284299 2317423 2355355 2398566 2442196 2486174 2535058 2588697 2642854 2698463 2760472
58260 2760472 2828107 2896163 2965115 3039601 3117770 3192930 3265150 3340201 3417726 3491987 3563852
58249 3563852 3640123 3721224 3801776 3883063 3972238 4069195 4167336 4267536 4377863 4499097 4624335
58238 4624335 4753456 4893767 5045714 5202623 5365265 5541577 5731381 5927295 6131471
58229 6131471 6354678 6597872 6852286 7118962 7409581 7726289 8060202 8412185 8794917
58220 8794917 9211775 9654747 10126310 10641484 11205034 11809855 12461537 13180176 13974260
58211 13974260 14839135 15785827 16843535 18029223 19345415 20813879 22479033 24372607
58203 24372607 26512044 28942363 31741916 34982065 38731009 43114241 48330028 54606445
$$ packed form
58271B249420L4879L3124L7932M3211M3630M3978M8884N3639N4157N5609O2009
58260B760472O7635O8056O8952P4486P8169P5160P2220P5051P7525P4261P1865
58249C563852P6271Q1101Q0552Q1287Q9175R6957R8141J00200J10327J21234J25238
58238D624335J29121J40311J51947J56909J62642J76312J89804J95914K04176
58229F131471K23207K43194K54414K66676K90619L16708L33913L51983L82732
58220H794917M16858M42972M71563N15174N63550O04821O51682P18639P94084
58211A3974260Q64875R46692J057708J185688J316192J468464J665154J893574
58203B4372607K139437K430319K799553L240149L748944M383232N215787O276417
$$ plain form
58195 54606445 62218762 71584118 83293820 98062253 116747329 140405027 170046728
58188 170046728 206000832 247325504 291694633 335575459 374387779 402985592 417028510
58181 417028510 414817538 398154237 371340887 339105750 305034392 271256159 238927721
58174 238927721 208759249 181268249 156809830 135507679 117218795 101621334 88361954
58167 88361954 77123706 67604345 59512274 52607451 46710041 41660796 37306963 33531237
58159 33531237 30257202 27414728 24927145 22736674 20811004 19115191 17602440 16239303
58151 16239303 15014210 13913012 12909328 11986430 11146054 10387022 9695093 9061051 8488914
58142 8488914 7978068 7515074 7090618 6707652 6365399 6051298 5755814 5480364 5224226
$$ packed form
58195E4606445P612317R365356J1709702J4768433J8685076K3657698K9641701
58188A70046728L5954104M1324672M4369129M3880826L8812320K8597813J4042918
58181D17028510k210972j6663301k6813350l2235137l4071358l3778233l2328438
58174B38927721l0168472k7491000k4458419k1302151j8288884j5597461j3259380
58167H8361954j1238248r519361q092071o904823n897410n049245m353833l775726
58159C3531237l274035k842474k487583k190471j925670j695813j512751j363137
58151A6239303j225093j101198j003684r22898q40376p59032o91929o34042n72137
58142H488914n10846m62994m24456l82966l42253l14101k95484k75450k56138
$$ plain form
58133 5224226 4978521 4739832 4515811 4310568 4117406 3931854 3758902 3601260 3452906
58124 3452906 3310400 3178688 3059787 2947116 2836942 2734465 2642847 2556844 2472883 2395018
58114 2395018 2325261 2258098 2190292 2126558 2069907 2015671 1960585 1908733 1862922 1818794 1772984
58103 1772984 1728808 1688541 1648188 1605197 1563551 1525974 1488721 1449263 1411612 1378769 1347057
58092 1347057 1313322 1280994 1253701 1229257 1204976 1182798 1164273 1146395 1127114 1109261 1094583
58081 1094583 1079623 1061824 1043989 1028423 1012383 993627 974802 958026 940699 921075 902502
58070 902502 887619 873587 857519 841567 828188 815362 801098 787980 778664 771109 762624 754500
58058 754500 748527 742892 735499 727489 719903 710884 699677 689231 681346 673466 663759 654952 649496 645343
$$ packed form
58133E224226k45705k38689k24021k05243j93162j85552j72952j57642j48354
58124C452906j42506j31712j18901j12671j10174j02477r1618q6003q3961p7865
58114B395018o9757o7163o7806o3734n6651n4236n5086n1852m5811m4128m5810
58103A772984m4176m0267m0353m2991m1646l7577l7253l9458l7651l2843l1712
58092A347057l3735l2328k7293k4444k4281k2178j8525j7878j9281j7853j4678
58081A094583j4960j7799j7835j5566j6040j8756j8825j6776j7327j9624j8573
58070I02502j4883j4032j6068j5952j3379j2826j4264j3118r316p555q485q124
58058G54500n973n635p393q010p586r019j1207j0446p885p880r707q807n456m153
$$ plain form
58044 645343 640347 636398 635085 633503 628666 622268 616890 611237 603352 595037 588761 583372 576926 570596
58030 570596 565746 560122 551027 539628 528492 517583 506165 495826 488008 481133 473512 466434 461271
58017 461271 456378 450073 443832 439383 435569 431228 428074 427443 427240 425433 423513 423061 422149 418868 415378
58002 415378 414567 415401 415415 415133 416044 416755 415161 412317 410330 408461 405005 400944 398103 395694 392302 389292
57986 389292 388610 389129 388752 388280 389541 391480 391739 390590 389803 389121 387285 385073 384027 383535 382346 381434
57970 381434 382165 383163 382221 379915 378233 377131 375549 374292 374651 375572 375380 374937 375995 377807 378514 378460 378898
57953 378898 378793 376254 372006 368215 364978 361103 357250 355049 354010 352414 350390 349237 348701 347892 347935
57938 347935 350749 356045 362302 369670 379104 389698 399749 409425 419515 428721 435213 439736 444015
$$ packed form
58044F45343m996l949j313j582m837o398n378n653p885q315o276n389o446o330
58030E70596m850n624r095j1399j1136j0909j1418j0339p818o875p621p078n163
58017D61271m893o305o241m449l814m341l154o31k03j807j920m52r12l281l490
58002D15378q11Q34J4k82R11P11j594k844j987j869l456m061k841k409l392l010
57986C89292o82N19l77m72J261J939K59j149p87o82j836k212j046m92j189r12
57970C81434P31R98r42k306j682j102j582j257L59R21j92m43J058J812P07n4M38
57953C78898j05k539m248l791l237l875l853k201j039j596k024j153n36q09M3
57938C47935K814N296O257P368R434J0594J0051R676J0090R206O492M523M279
$$ plain form
57925 444015 447134 446764 443094 438304 432929 426028 418246 411293 404801 397010 388320 381032 375775 371165
57911 371165 366822 363748 361804 359748 357789 357440 358782 360350 361609 363076 364196 363624 361540 359349 357377
57896 357377 355198 353837 355027 358485 362392 366280 371004 376180 380292 383250 386338 389680 392207 394039
57882 394039 396493 399616 402013 403087 403369 402724 400444 397009 393669 390409 386285 381429 376736 372087 367037
57867 367037 362667 360357 359265 357403 354748 352818 351801 350822 350560 352629 356481 359830 362234 365518 370563
57852 370563 376390 382556 389663 397154 403229 407414 410867 413934 415818 416837 418342 420107 420434 419216
57838 419216 418255 418043 416952 414335 411723 409956 407656 403751 399358 395966 393556 391579 390074 388873 387239
57823 387239 385143 383479 382469 381349 380044 379511 379949 380324 380143 380088 380452 380513 379810 378444 375810 370735 363298
$$ packed form
57925D44015L119l70l670m790n375o901p782o953o492p791q690p288n257m610
57911C71165m343l074j944k056j959l49J342J568J259J467J120n72k084k191j972
57896C57377k179j361J190L458L907L888M724N176M112K958L088L342K527J832
57882C94039K454L123K397J074K82o45k280l435l340l260m124m856m693m649n050
57867C67037m370k310j092j862k655j930j017r79k62K069L852L349K404L284N045
57852C70563N827O166P107P491O075M185L453L067J884J019J505J765L27j218
57838D19216r61k12j091k617k612j767k300l905m393l392k410j977j505j201j634
57823C87239k096j664j010j120j305n33M38L75j81n5L64O1p03j366k634n075p437
$$ plain form
57806 363298 354944 346565 338011 329628 322427 316371 310331 304083 298693 294650 291324 288550 286957 286379
57792 286379 285700 284597 283793 283421 282911 282645 283781 286241 288810 291416 295218 300170 304748 308549 312991
57777 312991 318857 325290 331831 339261 347592 355382 361954 368287 374678 379467 381309 381085 380441 379856 379126
57762 379126 378328 377361 375748 373628 371738 369950 367246 363511 359852 356744 353584 350510 348796 348770 349119
57747 349119 348975 348959 349486 349776 349339 348793 348449 347784 346982 347193 348450 349154 348556 348011 348777 350243 351293 351752
57729 351752 351533 350049 347627 345945 345922 346547 346731 346859 347591 348669 349951 352082 355053 357545 358757 359490
57713 359490 360472 361158 361179 361393 362329 363044 362750 362090 361625 360508 357977 354788 351896 348953 345490 342306 340278
57696 340278 338834 336959 334735 332716 330766 328698 327055 326072 324799 322441 319686 317617 316104 314316
$$ packed form
57806C63298q354q379q554q383p201o056o040o248n390m043l326k774j593n78
57792B86379o79j103q04l72n10k66J136K460K569K606L802M952M578L801M442
57777C12991N866O433O541P430Q331P790O572O333O391M789J842k24o44n85p30
57762C79126p98r67j613k120j890j788k704l735l659l108l160l074j714k6L49
57747C49119j44j6N27K90m37n46l44o65q02K11J257P04n98n45P66J466J050M59
57729C51752k19j484k422j682k3O25J84J28P32J078J282K131K971K492J212P33
57713C59490R82O86K1K14R36P15k94o60m65j117k531l189k892k943l463l184k028
57696C40278j444j875k224k019j950k068j643r83j273k358k755k069j513j788
$$ plain form
57682 314316 312077 309831 308059 307462 308873 312295 316998 323160 332281 345424 362449 383787 411583
57669 411583 448175 494520 550646 615745 686339 755349 814132 854943 871807 861853 827768 777529
57657 777529 720020 661290 605171 554942 512452 477085 447534 423624 405089 390005 376323
57646 376323 364004 354058 346437 340378 335755 332444 329302 325473 321905 320027 319617 319461 319313 319660 320241
57631 320241 320372 320227 320413 320799 320939 321000 321091 320430 318466 316080 314469 313575 312759 312102 311695 310611 308141 305309
57613 305309 303711 303522 304003 305141 307256 309629 311097 311551 311555 311129 310209 309571 309798 309994 308996 307294 306260
57596 306260 306046 305742 305103 304571 304016 302970 301728 300854 299936 298196 295966 294250 293198 292271 291463 291064 290710
57579 290710 289965 289355 289467 289562 288501 286629 285324 284998 284886 284447 283683 282512 281118 280435 280955 281595 281133
$$ packed form
57682C14316k239k246j772n97J411L422M703O162R121J3143J7025K1338K7796
57669D11583L6592M6345N6126O5099P0594O9010N8783M0811J6864r954l4085n0239
57657G77529n7509n8730n6119n0229m2490l5367k9551k3910j8535j5084j3682
57646C76323j2319r946p621o059m623l311l142l829l568j878m10j56j48L47N81
57631C20241J31j45J86L86J40O1R1o61j964k386j611q94q16o57m07j084k470k832
57613C05309j598j89M81J138K115K373J468M54Mm26r20o38K27J96r98j702j034
57596C06260k14l04o39n32n55j046j242q74r18j740k230j716j052r27q08l99l54
57579B90710p45o10J12R5j061j872j305l26j12m39p64j171j394o83N20O40m62
$$ plain form
57562 281133 280182 280166 280922 281081 280516 280583 282029 284361 287330 291457 296859 302879 309034 315165 320635 324587
57546 324587 327024 328602 329444 329258 328443 327967 328236 329027 330339 332309 334587 336716 338747 340606 341524 341137
57530 341137 340421 340262 339926 338392 336377 335353 335210 334782 334104 334154 334681 334442 333551 333516 334760 336035 336634 337397
57512 337397 339022 341000 342773 344542 346415 347955 349022 350045 351255 352653 354715 357878 361301 363432
57498 363432 363944 363914 364087 364250 364383 365034 366308 367680 369025 370696 372540 373981 375130 376593 378233 379328
57482 379328 379904 380639 381571 382268 383149 385071 387619 389431 390344 391542 393287 394171 393120 390716 388031 385534
57466 385534 383657 383129 384126 386016 388353 391199 394340 397310 400288 403828 407608 410726 413308 416484 420634
57451 420634 425012 429210 433539 437775 441041 443239 445178 447022 448161 448900 450634 453874 457617 461212
$$ packed form
57562B81133r51j6P56J59n65O7J446K332K969M127N402O020O155O131N470L952
57546C24587K437J578Q42j86q15m76K69P91J312J970K278K129K031J859R18l87
57530C41137p16j59l36j534k015j024j43m28o78N0N27k39q91l5J244J275N99P63
57512C37397J625J978J773J769J873J540J067J023J210J398K062L163L423K131
57498C63432N12l0J73J63J33O51J274J372J345J671J844J441J149J463J640J095
57482C79328N76P35R32O97Q81J922K548J812R13J198J745Q84j051k404k685k497
57466C85534j877n28R97J890K337K846L141K970K978L540L780L118K582L176M150
57451D20634M378M198M329M236L266K198J939J844J139P39J734L240L743L595
$$ plain form
57437 461212 465297 470306 475482 480113 484394 488467 491939 494924 498246 502041 505497 508483 511963 516136
57423 516136 519766 522167 524390 527490 531017 534222 537497 541419 545483 548919 551924 555129 558604 562253
57409 562253 566370 571011 575581 579736 583917 588379 592589 596219 599829 603899 608103 612133 616319 620797
57395 620797 625083 629151 633919 639910 646324 652268 658005 664205 670803 677427 684191 691294 698477 705530
57381 705530 712687 719979 726907 733208 739171 744847 749857 754459 759684 765840 771836 776695 780726 784612
57367 784612 788325 791722 795253 799295 803629 808228 813637 819849 825812 830888 835928 841993 848862 855669
57353 855669 862292 869181 876405 883731 891196 898919 906767 914661 922745 930881 938632 946029 953671 961813
57339 961813 970189 978877 988315 998218 1007699 1016806 1026679 1037632 1048390 1057893 1066638 1075552 1084752 1094170
$$ packed form
57437D61212M085N009N176M631M281M073L472K985L322L795L456K986L480M173
57423E16136L630K401K223L100L527L205L275L922M064L436L005L205L475L649
57409E62253M117M641M570M155M181M462M210L630L610M070M204M030M186M478
57395F20797M286M068M768N991O414N944N737O200O598O624O764P103P183P053
57381G05530P157P292O928O301N963N676N010M602N225O156N996M859M031L886
57367G84612L713L397L531M042M334M599N409O212N963N076N040O065O869O807
57353H55669O623O889P224P326P465P723P848P894Q084Q136P751P397P642Q142
57339I61813Q376Q688R438R903R481R107R873J0953J0758R503Q745Q914R200R418
$$ plain form
57325 1094170 1104189 1114835 1125429 1135810 1146740 1158401 1169768 1180292 1190813 1201878 1212587
57314 1212587 1222317 1232233 1243660 1256079 1268169 1279876 1292012 1304585 1317011 1329379 1342195 1355346
57302 1355346 1368425 1381630 1395331 1409273 1423079 1436904 1450781 1464153 1476989 1490493 1505588
57291 1505588 1521511 1537023 1552302 1568511 1586069 1604412 1622903 1641004 1658161 1674441 1690691
57280 1690691 1707293 1723525 1738875 1753933 1768982 1782819 1794307 1804195 1814122 1824498 1834704 1844587
57268 1844587 1854478 1864343 1874281 1885334 1898523 1913567 1929701 1947200 1966770 1987874 2009020 2029490
57256 2029490 2049770 2070499 2091887 2113830 2135821 2157227 2178329 2200419 2224164 2248753 2273474
57245 2273474 2299060 2326315 2354412 2381905 2408668 2435577 2463058 2491180 2520394 2550790 2581332
$$ packed form
57325A094170J0019J0646J0594J0381J0930J1661J1367J0524J0521J1065J0709
57314A212587R730R916J1427J2419J2090J1707J2136J2573J2426J2368J2816J3151
57302A355346J3079J3205J3701J3942J3806J3825J3877J3372J2836J3504J5095
57291A505588J5923J5512J5279J6209J7558J8343J8491J8101J7157J6280J6250
57280A690691J6602J6232J5350J5058J5049J3837J1488R888R927J0376J0206R883
57268A844587R891R865R938J1053J3189J5044J6134J7499J9570K1104K1146K0470
57256B029490K0280K0729K1388K1943K1991K1406K1102K2090K3745K4589K4721
57245B273474K5586K7255K8097K7493K6763K6909K7481K8122K9214L0396L0542
$$ plain form
57234 2581332 2611127 2640767 2671169 2701969 2732490 2763439 2795995 2829891 2864043 2898446 2933713
57223 2933713 2969249 3003782 3037486 3071886 3107724 3144374 3181176 3217914 3254141 3289536 3324904
57212 3324904 3361489 3399348 3437538 3475675 3513974 3551952 3588424 3622850 3655621 3687210 3718027
57201 3718027 3748784 3779890 3810718 3840502 3869603 3898934 3928694 3958702 3989346 4021005 4053209
57190 4053209 4085653 4119281 4154861 4191161 4226116 4259278 4291576 4323179 4353307 4381741 4408844
57179 4408844 4434388 4457935 4480109 4501930 4523300 4543652 4563686 4584739 4606864 4629223 4651985
57168 4651985 4675965 4700750 4725180 4749537 4775184 4802021 4828269 4852963 4876821 4900454 4923484
57157 4923484 4945784 4967856 4989526 5009734 5027968 5044633 5059776 5072743 5083304 5091853 5098410 5102549
$$ packed form
57234B581332K9795K9640L0402L0800L0521L0949L2556L3896L4152L4403L5267
57223B933713L5536L4533L3704L4400L5838L6650L6802L6738L6227L5395L5368
57212C324904L6585L7859L8190L8137L8299L7978L6472L4426L2771L1589L0817
57201C718027L0757L1106L0828K9784K9101K9331K9760L0008L0644L1659L2204
57190D053209L2444L3628L5580L6300L4955L3162L2298L1603L0128K8434K7103
57179D408844K5544K3547K2174K1821K1370K0352K0034K1053K2125K2359K2762
57168D651985K3980K4785K4430K4357K5647K6837K6248K4694K3858K3633K3030
57157D923484K2300K2072K1670K0208J8234J6665J5143J2967J0561Q549O557M139
$$ plain form
57145 5102549 5104204 5103395 5099348 5091192 5079318 5064787 5047800 5028256 5007497 4987919 4970991 4956990
57133 4956990 4946296 4939412 4936096 4936065 4940200 4949638 4964251 4983599 5008543 5039903 5076200 5114849 5155157
57120 5155157 5198091 5243710 5291121 5340541 5393074 5448834 5507689 5571658 5644276 5727882 5823717
57109 5823717 5934195 6062612 6211139 6381675 6578361 6806909 7072399 7380894 7743055
57100 7743055 8173794 8689703 9310416 10062137 10976998 12090230 13441511 15077297 17046298
57091 17046298 19391253 22145528 25331076 28949464 32972274 37342847 41983973 46800708
57083 46800708 51689683 56567015 61381813 66064782 70434864 74169747 76905563 78393631
57075 78393631 78580067 77563734 75505977 72574868 68934566 64748387 60179739 55392162
$$ packed form
57145E102549J655q09m047q156j1874j4531j6987j9544k0759j9578j6928j4001
57133D956990j0694o884l316l1M135R438J4613J9348K4944L1360L6297L8649M0308
57120E155157M2934M5619M7411M9420N2533N5760N8855O3969P2618Q3606R5835
57109E823717J10478J28417J48527J70536J96686K28548K65490L08495L62161
57100G743055M30739N15909O20713P51721R14861J113232J351281J635786J969001
57091A7046298K344955K754275L185548L618388M022810M370573M641126M816735
57083D6800708M888975M877332M814798M682969M370082L734883K735816J488068
57075G8393631J86436j016333k057757k931109l640302m186179m568648m787577
$$ plain form
57067 55392162 50544836 45779920 41210327 36917213 32953417 29345715 26097901 23198481
57059 23198481 20628476 18364032 16376730 14636323 13114000 11782897 10617659 9595560
57051 9595560 8697248 7905542 7204850 6582485 6028822 5534949 5091408 4689977 4325071
57042 4325071 3992416 3687851 3408452 3153298 2921734 2711784 2521148 2348675 2193894
57033 2193894 2056088 1934729 1829919 1741671 1669773 1615193 1580599 1568260 1577761 1606005 1647849
57022 1647849 1694816 1733471 1747555 1724509 1661894 1568336 1458045 1343448 1231817 1126926
57012 1126926 1031477 946968 872827 807616 750897 702817 662389 627603 597038 570111 546020
57001 546020 523806 503426 485404 469370 454114 439157 425093 412306 400496 389643 380275 372579
$$ packed form
57067E5392162m847326m764916m569593m293114l963796l607702l247814k899420
57059B3198481k570005k264444j987302j740407j522323j331103j165238j022099
57051I595560q98312p91706p00692o22365n53663m93873m43541m01431l64906
57042D325071l32655l04565k79399k55154k31564k09950j90636j72473j54781
57033B193894j37806j21359j04810q8248p1898n4580l4594j2339R501K8244M1844
57022A647849M6967L8655J4084k3046o2615r3558j10291j14597j11631j04891
57012A126926r5449q4509p4141o5211n6719m8080m0428l4786l0565k6927k4091
57001E46020k2214k0380j8022j6034j5256j4957j4064j2787j1810j0853r368p696
$$ plain form
56989 372579 366248 361477 359226 360374 365380 374669 388165 404098 419116 429873 434083 430505 419239
56976 419239 402233 382460 362121 342157 323276 306413 292074 280217 270964 264634 260914 258886
56964 258886 258137 259287 263322 271076 283322 300555 322384 347529 374275 400347 422543 437358
56952 437358 442328 436656 421091 397955 370975 344022 319592 298572 281014 266622 255015 246231
56940 246231 240790 238844 239824 243471 250602 262267 278870 300782 328787 362713 400194 437610 471327
56927 471327 497133 509958 506498 488090 459708 426303 391123 356545 324417 295434 269576 247184
56915 247184 228500 212600 198210 185305 174490 165175 156033 147099 139773 134703 131134 128305 125966
56902 125966 123551 120456 117275 115260 114407 113510 112221 111581 112334 114198 117076 121674 128658 138501 152221
$$ packed form
56989C72579o331m771k251J148N006R289J3496J5933J5018J0757M210l578j1266
56976D19239j7006j9773k0339j9964j8881j6863j4339j1857r253o330l720k028
56964B58886p49J150M035P754J2246J7233K1829K5145K6746K6072K2196J4815
56952D37358M970n672j5565k3136k6980k6953k4430k1020j7558j4392j1607q784
56940B46231n441j946R80L647P131J1665J6603K1912K8005L3926L7481L7416L3717
56927D71327K5806J2825l460j8408k8382l3405l5180l4578l2128k8983k5858k2392
56915B47184j8684j5900j4390j2905j0815r315r142q934p326n070l569k829k339
56902A25966k415l095l181k015q53q97j289o40P53J864K878M598O984R843J3720
$$ plain form
56887 152221 170855 193913 219478 245724 270857 291729 304530 307637 302520 291623 276823 260211
56875 260211 244472 231403 221117 213277 208164 206207 207653 213141 223502 238792 258757 284563
56863 284563 318726 362905 416850 479436 548908 621246 689524 745710 782755 795782 783744
56852 783744 751018 705868 656153 606829 561096 521638 489776 465081 447156 436835 434955 441290
56840 441290 455776 479824 515552 564696 628905 709743 806925 916661 1031805 1142351 1235467
56829 1235467 1297476 1318838 1298414 1243032 1163516 1070985 974971 882634 798688 725893 665299
56818 665299 616327 577620 548422 528865 519170 519478 530514 553452 589032 637512 699057 772516
56806 772516 853246 932909 1001553 1049469 1068592 1055204 1012492 949069 874184 794967 717305
$$ packed form
56887A52221J8634K3058K5565K6246K5133K0872J2801L107n117j0897j4800j6612
56875B60211j5739j3069j0286p840n113j957J446N488J0361J5290J9965K5806
56863B84563L4163M4179N3945O2586O9472P2338O8278N6186L7045J3027j2038
56852G83744l2726m5150m9715m9324m5733l9458l1862k4695j7925j0321j880O335
56840D41290J4486K4048L5728M9144O4209Q0838R7182J09736J15144J10546R3116
56829A235467O2009K1362k0424n5382p9516r2531r6014r2337q3946p2795o0594
56818F65299m8972l8707k9198j9557r695L08J1036K2938L5580M8480O1545P3459
56806G72516Q0730P9663O8644M7916J9123j3388m2712o3423p4885p9217p7662
$$ plain form
56795 717305 646268 584316 530922 485249 447907 419377 398561 384223 376544 376107 382756 396593
56783 396593 418764 449789 487955 530203 573172 612131 640380 651899 644588 620342 583065 537633
56771 537633 489414 442637 399121 359277 323747 293161 267098 244511 224813 207711 192643
56760 192643 179218 167630 157762 148526 139035 129874 122408 117262 114058 111990 110032 107341 104143 101535
56746 101535 99845 98092 95646 93361 92181 91663 90905 90019 89600 89476 89149 88876 89290 90317 91354 92099
56730 92099 92535 92559 92221 91883 91701 91564 91801 93020 94882 96171 96658 97719 100353 103717 106443 108233 109303
56713 109303 109438 108653 107790 107426 107147 106816 107397 109408 111730 113184 114266 115916 117559 117905 117005 116030 115504
56696 115504 115123 114900 115205 115904 116489 116800 116851 116433 115726 115659 116761 118205 118873 118786 118665 118785 119171 120223 122162
$$ packed form
56795G17305p1037o1952n3394m5673l7342k8530k0816j4338p679m37O649J3837
56783C96593K2171L1025L8166M2248M2969L8959K8249J1519p311k4246l7277m5432
56771E37633m8219m6777m3516l9844l5530l0586k6063k2587j9698j7102j5068
56760A92643j3425j1588r868r236r491r161p466n146l204k068j958k691l198k608
56746A01535j690j753k446k285j180n18p58q86m19j24l27k73M14J027J037P45
56730I2099M36K4l38l38j82j37K37J219J862J289M87J061K634L364K726J790J070
56713A09303J35p85q63l64k79l31N81K011K322J454J082J650J643L46r00r75n26
56696A15504l81k23L05O99N85L11N1m18p07o7J102J444O68q7j21J20L86J052J939
$$ plain form
56677 122162 124416 126379 128222 130224 132022 133199 133823 133751 132364 129808 127474 126410 126263 126508 127421 128915
56661 128915 129798 129484 129148 129881 131007 131613 132431 134449 136852 138247 138985 140309 141972 142696 142430 142174 141940
56644 141940 140780 138731 137009 136302 136264 136574 137120 137338 136652 135358 133909 131798 128513 125150 123596 124270
56628 124270 125901 127265 127912 127613 126535 125674 125818 126293 125911 124786 123934 123504 122814 121930 121816 122912 124643
56611 124643 126192 126862 126143 124408 123084 123106 123723 123800 123496 123577 123942 124193 124746 125848 126326 125049 122937 121795
56593 121795 121771 121786 121792 122547 123561 123475 122478 122377 124020 126374 128301 129628 130368 130478 130640 131883 134177 136542
56575 136542 138543 140473 142243 143416 144236 145351 146687 147857 149388 152175 156012 160123 164886 171528
56561 171528 180329 190631 202375 216004 230918 245470 258409 268930 275699 277589 275361 271096
$$ packed form
56677A22162K254J963J843K002J798J177O24p2j387k556k334j064j47K45R13J494
56661A28915Q83l14l36P33J126O06Q18K018K403J395P38J324J663P24k66k56k34
56644A41940j160k049j722p07l8L10N46K18o86j294j449k111l285l363j554O74
56628A24270J631J364O47k99j078q61J44M75l82j125q52m30o90q84j14J096J731
56611A24643J549O70p19j735j324K2O17P7l04Q1L65K51N53J102M78j277k112j142
56593A21795k4J5OP55J014q6r97j01J643K354J927J327P40J10J62J243K294K365
56575A36542K001J930J770J173Q20J115J336J170J531K787L837M111M763O642
56561A71528Q801J0302J1744J3629J4914J4552J2939J0521O769J890k228m265
$$ plain form
56549 271096 266062 260533 255230 251067 247582 243485 238769 234590 231136 227502 223720 220899 219047 216616
56535 216616 212747 208330 204331 200599 196866 193551 190959 188739 186540 184365 182145 179857 177983 176939
56521 176939 176307 175570 175041 174952 174422 172869 171627 172276 173949 174371 173165 171953 171445 170646 169004 167183 165542
56504 165542 163904 162930 163663 165505 166705 167073 168128 170295 172145 172903 173598 175073 176733 177918 178783 179279
56488 179279 178967 178308 178494 179567 180306 180298 180407 180931 181119 180788 180613 180547 179819 178767 178681 179564 180112 180189 181100 182987
56468 182987 184316 184588 185231 186987 188669 189470 190263 191565 192276 191697 190862 190680 190529 189917 189757 190738 191989
56451 191989 192591 193029 194016 195262 196462 198150 200634 203271 205576 207787 209808 211030 211732 212950 214407
56436 214407 214366 212306 209922 208625 207881 206973 206540 207199 208249 208934 209565 210415 210892 210762 210787 211322 211713 211749
$$ packed form
56549B71096n034n529n303m163l485m097m716m179l454l634l782k821j852k431
56535B16616l869m417l999l732l733l315k592k220k199k175k220k288j874j044
56521A76939o32p37n29q9n30j553j242O49J673M22j206j212n08p99j642j821j641
56504A65542j638r74P33J842J200L68J055K167J850P58O95J475J660J185Q65M96
56488A79279l12o59J86J073P39qJ09N24J88l31j75o6p28j052q6Q83N48P7R11J887
56468A82987J329K72O43J756J682Q01P93J302P11n79q35j82j51o12j60R81J251
56451A91989O02M38R87J246J200J688K484K637K305K211K021J222P02J218J457
56436B14407m1k060k384j297p44r08m33O59J050O85O31Q50M77j30K5N35L91L6
$$ plain form
56418 211749 212156 212971 213182 212718 212968 214392 215486 215193 214546 214717 215140 214827 214014 213225 212117 210481 209154
56401 209154 208914 209512 210497 211686 212355 211586 210044 209671 210946 212244 212607 213167 214907 216976 218265 218865
56385 218865 219022 218511 217952 218756 220782 221998 221451 220492 220168 219746 219050 219759 222722 226070 227722 227894 227624
56368 227624 226862 225738 225734 227643 229963 231040 231314 231917 232748 233531 235085 237809 240442 241950 243162 245079
56352 245079 247142 248631 250124 252031 253382 253638 254076 255829 258160 260189 262616 266096 269550 271739 273029
56337 273029 274146 274896 275521 277513 281477 285883 289432 292842 296899 300820 304154 308190 313664 319116 323324
56322 323324 327297 331960 335996 338069 339079 340097 340123 338208 335813 334670 334060 332507 330437 328861 327272
56307 327272 325218 324172 325363 327452 328760 330114 333009 336761 340065 343711 348981 354827 359402 363059
$$ packed form
56418B11749M07Q15K11m64K50J424J094k93o47J71M23l13q13p89j108j636j327
56401B09154k40N98R85J189O69p69j542l73J275J298L63N60J740K069J289O00
56385B18865J57n11n59Q04K026J216n47r59l24m22o96P09K963L348J652J72k70
56368B27624p62j124mJ909K320J077K74O03Q31P83J554K724K633J508J212J917
56352B45079K063J489J493J907J351K56M38J753K331K029K427L480L454K189J290
56337B73029J117P50O25J992L964M406L549L410M057L921L334M036N474N452M208
56322C23324L973M663M036K073J010J018K6j915k395j143o10j553k070j576j589
56307C27272k054j046J191K089J308J354K895L752L304L646N270N846M575L657
$$ plain form
56293 363059 367170 371302 374229 376569 379840 383968 388097 392641 398173 403619 408054 413009 420496 429890
56279 429890 439149 447927 457122 466631 475966 485901 497191 508907 520183 532191 546178 561151 575862
56266 575862 591389 609279 628744 648328 668716 691353 716029 742577 773139 809793 851558
56255 851558 896708 946483 1003538 1068347 1140273 1220669 1311688 1413327 1524684 1646619 1779978
56244 1779978 1922592 2071156 2224518 2381897 2539459 2692254 2837945 2974926 3098151
56235 3098151 3200862 3279620 3334114 3363228 3365270 3341344 3294727 3227448 3140887 3038889 2926616
56224 2926616 2806935 2681240 2552822 2425664 2300672 2176819 2055435 1939737 1830736
56215 1830736 1727242 1629387 1538558 1454347 1375101 1301080 1233671 1172080 1114167 1059895 1010576
$$ packed form
56293C63059M111M132K927K340L271M128M129M544N532N446M435M955P487R394
56279D29890R259Q778R195R509R335R935J1290J1716J1276J2008J3987J4973J4711
56266E75862J5527J7890J9465J9584K0388K2637K4676K6548L0562L6654M1765
56255H51558M5150M9775N7055O4809P1926Q0396R1019J01639J11357J21935J33359
56244A779978J42614J48564J53362J57379J57562J52795J45691J36981J23225
56235C098151J02711P8758N4494K9114K042k3926m6617o7279q6561j01998j12273
56224B926616j19681j25695j28418j27158j24992j23853j21384j15698j09001
56215A830736j03494r7855r0829q4211p9246p4021o7409o1591n7913n4272m9319
$$ plain form
56204 1010576 965542 923088 883857 849609 819427 790865 764112 741300 722413 705604 690719
56193 690719 678649 668028 656623 645285 636521 629914 623000 615848 610475 606453 601572 596344 593333
56180 593333 592374 590842 588340 586754 586045 584494 582822 583446 585762 586675 585783 585614 586886 588060 589450 593101
56164 593101 598596 603598 608454 615569 624355 631752 637878 646088 657075 667955 677750 688801 702101
56151 702101 716067 730746 748549 769991 793252 818758 849806 888062 932871 985500 1049400
56140 1049400 1125559 1211830 1307140 1411641 1522311 1632978 1739147 1838498 1927149 2001066
56130 2001066 2061735 2115238 2165082 2210709 2252654 2292860 2329124 2355379 2369107 2373459 2371259 2362438
56118 2362438 2348140 2331197 2310607 2280609 2236667 2177814 2102952 2011100 1906712 1798962 1694063
$$ packed form
56204A010576m5034m2454l9231l4248l0182k8562k6753k2812j8887j6809j4885
56193F90719j2070j0621j1405j1338q764o607o914p152n373m022m881n228l011
56180E93333r59j532k502j586p09j551j672O24K316R13q92j69J272J174J390L651
56164E93101N495N002M856P115Q786P397O126Q210J0987J0880R795J1051J3300
56151G02101J3966J4679J7803K1442K3261K5506L1048L8256M4809N2629O3900
56140A049400P6159Q6271R5310J04501J10670J10667J06169R9351Q8651P3917
56130B001066O0669N3503M9844M5627M1945M0206L6264K6255J3728M352k200q821
56118B362438j4298j6943k0590k9998m3942n8853p4862r1852j04388j07750j04899
$$ plain form
56107 1694063 1593152 1498259 1414074 1342340 1280362 1226724 1182952 1148248 1118511 1092163 1071352
56096 1071352 1056123 1043147 1031486 1023580 1019316 1015226 1010783 1009191 1010648 1011367 1010575 1011760 1015536 1018298
56082 1018298 1019554 1023448 1031090 1038604 1044820 1053544 1065904 1077817 1087591 1098774 1112890 1126654 1139005
56069 1139005 1153586 1171484 1188815 1204220 1221319 1241060 1259282 1274765 1291960 1312792 1333525
56058 1333525 1352672 1373886 1397887 1419765 1437668 1455939 1476358 1494770 1509895 1526704 1547268
56047 1547268 1567086 1584263 1603319 1625912 1647203 1665770 1687617 1715638 1744590 1771257 1799849
56036 1799849 1832286 1863206 1890245 1919410 1954383 1990293 2023971 2060380 2102678 2145909 2186946
56025 2186946 2230764 2280433 2330942 2379441 2431269 2489258 2547676 2603577 2663345 2730985 2800931
$$ packed form
56107A694063j00911r4893q4185p1734o1978n3638m3772l4704k9737k6348k0811
56096A071352j5229j2976j1661p906m264m090m443j592J457P19p92J185L776K762
56082A018298J256L894P642P514O216Q724J2360J1913R774J1183J4116J3764J2351
56069A139005J4581J7898J7331J5405J7099J9741J8222J5483J7195K0832K0733
56058A333525J9147K1214K4001K1878J7903J8271K0419J8412J5125J6809K0564
56047A547268J9818J7177J9056K2593K1291J8567K1847K8021K8952K6667K8592
56036A799849L2437L0920K7039K9165L4973L5910L3678L6409M2298M3231M1037
56025B186946M3818M9669N0509M8499N1828N7989N8418N5901N9768O7640O9946
$$ plain form
56014 2800931 2869535 2942217 3021933 3102511 3181172 3265388 3359239 3455534 3549804 3648974 3757288
56003 3757288 3867311 3974602 4087493 4212113 4341662 4471148 4608486 4759874 4918738
55994 4918738 5080740 5254758 5446842 5648674 5854509 6073874 6314560 6569545 6834334
55985 6834334 7119983 7434554 7769466 8119252 8496180 8909722 9351437 9817025 10322473
55976 10322473 10880530 11483403 12127921 12834449 13620442 14480537 15415464 16454285 17624060
55967 17624060 18926358 20370610 22000563 23859722 25965257 28349755 31094673 34290574
55959 34290574 38009472 42362353 47546726 53804543 61402871 70729830 82372909 97071127
55951 97071127 115692612 139313982 169076604 205555868 248032527 294271101 340732128
$$ packed form
56014B800931O8604P2682P9716Q0578P8661Q4216R3851R6295R4270R9170J08314
56003C757288J10023J07291J12891J24620J29549J29486J37338J51388J58864
55994D918738J62002J74018J92084K01832K05835K19365K40686K54985K64789
55985F834334K85649L14571L34912L49786L76928M13542M41715M65588N05448
55976A0322473N58057O02873O44518P06528P85993Q60095R34927J038821J169775
55967A7624060J302298J444252J629953J859159K105535K384498K744918L195901
55959C4290574L718898M352881N184373O257817P598328R326959J1643079J4698218
55951I7071127J8621485K3621370K9762622L6479264M2476659M6238574M6461027
$$ plain form
55944 340732128 382716419 414634694 431239867 429763008 411375929 380553861 342859810
55937 342859810 302994004 264163245 228312672 196424781 168738944 145050865 124992417
55930 124992417 108124758 93945958 81973115 71830822 63227075 55891206 49589524
55923 49589524 44163129 39494162 35455621 31930343 28848058 26161135 23804798 21714706
55915 21714706 19860129 18224915 16774061 15468722 14295266 13250031 12311543 11454240
55907 11454240 10673835 9973536 9339405 8752842 8213523 7727167 7283380 6867176 6480240
55898 6480240 6130066 5809431 5506327 5223358 4968214 4734990 4513068 4304871 4117363
55889 4117363 3945171 3778914 3621596 3480680 3352416 3229524 3115990 3018844 2932999 2848928
$$ packed form
55944C40732128M1984291L1918275J6605173j476859j8387079l0822068l7694051
55937C42859810l9865806l8830759l5850573l1887891k7685837k3688079k0058448
55930A24992417j6867659j4178800j1972843j0142293q603747p335869o301682
55923D9589524n426395m668967m038541l525278l082285k686923k356337k090092
55915B1714706j854577j635214j450854j305339j173456j045235r38488q57303
55907A1454240p80405p00299o34131n86563n39319m86356m43787m16204l86936
55898F480240l50174l20635l03104k82969k55144k33224k21922k08197j87508
55889D117363j72192j66257j57318j40916j28264j22892j13534r7146q5845q4071
$$ plain form
55879 2848928 2767704 2694021 2621994 2542653 2458944 2379366 2302963 2224027 2145401 2073587 2006183
55868 2006183 1937005 1868500 1806924 1750400 1693622 1639231 1592816 1551507 1508881 1466363 1428803
55857 1428803 1393633 1355484 1316988 1284156 1255390 1225516 1196245 1172156 1150539 1125629 1098955
55846 1098955 1075469 1053430 1028167 1001894 979740 959759 936768 912599 892648 875672 856772
55835 856772 837297 822014 809357 794140 777383 764086 753781 742383 730997 723758 719127 712176
55823 712176 703436 696799 690758 680506 666896 654813 644334 631843 618223 607575 599258 589373
55811 589373 578828 571914 568102 563145 557171 553969 553329 551742 549757 551162 555627 559475 562997 569828
55797 569828 579676 588540 595504 602626 608957 611422 610916 610915 610724 606672 599194 592214 586288 578897 570732
$$ packed form
55879B848928q1224p3683p2027p9341q3709p9578p6403p8936p8626p1814o7404
55868B006183o9178o8505o1576n6524n6778n4391m6415m1309m2626m2518l7560
55857A428803l5170l8149l8496l2832k8766k9874k9271k4089k1617k4910k6674
55846A098955k3486k2039k5263k6273k2154j9981k2991k4169j9951j6976j8900
55835H56772j9475j5283j2657j5217j6757j3297j0305j1398j1386p239m631o951
55823G12176q740o637o041j0252j3610j2083j0479j2491j3620j0648q317r885
55811E89373j0545o914l812m957n974l202o40j587j985J405M465L848L522O831
55797E69828R848Q864O964P122O331K465n06jj91m052p478o980n926p391q165
$$ plain form
55782 570732 564914 560372 552561 540528 527204 513280 497149 480468 467432 458758 452399 449691 454390
55769 454390 465822 479049 491510 503333 511513 510709 500541 486194 471325 455904 441019 429521
55757 429521 421104 412357 402474 393849 386717 378529 368902 359888 351039 339598 326004 313922 304369
55744 304369 295016 285669 279079 275651 272634 269315 267979 268920 269459 268739 268689 269424 268486 265595 263483 263010
55728 263010 261824 258783 255465 252459 248330 243036 238394 234544 229800 224363 220298 217684 214850 212372
55714 212372 212525 214796 216530 218053 222463 230095 237921 244719 251899 258828 262443 262428 261837 261526 258792
55699 258792 252613 245537 239081 231847 223563 216519 211481 206469 201036 197571 196761 195872 193205 190507 189449
55684 189449 189352 189809 191941 195631 198992 201718 205601 210837 215409 218916 223110 227762 230122 229557 228636
$$ packed form
55782E70732n818m542p811j2033j3324j3924j6131j6681j3036q674o359k708M699
55769D54390J1432J3227J2461J1823Q180q04j0168j4347j4869j5421j4885j1498
55757D29521q417q747r883q625p132q188r627r014q849j1441j3594j2082r553
55744C04369r353r347o590l428l017l319j336R41N39p20n0P35r38k891k112m73
55728B63010j186l041l318l006m129n294m642l850m744n437m065k614k834k478
55714B12372J53K271J734J523M410P632P826O798P180O929L615j5n91l11k734
55699B58792o179p076o456p234q284p044n038n012n433l465q10q89k667k698j058
55684A89449r7M57K132L690L361K726L883N236M572L507M194M652K360n65r21
$$ plain form
55669 228636 228363 226602 222615 218951 217094 215296 212569 210843 211187 211679 211155 211446 213796 216516 218402
55654 218402 221146 226048 231394 235337 238521 241703 243581 243194 242009 241582 241375 240555 239672 238976 237308 234000
55638 234000 229714 224433 217103 208212 200030 193383 186997 180787 176485 173984 170560 165225 160510 158236
55624 158236 156754 154208 151414 149525 147761 145508 143927 143453 142244 139120 135723 133875 132986 131708 129975
55609 129975 127941 125155 122149 120508 120179 119127 116790 115121 115074 114996 113883 113156 113575 113492 112022 110971
55593 110971 111573 112114 110951 109231 108465 107927 106626 105525 105581 105731 104920 104127 104478 105385 106213 107677 109929
55576 109929 111553 112107 113309 116015 118548 119857 121762 125958 131217 135705 139777 144261 148172 150403
55562 150403 151686 152732 152395 149770 146215 143212 140171 136305 132672 130360 128539 126321 124515 123635 122288
$$ packed form
55669B28636k73j761l987l664j857j798k727j726L44M92n24K91K350K720J886
55654B18402K744M902N346L943L184L182J878l87j185m27k07q20q83o96j668l308
55638B34000m286n281p330q891q182o647o386o210m302k501l424n335m715k274
55624A58236j482k546k794j889j764k253j581m74j209l124l397j848q89j278j733
55609A29975k034k786l006j641l29j052k337j669m7p8j113p27M19q3j470j051
55593A10971O02N41j163j720p66n38j301j101N6J50q11p93L51R07Q28J464K252
55576A09929J624N54J202K706K533J309J905M196N259M488M072M484L911K231
55562A50403J283J046l37k625l555l003l041l866l633k312j821k218j806q80j347
$$ plain form
55547 122288 119641 117385 117074 117589 117445 117492 118886 120427 120495 119867 120072 120620 120406 120262 121507 123302 123964
55530 123964 123739 123935 124469 124485 124277 124412 124003 121918 118685 115443 112186 108805 106415 105721 105410 104084 102467
55513 102467 101845 101762 101221 100646 100615 100046 97808 94825 92519 90485 87830 85467 84792 85235 85285 84920 84974 85144
55495 85144 84657 83833 83107 81646 78937 76557 76254 77294 77681 76950 75856 74544 73143 72993 75012 77721
55479 77721 79001 78943 78998 79345 79222 78917 79207 79530 78853 77744 77595 78339 78773 78582 78349 78167 77828 77746 78191
55460 78191 78371 77624 76617 76001 75057 73143 71216 70337 69919 69120 68623 69322 70555 71429 72488 74256 75669
55443 75669 75940 76414 78330 80279 80300 79125 78758 79112 78772 78032 78308 79244 79193 78129 77534 77756 77920 78061
55425 78061 78998 80335 80799 80350 79943 79565 78475 77029 76311 76365 76574 77220 78768 80294 80657 80605 81656 83422
$$ packed form
55547A22288k647k256l11N15j44M7J394J541O8o28K05N48k14j44J245J795O62
55530A23964k25J96N34J6k08J35m09k085l233l242l257l381k390o94l11j326j617
55513A02467o22q3n41n75l1n69k238k983k306k034k655k363o75M43N0l65N4J70
55495H5144m87q24p26j461k709k380l03J040L87p31j094j312j401j50K019K709
55479G7721J280n8N5L47j23l05K90L23o77j109j49P44M34j91k33j82l39q2M45
55460G8191J80p47j007o16r44j914j927q79m18p99m97O99J233Q74J059J768J413
55443G5669K71M74J916J949K1j175l67L54l40p40K76R36n1j064n95K22J64J41
55425G8061R37J337M64m49m07l78j090j446p18N4K09O46J548J526L63n2J051J766
$$ plain form
55407 83422 84091 83100 81422 79763 78379 77983 78862 79718 79256 78208 77916 77930 77144 76304 76947 78645 79732
55390 79732 80067 80693 81486 81651 81846 83182 84653 84290 82423 81144 80975 80786 80589 81456 82853 83006 82065
55373 82065 82077 83597 85026 85556 86086 86949 87346 87489 88697 90841 92113 91813 91043 90257 88594 86198 84666
55356 84666 84404 83847 82100 80241 79219 78572 78012 78252 79379 80276 80474 80809 81543 81672 80800 79967 79833 79756
55338 79756 79361 79399 80260 81175 81556 81721 81790 81415 81070 81959 83995 85385 84895 83164 81353 79922 79147 79258
55320 79258 79527 78746 77149 76453 77475 79142 80284 80985 81699 82437 83339 84691 85909 85808 84314 82716
55304 82716 81895 81484 81003 80525 80049 79433 79118 79696 80793 81583 82182 83117 83818 83343 82332 82339 83426 84366 85052
55285 85052 86475 88317 88948 88067 87077 86487 85257 83224 81843 81773 81910 81495 81107 80880 79956 78497 78059
$$ packed form
55407H3422O69r91j678j659j384l96Q79Q56m62j048k92J4p86q40O43J698J087
55390G9732L35O26P93J65J95J336J471l63j867j279j69j89j97Q67J397J53r41
55373H2065J2J520J429N30N30Q63L97J43J208K144J272l00p70p86j663k396j532
55356H4666k62n57j747j859j022o47n60K40J127Q97J98L35P34J29q72q33j34p7
55338G9756l95L8Q61R15L81J65O9l75l45Q89K036J390m90j731j811j431p75J11
55320G9258K69p81j597o96J022J667J142P01P14P38R02J352J218j01j494j598
55304H2716q21m11m81m78m76o16l15N78J097P90N99R35P01m75j011PJ087R40O86
55285H5052J423J842O31q81r90n90j230k033j381p0J37m15l88k27r24j459m38
$$ plain form
55268 78059 79024 79835 79782 80346 82519 84883 85772 85545 85309 85074 84636 84715 85763 86902 87333 87569 88117 88305
55250 88305 87603 86869 87067 87829 88342 88571 88619 88031 86708 85451 84748 84121 83389 83281 84002 84590 84633 85252 87290
55231 87290 89711 90904 90569 89413 88044 87018 86926 87619 88247 88586 89207 89941 89722 88504 87751 88256 89065
55214 89065 89414 89989 91273 92323 92458 92589 93541 94472 94306 93394 92425 90973 88585 86118 84560 83540 82391
55197 82391 81646 82078 83160 83885 84358 85294 86630 87759 88390 88262 86888 84622 83000 82901 83298 82935 82221
55180 82221 82254 82864 83006 82375 81429 80385 79284 78429 77776 76603 74759 73521 74158 76297 78556 80134 80960
55163 80960 81160 81318 82454 84789 87220 88783 89772 90669 91079 90717 90393 90866 91610 91786 91614 91696 91828 91589
55145 91589 91282 91262 91117 90526 90067 90153 90103 89317 88488 88503 89012 89240 89321 89576 89328 87841 85793 84565 84573 85312
$$ packed form
55268G8059R65Q11n3N64K173K364Q89k27k36k35m38P9J048J139M31K36N48J88
55250H8305p02p34J98P62N13K29M8n88j323j257p03o27p32j08P21N88M3O19K038
55231H7290K421J193l35j156j369j026r2O93O28L39O21P34k19j218p53N05Q09
55214H9065L49N75J284J050J35J31R52R31j66r12r69j452k388k467j558j020j149
55197H2391p45M32J082P25M73R36J336J129O31j28j374k266j622r9L97l63p14
55180H2221L3O10J42o31r46j044j101q55o53j173j844j238O37K139K259J578Q26
55163H0960K00J58J136K335K431J563R89Q97M10l62l24M73P44J76j72Q2J32k39
55145I1589l07k0j45n91m59Q6n0p86q29J5N09K28Q1K55k48j487k048j228QP39
$$ plain form
55125 85312 86377 87401 87717 87222 86910 87504 88308 88391 88001 87637 86706 84559 82090 80840 81027 81819 82987
55108 82987 84903 87342 89632 91680 93740 95578 96877 97961 99105 99758 99588 99587 100812 102641 103562 103242
55092 103242 102539 101958 101472 101485 102598 104526 106374 107753 108700 108971 108507 108117 108513 109054 108583 107157 105807
55075 105807 104978 104359 103896 103869 104239 104845 105833 106952 107138 105919 104528 104349 104920 104880 104217 103914 103903 103278 102308
55056 102308 102292 103267 103695 102828 101775 101575 101641 100936 99694 99061 99597 100791 101727 101855 101281 100503 99771 98920
55038 98920 97965 97403 97528 97915 98129 98472 99394 100585 101314 101323 100868 100353 100414 101687 103795 105267 105249 104610 104579
55019 104579 105057 105210 104961 104756 104476 103730 102722 101819 100810 99611 99008 99560 100399 100471 100311 101191 102964 104265
55001 104265 104586 104676 105037 105430 105827 106584 107590 108359 108953 109842 110941 111791 112477 113352 114069 113938 113055 112042
$$ packed form
55125H5312J065J024L16m95l12N94Q04Q3l90l64r31k147k469j250J87P92J168
55108H2987J916K439K290K048K060J838J299J084J144O53j70jJ225J829R21l20
55092A03242p03n81m86J3J113J928J848J379R47K71m64l90L96N41m71j426j350
55075A05807q29o19m63k7L70O06R88J119J86j219j391j79N71m0o63l03j1o25r70
55056A02308j6R75M28q67j053k00O6p05j242o33N36J194R36J28n74p78p32q51
55038I8920r55n62J25L87K14L43R22J191P29Rm55n15O1J273K108J472j8o39l1
55019A04579M78J53k49k05k80p46j008r03j009j199o03N52Q39P2j60Q80J773J301
55001A04265L21R0L61L93L97P57J006P69N94Q89J099Q50O86Q75P17j31q83j013
$$ plain form
54983 112042 110890 109153 107095 105568 104898 104846 105364 106423 107441 107976 108558 109713 110633 110153 108650 107547
54967 107547 107236 107009 106815 107467 108996 110307 110728 110671 110580 110430 110388 110779 111243 111018 110203 109636 109488 109066 108116
54948 108116 107214 106822 106992 107972 109917 111978 112896 112650 112393 112690 112983 112905 112872 113078 113031 112455 111766 111392 111416
54929 111416 111965 113123 114516 115837 117612 120413 123594 126030 127959 130768 134933 139576 144217 149542
54915 149542 156076 163278 170325 176723 181851 184971 185984 185272 182706 177969 171945 166467 162283 158360
54901 158360 153656 148536 144054 140727 138427 136703 134933 132838 130897 129558 128237 126092 123602 122149
54887 122149 122098 122540 122977 123841 125178 126281 127043 128378 130771 133528 135975 138402 141459 145519 150899 157692
54871 157692 165095 171874 177673 182872 187162 189533 189788 188683 186308 181833 175340 168475 162651 157770
$$ packed form
54983A12042j152j737k058j527o70n2N18J059J018N35N82J155R20m80j503j103
54967A07547l11k27j94O52J529J311M21n7r1j50m2L91M64k25q15n67j48m22r50
54948A08116r02l92J70R80J945K061R18k46k57K97K93p8l3K06m7n76o89l74K4
54929A11416N49J158J393J321J775K801L181K436J929K809M165M643M641N325
54915A49542O534P202P047O398N128L120J013p12k566m737o024n478m184l923
54901A58360m704n120m482l327k300j724j770k095j941j339j321k145k490j453
54887A22149n1M42M37Q64J337J103P62J335K393K757K447K427L057M060N380O793
54871A57692P403O779N799N199M290K371K55j105k375m475o493o865n824m881
$$ plain form
54857 157770 153298 149308 145810 142246 138462 135154 132687 130444 127952 125658 123916 122171 119883 117404
54843 117404 115312 113621 112211 111260 110755 110321 109918 109877 109984 109480 108304 107322 106992 106887 106876 107512 108719 109347
54825 109347 108771 107863 107669 108150 108849 109734 110627 110864 110330 109959 110446 111334 112004 112647 113520 114235 114588 115209 116535
54806 116535 117962 118816 119347 119985 120414 120246 119943 120184 120848 121313 121235 120519 119143 117544 116526 116317 116413 116644
54788 116644 117426 118600 119165 118828 118646 119297 119805 118967 117113 115413 114278 113483 113147 113543 114448 115634 117534
54771 117534 120590 124474 128681 133342 138669 144165 149174 153756 158423 163530 169457 176590 184419 191354
54757 191354 196183 199081 200549 200187 197356 192371 186118 179055 171418 163815 156826 150524 145000 140748
54743 140748 137852 135566 133417 131958 131631 131725 131361 130738 130385 129996 129063 128018 127563 127431 126956 126403 126565
$$ packed form
54857A57770m472l990l498l564l784l308k467k243k492k294j742j745k288k479
54843A17404k092j691j410r51n05m34m03m1J07n04j176r82l30j05j1O36J207O28
54825A09347n76r08j94M81O99Q85Q93K37n34l71M87Q88O70O43Q73P15L53O21J326
54806A16535J427Q54N31O38M29j68l03K41O64M65p8p16j376j599j018k09R6K31
54788A16644P82J174N65l37j82O51N08q38j854j700j135p95l36L96R05J186J900
54771A17534L056L884M207M661N327N496N009M582M667N107N927P133P829O935
54757A91354M829K898J468l62k831m985o253p063p637p603o989o302n524m252
54743A40748k896k286k149j459l27R4l64o23l53l89r33j045m55j32m75n53J62
$$ plain form
54726 126565 127463 128555 129964 132377 135935 140203 145118 150966 157558 164254 170743 177066 182926 187663
54712 187663 190786 192045 191213 188310 183724 177684 170124 161537 153375 146924 142266 138930 136812 135745
54698 135745 134924 133752 132723 132510 132737 132622 132297 132397 132703 132325 131009 129312 127643 126079 124922 124517
54682 124517 124579 124406 123677 122436 120682 118622 116966 116151 115603 114515 113036 111947 111600 111959 113140 114912
54666 114912 116098 115629 114044 112909 112866 113224 113369 113515 114006 114806 115879 117308 118841 119825 119742 118477 116292
54649 116292 113897 112251 111717 111705 111588 111571 112106 112997 113795 114605 115745 117003 118007 118914 119939 120643 120537
54632 120537 119988 119648 119440 119007 118696 119037 119585 119405 118471 117564 117022 116633 116502 116856 117139 116512 115287 114730
54614 114730 115384 116619 117860 119218 120701 121876 122546 122941 123001 122281 120746 118932 117235 115775 114940 115134
$$ packed form
54726A26565Q98J092J409K413L558M268M915N848O592O696O489O323N860M737
54712A87663L123J259q32k903m586o040p560q587q162o451m658l336k118j067
54698A35745q21j172j029k13K27j15l25J00L06l78j316j697j669j564j157m05
54682A24517O2j73p29j241j754k060j656q15n48j088j479j089l47L59J181J772
54666A14912J186m69j585j135m3L58J45J46M91Q00J073J429J533R84q3j265k185
54649A16292k395j646n34j2j17j7N35Q91P98Q10J140J258J004R07J025P04j06
54632A20537n49l40k08m33l11L41N48j80r34r07n42l89j31L54K83o27j225n57
54614A14730O54J235J241J358J483J175O70L95O0p20j535j814j697j460q35J94
$$ plain form
54598 115134 115902 116213 115829 115536 115790 116001 115546 114756 114454 115037 116301 117697 118516 118316 117452 116869 117232 118513
54580 118513 120304 122082 123313 123773 123774 123690 123419 122799 122215 122098 122073 121444 120446 120117 120849 121854 122307 122367 122789
54561 122789 123989 125734 127396 128427 128821 129059 129402 129522 129215 129024 129530 130375 130717 130426 130134 130251 130680
54544 130680 131391 132525 133974 135463 136978 138519 139658 140027 140051 140397 140852 140576 139425 138212 137557 137238
54528 137238 136737 135820 134507 133089 132164 132097 132430 132354 131708 131027 130767 131043 131896 133173 134329 134931 135202 135527
54510 135527 135791 135841 136059 136611 136618 135155 132786 130893 129695 128166 125931 123920 122915 122620 122608 123176 124628
54493 124628 126428 127651 127954 127776 127821 128372 128862 128288 126429 124350 123255 123291 123981 125184 126790 128028 128248
54476 128248 127977 128130 128607 128863 129414 131233 133869 135776 136577 137399 138766 139738 139686 139486 140270 142089 144369
$$ packed form
54598A15134P68L11l84k93K54K11m55p90l02N83J264J396Q19k00q64n83L63J281
54580A18513J791J778J231M60Jq4k71o20n84j17k5o29r98l29P32J005M53O0M22
54561A22789J200J745J662J031L94K38L43J20l07j91N06Q45L42k91k92J17M29
54544A30680P11J134J449J489J515J541J139L69K4L46M55k76j151j213o55l19
54528A37238n01r17j313j418r25o7L33p6o46o81k60K76Q53J277J156O02K71L25
54510A35527K64N0K18N52Pj463k369j893j198j529k235k011j005k95j2N68J452
54493A24628J800J223L03j78M5N51M90n74j859k079j095L6O90J203J606J238K20
54476A28248k71J53M77K56N51J819K636J907Q01Q22J367R72n2k00P84J819K280
$$ plain form
54459 144369 146630 148273 148687 148130 147639 147628 147457 146725 145906 145295 144412 143058 141957 141687 141827 141782 141698 141984
54441 141984 142623 143403 144152 144384 143528 141881 140477 139676 138809 137592 136823 137133 138040 138916 139897 141147 142194
54424 142194 142815 143737 145553 147685 149315 150673 152378 154072 154766 154270 153387 152823 152650 152702 152875 153021 152985
54407 152985 152746 152294 151582 150756 150156 149911 149883 150136 150967 152314 153608 154454 154994 155481 155959 156505 157222 157852
54389 157852 158008 157903 158237 159215 160303 161058 161419 161150 159845 157764 155799 154412 153410 152918 153533 155215
54373 155215 157044 158488 159915 161455 162425 162529 162579 163399 164913 166948 169918 173894 177895 180973 183253
54358 183253 185164 186493 187025 187259 187539 187191 185565 183286 181478 180237 178874 177178 175435 173560 171205
54343 171205 168528 166035 163871 161997 160767 160566 161045 161396 161138 160177 158498 156413 154690 153770 153199 152445
$$ packed form
54459A44369K261J643M14n57m91j1j71p32q19o11q83j354j101k70J40m5q4K86
54441A41984O39P80P49K32q56j647j404q01q67j217p69L10R07Q76R81J250J047
54424A42194O21R22J816K132J630J358J705J694O94m96q83n64j73N2J73J46l6
54407A52985k39m52p12q26o00k45k8K53Q31J347J294Q46N40M87M78N46P17O30
54389A57852J56j05L34R78J088P55L61k69j305k081j965j387j002m92O15J682
54373A55215J829J444J427J540R70J04N0Q20J514K035K970L976M001L078K280
54358A83253J911J329N32K34K80l48j626k279j808j241j363j696j743j875k355
54343A71205k677k493k164j874j230k01M79L51k58r61j679k085j723r20n71p54
$$ plain form
54327 152445 151792 151695 151722 151072 149885 149157 149459 150469 151673 152820 153688 154040 153889 153434 152784 152074 151683 151953
54309 151953 152843 154014 155024 155269 154282 152410 150651 149431 148095 146108 144164 143419 144072 145321 146356
54294 146356 146849 146854 146860 147598 149171 150603 150788 149670 148089 146775 145956 145605 145576 145736 146300 147662 149671 151515
54276 151515 152643 153235 153497 153215 152446 151903 152114 152878 154016 155806 157996 159295 158764 157091 155564 154462
54260 154462 153374 152470 152316 152835 153525 154467 156147 158449 160620 162112 162787 162679 162227 162315 163243 164095 163959
54243 163959 163282 163116 163426 163298 162495 161683 161184 160613 159804 159174 159064 159434 160179 161109 161731 161764 161739 162410 163753
54224 163753 165201 166551 167855 168737 168692 167868 166698 165067 162764 160480 159260 159025 158733 157954 157253 156927
54208 156927 156487 155579 154504 153489 152301 150909 149840 149536 149859 150381 150700 150515 149918 149573 149988 150709 150909
$$ packed form
54327A52445o53r7K7o50j187p28L02J010J204J147Q68L52j51m55o50p10l91K70
54309A51953Q90J171J010K45r87j872j759j220j336j987j944p45O53J249J035
54294A46356M93NOP38J573J432J85j118j581j314q19l51k9J60N64J362K009J844
54276A51515J128N92K62k82p69n43K11P64J138J790K190J299n31j673j527j102
54260A54462j088r04j54N19O90R42J680K302K171J492O75j08m52Q8R28Q52j36
54243A63959o77j66L10j28q03q12m99n71q09o30j10L70P45R30O22L3k5O71J343
54224A63753J448J350J304Q82m5q24j170j631k303k284j220k35k92p79p01l26
54208A56927m40r08j075j015j188j392j069l04L23N22L19j85n97l45M15P21K00
$$ plain form
54191 150909 150629 150687 151437 152428 153270 154028 154694 155107 155464 156142 156966 157394 157485 157837 158479 158694 158179 157550 157449
54172 157449 157900 158759 159973 161066 161159 160038 158624 157937 157954 157870 157106 155772 154430 153655 153623 154049 154666 155643
54154 155643 157186 158905 160078 160428 160207 159675 159032 158637 158671 158718 158322 157755 157549 157512 157073 156436 156413 157142 158012
54135 158012 158924 160478 162626 164214 164400 163676 162995 162664 162556 162658 162779 162331 161054 159539 158557 158251 158439
54118 158439 159217 160684 162354 163437 163650 163495 163763 164938 166858 168840 170254 171062 171629 172144 172545 172893
54102 172893 173375 173911 174207 174262 174423 175004 176204 178301 181436 185305 189594 194568 200584 207033 212465 215764
54086 215764 216692 215362 212068 207706 203509 200043 197004 194073 191322 188725 186089 183655 182030 181298 180930
54071 180930 180755 181171 182129 182833 182887 182887 183351 183908 184200 184801 186401 188632 190558 192001 193609 195843 198560
$$ packed form
54191A50909k80N8P50R91Q42P58O66M13L57O78Q24M28R1L52O42K15n15o29j01
54172A57449M51Q59J214J093R3j121j414o87J7q4p64j334j342p75l2M26O17R77
54154A55643J543J719J173L50k21n32o43l95L4M7l96n67k06l7m39o37k3P29Q70
54135A58012R12J554K148J588J86p24o81l31j08J02J21m48j277j515r82l06J88
54118A58439P78J467J670J083K13j55K68J175J920J982J414Q08N67N15M01L48
54102A72893M82N36K96N5J61N81J200K097L135L869M289M974O016O449N432L299
54086B15764R28j330l294m362m197l466l039k931k751k597k636k434j625p32l68
54071A80930j75M16R58P04N4%M64N57K92O01J600K231J926J443J608K234K717
$$ plain form
54054 198560 201447 204264 206734 208671 210161 211295 211875 211758 211273 210897 210656 210278 209823 209831 210859 213106 216461
54037 216461 220671 225466 230598 235766 240571 244784 248660 252648 256681 260136 262717 265014 267822 271081
54023 271081 273876 275496 276201 276867 278038 279473 280602 281168 281181 280444 278619 275859 272844 269852 266346 261927
54007 261927 257166 252852 248826 244430 239786 235709 232419 229335 226243 223689 221906 220241 218131 215956
53993 215956 214348 213180 211794 209919 207891 206165 204929 204106 203481 202910 202424 202006 201411 200519 199740 199644 200184
53976 200184 200704 200638 199825 198338 196637 195757 196526 198500 200329 201314 201943 202782 203643 204204 204796 206119 208559
53959 208559 212061 216207 220227 223481 226293 229988 235844 244313 255248 268244 282389 296117 307680
53946 307680 315671 319221 318233 313604 306846 299313 292054 286135 282351 280534 279744 279278 278987 278682 278003 277011
$$ packed form
54054A98560K887K817K470J937J490J134N80j17m85l76k41l78m55QJ028K247L355
54037B16461M210M795N132N168M805M213L876L988M033L455K581K297K808L259
54023B71081K795J620P05O66J171J435J129N66J3p37j825k760l015k992l506m419
54007B61927m761m314m026m396m644m077l290l084l092k554j783j665k110k175
53993B15956j608j168j386j875k028j726j236q23o25n71m86m18n95q92p79r6N40
53976B00184N20o6q13j487j701q80P69J974J829R85O29Q39Q61N61N92J323K440
53959B08559L502M146M020L254K812L695N856Q469J0935J2996J4145J3728J1563
53946C07680P991L550r88m629o758p533p259n919l784j817p90m66k91l05o79r92
$$ plain form
53930 277011 276181 275667 275261 275175 276055 277964 280184 282319 284786 287806 290755 293019 294887 297095 300078 304077
53914 304077 309389 316036 323634 331896 340698 349401 356819 362377 366660 370354 373242 374750 374947 374377 373353
53899 373353 371963 370413 368859 367126 364931 362172 358844 355034 351061 347146 342918 337853 332210 326698
53885 326698 321167 314636 306930 299258 292675 287019 281904 277670 274453 271270 267144 262493 258388 254965
53871 254965 251618 248348 245807 244106 242477 240174 237118 233735 230702 228702 227941 227925 228011 227872 227186 225383
53855 225383 222305 218696 215469 212735 210053 207367 205190 204050 204099 205036 206102 206482 206020 205247 204609 204183
53839 204183 204238 205240 206906 208098 208165 207744 207638 207724 207593 207559 208178 209314 210470 211535 212483 212871 212481 211970
53821 211970 212110 212788 213448 214044 214745 215141 214644 213356 211872 210630 210126 211198 214147 218002 221554 224785
$$ packed form
53930B77011q30n14m06q6Q80J909K220K135K467L020K949K264J868K208K983L999
53914C04077N312O647P598Q262Q802Q703P418N558M283L694K888J508J97n70j024
53899C73353j390j550j554j733k195k759l328l810l973l915m228n065n643n512
53885C26698n531o531p706p672o583n656n115m234l217l183m126m651m105l423
53871B54965l347l270k541j701j629k303l056l383l033k000p61j6Q6j39o86j803
53855B25383l078l609l227k734k682k686k177j140M9R37J066L80m62p73o38m26
53839B04183N5J002J666J192O7m21j06Q6j31l4O19J136J156J065R48L88l90n11
53821B11970J40O78O60N96P01L96m97j288j484j242n04J072K949L855L552L231
$$ plain form
53805 224785 228437 232598 236681 240450 244105 247595 250845 254431 259033 264364 269512 274128 278442 282328
53791 282328 285378 287764 290045 292182 293657 294535 295475 296731 298030 299264 300385 300705 299358 296484 292948
53776 292948 288911 283820 278002 272990 269688 267121 263639 258730 253224 248331 244945 243329 242952 242818 242221
53761 242221 240997 239132 236596 233583 230439 227290 224222 221766 220546 220286 219819 218322 216108 214096 212895
53746 212895 212530 212576 212416 211731 210855 210385 210479 210863 211375 212029 212668 213098 213511 214288 215493 217034 219109 221810
53728 221810 224389 225725 225602 224910 224508 224510 224779 225445 226656 228288 230084 231743 232946 233684 234529 236011 237875
53711 237875 239528 241151 243573 246957 250414 253142 255311 257503 259919 262485 265245 268236 271326 274523
53697 274523 278191 282597 287391 291816 295470 298727 302289 306257 309778 311935 312863 313418 313711 312838 310483
$$ packed form
53805B24785L652M161M083L769L655L490L250L586M602N331N148M616M314L886
53791B82328L050K386K281K137J475Q78R40J256J299J234J121L20j347k874l536
53776B92948m037n091n818n012l302k567l482m909n506m893l386j616l77j34n97
53761B42221j224j865k536l013l144l149l068k456j220k60m67j497k214k012j201
53746B12895l65M6j60o85q76m70R4L84N12O54O39M30M13P77J205J541K075K701
53728B21810K579J336j23o92m02KK69O66J211J632J796J659J203P38Q45J482J864
53711B37875J653J623K422L384L457K728K169K192K416K566K760K991L090L197
53697B74523L668M406M794M425L654L257L562L968L521K157R28N55K93q73k355
$$ plain form
53682 310483 307886 306375 305560 304046 301536 299140 297700 296840 295816 294449 293059 292084 291812 291967 291624 290117
53666 290117 287909 286019 284847 284199 284109 284719 285539 285782 285397 284951 284596 284058 283532 283590 284193 284763 285240 286054
53648 286054 287030 287392 287036 286794 287220 288098 289321 291227 293756 296276 298587 301172 304111 306751 308793 310785
53632 310785 313076 315206 316790 318143 319560 320851 322058 323781 326338 329462 333261 338438 344862 350908
53618 350908 355132 357941 360802 364413 368423 372395 376194 379790 383343 387155 391036 394210 396375 398312
53604 398312 400880 403876 406490 408395 409810 411021 412478 414758 417673 419834 419990 418572 417197 416885 417479
53589 417479 418501 419627 420293 419738 417800 415290 413286 412219 411712 411061 409826 408097 406207 404218 401893
53574 401893 399171 396398 393953 391906 390180 388752 387529 386273 384824 383278 381872 380868 380471 380613 380882
$$ packed form
53682C10483k597j511q15j514k510k396j440q60j024j367j390r75k72J55l43j507
53666B90117k208j890j172o48r0O10Q20K43l85m46l55n38n26N8O03N70M77Q14
53648B86054R76L62l56k42M26Q78J223J906K529K520K311K585K939K640K042J992
53632C10785K291K130J584J353J417J291J207J723K557L124L799N177O424O046
53618C50908M224K809K861L611M010L972L799L596L553L812L881L174K165J937
53604C98312K568K996K614J905J415J211J457K280K915K161J56j418j375l12N94
53589D17479J022J126O66n55j938k510k004j067n07o51j235j729j890j989k325
53574D01893k722k773k445k047j726j428j223j256j449j546j406j004l97J42K69
$$ plain form
53559 380882 380921 380720 380254 379265 377963 377479 378700 380870 382344 382686 382962 383973 385405 386969 389104 392007
53543 392007 395067 397881 400868 404293 407669 410860 414791 420178 426319 432044 437286 442867 449332 456791
53529 456791 465348 474894 484922 495275 506528 518965 531825 544352 556986 570597 585158 600157
53517 600157 615791 632626 650420 668435 686805 706501 727973 750734 774370 799074 824990
53506 824990 851678 878360 904337 929271 953549 978125 1003406 1028495 1052073 1073796 1094238
53495 1094238 1113852 1132779 1151380 1170049 1188580 1206557 1224341 1242856 1262331 1282031 1301287
53484 1301287 1320093 1338603 1356781 1374753 1392853 1410999 1428499 1444732 1459611 1473212 1485251
53473 1485251 1495106 1502149 1506093 1507273 1506460 1504026 1499438 1491966 1481712 1469458 1455720 1440655 1424866
$$ packed form
53559C80882L9k01m66r89j302m84J221K170J474L42K76J011J432J564K135K903
53543C92007L060K814K987L425L376L191L931N387O141N725N242N581O465P459
53529D56791Q557R546J0028J0353J1253J2437J2860J2527J2634J3611J4561J4999
53517F00157J5634J6835J7794J8015J8370J9696K1472K2761K3636K4704K5916
53506H24990K6688K6682K5977K4934K4278K4576K5281K5089K3578K1723K0442
53495A094238J9614J8927J8601J8669J8531J7977J7784J8515J9475J9700J9256
53484A301287J8806J8510J8178J7972J8100J8146J7500J6233J4879J3601J2039
53473A485251R855P043L944J180q13k434m588p472j0254j2254j3738j5065j5789
$$ plain form
53460 1424866 1409501 1395160 1381145 1366093 1349147 1330424 1310638 1290488 1270275 1249968 1229599
53449 1229599 1209425 1189636 1170181 1151072 1132492 1114387 1096389 1078691 1062598 1049543 1039691
53438 1039691 1032101 1026128 1021933 1019608 1018544 1017991 1017756 1018063 1019068 1020849 1023738 1028351 1035167 1043919 1053433
53423 1053433 1062377 1070497 1078989 1089467 1102739 1118676 1136828 1156671 1177558 1199065 1221422 1245209
53411 1245209 1270642 1297503 1325685 1355431 1387033 1420587 1456004 1493054 1531461 1571201 1612602
53400 1612602 1655976 1701324 1748587 1797932 1849515 1903131 1958391 2014986 2072616 2130884 2189513
53389 2189513 2248247 2306366 2362850 2417446 2470949 2523831 2575112 2623341 2668290 2710756 2750931
53378 2750931 2787938 2821010 2850193 2875576 2896573 2912396 2922819 2928063 2928124 2922445 2910220 2890969
$$ packed form
53460A424866j5365j4341j4015j5052j6946j8723j9786k0150k0213k0307k0369
53449A229599k0174j9789j9455j9109j8580j8105j7998j7698j6093j3055r852
53438A039691p590n973m195k325j064n53k35L07J005J781K889M613O816Q752R514
53423A053433Q944Q120Q492J0478J3272J5937J8152J9843K0887K1507K2357K3787
53411A245209K5433K6861K8182K9746L1602L3554L5417L7050L8407L9740M1401
53400A612602M3374M5348M7263M9345N1583N3616N5260N6595N7630N8268N8629
53389B189513N8734N8119N6484N4596N3503N2882N1281M8229M4949M2466M0175
53378B750931L7007L3072K9183K5383K0997J5823J0423N244O1n679j2225j9251
$$ plain form
53366 2890969 2864851 2832374 2793875 2749633 2700600 2648515 2594886 2540237 2484689 2428855 2373631
53355 2373631 2319448 2266367 2214728 2165116 2117772 2072513 2029120 1987376 1946840 1906988 1867424
53344 1867424 1827735 1787571 1747346 1708413 1671981 1638122 1606376 1576852 1550039 1525904 1504027
53333 1504027 1484427 1467472 1453054 1440542 1429393 1419094 1408685 1397090 1383936 1369537 1354302
53322 1354302 1338803 1323997 1310505 1297834 1285159 1272635 1261047 1250415 1240117 1230347 1222267 1216524
53310 1216524 1212630 1209957 1208329 1207444 1206802 1206680 1208169 1211803 1217013 1223431 1231801 1242956 1256629 1272021
53296 1272021 1288991 1307985 1329190 1352346 1377162 1403410 1430740 1458658 1486540 1513641 1539454
53285 1539454 1564065 1587758 1610259 1630907 1649433 1665862 1679627 1689688 1695735 1698411 1698083 1694362
$$ packed form
53366B890969k6118l2477l8499m4242m9033n2085n3629n4649n5548n5834n5224
53355B373631n4183n3081n1639m9612m7344m5259m3393m1744m0536l9852l9564
53344A867424l9689m0164m0225l8933l6432l3859l1746k9524k6813k4135k1877
53333A504027j9600j6955j4418j2512j1149j0299j0409j1595j3154j4399j5235
53322A354302j5499j4806j3492j2671j2675j2524j1588j0632j0298r770q080n743
53310A216524l894k673j628q85o42j22J489L634N210O418Q370J1155J3673J5392
53296A272021J6970J8994K1205K3156K4816K6248K7330K7918K7882K7101K5813
53285A539454K4611K3693K2501K0648J8526J6429J3765J0061O047K676l28l721
$$ plain form
53273 1694362 1687235 1677660 1666303 1652551 1635591 1615868 1594553 1572050 1547896 1521920 1494655 1466716
53261 1466716 1438462 1410193 1382063 1353686 1324358 1293810 1262566 1231552 1201543 1172875 1145493
53250 1145493 1119242 1094098 1069963 1046314 1022506 998444 974528 950832 926912 902709 879072
53239 879072 856956 836497 817313 799345 782952 768385 755608 744501 734889 726487 719035 712325
53227 712325 705961 699342 692070 684112 675436 665803 655125 643620 631372 618101 603632 588290 572613
53214 572613 556981 541737 527282 513809 501305 489974 480124 471401 462761 453661 444754 436875 429835
53201 429835 422791 415306 407347 398667 389103 379301 370244 362041 354004 346015 338990 333600 329194 324557
53187 324557 319328 314200 309921 306546 303607 300618 297337 293813 290360 287333 284775 282359 279789 277170
$$ packed form
53273A694362p127r575j1357j3752j6960j9723k1315k2503k4154k5976k7265k7939
53261A466716k8254k8269k8130k8377k9328l0548l1244l1014l0009k8668k7382
53250A145493k6251k5144k4135k3649k3808k4062k3916k3696k3920k4203k3637
53239H79072k2116k0459j9184j7968j6393j4567j2777j1107r612q402p452o710
53227G12325o364o619p272p958q676r633j0678j1505j2248j3271j4469j5342j5677
53214E72613j5632j5244j4455j3473j2504j1331r850q723q640r100q907p879p040
53201D29835p044p485p959q680r564r802r057q203q037p989p025n390m406m637
53187C24557n229n128m279l375k939k989l281l524l453l027k558k416k570k619
$$ plain form
53173 277170 274804 272677 270482 268237 266551 265950 266228 266812 267542 268611 269806 270402 269976 268885 267712 266598
53157 266598 265351 263970 262794 262220 262373 262912 263142 262510 261067 259331 257750 256433 255277 254063 252582
53142 252582 251049 250245 250724 251976 252889 253099 253330 254277 255721 256975 257762 258338 259060 260001 260766 260709 259657
53125 259657 258369 257836 258250 259121 260305 262134 264547 266924 268977 270960 272808 273977 274537 275458 277211
53110 277211 278933 279682 279774 279947 279892 278657 276186 273450 271114 268954 266560 263946 261378 259221 257939 257681
53094 257681 257864 257701 257161 256885 257126 257277 256614 255114 253411 252177 251674 251702 251890 252036 252101 251926 251289 250431
53076 250431 250126 250880 252299 253532 254083 253893 253042 251806 250694 249888 248877 247197 245323 244174 243782 243175
53060 243175 241684 239860 238805 238967 239819 240444 240259 239367 238405 237999 238305 239095 240150 241433 242921 244443
$$ packed form
53173B77170k366k127k195k245j686o01K78N84P30J069J195N96m26j091j173j114
53157B66598j247j381j176n74J53N39K30o32j443j736j581j317j156j214j481
53142B52582j533q04M79J252R13K10K31R47J444J254P87N76P22R41P65n7j052
53125B59657j288n33M14Q71J184J829K413K377K053J983J848J169N60R21J753
53110B77211J722P49R2J73n5j235k471k736k336k160k394k614k568k157j282k58
53094B57681J83j63n40k76K41J51o63j500j703j234n03K8J88J46O5j75o37q58
53076B50431l05P54J419J233N51j90q51j236j112q06j011j680j874j149l92o07
53060B43175j491j824j055J62Q52O25j85q92r62m06L06P90J055J283J488J522
$$ plain form
53044 244443 245698 246401 246522 246390 246338 246236 245697 244869 244534 245062 245649 245110 243260 241070 239518 238724 238208 237641
53026 237641 237240 237634 239354 242258 245462 248003 249511 250201 250449 250609 250987 251629 252198 252316 252065 251941 252385
53009 252385 253425 254688 255683 256207 256588 257264 258086 258374 257799 256841 256080 255433 254498 253342 252454 252051 251907 251813
52991 251813 251862 252275 253193 254576 256105 257324 258160 259174 261016 263675 266472 268716 270205 271220 272226
52976 272226 273573 275383 277746 280803 284285 287139 288266 287806 287049 286813 286577 285623 284340 283732 284104 284928
52960 284928 285650 285979 285728 285146 285115 286240 287795 288302 287132 284946 282639 280575 278821 277401 276096 274544
52944 274544 272681 270709 268620 266273 263909 261994 260478 258839 257095 256125 256650 258249 259744 260265 259735
52929 259735 258659 257738 257467 257749 257974 257680 257086 256880 257468 258474 259026 258603 257605 256914 256877 257036 256964 256880 257114
$$ packed form
53044B44443J255P03J21j32n2j02n39q28l35N28N87n39j850k190j552p94n16n67
53026B37641m01L94J720K904L204K541J508O90K48J60L78O42N69J18k51j24M44
53009B52385J040J263R95N24L81O76Q22K88n75r58p61o47r35j156q88m03j44r4
52991B51813M9M13R18J383J529J219Q36J014J842K659K797K244J489J015J006
52976B72226J347J810K363L057L482K854J127m60p57k36k36r54j283o08L72Q24
52960B84928P22L29k51n82l1J125J555N07j170k186k307k064j754j420j305j552
52944B74544j863j972k089k347k364j915j516j639j744r70N25J599J495N21n30
52929B59735j076r21k71K82K25k94n94k06N88J006N52m23r98o91l7J59p2q4K34
$$ plain form
52910 257114 257439 257548 257873 259120 261010 262224 261821 260201 258447 257148 256192 255353 254734 254674 255333 256356 257046
52893 257046 257067 256864 257094 257747 258234 258297 258354 258812 259495 260002 260296 260637 261086 261381 261287 260926 260714 261038 261935 263075
52873 263075 264033 264592 264872 265308 266382 268117 269855 270875 271280 271898 273215 274882 276466 278107 279986 281658
52857 281658 282544 282728 282688 282417 281458 279694 277469 274975 272084 268869 265771 263130 260849 258601 256142 253505
52841 253505 251100 249419 248354 247107 245189 243188 241993 241567 241139 240418 239852 239747 239916 240238 240880 241792
52825 241792 242584 242985 242893 241943 239777 236888 234518 233441 233390 233869 234823 236156 237296 237806 238053 238761 240151
52808 240151 241867 243467 244618 245082 244884 244392 243916 243393 242603 241584 240618 239924 239426 238692 237211 235022 233065
52791 233065 232454 233229 234184 234113 232980 231751 231383 232152 233615 234966 235625 235674 235599 235628 235608 235489 235513 235774 235997
$$ packed form
52910B57114L25J09L25J247J890J214m03j620j754j299r56q39o19o0O59J023O90
52893B57046K1k03K30O53M87O3N7M58O83N07K94L41M49K95r4l61k12L24Q97J140
52873B63075R58N59K80M36J074J735J738J020M05O18J317J667J584J641J879J672
52857B81658Q86J84m0k71r59j764k225k494k891l215l098k641k281k248k459k637
52841B53505k405j681j065j247j918k001j195m26m28p21n66j05J69L22O42R12
52825B41792P92M01r2r50k166k889k370j077n1M79R54J333J140N10K47P08J390
52808B40151J716J600J151M64j98m92m76n23p90j019r66o94m98p34j481k189j957
52791B33065o11P75R55p1j133j229l68P69J463J351O59M9p5K9k0j19K4K61K23
$$ plain form
52772 235997 235934 235650 235168 234216 232634 230792 229334 228612 228554 228885 229271 229444 229407 229413 229623 229886 230016 230147 230660
52753 230660 231786 233358 234885 235931 236529 237201 238475 240421 242752 245202 247554 249502 250868 251905 253031
52738 253031 254338 255654 257006 258572 260194 261383 261857 261703 261034 260032 259377 260022 262161 264761 266425
52723 266425 266546 265464 263859 262238 260817 259583 258417 257168 255612 253538 251199 249479 249127 249799 250306
52708 250306 249956 249227 248951 249254 249573 249365 248490 247118 245589 244340 243735 243907 244734 245932 247191 248291 249035
52691 249035 249132 248424 247337 246723 246950 247473 247655 247722 248443 250107 252303 254464 256106 256812 256589 256055 255656 254947
52673 254947 253371 251497 250512 250552 250532 249781 248850 248412 248336 248285 248365 248624 248622 248165 247963 248898 251006 253615 256205
52654 256205 258727 261442 264770 268982 273720 278113 281600 284201 285841 285949 284163 281004 277476 274321
$$ packed form
52772B35997o3k84m82r52j582j842j458p22n8L31L86J73l7OK10K63J30J31N13
52753B30660J126J572J527J046N98O72J274J946K331K450K352J948J366J037J126
52738B53031J307J316J352J566J622J189M74j54o69j002o55O45K139K600J664
52723B66425J21j082j605j621j421j234j166j249j556k074k339j720l52O72N07
52708B50306l50p29k76L03L19k08q75j372j529j249o05J72Q27J198J259J100P44
52691B49035R7p08j087o14K27N23J82O7P21J664K196K161J642P06k23n34l99p09
52673B54947j576j874r85M0k0p51r31m38p6n1Q0K59km57k02R35K108K609K590
52654B56205K522K715L328M212M738M393L487K601J640J08j786l159l528l155
$$ plain form
52640 274321 271892 270309 269343 268453 267313 266085 265039 264263 263855 263939 264281 264478 264748 265942 268446 271643
52624 271643 274779 277694 280222 281583 281100 279178 276898 274920 273316 272219 271956 272585 273634 274319 273951
52609 273951 272492 270810 269949 269871 269467 268102 266577 266091 266789 267890 268779 269356 269671 269872 270290 271015 271561
52592 271561 271474 271076 271089 271661 272214 272207 271663 270988 270585 270613 270990 271700 273028 275157 277548 279245 279889 279929 279768
52573 279768 279458 279343 280006 281194 281736 281216 280756 281338 282202 281931 280427 278661 277011 275194 273543 272985 273628
52556 273628 274432 274509 273841 272599 270664 268165 265803 264243 263553 263341 263078 262363 261365 260966 261898 263749 265354
52539 265354 266148 266556 267068 267511 267420 266658 265643 265228 266252 268696 271436 273285 274155 274690 275065 274980 274693 275085
52521 275085 276459 278016 278845 278916 278824 279068 279853 281166 282778 284488 286479 289053 291955 294414 296079 297507
$$ packed form
52640B74321k429j583r66q90j140j228j046p76m08Q4L42J97K70J194K504L197
52624B71643L136K915K528J361m83j922k280j978j604j097k63O29J049O85l68
52609B73951j459j682q61p8m04j365j525m86O98J101Q89N77L15K01M18P25N46
52592B71561q7l98J3N72N53pn44o75m03K8L77P10J328K129K391J697O44M0j61
52573B79768l10j15O63J188N42n20m60N82Q64k71j504j766j650j817j651n58O43
52556B73628Q04P7o68j242j935k499k362j560o90k12k63p15r98l99R32J851J605
52539B65354P94M08N12M43r1p62j015m15J024K444K740J849Q70N35L75q5k87L92
52521B75085J374J557Q29P1r2K44P85J313J612J710J991K574K902K459J665J428
$$ plain form
52505 297507 299481 302092 304657 306314 306645 305905 304696 303224 300986 297498 293155 289004 285719 283202 281061
52490 281061 279032 276968 274921 273217 272066 271152 270062 268961 268296 267966 267469 266869 266873 267829 269356 271130
52474 271130 273242 275465 276962 277336 277417 278347 280253 282423 284478 286656 289023 291165 292870 294633 297108
52459 297108 300279 303449 305886 307200 307180 305730 303175 300296 297678 295154 292256 289090 286249 283946 281868
52444 281868 280028 278972 278744 278375 277051 275317 274424 274810 275881 276980 277726 277607 276181 273901 272016 271382
52428 271382 271756 272418 273027 273658 274328 274757 274555 273660 272644 272347 273049 274271 275569 277087 278970 280798 282210
52411 282210 283624 285667 288260 291075 294594 299830 307164 316258 326889 338819 350845 361014 368011
52398 368011 371559 371491 367564 360505 352254 344569 337988 332438 327978 324462 321234 317844 314591 311879 309526
$$ packed form
52505B97507J974K611K565J657L31p40j209j472k238l488m343m151l285k517k141
52490B81061k029k064k047j704j151r14j090j101o65l30m97o00MR56J527J774
52474B71130K112K223J497L74Q1R30J906K170K055K178K367K142J705J763K475
52459B97108L171L170K437J314k0j450k555k879k618k524k898l166k841k303k078
52444B81868j840j056k28l69j324j734q93L86J071J099P46j19j426k280j885o34
52428B71382L74O62O09O31O70M29k02q95j016k97P02J222J298J518J883J828J412
52411B82210J414K043K593K815L519N236P334R094J0631J1930J2026J0169O997
52398C68011L548o8l927p059q251p685o581n550m460l516l228l390l253k712k353
$$ plain form
52383 309526 307188 305014 303454 302816 303364 305364 308622 312379 316080 319799 323602 327056 329951 333030 337360
52368 337360 343193 349874 356560 362495 366866 369115 369479 368765 367547 365853 363693 361571 360299 360341 361373
52353 361373 362528 363184 363460 363848 364524 365340 366272 367446 368759 370026 371518 373781 376779 379823 382560 385527
52337 385527 389368 394044 399209 404939 411603 419353 428211 438443 450390 463907 478346 493126 508214
52324 508214 524049 541090 559412 578760 599030 620413 642753 665007 685950 705426 724422
52313 724422 743932 764231 785280 807110 829544 852104 874460 896553 918093 938480 957497
52302 957497 975617 993316 1010532 1027006 1042648 1057232 1070214 1081154 1089949 1096377 1099845 1099950
52290 1099950 1096877 1091071 1082966 1073297 1063057 1052792 1042365 1031706 1021217 1011204 1001618 992822
$$ packed form
52383C09526k338k174j560o38N48K000L258L757L701L719L803L454K895L079M330
52368C37360N833O681O686N935M371K249L64p14j218j694k160k122j272M2J032
52353C61373J155O56K76L88O76Q16R32J174J313J267J492K263K998L044K737K967
52337C85527L841M676N165N730O664P750Q858J0232J1947J3517J4439J4780J5088
52324E08214J5835J7041J8322J9348K0270K1383K2340K2254K0943J9476J8996
52313G24422J9510K0299K1049K1830K2434K2560K2356K2093K1540K0387J9017
52302I57497J8120J7699J7216J6474J5642J4584J2982J0940Q795O428L468J05
52290A099950l073n806q105r669j0240j0265j0427j0659j0489j0013r586q796
$$ plain form
52278 992822 985824 981102 977855 975171 973419 973621 975920 979646 984674 991779 1001583 1013910 1028173 1043686
52264 1043686 1059551 1074965 1089856 1104740 1119833 1134716 1149053 1163208 1177993 1194006 1211170
52253 1211170 1228643 1245156 1259840 1272789 1284538 1295013 1303258 1308292 1309920 1308581 1304610 1297852
52241 1297852 1288068 1275600 1261409 1246232 1229867 1211728 1192132 1172490 1154030 1136797 1120127
52230 1120127 1103574 1086932 1069920 1052619 1036057 1021658 1010007 1000472 991981 983844 975958 968667
52218 968667 962462 957525 953560 950245 947676 946109 945495 945581 946318 947824 950092 953045 956697 960833 964699
52203 964699 967513 969281 970713 972360 974217 976207 978575 981620 985333 989531 994170 999305 1004789 1010153
52189 1010153 1014944 1019200 1023457 1028069 1032607 1036177 1038309 1039213 1039163 1038038 1035568 1031565 1025774 1017941 1008358
$$ packed form
52278I92822o998m722l247k684j752K02K299L726N028P105R804J2327J4263J5513
52264A043686J5865J5414J4891J4884J5093J4883J4337J4155J4785J6013J7164
52253A211170J7473J6513J4684J2949J1749J0475Q245N034J628j339l971o758
52241A297852r784j2468j4191j5177j6365j8139j9596j9642j8460j7233j6670
52230A120127j6553j6642j7012j7301j6562j4399j1651r535q491q137p886p291
52218I68667o205m937l965l315k569j567o14Q6P37J506K268K953L652M136L866
52203I64699K814J768J432J647J857J990K368L045L713M198M639N135N484N364
52189A010153M791M256M257M612M538L570K132R04n0j125k470m003n791p833r583
$$ plain form
52174 1008358 998006 987929 978755 970927 964771 960014 955829 951901 948891 947324 946570 945737 945174 946184
52160 946184 949370 954108 959624 965694 972094 978130 983088 986703 988948 989829 989673 989201 988965 988941 988940 989210 990306
52143 990306 992501 995557 999064 1002776 1006518 1009877 1012240 1013333 1013644 1014110 1015372 1017597 1020968 1026053 1033574
52128 1033574 1044086 1057896 1074887 1094369 1115627 1138906 1165320 1195457 1228495 1263059 1298475
52117 1298475 1334660 1371203 1407203 1441827 1474516 1504842 1532669 1558228 1581542 1601951 1618782
52106 1618782 1632283 1643364 1652509 1659586 1664670 1668403 1671380 1673632 1674853 1674877 1673827 1671993 1669479 1665769
$$ packed form
52174A008358j0352j0077r174p828o156m757m185l928l010j567p54q33n63J010
52160I46184L186M738N516O070O400O036M958L615K245Q81j56m72k36k4jK70J096
52143I90306K195L056L507L712L742L359K363J093L11M66J262K225L371N085P521
52128A033574J0512J3810J6991J9482K1258K3279K6414L0137L3038L4564L5416
52117A298475L6185L6543L6000L4624L2689L0326K7827K5559K3314K0409J6831
52106A618782J3501J1081R145P077N084L733K977K252J221K4j050j834k514l710
$$ [...]
##END NTUPLES=NMR SPECTRUM
##END=
