
##TITLE=AC1316_SSVAH12145_6535240_8EwEVxWRDJ
##JCAMPDX= 6.0         $$ Bruker NMR JCAMP-DX V2.0
##DATA TYPE= NMR SPECTRUM
##DATA CLASS= NTUPLES
##ORIGIN= BRUKER
##OWNER= Administrator
$$ 1.72 TOPSPIN		Version 2.1
$$ 2012-07-17 19:36:34.734 -0500  Administrator@TOPSPIN
$$ Compression mode = diff/dup
##.OBSERVE FREQUENCY= 400.02188249412
##.OBSERVE NUCLEUS= ^1H
##.ACQUISITION MODE= SIMULTANEOUS (DQD)
##.ACQUISITION SCHEME= undefined
##.AVERAGES= 8
##.DIGITISER RES= 22
##SPECTROMETER/DATA SYSTEM= spect
##.PULSE SEQUENCE= zg30
##.SOLVENT NAME= COFFEE_meoh
##.SHIFT REFERENCE= INTERNAL, COFFEE_meoh, 1, 14.98509
##AUDIT TRAIL= $$ (NUMBER, WHEN, WHO, WHERE, PROCESS, VERSION, WHAT)
$$ ##TITLE= Audit trail, TOPSPIN		Version 2.1
$$ ##JCAMPDX= 5.01
$$ ##ORIGIN= Bruker BioSpin GmbH
$$ ##OWNER= Administrator
$$ $$ C:\Bruker\TOPSPIN/data/COFFEE/nmr/AC1316_SSVAH12145_6535240_8EwEVxWRDJ/10/pdata/1/auditp.txt
$$ ##AUDIT TRAIL=  $$ (NUMBER, WHEN, WHO, WHERE, PROCESS, VERSION, WHAT)
(   1,<2012-07-17 19:36:27.921 -0500>,<Administrator>,<TOPSPIN>,<go>,<TOPSPIN 2.1>,
      <created by zg
	started at 2012-07-17 19:35:21.468 -0500,
	POWCHK enabled, PULCHK disabled,
       configuration hash MD5:
       6B 1B 68 BB D9 2E 58 E2 7F 35 AD 54 07 DF 0E 41
       data hash MD5: 64K
       B9 8D 14 F5 86 B4 B6 F7 B0 A6 9A 57 C5 65 D7 18>)
(   2,<2012-07-17 19:36:30.640 -0500>,<Administrator>,<TOPSPIN>,<proc1d>,<TOPSPIN 2.1>,
      <Start of raw data processing
       efp LB = 0 FT_mod = 6 PKNL = 1 PHC0 = 0 PHC1 = 0 SI = 32K 
       data hash MD5: 32K
       B9 2E 63 75 11 AC 4E 93 EF 26 06 23 50 03 09 26>)
(   3,<2012-07-17 19:36:31.046 -0500>,<Administrator>,<TOPSPIN>,<proc1d>,<TOPSPIN 2.1>,
      <pk PHC0 = 179.5276 PHC1 = 0 
       data hash MD5: 32K
       7E 9E C0 68 5B A9 E7 46 5A C7 EC 13 67 0B 53 E6>)
(   4,<2012-07-17 19:36:31.140 -0500>,<Administrator>,<TOPSPIN>,<proc1d>,<TOPSPIN 2.1>,
      <abs ABSG = 1 
       data hash MD5: 32K
       7F 5A 2A CE 9B 45 E3 4A 82 80 4E 64 42 99 55 81>)
(   5,<2012-07-17 19:36:31.171 -0500>,<Administrator>,<TOPSPIN>,<proc1d>,<TOPSPIN 2.1>,
      <abs ABSG = 2 
       data hash MD5: 32K
       7F 6B B9 E0 69 26 0F 41 C2 18 CF 89 C6 16 61 D6>)
(   6,<2012-07-17 19:36:31.203 -0500>,<Administrator>,<TOPSPIN>,<proc1d>,<TOPSPIN 2.1>,
      <abs ABSG = 3 
       data hash MD5: 32K
       4C 2A 93 37 A8 85 5A 59 43 6A B6 58 7C A4 E2 AB>)
(   7,<2012-07-17 19:36:31.234 -0500>,<Administrator>,<TOPSPIN>,<proc1d>,<TOPSPIN 2.1>,
      <abs ABSG = 4 
       data hash MD5: 32K
       2C B0 BF 2E 76 20 71 67 7D B7 1D 00 68 78 31 90>)
(   8,<2012-07-17 19:36:31.265 -0500>,<Administrator>,<TOPSPIN>,<proc1d>,<TOPSPIN 2.1>,
      <abs ABSG = 5 
       data hash MD5: 32K
       3D 8B 3D FF 12 14 65 8B A2 50 F2 68 FD 72 59 37>)
$$ ##END=
$$ 
$$ $$ hash MD5
$$ $$ 57 CB CF 49 FB 6F B7 0C 98 62 76 5A 1C 2B 3C A7
##$RELAX= 
##$RELAX= 
##$RELAX= 
##$RELAX= 
##$RELAX= 
##$RELAX= 
##$RELAX= 
$$ Bruker specific parameters
$$ --------------------------
$$ [...]
150 150 150 150 150 150 150 150
##$TP07= 0
##$TPNAME0= <>
##$TPNAME1= <>
##$TPNAME2= <>
##$TPNAME3= <>
##$TPNAME4= <>
##$TPNAME5= <>
##$TPNAME6= <>
##$TPNAME7= <>
##$TPOAL= (0..7)
0.5 0.5 0.5 0.5 0.5 0.5 0.5 0.5
##$TPOFFS= (0..7)
0 0 0 0 0 0 0 0
##$TUNHIN= 0
##$TUNHOUT= 0
##$TUNXOUT= 0
##$USERA1= <user>
##$USERA2= <user>
##$USERA3= <user>
##$USERA4= <user>
##$USERA5= <user>
##$V9= 5
##$VALIST= <valist>
##$VCLIST= <CCCCCCCCCCCCCCC>
##$VD= 0
##$VDLIST= <DDDDDDDDDDDDDDD>
##$VPLIST= <PPPPPPPPPPPPPPP>
##$VTLIST= <TTTTTTTTTTTTTTT>
##$WBST= 2048
##$WBSW= 25
##$XGAIN= (0..3)
0 0 0 0
##$XL= 0
##$YL= 0
##$YMAX_a= 503638
##$YMIN_a= -644825
##$ZGOPTNS= <>
##$ZL1= 120
##$ZL2= 120
##$ZL3= 120
##$ZL4= 120
##$ABSF1= 14.98509
##$ABSF2= -5.573092
##$ABSG= 5
##$ABSL= 3
##$ALPHA= 0
##$AQORDER= 0
##$ASSFAC= 0
##$ASSFACI= 0
##$ASSFACX= 0
##$ASSWID= 0
##$AUNMP= <proc_prof1d_extract_pilot.lims>
##$AXLEFT= 0
##$AXNAME= <>
##$AXNUC= <1H>
##$AXRIGHT= 0
##$AXTYPE= 0
##$AXUNIT= <>
##$AZFE= 0.1
##$AZFW= 0.1
##$BCFW= 0
##$BC_mod= 0
##$BYTORDP= 0
##$COROFFS= 0
##$CY= 15
##$DATMOD= 1
##$DC= 0
##$DFILT= <>
##$DTYPP= 0
##$F1P= 0
##$F2P= 0
##$FCOR= 0.5
##$FTSIZE= 32768
##$FT_mod= 6
##$GAMMA= 0
##$GB= 0
##$INTBC= 1
##$INTSCL= 1
##$ISEN= 128
##$LB= 0
##$LEV0= 0
##$LPBIN= 0
##$MAXI= 10000
##$MC2= 0
##$MEAN= 0
##$ME_mod= 0
##$MI= 0
##$NCOEF= 0
##$NC_proc= -8
##$NLEV= 6
##$NOISF1= 0
##$NOISF2= 0
##$NSP= 0
##$NTH_PI= 0
##$NZP= 0
##$OFFSET= 14.98509
##$PC= 1
##$PHC0= 179.5276
##$PHC1= 0
##$PH_mod= 1
##$PKNL= yes
##$PPARMOD= 0
##$PPDIAG= 0
##$PPIPTYP= 0
##$PPMPNUM= 2147483647
##$PPRESOL= 1
##$PSCAL= 4
##$PSIGN= 0
##$PYNMP= <proc.py>
##$REVERSE= no
##$SF= 400.02
##$SI= 32768
##$SIGF1= 0
##$SIGF2= 0
##$SINO= 400
##$SIOLD= 32768
##$SPECTYP= <>
##$SREGLST= <1H.CDCl3>
##$SSB= 0
##$STSI= 32768
##$STSR= 0
##$SW_p= 8223.68421052631
##$SYMM= 0
##$S_DEV= 0
##$TDeff= 65536
##$TDoff= 0
##$TI= <>
##$TILT= no
##$TM1= 0
##$TM2= 0
##$TOPLEV= 0
##$USERP1= <user>
##$USERP2= <user>
##$USERP3= <user>
##$USERP4= <user>
##$USERP5= <user>
##$WDW= 1
##$XDIM= 32768
##$YMAX_p= 470064658
##$YMIN_p= -797264
##$CURPLOT= <Network HP LaserJet P1505>
##$CURPRIN= <$Network HP LaserJet P1505>
##$DFORMAT= <normdp>
##$LAYOUT= <+/1D_H.xwp>
##$LFORMAT= <normlp>
##$PFORMAT= <normpl>
##$SURQMSG= 1
$$ End of Bruker specific parameters
$$ ---------------------------------
##NTUPLES= NMR SPECTRUM
##VAR_NAME=  FREQUENCY,     SPECTRUM/REAL,   SPECTRUM/IMAG
##SYMBOL=    X,             R,               I
##VAR_TYPE=  INDEPENDENT,   DEPENDENT,       DEPENDENT
##VAR_FORM=  AFFN,          ASDF,            ASDF
##VAR_DIM=   32768,         32768,           32768
##UNITS=     HZ,            ARBITRARY UNITS, ARBITRARY UNITS
##FACTOR=    0.250966925370066, 1,           1
##FIRST=     8223.43324360094, 270931,       55029
##LAST=      0,             90271,           -326444
##MIN=       0,             -797264,         0
##MAX=       8223.43324360094, 470064658,    0
$$ Real data points
##PAGE= N=1
##DATA TABLE= (X++(R..R)), XYDATA
$$ [...]
$$ plain form
19548 71651 282315 164404 205664 -101395 -157912 -124978 -231724 77749 -122063 180848
19537 226245 134290 -60082 22942 -31018 39303 -64796 -282125 75705 -167289 -307439 1905
19525 -216617 -198971 -353538 -283882 -139172 -69 -116659 -158551 -24457 -61105 -40119 21767
19513 149794 207799 -278221 42357 17345 158043 -53006 57321 -172553 -125342 -151820 -174164
19502 -174164 -577143 71476 -99156 326203 114094 -289282 87076 61577 -129698 -131175 -111693
19491 -111693 -120307 -344865 117083 134446 -1048 116165 -29835 -341719 218217 297410 -111080
19479 -344805 -218286 -272850 -196726 -183050 -97604 14319 169537 -152177 92414 -107789 -183821
19468 -183821 17299 -106340 -181989 123788 41454 6579 54104 -85958 -224072 -189748 -215942
$$ packed form
19548G1651K10664j17911M1260a01395n6517L2934j06746G7749a22063A80848
19537B26245r1955f0082B2942c1018C9303f4796k17329G5705a67289j40150A905
19525b16617J7646j54567O9656a39172f9j16590m1892b4457l6648K0986B1767
19513A49794N8005b78221D2357A7345J40698e3006E7321a72553M7211k6478k2344
19502a74164m02979G1476i9156C26203A14094b89282H7076k5499a29698j477J9482
19491a11693q614k24558A17083J7363a048A16165b9835l11884B18217P9193a11080
19479c44805J26519n4564P6124J3676Q5446A4319J55218a52177I2414a07789p6032
19468a83821A7299a06340p5649A23788D1454F579M7525h5958j38114L4324k6194
$$ plain form
19457 -215942 232466 -229645 57887 -354459 -28353 -446302 65860 -243961 88677 53645
19447 53645 -75569 54773 -219490 -32633 -200840 146079 49729 -47780 34096 -175559 -134015
19436 -134015 -36597 -182973 179082 -139159 -177646 -30233 125029 -86555 -83551 -18458 185271
19424 -63458 -199744 -132592 -458420 -88387 -285047 -184204 -247208 38037 -188319 -183297 -79244
19412 397312 -78100 -93715 -233313 31360 94594 -63559 353115 -326215 -40377 -86872 -36003
19400 -256254 -91077 -158284 -29379 32813 -73189 -20224 37583 -121709 -72308 157730 -279374
19388 -363613 44840 131319 125629 40658 -44380 412473 94318 -148116 -3662 -33116 -62839
19377 -62839 -380455 125396 -303497 -369096 98444 340047 -169193 -73812 -207813 19954
$$ packed form
19457b15942B32466b29645E7887c54459b8353m17949F5860b43961H8677l5032
19447E3645g5569E4773b19490c2633j68207A46079D9729d7780C4096a75559M1544
19436a34015c6597j46376A79082a39159l8487c0233A25029h6555L004a8458A85271
19424f3458j36286O7152l25828h8387j96660J00843o3004C8037a88319N022g9244
19412C97312g8100j5615j39598C1360O3234f3559C53115c26215d0377m6495c6003
19400b56254i1077o7207b9379C2813g3189b0224C7583a21709M9401A57730b79374
19388c63613D4840Q6479n690D0658d4380D12473I4318a48116c662k9454k9723
19377f2839l17616A25396c03497o5599I8444K41603a69193g3812j34001A9954
$$ plain form
19366 -488198 236887 -156943 316459 -116192 -260929 33563 121526 -174199 -3760 -32452
19356 -32452 -57555 -58041 82596 -15905 -67386 -166242 -89735 96933 54649 2606 255289 -272775
19343 -111464 -109611 316677 -139706 -139696 64874 133457 111468 115539 -273518 -42416 203719 -129340
19330 -94137 -86398 285338 34248 24828 -18650 -43431 104114 -159834 10575 55465 -110319
19318 -79105 -165996 -117294 -69627 -150672 -139494 65663 -29858 13884 -4049 52431 100575 -165897
19305 -235318 -651633 80916 -252307 59271 -163672 -27835 72227 -242677 -214376 160510
19294 -228795 295249 20725 -462911 -103563 227837 -181000 -267412 -326 -185597 -254120 62588
19282 47983 30731 -172726 -422772 -57505 -195291 -54376 258514 -66868 51107 12741 156291
$$ packed form
19366d88198B36887a56943C16459a16192j44737C3563Q7963a74199c760k8692
19356c2452k5103m86H2596a5905n1481r8856P6507I6933m2284B606K52683b72775
19343a11464J853C16677a39706J0F4874O8583k1989M071b73518d2416B03719a29340
19330i4137P739B85338C4248r420a8650k4781A04114a59834A0575M4890a10319
19318g9105q6891M8702M7667q1045J1178F5663b9858A3884d049E2431M8144a65897
19305b35318m16315H0916b52307E9271a63672b7835G2227b42677K8301A60510
19294b28795B95249B0725d62911a03563B27837a81000q6412c26j85271o8523F2588
19282D7983j7252a72726k50046e7505j37786e4376B58514f6868E1107A2741J43550
$$ plain form
19271 156291 -48394 55044 -199833 64333 -191848 -40536 -244081 -101376 95185 66928 -93977
19259 61465 -402377 -53232 -67187 -65898 -197513 17276 -24054 -59219 -133445 -302921 -541719
19248 -541719 161949 -153456 -204608 286378 107119 -142283 245227 -234431 -1581 59976
19237 -251835 -208955 -93996 181499 123998 -50885 -301384 -220235 75672 -53893 309392 -73770
19225 -217598 -13770 -224288 -240369 5821 -100881 -191150 -283912 85213 -300065 61029 -343789
19213 -20741 -110652 -213877 147088 -136248 -233004 208362 152994 -271093 -330256 -89915 -455684
19202 -455684 158475 -225433 -94179 -114434 22485 -114339 -44068 -7979 -297013 -31140 -153503
19191 -153503 -239713 29908 -8329 -34022 148244 275442 -311946 -125197 -244450 -284968 -241568
$$ packed form
19271A56291d8394E5044a99833F4333a91848d0536k03545a01376I5185k8257i3977
19259F1465d02377e3232j3955J289j31615A7276b4054l5165p4226j69476k38798
19248e41719A61949a53456n1152B86378A07119a42283B45227b34431a581E9976
19237b51835M2880i3996A81499n7501e0885k50499Q1149G5672e3893C09392g3770
19225b17598a3770k10518j6081E821a00881r0269r2762H5213c00065F1029c43789
19213b0741q9911j03225A47088a36248r6756B08362n5368b71093n9163h9915l65769
19202d55684A58475b25433i4179k0255B2485a14339d4068g979k89034c1140j22363
19191a53503q6210B9908h329k5693A48244J27198c11946a25197j19253m0518M3400
$$ plain form
19180 -241568 -110953 -200822 432033 -66480 154548 243472 17806 36064 -66087 -317627 -126413
19168 -58409 -190432 -25631 -233374 -54309 -70895 -142092 -484971 -440586 131735 52720 -47099
19156 -279685 -157598 -39856 203144 -403044 946 -276488 -268921 242166 -164689 -95960 125462
19144 -408144 -17514 34444 -146503 180973 -69644 165733 -177437 -106880 56341 47948 -259144
19132 -247200 9193 -164741 -84598 -62497 250529 -205384 -308123 -318626 -296251 -182626 -103919
19121 -103919 -38104 38425 -395467 -265699 -51706 -115177 -226483 294311 138880 -122708
19110 -133194 -33601 -104004 461887 -83995 92208 -64635 -195878 -44964 -37047 126719 -4487
19098 -136257 47966 -134663 -332085 -34463 6222 -105892 -61226 -382540 -135778 259032
$$ packed form
19180b41568a10953q9869D32033f6480A54548Q8924A7806J8258f6087k51540a26413
19168e8409j32023b5631k07743e4309j6586p1197l42879M4385A31735E2720d7099
19156b79685J22087c9856B03144d03044I46b76488P567B42166a64689O8729A25462
19144d08144a7514C4444a46503A80973f9644A65733a77437P0557E6341q393b59144
19132b47200I193a64741Q0143K2101B50529b05384j02739j0503K2375J13625P8707
19121a03919c8104C8425c95467J29768e1706o3471j11306B94311A38880a22708
19110a33194c3601p0403D61887h3995I2208f4635j31243d4964P917A26719d487
19098a36257D7966a34663j97422c4463F222a05892M4666l21314a35778B59032
$$ plain form
19087 -1563 15453 109066 -2655 43707 -114932 -286605 -366031 -39705 -108528 -33450 251236
19075 15511 169079 -212060 -63115 178470 -313923 -318364 -220208 -39814 -195671 19209 -33712
19063 -499 -134269 122431 -11008 -68482 -10348 228938 -140289 -241978 -143655 170774 -120140
19051 217270 8849 -203386 74110 -339444 97575 -61051 -221854 -126443 -145408 -16989 -126626
19040 -126626 44250 188030 -292270 -221858 459 -27622 -999 18876 -34935 -189042 295046
19028 209481 216037 117983 275938 -388456 136238 128513 150589 -65974 -110988 304541 150512
19016 -60135 91020 -73603 -145425 139814 144002 -141478 -163887 -110255 -21909 98835 38030
19004 -269237 -102939 -86484 137344 169485 -131673 174345 -197802 88169 -161178 143170
$$ packed form
19087a563A5453R3613b655D3707a14932j71673p9426c9705o8823c3450B51236
19075A5511J53568b12060f3115A78470c13923m441R8156c9814j55857A9209c3712
19063d99j33770A22431a1008n7474a0348B28938a40289j01689R8323A70774a20140
19051B17270H849b03386G4110c39444I7575f1051j60803R5411j8965a6989j09637
19040a26626D4250J43780b92270P0412D59b7622i99A8876c4935j54107B95046
19028B09481O556r8054J57955c88456A36238p725K2076f5974m5014C04541A50512
19016f0135I1020g3603p1822A39814M188a41478k2409N3632b1909I8835C8030
19004b69237a02939J6455A37344L2141a31673A74345a97802H8169a61178A43170
$$ plain form
18993 -304747 -152402 -9104 322871 -421477 163017 31513 -151341 -11014 11135 -286278
18982 -172185 65164 -176618 57634 -128568 110750 -230846 -120728 13169 -134126 -129468
18972 -129468 -161733 -129882 228817 -170540 -246105 355391 -178803 -204589 -107726 66768 101325
18961 101325 -39578 98878 -216992 142430 -9060 25997 177341 10479 -414604 -109181 58603
18949 -274978 -65597 9900 -140858 31595 212234 -71286 -364855 110272 -46623 -14567 171316
18937 -87453 -57152 -464641 -141081 -148283 49349 -82457 -175805 -164729 179307 -92829 -129722
18926 -129722 361620 103442 -13643 110135 -57730 199076 48197 34793 23006 -206485
18915 -257284 111066 159737 71244 -374469 -154264 -333289 -41266 -2250 -152069 -25543 -207000
$$ packed form
18993c04747J52345i104C22871d21477A63017C1513a51341a1014A1135b86278
18982a72185F5164a76618E7634a28568A10750b30846J10118A3169a34126M658
18972a29468l2265L1851B28817a70540p5565C55391a78803k5786R6863F6768L4557
18961A01325c9578I8878b16992A42430i060B5997J51344A0479d14604a09181E8603
18949b74978f5597I900a40858C1595J80639g1286k93569A10272d6623a4567A71316
18937h7453L0301m07489a41081p202D9349h2457r3348J1076A79307i2829l6893
18926a29722C61620A03442a3643A10135e7730A99076D8197j3404j1787b06485
18915b57284A11066M8671G1244c74469a54264j79025d1266b250j49819b5543j81457
$$ plain form
18904 -207000 41473 119405 -279708 1375 130382 -273851 22413 -301135 114777 -138424
18893 -81726 -268648 355158 197722 29501 -221652 -74498 -272923 160751 102244 -157017
18882 -135927 16686 40158 139724 -215511 -433195 199120 -39990 50525 -216196 354492
18871 83872 172089 -42754 1216 -46307 -299919 -167826 39712 -208964 -176922 62897 -211256
18859 250914 84749 212342 -317158 289788 155900 -123791 -66340 -276832 -20710 -422779
18849 -422779 217969 -139172 -81645 -216518 -197691 301198 132308 110295 -230146 269319
18838 -278601 110464 -24494 -260274 -57184 37068 419642 -273767 -189819 -62300 177623
18827 79755 105373 -176748 -242551 -58393 151856 -110764 161904 -73625 185283 -183626
$$ packed form
18904b07000D1473P7932b79708A375J29007b73851B2413c01135A14777a38424
18893h1726j86922C55158j57436B9501b21652g4498j98425A60751n8507a57017
18882a35927A6686K3472R9566b15511k17684A99120c9990E0525b16196C54492
18871H3872Q8217d2754A216d6307k53612J32093C9712b08964L2042F2897b11256
18859B50914H4749J27593c17158B89788j33888a23791N7451k10492b0710m02069
18849d22779B17969a39172N7527j34873J8827C01198A32308k2013b30146B69319
18838b78601A10464b4494k35780e7184C7068L82574b73767Q3948f2300A77623
18827G9755K5618a76748o5803e8393A51856a10764A61904g3625A85283a83626
$$ plain form
18816 322374 89536 209411 -331812 63268 45977 155517 99068 -93165 81002 -199153 113173
18804 -49798 242772 -58497 -24662 -6325 -281391 -85703 -381110 73503 -197263 -65761 62721
18792 -298820 -315742 -139959 329508 -129097 43612 9977 158625 -282284 63113 2019 -81067
18780 172013 -326863 -151355 -123527 -104830 113341 124666 318955 19761 41429 -209485
18769 153792 -150188 215073 126046 342990 -46293 -324418 -274652 -169 130436 -217192 137923
18757 -225586 -238161 -38620 142084 -261761 297173 122894 16348 -196940 252734 315762
18747 315762 116462 -177559 -20969 -323071 280452 -312501 -149612 8362 -23698 -106905
18737 -106905 53028 -216716 -87900 -139903 -339139 190706 125192 -26759 -226097 -350217
$$ packed form
18816C22374H9536J19875c31812F3268j7291J09540n6449i3165H1002a99153A13173
18804d9798B42772e8497b4662f325k75066h5703k95407G3503a97263f5761F2721
18792b98820j6922a39959C29508a29097D3612I977J48648b82284F3113B019h1067
18780A72013c26863a51355K7828J8697A13341J1325J94289A9761K1668b09485
18769A53792a50188B15073q9027K16944d6293k78125M9766a69A30436b17192A37923
18757b25586j2575c8620A42084b61761B97173A22894A6348a96940B52734O3028
18747C15762A16462a77559b0969l02102B80452c12501a49612H362b3698q3207
18737a06905E3028b16716h7900n2003j99236A90706o5514b6759j99338j24120
$$ plain form
18727 -350217 298485 362826 248785 61410 125083 -238339 -202572 -78018 17803 180942 56836
18715 -148311 -75221 -298465 -104479 -518639 214175 18234 -14291 -106804 70183 32234 -84524
18703 112117 -261052 228977 -161993 -154365 -274832 -114995 -355989 131871 164897 -247426
18692 544883 -292987 2930 -189355 -2586 52937 -46484 -153077 -184306 -27932 -148811 -258385
18681 -258385 6353 -16084 66 -75211 255891 -96731 5462 -89186 152703 22621 -222623 14325
18668 -40104 -28157 207695 -158975 -42176 64592 -124446 33705 -101275 7052 -54610 134089
18656 -112111 -93919 133569 109532 -231214 -174363 105148 4842 272186 -116925 -159751 52703
18644 -196263 -88283 -171449 42136 -219063 -377689 58333 -38416 -10588 -141661 -266684 -69719
$$ packed form
18727c50217B98485O4341j14041F1410O3673b38339L5767g8018A7803J63139E6836
18715a48311P3090k23244a04479m14160B14175A8234a4291r2513G0183C2234h4524
18703A12117b61052B28977a61993P628j20467a14995k40994A31871L3026b47426
18692E44883b92987B930a89355b586E2937d6484j06593l1229b7932j20879j09574
18681b58385F353a6084F6g5211B55891i6731E462h9186A52703B2621b22623A4325
18668d0104J1947B07695a58975d2176F4592a24446C3705a01275G052e4610A34089
18656a12111J8192A33569k4037b31214N6851A05148D842K67344a16925m2826E2703
18644a96263h8283q3166D2136b19063j58626E8333c8416a0588j31073j25023f9719
$$ plain form
18632 -52329 -138674 42597 -210614 -53250 -10757 -73742 -186653 -191307 -295814 -351673 -113578
18620 34785 -221051 -179881 -247126 -22391 327782 -67457 -36080 -181982 -310769 -54262 170037
18608 -43393 134031 -3068 -110623 75132 -11586 -196595 361773 323635 156199 -169415 203571
18596 -147152 -246870 -58313 -205368 -30789 114583 -150859 229511 -24729 -142950 92163
18585 72575 155732 141234 -15940 -59117 -216556 -76994 7912 -38292 -258716 -350947 -247842
18574 -247842 -47584 -293918 -258441 69967 -224205 61030 -347814 -155566 81352 -15193 198248
18562 31701 5585 81213 104526 71518 40779 267084 151042 -248641 -258862 56316 -59709
18550 -165937 28729 43535 -101533 159813 -90646 12978 35117 -21990 -85241 -144831 -208646
$$ packed form
18632e2329q6345D2597b10614e3250a0757o2985j12911m654j04507n5859a13578
18620C4785b21051M1170o7245b2391C27782f7457L1377j45902j28787e4262A70037
18608d3393A34031c068j07555G5132a1586j85009C61773l8138A56199a69415B03571
18596a47152r9718e8313j47055c0789A14583a50859B29511b4729j18221I2163
18585G2575Q3157j4498a5940m3177j57439g6994G912c8292k20424r2231J03105
18574b47842d7584k46334L5477F9967b24205F1030c47814a55566H1352a5193A98248
18562C1701E585P5628K3313l3008l0739K26305j16042b48641j0221E6316e9709
18550a65937B8729J4806a01533A59813i0646A2978K2139b1990o3251n9590o3815
$$ plain form
18539 -208646 -253061 -18958 -219516 56182 256124 -202182 -58210 -181901 221203 60340
18528 -58847 46804 -104886 121085 88500 -76625 -242698 -229908 193749 -151595 370986
18517 89355 19827 163075 297498 -192934 38040 -38573 -88766 -18118 140803 -443636 4427
18505 282041 158743 -15991 -31682 294822 204360 -233185 24031 97596 -406004 -132876
18494 -139503 -51872 -233327 94264 -27736 -189226 -314777 -189903 -186457 -140558 95220 -190259
18482 -153756 -143085 211601 -18600 -109086 -89866 -261570 349166 -92432 -194351 -164361 -230832
18471 -230832 -61272 -43760 -180620 21317 -134844 115112 215085 81383 -159264 -115337 -37350
18459 104206 -2834 16032 9859 5369 -297734 -93540 112720 -69872 166853 -192829 133738
$$ packed form
18539b08646m4415a8958k00558E6182J99942b02182e8210j23691B21203F0340
18528e8847D6804a04886A21085l2585g6625j66073J2790A93749a51595C70986
18517H9355A9827J43248J34423a92934C8040c8573n0193a8118A40803d43636D427
18505B82041j23298a5991j5691B94822r0462b33185B4031P3565d06004a32876
18494a39503e1872j81455I4264b7736j61490j25551J24874L446M5899I5220a90259
18482a53756J0671B11601a8600r0486J9220j71704C49166i2432j01919K9990o6471
18471b30832f1272J7512j36860B1317a34844A15112R9973H1383a59264M3927c7350
18459A04206b834A6032o173m490b97734i3540A12720f9872A66853a92829A33738
$$ plain form
18447 78802 81849 -39474 -125398 -47937 -27880 -32762 -59479 178245 34628 114998 -197727 -83125
18434 -288221 -253114 -294828 -73858 -215265 -183856 -532729 -133881 -91193 299298 -148144
18423 107778 39943 288273 -240618 -73262 -83436 -41298 -62008 338280 43263 -156235 93923
18411 -42299 296673 101506 -216735 -714 -383251 9560 325626 -234852 -46149 -306111 -260075
18400 -260075 -469679 68200 -73758 -309962 -143493 49553 164750 -300680 102094 105367
18390 105367 -128618 165492 -161301 -40998 284149 69818 134543 101603 -341804 -75250
18379 -40464 112681 -178142 318063 143445 -85683 -37822 -168690 -121458 30273 210166
18369 210166 90099 142902 44301 -56152 143382 26609 -124835 201400 -44585 -16284 -372897
$$ packed form
18447G8802L047c9474q5924d7937K0057m882k6717A78245C4628Q0370a97727h3125
18434b88221L5107m1714g3858j41407L1409l48873a33881M2688B99298a48144
18423A07778C9943K48330b40618g3262j0174d1298k0710C38280D3263a56235I3923
18411d2299B96673A01506b16735g14l82537I560L16066b34852d6149k59962M6036
18400b60075k09604F8200g3758k36204a43493D9553J15197c00680A02094L273
18390A05367a28618A65492a61301d0998B84149F9818O4725l2940c41804g5250
18379d0464A12681a78142C18063A43445h5683c7822j30868M7232C0273J79893
18369B10166I0099N2803D4301e6152A43382B6609a24835B01400d4585a6284l56613
$$ plain form
18358 -372897 21539 44206 36772 73166 123344 -102132 -1033 41103 380965 -4853 -203083
18347 -203083 -350151 25558 59370 54641 30414 -244936 144382 -207894 -199791 -222233 -188100
18336 -188100 114615 200809 -140496 -119071 64666 139699 -321264 115014 24642 515943
18326 515943 -40735 -67106 -264635 183502 364234 -120025 238667 56402 -231600 -87599
18315 -269662 -49422 231220 118268 -18032 -18844 -35148 17001 189357 147686 204315 -340696
18303 -33969 -329361 -146756 -112613 -44547 -19791 110572 -260236 280030 62295 118398 -10190
18291 -101636 19707 -128705 -254985 210260 -226163 -151179 -41319 -136292 78855 -181600
18280 92308 33651 -77242 258296 -128312 -396935 135301 -70973 110612 -22552 -183181
$$ packed form
18358c72897B1539K2667p434L6394N0178a02132a033D1103L39862d853j98230
18347b03083j47068B5558L3812m729k4227b44936A44382b07894Q103k2442L4133
18336a88100A14615Q6194a40496K1425F4666P5033c21264A15014B4642M91301
18326E15943d0735k6371j97529A83502J80732a20025B38667E6402b31600h7599
18315b69662d9422B31220j12952a8032q12j6304A7001J72356m1671N6629c40696
18303c3969k95392a46756L4143d4547a9791A10572b60236B80030F2295N6103a0190
18291a01636A9707a28705j26280B10260b26163P4984d1319r4973G8855a81600
18280I2308C3651g7242B58296a28312k68623A35301g0973A10612b2552j60629
$$ plain form
18270 -183181 -239706 -306407 -621113 249723 7552 -84358 -77977 -31025 -29013 195283 123886
18259 123886 204578 191275 130550 18736 -394441 34062 -81645 -2560 -129932 9986 36860
18248 36860 149145 -326499 60193 -58357 -424911 -43028 -163031 215056 172671 -10630 223284
18236 -235112 115076 -104603 15579 175300 -159622 -478863 -365986 40012 -102107 -37505
18225 -319872 -110852 -273136 3745 120865 63796 -258872 266955 -114607 12569 25330
18215 25330 -210286 97173 171116 -4712 -294525 -316665 -101978 -350103 161238 -87792 -44714
18204 -44714 -164736 21944 220469 -8830 -65409 -54536 229267 -34982 95923 -185852 2513
18192 -176220 -236208 -253918 282294 234492 279935 267238 -276075 -258165 -80019 -147074 -65948
$$ packed form
18270a83181n6525o6701l14706B49723G552h4358O381c1025K012A95283p1397
18259A23886Q0692j3303o0725A8736c94441C4062h1645b560j27372I986K6874
18248C6860J12285c26499F0193e8357l66554d3028j20003B15056m2385a0630B23284
18236b35112A15076a04603A5579J59721a59622l19241J12877D0012a02107c7505
18225c19872a10852j62284C745J17120n7069b58872B66955a14607A2569J2761
18215B5330b10286I7173P3943d712k89813k2140a01978k48125A61238h7792M3078
18204d4714j20022B1944J98525h830n6579J0873B29267c4982I5923a85852B513
18192a76220n9988j7710B82294m7802M5443j2697b76075J7910h0019o7055f5948
$$ plain form
18180 -352454 -228165 -14598 109328 -92002 184023 233120 -35431 179216 58667 60196 -198313
18168 -532295 -232059 70416 -94195 -177667 -109009 -274184 -5390 -48435 2445 -199848 -40988
18156 -235408 181173 -46119 -115434 236371 -157810 -267225 185391 -18616 -113931 65319
18145 271431 -173868 222722 -221460 -166213 -172422 -428251 108732 288500 35216 48095
18135 48095 -218668 281786 -144487 -170267 -92250 -58610 -51589 -152415 -135187 449858 -27384
18123 -94516 -204044 -172848 520271 70263 -98677 250669 -172279 36497 -328185 -150282
18112 -274900 166877 -153792 313125 -106343 -473843 158472 -217871 -175812 -91869 -61188
18102 -61188 188009 -340600 242508 30827 26841 -51850 328160 65655 -212490 -44711 -88982
$$ packed form
18180c52454J24289a4598A09328i2002A84023M9097c5431A79216E8667J529a98313
18168e32295b32059G0416i4195q3472O8658j65175e390m3045B445a99848d0988
18156b35408A81173d6119o9315B36371a57810j09415A85391a8616r5315F5319
18145B71431a73868B22722b21460N5247o209k55829A08732J79768C5216J2879
18135D8095b18668B81786a44487k5780P8017L3640P021j00826J7228D49858b7384
18123i4516j09528L1196E20271G0263i8677B50669a72279C6497c28185a50282
18112b74900A66877a53792C13125a06343l67500A58472b17871M2059Q3943L0681
18102f1188A88009c40600B42508C0827l986e1850C28160F5655b12490d4711m4271
$$ plain form
18091 -88982 -73403 -274057 -360646 -304825 -207787 -165493 -61408 -43055 -286295 91717 4502
18079 90326 317059 -104518 40577 -155755 45903 -257883 76078 96293 -139189 94595 22938
18067 -105321 195018 154779 73051 -243787 -43362 -596 116292 -128366 254490 100405 48000
18055 92973 -79775 33105 -318095 -244912 232246 -130121 104811 -195294 57079 49259 -227326
18043 -155018 200998 -197112 -40604 -26577 -243689 144515 277335 -88769 -169923 95177
18032 226770 82205 97586 389086 239496 -108281 -105350 -146262 -278593 217698 -135706
18021 265749 -62903 -45602 -259899 -28103 85059 120349 -109882 -141275 346373 433516 -69656
18009 -144871 7422 50451 -242857 92742 220166 12708 135036 127237 -217873 -208161 125360
$$ packed form
18091h8982J5579k00654q6589N5821R7038M2294f1408J8353k43240I1717D502
18079I0326K26733a04518D0577a55755D5903b57883G6078K0215a39189I4595B2938
18067a05321A95018m0239G3051b43787d3362e96A16292a28366B54490A00405D8000
18055I2973g9775C3105c18095P3183B32246a30121A04811a95294E7079p820b27326
18043a55018B00998a97112d0604J4027k17112A44515J32820h8769q1154I5177
18032B26770H2205J5381K91500j49590a08281K931m0912j32331B17698a35706
18021B65749f2903J7301k14297b8103H5059L5290a09882l1393C46373Q7143f9656
18009a44871G422M3029b42857I2742J27424A2708J22328p799b17873R712A25360
$$ plain form
17997 -163958 151635 -138231 -32485 196685 164048 254191 9797 -70838 310437 76614 -52759
17985 -109672 -112620 65338 -9075 91232 -25563 33027 -118868 150181 95080 -209970 80731
17973 97598 35189 -38857 -7966 -30324 -206599 121848 254674 135897 -4611 -21747 201490
17961 269537 4118 -49163 -134915 339910 279113 -106739 -250126 -161176 9089 -245578 -167859
17950 -167859 -227466 -204254 -112908 -282684 54249 -154837 17674 126384 219896 106552 54198
17939 54198 -201504 -175705 -58430 -15570 244672 198096 181474 -90310 -183054 -132601 102377
17927 5900 -207561 -85397 -211902 -65986 -82540 -213640 44311 -211177 -39955 217941 46418
17915 -36635 -95061 -22314 -21685 51309 88305 101136 -166067 -13063 -34996 -231693 183758
$$ packed form
17997a63958A51635a38231c2485A96685l2637R0143I797g0838C10437G6614e2759
17985a09672k948F5338i075I1232b5563C3027a18868A50181n5101b09970H0731
17973I7598C5189c8857g966k2358j76275A21848J32826j18777d611j7136B01490
17961B69537D118d9163q5752C39910o0797a06739j43387Q8950I089b45578P7719
17950a67859n9607K3212R1346j69776E4249a54837A7674J08710R3512A06552n2354
17939E4198b01504K5799e8430a5570B44672m6576j6622i0310r2744N0453A02377
17927E900b07561h5397j26505f5986j6554j31100D4311b11177c9955B17941D6418
17915c6635n8426b2314O29E1309L6996J2831a66067a3063k1933j96697A83758
$$ plain form
17903 -189317 182001 -149804 255322 -64571 -34589 47884 10597 98831 -230432 -87135 295
17891 -138223 -161905 29726 -257178 -314940 -37469 80010 -468233 7018 -16500 86957 224836
17880 224836 28781 378162 71039 -222734 130173 -146795 -419854 -2779 -60223 22979 -77334
17868 165238 11810 397964 52550 50316 17938 -252941 -331414 -24941 -45708 -178475 -388371
17857 -388371 -236177 252098 -172998 276137 470879 26293 82032 -150986 -199958 -72268
17846 -9290 -89189 -257807 79110 86682 -85800 -123816 -162609 298132 38585 147996 22673
17834 -279272 140409 -150014 -102935 98558 158245 -114806 -337709 139354 81319 -184486
17823 84642 233782 245506 58102 -109723 -58068 146249 298674 28368 -203194 123764
$$ packed form
17903a89317A82001a49804B55322f4571K9982D7884A0597Q8234b30432h7135B95
17891a38223k3682B9726b57178n7762c7469H0010d68233G018a6500H6957J37879
17880B24836B8781L49381G1039b22734A30173a46795k73059b779n7444B2979g7334
17868A65238A1810L86154E2550k234A7938b52941p8473b4941k0767j32767k09896
17857c88371J52194B52098a72998B76137J94742B6293N5739a50986m8972g2268
17846i290p9899j68618G9110P572h5800l8016l8793B98132C8585J09411B2673
17834b79272A40409a50014M7079I8558N9687a14806k22903A39354n8035a84486
17823H4642J49140J1724E8102a09723N1655A46249J52425B8368b03194A23764
$$ plain form
17812 180034 -91132 79824 -27493 149824 170312 32790 65363 65585 -160165 125074 -13606
17800 -109991 265671 11392 6888 59167 372767 -28819 115016 67965 209157 -99410 281965
17788 -149598 -76608 226945 -342586 61426 19471 128067 -234218 92006 125673 -176855
17777 -9506 -157937 4931 290439 -298475 52932 32514 46 -226116 -168995 -118188 -212805 -145777
17765 -145777 -205571 -238975 -328241 -37416 136078 -179740 75064 313935 -24965 137437 -234889
17753 -177813 -222559 37032 -370205 -71808 -26052 16262 -13315 -28705 35311 -343091 123727
17741 170698 302290 95968 204489 264457 296075 -111962 -27027 44871 441980 -5831 -15539
17730 -15539 314588 -310155 -105888 -97039 257065 85289 -24887 -48423 23794 -19720 118505
$$ packed form
17812A80034i1132G9824b7493A49824K0488C2790L2573K22a60165A25074a3606
17800a09991B65671A1392m504N2279L13600b8819A15016m7051J41192i9410B81965
17788a49598P2990B26945c42586F1426A9471J08596b34218I2006L3667a76855
17777i506j48431D931K85508b98475E2932k0418D6b26116N7121N0807r4617O7028
17765a45777n9794l3404q9266c7416A36078a79740G5064K38871b4965A37437b34889
17753a77813m4746C7032c70205g1808b6052A6262a3315j5390C5311c43091A23727
17741A70698J31592I5968J08521N9968L1618a11962b7027D4871L97109e831r708
17730a5539C14588c10155a05888Q849B57065H5289b4887k3536B3794a9720A18505
$$ plain form
17718 212189 119164 379376 -108570 -141472 84215 -29670 -93581 -85468 68013 -208704 89302
17706 -38723 -39245 233168 287328 -158386 165210 48034 237410 -332554 -356409 -47037 51201
17694 294464 256171 65257 141646 -156895 12543 -56048 -37070 75555 62492 140585 439840
17683 439840 204423 75418 9840 -433313 285862 242223 504948 8971 111683 66906 -371814
17671 92374 430904 -62247 91947 -92511 297078 250652 32585 -184274 385266 137225 33432
17659 248795 -158563 157099 -37102 -237868 -47204 310397 -106747 -22591 -78658 306781
17648 67550 27239 200744 -166089 85025 265389 -134484 -536795 185290 44628 -254222
17637 43724 280363 120483 -215049 -102207 159643 -71764 -130772 242849 -13478 -283659
$$ packed form
17718B12189r3025K60212a08570l2902H4215b9670o3911Q113F8013b08704H9302
17706c8723n22B33168N4160a58386A65210D8034J89376c32554k3855d7037E1201
17694B94464l8293F5257P6389a56895A2543e6048J8978G5555j3063P8093K99255
17683D39840B04423G5418I840d33313B85862m3639K62725H971J02712m4777c71814
17671I2374L38530f2247I1947i2511B97078m6426C2585a84274C85266A37225C3432
17659B48795a58563A57099c7102k00766d7204C10397a06747b2591n6067C06781
17648F7550B7239J73505a66089H5025J80364a34484m02311A85290D4628b54222
17637D3724K36639A20483b15049a02207A59643g1764n9008B42849a3478k70181
$$ plain form
17627 -283659 43066 -114104 -96310 -104487 -10847 -237679 -179027 192828 -73506 -56221 267377
17615 112136 -57375 -270709 -22183 -300583 -30646 165862 -8379 183286 -54570 190993 -183781
17603 192171 23159 120797 33222 127936 -117756 -217638 267536 203211 125556 -98386 20751
17591 234386 19208 -45394 187154 -4036 136440 -54262 -6794 329333 25115 -55585 121238
17579 25309 23854 -197834 -191849 -167507 -33209 196163 283173 177829 -50540 -119699 269185
17567 128590 144224 79095 322068 91163 -75899 307944 -109698 -68325 -178137 -24663 -354843
17556 -354843 264506 77936 159361 -119522 -112286 -42 323553 322786 243063 -52363 -29830 16540
17543 424 -241556 313152 141249 157230 184024 -10004 -161188 -82205 31957 117074 244400
$$ packed form
17627b83659D3066a14104J7794q177a0847k26832N8652A92828g3506J7285B67377
17615A12136e7375k13334b2183k78400c0646A65862h379A83286e4570A90993a83781
17603A92171B3159R7638C3222R4714a17756r9882B67536o4325p7655i8386B0751
17591B34386A9208d5394A87154d036A36440e4262f794C29333B5115e5585A21238
17579B5309j455a97834N985K4342c3209A96163Q7010j05344e0540o9159B69185
17567A28590J5634o5129K42973I1163g5899C07944a09698M1373j09812b4663l30180
17556c54843B64506G7936Q1425a19522P236d2C23553p67p9723e2363K2533A6540
17543D24b41556C13152A41249J5981K6794a0004j51184P8983C1957Q5117J27326
$$ plain form
17532 244400 111508 161322 14843 -223803 287406 -304429 188948 144100 8067 182817
17522 182817 -215916 21880 228705 44375 -266435 285387 59447 -65733 92771 -37083 -37164
17511 -37164 208141 -56278 -33951 71657 186143 128751 52475 357839 190817 -57862 55896
17499 -159636 36680 35727 84394 107509 194442 9750 -39760 308514 376796 142335 -55935 85932
17486 138304 19605 466611 247104 -132309 182261 189265 56418 183296 388649 -185765
17475 -68970 284555 274278 293940 389453 42211 176696 330238 239505 172234 28419 174033
17464 174033 166656 261525 -51646 35668 200980 -63493 -131568 31544 60574 -29007 286598
17452 51469 189161 258291 -13427 49910 169120 190030 175164 331929 603978 291309 174346
$$ packed form
17532B44400A11508M9814A4843b23803B87406c04429A88948m4848H067J74750
17522A82817b15916B1880K06825D4375b66435B85387E9447f5733I2771c7083q1
17511c7164B08141e6278K2327G1657J14486n7392E2475L05364j67022e7862E5896
17499a59636C6680r53M8667K3115Q6933I750c9760C08514O8282A42335e5935H5932
17486A38304A9605M47006k19507a32309A82261P004E6418J26878K05353a85765
17475f8970B84555j0277J9662R5513D2211J34485J53542r0733o7271B8419J45614
17464A74033p377R4869e1646C5668J65312f3493o8075C1544K9030b9007B86598
17452E1469J37692O9130a3427D9910J19210K0910j4866J56765K72049B91309j16963
$$ plain form
17441 174346 88580 316930 74418 432200 46418 196190 347423 261359 603207 20199
17430 305304 176645 182139 167266 256814 346202 149902 513820 708031 66132 360249 50094
17418 -78731 481352 240498 -32229 150108 525509 279129 -35433 320407 368282 303124
17408 303124 89878 456207 492310 267687 11498 3922 241421 275508 407961 43547 -243558
17396 -161281 -22775 4411 161204 187436 180412 17890 36639 205675 -159925 439597 -69782
17384 44843 -10113 278737 -115475 -58698 196500 372192 -36826 -195798 310957 15357
17373 -31729 283572 -60433 477589 80669 25603 138376 102383 314968 251412 223484 48687
17361 -344077 10912 -167081 287434 398483 111989 286735 43337 102654 194015 145251
$$ packed form
17441A74346q5766K28350G4418L57782D6418J49772J51233q6064L41848B0199
17430C05304j28659N494j4873Q9548Q9388A49902L63918J94211F6132K94117E0094
17418g8731D81352B40498c2229A50108L75401k46380c5433C20407M7875o5158
17408C03124H9878L66329L6103k24623A1498C922K37499L4087J32453D3547b43558
17396a61281b2775D411J56793K6232p024A7890J8749J69036a59925D39597f9782
17384D4843a0113B78737a15475N6777A96500J75692c6826j58972C10957A5357
17373c1729B83572f0433D77589H0669B5603J12773l5993K12585o3556k7928D8687
17361c44077A0912a67081B87434J11049A11989J74746D3337N9317R1361m8764
$$ plain form
17351 145251 81701 247801 64891 298997 146696 251333 200983 405711 82742 309301
17341 309301 315847 124604 -210249 515555 117320 36278 -20420 226507 585397 354127
17331 354127 55713 265066 79199 96043 113370 -99217 18589 304943 457108 -4519 184900
17319 36306 234509 193712 268627 295429 -16471 138545 211908 96777 301501 -6454 175965
17307 -42174 301888 189801 441480 209517 120124 253009 174405 -6153 173551 -100762
17296 202459 -45173 5653 378487 317199 361596 157424 60788 211878 169358 140088 130878
17285 130878 228162 -88641 -111976 385247 -106741 403845 441877 148462 -249705 83197
17274 -210466 395580 338227 127488 389110 -11075 14144 180045 137600 178130 190750 454850
$$ packed form
17351A45251o3550J66100F4891K34106A46696J04637n0350K04728H2742K26559
17341C09301O546A24604b10249E15555A17320C6278b0420B26507L58890k31270
17331C54127E5713K09353G9199J6844J7327i9217A8589K86354J52165d519A84900
17319C6306J98203m0797P4915K6802a6471A38545P3363I6777K04724f454A75965
17307d2174C01888j12087K51679B09517q9393J32885p8604f153A73551a00762
17296B02459d5173E653L72834o1288M4397A57424F0788J51090m2520k9270r210
17285A30878R7284h8641k3335C85247a06741D03845L8032A48462b49705H3197
17274b10466C95580n7353A27488K61622a1075A4144J65901m2445M0530J2620K64100
$$ plain form
17263 454850 502865 282525 75830 -55695 -189741 -22884 14170 270454 -114030 167464
17252 151580 200664 78812 322750 133811 215069 489650 245640 375770 -154895 55028
17241 -43366 117684 255290 487524 548675 -45517 25613 119022 -112600 -113797 147377 302073
17230 302073 253170 339487 430954 18709 230974 270320 305146 126690 380558 500592 154765
17218 394097 -82743 26156 582059 104332 -55259 337090 379914 40796 240231 146054 463588
17207 463588 222983 36945 156338 158396 355232 339041 110733 260587 337649 -7778 270366
17195 528280 90469 -150744 200005 320531 20544 234856 467617 491108 188888 364604
17185 364604 70847 309088 95298 308997 393156 346913 -63217 380704 579096 360705
$$ packed form
17263D54850M8015k20340G5830e5695j34046b2884A4170K56284a14030A67464
17252A51580M9084G8812K43938A33811Q1258K74581k44010J30130a54895E5028
17241d3366A17684J37606K32234O1151d5517B5613R3409a12600j197A47377J54696
17230C02073m8903Q6317R1467A8709K12265L9346L4826A26690K53868J20034A54765
17218C94097h2743B6156N55903A04332e5259C37090M2824D0796J99435r4177L17534
17207D63588B22983C6945J19393K058J96836j6191A10733J49854P7062g778B70366
17195E28280I0469a50744B00005J20526B0544K14312K32761K3491A88888J75716
17185C64604G0847K38241I5298K13699Q4159m6243f3217C80704J98392k18391
$$ plain form
17175 360705 343285 296356 311005 547473 488522 -31920 141484 184522 331012 423144 360811
17164 360811 156636 134527 282197 210508 170962 263131 395269 152484 191228 294343
17154 294343 408458 377560 223845 210487 502422 195973 259862 173744 278869 96658
17143 -27667 -186838 342844 352594 232439 497925 13795 289222 176630 357622 288958
17133 288958 159787 35435 193851 221517 203294 739217 329979 331513 389113 -51951 434459
17121 -129606 35779 304867 478726 460901 280792 603093 96021 309927 141650 366866
17111 366866 -41299 416251 343991 631636 365771 190531 223619 318050 480416 465181
17101 465181 190568 136851 565740 227215 638671 110707 323846 109598 348722 494212
$$ packed form
17175C60705j7420m6929J4649K36468n8951c1920A41484M3038J46490R2132o2333
17164C60811A56636k2109J47670p1689l9546R2169J32138A52484L8744J03115
17154B94343J14115l0898j53715j3358K91935A95973O3889q6118J05125I6658
17143b7667j59171C42844R750j20155K65486A3795K75427j12592J80992o8664
17133B88958j29171C5435J58416K7666j8223N35923C29979J534N7600e1951D34459
17121a29606C5779K69088J73859j7825j80109L22301I6021K13906A41650K25216
17111C66866d1299D16251p2260K87645k65865j75240L3088R4431J62366j5235
17101D65181A90568n3717M28889B27215M11456A10707K13139A09598K39124J45490
$$ plain form
17091 494212 151811 329407 554106 209380 420406 548825 524651 333980 498945 514353
17081 514353 453928 273436 657372 58120 385395 515523 419409 166873 473999 398447
17071 398447 53905 605375 442814 272726 535730 406405 339989 360316 528280 657277
17061 657277 463148 398900 478031 382858 416660 741596 293172 473871 412495 470419 586364
17050 586364 625810 236626 585420 437420 245502 515023 757720 462802 553869 861424
17040 861424 642866 364442 895632 450591 618462 941896 588208 282867 616357 684496
17030 684496 552778 540075 436857 574979 468800 533074 807333 750634 643709 929196
17020 929196 327840 794169 738796 887168 1018588 449081 628327 627225 655687 788532
$$ packed form
17091D94212A51811J77596K24699B09380K11026J28419k4174j90671J64965J5408
17081E14353o0425j80492L83936E8120L27275J30128r6114A66873L07126p5552
17071C98447E3905N51470j62561j70088K63004j29325o6416K0327J67964J28997
17061F57277j94129o4248P9131r5173L3802L24936B93172J80699o1376N7924J15945
17050E86364L9446B36626L48794j48000j91918K69521K42697k94918R1067L07555
17040H61424k18558k78424N31190m45041J67871L23434l53688B82867L33490O8139
17030F84496j31718j2703j03218J38122j06179O4274K74259n6699j06925K85487
17020I29196C27840M66329n5373J48372J31420D49081J79246j102K8462J32845
$$ plain form
17010 788532 490192 690941 991049 610234 573838 567977 621066 620454 837202 475962 711187
16999 711187 822303 667341 586876 666990 633525 586118 802951 865428 676685 732139 726318
16988 726318 632007 404643 386440 831993 830241 1028662 1052492 1059369 830745 1105851 708496
16977 708496 874048 621557 781332 822731 619349 837091 930935 815894 845330 761054
16967 761054 903908 1275960 645839 935255 828511 918912 1095043 602296 1161359 1051468
16957 1051468 721074 954480 839978 1052947 1374144 1098274 839558 1026148 928060 908746
16947 908746 950976 1120179 944562 999050 1456160 1166828 1112222 1408577 1137673 1287443
16937 1287443 1319830 1357458 1723407 1192448 1486998 1214082 1315892 1286512 1328497 1446386
$$ packed form
17010G88532k98340K00749L00108l80815l6396n861N3089o12K16748l61240K35225
16999G11187J11116j54962q0465Q0114l3465m7407K16833O2477j88743N5454n821
16988G26318r4311k27364j8203M45553j752J98421K3830O877k28624K75106l97355
16977G08496J65552k52491J59775M1399k03382K17742R3844j15041K9436q4276
16967G61054J42854L72052o30121K89416j06744R0401J76131m92747N59063j09891
16957A051468l30394K33406j14502K12969L21197k75870k58716J86590r8088j9314
16947I08746M2230J69203j75617N4488M57110k89332n4606K96355k70904J49770
16937A287443L2387L7628L65949n30959K94550k72916J01810k9380M1985J17889
$$ plain form
16927 1446386 1283099 1493381 1388490 1443053 1673374 1218668 1600091 1218755 1173714 1397974
16917 1397974 1583149 1698965 1495712 1458824 1396221 1468655 1556225 1601927 1664522 1695054 1800526
16906 1800526 1734327 1802218 1752782 1611801 1654755 1648334 1749083 1398270 1670378 1485193
16896 1485193 1720895 1832936 1756344 1903143 1981728 1888559 1672853 1735307 2021485 2180965
16886 2180965 1782817 2029048 2282652 2306685 1959985 1881934 2160251 2130421 2418623 2155645
16876 2155645 2540352 2385075 2453922 2322304 2077255 2257527 2275951 2441560 2578653 2111386
16866 2111386 2644481 2589050 2459809 2916783 2708801 2584833 2693445 2624736 2862865 3104088
16856 3104088 2946543 2804120 2959439 3063134 3011196 3296073 3339649 3315436 3252474 3439608
$$ packed form
16927A446386j63287K10282j04891N4563K30321m54706L81423l81336m5041K24260
16917A397974J85175J15816k03253l6888o2603P2434Q7570M5702O2595L0532J05472
16906A800526o6199O7891m9436j40981M2954o421J00749l50813K72108j85185
16896A485193K35702J12041p6592J46799P8585r3169k15706O2454K86178J59480
16886B180965l98148K46231K53604K4033l46700p8051K78317k9830K88202k62978
16876B155645L84707j55277O8847j31618k45049J80272J8424J65609J37093m67267
16866B111386N33095n5431j29241M56974k07982j23968J08612o8709K38129K41223
16856C104088j57545j42423J55319J03695n1938K84877M3576k4213o2962J87134
$$ plain form
16846 3439608 3341783 3332333 3404875 3695649 3036957 3733534 3811159 4112313 4131075 4145548 3954897
16835 3954897 4106907 4299386 4288702 4248705 4176493 4499306 4612751 4488559 4621682 4892864
16825 4892864 4520050 5040295 4656806 5140941 5029232 5544285 5260852 5588341 5223346
16816 5223346 5805527 6039327 6001655 6313264 6326129 6267238 6266035 6387038 6597494 6939982
16806 6939982 6792023 6919278 7088767 7266881 7599289 7808314 7649481 8109947 8254352
16797 8254352 8430756 8768359 8909272 8772870 9091433 9521563 9876774 10163172 9851687
16788 9851687 10442948 11082730 11159634 11640720 11970526 12038628 12348988 12700946 13295900 13653585
16778 13653585 13822376 14274297 14800257 14939938 15920836 16051390 16704889 17235770 17657087
$$ packed form
16846C439608r7825r450P2542K90774o58692O96577P7625L01154J8762J4473j90651
16835C954897J52010J92479j0684l9997p2212L22813J13445j24192J33123K71182
16825D892864l72814N20245l83489M84135j11709N15053k83433L27489l64995
16816E223346N82181K33800l7672L11609J2865n8891j203J21003K10456L42488
16806F939982j47959J27255J69489J78114L32408K09025j58833M60466J44405
16797H254352J76404L37603J40913j36402L18563M30130L55211K86398l11485
16788I851687N91261O39782P6904M81086L29806O8102L10360L51958N94954L57685
16778A3653585J68791M51921N25960J39681R80898J30554O53499N30881M21317
$$ plain form
16769 17657087 18231546 19400636 19370702 20636696 20956697 21905381 22422754 23539232 24291323
16760 24291323 25598729 26071578 27379845 28597909 29737916 31284711 32199315 33881042
16752 33881042 35150855 37060983 38969167 40452767 42431608 44602845 46733540 49135772
16744 49135772 51898811 54447856 57344188 60482340 63959204 67570384 71198867 75211866
16736 75211866 79571242 84373011 89353152 94814285 100147714 106485737 113084144 119417924
16728 119417924 126475276 133942043 141409339 148860310 156629262 163839165 171697457 178721139
16720 178721139 184671131 190274626 194771937 197971387 200191557 200700226 200038915 197900445
16712 197900445 194590745 189632917 184219281 177812033 170646528 162790721 155387017 147368650
$$ packed form
16769A7657087N74459J169090k9934J265994L20001R48684N17373J116478P52091
16760B4291323J307406M72849J308267J218064J140007J546795R14604J681727
16752C3881042J269813J910128J908184J483600J978841K171237K130695K402232
16744D9135772K763039K549045K896332L138152L476864L611180L628483M012999
16736G5211866M359376M801769M980141N461133N333429O338023O598407O333780
16728A19417924P057352P466767P467296P450971P768952P209903P858292P023682
16720A78721139N949992N603495M497311L199450K220170N08669o61311k138470
16712A97900445l309700m957828n413636o407248p165505p855807p403704q018367
$$ plain form
16704 147368650 139340890 131269716 124208875 116957750 110317382 103393321 97220949 91426371
16696 91426371 85834643 81351303 76162508 72048564 67830134 64125296 60293246 57198154
16688 57198154 53968331 51226085 48454371 45740270 43633573 41430530 39398689 37668394
16680 37668394 35528312 34222607 32579400 30777850 29616787 28600613 27026755 25906984
16672 25906984 24554854 23911447 22856123 22036902 21335260 20284931 19677414 18773043 18026402
16663 18026402 17921229 17109146 16523583 15826529 15332721 14955965 14234743 13673622 13590413
16654 13590413 12726122 12757207 12319126 11817851 11489905 11333654 10623596 10467403 10216198
16645 10216198 10102519 9329215 9182847 9305509 9180329 8669175 8608985 8342501 7846028
$$ packed form
16704A47368650q027760q071174p060841p251125o640368o924061o172372n794578
16696I1426371n591728m483340n188795m113944m218430l704838l832050l095092
16688E7198154l229823k742246k771714k714101k106697k203043k031841j730295
16680C7668394k140082j305705j643207j801550j161063j016174j573858j119771
16672B5906984j352130o43407j055324q19221p01642j050329o07517r04371p46641
16663A8026402j05173q12083n85563o97054m93808l76756p21222n61121q3209
16654A3590413q64291L1085m38081n01275l27946j56251p10058j56193k51205
16645A0216198j13679p73304j46368J22662j25180n11154o0190k66484m96473
$$ plain form
16636 7846028 7721447 7627932 7340871 7234809 7234046 7030186 6930435 6767897 6545004 6140480
16626 6140480 5844588 6149316 6160451 5801086 5552246 5518291 4929486 5118145 5453134 5101579
16616 5101579 5097711 4874260 4423549 4722075 4418302 4153695 4285108 4301967 3849841 4270410
16606 4270410 3832201 3862519 3659886 3848142 3734822 3791289 3440052 3322471 3579723 3409214
16596 3409214 3199648 3465582 3614180 3373435 3109121 2905298 3054368 3092397 3047293 3127694
16586 3127694 3014842 2780523 2762951 2926511 2895393 2516272 2442944 2289098 2565406 2336250
16576 2336250 2618085 2521104 2358726 2355041 2354952 2519908 2240011 2169694 2312700 2111867 2121222
16565 2121222 2226256 2027933 1687955 1901673 1728426 1901234 1984980 1688910 1944010 1780998
$$ packed form
16636G846028j24581r3515k87061j06062p63k03860r9751j62538k22893m04524
16626F140480k95892L04728J1135l59365k48840l3955n88805J88659L34989l51555
16616E101579l868k23451m50711K98526l03773k64607J31413J6859m52126M20569
16606D270410m38209L0318k02633J88256j13320N6467l51237j17581K57252j70509
16596C409214k09566K65934J48598k40745k64314k03823J49070L8029m5104Q0401
16586C127694j12852k34319j7572J63560l1118l79121p3328j53846K76308k29156
16576B336250K81835r6981j62378l685q9J64956k79897p0317J43006k00833R355
16565B121222J05034j98323l39978K13718j73247J72808Q3746k96070K55100j63012
$$ plain form
16555 1780998 1809147 1929860 1730143 1434994 1890563 1809551 1616522 1861489 1524961 1508815
16545 1508815 1546289 1666242 1488938 1185024 1174929 1607124 1169420 1370550 1244816 1566330
16535 1566330 1549351 1525117 1615406 1611311 1411868 1387423 1193591 1356780 994030 1062328 1263843
16524 1263843 1257246 1296352 982567 886024 1209698 1229959 1095723 1347292 1224870 1344524
16514 1344524 1079457 925054 723409 804181 773403 1241005 500008 1047870 1344855 798569
16504 798569 980833 998504 766271 948113 959645 897154 743775 982643 1016343 674515
16494 674515 768466 694536 859696 696657 983662 757757 889425 843165 516465 786863
16484 786863 760481 489771 592056 901176 795952 766961 1055817 624405 978979 677432
$$ packed form
16555A780998K8149J20713j99717k95149M55569q1012j93029K44967l36528j6146
16545A508815L7474J19953j77304l03914j0095M32195m37704K01130j25734L21514
16535A566330j6979k4234R0289m095j99443k4445j93832J63189l62750O8298K01515
16524A263843o597L9106l13785r6543L23674K0261j34236K51569j22422J19654
16514A344524k65067j54403k01645Q0772l0778M67602E00008N47862K96985n46286
16504G98569J82264J7671k32233J81842J1532o2491j53379K38868L3700l41828
16494F74515R3951p3930J65160j63039K87005k25905J31668m6260l26700K70398
16484G86863k6382k70710J02285L09120j05224k8991K88856m31412L54574l01547
$$ plain form
16474 677432 719211 631959 614089 839406 634285 489367 596614 621607 419244 899012
16464 899012 706817 937119 590377 483245 582352 754540 725940 459063 401570 548006
16454 548006 454364 667725 519515 592583 791096 282422 420837 617779 587410 653766
16444 653766 502563 358959 306897 642963 656254 262688 329671 360017 507889 602846
16434 602846 870609 472469 410267 524116 294664 473057 358376 681637 528354 605987
16424 605987 637242 352395 340706 470845 788758 501264 667322 502341 115040 429332
16414 429332 257071 410109 359368 334687 317766 836309 178485 388026 606154 414906
16404 414906 299251 636251 426279 408939 432339 205042 372976 242163 274837 413313
$$ packed form
16474F77432M1779q7252j7870K25317k05121j44918J07247K4993k02363M79768
16464H99012j92195K30302l46742j07132R9107J72188k8600k66877n7493J46436
16454E48006r3642K13361j48210P3068J98513B82422J38415J96942l0369O6356
16444F53766j51203j43604n2062L36066J3291B62688O6983L0346J47872R4957
16434F02846K67763l98140o2202J13849k29452J78393j14681L23261j53283P7633
16424F05987L1255k84847j1689J30139L17913k87494J66058j64981A15040L14292
16414D29332j72261J53038n0741k4681j6921N18543A78485K09541K18128j91248
16404D14906j15655L37000k09972j7340K3400B05042J67934j30813L2674J38476
$$ plain form
16394 413313 139624 238723 395410 293166 247181 247194 309429 525111 241730 576217 508743
16383 508743 331206 -33152 462732 311987 398759 189853 456333 242750 116871 185365
16373 185365 -90849 -40926 216546 -36672 52188 297569 176635 87776 320326 358491 543978
16362 543978 450585 589540 218326 262267 380705 275218 296330 273845 51420 -40525 67196
16350 296124 184773 231833 84194 108621 250899 287781 -142225 489841 136581 30494
16339 389831 268287 146219 518514 124666 293140 580820 230704 233614 71302 -72652
16328 211033 98557 158333 165370 291690 391322 298163 37923 219286 273297 131779 159830
16317 159830 18676 361200 -42467 341879 325594 -68223 269429 188978 136838 91231 -46357
$$ packed form
16394D13313A39624R9099J56687j02244m5985J3O2235K15682B41730L34487o7474
16383E08743j77537c3152D62732j50745Q6772A89853K66480k13583A16871O8494
16373A85365i0849d0926B16546c6672E2188K45381j20934H7776K32550L8165J85487
16362E43978r3393J38955B18326M3941J18438j05487K1112k2485E1420d0525F7196
16350B96124j11351M7060H4194K4427J42278L6882a42225D89841A36581C0494
16339C89831j21544j22068L72295A24666J68474K87680B30704K910G1302g2652
16328B11033I8557N9776P037J26320R9632r3159C7923J81363N4011A31779K8051
16317A59830A8676L42524d2467C41879j6285f8223B69429q0451n2140m5607d6357
$$ plain form
16305 354290 -56264 347420 47584 58008 38562 -11904 1174 141421 61625 58351 534884
16294 534884 372014 279319 124247 401471 226549 33425 -86642 165859 274460 178800
16284 178800 100914 384079 362004 111534 38426 409851 -172007 -113023 89542 309223
16274 309223 -121835 548443 206701 25173 -5731 49844 362982 21282 518363 391743
16264 391743 8119 -103746 311432 78874 -28346 224079 246106 215295 52655 47710 178556
16253 178556 178480 322565 69971 -26597 -14368 -60490 -112182 85281 30569 15382 105553 198093
16241 198093 -152058 154934 449100 56157 59660 99575 55752 46088 -18503 -3912 -32441
16230 -32441 86928 -133318 19011 -28462 -82970 -294042 217244 -286570 92851 174690 -115446
$$ packed form
16305C54290e6264C47420D7584J0424j9446a1904A174J40247F1625l274M76533
16294E34884j62870r2695A24247K77224j74922C3425h6642A65859J08601r5660
16284A78800p7886K83165k2075A11534C8426L71425a72007N8984H9542K19681
16274C09223a21835E48443B06701B5173e731D9844L13138B1282M97081j26620
16264C91743H119a03746C11432G8874b8346B24079K2027l0811E2655m945J30846
16253A78556p6J44085F9971b6597J2229m6122n1692H5281C0569j5187R0171R2540
16241A98093a52058A54934K94166E6157L503L9915m3823r664a8503c912k8529
16230c2441H6928a33318A9011b8462n4508k11072B17244b86570I2851Q1839a15446
$$ plain form
16218 200136 -33005 6315 777 -378309 39014 188543 182120 -149570 -228968 241531 43511
16206 -138767 91454 -11203 85116 75815 -80059 -13363 -86501 132070 357041 85323 197049
16195 197049 49354 -100741 43629 326535 97845 -2793 15406 274437 171730 369450 -41800
16183 314050 246390 -18761 -171158 61659 125706 -20887 -107452 -218407 -186773 108533 -34362
16171 -197277 132604 -193435 233525 -218602 113978 -61418 237918 203341 134464 16162
16160 -48927 -205658 -70368 -3557 -302727 -308533 153823 -177497 -316646 43861 -137512 20113
16148 -102912 93264 200764 54039 -280672 -10812 80275 41270 -312167 -166135 299098
16137 297110 188438 26354 -71365 -117800 341525 210212 -81788 104978 -68066 -240998
$$ packed form
16218B00136c3005F315G77c78309C9014J49529o423a49570p9398B41531D3511
16206a38767I1454a1203H5116r301h0059a3363p3138A32070K24971H5323J11726
16195A97049D9354a00741D3629K82906I7845b793A5406K59031j02707J97720d1800
16183C14050o7660a8761j52397F1659O4047b0887q6565j10955L1634A08533c4362
16171a97277A32604a93435B33525b18602A13978f1418B37918l4577o8877A6162
16160d8927j56731g0368c557k99170n806A53823a77497j39149D3861a37512B0113
16148a02912I3264J07500E4039b80672a0812H0275l9005c12167J46032B99098
16137B97110j08672B6354g1365m6435C41525j31313h1788A04978f8066j72932
$$ plain form
16127 -240998 -100239 274554 163505 -171792 -429575 -2386 46958 122320 27529 385672
16117 385672 -151951 202302 -46531 -53542 -61745 44718 -30458 -149026 -71234 64355 -150510
16105 -160441 -130993 20383 209834 196264 422769 162201 48889 232059 267725 181792 -94978
16093 168857 82300 -8837 37759 19025 -122559 -179926 -20176 35658 163634 65893 20555
16081 129661 -195661 -143617 -1725 45461 -50708 -139105 165533 -287409 108984 -144025 -91123
16070 -91123 -58569 261748 397950 134347 96771 -194689 97534 21477 -46695 71048 184585
16059 184585 359308 67919 -87528 -39169 -89186 -210763 -269794 -211443 -93598 59953 146226
16048 146226 -144605 -157087 49792 -213632 108716 387278 -170647 -243195 -327595 131280
$$ packed form
16127b40998a00239B74554j11049a71792k57783b386D6958P5362B7529L58143
16117C85672a51951B02302d6531p011q203D4718c0458j18568g1234F4355a50510
16105a60441K9448B0383J89451j3570K26505A62201D8889J83170L5666q5933i4978
16093A68857H2300h837C7759j8734a22559n7367b0176C5658J27976F5893B0555
16081A29661a95661N2044a725D5461e0708q8397A65533b87409A08984a44025N2902
16070i1123L2554B61748J36202A34347l7576a94689I7534B1477d6695G1048J13537
16059A84585J74723F7919h7528c9169n0017j21577n9031N8351i3598E9953Q6273
16048A46226a44605j2482D9792b13632A08716K78562a70647p2548q4400A31280
$$ plain form
16037 164678 -150340 -52662 -49611 -85728 -178629 79121 -251092 -269148 59607 -45169 146070
16025 98713 -24871 -203605 280289 209563 -234521 -116556 195406 -110 -112115 273966 112217
16013 -307306 -36459 88897 159156 -339805 -280570 24753 -343163 -19403 127334 230879 -100464
16001 50032 -46359 -86016 -20035 -23152 33688 -67492 59118 -95998 -419964 -12766 -251132
15990 -251132 94389 -187555 -66143 15485 -8235 -87530 68515 264254 176482 374812 1276
15978 343402 -16562 -97307 110893 -56899 192709 247795 104977 137955 -28901 231950 166126
15967 166126 -347633 141702 -69140 98217 17585 -282816 130344 -76524 -440080 117162
15956 107872 -218146 -63449 70092 57143 -243102 -264867 -78741 -253636 -142983 -228156 102868
$$ packed form
16037A64678a50340e2662L051l6117r2901G9121b51092j8056E9607d5169A46070
16025I8713b4871j78734B80289p0726b34521a16556A95406a10j12005B73966A12217
16013c07306c6459H8897P0259c39805N9235B4753c43163a9403A27334J03545a00464
16001E0032d6359l9657b0035l117C3688f7492E9118i5998l23966a2766k38366
15990b51132I4389a87555f6143A5485h235p9295F8515J95739q7772J98330A276
15978C43402a6562q0745A10893e6899A92709N5086A04977L2978b8901B31950o5824
15967A66126c47633A41702f9140I8217A7585b82816A30344g6524l63556A17162
15956A07872b18146f3449G0092j2949b43102k1765g8741j74895J10653q5173A02868
$$ plain form
15944 -80264 201734 -146345 35657 -105716 127751 -228656 141448 135578 184667 241280 -164821
15932 -159899 -213254 -192997 -208579 170550 -169536 -80198 -331753 143015 124328 -34656 -292865
15921 -292865 50761 119186 -452329 -160164 -322466 206718 135381 9717 -60818 -29835 9371
15909 -192244 324499 -29248 -78312 163102 -411164 -162606 355579 109139 62986 -77528
15898 -136408 -15890 -60336 -85709 -95855 174695 151559 -225235 232215 -73276 -246898 -96726
15886 -169892 9530 151250 -378252 -80402 -204074 160007 34553 91688 91480 14445 -262913
15874 19838 365058 -293053 305868 -222058 36037 177636 -177825 -162693 -28405 -20094 -401620
15863 -401620 -120939 93224 214991 346666 44064 -50225 -120614 -31981 -186947 -212126 -177696
$$ packed form
15944h0264B01734a46345C5657a05716A27751b28656A41448n870M9089N6613a64821
15932a59899n3355K0257j5582A70550a69536h0198k51555A43015j8687c4656k58209
15921b92865E0761O8425d52329a60164j62302B06718p1337I717f0818b9835I371
15909a92244C24499b9248m9064A63102d11164a62606C55579A09139m6153g7528
15898a36408a5890m4446k5373j0146A74695k3136b25235B32215g3276j73622i6726
15886a69892I530J41720c78252h0402j23672A60007C4553N7135k08A4445b62913
15874A9838L45220b93053C05868b22058C6037J41599a77825J5132b8405Q311l81526
15863d01620a20939I3224J21767J31675D4064e0225p0389c1981j54966k5179L4430
$$ plain form
15852 -177696 -116450 -247912 -45106 426486 65152 -165466 -39656 -156907 -116175 -214188 43229
15840 -13026 73644 19137 182461 -85869 65624 -139841 -106796 106551 296683 -334490 280720
15828 -4542 -29944 126872 -123946 480384 -215156 -16784 -43975 107914 94111 100361 112808
15817 112808 -285673 -280030 -143248 168039 -72043 50201 70452 -189013 -82865 -214713 -218628
15806 -218628 -215178 -248855 72856 20495 -218985 6144 -122287 -220388 -111059 -29042 -203855
15795 -203855 59577 -468291 27555 133395 -108330 -86323 -127530 80698 -234350 21428 1598
15783 -137062 -27672 50601 16020 296631 -411688 -17781 -214420 241026 65057 73090 149684
15772 149684 236016 -231321 -65332 -3868 -353211 -180024 52745 -81022 -118136 80421 -156165
$$ packed form
15852a77696O1246j31462d5106D26486F5152a65466c9656j17251M0732r8013D3229
15840a3026G3644A9137J63324h5869F5624a39841L3045A06551J90132c34490B80720
15828d542k5402A26872a23946D80384b15156a6784k7191A07914j3803O250J2447
15817A12808b85673N643J36782A68039g2043E0201K0251a89013h2865j31848l915
15806b18628L450l3677G2856B0495b18985F144a22287r8101J09329b9042j74813
15795b03855E9577d68291B7555J05840a08330K2007m1207H0698b34350B1428A598
15783a37062b7672E0601A6020K80611d11688a7781j96639B41026F5057Q033P6594
15772A49684Q6332b31321f5332c868l49343J73187E2745h1022l7114H0421a56165
$$ plain form
15760 150450 45861 144498 289705 243382 42584 107901 76699 177637 -167395 -36947 156244
15748 128897 -141618 95037 -80045 -95018 390787 354871 302648 9317 211625 -55781 -51125
15737 -51125 -173451 -35946 -29838 -233250 -55802 5477 -44473 3722 53592 -310977 -173040
15726 -173040 11581 -60992 -109868 7954 20972 400088 -79 -114203 -300453 231000 34720
15714 216699 106352 -120569 -47454 -292094 167440 -31701 105878 40964 -19006 -316226
15704 -316226 64894 12232 202676 9537 -345028 -250795 -222456 97570 7696 106716 90314
15693 90314 -281037 50283 43572 11383 -165448 -140142 115881 -98137 -155737 -357199 -138949
15681 -54531 119337 -12906 -417580 -160387 -53813 -450475 -358219 129045 28616 -125293
$$ packed form
15760A50450D5861R8637J45207m6323D2584O5317l1202J00938a67395c6947A56244
15748A28897a41618I5037h0045j4973C90787l5916n2223I317K02308e5781M656
15737e1125j22326c5946O108k03412e5802E477d4473C722M9870c10977J37937
15726a73040A1581f0992m8876G954J3018L79116g9j14124j86250B31000C4720
15714B16699A06352a20569d7454k44640A67440c1701A05878D0964a9006k97220
15704c16226F4894A2232J90444I537c45028R4233K8339I7570G696R9020j6402
15693I0314b81037E0283o711A1383a65448K5306A15881i8137n7600k01462a38949
15681e4531A19337a2906m04674a60387e3813l96662R2256A29045B8616a25293
$$ plain form
15670 378265 142285 -147107 64846 -214112 44675 -122623 12233 349193 -116161 -166105
15660 -166105 39968 -108088 32052 -2523 142370 409579 -9982 -91895 33192 -71756 21877
15648 -64821 -85133 -145497 249059 -108159 -157348 32647 294844 220077 -26556 -84331 -174946
15637 -174946 209961 109109 -175772 31066 -316385 -137310 144088 476560 -15509 198118
15626 -118905 -193759 207868 -268460 196214 -248779 -66193 -101698 -300505 194621 440637
15616 440637 -12452 -198157 -224460 -111397 -94298 -159491 267204 50926 -203656 210757
15605 -81859 -165512 -38688 -68460 -86326 -417325 -86105 -45899 27214 92890 142457 20650
15593 -144940 -107682 -49713 -369292 15210 -162935 138193 122686 -48755 -42107 -145241 102952
$$ packed form
15670C78265A42285a47107F4846b14112D4675a22623A2233L36960a16161m9944
15660a66105C9968a08088C2052b523A42370K67209i982q1913C3192g1756B1877
15648f4821k0312o0364B49059a08159m9189C2647K62197p4767b6556n7775r0615
15637a74946B09961j00852a75772C1066c16385a37310A44088L32472a5509A98118
15626a18905p4854B07868b68460A96214b48779f6193l5505j98807A94621K46016
15616D40637a2452j85705k6303a11397J7099o5193B67204E0926b03656B10757
15605h1859q3653c8688k9772j7866l30999h6105M0206B7214O5676M9567B0650
15593a44940L7258d9713l19579A5210a62935A38193j5507d8755O648j03134A02952
$$ plain form
15581 -106560 -57932 44741 121713 -33729 -127606 168071 163741 -342736 75907 -136047 -218935
15570 -218935 301418 87136 228807 -18529 -71719 -89719 -43943 -70305 170377 145137 25817
15558 181863 286612 28381 -148666 -216203 24427 -84138 -9489 -667 2388 -95846 278427 218895
15546 218895 131114 -140822 -22403 -58398 -63902 54623 184877 -39268 -19755 115516 214559
15535 214559 8639 -51260 -69010 353608 126331 -178928 20261 -57715 -24670 -186815 -235505
15524 -235505 182786 75386 55165 -291784 21968 184957 351689 353876 -316506 62368 -41020
15512 9572 -25146 44411 -53158 -116349 81812 -19340 -90335 29555 -110 -413370 -419087 -524951
15500 -524951 -25347 157546 -215651 -80053 -454136 202908 -107134 -49936 45311 -135131
$$ packed form
15581a06560M8628D4741P6972c3729r3877A68071m330c42736G5907a36047q2888
15570b18935C01418H7136J41671a8529n3190j8000d3943k6362A70377k5240B5817
15558A81863J04749B8381a48666o7537B4427h4138i489f67B388i5846B78427n9532
15546B18895q7781a40822b2403l5995n504E4623J30254c9268J9513A15516R9043
15535B14559H639e1260j7750C53608A26331a78928B0261e7715b4670j62145m8690
15524b35505A82786G5386k0221b91784B1968J62989J66732K187c16506F2368d1020
15512I572b5146D4411e3158o3191H1812a9340p0995B9555a10m13260n717j05864
15500e24951b5347A57546b15651h0053l74083B02908a07134d9936D5311a35131
$$ plain form
15489 -40644 -99169 332619 2405 50413 223990 275832 -213657 -182369 -115582 -354327 384872
15477 -2152 -2599 -105763 -100804 -100400 294502 -333080 612461 -105311 -305920 -355266 225238
15465 -88623 135683 153997 -27405 144404 -10780 -342830 22836 105059 220599 -113712 -236529
15454 -236529 151614 108474 -32572 -248938 213000 124780 50330 -251387 -373583 35380
15443 -189502 39754 -157246 127403 -197445 -94183 -31249 -118696 -10432 419725 63972 153221
15432 153221 -172533 212357 37608 -370696 -191949 57319 6339 69663 -343635 -32511 -126989
15421 -126989 -168000 -101088 473278 263875 -28676 304864 45616 -98708 31394 -35486 -193281
15410 -193281 77087 15546 -298377 16542 14019 28658 -55633 -13897 -291030 -2244 -14136
$$ packed form
15489d0644n8525C32619B405M8008J73577N1842b13657L1288O6787k38745C84872
15477b152m47j03164M959M04B94502c33080F12461a05311k00609m9346B25238
15465h8623A35683J8314b7405A44404a0780l32050B2836Q2223J15540a13712j22817
15454b36529A51614m3140c2572k16366B13000q8220E0330b51387j22196C5380
15443a89502C9754a57246A27403a97445i4183c1249q7447a0432D19725F3972Q9249
15432A53221a72533B12357C7608c70696J78747E7319F339O3324c43635c2511r4478
15421a26989m1011O6912D73278k09403b8676C04864D5616i8708C1394c5486j57795
15410a93281G7087A5546b98377A6542k523J4639e5633a3897k77133b244j1892
$$ plain form
15399 -14136 282857 -60881 -36326 117302 -332857 -174886 -243222 199013 170376 156236 -46534
15387 -96650 -86518 -330476 -85332 209498 -151201 223132 -24781 -29335 146759 107791 -156971
15375 192155 20183 -148958 148567 -74177 -193936 259314 -58360 187578 28959 110476
15365 110476 -144163 -129666 49141 7576 -108540 -114145 91747 -393094 50362 1644 301424
15354 301424 404212 21968 -2395 -237311 -131881 -122874 192884 93121 29838 77104 -351722
15342 165895 55689 -44724 191934 -150919 231727 282484 98595 -177755 303994 167384
15332 167384 14119 -236815 -226789 20375 31597 238833 288623 -186287 85361 -53343 235591
15320 78837 -271060 -150209 58825 13992 81966 -102691 -138682 -135661 73303 189646 -138480
$$ packed form
15399a4136B82857f0881K4555A17302c32857J57971o8336A99013k8637j4140d6534
15387i6650J0132k43958h5332B09498a51201B23132b4781m554A46759l8968a56971
15375A92155B0183a48958A48567g4177j19759B59314e8360A87578B8959Q1517
15365A10476a44163J4497D9141G576a08540n605I1747c93094E0362A644K99780
15354C01424J02788B1968b395k34916J05430R007A92884I3121B9838M7266c51722
15342A65895E5689d4724A91934a50919B31727N0757I8595a77755C03994j36610
15332A67384A4119b36815J0026B0375J1222K07236M9790a86287H5361e3343B35591
15320G8837b71060J20851E8825A3992O7974a02691l5991L021G3303J16343a38480
$$ plain form
15308 322749 125044 -190137 272948 147589 -2483 -173922 173086 -58046 -104075 -76970
15298 -76970 413601 -84410 -40600 -50055 111864 42633 43317 -197377 261638 75905 62510
15287 62510 36446 -92307 -29967 67997 -18105 -31828 283075 61720 30733 87328 -19015
15275 112631 180673 284303 -291468 -147372 125084 140087 164242 94060 33384 -255381
15264 106520 254294 155388 278320 149247 -68613 178967 232073 162547 13089 -55110 269824
15252 -40170 379186 112976 293127 676199 1506221 1015579 1239606 1251226 703938 143603
15241 12511 194454 -38712 286853 267229 147478 71914 108838 -78183 37522 266753 -71685
15229 24376 73629 256718 122796 -20001 151506 1460 -113220 76442 391135 362822 8626
$$ packed form
15308C22749A25044a90137B72948j25359b483j71439A73086e8046m6029K7105
15298g6970D13601h4410d0600r455A11864D2633O84a97377B61638G5905j3395
15287F2510k6064i2307b9967F7997a8105j3723B83075F1720C0733N6595a9015
15275A12631O8042J03630b91468J44096A25084J5003K4155p0182C3384b55381
15264A06520J47774r8906J22932j29073f8613A78967N3106o9526A3089e5110B69824
15252d0170C79186A12976J80151L83072Q30022m90642K24027J1620n47288A43603
15241A2511J81943c8712B86853j9624j19751G1914L6924g8183C7522K29231g1685
15229B4376M9253J83089A22796b0001A51506A460a13220G6442L14693k8313H626
$$ plain form
15217 55007 855 43805 72300 18444 -139498 -65498 -20148 -39809 -41946 52656 256013 22172
15204 170633 118614 183082 -205248 -31335 74402 -235769 211277 150273 -208229 197245
15193 34701 -69132 -70034 44681 -293814 42377 -2552 -360396 -420542 63720 283222 290154 120345
15180 73879 274044 -91494 8276 194521 117955 176313 -138461 92654 112188 101485 113670
15169 113670 58244 -45173 -156669 215772 22913 264428 111298 130189 87964 -172786
15158 36745 182158 194779 243320 -182613 -50324 -4848 72053 430181 -126359 -100186 -13319
15146 -80318 186930 346521 306014 -146180 -366174 240084 -428657 104432 171218 -36002
15135 -3646 61211 55667 -8319 242331 356765 352459 442123 218956 36927 124770 5337 153486
$$ packed form
15217E5007H55M2950K8495A8444a39498f5498b0148j9661k137E2656K03357B2172
15204A70633n2019O4468b05248c1335G4402b35769B11277o1004b08229A97245
15193C4701f9132r02D4681b93814D2377b552l57844o0146F3720K19502O932A20345
15180G3879K00165i1494H276J86245p6566N8358a38461I2654J9534j0703J2185
15169A13670n5426d5173j11496B15772B2913K41515A11298J8891m2225a72786
15158C6745J45413J2621M8541a82613e0324d848G2053L58128a26359K6173a3319
15146h0318A86930J59591m0507a46180k19994B40084d28657A04432O6786c6002
15135c646F1211n544h319B42331J14434m306Q9664B18956C6927Q7843E337J48149
$$ plain form
15123 153486 179371 157027 182238 225647 91576 415885 284241 75035 -6814 -152578 97294
15111 82038 18893 -101953 -46504 237751 188453 342057 229524 115731 -84666 529704
15100 194852 199307 321782 185029 95579 38486 269080 77091 120772 150804 355271 237447
15089 237447 79515 -9880 90072 98264 214194 317494 43766 379509 126475 348184 38432
15077 68950 -41356 47977 161690 362829 107484 84395 -90948 181709 164797 47288 61012
15066 61012 264309 348778 101134 235377 184908 213742 213761 211716 187657 497041 142898
15054 68018 152978 -32760 266082 71193 -329510 275950 159909 206739 83573 139594 10657
15042 -119531 131693 235350 271777 341228 311125 431774 294246 395345 257512 -3452
$$ packed form
15123A53486K5885k2344K5211M3409I1576L24309j31644G5035f814j45764I7294
15111H2038A8893a01953d6504B37751m9298J53604j12533j13793h4666E29704
15100A94852M455J22475j36753q9450C8486K30594G7091M3681L0032K04467j17824
15089B37447G9515i880I0072Q192J15930J03300D3766L35743A26475K21709C8432
15077F8950d1356D7977J13713K01139A07484k3089i0948A81709j6912D7288J3724
15066F1012K03297Q4469A01134J34243n0469K8834J9k045k4059L09384A42898
15054F8018Q4960c2760B66082G1193c29510B75950j16041M6830H3573N6021A0657
15042a19531A31693J03657L6427O9451l0103J20649j37528J01099j37833c452
$$ plain form
15031 415213 -24646 76540 113506 104045 122857 170369 82650 148203 334050 332887 292770 155033
15019 155033 227234 146501 151244 296729 137361 112731 232244 325747 33698 373540 167274
15007 16361 531129 229156 -170452 292871 211746 431575 348948 417760 350213 400886 326355
14996 326355 29429 261076 196633 -32523 159182 194668 313693 229010 153388 125921 -56652
14984 137407 -2290 92279 252179 235629 408279 524044 276800 457018 338915 407586
14974 407586 156538 296323 -84873 169718 379311 285206 398740 211713 315612 535052
14964 535052 -181901 287401 27297 41769 76168 298487 488849 393783 360607 253276
14954 253276 286205 254292 292343 41851 537229 371476 311355 143621 -16386 444753 84181
$$ packed form
15031D15213b4646G6540L6966r461J8812M7512H2650O5553J85847j163m0117j37737
15019A55033P2201q0733M743J45485A37361k4630J19513R3503C3698L39842A67274
15007A6361N14768B29156a70452B92871q1125K19829q2627O8812o7547N0673p4531
14996C26355B9429K31647o4443c2523A59182L5486J19025q4683p5622k7467e6652
14984A37407b290I2279J59900j6550J72650J15765k47244J80218j18103O8671
14974D07586A56538J39785h4873A69718K09593r4105J13534j87027J03899K19440
14964E35052a81901B87401B7297J4472L4399K22319J90362r5066l3176j07331
14954B53276L2929l1913L8051D1851M95378j65753o0121A43621a6386D44753H4181
$$ plain form
14942 247933 447923 275931 218615 99067 100382 359141 474871 18392 28460 331521 226913
14931 226913 379537 635402 197475 64820 395836 440484 329705 303897 372928 270132
14921 270132 350935 520091 558401 329643 574339 44008 330815 135809 403626 141444
14910 238380 240978 -112342 361066 587311 384480 374856 534801 342750 228012 386395
14900 386395 325319 426598 209363 169536 95168 -11231 511713 291248 235342 281790 93395
14888 277648 412906 236094 693421 396424 674657 151040 364343 129101 326829 719918
14878 719918 219443 339291 379242 486426 664412 446965 331033 106514 608827 398248
14868 398248 220106 722487 279746 192167 105899 647254 247708 380085 453752 298718
$$ packed form
14942B47933J99990j71992n7316I9067J315K58759J15730A8392J0068L03061j04608
14931B26913J52624K55865A97475F4820L31016M4648j10779k5808O9031j02796
14921B70132Q0803J69156L8310k28758K44696D4008K86807A35809K67817A41444
14910B38380K598a12342C61066K26245k02831r624J59945j92051j14738J58383
14900C86395o1076J01279B09363l9827p4368a1231E11713k20465n5906M6448I3395
14888B77648J35258j76812M57327k96997K78233A51040K13303A29101J97728L93089
14878G19918B19443J19848L9951J07184J77986k17447j15932A06514N02313k10579
14868C98248j78142N02381B79746q7579q6268N41355B47708J32377P3667j55034
$$ plain form
14858 298718 338014 552134 391781 339206 200322 363230 366894 581648 267439 300877
14848 300877 45271 467217 421185 265925 354547 314190 273353 682020 368337 682133
14838 682133 264079 493130 269348 562619 423163 661518 254918 617202 462897 584205
14828 584205 373251 477389 500094 595998 160203 419164 843948 571901 677533 439973
14818 439973 162979 530217 254096 763774 488805 555808 359012 572758 466944 343094
14808 343094 535385 816480 806855 388690 659117 753556 348058 132219 372493 526803
14798 526803 501068 560920 583508 556274 802130 541854 563005 584392 390350 380393 536066
14787 536066 823324 282932 707894 600610 694913 715521 673352 571732 527055 428086
$$ packed form
14858B98718L9296K14120j60353n2575j38884J62908L664K14754B67439L3438
14848C00877D5271M21946m6032j55260Q8622m0357m0837M08667l13683L13796
14838F82133B64079K29051k23782K93271j39456K38355B54918L62284j54305J21308
14828E84205k10954J04138K2705R5904A60203K58961M24784k72047J05632k37560
14818D39973A62979L67238B54096N09678k74969O7003j96796K13746j05814j23850
14808C43094J92291K81095r625C88690K70427R4439C48058A32219K40274J54310
14798E26803k5735N9852K2588k7234K45856k60276K1151K1387j94042r957J55673
14787E36066K87258B82932M24962j07284R4303K0608m2169j01620m4677r8969
$$ plain form
14777 428086 602835 539293 419818 462204 663187 502209 317276 640058 846702 898375
14767 898375 706558 543930 312381 842152 514643 656551 350051 774382 739261 784940
14757 784940 478222 536681 547579 692016 635196 795662 353718 944534 387038 1077828
14747 1077828 969200 682428 695254 782585 803111 522858 445776 913250 1012536 682933
14737 682933 757838 701444 581308 554414 1006885 803187 619632 813955 752012 806444
14727 806444 782812 679517 692459 865692 543490 576457 523484 742916 1146219 986231
14717 986231 1124004 928316 876536 951457 1003071 1137218 960425 1094198 960680 722993
14707 722993 723263 673797 673386 970799 964977 852602 646785 614119 930986 948779 988135 699519
$$ packed form
14777D28086J74749o3542j19475M2386K00983j60978j84933L22782K06644N1673
14767H98375j91817j62628k31549N29771l27509J41908l06500M24331l5121M5679
14757G84940l06718N8459J0898J44437n6820J60466C53718N90816C87038O90790
14747A077828j08628k86772J2826Q7331K0526k80253p7082M67474R9286l29603
14737F82933P4905n6394j20136k6894M52471k03698j83555J94323o1943N4432
14727H06444k3632j03295J2942J73233l22202L2967n2973K19432M03303j59988
14717I86231J37773j95688n1780P4921N1614J34147j76793J33773j33518k37687
14707G22993K70m9466m11K97413n822j12375k05817l2666L16867J7793L9356k88616
$$ plain form
14695 699519 944859 1058785 909485 1113434 856210 1082579 1095085 1040210 1352104 1016135
14685 1016135 826825 1242698 968239 1116515 1007669 607642 943431 1034316 1109388 940040
14675 940040 1154995 719404 1062353 1125395 1080880 1235986 1253064 984582 987439 1198913
14665 1198913 1175829 1191042 1199669 1253699 1304296 838863 846631 1030366 1150020 1211328 1020248
14654 1020248 1090897 1191179 1277342 1320259 1032507 980926 1220796 1185626 1211373 1140280 1164373
14643 1164373 1412305 1463795 1436889 1162373 1087329 1357231 1132751 1646800 1525216 1572548
14633 1572548 1094990 1400579 1345710 1261131 1320294 1394663 1522268 1423730 1538420 1186833
14623 1186833 1198602 1777519 1437220 1358346 1331364 1611062 1470973 1826142 1473014 1313871
$$ packed form
14695F99519K45340J13926j49300K03949k57224K26369J2506n4875L11894l35969
14685A016135j89310M15873k74459J48276j08846m00027L35789R0885P5072j69348
14675I40040K14955m35591L42949O3042m4515J55106J7078k68482K857K11474
14665A198913k3084J5213Q627N4030N0597m65433P768J83735J19654O1308j91080
14654A020248P0649J00282Q6163M2917k87752n1581K39870l5170K5747p1093K4093
14643A164373K47932N1490k6906k74516p5044K69902k24480N14049j21584M7332
14633A572548m77558L05589n4869q4579N9163P4369J27605r8538J14690l51587
14623A186833J1769N78917l40299p8874k6982K79698j40089L55169l53128j59143
$$ plain form
14613 1313871 1504382 1589928 1656424 1351568 1484365 1400553 2033498 1926160 1640841 1678233
14603 1678233 1580582 1826706 1443770 1785384 1610816 1536589 2042262 1781126 1507793 1501010
14593 1501010 1862623 1774108 1638102 1896792 1952864 1940027 2020232 1591989 2284308 2219716
14583 2219716 2032699 2225365 2093098 2084430 2081493 2043172 2284453 2225842 2050145 2325457
14573 2325457 2376267 2215923 2061106 2361229 2192225 2448472 2275687 2202246 2491097 2534394
14563 2534394 2726880 2549687 2839469 2998553 2839369 2623742 3170913 3488481 3475332 3895869
14553 3895869 4008690 4335767 5049940 5761471 7481237 11026300 19812268 39842261 49135805
14544 49135805 22314107 9030777 4780382 3245961 2648994 2280792 2225554 2102520 1994221
$$ packed form
14613A313871J90511Q5546O6496l04856J32797q3812O32945j07338k85319L7392
14603A678233r7651K46124l82936L41614j74568p4227N05673k61136k73333o783
14593A501010L61613q8515j36006K58690N6072j2837Q0205m28243O92319o4592
14583B219716j87017J92666j32267q668k937l8321K41281n8611j75697K75312
14573B325457N0810j60344j54817L00123j69004K56247j72785p3441K88851M3297
14563B534394J92486j77193K89782J59084j59184k15627N47171L17568j3149M20537
14553C895869J12821L27077P14173P11531J719766L545063Q785968K0029993R293544
14544D9135805B2314107I030777m250395j534421n96967l68202n5238j23034j08299
$$ plain form
14535 1994221 2352854 2257580 2075630 2288314 2453272 2152589 2159233 2132560 2421400 2735584
14525 2735584 2633716 2311540 2713806 2465544 2713663 2090663 2499526 2617678 2601055 2866689
14515 2866689 2476246 2882960 2842030 2749871 2655535 2939832 2752343 3189615 2973156 3031245
14505 3031245 2765060 3174209 3272259 3059164 3566284 3343671 3144654 3432401 3224707 3274631
14495 3274631 3617549 3476219 3347738 3482659 3046667 3716840 3550800 3645231 4023618 3576515
14485 3576515 3729937 3622451 4075728 3763874 4008093 3941405 4226720 4217862 4097217 4013978
14475 4013978 4108320 4165371 4129092 4210642 4542663 4396589 4681694 4567500 4524861 4730049
14465 4730049 5065670 4805968 4749402 5044642 5012095 4869381 5355384 5243557 5016495 5184902
$$ packed form
14535A994221L58633r5274j81950K12684J64958l00683O644k6673K88840L14184
14525B735584j01868l22176M02266k48262K48119o23000M08863J18152j6623K65634
14515B866689l90443M06714m0930r2159r4336K84297j87489M37272k16459N8089
14505C031245k66185M09149R8050k13095N07120k22613j99017K87747k07694M9924
14495C274631L42918j41330j28481J34921m35992O70173j66040R4431L78387m47103
14485C576515J53422j07486M53277l11854K44219o6688K85315q858j20645q3239
14475D013978R4342N7051l6279Q1550L32021j46074K85105j14194m2639K05188
14465D730049L35621k59702n6566K95240l2547j42714M86003j11827k27062J68407
$$ plain form
14455 5184902 5316112 5172622 5471422 5593164 5396375 5488609 5840354 5966277 5863054 5804991
14445 5804991 5773747 6008582 6160708 6065921 6160596 6363640 6444808 6686010 6484829 6745662
14435 6745662 6484576 6740731 7284233 7015337 6942122 7753622 7461495 7630790 7481695 7255609
14425 7255609 7770772 7637830 7881694 7901812 8089303 8243990 8466714 8692543 8569186 8649038
14415 8649038 8981782 9027011 9251647 9515126 9615066 9661855 9747510 9882593 9897749 10217485
14405 10217485 10587634 10539374 10489582 10842354 11114363 10962120 11373097 11205775 11754639 12203536
14395 12203536 11996315 12310127 12726205 12626479 12755739 12900557 13284401 13640612 13888462
14386 13888462 14058197 14209417 14542733 14580234 14963690 15401165 15659716 15883966 15959336 16521722
$$ packed form
14455E184902J31210j43490K98800J21742j96789R2234L51745J25923j03223n8063
14445E804991l1244K34835J52126r4787R4675K03044Q1168K41202k01181K60833
14435F745662k61086K56155N43502k68896p3215Q11500k92127J69295j49095k26086
14425G255609N15163j32942K43864K0118J87491J54687K22724K25829j23357P9852
14415H649038L32744M5229K24636K63479R9940M6789Q5655J35083J5156L19736
14405A0217485L70149m8260m9792L52772K72009j52243M10977j67322N48864M48897
14395A2203536k07221L13812M16078r9726J29260J44818L83844L56211K47850
14386A3888462J69735J51220L33316L7501L83456M37475K58551K24250P5370N62386
$$ plain form
14376 16521722 16690151 17118902 17405702 17866664 17925755 18210984 18847479 19150101 19807642
14367 19807642 19767213 20176837 20873795 21063178 21808120 22247704 22528577 23138782 23744976
14358 23744976 24035226 24824917 25383273 25837299 26874545 26624888 27784538 28316691 29161012
14349 29161012 29920077 30872687 31356290 32199453 33220978 33946448 34995320 35663029 36673791
14340 36673791 37757659 38728432 39820034 40781307 41828106 42877804 44350798 45798768
14332 45798768 47060654 48616854 50322290 51877990 53074761 54709751 56707691 58461680
14324 58461680 60377636 62521934 64753883 66939727 69585638 71795447 74186721 77198879
14316 77198879 79961026 82867166 86238665 89426183 93265374 96434817 100423352 104622484
$$ packed form
14376A6521722J68429M28751K86800M60962N9091K85229O36495L02622O57541
14367A9807642m0429M09624O96958J89383P44942M39584K80873O10205O06194
14358B3744976K90250P89691N58356M54026J037246k49657J159650N32153Q44321
14349B9161012P59065R52610M83603Q43163J021525P25470J048872O67709J010762
14340C6673791J083868R70773J091602R61273J046799J049698J472994J447970
14332D5798768J261886J556200J705436J555700J196771J634990J997940J753989
14324E8461680J915956K144298K231949K185844K645911K209809K391274L012158
14316G7198879K762147K906140L371499L187518L839191L169443L988535M199132
$$ plain form
14308 104622484 108943760 113689525 118489847 124092152 129048184 134826256 140813321 147342202
14300 147342202 154561215 161947533 169710864 177639460 185984009 195302781 204483185 214685639
14292 214685639 225403894 236852408 248309865 260590798 273372648 286406275 300020518
14285 300020518 314233903 328569560 342966163 358101205 372818331 387580588 401454877
14278 401454877 415248065 428336065 439916377 450673372 459554798 466521733 470041371
14271 470041371 470064658 469288792 468245451 464112453 457973536 450770320 441410229 430862507
14263 430862507 418679468 405009942 390389418 374930376 359429625 343703689 327672238
14256 327672238 312611868 298599916 284286133 270228982 257221597 244455982 232656631
$$ packed form
14308A04622484M321276M745765M800322N602305M956032N778072N987065O528881
14300A47342202P219013P386318P763331P928596Q344549R318772R180404J0202454
14292B14685639J0718255J1448514J1457457J2280933J2781850J3033627J3614243
14285C00020518J4213385J4335657J4396603J5135042J4717126J4762257J3874289
14278D01454877J3793188J3088000J1580312J0756995Q881426O966935L519638
14271D70041371K3287p75866j043341m132998o138917p203216r360091j0547722
14263D30862507j2183039j3669526j4620524j5459042j5500751j5725936j6031451
14256C27672238j5060370j4011952j4313783j4057151j3007385j2765615j1799351
$$ plain form
14249 232656631 221005490 210344718 199744017 189889809 181115735 173171636 164700618
14242 164700618 157065572 149861935 142877750 136393142 130899588 125343376 119613963 114627375
14234 114627375 109817246 105087894 100903873 97408147 93732212 89497960 86120520 82816014
14226 82816014 79574679 77132283 73725800 71645594 68787325 66353115 64577239 62493911
14218 62493911 60293628 58130725 56365809 54387027 52922823 51807024 49767124 48137865
14210 48137865 46804963 45037430 44647211 43652313 42876249 40782299 39492115 38538768 37312513
14201 37312513 36791903 35797859 34700100 33646900 32563362 31883213 31169714 30879174 29870415
14192 29870415 29091551 28302543 27718677 27012288 26218790 25579501 25153373 24631141 24040664
$$ packed form
14249B32656631j1651141j0660772j0600701r854208q774074p944099q471018
14242A64700618p635046p203637o984185o484608n493554n556212n729413m986588
14234A14627375m810129m729352m184021l495726l675935m234252l377440l304506
14226H2816014l241335k442396l406483k080206k858269k434210j775876k083328
14218F2493911k200283k162903j764916j978782j464204j115799k039900j629259
14210D8137865j332902j767533l90219r94898p76064k093950j290184r53347j226255
14201C7312513n20610r94044j097759j053200j083538o80149p13499k90540j008759
14192B9870415p78864p89008n83866p06389p93498o39289m26128n22232n90477
$$ plain form
14183 24040664 23768051 23135674 22546390 22119952 21651318 21487754 20555239 20046738 20221117
14174 20221117 19580425 19029831 18439660 18159409 18279249 17289503 17277419 16954718 16886318 16281498
14164 16281498 16017372 15803637 15499012 15226126 14791054 14531370 14082798 13985736 13563039
14155 13563039 13864587 13331014 12918251 13337630 12789051 12479520 12355197 12339763 11945589
14146 11945589 11723595 11806209 11358193 11544947 10910217 10873403 10890679 10665989 10645904 10339888
14136 10339888 10126245 9940629 9797494 9814176 9618766 9183532 9277402 9231061 9314375 9166906
14126 9166906 8994006 8683258 8604423 8615906 8523082 8131482 7926484 8158693 8196390 7939020
14116 7939020 8098545 7702830 7586151 7872079 7446918 7248499 6906676 6879041 6700141 6805957
$$ packed form
14183B4040664k72613o32377n89284m26438m68634j63564r32515n08501J74379
14174B0221117o40692n50594n90171k80251J19840r89746j2084l22701o8400o04820
14164A6281498k64126k13735l04625k72886m35072k59684m48572r7062m22697
14155A3563039L01548n33573m12763M19379n48579l09531j24323j5434l94174
14146A1945589k21994Q2614m48016J86754o34730l6814J7276k24690k0085l06016
14136A0339888k13643j85616j43135J6682j95410m35234R3870m6341Q3314j47469
14126I166906j72900l10748p8835J1483r2824l91600k04998K32209L7697k57370
14116G939020J59525l95715j16679K85928m25161j98419l41823k7635j78900J05816
$$ plain form
14106 6805957 6821048 6851745 6438574 6638376 6361734 6585471 6227890 6184270 6150292 6241610
14096 6241610 5997354 6227838 6192296 5980390 5741639 5711684 5358138 5695167 5631594 5295296
14086 5295296 5506697 5434656 5131128 5151627 4980010 5367616 5241512 4836848 5005647 4871641
14076 4871641 4952444 4804522 4715677 4519646 4819789 4632453 4740185 4631901 4649747 4481009
14066 4481009 4530574 4431887 4063465 4245905 4352745 4173303 4091270 4064807 4028411 4191852
14056 4191852 4198745 4057770 3921025 4124940 3950715 3756272 3531469 3764748 3754221 3785216
14046 3785216 3407034 3519091 3596428 3535537 3160994 3224131 3360338 3439397 3644634 3310368
14036 3310368 3310930 3505708 3186855 3294358 3233101 3250827 3323980 3151068 2967858 2935986 2723244
$$ packed form
14106F805957J5091L0697m13171J99802k76642K23737l57581m3620l3978R1318
14096F241610k44256K30484l5542k11906k38751k9955l53546L37029o3573l36298
14086E295296K11401p2041l03528K0499j71617L87606j26104m04664J68799j34006
14076D871641Q0803j47922q8845j96031L00143j87336J07732j08284J7846j68738
14066D481009M9565r8687l68422J82440J06840j79442q2033k6463l6396J63441
14056D191852O893j40975j36745K03915j74225j94443k24803K33279j0527L0995
14046C785216l78182J12057P7337o0891l74543O3137J36207P9059K05237l34266
14036C310368N62J94778l18853J07503o1257J7726P3153j72912j83210l1872k12742
$$ plain form
14025 2723244 3292215 3248116 3003514 2794077 3029794 2528871 2784118 2726073 2626004 2434204
14015 2434204 2617382 2824594 2982774 2688764 2534633 2709146 2278522 2758525 2289253
14006 2289253 2339921 2486867 1935215 2247616 2473925 2435017 2377672 2441015 2313461 2391151
13996 2391151 2355016 2146281 2284212 2336866 2598253 2712266 3022463 4144377 5541220
13987 5541220 12741661 31709130 50165562 26218708 13335078 8798898 6295653 5175529
13979 5175529 4256528 3703623 3464486 3423093 3038461 3072569 2833648 2637530 2673536 2381879
13969 2381879 2481998 2665435 2532305 2180582 2079628 2446851 2302910 2315298 2258837 2328183
13959 2328183 2266880 2349431 1827128 2236955 1800706 2037657 1903858 2360508 2056045 1886231
$$ packed form
14025B723244N68971m4099k44602k09437K35717n00923K55247n8045j00069j91800
14015B434204J83178K07212J58180k94010j54131J74513m30624M80003m69272
14006B289253N0668J46946n51652L12401K26309l8908n7345O3343j27554P7690
13996B391151l6135k08735J37931N2654K61387J14013L10197J121914J396843
13987E541220P200441J8967469J8456432k3946854j2883630m536180k503245j120124
13979E175529r19001n52905k39137m1393l84632L4108k38921j96118L6006k91657
13969B381879J00119J83437j33130l51723j00954L67223j43941J2388n6461O9346
13959B328183o1303Q2551n22303M09827m36249K36951j33799M56650l04463j69814
$$ plain form
13949 1886231 2028458 1893035 2124979 1866257 1962264 1954457 1843509 1841850 1953647 1932070
13939 1932070 1681056 2083268 1721489 1845103 1853632 1962774 2014156 1522135 1759000 1883409
13929 1883409 1946929 1865164 1333994 1352070 1916976 1532729 1863453 1649491 1499078 1576270
13919 1576270 1720838 1795026 1377545 1434419 1252012 1584940 1745695 1766671 1362812 1684615
13909 1684615 1625757 1378566 1170812 1542945 1417365 1455840 1211190 1528155 1246322 1575065
13899 1575065 1267668 1548979 1562842 1282580 1310553 1513870 1162036 1139520 1398490 1427326
13889 1427326 1156244 1223909 1373554 1436810 1297746 1105626 1156788 1281688 1352345 1361098
13879 1361098 1190210 974052 1043964 1172815 1409338 1466872 1271392 923852 647327 1178224
$$ packed form
13949A886231J42227j35423K31944k58722R6007p807j10948j659J11797k1577
13939A932070k51014M02212l61779J23614Q529J09142N1382m92021K36865J24409
13929A883409O3520q1765n31170J8076N64906l84247L30724k13962j50413P7192
13919A576270J44568P4188m17481N6874j82407L32928J60755K0976m03859L21803
13909A684615n8858k47191k07754L72133j25580L8475k44650L16965k81833L28743
13899A575065l07397K81311J3863k80262K7973K03317l51834k2516K58970K8836
13889A427326k71082O7665J49645O3256j39064j92120N1162J24900P0657Q753
13879A361098j70888k16158O9912J28851K36523N7534j95480l47540k76525N30897
$$ plain form
13869 1178224 1290279 1238878 1184194 1119869 1222557 1053181 1319867 1152377 1362897 1142317
13859 1142317 1193267 1090850 1295556 1120096 1366688 1043967 1201287 1297890 1028202 1128446
13849 1128446 1103311 1181249 1014480 782899 928085 862291 1113899 1086055 1077758 1149566 950733
13838 950733 904983 705964 801016 762407 1320463 1077064 844718 1129776 892224 981863
13828 981863 653632 1076835 1164747 977318 1099290 744292 829189 1025395 812873 1135047
13818 1135047 964583 810250 714989 732558 907241 1030187 999216 867991 833627 550232
13808 550232 951471 646421 1084926 732691 725266 453552 715853 1053677 846679 873928
13798 873928 1136114 574821 780664 818016 704005 806472 524029 986454 752335 959982
$$ packed form
13869A178224J12055n1401n4684o4325J02688j69376K66686j67490K10520k20580
13859A142317N0950j02417K04706j75460K46592l22721J57320R6603k69688J00244
13849A128446k5135P7938j66769k31581J45186o5794K51608k7844q297P1808j98833
13838I50733m5750j99019R5052l8609N58056k43399k32346K85058k37552Q9639
13828I81863l28231M23203Q7912j87429J21972l54998Q4897J96206k12522L22174
13818A135047j70464j54333r5261J7569J74683J22946l0971j31225l4364k83395
13808E50232M01239l05050M38505l52235p425k71714K62301L37824k06998K7249
13798H73928K62186n61293K05843L7352j14011J02467k82443M62425k34119K07647
$$ plain form
13788 959982 857277 623459 1086309 939277 600324 869034 941752 594495 652698 843476
13778 843476 999522 748950 572245 832160 607888 1032875 733996 711976 932994 923547
13768 923547 620946 901821 665439 961756 561402 1065989 650669 532357 451442 725458
13758 725458 832521 706258 845716 799207 686583 651894 713248 659994 587958 590825 762377
13747 762377 515618 479816 490834 539780 337700 385354 875272 464428 590891 540836
13737 540836 563359 517208 651425 556902 694321 868167 391842 575416 832928 381944
13726 610788 348519 664258 494483 273062 646306 883088 516022 942726 530633 798069
13716 798069 667665 529991 493321 691044 813239 279403 578910 617853 584965 765268
$$ packed form
13788I59982j02705k33818M62850j47032l38953K68710P2718l47257N8203J90778
13778H43476J56046k50572j76705K59915k24272M24987k98879k2020K21018r447
13768I23547l02601K80875k36382K96317m00354N04587m15320j18312q0915K74016
13758G25458J07063j26263J39458m6509j12624l4689O1354n3254p2036K867J71552
13747G62377k46759l5802J1018M8946k02080M7654M89918m10844J26463n0055
13737E40836K2523m6151J34217r4523J37419J73846C91842J83574K57512C81944
13726F10788k62269L15739j69775k21421L73244K36782l67066M26704m12093K67436
13716G98069j30404j37674l6670J97723J22195B79403K99507L8943l2888J80303
$$ plain form
13706 765268 718557 423405 382948 301809 795400 447399 220975 283481 684910 491840
13696 491840 551704 661701 820166 538269 569846 343774 629129 612760 691256 846786
13686 846786 593494 530662 466122 842313 343213 237390 430798 297507 679232 341999
13676 341999 335346 486581 487320 735821 699961 352125 558436 173704 286771 352328 426350
13665 426350 577866 315004 318668 424146 159386 342742 363262 349971 652920 400898
13655 400898 368895 421546 692911 508603 309665 665620 189093 112065 518979 490756
13645 490756 368368 326919 415170 273426 284048 427166 373189 187500 469908 214249
13634 553435 319522 603486 545803 480446 82875 106622 312086 498727 230895 483452
$$ packed form
13706G65268m6711k95152m0457q1139M93591l48001B20975O2506M01429j93070
13696D91840N9864J09997J58465k81897L1577k26072K85355j6369P8496J55530
13686H46786k53292o2832o4540L76191C43213j05823J93408j33291L81725l37233
13676C41999o653J51235P39K48501l5860l47836K06311A73704J13067O5557P4022
13665D26350J51516k62862L664J05478A59386J83356K0520j3291L02949k52022
13655D00898l2003N2651K71365j84308j98938L55955A89093p7028M06914k8223
13645D90756j22388m1449Q8251j41744J0622J43118n3977j85689K82408B14249
13634E53435k33913K83964n7683o5357H2875K3747K05464J86641B30895K52557
$$ plain form
13624 483452 405797 451055 -15954 339259 280405 397120 624648 464252 398280 731876
13614 731876 283816 218872 453545 335065 325688 347668 82442 369385 421742 430820 566411
13603 566411 251826 455081 200169 289353 385866 109318 433516 711993 234207 507740
13593 507740 417240 270380 295719 320073 256302 14726 188043 371040 399604 323486 143829
13581 405487 436956 344670 277241 243258 473606 292570 486084 450617 237735 292040 579392
13570 579392 262529 206239 437963 551621 19183 -78366 526402 419212 566678 338293
13560 338293 315528 463332 423140 293885 166092 39010 249122 390494 333158 11450
13549 385470 123956 120723 325243 468375 318583 -12940 355349 474695 310418 414661
$$ packed form
13624D83452p7655M5258a5954C39259n8854J16715K27528j60396o5972L33596
13614G31876B83816o4944K34673j18480r377K1980H2442K86943N2357R078J35591
13603E66411B51826K03255B00169Q9184R6513A09318L24198K78477B34207K73533
13593E07740r0500j46860K5339K4354o3771A4726J73317J82997K8564p6118A43829
13581D05487L1469r2286o7429l3983K30348j81036J93514l5467k12882N4305K87352
13570E79392B62529n6290K31724J13658A9183g8366E26402j07190J47466k28385
13560C38293k2765J47804m0192j29255j27793C9010K10112J41372n7336A1450
13549C85470A23956l233K04520J43132j49792a2940C55349J19346j64277J04243
$$ plain form
13539 414661 48530 256682 198009 202229 184733 595490 542813 140912 566360 453292 606813
13528 606813 555815 104050 349358 224937 200475 398302 252206 349533 -11323 180211
13517 599489 392920 294680 426375 314521 184340 47597 395362 182434 330811 363615
13507 363615 150119 -25977 100425 225374 201461 194755 322220 1367 140071 262812 360993
13496 360993 -32366 379343 451405 -53850 372651 201807 58097 448064 -915 377003 276480
13485 276480 264878 345689 463522 68149 242385 479039 338980 464535 133928 197935
13475 197935 106847 327450 187686 345605 178327 344288 58266 400271 358706 70498
13464 493486 372388 373424 165093 230748 358442 -66140 693907 365770 246511 569859
$$ packed form
13539D14661D8530K08152n8673M220j7496M10757n2677A40912M25448j13068J53521
13528F06813n0998A04050K45308j24421k4462J97827j46096R7327a1323A80211
13517E99489k06569r8240J31695j11854j30181D7597L47765A82434J48377L2804
13507C63615A50119b5977A00425J24949k3913o706J27465A367J38704J22741R8181
13496C60993c2366C79343P2062e3850C72651j70844E8097L89967i15C77003j00523
13485B76480j1602Q0811J17833F8149J74236K36654j40059J25555A33928O4007
13475A97935r1088K20603j39764J57919j67278J65961E8266L42005m1565G0498
13464D93486j21098J036A65093O5655J27694f6140F93907l28137j19259L23348
$$ plain form
13454 569859 233902 604871 202268 251796 311508 -144111 310567 136222 418075 544224
13444 544224 402193 662781 -38730 308931 167598 381396 136688 143775 144769 223432 336061
13433 336061 371638 350996 63115 386343 264087 384984 225291 71837 162354 64786 163053
13422 163053 299018 157569 121716 224877 168821 181980 171852 -139212 -22496 181002
13411 356870 286676 181539 252300 289565 223770 218887 237720 105596 53722 423096 18215
13399 531926 510161 357331 -67629 294346 190202 31060 355702 293157 226292 -177477
13388 220864 240266 156449 77530 -23215 352901 65497 160691 -97273 10376 370672 509199
13377 509199 357921 410809 222999 247830 141302 71641 51141 302812 434973 171388
$$ packed form
13454E69859B33902L70969B02268M9528N9712a44111C10567A36222K81853J26149
13444E44224j42031K60588c8730C08931j41333K13798A36688P087R94P8663J12629
13433C36061L5577k0642F3115L23228j22256J20897j59693G1837R0517F4786R8267
13422A63053J35965j41449l5853J03161n6056J3159j0128a39212b2496A81002
13411C56870p0194j05137P0761L7265o5795m883J8833A05596n1874L69374A8215
13399E31926k1765j52830f7629B94346j04144C1060L24642o2545o6865a77477
13388B20864J9402q3817G7530b3215C52901F5497R5194i7273A0376L60296J38527
13377E09199j51278N2888j87810K4831j06528o9661k0500K51671J32161A71388
$$ plain form
13366 20506 352314 137378 221261 424360 -13230 -32285 -282995 132267 129834 48046 -137341
13354 499826 -175082 395740 521711 95603 9359 317179 458886 167852 101061 264903
13344 264903 325833 252913 428826 195479 219271 326468 190724 548378 184055 319546
13334 319546 -18348 277178 373279 -66854 545990 -110695 340522 331821 64487 433834 191154
13322 320583 214644 -23586 42704 327602 227551 336631 196242 70558 -86998 573910
13311 93721 308334 315204 -34737 -64897 127158 247477 223343 359473 -76964 -8066 139803
13299 -17955 109742 300030 -265160 138415 74488 142115 440575 395086 204068 220743
13289 220743 582834 27789 268244 -26831 191561 172815 172481 259277 48039 -58274 51666
$$ packed form
13366B0506L31808A37378Q3883K03099a3230j9055k50710A32267k433D8046a37341
13354D99826a75082C95740J25971I5603I359L07820J41707A67852o6791J63842
13344B64903O0930p2920J75913A95479K3792J07197j35744L57654A84055J35491
13334C19546a8348B77178R6101f6854E45990a10695C40522q701F4487L69347A91154
13322C20583j05939b3586D2704K84898j00051J09080j40389G0558h6998E73910
13311I3721K14613O870c4737l0160A27158J20319k4134J36130g6964h066A39803
13299a7955A09742J90288b65160A38415o3927O7627K98460m5489j91018J6675
13289B20743L62091B7789K40455b6831A91561j8746l34Q6796D8039e8274E1666
$$ plain form
13277 33798 301770 -28518 318429 213080 165396 126455 181946 -22419 -151262 114128 196109
13266 196109 140719 101468 10802 287133 284932 115307 287482 -153385 50833 441558 21512
13254 310818 -12325 45154 -8072 234716 -115332 1475 187896 -118802 66615 53452 45549
13243 45549 211552 108967 316017 331816 67173 243420 38354 120914 180219 -43039 -110528
13232 -110528 244189 218848 129290 124505 55213 81526 55231 208676 -2225 230499 282951
13221 282951 75778 53176 60518 -35533 136103 276279 116281 353117 -85607 22855 65834
13210 65834 62766 -241236 -143636 334665 -23561 95594 59321 -64027 123504 238205 -220700
13198 66179 408196 32899 358330 -83519 442317 166078 129066 65449 -347266 101407
$$ packed form
13277C3798K67972b8518C18429j05349m7684l8941N5491b2419j28843A14128Q1981
13266A96109n5390l9251A0802K76331k201A15307J72175a53385E0833L90725B1512
13254C10818a2325D5154h072B34716a15332A475J86421a18802F6615j3163p903
13243D5549J66003j02585K07050J5799F7173J76247C8354Q2560N9305d3039o7489
13232a10528B44189k5341q9558m785E5213K6313k6295J53445b225B30499N2452
13221B82951G5778k2602P342c5533A36103J40176A16281K36836h5607B2855M2979
13210F5834l068b41236R7600C34665b3561I5594l6273f4027A23504J14701b20700
13198F6179L42017C2899L25431h3519D42317A66078l7012o3617c47266A01407
$$ plain form
13187 87215 -23498 65179 55791 12770 219664 -192269 187510 92089 -27298 172399 252381
13176 252381 10673 108864 -208581 97861 274851 -42610 -6595 66708 -5403 68218 29061
13164 234015 -389838 465254 134138 22557 -206509 345794 121116 -18297 50639 202798
13154 202798 -164788 69455 -273782 -242261 -76522 286441 44455 279710 87406 276707
13144 276707 -393139 205477 31444 159632 72620 114020 301569 -99484 -253951 286776
13133 186081 140576 -137065 242997 89333 249426 44338 -87690 336155 305494 337011 -35879
13121 -178619 -128027 23740 -112310 -12474 185145 17502 -243119 -154592 65416 116871 276910
13110 276910 -77368 -179206 -195133 5883 42292 66467 22954 -90554 55614 -213516 144033
$$ packed form
13187H7215b3498F5179r388A2770K06894a92269A87510I2089b7298A72399P9982
13176B52381A0673R8191b08581I7861J76990d2610f595F6708e403F8218B9061
13164B34015c89838D65254A34138B2557b06509C45794A21116a8297E0639J52159
13154B02798a64788F9455b73782L1521g6522B86441D4455K35255H7406J89301
13144B76707c93139B05477C1444J28188G2620M1400J87549i9484j54467B86776
13133A86081m5505a37065B42997H9333J60093D4338h7690C36155l0661L1517c5879
13121a78619N0592B3740a12310a2474A85145A7502b43119Q8527F5416N1455J60039
13110B76910g7368j01838j5927E883L6409K4175B2954i0554E5614b13516A44033
$$ plain form
13098 46794 189762 218900 278758 341787 -319815 -38414 3356 110388 172439 20609 374845
13087 374845 -7846 111646 161358 110707 324401 -53612 48497 184154 770 -26212 179626
13075 208673 217070 166882 213937 70453 324971 248764 -94215 -232094 64124 -119820 62151
13063 122054 152952 205152 158163 40082 294575 8507 246822 165935 84244 222971 -300212
13051 109902 162648 107986 27926 -122469 -56131 -451296 10678 -105906 -51232 179386 437627
13040 437627 184681 207964 52974 89473 219608 5727 196559 402088 109987 58749 326147
13029 326147 293795 47842 84586 311444 -120075 129887 371752 26856 11148 99863 130781
13018 130781 33219 271822 239909 98952 121174 432152 106450 -196140 145010 -443032
$$ packed form
13098D6794J42968K9138N9858O3029c19815c8414C356J07032O2051B0609L54236
13087C74845g846A11646M9712n0651K13694e3612D8497J35657G70b6212A79626
13075B08673Q397n0188M7055G0453K54518p6207i4215j37879F4124a19820F2151
13063A22054L0898N2200m6989D0082K54493H507K38315q0887q1691J38727c00212
13051A09902N2746n4662B7926a22469e6131l95165A0678a05906e1232A79386K58241
13040D37627A84681K3283E2974L6499J30135E727J90832K05529A09987n1238K67398
13029C26147l2352D7842L6744K26858a20075A29887K41865B6856A1148Q8715L0918
13018A30781C3219K38603l1913I8952K2222L10978A06450a96140A45010d43032
$$ plain form
13007 49861 133269 185617 -274082 38782 307774 102896 -136613 71782 -411386 263110
12996 -93010 10631 -92026 -355719 182017 6474 -184685 -179508 -13696 -84449 22773 -176367
12984 143410 169434 -21634 -64808 -351185 -131318 157352 -345100 -227118 264525 87438
12973 119050 132957 -54594 119743 -175092 134140 46518 91646 -4325 150356 -132607 131164
12961 148577 -181902 -103293 -18223 104775 209341 154025 65896 154613 121954 -52085 -143499
12950 -143499 100145 179483 52024 200527 361415 35539 141781 263317 171647 100147
12940 100147 144762 224389 80278 -234419 -175686 132724 43834 96259 223197 -80312 238763
12928 -197721 8556 -56233 240838 105413 -71808 5930 -276138 14516 -11596 132307 88862
$$ packed form
13007D9861Q3408N2348b74082C8782K68992A02896a36613G1782d11386B63110
12996i3010A0631i2026k63693A82017F474a84685N177a3696p0753B2773a76367
12984A43410K6024b1634m3174k86377a31318A57352c45100J17982B64525H7438
12973A19050J3907e4594A19743a75092A34140D6518M5128d325A50356a32607A31164
12961A48577a81902P8609a8223A04775J04566n5316F5896Q8717l2659e2085r1414
12950a43499A00145P9338E2024J48503J60888C5539J06242J21536r1670p1500
12940A00147M4615P9627H0278b34419N8733A32724D3834N2425J26938h0312B38763
12928a97721H556e6233B40838A05413g1808E930b76138A4516a1596A32307m3445
$$ plain form
12917 88862 -145536 19827 -91380 -163281 100956 -47472 -75172 -251615 204870 -107840 -10641
12905 -91049 -109664 151852 252057 257283 66725 243030 37059 404954 20462 -217521 92109
12893 -150 -192163 23661 -104215 -5106 242864 -76667 126875 170114 -55415 54451 -243096
12881 39598 -56614 74491 133641 307438 22783 66467 9467 21100 -27292 -207551 -92904
12869 -160988 -194188 -289425 -102230 9824 202016 289421 -7101 -319668 39211 60016 -50258
12857 -250063 188175 -28089 198325 -21363 283858 -289955 -1462 -195738 -68134 -227864
12847 -227864 129059 -200864 79249 21017 298478 51807 -261982 72606 210750 40124
12836 -232560 154088 -45951 -4048 246771 -34561 30998 252573 169985 -25379 -77557 -176076
$$ packed form
12917H8862a45536A9827i1380p1901A00956d7472k7700j76443B04870a07840a0641
12905i1049j8615A51852J00205N226F6725J76305C7059L67895B0462b17521I2109
12893a50j92013B3661a04215e106B42864g6667A26875M3239e5415E4451b43096
12881C9598e6614G4491N9150J73797B2783M3684I467J1633b7292j80259i2904
12869a60988l3200r5237a02230I824J92192Q7405g101l12567C9211K0805e0258
12857b50063A88175b8089A98325b1363B83858b89955a462j94276f8134j59730
12847b27864A29059b00864G9249B1017K77461E1807b61982G2606J38144D0124
12836b32560A54088d5951d048B46771c4561C0998K21575q2588b5379n2178r8519
$$ plain form
12825 -176076 76754 84131 97020 -187602 171804 -229561 -68038 -323443 25212 87166 -40654
12813 45997 132325 -211869 125107 76629 150031 105301 225492 107191 -183723 -227815 -439829
12802 -439829 -19147 -27103 -142810 289917 165530 285757 -88823 106871 8216 111891 -59830
12790 95236 99974 160734 5761 -125365 -294647 182985 143257 35627 -106791 119571 64363
12779 64363 21871 283507 -216508 -44333 -102836 284182 57106 -19542 -270023 111121 16856
12767 252628 211516 -1266 -6487 272435 -150031 184601 36822 185983 189671 -73195 -1482
12755 192168 -246961 94516 316672 -63171 -18332 41166 167495 -177365 85177 -218348
12744 -154850 46944 -114489 80669 -43607 -80510 -122110 219645 -84684 330491 217872 -146071
$$ packed form
12825a76076G6754P377J2889a87602A71804b29561f8038k55405B5212O1954d0654
12813D5997Q6328b11869A25107m8478P3402m4730J20191A07191a83723m4092k12014
12802d39829a9147p956j15707B89917j24387J20227h8823A06871H216J03675e9830
12790I5236M738O0760E761a25365j69282A82985l9728C5627a06791A19571n5208
12779F4363B1871K61636b16508d4333n8503B84182E7106a9542k50481A11121A6856
12767B52628m1112a266n221B72435a50031A84601C6822J49161L688g3195a482
12755A92168b46961I4516K22156f3171a8332D1166J26329a77365H5177b18348
12744a54850D6944a14489H0669d3607l6903m1600B19645h4684C30491j12619a46071
$$ plain form
12732 148144 194768 -231480 124465 131779 90145 58097 270735 -52593 -179426 103455 -83338
12720 164441 -179087 -192563 95481 -52746 -17247 227723 71101 79590 171161 81505 163592
12709 163592 54490 189482 391175 464631 33258 437241 208727 71775 382499 95210
12698 184513 78549 86428 42485 300755 49942 -137530 12735 253660 156404 73282 -11751
12686 72777 -186264 81405 543450 107080 16304 14827 300172 300141 345643 197568 -130458
12674 -142367 -66215 516383 -117781 117726 -147383 -111518 -53043 -39272 147897 -30303
12663 -293498 -43540 -133416 24412 -158240 109064 -107559 176362 -63476 -188589 372033
12652 154155 122247 -19725 1202 171069 441046 119180 -87405 253490 113622 181366 -158889
$$ packed form
12732A48144M6624b31480A24465P314m1634l2048K12638e2593j26833A03455h3338
12720A64441a79087j3476I5481e2746a7247B27723G1101Q489R1571H1505Q2087
12709A63592E4490J34992K01693P3456C3258M03983B08727G1775L10724I5210
12698A84513G8549P879D2485K58270D9942a37530A2735K40925r7256G3282a1751
12686G2777a86264H1405M62045A07080A6304j477K85345l1M5502j48075a30458
12674a42367f6215E16383a17781A17726a47383L5865e3043J3771A47897c0303
12663b93498d3540q9876B4412a58240A09064a07559A76362f3476j25113C72033
12652A54155l1908a9725A202J69867K69977A19180h7405B53490A13622O7744a58889
$$ plain form
12640 105154 292204 118818 143053 47881 -84314 81441 -59960 123891 100257 -59987 162748
12628 89799 394797 405137 -28258 59371 339544 244298 155161 125780 587991 347821 -211651
12616 -223031 359241 58973 -303701 -256563 -122849 -14692 -115225 54583 -232681 188725
12605 -132389 151407 99009 -17260 4442 62803 -14899 305756 368409 -96091 61924 223576
12594 223576 -3252 -74327 39674 66833 222883 -184454 11254 125374 -59114 -346013 -62000
12582 -141986 -215718 420672 -52356 113443 337605 320064 94954 66126 272849 -63652 -255031
12571 -255031 116725 165549 -34285 26246 23577 32167 517165 -57710 52222 -11565 288514
12559 -323899 -106876 411867 117064 -150583 162594 -181021 340094 81949 34276 113424
$$ packed form
12640A05154J87050A18818K4235D7881h4314H1441e9960A23891k3634e9987A62748
12628H9799L04998J0340b8258E9371K80173r5246q9137k9381M62211k40170b11651
12616b23031C59241E8973c03701M7138a22849a4692j00533E4583b32681A88725
12605a32389A51407n2398a7260D442N8361a4899C05756O2653i6091F1924J61652
12594B23576c252p1075C9674K7159J56050a84454A1254J14120e9114k86899f2000
12582a41986p3732D20672e2356A13443K24162j7541I4954k8828K06723f3652j91379
12571b55031A16725M8824c4285B6246k669Q590M84998e7710E2222a1565B88514
12559c23899a06876D11867A17064a50583A62594a81021C40094H1949C4276P9148
$$ plain form
12549 113424 -246567 -168469 -16989 67545 151763 -157266 -197104 125430 65398 -51897 93734
12537 98974 -151335 20305 81896 117531 -147643 32906 -17606 268130 -1980 153491 65397
12525 56566 -145920 69251 -205906 313671 -165259 144312 -273596 -38117 75490 -55010
12514 53252 -146499 -335796 -40652 -137852 -211738 56430 -162362 -24051 112851 118208 -155711
12502 165348 -117524 192191 124320 -128849 124966 241131 -18197 68786 332182 9039
12491 112394 8052 206565 129498 -79997 -10392 -41330 181288 -188711 603050 14187 -219353
12479 -19524 -50923 170040 171650 -23365 -19965 -417754 -42783 80379 -82486 -41900 -480106
12468 -480106 -114647 -77438 77283 19213 201212 -48254 46252 184674 -132600 -276619
$$ packed form
12549A13424b46567P8098a6989F7545Q4218a57266l9838A25430o0032e1897I3734
12537I8974a51335B0305O1591L5635a47643C2906a7606B68130a980A53491F5397
12525E6566a45920F9251b05906C13671a65259A44312b73596c8117G5490e5010
12514E3252a46499j89297d0652r7200p3886E6430a62362b4051A12851N357a55711
12502A65348a17524A92191o7871a28849A24966J16165a8197F8786K63396I039
12491A12394H052J98513p7067g9997a0392l0938A81288a88711F03050A4187b19353
12479a9524l1399A70040J610b3365L400l97789d2783H0379h2486M0586m38206
12468d80106a14647L7209G7283A9213J81999d8254D6252J38422a32600j44019
$$ plain form
12458 -276619 183717 -278660 -395665 5882 409054 -36267 -441516 -287798 -12680 66147
12447 -21727 -26520 -453389 250787 84755 228150 -109837 -251381 168467 -153862 -53330
12436 270377 347257 158483 244524 85532 -66508 439125 -136886 -146555 -15789 289074 -170792
12424 -89446 2930 -253091 162820 -199430 113338 -24059 -152573 492 -135218 -13784 11571
12412 240569 -19444 -423312 35840 5974 143471 81326 -275770 -144563 -68157 36638 -58102
12400 -113833 170872 206804 106123 419086 -135474 304840 202660 -51151 -90021 -347378
12390 -347378 -91843 -309197 128544 157746 -120544 129349 281576 -6638 -15902 347150 -37706
12378 -158540 218493 -262186 12241 147062 -39589 -87068 221554 -185736 -167369 -256330
$$ packed form
12458b76619A83717b78660j17005E882M03172c6267m05249J53718a2680F6147
12447b1727m793m26869B50787H4755J43395a09837j41544A68467a53862e3330
12436B70377P6880A58483Q6041H5532f6508D39125a36886r669a5789B89074a70792
12424h9446B930b53091A62820a99430A13338b4059j28514D92a35218a3784A1571
12412B40569a9444m03868C5840E974J37497o2145b75770J31207f8157C6638e8102
12400a13833A70872L5932j00681L12963a35474C04840j02180e1151l8870k57357
12390c47378i1843k17354A28544K9202a20544A29349J52227f638r264C47150c7706
12378a58540B18493b62186A2241J34821c9589m7479B21554a85736J8367q8961
$$ plain form
12368 -256330 -70643 -188170 71383 64489 144084 -25508 69053 227195 113245 -109234 -342769
12357 -342769 60783 23066 243744 -185735 -259761 32467 -69473 -215245 -78773 48941 62770
12346 62770 111124 -118385 -19748 214323 37775 -162286 -119350 -3179 180753 169150 131718
12335 131718 -206240 -47863 289553 -6140 -65495 -1591 -327358 -67834 178082 228473 236641
12324 236641 63245 -107919 -134367 -15209 -185228 426805 -142541 136692 -293590 -43660
12313 -35773 -235780 174297 -262791 -297743 198726 -215234 26342 67537 -185368 26348
12302 60045 -87550 -124116 51477 -124275 -227380 -51259 -131916 -145559 67903 76695 -121586
12290 317532 -50022 120795 118005 77519 -70008 255954 367075 317482 29599 142203 257836
$$ packed form
12368b56330g0643j17527G1383o894P9595b5508F9053J58142A13245a09234k33535
12357c42769F0783B3066K20678a85735p4026C2467f9473j45772g8773D8941J3829
12346F2770M8354a18385a9748B14323C7775a62286M2936c179A80753j1603l7432
12335A31718b06240d7863B89553f140n9355a591l25767f7834A78082N0391Q168
12324B36641F3245a07919k6448a5209j70019D26805a42541A36692b93590d3660
12313c5773k00007A74297b62791l4952A98726b15234B6342M1195a85368B6348
12302F0045h7550l6566E1477a24275j03105e1259q0657j3643F7903Q792a21586
12290C17532e0022A20795k790m0486g0008B55954J11121m9593B9599J12604J15633
$$ plain form
12279 257836 -34248 -36434 -140821 40107 212532 407612 151254 279805 -68401 138641
12268 172464 222951 -107393 109121 -233305 -94671 -96602 -117501 -40895 -111599 243653 417405
12257 417405 86274 194449 -57027 406356 4684 116078 70992 -13772 246228 181468 -211924
12245 404966 -180205 -81057 -11761 127131 20820 116900 147434 -167917 253880 36111 123243
12234 123243 176547 -281340 155796 -50903 163579 233517 579342 373668 219312 27809
12223 282101 223604 229833 -88367 137130 320737 285341 151537 234447 288621 -165442 98384
12211 155898 320068 119419 203891 417498 474505 8835 289003 165336 -22388 278575
12200 597438 -125671 -103607 -73543 233295 243568 213618 476377 216638 253588 -156985
$$ packed form
12279B57836c4248k186j04387D0107J72425J95080A51254J28551f8401A38641
12268A72464N0487a07393A09121b33305i4671j931k0899d0895p0704B43653J73752
12257D17405H6274J08175e7027D06356D684J11394m5086a3772B46228o4760b11924
12245D04966a80205h1057a1761A27131B0820R6080L0534a67917B53880C6111Q7132
12234A23243N3304b81340A55796e0903A63579O9938L45825k05674j54356B7809
12223B82101n8497O229h8367A37130J83607l5396j33804Q2910N4174a65442I8384
12211A55898J64170A19419Q4472K13607N7007H835K80168j23667b2388B78575
12200E97438a25671K2064L0064B33295J0273k9950K62759B16638L6950a56985
$$ plain form
12189 366729 211930 -54683 -216901 109832 346218 46464 287076 -163862 -15809 137722
12178 143980 379396 126536 161015 453813 63971 234051 178016 132800 288522 63477
12167 113102 246301 -148745 290914 6134 129438 285770 128031 -62580 165910 -41250
12156 217239 220266 894 214672 -15511 175649 56046 4700 20071 240526 172332 145324 -164744
12143 -26963 -150764 -50355 201734 187300 221325 -107935 -46069 -169064 290317 -87913 -388917
12132 -388917 -19374 17130 71268 127036 218524 -401024 -114368 104272 113331 -145368 184925
12120 261376 102002 123203 -295256 319063 455 -27812 417778 -106199 -161513 41305 -134956
12108 -259984 -42325 -61043 40887 112920 77687 104657 -178450 -54205 11405 122837 89539
$$ packed form
12189C66729j54799e4683j62218A09832K36386D6464K40612a63862a5809A37722
12178A43980K35416A26536L4479K92798F3971J70080n6035m5216J55722F3477
12167A13102J33199a48745B90914F134J23304J56332A28031f2580A65910d1250
12156B17239L027H94K13778a5511A75649E6046D700J5371K20455o8194k7008a64744
12143b6963j23801e0355B01734j4434L4025a07935d6069j22995B90317h7913l01004
12132c88917a9374A7130N4138N5768R1488d01024a14368A04272R059a45368A84925
12120B61376A02002K1201b95256C19063D55b7812D17778a06199n5314D1305a34956
12108b59984d2325j8718D0887P2033l5233K6970a78450e4205A1405J11432l3298
$$ plain form
12097 89539 79258 30711 26532 122486 93393 -289697 -320581 -147830 -51259 -111047 -12320
12085 -308436 2471 195124 -374049 -339137 -99617 -133311 9585 211076 728349 1745104 1072976
12074 1072976 439592 194248 22666 295789 -242441 246347 605489 -36515 -25675 44492
12063 -128213 -172123 86519 200309 191651 152252 121316 201859 -200991 -162911 -138709 143931
12051 22598 33540 -51748 264953 17222 -44277 -158823 -168552 -26478 -548017 54364 -31806
12039 83169 118258 -113636 -154533 -139152 -208950 -10687 100677 -348953 -127315 62517 -106632
12027 -186484 182563 -21994 62087 18841 -60606 441081 35447 472036 -70361 -261181 137395
12015 108734 134168 -12541 95847 -1670 198484 43752 142908 -176042 121087 -7089 -51003
$$ packed form
12097H9539j0281C0711m179R5954k9093b89697l0884a47830e1259n9788a2320
12085c08436B471J92653c74049L4912i9617l3694I585K01491N17273J016755o72128
12074A072976D39592A94248B2666K73123b42441B46347L59142c6515J0840D4492
12063a28213m3910H6519J13790q658l9399l0936Q0543b00991L8080K4202A43931
12051B2598J0942e1748B64953A7222d4277j14546r729b6478n21539E4364c1806
12039H3169L5089a13636m0897J5381o9798a0687A00677c48953a27315F2517a06632
12027a86484A82563b1994F2087A8841f0606D41081C5447M36589g0361j90820A37395
12015A08734K5434a2541I5847a670A98484D3752R9156a76042A21087g089m3914
$$ plain form
12004 -51003 -198554 -270264 -70920 22219 -149981 -316055 -13328 6620 -196907 -88995 -159693
11993 -159693 -342881 -109954 26192 374702 231143 -225343 -28245 127088 26142 -376008
11982 -281587 -59877 -110161 291493 32851 255471 76011 -118614 -324849 -170629 83713
11971 -248899 -28478 146617 -238775 -166511 50247 -44763 -211631 -91122 268154 20448 94529
11960 94529 334380 243208 -23896 422070 143080 226987 -93426 -168360 437311 33904 -32740
11948 -219439 373202 219265 -42456 -108497 239859 -174065 -410570 -52416 1343 -91012 -116031
11937 -116031 62552 7448 -30315 44364 -200554 42355 2976 242335 -95621 123880 -2810
11925 -157463 3574 -44730 -203993 -52548 226333 216292 98998 33811 217991 -162664 -177713
$$ packed form
12004e1003j47551p1710g0920B2219a49981j66074a3328F620a96907h8995p0698
11993a59693j83188a09954B6192L48510j43559b25343b8245A27088B6142c76008
11982b81587e9877n0284B91493C2851K22620G6011a18614k06235J54220H3713
11971b48899b8478A46617b38775P2264E0247d4763j66868i1122B68154B0448P4081
11960I4529K39851r1172b3896D22070A43080Q3907i3426p4934D37311C3904c2740
11948b19439C73202j53937d2456o6041B39859a74065k36505e2416A343i1012k5019
11937a16031F2552G448c0315D4364b00554D2355B976K39359i5621A23880b810
11925a57463C574d4730j59263e2548B26333j0041I8998C3811J84180a62664j5049
$$ plain form
11914 -177713 -152106 18788 -65507 -22823 -85924 96504 -284832 -349072 -164834 226193 5277
11902 56204 -15001 -56902 -62290 388894 33449 -189073 -117467 -236319 44976 57485 -111111
11890 -13034 -147790 236245 -306992 61946 18357 110722 -137594 -118792 17020 -426252 -42103
11878 -26348 -41174 -117609 -4052 8995 -98848 -6469 -209232 320551 65501 -43345 -83083 -121082
11866 -121082 -203611 167682 63894 -221908 -281219 195597 -201999 -54360 -23576 169336
11855 -75025 16761 155731 68304 423590 -145374 43807 58057 -52439 -507629 -52660 -109673
11844 -109673 -64 177489 -11473 -148660 -1635 136510 152392 72220 390104 -17122 155019
11832 -152386 -80579 -290886 -8824 94919 168282 -159215 -51075 55358 -156600 -24038 182902
$$ packed form
11914a77713K5607A8788f5507b2823o3101I6504b84832o4240a64834B26193E277
11902E6204a5001m1901n388C88894C3449a89073P1606j18852D4976J2509a11111
11890a3034j34756B36245c06992F1946A8357R2365a37594J8802A7020d26252d2103
11878b6348j4826p6435d052H995i8848f469k02763C20551F5501d3345l9738l7999
11866a21082q2529A67682F3894b21908n9311A95597b01999e4360b3576A69336
11855g5025A6761J38970F8304L55286a45374D3807J4250e2439m55190e2660n7013
11844a09673f4A77489a1473j37187a635A36510J5882G2220L17884a7122A55019
11832a52386P1807k10307h824I4919P3363a59215e1075E5358a56600b4038A82902
$$ plain form
11820 -138378 -219358 -164951 214649 213076 114394 -28083 -261471 83462 26520 -34231 83100
11808 -164225 -252830 108086 12838 76093 -5711 406698 47777 21087 53205 -82902 -230857
11797 -230857 -19270 53932 -137899 190222 122853 70042 37200 -279625 239188 -2168 227605
11785 -173477 157581 330181 83365 5061 63129 -16478 -276171 -228594 260055 -25598 -83415
11774 -83415 50571 -215693 -337337 -223930 -13854 -143090 -61880 135295 -12758 36642 -29886
11762 -65784 -48004 -226095 149439 -107754 170508 12471 -129265 59541 -127804 -198096
11752 -198096 -66308 289165 -102054 -23349 -18094 -29293 -143929 -224603 -8164 -68426 56705
11740 -30202 229024 262674 -66242 21607 137205 18495 -469193 284188 -280016 -25369 29712
$$ packed form
11820a38378q0980N4407B14649j573r8682b8083k33388H3462B6520c4231H3100
11808a64225q8605A08086A2838O3255e711D06698D7777B1087L2118h2902j47955
11797b30857a9270E3932a37899A90222o7369n2811l2842b79625B39188b168B27605
11785a73477A57581J72600H3365E061N8068a6478k59693M7577B60055b5598n7817
11774h3415E0571b15693j21644J13407a3854j29236f1880A35295a2758C6642b9886
11762f5784J7780j78091A49439a07754A70508A2471a29265E9541a27804p0292
11752a98096f6308B89165a02054b3349N255j1199j14636q0674h164o0262E6705
11740c0202B29024L3650f6242B1607J15598A8495d69193B84188b80016b5369B9712
$$ plain form
11728 15186 -410065 -107926 -256099 -50860 154109 41035 196289 269661 64732 -92030 -84939
11717 -84939 227395 122110 -212701 89542 335856 -72472 195790 3982 367331 20861 6502
11705 -159387 -83993 -76510 64094 33072 218486 270932 -151123 233138 182402 86008 281486
11694 281486 112140 286521 93266 188557 49880 55042 217579 122934 21824 35370 67293
11683 67293 -45164 260148 -140317 42304 124250 217631 20297 -285762 222544 63308 -22158
11671 80680 117101 166161 43663 -91440 145353 -121271 -175232 -289079 -365959 261849 -122911
11659 127078 14979 -28832 232803 -216722 327669 233219 139810 -238906 23159 197401
11649 197401 7953 -166815 92295 131830 105726 41883 -56241 61444 -103949 -274201 296939
$$ packed form
11728A5186d10065a07926j48173e0860A54109D1035J55254P3372F4732i2030P091
11717h4939B27395j05285b12701H9542K46314g2472A95790C982L63349B0861F502
11705a59387P5394P483F4094l1022J85414N2446a51123B33138n0736H6008J95478
11694B81486A12140J74381I3266R5291D9880N162J62537r4645B1824J3546L1923
11683F7293d5164B60148a40317D2304Q1946R3381B0297b85762B22544F3308b2158
11671H0680L6421M9060D3663i1440A45353a21271n3961j13847p6880B61849a22911
11659A27078A4979b8832B32803b16722C27669r4450r3409b38906B3159J74242
11649A97401G953a66815I2295L9535k6104D1883e6241F1444a03949j70252B96939
$$ plain form
11637 -185194 155777 375996 919 -125999 51286 68197 130309 55658 8774 74888 255196
11626 255196 252612 -342532 -96025 158320 121425 191334 -32306 -56136 158715 -45568 95286
11614 269460 127759 293858 204329 98400 73219 -71675 125115 141749 -89612 296839 110033
11602 45311 -211130 93938 72742 207067 91774 131290 -99564 329307 127514 350421 170490
11590 -163382 385161 49778 94213 119060 248981 342834 -35970 189308 66828 36223 163880
11579 163880 -11963 12094 -66795 -182256 135991 -89906 158664 176360 54571 -259293 -32931
11567 93703 14411 -214180 19069 274126 164679 59245 -34114 -7828 147121 187924 301163
11556 301163 153318 281922 94358 -192967 -100578 13016 24483 -34449 156355 128614 193469
$$ packed form
11637a85194A55777K20219I19a25999E1286J6911O2112E5658H774O6114J80308
11626B55196k584c42532i6025A58320l6895O9909c2306k3830A58715d5568I5286
11614B69460A27759J66099q9529I8400k5181g1675A25115J6634h9612B96839A10033
11602D5311b11130I3938k1196J34325I1774L9516i9564C29307A27514K22907A70490
11590a63382C85161D9778M4435K4847J29921R3853c5970A89308F6828l0605J27657
11579A63880a1963A2094f6795j15461A35991h9906A58664J7696E4571b59293c2931
11567I3703A4411b14180A9069K55057j09447E9245c4114g828A47121M0803J13239
11556C01163j47845J28604I4358a92967R2389A3016J1467c4449A56355k7741O4855
$$ plain form
11545 193469 14858 193830 -83906 -159057 -32327 159898 127291 42956 -262579 26390 244234
11534 244234 422910 208999 69698 410289 6405 -54007 164991 257227 152669 -187766
11523 90806 206729 126246 124377 10057 42333 -19245 -133927 -249312 60389 66564 80339
11512 80339 461364 342251 128890 67086 369427 22504 270206 45103 -30971 26711 150412
11501 150412 151479 215363 -51114 165955 -1646 9739 295792 -93177 -72628 116372 301112
11490 301112 294298 55260 218960 -47474 -62987 -198422 244730 137825 22844 415120 63058
11478 104439 -102647 39331 82279 -167135 255187 -74275 108884 91665 73633 199972
11468 199972 46616 123075 -106300 352600 160905 475947 186748 -51369 138855 270727
$$ packed form
11545A93469A4858J78972h3906p5151c2327A59898l2607D2956b62579B6390K17844
11534B44234J78676B08999F9698L40591F405e4007A64991R2236j04558a87766
11523I0806J15923q0483j869A0057L2276a9245j14682j15385F0389O175J3775
11512H0339L81025j19113A28890o1804L02341B2504K47702D5103c0971B6711J23701
11501A50412J067O3884e1114A65955a646I739K86053i3177K0549A16372J84740
11490C01112o814E5260J63700d7474j5513j35435B44730j06905B2844L92276F3058
11478A04439a02647C9331M2948a67135B55187g4275A08884j7219j8032J26339
11468A99972D6616P6459a06300C52600A60905L15042A86748e1369A38855J31872
$$ plain form
11458 270727 -24403 -127570 -98121 -120049 133703 36656 176932 231514 157817 -45323 64403
11446 -29247 31274 153641 -187372 188586 257491 291535 119766 -173984 -133705 -138279 215292
11434 -170729 131624 -150050 -221304 -7396 -227580 -364867 -170006 -166336 -100415 -186847 162728
11422 -382061 -78708 182192 -147319 46206 -29186 101092 54976 -57927 141450 -42211 -65987
11411 -65987 245917 -11799 118114 7341 60003 70584 207390 190868 408615 -183935 249221
11399 30228 318434 329337 133840 -34119 83793 -8976 46265 -71442 -404 284914 -169859
11387 -272114 365662 17705 -70320 272404 72739 -85798 141112 -103535 129877 -6737 44891
11375 144021 -195001 -204991 -217164 180909 83388 64178 -182198 177741 260885 244186 -158833
$$ packed form
11458B70727b4403j03167K9449k1928A33703C6656J40276N4582p3697d5323F4403
11446b9247C1274J22367a87372A88586O8905L4044A19766a73984M0279m574B15292
11434a70729A31624a50050p1254g396k20184j37287a70006L670O5921q6432A62728
11422c82061g8708A82192a47319D6206b9186A01092m6116e7927A41450d2211k3776
11411f5987B45917a1799A18114G341N2662J0581J36806j6522K17747a83935B49221
11399C0228K88206J0903A33840c4119H3793h976D6265g1442d04B84914a69859
11387b72114C65662A7705g0320B72404G2739h5798A41112a03535A29877f737D4891
11375A44021a95001r990j2173A80909H3388j9210a82198A77741Q3144j6699a58833
$$ plain form
11363 -234882 112558 -8043 850 77555 142125 -237778 163450 -9565 -12635 395995 -26174 164777
11350 -232375 -82944 -103910 77940 -142857 -237289 -39875 318333 -125690 19909 -117182 -156002
11339 -156002 -223922 277466 -264492 157274 193517 208229 -178626 108741 -156887 88535
11328 -60152 100221 -722 30447 -215197 91554 221003 -84284 -105483 -59893 257775 -46793
11316 102147 -122289 -107836 31845 -204464 304714 -61213 -232430 -3051 -282367 390986
11305 91388 -192171 -138735 -155926 23545 189015 132953 -61863 -177521 -101832 -208905 -308398
11294 -308398 -63837 81254 -150855 6478 -84597 7185 -11542 -292456 56072 -214990 -157918
11283 -157918 -72781 -28283 405829 286783 -78453 42325 226348 -125099 -204076 -37518 158890
$$ packed form
11363b34882A12558h043H50P6705O4570b37778A63450i565l070C95995b6174A64777
11350b32375h2944k0966G7940a42857r4432c9875C18333a25690A9909a17182l8820
11339a56002o7920B77466b64492A57274L6243J4712a78626A08741a56887H8535
11328f0152A00221g22C0447b15197I1554J29449h4284k1199M5590B57775d6793
11316A02147a22289J4453C1845b04464C04714f1213j71217c051k79316C90986
11305I1388a92171N3436j7191B3545J65470n6062f1863j15658P5689j07073r9493
11294c08398f3837H1254a50855F478h4597G185a1542k80914E6072b14990N7072
11283a57918g2781b8283D05829j19046g8453D2325J84023a25099p8977c7518A58890
$$ plain form
11271 -196690 180118 24765 158307 267484 67704 -45757 40957 192847 -165489 -238651
11261 -238651 215377 -147944 461794 181461 -173131 -166305 246841 298067 -633409 -261021
11250 39827 24360 84417 -133425 -230204 -194636 -11599 -77892 -175642 51329 203311 159413
11239 159413 -242094 48056 -179979 15121 60672 217054 -194447 80740 -173938 -85644
11228 -259211 93532 -114929 -232384 106764 37181 60055 -218129 -172755 -144871 -161637 109114
11216 125202 28850 66910 -139664 264013 372839 95155 -253906 13401 20662 39851 116908
11205 116908 -464229 -573837 -358515 -160187 -155416 11442 -163418 -46035 -209274 262795
11194 -23813 -67630 109060 218508 89940 -349 -345285 63871 -155400 218371 416746 -60268
$$ packed form
11271a96690A80118B4765J33542J09177F7704d5757D0957J51890a65489p3162
11261b38651B15377a47944D61794A81461a73131O826B46841N1226f33409b61021
11250C9827j5467O0057a33425r6779L5568a1599o6293r7750E1329J51982m3898
11239A59413b42094D8056a79979A5121M5551J56382a94447H0740a73938h5644
11228b59211I3532a14929j17455A06764C7181K2874b18129M5374K7884j6766A09114
11216A25202B8850L8060a39664B64013J08826I5155b53906A3401P261J9189P7057
11205A16908d64229j09608K15322a60187M771A1442a63418d6035j63239B62795
11194b3813m3817A09060J09448H9940c49l44936F3871a55400B18371J98375f0268
$$ plain form
11182 -35705 -130510 95203 -133449 44223 -279653 -89499 -124820 16985 -53814 -28444 -167975
11171 -167975 -505843 -52202 -39908 64224 -102635 -64384 -161792 -384127 -176615 58091 -98883
11159 -90845 146716 -209566 -97944 80981 613399 1968 -186570 211985 141058 -27318 77193
11147 126802 109916 37995 -83746 77679 144141 105509 -190215 122893 -294826 -161765 140493
11135 -164992 41651 137065 239736 -271014 825 -84098 -140129 -121588 71402 306729 -107865
11123 7342 404691 402365 -122440 121287 -72596 -257838 -251702 248113 145054 446955 295239
11112 295239 211464 13621 197545 333954 217694 -46043 244384 282748 -329355 246435
11101 76581 -183887 -87159 241204 462857 442675 135102 185091 477952 -32990 49187 -125288
$$ packed form
11182c5705r4805I5203a33449D4223b79653h9499l5321A6985e3814K5370j39531
11171a67975l37868e2202J2294F4224a02635L8251r7408k22335a76615E8091i8883
11159i0845A46716b09566i7944H0981N32418A968a86570B11985p0927b7318G7193
11147A26802j6886C7995h3746G7679O6462l8632a90215A22893b94826J33061A40493
11135a64992D1651R5414J02671b71014H25h4098n6031J8541G1402K35327a07865
11123G342L97349k326a22440A21287g2596j85242O136B48113j03059L01901j51716
11112B95239q3775A3621J83924J36409j16260d6043B44384L8364c29355B46435
11101G6581a83887h7159B41204K21653k0182A35102M9989K92861c2990D9187a25288
$$ plain form
11089 41999 58899 179541 131431 -36991 209948 139018 306072 86053 442949 -63077 -104329
11078 -104329 392518 114440 416280 20697 85778 444389 81861 347367 24738 587619
11068 587619 196170 414931 241198 354401 695886 326387 658328 572609 496322 396032
11058 396032 511569 605450 556309 435666 753684 690094 425192 426028 262530 674615 609121
11047 609121 755853 742585 892631 648401 751568 660345 673497 457518 726937 563115
11037 563115 653936 679877 663470 802909 809697 745310 292747 671199 775166 651983 730665
11026 730665 876691 536773 570876 542999 730467 500932 650472 396765 631490 545552
11016 545552 681780 665463 314045 542907 577847 821802 1047148 996140 932552 880906
$$ packed form
11089D1999J6900J20642m8110c6991B09948p0930J67054H6053L56896f3077m1252
11078a04329C92518A14440L01840B0697O5081L58611H1861K65506B4738N62881
11068E87619A96170K18761j73733J13203L41485C26387L31941q5719p6287j00290
11058C96032J15537R3881m9141j20643L18018o3590k64902Q36j63498M12085o5494
11047F09121J46732j3268J50046k44230J03167r1223J3152k15979K69419j63822
11037E63115R0821K5941j6407J39439O788o4387B92747L78452J03967j23183P8682
11026G30665J46026l39918L4103k7877J87468k29535J49540k53707K34725q5938
11016E45552J36228j6317C14045K28862L4940K43955K25346n1008o3588n1646
$$ plain form
11006 880906 625954 404975 610753 398725 594343 723943 657223 795378 922316 903083
10996 903083 433699 587360 941239 814125 713716 892975 785379 698938 853180 809539
10986 809539 923187 843299 812984 578706 1222181 1406834 1257908 1538554 1365288 1450633
10976 1450633 1842850 1970661 2225518 2268376 2883710 2432433 2712287 2670648 2529578 2248797
10966 2248797 2084130 2037020 1559603 1661378 1760864 1898101 1966922 1893219 1922319 1891048
10956 1891048 2049145 1762191 1779014 1310680 1200471 1072979 1052457 600414 494949 619578
10946 619578 180091 607305 168800 83864 593393 253182 165355 171315 39837 313062
10936 313062 -200392 211654 97247 64972 387973 338795 135703 197899 169839 -180544
$$ packed form
11006H80906k54952k20979K05778k12028J95618J29600o6720J38155J26938j9233
10996I03083D33699J53661L53879j27114j00409J79259j07596q6441J54242m3641
10986H09539J13648p9888l0315k34278O43475J84653j48926K80646j73266Q5345
10976A450633L92217J27811K54857M2858O15334m51277K79854m1639j41070k80781
10966B248797j64667m7110m77417J01775R9486J37237O8821p3703K9100l1271
10956A891048J58097k86954J6823m68334j10209j27492k0522m52043j05465J24629
10946F19578A80091M27214A68800H3864N09529B53182q7827N960C9837K73225
10936C13062b00392B11654I7247l2275L23001m9178A35703O2196k8060a80544
$$ plain form
10925 303920 -156508 190493 166063 -12627 -217893 -145575 -68575 31910 -121824 12098 -110778
10913 -25901 -148459 -75449 -126787 -33144 9592 2652 -162574 -34282 163565 -57798 -4859 360917
10900 3102 64643 234068 296051 -171414 75044 -191952 212324 -80595 -31707 7904 -42512
10888 -22741 274094 -176009 151830 -157347 195427 -219757 -48631 -7654 -49365 -272249
10878 -272249 -20796 -38541 -139358 -207964 124938 -66666 -192235 48029 -88532 -165619 128342
10866 54502 112448 159089 138603 -58132 176782 134062 42427 319783 -11855 57379 -413429
10854 -96200 -267770 -55945 277338 100594 263901 90507 59032 -33853 77398 -347946 253688
10842 197639 47607 166650 97017 289127 42292 180451 -16949 232701 -169587 -373892
$$ packed form
10925C03920a56508A90493k4430a2627k05266P2318f8575C1910a21824A2098a10778
10913b5901j22558P3010n1338c3144I592B652a62574c4282A63565e7798d859C60917
10900C102O1541J69425O1983a71414G5044a91952B12324h0595c1707G904d2512
10888b2741B74094a76009A51830a57347A95427b19757d8631g654m1711k22884
10878b72249b0796j7745j00817o8606A24938f6666j25569D8029h8532p7087A28342
10866E4502N7946M6641k0486e8132A76782m2720D2427K77356a1855E7379d13429
10854i6200j71570e5945B77338A00594J63307I0507l1475c3853G7398c47946B53688
10842A97639D7607J19043o9633J92110D2292J38159a6949B32701a69587k04305
$$ plain form
10832 -373892 -26791 238736 -144811 137868 -68676 -154734 -69664 159128 139816 81287 160650
10821 160650 -184644 -338877 127945 -174390 629 -87317 45984 -92800 -98481 22805 372627
10810 372627 249489 -403824 314935 -235988 -50590 -19861 -114002 -213356 13333 90395 4319
10798 31210 -123801 -185671 -166622 115337 32372 209612 374408 79951 -188207 -71984 149693
10786 21911 -259466 -335267 -285709 -57311 -453258 -229408 -171718 -80199 -155375 198296 -75028
10774 -26892 -294458 -186258 -133932 -262689 -3505 37406 464211 -357781 54745 -63248 -273044
10763 -273044 -62890 98320 -105177 156225 -130974 -24825 -135581 211169 -307313 193001
10752 -302192 187680 -95195 -234061 -179079 40691 -232403 -160940 134181 -42814 -45504 -89870
$$ packed form
10832c73892b6791B38736a44811A37868f8676q6058f9664A59128j9312n8529P9363
10821A60650a84644j54233A27945a74390F29h7317D5984i2800n681B2805L49822
10810C72627j23138d03824C14935b35988e0590a9861r4141r9354A3333P7062D319
10798C1210a23801o1870J9049A15337C2372J77240J64796G9951a88207g1984A49693
10786B1911b59466p5801M9558e7311l95947K23850N7690h0199p5176A98296g5028
10774b6892k67566J08200N2326j28757c505C7406M26805c57781E4745f3248k09796
10763b73044f2890I8320a05177A56225a30974b4825j10756B11169c07313A93001
10752c02192A87680i5195j38866N4982D0691b32403P1463A34181d2814k690m4366
$$ plain form
10741 -89870 -460235 -29229 -112588 -81264 18985 30155 126496 -42706 -250653 -30807 -194829
10730 -194829 -254861 -380548 -189604 -57609 87123 -273211 -2722 -180139 68909 -38220 -320116
10719 -320116 -120615 -164180 12731 -159317 -144845 164181 112234 -83561 -17338 116665 -221429
10707 71063 -48159 358 5493 -25461 188199 3088 -28672 -73445 -135401 242949 -456167 40508
10694 48027 2210 -15687 211757 -251873 254787 146384 -67231 -186281 17811 -114438 26467
10682 88101 -139674 228778 -217250 501417 108412 62597 70822 -135848 -215482 -252356 10593
10670 -234002 341142 95132 -214989 53021 10477 170324 -48066 -271037 20000 94040 -128402
10658 170051 -318243 -161073 58457 -430858 -155144 -158612 185403 -201495 90405 -168800
$$ packed form
10741h9870l70365b9229q3359L1324A8985J1170R6341d2706k07947c0807j64022
10730a94829o0032j25687a89604e7609H7123b73211b722j77417F8909c8220k81896
10719c20116a20615m3565A2731a59317J4472A64181n1947h3561a7338A16665b21429
10707G1063d8159C58N135b5461A88199C088b8672m4773o1956B42949d56167D0508
10694D8027B210a5687B11757b51873B54787j08403f7231j19050A7811a14438B6467
10682H8101a39674B28778b17250E01417A08412m5815Q225a35848p9634l6874A0593
10670b34002C41142I5132b14989E3021A0477J59847d8066k22971B0000P4040a28402
10658A70051c18243J57170E8457d30858a55144l468A85403b01495I0405a68800
$$ plain form
10647 -158709 -41591 -56725 82319 -335643 10977 -335314 -69220 -41308 -140287 -116843 -65560
10636 -65560 -69254 -504784 -280423 -92617 260391 -79632 -32113 121816 -36714 393800 -275845
10624 -6045 -85323 246275 19411 174709 -124221 156728 94328 -253243 -154947 165697 -189735
10612 80027 -156661 -10892 -368360 204670 -263062 -287621 43009 71122 -269569 -190514 -58116
10600 -191428 -172166 -12062 -57272 246095 8573 -170792 -51488 422845 -317467 60857 211347
10589 211347 -294675 -169580 -85634 -10681 7409 -117268 215601 -16653 -169197 23110 32595
10578 32595 65504 157505 -312888 -83165 -217499 94661 -196725 225464 320682 -248278 13030
10566 115383 -290547 135876 35525 62137 -85316 48839 -22425 -7061 93570 -203754 -90582
$$ packed form
10647a58709d1591j5134H2319c35643A0977c35314f9220K7912r8979K3444N1283
10636f5560l694m35530K24361i2617B60391g9632c2113A21816c6714C93800b75845
10624f045p9278B46275A9411J55298a24221A56728o2400b53243R8296A65697a89735
10612H0027a56661a0892l57468B04670b63062k4559D3009K8113b69569P9055e8116
10600a91428J9262a2062m5210B46095H573a70792e1488D22845c17467F0857J50490
10589B11347b94675J25095Q3946a0681G409a17268B15601a6653j52544B3110R485
10578C2595L2909R2001c12888h3165j34334I4661a96725B25464R5218b48278A3030
10566A15383b90547A35876C5525K6612h5316D8839b2425g061I3570b03754i0582
$$ plain form
10554 -286272 26034 -238616 254817 -100841 71821 -404262 -19300 -113362 -29002 79770 97930
10543 97930 -178361 -153801 -191598 -174170 -48816 151765 63780 102334 19996 -98326 -351873
10532 -351873 -458809 166428 -68645 106581 -173451 -22645 -28183 48746 200497 -66815 -104827
10521 -104827 36615 207577 109978 -9180 -58172 -161760 200124 81844 19144 -149293 -41763
10509 -14043 46216 285963 260892 -103253 72903 -86189 -303987 -188411 -159613 -69363 -164913
10498 -164913 241057 -250975 -209813 19766 247418 113284 67359 -312536 -86134 -111360
10488 -111360 306064 64778 -14443 441638 80056 -286942 756163 373450 703474 128793
10477 461109 55632 278196 390604 -45912 -22200 297554 266850 -20438 162659 29160 82352
$$ packed form
10554b86272B6034b38616B54817a00841G1821d04262a9300r4062b9002G9770J8160
10543I7930a78361K4560l7797J7428d8816A51765F3780L8554A9996i8326k53547
10532c51873j06936A66428f8645A06581a73451b2645n538D8746J51751f6815l8012
10521a04827C6615J70962r7599i180m8992j03588B00124H1844A9144a49293d1763
10509a4043D6216K39747k5071a03253G2903h6189k17798J15576K8798f9363r5550
10498a64913B41057b50975M1162A9766K27652A13284m5925c12536h6134k5226
10488a11360C06064F4778a4443D41638H0056b86942G56163C73450L30024A28793
10477D61109E5632K22564J12408d5912b2200B97554l0704b0438A62659B9160N3192
$$ plain form
10466 82352 -112457 -63310 -46118 -88257 -204128 -133620 -59158 206535 308719 -95814 85919
10454 -208971 187043 -284704 -117184 383969 -78483 198715 -143318 -193916 319026 -196193
10443 28355 -166982 404031 -243308 -238452 400269 -386379 170039 -172997 205977 -118832
10432 200060 -41500 -221056 100061 -393984 -107974 131368 145445 126979 -111824 -123856
10422 -123856 152481 -146311 -127265 -118623 117105 103537 -277964 -197648 -61646 94133 -205096
10410 -194282 -44216 83976 144580 -85749 -257837 14579 -35554 133403 109064 -10416 221152
10398 -80148 81394 89606 -141412 -60199 -37578 313652 -24091 112065 72918 -259514 233380
10386 35685 34126 173215 -148093 -167929 211040 -77591 -68476 480713 -16886 269729 351968
$$ packed form
10466H2352a12457M9147J7192m2139j15871P0508e9158B06535J02184i5814H5919
10454b08971A87043b84704a17184C83969g8483A98715a43318n0598C19026a96193
10443B8355a66982D04031b43308M856D00269c86379A70039a72997B05977a18832
10432B00060d1500j79556A00061c93984a07974A31368J4077j8466a11824j2032
10422a23856A52481a46311J9046Q642A17105j3568b77964Q0316f1646I4133b05096
10410a94282d4216H3976O0604h5749j72088A4579c5554A33403k4339a0416B21152
10398h0148H1394Q212a41412f0199K2621C13652b4091A12065l9147b59514B33380
10386C5685j559J39089a48093j9836B11040g7591R115D80713a6886B69729Q2239
$$ plain form
10375 351968 -36007 -92547 9762 29633 221536 360180 342388 394719 55805 886689 453260
10364 453260 189933 425607 223542 -181080 359963 221993 400211 234114 250211 315104
10354 315104 132608 40466 406528 425824 207156 363390 459624 307690 230816 581469
10344 581469 330229 533111 463239 267060 330033 -13169 -54206 25009 237298 130898
10334 130898 3171 -5615 393624 32421 -344067 379921 8082 376924 213042 322161 196639
10323 196639 336412 107601 290974 111219 16743 175842 346851 80056 95057 -35212
10312 347566 -231898 101751 -48850 -48507 126348 -49656 -210193 42534 21868 289602 -194655
10300 -201308 158054 -15839 -73286 166296 178846 -263662 59323 -187804 -212483 -31236 -52831
$$ packed form
10375C51968c6007n6540I762J9871J91903J38644j7792N2331E5805Q30884m33429
10364D53260A89933K35674k02065a81080C59963j37970J78218j66097J6097O4893
10354C15104A32608D0466L66062J9296B07156J56234R6234j51934p6874L50653
10344E81469k51240K02882o9872j96179O2973a3169m1037B5009K12289j06400
10334A30898C171e615C93624C2421c44067C79921H082L68842j63882J09119j25522
10323A96639J39773A07601J83373A11219A6743J59099J71009H0056J5001c5212
10312C47566b31898A01751d8850L43A26348d9656j60537D2534k0666K67734a94655
10300b01308A58054a5839n7447A66296J2550b63662E9323a87804k4679c1236k1595
$$ plain form
10289 -52831 -93387 66619 28634 -186807 -59509 -142988 -180335 -123811 -71243 114317 -54717
10277 196025 -246058 -15480 -82498 107414 183057 -283972 130404 19048 -62360 -56374 77708
10265 -203481 -81057 31358 284627 80874 368848 161913 216688 135972 317464 290766 304159
10254 304159 292378 -23093 210969 10588 -201913 231403 28091 106803 153156 -89941 95845
10242 140815 258743 -18514 -294073 -12095 277936 44225 228752 290081 -453555 -68086
10231 -87637 342164 280512 -35149 -408821 -200371 -236913 83548 -308311 -152275 97157 -122251
10219 -388434 -197126 -159446 -359920 -107028 -291272 -11601 -182939 -51484 -231284 -218978
10209 -218978 -53087 -292780 -101525 -8283 -310454 120163 -176284 -201175 35162 12028 -101174
$$ packed form
10289e2831m0556F6619B8634a86807e9509q3479l7347N6524N2568A14317e4717
10277A96025b46058a5480o7018A07414P5643b83972A30404A9048f2360N986G7708
10265b03481h1057C1358K53269H0874K87974A61913N4775q0716J81492k6698J3393
10254C04159j1781b3093B10969A0588b01913B31403B8091P8712M6353h9941I5845
10242A40815J17928a8514k75559a2095B77936D4225J84527O1329d53555f8086
10231h7637C42164o1652c5149l73672b00371l6542H3548c08311a52275I7157a22251
10219c88434J91308L7680k00474a07028j84244a1601j71338e1484j79800J2306
10209b18978e3087k39693a01525h283l02171A20163a76284k4891C5162A2028a01174
$$ plain form
10197 -35852 293667 71880 -147992 1481 -157304 -57088 -62977 -301093 -200440 352946 -234938
10185 81362 56380 -310025 -134250 -47741 -105404 36291 -271591 -20893 11424 -131349 -295051
10174 -295051 107804 -119883 81067 -65170 -161132 129071 315286 -42592 -220365 30312
10163 -148173 114505 -238083 -304070 -466083 -224251 100534 -123366 -124116 -86969 17780 -48293
10151 -286877 66854 -119530 113218 -85908 -149966 -190528 235962 433101 105129 -78811
10140 -285290 -29045 -285679 -174919 -52368 -321169 -35415 381810 138628 -48140 -119638
10130 -119638 115393 3157 -28578 -213869 222321 14927 -42513 -17586 -557489 97530 141682
10119 141682 -206403 192309 -24481 86470 197448 -130488 -2179 -83399 -213523 49512 -56443
$$ packed form
10197c5852B93667G1880a47992A481a57304e7088n889k38116J00653C52946b34938
10185H1362k4982c10025a34250d7741n7663C6291b71591b0893A1424a31349j63702
10174b95051A07804a19883H1067f5170r5962A29071J86215d2592j77773C0312
10163a48173A14505b38083o5987j62013b24251A00534a23366p50L7147A7780d8293
10151b86877F6854a19530A13218h5908o4058m0562B35962J97139A05129g8811
10140b85290b9045k56634J10760e2368k68801c5415C81810A38628d8140p1498
10130a19638A15393C157b8578j85291B22321A4927d2513a7586n39903I7530M4152
10119A41682b06403A92309b4481H6470J10978a30488b179q1220j30124D9512e6443
$$ plain form
10107 -232810 -296687 29853 130212 -156431 195716 -139620 172887 -207787 -115187 -123213
10097 -123213 -344823 -260787 -46641 -339798 126371 -187978 159937 -49253 -254854 125714
10086 25499 261383 -410933 -177655 -59879 119485 -209265 86730 -378062 -61012 -89233
10076 -89233 -72489 -94669 -102624 132910 104514 -222136 18565 -96331 -37957 -85386 73451
10064 -79108 25618 -218450 180992 14801 -63204 -113713 113201 -67556 35458 -36995 47664
10052 196966 -274431 -101794 -49409 -128122 -162007 -358170 -261692 -132482 -150857 -120233 347039
10040 110811 -134872 -210592 -53211 62166 73994 129546 -194623 21424 -105726 -400592 -90654
10028 101741 -63643 133852 -305670 -6803 -249384 -159715 157918 -116661 -180717 -424131
$$ packed form
10107b32810o3877B9853J00359a56431A95716a39620A72887b07787R2600q026
10097a23213k21610Q4036d6641k93157A26371a87978A59937d9253k05601A25714
10086B5499K35884d10933a77655e9879A19485b09265H6730c78062f1012k8221
10076h9233J6744k2180p955A32910k8396b22136A8565i6331c7957m7429G3451
10064g9108B5618b18450A80992A4801f3204n0509A13201f7556C5458c6995D7664
10052A96966b74431a01794d9409p8713l3885j96163R6478J29210j8375L0624C47039
10040A10811a34872p5720e3211F2166J1828N5552a94623B1424a05726k94866i0654
10028A01741f3643A33852c05670f803k42581Q9669A57918a16661o4056k43414
$$ plain form
10018 -424131 140327 -212488 -201905 -155272 49119 -269795 -23279 18768 -288957 -15592 -212556
10007 -212556 133812 -199231 -265388 -44565 -257588 -89295 -209510 -113105 -54764 38807 -85396
9995 79131 -241520 42169 -202866 142295 -97384 102143 -448809 100747 227830 37546
9984 -220863 -43378 -18604 96988 -159584 -10185 83742 204057 305734 137204 70947 -15184
9972 231580 27464 77049 -82987 96751 -74396 224630 -196481 -321465 -51037 -102181 -35589
9960 -234322 -149814 -228684 69756 -41806 -332439 -169068 -357664 -204429 -107472 -144991 346100
9948 -340794 -137717 -57628 -90815 -43447 -213491 340029 -19168 276882 -11228 -143502 -50571
9936 -11915 -110119 -57426 -114392 100117 77603 -83682 201526 -8587 -171690 203972 -456251
$$ packed form
10018d24131A40327b12488J0583M6633D9119b69795b3279A8768b88957a5592j96964
10007b12556A33812a99231o6157d4565k13023h9295j20215R6405e4764C8807h5396
9995G9131b41520D2169b02866A42295i7384A02143d48809A00747J27083C7546
9984b20863d3378a8604I6988a59584a0185H3742J20315J01677A37204o6257a5184
9972B31580B7464M9585h2987I6751g4396B24630a96481j24984e1037n1144c5589
9960b34322Q4508p8870F9756d1806k90633J63371j88596J53235R6957l7519C46100
9948c40794a37717e7628l3187d3447j70044C40029a9168B76882a1228j32274e0571
9936a1915r8204N2693n6966A00117k2514h3682B01526h587j63103B03972d56251
$$ plain form
9924 130815 -419333 -45339 -216742 -138823 110630 -133907 119945 -261880 -219765 -241343
9914 -241343 -208098 158646 -128381 -173225 3874 -46358 300370 -52269 -234990 -113486 -177095
9903 -177095 -28101 10887 -175807 -6839 -223736 -19416 -106457 88983 -25130 -134590 21860
9891 198819 -244675 -154203 -291953 -70006 -28244 -72267 -320391 147409 -11531 114176 -183519
9879 180147 -158714 62149 4634 273756 -153282 -235496 -328186 -319224 -109959 -149687 -161710
9868 -161710 -289465 -148509 -419324 -103336 -426580 -213121 -446459 -50580 -155390 -72434
9857 62060 -224610 145192 -260429 -264673 -87819 259380 -142777 25636 31457 156951 -145304
9845 -242664 15712 -178806 206270 -62068 -129964 -44654 -153002 -116826 33828 -504142 114168
$$ packed form
9924A30815d19333d5339j71403P7919A10630a33907A19945b61880M2115k1578
9914b41343L3245A58646a28381m4844C874d6358C00370e2269j82721a13486o3609
9903a77095b8101A0887a75807f839k16897a9416q7041H8983b5130j09460B1860
9891A98819b44675R0472j37750g0006b8244m4023k48124A47409a1531A14176a83519
9879A80147a58714F2149D634K69122a53282q2214r2690Q962a09959l9728j2023
9868a61710j27755J40956k70815a03336l23244b13121k33338e0580j04810g2434
9857F2060b24610A45192b60429m244h7819B59380a42777B5636N821J25494a45304
9845b42664A5712a78806B06270f2068o7896d4654j08348L6176C3828e04142A14168
$$ plain form
9833 71439 31329 54012 105193 5391 -1434 -53434 -240922 126790 -163506 104729 -153665
9821 -166453 165213 51477 306185 -91551 -47286 113045 46470 -413154 -240079 -207632 -340854
9810 -340854 -64633 -261568 43434 -161784 -309602 112402 139316 95213 -84211 119991 47834
9798 -54666 13249 202814 -423945 253225 -456710 -20732 -76006 -217763 -51899 105016 -60189
9786 167251 83714 -364911 -291824 -135375 -391112 -339173 -78282 59320 55565 -83956 -118180
9775 -118180 -266416 -2441 33216 -226633 -266036 -166566 -56099 280107 -137079 267493 45625
9763 -1489 16004 -174197 242909 -86938 -158092 230314 -357977 -72556 -63676 -149908 -281544
9752 -281544 -83057 -117453 -283758 -101648 -79802 -229969 -30843 -228671 82606 -223421 -314857
$$ packed form
9833G1439C1329K2683N1181E391a434n2000j87488A26790a63506A04729a53665
9821a66453A65213E1477K54708i1551M4265A13045D6470d13154J73075L2447j33222
9810c40854f4633j96935D3434a61784j47818A12402K6914m4103h4211A19991D7834
9798e4666A3249J89565d23945B53225d56710b0732n5274j41757e1899A05016f0189
9786A67251q3537c64911P3087a35375k55737N1939g8282E9320l755h3956l4224
9775a18180j48236b441C3216b26633l9403R9470e6099B80107a37079B67493D5625
9763a489A6004a74197B42909h6938p1154B30314c57977g2556Q880q6232j31636
9752b81544h3057l4396j66305a01648K1846j50167c0843j97828H2606b23421r1436
$$ plain form
9741 -314857 -186434 -70137 -133278 -154962 80848 80722 -78932 -148381 -95675 32530 55633 -329955
9728 144909 86203 44910 -160143 -137961 -223070 307735 122428 -109368 -380219 -309053 -99921
9716 -134910 -136319 -169184 -104325 -29121 -52825 -238034 -58626 262785 -84823 -127328 17368
9704 -315029 -220318 -308364 -424080 -129829 -164061 244902 -99726 -100910 -210422 189250 160224
9693 160224 -497339 -157700 1760 178047 -312839 118187 -286842 -142599 50438 49627 146903
9682 146903 -170644 -83346 -123631 -114445 215046 2674 -148300 -62163 -300830 307138 38524
9670 -187347 27225 -88300 -176802 -307998 -326674 -250765 255066 -227997 -173751 35761 185918
9659 185918 -111848 13266 99230 104399 128587 -28536 -10379 50349 68086 -45484 13736 72775
$$ packed form
9741c14857J28423g0137o3141k1684H0848j26g8932o9449N2706C2530K3103c29955
9728A44909n8706m1293a60143K2182q5109C07735A22428a09368k70851P1166i9921
9716a34910j409l2865O4859b9121k3704j85209e8626B62785h4823m2505A7368
9704c15029R4711q8046j15716a29829l4232B44902i9726j184j09512A89250k9026
9693A60224d97339a57700A760J76287c12839A18187b86842a42599E0438q11R7276
9682A46903a70644h3346m0285R186B15046B674a48300f2163k38667C07138C8524
9670a87347B7225h8300q8502j31196j8676P5909B55066b27997N4246C5761J50157
9659A85918a11848A3266Q5964N169K4188b8536a0379E0349J7737d5484A3736N9039
$$ plain form
9647 72775 87431 -44618 71251 118841 -24899 1871 -64882 -166039 129089 232995 254896
9636 254896 -170451 87170 -400561 -83125 -68740 -171676 111979 -212851 -52004 127288
9625 -38087 -58567 -246002 -106635 168998 -52185 -121899 -62554 -114633 -315795 -279291 -102179
9613 -410744 -251688 -274671 44484 17809 39765 175659 -221569 166923 182607 114310 56345
9601 -106432 -95650 -109515 129255 -58239 -166982 107199 -165290 -63755 -360487 -107368
9590 -128964 -359666 55513 235155 -13953 19322 -13652 293307 -121326 289349 28435 -212578
9578 56926 190420 -370259 -277498 -46112 20978 632997 -401195 74791 76060 -27932 -162817
9567 -162817 60520 -144637 -120749 -416208 -143234 -38604 60463 143687 31632 164602 -10005
$$ packed form
9647G2775J4656d4618G1251M7590b4899A871f4882j01157A29089J03906K1901
9636B54896a70451H7170d00561h3125J4385j02936A11979b12851e2004A27288
9625c8087k0480j87435a06635A68998e2185o9714N9345n2079k01162L6504a02179
9613d10744J59056k2983D4484A7809K1956J35894b21569A66923J5684o8297E6345
9601a06432J0782j3865A29255e8239j08743A07199a65290f3755k96732a07368
9590a28964k30702E5513J79642a3953A9322a3652B93307a21326B89349B8435b12578
9578E6926J33494c70259R2761d6112B0978O12019d01195G4791J269b7932j34885
9567a62817F0520a44637K3888k95459a43234c8604F0463Q3224C1632J32970a0005
$$ plain form
9555 -21219 -18158 160733 -270854 -26801 -66620 204167 110100 -456646 -438899 34754 142542
9544 142542 -154168 247481 162692 -178468 65308 -257901 55037 38336 -264572 -219553 56015
9532 174485 241928 226 248843 -343620 169413 53784 -34856 3133 16357 -148520 -90502
9521 -90502 53083 79591 -35168 -432224 180369 -126667 -225333 -165922 205827 -60562 -89112
9510 -89112 -296967 -58049 -5077 -3725 -161530 -57578 -111237 -253272 -13128 53747 -41521 -460165
9498 -460165 54072 32208 -166997 -106493 -343074 -173648 41660 310741 -59017 -133382 -152274
9487 -152274 -328174 -276797 -169207 187612 213217 -124025 48327 -20843 34741 -6797 -361139
9476 -361139 56217 -89409 -150770 11357 -58819 20474 -25437 -219693 -13452 -191613 -76121
$$ packed form
9555b1219L061A60733b70854b6801l9819B04167r4067d56646J7747C4754J07788
9544A42542a54168B47481q4789a78468F5308b57901E5037j6701b64572M5019E6015
9532A74485O7443B26K48617c43620A69413E3784c4856C133J3224a48520N8018
9521i0502E3083K6508c5168l97056A80369a26667r8666N9411B05827f0562k8550
9510h9112k07855e8049e077J352j57805e7578n3659j42035a3128E3747d1521m18644
9498d60165E4072k1864a66997O0504k36581J69426D1660K69081e9017p4365j8892
9487a52274j75900N1377J07590A87612K5605a24025D8327b0843C4741f797l54342
9476c61139E6217h9409o1361A1357e8819B0474b5437j94256a3452j78161g6121
$$ plain form
9464 -256630 18473 -460241 71850 -141813 -27399 38994 -121398 86624 71277 -223684 337672
9452 -215789 -239708 -254874 104655 114342 119450 -131861 36897 11672 -85450 -97017 -101676 -83644
9440 -83644 280644 -39865 -439143 -229209 -146055 58816 103442 -83191 -382915 -292035 -143076
9428 -74960 -91126 8584 5952 -128650 32498 -92443 -120850 215798 -177687 -314916 -156412
9416 -402438 -90987 219540 105983 67120 -104366 217285 238644 -6736 -100919 -278849 -324416
9405 -324416 67429 -340934 144758 -60083 -160620 -296197 -26371 -73651 128401 -183162
9394 -201535 -547107 118375 -161042 88530 100307 24585 -26154 -167881 126489 76899 67025
9383 67025 133250 -188867 30087 -281825 27345 321897 112768 -186033 275719 -149115
$$ packed form
9464b56630A8473d60241G1850a41813b7399C8994a21398H6624j5347b23684C37672
9452b15789k3919j5166A04655R687N108a31861C6897A1672h5450j1567m659J8032
9440h3644B80644c9865l99278K09934Q3154E8816M4626h3191k99724R0880a43076
9428g4960j6166H584k632a28650C2498i2443k8407B15798a77687j37229a56412
9416d02438i0987B19540A05983l8863a04366B17285K1359f736r4183j77930m5567
9405c24416F7429c40934A44758f0083j00537j35577b6371m7280A28401a83162
9394b01535l45572A18375a61042H8530J1777B4585b6154j41727A26489m9590r874
9383F7025O6225a88867C0087b81825B7345K94552A12768a86033B75719a49115
$$ plain form
9372 -49038 -230122 -56823 -10612 -224310 180688 -171455 -117795 -210192 -44594 -354823 -90075
9360 126027 -223303 27672 52411 409132 -33495 -178399 -291459 115574 70737 -264279
9349 -260189 -225710 -104258 -177877 -451615 89159 27692 102617 159674 194460 113048 42659
9337 -39071 -8317 -8333 -225132 -212503 160336 -44948 -83346 -10689 -158058 34443 761 33418
9325 33418 -112770 341954 70839 -87223 191891 200126 -181605 -182576 36408 -86314 1051 -265220
9312 -69335 37030 -143058 -32277 -369190 -236120 -374914 57462 -149516 -354131 257297
9301 -190970 -123399 43543 274696 -81228 -15590 -138377 -69077 -127325 -417804 -146431 -241250
9290 -241250 -318153 -141290 -78066 -260202 99104 -217550 -406922 12709 -275370 73525 84722
$$ packed form
9372d9038j81084e6823a0612k13698A80688a71455N3660r2397d4594l10229i0075
9360A26027b23303B7672K4739L56721c3495j44904j13060A15574m4837b64279
9349b60189L4479a04258p3619k73738H9159B7692P4925N7057L4786q1412D2659
9337c9071h317j6k16799J2629A60336d4948l8398a0689j47369C4443G61L2657
9325C3418a12770C41954G0839h7223A91891Q235a81605r71C6408h6314A051b65220
9312f9335C7030a43058c2277l36913J33070j38794E7462a49516k04615B57297
9301a90970O7571D3543K31153h1228a5590j22787f9077n8248k90479a46431r4819
9290b41250p6903a41290O3224j82136I9104b17550j89372A2709b75370G3525J1197
$$ plain form
9279 84722 108683 -88802 239884 211634 308668 8315 76610 -42796 -176478 -59932 -253398
9268 -253398 -20721 -30398 -132981 -252855 -464439 36920 -310493 -127960 -234376 -59568 -142462
9257 -142462 26629 -221442 -244446 -215079 -11238 104212 -49736 -386116 49695 -213600 -215466
9246 -215466 65541 -252991 -192113 -114905 96254 37950 -246652 -194638 -110877 -10451 12763
9234 -128930 148992 -229122 -285179 27634 219443 11345 -17543 -174046 38825 75751 -48172
9222 -10241 -74762 31064 -199883 -226445 187580 -258602 -106176 10056 -13199 -186230 16503
9210 -12395 62252 -39326 215602 -86631 145019 51236 -152075 -194021 -136466 -132048 -320775
9199 -320775 -111323 -161381 -220561 32521 -109888 -154104 84396 -489891 251475 4732 -40351
$$ packed form
9279H4722K3961h8802B39884k8250R7034H315O8295d2796j33682e9932j93466
9268b53398b0721r677j02583j19874k11584C6920c10493a27960j06416e9568q2894
9257a42462B6629b21442k3004K9367a1238A04212d9736l36380D9695b13600j866
9246b15466F5541b52991O0878P7208I6254C7950b46652N2014Q3761a0451A2763
9234a28930A48992b29122n6057B7634J91809A1345a7543j56503C8825L6926d8172
9222a0241o4521C1064a99883k6562A87580b58602a06176A0056a3199j73031A6503
9210a2395F2252c9326B15602h6631A45019E1236a52075m1946N7555M418j88727
9199c20775a11323n0058n9180C2521a09888m4216H4396d89891B51475D732d0351
$$ plain form
9187 -11935 -106297 66156 97013 -124926 11190 -99910 -68573 -176559 -28193 -372000 -338288
9176 -338288 -116963 49110 -89088 -147995 438341 -43367 17739 -280970 102988 71164 144268
9165 144268 -122789 197584 214059 -213715 -70622 37720 -189962 -154234 -122576 234891 -182099
9153 -92194 235024 -58739 57561 -266914 -129056 -221104 -57009 30322 29264 -291564 199923
9141 -235328 -246653 250053 -60207 14289 -178722 -10634 86437 -183588 -113258 158481 -168587
9129 387748 -59933 -147618 -530749 -267697 -48942 68485 -77933 -104695 -161435 -15235 40126
9117 -152752 165118 74543 133161 -12941 -252122 -93401 -309621 -129 125105 111861 -349361
9105 110777 -39219 110499 -111246 -10516 179193 -67035 53302 -107976 50254 99369 -235569
$$ packed form
9187a1935r4362F6156L0857a24926A1190i9910L1337j07986b8193l43807L3712
9176c38288a16963D9110h9088n8907D38341d3367A7739b80970A02988l1824P3104
9165A44268a22789A97584J6475b13715g0622C7720a89962L5728L1658B34891a82099
9153i2194B35024e8739E7561b66914a29056r2048e7009C0322j058b91564A99923
9141b35328j1325B50053f0207A4289a78722a0634H6437a83588P0330A58481a68587
9129C87748e9933q7685l83131K63052d8942F8485g7933k6762n6740a5235D0126
9117a52752A65118G4543N8618a2941k39181i3401k16220a29A25105j3244c49361
9105A10777c9219A10499a11246a0516A79193f7035E3302a07976E0254M9115b35569
$$ plain form
9093 -156436 -155864 -196306 -171893 -239957 -14090 -161898 -92200 45855 137580 88328 -176884 -213421
9081 -213421 -242876 -22491 -37635 -226651 -94592 -251623 -27152 150373 -24652 588 146215
9070 146215 -10059 -135347 114266 -119764 20129 -307364 -116577 -77839 229276 70962
9059 69911 126843 -70610 253183 -355111 129701 122692 -198222 149706 -221720 -268606 -168122
9048 -168122 486650 9375 43474 -122493 -187810 31410 -212369 -176351 -227250 -1658 -163521
9037 -163521 27836 -80659 286698 65852 -288651 133573 -84464 -17744 -434038 185860 -430086
9025 -361842 76576 -75926 -267642 169227 -160057 250862 -299132 154954 92469 -324 132593
9013 -83269 -301558 122004 34069 29046 177981 144481 -217902 -114139 -4110 17728 -224848
$$ packed form
9093a56436N72m0442K4413o8064a4090j47808O9698D5855R1725m9252a76884l6537
9081b13421k9455b2491j5144j89016i4592j57031b7152A50373b4652E88J45627
9070A46215a0059j25288A14266a19764B0129c07364a16577L8738B29276G0962
9059F9911N6932g0610B53183c55111A29701p009a98222A49706b21720m6886J00484
9048a68122D86650I375L4099a22493o5317C1410b12369L6018n0899a658j61863
9037a63521B7836h0659B86698F5852b88651A33573h4464a7744m16294A85860d30086
9025c61842G6576g5926j91716A69227a60057B50862b99132A54954o2485c24A32593
9013h3269k18289A22004C4069n023J48935l3500b17902J03763d110A7728b24848
$$ plain form
9001 -59144 -54072 -42871 245052 46501 31816 -331100 -203398 -196374 14144 25767 -60380 -125502
8989 -125502 -92217 171117 -95904 138399 64789 -82118 33940 208662 -269632 75123 -258333
8977 -439552 -305555 190810 108336 -423557 200360 51050 -159353 201828 295368 -73924
8966 -307344 -153023 354651 -130590 -429937 -64671 278688 -221757 -311159 119506 69770
8956 69770 55744 -93315 -67632 -31936 -61163 -81579 -168356 17930 207986 308979 -161368
8944 221029 96392 -133640 -333702 56265 -146038 -226051 132542 -91773 8673 36297 133034
8933 133034 -142793 -21017 -183001 313431 -134714 50037 292823 271855 503106 269141
8923 269141 1581581 6492758 3445446 595286 475881 251299 189395 101847 93010 -189169
$$ packed form
9001e9144N072J1201B45052D6501j4685c31100J27702P024A4144J1623f0380o5122
8989a25502L3285A71117i5904A38399F4789h2118C3940J74722b69632G5123b58333
8977d39552J33997A90810q2474d23557B00360E1050a59353B01828R3540g3924
8966c07344a53023C54651a30590k99347f4671B78688b21757q9402A19506m9736
8956F9770j4026i3315K5683c1936k9227k0416q6777A7930J90056J00993a61368
8944B21029I6392a33640k00062E6265a46038q0013A32542i1773H673K7624R6737
8933A33034a42793b1017j61984C13431a34714E0037K42786k0968K31251k33965
8923B69141J312440M911177l047312E95286j19405k24582o1904q7548q837a89169
$$ plain form
8912 -89614 -20945 -292138 -150704 120871 197552 -242722 99743 -35774 -108665 -31176 -327981
8901 -327981 75021 -208318 156962 -400232 20613 95454 39239 -41159 -148803 -61840 -50405
8890 -50405 -244235 -315888 136213 296115 -197302 -405116 212125 110646 -30580 101747
8879 -83056 -312259 109657 -171328 61280 -171970 -171552 -245796 112621 -172581 -161385 107644
$$ packed form
8912h9614b0945k71193J41434A20871P6681b42722I9743c5774p2891c1176k96805
8901c27981G5021b08318A56962d00232B0613P4841C9239d1159j07644f1840J1435
8890e0405j93830p1653A36213J59902a97302k07814B12125j01479c0580A01747
8879h3056k29203A09657a71328F1280a71970M18p4244A12621a72581J1196A07644
$$ [...]
##END NTUPLES=NMR SPECTRUM
##END=
