
##TITLE=AC1316_SSVAH12145_6535240_8EwEVxWRDJ
##JCAMPDX= 6.0         $$ Bruker NMR JCAMP-DX V2.0
##DATA TYPE= NMR SPECTRUM
##DATA CLASS= NTUPLES
##ORIGIN= BRUKER
##OWNER= Administrator
$$ 1.72 TOPSPIN		Version 2.1
$$ 2012-07-17 19:49:39.218 -0500  Administrator@TOPSPIN
$$ Compression mode = diff/dup
##.OBSERVE FREQUENCY= 400.02188249412
##.OBSERVE NUCLEUS= ^1H
##.ACQUISITION MODE= SIMULTANEOUS (DQD)
##.ACQUISITION SCHEME= undefined
##.AVERAGES= 64
##.DIGITISER RES= 22
##SPECTROMETER/DATA SYSTEM= spect
##.PULSE SEQUENCE= noesygpps1d.comp
##.SOLVENT NAME= COFFEE_meoh
##.SHIFT REFERENCE= INTERNAL, COFFEE_meoh, 1, 14.96077
##AUDIT TRAIL= $$ (NUMBER, WHEN, WHO, WHERE, PROCESS, VERSION, WHAT)
$$ ##TITLE= Audit trail, TOPSPIN		Version 2.1
$$ ##JCAMPDX= 5.01
$$ ##ORIGIN= Bruker BioSpin GmbH
$$ ##OWNER= Administrator
$$ $$ C:\Bruker\TOPSPIN/data/COFFEE/nmr/AC1316_SSVAH12145_6535240_8EwEVxWRDJ/12/pdata/1/auditp.txt
$$ ##AUDIT TRAIL=  $$ (NUMBER, WHEN, WHO, WHERE, PROCESS, VERSION, WHAT)
(   1,<2012-07-17 19:49:33.953 -0500>,<Administrator>,<TOPSPIN>,<go>,<TOPSPIN 2.1>,
      <created by zg
	started at 2012-07-17 19:38:03.875 -0500,
	POWCHK enabled, PULCHK disabled,
       configuration hash MD5:
       6B 1B 68 BB D9 2E 58 E2 7F 35 AD 54 07 DF 0E 41
       data hash MD5: 64K
       D1 6D C5 AB D4 26 CD 4F 91 41 C0 F7 08 4D F7 88>)
(   2,<2012-07-17 19:49:37.000 -0500>,<Administrator>,<TOPSPIN>,<proc1d>,<TOPSPIN 2.1>,
      <Start of raw data processing
       efp LB = 0.3 FT_mod = 6 PKNL = 1 PHC0 = 0 PHC1 = 0 SI = 128K 
       data hash MD5: 128K
       A6 55 CB 04 2C B8 FF E9 AB C4 93 10 AA 72 E4 DB>)
(   3,<2012-07-17 19:49:38.062 -0500>,<Administrator>,<TOPSPIN>,<proc1d>,<TOPSPIN 2.1>,
      <pk PHC0 = 1.818237 PHC1 = 0 
       data hash MD5: 128K
       99 2D 97 84 41 80 C5 00 BD D0 A0 89 24 08 35 8C>)
(   4,<2012-07-17 19:49:38.796 -0500>,<Administrator>,<TOPSPIN>,<proc1d>,<TOPSPIN 2.1>,
      <abs ABSG = 1 
       data hash MD5: 128K
       91 47 C8 30 1E C7 2D D5 DE 73 AD 89 ED F9 52 92>)
(   5,<2012-07-17 19:49:38.875 -0500>,<Administrator>,<TOPSPIN>,<proc1d>,<TOPSPIN 2.1>,
      <abs ABSG = 2 
       data hash MD5: 128K
       36 2A E1 5B 67 9F D2 75 CF 96 BD A2 FC DB 7E EE>)
(   6,<2012-07-17 19:49:38.921 -0500>,<Administrator>,<TOPSPIN>,<proc1d>,<TOPSPIN 2.1>,
      <abs ABSG = 3 
       data hash MD5: 128K
       45 F7 15 F6 F4 4A DF 21 5C 71 C9 E1 C2 77 15 37>)
(   7,<2012-07-17 19:49:39.015 -0500>,<Administrator>,<TOPSPIN>,<proc1d>,<TOPSPIN 2.1>,
      <abs ABSG = 4 
       data hash MD5: 128K
       62 53 02 FD 67 35 4C 47 E7 01 98 76 E5 61 7B DC>)
(   8,<2012-07-17 19:49:39.109 -0500>,<Administrator>,<TOPSPIN>,<proc1d>,<TOPSPIN 2.1>,
      <abs ABSG = 5 
       data hash MD5: 128K
       B7 E6 EA E4 19 54 60 C7 B0 07 9C 5C 8D 96 A4 97>)
$$ ##END=
$$ 
$$ $$ hash MD5
$$ $$ F9 9F AB F2 FC C3 DF 17 AA 4B DF 18 C2 5E 7D 08
##$RELAX= 
##$RELAX= 
##$RELAX= 
##$RELAX= 
##$RELAX= 
##$RELAX= 
##$RELAX= 
##$RELAX= 
$$ Bruker specific parameters
$$ [...]
##$TP07= 0
##$TPNAME0= <>
##$TPNAME1= <>
##$TPNAME2= <>
##$TPNAME3= <>
##$TPNAME4= <>
##$TPNAME5= <>
##$TPNAME6= <>
##$TPNAME7= <>
##$TPOAL= (0..7)
0.5 0.5 0.5 0.5 0.5 0.5 0.5 0.5
##$TPOFFS= (0..7)
0 0 0 0 0 0 0 0
##$TUNHIN= 0
##$TUNHOUT= 0
##$TUNXOUT= 0
##$USERA1= <user>
##$USERA2= <user>
##$USERA3= <user>
##$USERA4= <user>
##$USERA5= <user>
##$V9= 5
##$VALIST= <valist>
##$VCLIST= <CCCCCCCCCCCCCCC>
##$VD= 0
##$VDLIST= <DDDDDDDDDDDDDDD>
##$VPLIST= <PPPPPPPPPPPPPPP>
##$VTLIST= <TTTTTTTTTTTTTTT>
##$WBST= 2048
##$WBSW= 25
##$XGAIN= (0..3)
0 0 0 0
##$XL= 0
##$YL= 0
##$YMAX_a= 12127678
##$YMIN_a= -9245439
##$ZGOPTNS= <>
##$ZL1= 120
##$ZL2= 120
##$ZL3= 120
##$ZL4= 120
##$ABSF1= 14.96077
##$ABSF2= -5.597412
##$ABSG= 5
##$ABSL= 3
##$ALPHA= 0
##$AQORDER= 0
##$ASSFAC= 0
##$ASSFACI= 0
##$ASSFACX= 0
##$ASSWID= 0
##$AUNMP= <proc_prof1d_extract.lims>
##$AXLEFT= 0
##$AXNAME= <>
##$AXNUC= <1H>
##$AXRIGHT= 0
##$AXTYPE= 0
##$AXUNIT= <>
##$AZFE= 0.1
##$AZFW= 0.1
##$BCFW= 0
##$BC_mod= 0
##$BYTORDP= 0
##$COROFFS= 0
##$CY= 15
##$DATMOD= 1
##$DC= 0
##$DFILT= <>
##$DTYPP= 0
##$F1P= 0
##$F2P= 0
##$FCOR= 0.5
##$FTSIZE= 131072
##$FT_mod= 6
##$GAMMA= 0
##$GB= 0
##$INTBC= 1
##$INTSCL= 1
##$ISEN= 128
##$LB= 0.3
##$LEV0= 0
##$LPBIN= 0
##$MAXI= 10000
##$MC2= 0
##$MEAN= 0
##$ME_mod= 0
##$MI= 0
##$NCOEF= 0
##$NC_proc= -2
##$NLEV= 6
##$NOISF1= 0
##$NOISF2= 0
##$NSP= 0
##$NTH_PI= 0
##$NZP= 0
##$OFFSET= 14.96077
##$PC= 1
##$PHC0= 1.818237
##$PHC1= 0
##$PH_mod= 1
##$PKNL= yes
##$PPARMOD= 0
##$PPDIAG= 0
##$PPIPTYP= 0
##$PPMPNUM= 2147483647
##$PPRESOL= 1
##$PSCAL= 4
##$PSIGN= 0
##$PYNMP= <proc.py>
##$REVERSE= no
##$SF= 400.020009727415
##$SI= 131072
##$SIGF1= 0
##$SIGF2= 0
##$SINO= 400
##$SIOLD= 131072
##$SPECTYP= <>
##$SREGLST= <1H.CDCl3>
##$SSB= 0
##$STSI= 131072
##$STSR= 0
##$SW_p= 8223.68421052631
##$SYMM= 0
##$S_DEV= 0
##$TDeff= 65536
##$TDoff= 0
##$TI= <>
##$TILT= no
##$TM1= 0
##$TM2= 0
##$TOPLEV= 0
##$USERP1= <user>
##$USERP2= <user>
##$USERP3= <user>
##$USERP4= <user>
##$USERP5= <user>
##$WDW= 1
##$XDIM= 131072
##$YMAX_p= 394347129
##$YMIN_p= -11655
##$CURPLOT= <Network HP LaserJet P1505>
##$CURPRIN= <$Network HP LaserJet P1505>
##$DFORMAT= <normdp>
##$LAYOUT= <+/1D_H.xwp>
##$LFORMAT= <normlp>
##$PFORMAT= <normpl>
##$SURQMSG= 1
$$ End of Bruker specific parameters
$$ ---------------------------------
##NTUPLES= NMR SPECTRUM
##VAR_NAME=  FREQUENCY,     SPECTRUM/REAL,   SPECTRUM/IMAG
##SYMBOL=    X,             R,               I
##VAR_TYPE=  INDEPENDENT,   DEPENDENT,       DEPENDENT
##VAR_FORM=  AFFN,          ASDF,            ASDF
##VAR_DIM=   131072,        131072,          131072
##UNITS=     HZ,            ARBITRARY UNITS, ARBITRARY UNITS
##FACTOR=    0.0627417313425164, 1,          1
##FIRST=     8223.62146879497, 1793,         -53498
##LAST=      0,             1956,            -53746
##MIN=       0,             -11655,          0
##MAX=       8223.62146879497, 394347129,    0
$$ Real data points
##PAGE= N=1
##DATA TABLE= (X++(R..R)), XYDATA
$$ [...]
$$ plain form
63933 4243098 4471269 4677126 4856099 5004650 5119198 5196773 5236304 5238206 5202617 5128954
63923 5128954 5017604 4871268 4694187 4490788 4265871 4025596 3777057 3526518 3278350
63914 3278350 3035606 2801036 2577438 2367480 2173394 1996546 1837203 1694947 1569335
63905 1569335 1459812 1365017 1282681 1210503 1146846 1090500 1040272 995271 955259 920173 889340
63894 889340 861533 835762 811631 788892 767081 745805 725075 705101 685920 667473 649929
63883 649929 633645 618854 605656 594337 585373 578995 574991 573108 573423 576098 580987 587805 596550
63870 596550 607326 619798 633198 646965 660992 675169 689176 702978 717028 731528 745824
63859 745824 758944 770506 780576 788896 794874 798326 799658 799233 796970 792577 785756 776218 764067
$$ packed form
63933D243098K28171K05857J78973J48551J14548P7575L9531J902l5589p3663
63923E128954j11350j46336j77081k03399k24917k40275k48539k50539k48168
63914C278350k42744k34570k23598k09958j94086j76848j59343j42256j25612
63905A569335j09523r4795q2336p2178o3657n6346n0228m5001m0012l5086l0833
63894H89340k7807k5771k4131k2739k1811k1276k0730j9974j9181j8447j7544
63883F49929j6284j4791j3198j1319q964o378m004j883L15K675M889O818Q745
63870E96550J0776J2472J3400J3767J4027J4177J4007J3802J4050J4500J4296
63859G45824J3120J1562J0070Q320N978L452J332m25k263m393o821r538j2151
$$ plain form
63846 764067 750205 735721 720732 704420 686390 667306 647873 628011 607585 587162 567168
63835 567168 546843 525106 502255 479899 459226 440295 422995 407622 394127 381709 369704
63824 369704 358297 347805 337868 327986 318453 310096 303273 297662 292818 288414 284099 279752 275896 273316
63810 273316 272150 271676 271024 269760 267805 265316 262795 260912 259893 259306 258678 258121 258057 258493 258781 258124 256166
63793 256166 253143 249562 245790 241984 238391 235525 233705 232459 230826 228477 226241 225133 225067 224993 224231
63778 224231 223138 222294 221541 220308 218647 217410 217266 217929 218507 218422 217819 217238 217103 217467 218067 218599 218994 219390
63760 219390 219834 220127 220067 219728 219384 219298 219683 220632 221869 222750 222832 222356 221842 221313 220374 219030 217947 217733 218420
63741 218420 219797 221778 224147 226449 228623 231354 235197 239564 243230 245833 248219 251193 254480 257197
$$ packed form
63846G64067j3862j4484j4989j6312j8030j9084j9433j9862k0426k0423j9994
63835E67168k0325k1737k2851k2356k0673j8931j7300j5373j3495j2418j2005
63824C69704j1407j0492r937r882r533q357o823n611m844m404m315m347l856k580
63810B73316j166m74o52j264j955k489k521j883j019n87o28n57o4M36K88o57j958
63793B56166l023l581l772l806l593k866j820j246j633k349k236j108o6p4p62
63778B24231j093q44p53j233j661j237j44O63N78q5o03n81j35L64O00N32L95L96
63760B19390M44K93o0l39l44q6L85R49J237Q81Q2m76n14n29r39j344j083k14O87
63741B18420J377J981K369K302K174K731L843M367L666K603K386K974L287K717
$$ plain form
63727 257197 258969 260229 261657 263661 266339 269680 273704 278378 283421 288287 292561 296293 299700 302571
63713 302571 304311 304660 304075 303191 302120 300506 298075 294923 291432 288143 285621 284132 283420 282907 282190 281268
63697 281268 280439 280173 281013 283285 286697 290341 293314 295399 297067 298896 301128 303743 306613 309334 311143
63682 311143 311492 310777 310116 310174 310574 310749 310985 312033 313843 315365 315800 315528 315500 316168 317458 319452 322391
63665 322391 325880 328720 329948 329798 329130 328015 325512 321095 315770 311139 307612 304268 300408 296388 292619
63650 292619 288647 283990 279322 275943 274253 273559 273224 273173 273230 272851 271887 271000 270957 271892 273487 275486 277868
63633 277868 280871 284965 290346 296402 302197 307558 313073 318911 324439 329319 334246 340104 347095 355149
63619 355149 364449 374946 386103 397912 411485 427689 445744 464230 483048 503234 525130 548101
$$ packed form
63727B57197J772J260J428K004K678L341M024M674N043M866M274L732L407K871
63713C02571J740L49n85q84j071j614k431l152l491l289k522j489p12n13p17r22
63697B81268q29k66Q40K272L412L644K973K085J668J829K232K615K870K721J809
63682C11143L49p15o61N8M00J75K36J048J810J522M35k72k8O68J290J994K939
63665C22391L489K840J228j50o68j115k503m417n325m631l527l344l860m020l769
63650B92619l972m657m668l379j690o94l35n1N7l79r64q87m3R35J595J999K382
63633B77868L003M094N381O056N795N361N515N838N528M880M927N858O991Q054
63619C55149R300J0497J1157J1809J3573J6204J8055J8486J8818K0186K1896K2971
$$ plain form
63607 548101 572098 598078 626455 656178 685852 714678 741583 764387 780946 790863 795324 795550
63595 795550 792170 785966 778324 770574 763241 756066 748497 739894 729499 716591 700885 682736 662799
63582 662799 641538 619251 596528 574278 553079 532881 513728 496453 482118 470999 462629 456650
63570 456650 452952 451080 450288 450335 451593 454219 457823 462139 467309 473233 479302 485252 491687 499296 508042
63555 508042 517628 528246 540314 553893 569064 586589 607436 631619 658086 685888 715167 747005
63543 747005 782366 820717 859131 892938 918025 932855 938375 936460 928989 918064 906029 894734
63531 894734 884926 876440 868665 860846 852318 842577 830890 815898 796162 771334 742591 711742 680101
63518 680101 648296 616826 586445 557978 531878 508053 486234 466553 449544 435373 423293
$$ packed form
63607E48101K3997K5980K8377K9723K9674K8826K6905K2804J6559R917M461K26
63595G95550l380o204p642p750p333p175p569q603j0395j2908j5706j8149j9937
63582F62799k1261k2287k2723k2250k1199k0198j9153j7275j4335j1119q370n979
63570D56650l698j872p92M7J258K626L604M316N170N924O069N950O435P609Q746
63555E08042R586J0618J2068J3579J5171J7525K0847K4183K6467K7802K9279L1838
63543G47005L5361L8351L8414L3807K5087J4830N520j915p471j0925j2035j1295
63531H94734r808q486p775p819q528r741j1687j4992j9736k4828k8743l0849l1641
63518F80101l1805l1470l0381k8467k6100k3825k1819j9681j7009j4171j2080
$$ plain form
63507 423293 412185 401552 391599 382519 374220 366803 360707 356096 352463 349191 346193 343721 341758 340056
63493 340056 338627 337815 337790 338273 338881 339534 340388 341483 342645 343733 344828 346105 347652 349530 351903 354858
63477 354858 358107 361166 363925 366781 369961 373007 375233 376449 376816 376126 373776 369582 364216 358661 353599
63462 353599 349389 346167 343646 341167 338417 335930 334558 334585 335685 337567 340167 343209 346110 348590 351099
63447 351099 354379 358712 363749 368985 374276 380060 387180 396311 407330 419322 431475 443986 457945
63434 457945 474380 493601 515366 539190 564172 588735 610999 629622 644312 655638 664515 671902
63422 671902 678824 686503 696315 709483 726741 748320 774112 803585 835633 868935 902628 936150
63410 936150 968109 995825 1016703 1029913 1036167 1036163 1030204 1019448 1006441 993663 981939 970710 959247
$$ packed form
63507D23293j1108j0633r953r080q299p417o096m611l633l272k998k472j963j702
63493C40056j429q12k5M83O08O53Q54J095J162J088J095J277J547J878K373K955
63477C54858L249L059K759K856L180L046K226J216L67o90k350m194n366n555n062
63462C53599m210l222k521k479k750k487j372K7J100J882K600L042K901K480K509
63447C51099L280M333N037N236N291N784P120R131J1019J1992J2153J2511J3959
63434D57945J6435J9221K1765K3824K4982K4563K2264J8623J4690J1326Q877P387
63422F71902O922P679R812J3168J7258K1579K5792K9473L2048L3302L3693L3522
63410I36150L1959K7716K0878J3210O254mn959j0756j3007j2778j1724j1229j1463
$$ plain form
63397 959247 946915 932678 915263 893973 868981 840904 810556 778994 747275 716015 685514
63386 685514 656251 628921 603965 581444 561368 543805 528628 515465 503993 494108 485969 480117
63374 480117 477307 477747 480601 484781 490142 497354 506628 517306 528821 541315 554957 569378 584347
63361 584347 600543 619043 640347 664406 691224 720739 752267 784770 817743 851202 884628
63350 884628 916433 944767 968499 987095 999866 1005926 1005080 998553 988616 977340 965634 953375
63338 953375 940324 926729 912963 898719 882767 863575 840242 812973 782888 751523 720394
63327 720394 690757 663421 638634 616304 596465 579468 565594 554630 546084 539724 535524 532957
63315 532957 530573 526423 518879 507243 492043 474880 457676 441733 427556 415402 405540 397828
$$ packed form
63397I59247j2332j4237j7415k1290k4992k8077l0348l1562l1719l1260l0501
63386F85514k9263k7330k4956k2521k0076j7563j5177j3163j1472r885q139n852
63374D80117k810M40K854M180N361P212R274J0678J1515J2494J3642J4421J4969
63361E84347J6196J8500K1304K4059K6818K9515L1528L2503L2973L3459L3426
63350H84628L1805K8334K3732J8596J2771O060q46o527r937j1276j1706j2259
63338I53375j3051j3595j3766j4244j5952j9192k3333k7269l0085l1365l1129
63327G20394k9637k7336k4787k2330j9839j6997j3874j0964q546o360m200k567
63315E32957k384m150p544j1636j5200j7163j7204j5943j4177j2154r862p712
$$ plain form
63303 397828 391501 385794 380511 375713 371227 366946 363379 361255 360543 360285 359481 357833 355592 353097 350632
63288 350632 348380 346264 343907 340933 337263 333188 329272 326146 324097 322839 321898 321249 321298 322158 323239
63273 323239 323796 323700 323469 323676 324488 325652 326724 327363 327654 328151 329451 331652 334317 336967 339514 342211
63257 342211 345296 348802 352669 356966 361943 367849 374626 381769 388585 394762 400741 407406 415297 424234
63243 424234 433808 444064 455454 468226 482280 497682 514935 534531 556513 580725 607138 635492
63231 635492 664867 694173 723068 752004 781324 810787 839971 868635 896500 923269 949241
63220 949241 975518 1003058 1031725 1060697 1089613 1118708 1147738 1175317 1199577 1219175 1233407
63209 1233407 1241683 1243350 1238071 1226018 1207574 1183036 1152857 1118146 1080692 1042341 1004302 967102
$$ packed form
63303C97828o327n707n283m798m486m281l567k124p12k58q04j648k241k495k465
63288C50632k252k116k357k974l670m075l916l126k049j258r41o49M9Q60J081
63273C23239N57r6k31K07Q12J164J072O39K91M97J300K201K665K650K547K697
63257C42211L085L506L867M297M977N906O777P143O816O177N979O665P891Q937
63243D24234R574J0256J1390J2772J4054J5402J7253J9596K1982K4212K6413K8354
63231F35492K9375K9306K8895K8936K9320K9463K9184K8664K7865K6769K5972
63220I49241K6277K7540K8667K8972K8916K9095K9030K7579K4260J9598J4232
63209A233407Q276J667n279j2053j8444k4538l0179l4711l7454l8351l8039l7200
$$ plain form
63197 967102 931117 897093 866147 839379 817385 799953 786199 775252 766980 761964 760697 762967
63185 762967 768138 775797 785838 798029 811913 827185 843894 862066 881321 901050 920881 940807
63173 940807 960900 981069 1001102 1020828 1040114 1058641 1075707 1090325 1101601 1108981 1112063 1110256
63161 1110256 1102829 1089352 1070059 1045744 1017374 985772 951548 915353 878248 841708 806957
63150 806957 774323 743466 714284 687295 663040 641474 622177 604879 589548 576147 564612
63139 564612 554864 546581 539203 532515 527031 523314 521056 519313 517616 516285 515635 515474 515603 516237 517651
63124 517651 519855 522908 527114 532482 538389 544190 549830 555398 560469 564501 567636 570499 573356 576184
63110 576184 579384 583519 588117 591654 593272 593951 595339 597795 600265 601882 602918 604015 605072 605363 604552
$$ packed form
63197I67102l5985l4024l0946k6768k1994j7432j3754j0947q272n016j267K270
63185G62967N171P659J0041J2191J3884J5272J6709J8172J9255J9729J9831J9926
63173I40807K0093K0169K0033J9726J9286J8527J7066J4618J1276P380L082j807
63161A110256p427j3477j9293k4315k8370l1602l4224l6195l7105l6540l4751
63150H06957l2634l0857k9182k6989k4255k1566j9297j7298j5331j3401j1535
63139E64612r748q283p378o688n484l717k258j743j697j331o50j61J29O34J414
63124E17651K204L053M206N368N907N801N640N568N071M032L135K863K857K828
63110E76184L200M135M598L537J618O79J388K456K470J617J036J097J057K91q11
$$ plain form
63095 604552 603211 602275 602200 602744 603428 604044 604673 605418 606299 607291 608333 609345 610440 612036 614564 618043 622150
63078 622150 626614 631310 636057 640760 645807 651893 659313 667787 677114 687545 699213 711682 724598
63065 724598 738480 754290 772325 792153 813594 837175 863457 892458 924044 958470 996236
63054 996236 1037676 1083033 1132657 1186727 1244784 1305865 1369107 1434063 1500505 1568179 1636749
63043 1636749 1705771 1774674 1842985 1910623 1977851 2044894 2111750 2178399 2244880 2310972 2375887
63032 2375887 2438497 2497750 2552626 2601712 2643004 2674214 2693147 2697916 2687218 2660751 2619285
63021 2619285 2564143 2496701 2418560 2332081 2240406 2146804 2054044 1964343 1879591 1801346 1730644
63010 1730644 1667984 1613599 1567714 1530543 1502108 1482179 1470433 1466550 1469976 1479699 1494571 1513961
$$ packed form
63095F04552j341r36p5N44O84O16O29P45Q81R92J042J012J095J596K528L479M107
63078F22150M464M696M747M703N047O086P420Q474R327J0431J1668J2469J2916
63065G24598J3882J5810J8035J9828K1441K3581K6282K9001L1586L4426L7766
63054I96236M1440M5357M9624N4070N8057O1081O3242O4956O6442O7674O8570
63043A636749O9022O8903O8311O7638O7228O7043O6856O6649O6481O6092O4915
63032B375887O2610N9253N4876M9086M1292L1210J8933M769j0698k6467m1466
63021B619285n5142o7442p8141q6479r1675r3602r2760q9701q4752p8245p0702
63010A730644o2660n4385m5885l7171k8435j9929j1746l883L426R723J4872J9390
$$ plain form
62998 1513961 1537811 1565816 1596853 1629550 1663249 1697993 1733679 1769703 1805509 1840988 1876087
62987 1876087 1910397 1943275 1973972 2001337 2023795 2040005 2049309 2051115 2044109 2026697 1998289 1959751
62975 1959751 1912566 1857976 1797080 1731291 1662244 1591412 1520065 1449553 1381363 1316841 1256917
62964 1256917 1202025 1152102 1106633 1064969 1026765 992078 960874 932464 905615 879379 853750
62953 853750 829422 806953 786286 766956 748554 730916 714059 698024 682737 667980 653568
62942 653568 639505 625890 612754 600149 588315 577469 567472 558046 549345 541963 536295 532134 528995
62929 528995 526431 523917 520939 517580 514611 512599 511198 509748 508235 507128 506451 505673 504495 503078 501404
62914 501404 499071 496045 493110 491070 489743 488170 485749 482766 479783 476820 473417 469393 465267 461726
$$ packed form
62998A513961K3850K8005L1037L2697L3699L4744L5686L6024L5806L5479L5099
62987A876087L4310L2878L0697K7365K2458J6210R304J806p006j7412k8408l8538
62975A959751m7185n4590o0896o5789o9047p0832p1347p0512o8190o4522n9924
62964A256917n4892m9923m5469m1664l8204l4687l1204k8410k6849k6236k5629
62953H53750k4328k2469k0667j9330j8402j7638j6857j6035j5287j4757j4412
62942F53568j4063j3615j3136j2605j1834j0846r997r426q701p382n668m161l139
62929E28995k564k514k978l359k969k012j401j450j513j107o77p78j178j417j674
62914E01404k333l026k935k040j327j573k421k983k983k963l403m024m126l541
$$ plain form
62900 461726 458871 456297 453894 452117 451279 450988 450692 450494 450912 451980 453118 453885 454301 454342 453674 452218 450578
62883 450578 449543 449321 449522 449771 450059 450553 451237 451818 452011 451962 452223 453108 454117 454338 453435 451965 450711 450005
62865 450005 449759 449775 449858 449860 449837 449963 450211 450431 450814 451901 453800 455737 456774 456883 456982 457923 459693 461577 462917
62846 462917 463646 464166 464805 465469 465879 465986 465896 465492 464519 463131 461974 461545 461720 462043 462197 462069 461731 461563
62828 461563 462006 462943 463716 464103 464868 466855 469868 473054 476172 479721 483889 488145 492147 496384 501426
62813 501426 506910 511864 515909 519735 524330 530050 536569 543498 550787 558581 566968 575987 585694 596057
62799 596057 606949 618539 631567 646756 663882 681891 700203 719560 741299 766112 793909
62788 793909 824595 858473 896028 937851 984815 1037847 1097435 1163658 1236712 1316988 1404484
$$ packed form
62900D61726k855k574k403j777q38k91k96j98M18J068J138P67M16M1o68j456j640
62883D50578j035k22K01K49K88M94O84N81J93m9K61Q85J009K21r03j470j254p06
62865D50005k46J6Q3Kk3J26K48K20L83J087J899J937J037J09R9R41J770J884J340
62846D62917P29N20O39O64M10J07r0m04r73j388j157m29J75L23J54j28l38j68
62828D61563M43R37P73L87P65J987L013L186L118L549M168M256M002M237N042
62813E01426N484M954M045L826M595N720O519O929P289P794Q387R019R707J0363
62799E96057J0892J1590J3028J5189J7126J8009J8312J9357K1739K4813K7797
62788G93909L0686L3878L7555M1823M6964N3032N9588O6223P3054Q0276Q7496
$$ plain form
62777 1404484 1498527 1598305 1703401 1813460 1927387 2042948 2156960 2265775 2365837 2454132
62767 2454132 2528250 2586137 2625985 2646478 2647074 2628013 2590219 2535248 2465126 2382006 2288043 2185700
62755 2185700 2078037 1968298 1859015 1751582 1646856 1546102 1451031 1362782 1281147 1205133
62745 1205133 1134255 1068992 1010012 957339 910395 868398 830508 795910 764169 735420 709959
62734 709959 687780 668677 652480 638849 627065 616452 606965 599037 592935 588531 585540 583640 582483
62721 582483 581959 582357 583951 586582 590017 594501 600466 607904 616628 626994 639671 654732 671775 690998
62707 690998 713305 739115 767946 799633 835148 875609 921106 971224 1026113 1086144 1150854
62696 1150854 1219230 1291008 1366775 1446522 1528718 1611004 1691240 1767574 1837982 1900308 1952630
$$ packed form
62777A404484R4043R9778J05096J10059J13927J15561J14012J08815J00062Q8295
62767B454132P4118N7887L9848K0493N96j9061l7794n4971p0122q3120r3963j02343
62755B185700j07663j09739j09283j07433j04726j00754r5071q8249q1635p6014
62745A205133p0878o5263n8980n2673m6944m1997l7890l4598l1741k8749k5461
62734G09959k2179j9103j6197j3631j1784j0613r487p928o102m404k991j900j157
62721E82483n24L98J594K631L435M484N965P438Q724J0366J2677J5061J7043J9223
62707F90998K2307K5810K8831L1687L5515M0461M5497N0118N4889O0031O4710
62696A150854O8376P1778P5767P9747Q2196Q2286Q0236P6334P0408O2326N2322
$$ plain form
62685 1952630 1993279 2020510 2032536 2028135 2007359 1971602 1922940 1863429 1795040 1719978 1640556
62674 1640556 1558643 1475610 1392962 1312610 1236169 1164283 1096951 1034244 976295 922842 873347
62663 873347 827570 785677 747833 714005 684091 657845 634731 614222 596190 580657 567210
62652 567210 555139 544132 534335 525609 517207 508412 499175 489971 481398 474056 468334 463946 460004 455967
62638 455967 452300 449842 448674 448039 447339 446787 446919 447769 448739 449162 448841 448038 447118 446310 445739 445480 445433 445242
62620 445242 444640 444000 444338 446502 450348 454876 459281 463754 469122 475801 483336 491110 499234 508421 519038
62605 519038 530728 543077 556343 571271 588472 608242 630755 656101 684289 715563 750638
62594 750638 790240 834464 882834 934814 989752 1046392 1102992 1158031 1210363 1258505 1300318
$$ packed form
62685A952630M0649K7231J2026m401k0776l5757m8662n9511o8389p5062p9422
62674A640556q1913q3033q2648q0352p6441p1886o7332o2707n7949n3453m9495
62663H73347m5777m1893l7844l3828k9914k6246k3114k0509j8032j5533j3447
62652E67210j2071j1007r797q726q402q795r237r204q573p342n722m388l942m037
62638D55967l667k458j168o35p00n52J32Q50R70M23l21q03r20q08n71k59m7j91
62620D45242o02o40L38K164L846M528M405M473N368O679P535P774Q124R187J0617
62605E19038J1690J2349J3266J4928J7201J9770K2513K5346K8188L1274L5075
62594G50638L9602M4224M8370N1980N4938N6640N6600N5039N2332M8142M1813
$$ plain form
62583 1300318 1333775 1357780 1371962 1376027 1369731 1353395 1328028 1294892 1255127 1209836 1160395 1108550
62571 1108550 1056107 1004390 954000 905268 858836 815560 775849 739473 706096 675694 648341
62560 648341 623923 602264 583222 566449 551384 537778 525979 516336 508513 501696 495338 489430
62548 489430 484189 479808 476423 473996 472273 471033 470323 470216 470440 470543 470411 470448 471189 472813 474876 476495
62532 476495 477029 476838 477173 479067 482503 486914 492204 498874 507251 517156 528368 541064 555719 572850
62518 572850 592928 616251 642806 672385 704929 740621 779651 821945 866959 913623 960682
62507 960682 1007377 1053559 1098764 1141343 1178955 1209938 1233841 1250702 1260287 1262237 1256573 1243927
62495 1243927 1225494 1202835 1177557 1151163 1125325 1101994 1082696 1067789 1056956 1050457 1049350 1054471
$$ packed form
62583A300318L3457K4005J4182M065o296j6336k5367l3136l9765m5291m9441n1845
62571A108550n2443n1717n0390m8732m6432m3276l9711l6376l3377l0402k7353
62560F48341k4418k1659j9042j6773j5065j3606j1799r643p823o817o358n908
62548D89430n241m381l385k427j723j240p10j07K24J03j32L7P41J624K063J619
62532D76495N34j91L35J894L436M411N290O670Q377R905J1212J2696J4655J7131
62518E72850K0078K3323K6555K9579L2544L5692L9030M2294M5014M6664M7059
62507I60682M6695M6182M5205M2579L7612L0983K3903J6861R585J950n664j2646
62495A243927j8433k2659k5278k6394k5838k3331j9298j4907j0833o499j107N121
$$ plain form
62483 1054471 1065807 1083041 1106044 1134401 1167054 1202925 1241538 1282501 1324553 1365458 1402584
62472 1402584 1433388 1455866 1469200 1473833 1470390 1458579 1437500 1406815 1367171 1319732 1266000 1208113
62460 1208113 1148609 1089427 1031337 974553 919699 867977 820580 778142 740708 708068 680037
62449 680037 656370 636536 619805 605720 594287 585514 578915 573762 569741 567110 566152 566744 568508
62436 568508 571225 574944 579641 584774 589298 592330 593755 593889 592510 588653 581697 572324 562017 551815
62422 551815 541909 532191 522584 512949 503258 494012 486019 479570 474126 468912 463531 457942 452299 447004
62408 447004 442588 439216 436462 433732 430776 427709 424799 422444 421091 420890 421460 422203 422766 423133 423465 424107
62392 424107 425644 428555 432652 436969 440429 442676 444193 445598 447023 448401 450184 453237 457789 462950
$$ packed form
62483A054471J1336J7234K3003K8357L2653L5871L8613M0963M2052M0905L7126
62472A402584L0804K2478J3334M633l443j1811k1079l0685l9644m7439n3732n7887
62460A208113n9504n9182n8090n6784n4854n1722m7397m2438l7434l2640k8031
62449F80037k3667j9834j6731j4085j1433q773o599n153m021k631r58N92J764
62436E68508K717L719M697N133M524L032J425J34j379l857o956r373j0307j0202
62422E51815r906r718r607r635r691r246p993o449n444n214n381n589n643n295
62408D47004m416l372k754k730k956l067k910k355j353k01N70P43N63L67L32O42
62392D24107J537K911M097M317L460K247J517J405J425J378J783L053M552N161
$$ plain form
62378 462950 467786 472586 478473 485877 494053 502266 510724 519959 529820 539711 549601 560275 572564 586724
62364 586724 602625 620266 639973 662258 687582 716205 748216 783735 822954 865939 912498
62353 912498 962249 1014626 1068575 1122383 1173969 1221364 1262873 1297012 1322628 1339126 1346499 1345195
62341 1345195 1336135 1320702 1300368 1276047 1247863 1215607 1179442 1140241 1099426 1058550 1018933
62330 1018933 981459 946616 914705 886020 860814 839059 820304 803834 788958 775081 761569
62319 761569 747708 732892 716716 698943 679641 659512 639783 621459 604763 589434 575304
62308 575304 562266 549975 538219 527538 518862 512326 506907 501510 496089 491434 488179 486285 485295
62295 485295 484759 484547 484970 486470 489092 492435 496213 500626 505963 512130 518845 526084 534079 542953 552596
$$ packed form
62378D62950M836M800N887P404Q176Q213Q458R235R861R891R890J0674J2289J4160
62364E86724J5901J7641J9707K2285K5324K8623L2011L5519L9219M2985M6559
62353I12498M9751N2377N3949N3808N1586M7395M1509L4139K5616J6498P373j304
62341A345195r060j5433k0334k4321k8184l2256l6165l9201m0815m0876l9617
62330A018933l7474l4843l1911k8685k5206k1755j8755j6470j4876j3877j3512
62319G61569j3861j4816j6176j7773j9302k0129j9729j8324j6696j5329j4130
62308E75304j3038j2291j1756j0681q676o536n419n397n421m655l255j894r90
62295D85295n36k12M23J500K622L343L778M413N337O167O715P239P995Q874R643
$$ plain form
62280 552596 562763 573164 583554 593943 604538 615346 626017 636198 645773 654595 662344 669008
62268 669008 675234 681838 689148 697201 706353 717268 730387 745785 763542 783965 807558 835028
62256 835028 867116 904020 945114 989618 1037291 1087979 1140631 1193306 1244001 1290854 1331697
62245 1331697 1364389 1387907 1402505 1408581 1406083 1395319 1377495 1353739 1324087 1288115 1246198 1199496
62233 1199496 1149114 1096153 1042429 990166 940730 894291 850905 811258 775985 744938 717665
62222 717665 694161 674445 657657 642346 627818 614687 603850 595328 588317 582071 576360 571270
62210 571270 566877 563156 560003 557346 555289 553938 553018 551967 550789 550517 552197 555469 558792 561379 564296
62195 564296 569203 576358 584371 591733 598090 604147 610877 618964 628616 639603 651452 663620 675518
$$ packed form
62280E52596J0167J0401J0390J0389J0595J0808J0671J0181R575Q822P749O664
62268F69008O226O604P310Q053R152J0915J3119J5398J7757K0423K3593K7470
62256H35028L2088L6904M1094M4504M7673N0688N2652N2675N0695M6853M0843
62245A331697L2692K3518J4598O076k498j0764j7824k3756k9652l5972m1917m6702
62233A199496n0382n2961n3724n2263m9436m6439m3386l9647l5273l1047k7273
62222G17665k3504j9716j6788j5311j4528j3131j0837q522p011o246n711n090
62210E71270m393l721l153k657k057j351r20j051j178k72J680L272L323K587K917
62195E64296M907P155Q013P362O357O057O730Q087R652J0987J1849J2168J1898
$$ plain form
62182 675518 686726 697472 708610 720602 732615 743157 751706 759205 766749 774291 781082 787096 793531
62169 793531 801934 813222 827696 845693 867929 895120 927365 963915 1003463 1044502 1085435 1124611
62157 1124611 1160494 1191817 1217555 1236909 1249450 1255183 1254398 1247615 1235755 1220008 1201167 1179211
62145 1179211 1153832 1125219 1094051 1060989 1026728 992480 959879 930249 904226 881977 863305
62134 863305 847593 834302 823655 816229 811645 808246 804484 800168 796010 792432 789409 787124 786142 786924
62120 786924 789531 793660 798653 803693 808431 813246 818410 823104 825754 825408 822338 817385 811270 804722
62106 804722 798624 793411 788536 782981 776342 769045 761447 753187 743871 734253 726211 721251 719279 719146
62092 719146 720112 722343 726100 731105 736865 743104 749564 755856 761941 768436 775964 784353 792910 801394
$$ packed form
62182F75518J1208J0746J1138J1992J2013J0542Q549P499P544P542O791O014O435
62169G93531Q403J1288J4474J7997K2236K7191L2245L6550L9548M1039M0933L9176
62157A124611L5883L1323K5738J9354J2541N733p85o783j1860j5747j8841k1956
62145A179211k5379k8613l1168l3062l4261l4248l2601k9630k6023k2249j8672
62134H63305j5712j3291j0647p426m584l399l762m316m158l578l023k285r82P82
62120G86924K607M129M993N040M738M815N164M694K650l46l070m953o115o548
62106H04722o098n213m875n555o639p297p598q260r316r618q042m960j972j33
62092G19146R66K231L757N005N760O239O460O292O085O495P528Q389Q557Q484
$$ plain form
62078 801394 810333 820457 832230 845898 861510 878740 896895 915295 933591 951799 970161 988901
62066 988901 1007931 1026952 1045992 1065655 1086565 1108702 1131593 1154878 1178147 1200314 1219695
62055 1219695 1234895 1245290 1250689 1251042 1246611 1237946 1225439 1209157 1189167 1165619 1138390 1107186
62043 1107186 1072319 1034966 996298 956733 916476 876435 837940 801693 767551 735368 705575
62032 705575 678766 655108 634324 616005 599794 585491 573073 562422 553016 544145 535635 528077
62020 528077 522127 517672 513872 509902 505471 500677 495626 490283 484643 479026 474083 470342 467687 465464
62006 465464 463310 461690 461344 462328 463956 465751 468089 471680 476628 482250 487665 492327 496057 498902 501084
61991 501084 502954 504832 506759 508297 508565 506695 502454 496367 489155 481233 472904 464730 457216 450202
$$ packed form
62078H01394Q939J0124J1773J3668J5612J7230J8155J8400J8296J8208J8362J8740
62066I88901J9030J9021J9040J9663K0910K2137K2891K3285K3269K2167J9381
62055A219695J5200J0395N399L53m431q665j2507j6282j9990k3548k7229l1204
62043A107186l4867l7353l8668l9565m0257m0041l8495l6247l4142l2183k9793
62032G05575k6809k3658k0784j8319j6211j4303j2418j0651r406q871q510p558
62020E28077n950m455l800l970m431m794n051n343n640n617m943l741k655k223
62006D65464k154j620l46R84J628J795K338L591M948N622N415M662L730K845K182
61991E01084J870J878J927J538K68j870m241o087p212p922q329q174p514p014
$$ plain form
61977 450202 443042 435509 428159 421672 416143 411243 406744 402650 399042 396075 393901 392344 390840 389068
61963 389068 387485 386881 387420 388423 389081 389052 388397 387331 386241 385679 386020 387131 388532 389906 391443 393700
61947 393700 397108 401640 406975 412979 419864 427786 436483 445624 455418 466536 479302 493215 507405
61934 507405 521409 535259 548937 561994 573853 584293 593505 601678 608761 614708 619732 624012 627148
61921 627148 628249 626723 622838 617371 610871 603499 595438 587275 579933 574414 571432 571128 573100 576927
61907 576927 582624 590421 600123 610880 621693 631996 641645 650467 657956 663480 666677 667517 666008 662025
61893 662025 655643 647476 638411 629117 620093 612055 605614 600398 595079 588736 581807 575277 569286 563139
61879 563139 556414 549329 542032 534243 525815 517212 509163 502043 495685 489534 483126 476765 471633 468761
$$ packed form
61977D50202p160p533p350o487n529m900m499m094l608k967k174j557j504j772
61963C89068j583o04N39J003O58k9o55j066j090n62L41J111J401J374J537K257
61947C93700L408M532N335O004O885P922Q697R141R794J1118J2766J3913J4190
61934E07405J4004J3850J3678J3057J1859J0440R212Q173P083N947N024M280L136
61921F27148J101j526l885n467o500p372q061q163p342n519k982l04J972L827
61907E76927N697P797R702J0757J0813J0303R649Q822P489N524L197Q40j509l983
61893F62025o382q167r065r294r024q038o441n216n319o343o929o530n991o147
61879E63139o725p085p297p789q428q603q049p120o358o151o408o361n132k872
$$ plain form
61865 468761 467875 467781 467924 468919 471460 475423 480405 486471 493817 502195 511300 521414 533068 546285 560795
61850 560795 576782 594711 614440 635148 656280 677935 700012 721489 740986 757814 772082
61839 772082 783936 793027 798725 800579 798573 793226 785536 776648 767424 758371 750004 743065 738233 735777
61825 735777 735767 738540 744495 753273 763516 773771 783436 792399 799966 804690 805359 801754 794306 783447
61811 783447 769590 753403 735719 717209 698419 680035 662867 647416 633519 620447 607513
61800 607513 594658 582379 571006 560267 549830 540056 531689 524889 519084 513839 509275 505387 501605
61787 501605 497443 493201 489496 486458 483794 481367 479180 477059 474837 472693 470856 469212 467734 467011
61773 467011 467651 469162 470140 469720 468306 466806 465747 465356 465834 467088 468541 469713 470834 472622 475532
$$ packed form
61865D68761q86r4J43R95K541L963M982O066P346Q378R105J0114J1654J3217J4510
61850E60795J5987J7929J9729K0708K1132K1655K2077K1477J9497J6828J4268
61839G72082J1854R091N698J854k006n347p690q888r224r053q367o939m832k456
61825G35777j0K773N955Q778J0243J0255R665Q963P567M724O69l605p448j0859
61811G83447j3857j6187j7684j8510j8790j8384j7168j5451j3897j3072j2934
61800F07513j2855j2279j1373j0739j0437r774q367o800n805n245m564l888l782
61787E01605m162m242l705l038k664k427k187k121k222k144j837j644j478p23
61773D67011O40J511R78m20j414j500j059l91M78J254J453J172J121J788K910
$$ plain form
61758 475532 479365 483413 486893 489532 491865 494757 498437 502224 505267 507241 508199 508130 506986 504865 501916
61743 501916 498288 494333 490548 487020 483286 479097 474978 471565 468701 465813 463009 461160 460844 461759 463226
61728 463226 464727 465802 466047 465574 465132 465397 466371 467683 469149 470735 472320 473869 475689 478123 481097
61713 481097 484211 487164 489813 491945 493345 494010 493972 493000 490868 487872 484656 481466 478019 474206 470438
61698 470438 466997 463455 459180 454237 449402 445373 442277 439856 437741 435509 432792 429537 425995 422394
61684 422394 418742 415021 411449 408407 406093 404279 402515 400611 398865 397618 396624 395190 393070 390878
61670 390878 389314 388265 387102 385677 384486 383901 383772 383922 384505 385587 386783 387642 388154 388594 389129 389896
61654 389896 391246 393521 396611 400018 403289 406212 408692 410690 412225 413296 413905 414321 415077 416418 418000
$$ packed form
61758D75532L833M048L480K639K333K892L680L787L043J974R58o9j144k121k949
61743E01916l628l955l785l528l734m189m119l413k864k888k804j849l16R15J467
61728D63226J501J075K45m73m42K65R74J312J466J586J585J549J820K434K974
61713D81097L114K953K649K132J400O65l8r72k132k996l216l190l447l813l768
61698D70438l441l542m275m943m835m029l096k421k115k232k717l255l542l601
61684D22394l652l721l572l042k314j814j764j904j746j247r94j434k120k192
61670C90878j564j049j163j425j191n85j29J50N83J082J196Q59N12M40N35P67
61654C89896J350K275L090L407L271K923K480J998J535J071O09M16P56J341J582
$$ plain form
61639 418000 419439 421024 423324 426188 428628 429818 429793 429147 428494 428366 429015 429896 429771 427833 424596 421279
61623 421279 418490 415910 413140 410287 407629 405120 402485 399633 396765 394163 391940 389972 388067 386209
61609 386209 384524 382856 380612 377329 373290 369220 365388 361482 357390 353555 350285 347179 343739 340205
61595 340205 337261 335052 333023 330700 328173 325749 323550 321540 319612 317506 315076 312739 311265 310851
61581 310851 310739 310054 308702 307131 305507 303614 301485 299666 298703 298639 299082 299639 300222 301024 302236 303762
61565 303762 305226 306298 306833 306774 306203 305608 305715 306749 308111 309083 309649 310319 311422 312930 314688 316323
61549 316323 317165 316927 316403 316811 318372 320156 321428 322449 323664 324839 325574 326254 327775 330416 333421 335746
61533 335746 336939 337294 337308 337044 336096 334294 332334 331352 331843 333332 335106 336721 337663 337200 335135 332326
$$ packed form
61639D18000J439J585K300K864K440J190k5o46o53j28O49Q81j25j938l237l317
61623D21279k789k580k770k853k658k509k635k852k868k602k223j968j905j858
61609C86209j685j668k244l283m039m070l832l906m092l835l270l106l440l534
61595C40205k944k209k029k323k527k424k199k010j928k106k430k337j474m14
61581C10851j12o85j352j571j624j893k129j819r63o4M43N57N83Q02J212J526
61565C03762J464J072N35n9n71n95J07J034J362R72N66O70J103J508J758J635
61549C16323Q42k38n24M08J561J784J272J021J215J175P35O80J521K641L005K325
61533C35746J193L55J4k64r48j802j960r82M91J489J774J615R42m63k065k809
$$ plain form
61517 332326 329886 328096 326534 325068 324124 323979 324282 324433 324230 324019 324311 325220 326273 326903 327090 327143 326927
61500 326927 325933 324375 323454 323865 324627 324257 322745 321434 321080 321137 321129 321687 323587 326407 328887 330352 331220
61483 331220 332277 333884 335898 337986 339862 341375 342554 343696 345325 347808 350774 353182 354252 354225 353891
61468 353891 353601 353230 352910 353084 353720 354144 353924 353383 352907 352229 350873 348963 347140 345914 345452 345776 346736
61451 346736 347894 348840 349574 350277 350832 350949 350710 350568 350707 350775 350421 349917 349978 351023 352756 354542 356070 357521
61433 357521 359137 360844 362446 363981 365594 367102 368078 368418 368574 369035 369815 370567 371049 371306 371583 372186 373266
61416 373266 374657 376093 377667 379763 382365 384764 386275 386999 387481 387837 387729 387152 386704 386817 387104 386790
61400 386790 385620 384070 382744 381904 381613 381971 382915 383939 384394 384152 383733 383594 383553 383174 382449 381722 381104 380445
$$ packed form
61517C32326k440j790j562j466r44j45L03J51k03k11K92R09J053O30J87N3k16
61500C26927r94j558r21M11P62l70j512j311l54N7qN58J900K820K480J465Q68
61483C31220J057J607K014K088J876J513J179J142J629K483K966K408J070k7l34
61468C53891k90l71l20J74O36M24k20n41m76o78j356j910j823j226m62L24R60
61451C46736J158R46P34P03N55J17k39j42J39O8l54n04O1J045J733J786J528J451
61433C57521J616J707J602J535J613J508R76L40J56M61P80P52M82K57K77O03J080
61416C73266J391J436J574K096K602K399J511P24M82L56j08n77m48J13K87l14
61400C86790j170j550j326q40k91L58R44J024M55k42m19j39m1l79p25p27o18o59
$$ plain form
61382 380445 379947 380224 381494 383098 384212 384822 385694 387507 390222 393182 395656 397490 399412 402426 406615
61367 406615 410711 413211 413807 413451 413274 413874 415443 417900 420717 423180 425162 427319 430303 434056 438173
61352 438173 442576 447435 452608 457629 462214 466434 470319 473643 476178 477885 478788 478953 478705 478572 478743
61337 478743 478877 478690 478498 478798 479494 479985 479948 479570 478990 478073 476917 476023 475597 475122 474077 472701 471546 470600
61319 470600 469509 468523 468497 469866 472194 474941 478166 482319 487798 494942 503971 514528 525632 536469
61305 536469 547096 558131 569972 582556 595550 608373 620133 629960 637441 642554 645256 645393 643050
61292 643050 638775 633374 627454 621109 614075 606322 598419 591031 584092 576884 569062 561178 553978 547558
61278 547558 541646 536381 532315 529779 528681 528825 530012 531788 533497 534774 535757 536761 537906 539128 540435
$$ packed form
61382C80445m98K77J270J604J114O10Q72J813K715K960K474J834J922L014M189
61367D06615M096K500N96l56j77O00J569K457K817K463J982K157K984L753M117
61352D38173M403M859N173N021M585M220L885L324K535J707R03J65k48j33J71
61337D78743J34j87j92L00O96M91l7l78n80r17j156q94m26m75j045j376j155r46
61319D70600j091r86k6J369K328K747L225M153N479P144R029J0557J1104J0837
61305E36469J0627J1035J1841J2584J2994J2823J1760R827P481N113K702J37k343
61292F43050m275n401n920o345p034p753p903p388o939p208p822p884p200o420
61278E47558n912n265m066k536j098J44J187J776J709J277R83J004J145J222J307
$$ plain form
61263 540435 542135 544784 548803 554058 559979 566140 572440 578627 584064 588305 591587 594284 596165 596692
61249 596692 595957 594746 593688 592846 592188 591884 591927 591863 591219 589973 588447 586927 585510 584104 582525 580788
61233 580788 579217 577970 576587 574537 572312 571362 572632 575695 579674 584509 590698 598089 605657 612521
61219 612521 618657 624516 630403 636405 642589 648936 655241 661328 667332 673578 680085 686279 691322 694849
61205 694849 697321 699555 701943 704388 706972 710287 714856 720578 727221 735219 745351 757595 770873
61192 770873 784222 797693 811635 825420 837407 846156 851379 853815 854608 854770 854765 854329 852861 850072
61178 850072 846111 841216 835628 829827 824293 818827 812610 805268 797379 789477 781118 771636 761493 751919
61164 751919 743223 734362 724444 713818 703259 692795 682018 671104 660763 651374 642822 635185 628984
$$ packed form
61263E40435J700K649M019N255N921O161O300O187N437M241L282K697J881N27
61249E96692p35j211j058q42o58l04M3o4o44j246j526j520j417j406j579j737
61233E80788j571j247j383k050k225r50J270L063L979M835O189P391P568O864
61219F12521O136N859N887O002O184O347O305O087O004O246O507O194N043L527
61205F94849K472K234K388K445K584L315M569N722O643P998J0132J2244J3278
61192G70873J3349J3471J3942J3785J1987Q749N223K436P93J62nm36j468k789
61178H50072l961m895n588n801n534n466o217p342p889p902q359r482j0143r574
61164G51919q696q861r918j0626j0559j0464j0777j0914j0341r389q552p637o201
$$ plain form
61151 628984 624608 621873 620289 619463 619192 619388 620023 620875 621269 620342 617714 613784 609242 604408 599162 593446
61135 593446 587760 583053 580019 578505 577754 577421 578154 580896 585722 591759 598303 605626 614461 624997 636791
61120 636791 649585 663740 679708 697413 716505 737011 759218 782838 806813 830330 853737
61109 853737 877956 903104 928177 952088 974548 995787 1015843 1034412 1051071 1065364 1076834
61098 1076834 1085172 1090241 1091904 1090092 1085112 1077556 1067763 1055695 1041541 1026052 1010028 993785 977403
61085 977403 961095 944988 928874 912729 897290 883662 872393 863267 855809 849627 844383 839945
61073 839945 836566 834611 834200 835377 838456 843745 850982 859475 868826 879212 890967 904243 919082
61060 919082 935452 953142 971862 991491 1012040 1033455 1055617 1078464 1101930 1125987 1150943
$$ packed form
61151F28984m376k735j584q26k71J96O35Q52L94r27k628l930m542m834n246n716
61135E93446n686m707l034j514p51l33P33K742M826O037O544P323Q835J0536J1794
61120F36791J2794J4155J5968J7705J9092K0506K2207K3620K3975K3517K3407
61109H53737K4219K5148K5073K3911K2460K1239K0056J8569J6659J4293J1470
61098A076834Q338N069J663j812m980p556r793j2068j4154j5489j6024j6243j6382
61085I77403j6308j6107j6114j6145j5439j3628j1269r126p458o182n244m438
61073H39945l379j955m11J177L079N289P237Q493R351J0386J1755J3276J4839
61060I19082J6370J7690J8720J9629K0549K1415K2162K2847K3466K4057K4956
$$ plain form
61049 1150943 1177368 1205402 1234341 1263365 1292441 1322048 1352201 1382260 1411613 1440113 1467951
61038 1467951 1495545 1523464 1551954 1580560 1608570 1635772 1662503 1689283 1716835 1746065 1777336
61027 1777336 1809966 1843017 1876325 1910160 1944377 1978907 2014846 2054001 2097523 2146100 2201417
61016 2201417 2266118 2341992 2429223 2527746 2638602 2764336 2909755 3083007 3295000 3557565
61006 3557565 3882918 4284132 4773831 5362732 6062796 6892629 7876028 9033423 10378502
60997 10378502 11922147 13661529 15537763 17392854 18987871 20101640 20645140 20699888
60989 20699888 20457864 20127965 19879550 19823695 19987610 20275554 20469681 20312311 19630656
60980 19630656 18413985 16794348 14965167 13105916 11347168 9766145 8394008 7228683
$$ packed form
61049A150943K6425K8034K8939K9024K9076K9607L0153L0059K9353K8500K7838
61038A467951K7594K7919K8490K8606K8010K7202K6731K6780K7552K9230L1271
61027A777336L2630L3051L3308L3835L4217L4530L5939L9155M3522M8577N5317
61016B201417O4701P5874Q7231R8523J10856J25734J45419J73252K11993K62565
61006C557565L25353M01214M89699N88901P00064Q29833R83399J157395J345079
60997A0378502J543645J739382J876234J855091J595017J113769N43500N4748
60989B0699888k42024l29899k48415n5855J63915K87944J94127j57370o81655
60980A9630656j216671j619637j829181j859251j758748j581023j372137j165325
$$ plain form
60972 7228683 6250927 5436827 4762499 4204878 3743306 3360940 3043840 2779284 2555773
60963 2555773 2363908 2196484 2048233 1915981 1798292 1694074 1601677 1519485 1446683 1382924
60953 1382924 1327621 1279829 1238253 1201111 1166598 1133835 1102825 1073310 1044450 1015997 988961
60942 988961 964468 942546 922559 904199 887301 871124 854648 837457 819828 802110 784435
60931 784435 766885 749580 732745 716834 702222 688574 675113 661839 649908 640238 632279 624804
60919 624804 617435 610626 604476 598484 592486 587089 582989 580320 578720 577656 576702 575892 575763 576695 578287
60904 578287 579752 580852 582007 583587 585546 587700 589866 591701 592865 593386 593471 592914 591098 587693 583006
60889 583006 577510 571391 564662 557429 549837 541965 533903 525728 517373 508672 499645 490629 482094 474450
$$ packed form
60972G228683r77756q14100o74328n57621m61572l82366l17100k64556k23511
60963B555773j91865j67424j48251j32252j17689j04218r2397q2192p2802o3759
60953A382924n5303m7792m1576l7142l4513l2763l1010k9515k8860k8453k7036
60942I88961k4493k1922j9987j8360j6898j6177j6476j7191j7629j7718j7675
60931G84435j7550j7305j6835j5911j4612j3648j3461j3274j1931r670p959p475
60919F24804p369o809o150n992n998n397m100k669j600j064r54q10j29R32J592
60904E78287J465J100J155J580J959K154K166J835J164N21Q5n57j816l405m687
60889E83006n496o119o729p233p592p872q062q175q355q701r027r016q535p644
$$ plain form
60875 474450 467878 462219 457182 452834 449646 447791 446701 445693 444769 444258 443972 443495 443199 444044 446165 448512
60859 448512 450298 452066 454753 458303 461880 465023 467859 470409 472450 474073 475824 478172 481182 484623
60845 484623 488007 490647 492121 492701 492990 493213 493239 493072 492694 491517 488739 484427 479571 474817 469796 464116
60829 464116 458336 453357 449314 445753 442554 439881 437466 434733 431698 428941 426549 423812 420309 416612
60815 416612 413412 410488 407186 403599 400535 398312 396197 393215 389219 384958 381290 378446 376003 373512
60801 373512 371138 369493 368750 368189 366953 365058 363243 361955 361001 360195 359749 359759 359833 359650 359527 359958 360807
60784 360807 361483 361801 362215 363184 364722 366622 368673 370558 371980 373110 374534 376458 378273 379236 379358 379245
60768 379245 379304 379597 380334 381877 384078 386095 387113 387017 386187 385023 383875 383054 382579 382160 381701 381475 381480 381037
$$ packed form
60875D74450o572n659n037m348l188j855j090j008r24n11k86m77k96Q45K121K347
60859D48512J786J768K687L550L577L143K836K550K041J623J751K348L010L441
60845D84623L384K640J474N80K89K23K6j67l78j177k778m312m856m754n021n680
60829D64116n780m979m043l561l199k673k415k733l035k757k392k737l503l697
60815D16612l200k924l302l587l064k223k115k982l996m261l668k844k443k491
60801C73512k374j645p43n61j236j895j815j288r54q06m46J0P4j83j23M31Q49
60784C60807O76L18M14R69J538J900K051J885J422J130J424J924J815R63J22j13
60768C79245N9K93P37J543K201K017J018r6q30j164j148q21m75m19m59k26Nm43
$$ plain form
60750 381037 379606 377711 376364 375691 374905 373683 372748 372842 373784 374901 375720 375736 374158 370635 365978 361506
60734 361506 357894 355091 353001 351516 350062 347962 345363 343149 341790 340818 339592 338069 336620 335594
60720 335594 335352 336222 338034 340030 341604 342941 344635 346885 349358 351647 353569 355129 356479 357912 359683
60705 359683 361778 363883 365547 366500 367005 367817 369453 371517 373098 373874 374378 375055 375625 375697 375548 375728 376194
60688 376194 376390 376038 375377 374667 373943 373305 373022 373260 373977 375147 376736 378442 379756 380492 381042 381997 383603
60671 383603 385605 387430 388494 388562 387861 386787 385528 384058 382382 380487 378194 375458 372806 371024 370245
60656 370245 369736 368818 367701 367140 367551 368787 370553 372625 374730 376621 378328 380127 382205 384508 386849
60641 386849 388850 389832 389102 386568 382922 379078 375619 372823 370909 369887 369326 368652 367787 367254 367529 368417
$$ packed form
60750C81037j431j895j347o73p86j222r35R4R42J117Q19J6j578l523m657m472
60734C61506l612k803k090j485j454k100k599k214j359r72j226j523j449j026
60720C35594k42Q70J812J996J574J337J694K250K473K289J922J560J350J433J771
60705C59683K095K105J664R53N05Q12J636K064J581P76N04O77N70P2j49J80M66
60688C76194J96l52o61p10p24o38k83K38P17J170J589J706J314P36N50R55J606
60671C83603K002J825J064O8p01j074j259j470j676j895k293k736k652j782p79
60656C70245n09r18j117n61M11J236J766K072K105J891J707J799K078K303K341
60641C86849K001R82p30k534l646l844l459k796j914j022n61o74q65n33K75Q88
$$ plain form
60625 368417 369209 369409 369208 369229 369858 370882 371790 372389 372960 373769 374632 375127 375175 375147 375436 376088 376888 377579 377988
60606 377988 378164 378429 379114 380127 381025 381578 382039 382741 383659 384515 385072 385169 384775 384295 384534 385956 388112 390176
60588 390176 391927 393788 395952 397957 399208 399569 399363 399095 399256 400102 401439 402828 404034 405154 406417
60573 406417 408214 411256 416210 423047 431116 440021 450060 461648 474634 488362 502017 514719 525724
60560 525724 534859 542421 548259 551266 550249 545193 537330 528173 518899 510440 503585 498764 495995 495158
60546 495158 496148 498763 502689 507681 513677 520818 529463 540094 552995 568042 584886 603152 622338
60533 622338 641704 660526 678333 694630 708508 718806 724631 725641 722032 714617 704808 694088
60521 694088 683324 672663 662019 651464 641285 631892 623662 616708 610962 606622 604250 604126 605719
$$ packed form
60625C68417P92K00k01K1O29J024R08N99N71Q09Q63M95M8k8K89O52Q00O91M09
60606C77988J76K65O85J013Q98N53M61P02R18Q56N57R7l94m80K39J422K156K064
60588C90176J751J861K164K005J251L61k06k68J61Q46J337J389J206J120J263
60573D06417J797L042M954O837Q069Q905J0039J1588J2986J3728J3655J2702J1005
60560E25724R135P562N838L007j017n056p863r157r274q459o855m821k769q37
60546D95158R90K615L926M992N996P141Q645J0631J2901J5047J6844J8266J9186
60533F22338J9366J8822J7807J6297J3878J0298N825J010l609p415r809j0720
60521F94088j0764j0661j0644j0555j0179r393q230o954n746m340k372j24J593
$$ plain form
60508 605719 608228 611471 615883 621882 629767 640126 653707 670828 691435 715814 744652 778185
60496 778185 815768 856537 900057 946051 993840 1042268 1089849 1134788 1175339 1210434 1239648
60485 1239648 1262264 1276810 1281874 1277063 1262739 1239199 1206642 1165797 1118030 1064931 1008196 949875
60473 949875 892274 837480 787095 742178 702984 668828 638679 612007 588837 569024 551966
60462 551966 537093 524203 513172 503659 495322 487986 481363 474952 468550 462636 457839 454075 450619
60449 450619 447048 443731 441216 439393 437546 435104 432127 429075 426318 423934 421782 419681 417623 415885
60435 415885 414818 414427 414265 413856 413120 412252 411395 410668 410321 410460 410645 410191 408972 407545 406372 405351 404337
60418 404337 403725 404080 405434 407344 409469 411710 413924 415973 417962 420083 422270 424390 426720 429700 433142
$$ packed form
60508F05719K509L243M412N999P885J0359J3581J7121K0607K4379K8838L3533
60496G78185L7583M0769M3520M5994M7789M8428M7581M4939M0551L5095K9214
60485A239648K2616J4546N064m811j4324k3540l2557m0845m7767n3099n6735n8321
60473I49875n7601n4794n0385m4917l9194l4156l0149k6672k3170j9813j7058
60462E51966j4873j2890j1031r513q337p336o623o411o402n914m797l764l456
60449D50619l571l317k515j823j847k442k977l052k757k384k152k101k058j738
60435D15885j067l91j62m09p36q68q57p27l47J39J85m54j219j427j173j021j014
60418D04337o12L55J354J910K125K241K214K049J989K121K187K120K330K980L442
$$ plain form
60403 433142 436139 437949 438675 438946 439298 440011 441171 442625 444163 445928 448349 451453 454645 457465 460209
60388 460209 463371 466729 469465 471124 472081 473104 474802 477398 480687 484208 487700 491288 495005 498415
60374 498415 501170 503742 507003 511109 515386 519323 523010 526475 529309 531272 532647 533597 533887 533808 534735
60359 534735 537793 542306 546492 549679 552997 557830 564380 572004 580197 588753 597505 606367 615291 623766
60345 623766 630702 635262 637581 638220 637138 633762 628056 621022 614005 607780 602394 597574 593065 588705
60331 588705 584360 579846 574968 569704 564299 559063 554095 549229 544239 539062 533929 529331 525741 523289
60317 523289 521893 521779 523550 527424 532659 538210 543950 550837 559889 571361 584945 600155 616252
60304 616252 632307 647853 663178 678418 692463 703358 709877 712300 711436 707282 698924 685586 667549
$$ packed form
60403D33142K997J810P26K71L52P13J160J454J538J765K421L104L192K820K744
60388D60209L162L358K736J659R57J023J698K596L289L521L492L588L717L410
60374D98415K755K572L261M106M277L937L687L465K834J963J375R50K90p9R27
60359E34735L058M513M186L187L318M833O550P624Q193Q556Q752Q862Q924Q475
60345F23766O936M560K319O39j082l376n706p034p017o225n386m820m509m360
60331E88705m345m514m878n264n405n236m968m866m990n177n133m598l590k452
60317E23289j396j14J771L874N235N551N740O887R052J1472J3584J5210J6097
60304F16252J6055J5546J5325J5240J4045J0895O519K423q64m154q358j3338j8037
$$ plain form
60291 667549 646297 624061 603079 584876 569955 558133 549047 542285 537322 533651 530964 528974 527148
60278 527148 524942 522356 519856 517671 515493 513078 510732 508853 507233 505275 502838 500425 498489 496861
60264 496861 494946 492251 488633 484299 479707 475405 471873 469472 468373 468331 468677 468828 468840 469179 470005 471003
60248 471003 471930 472945 474264 475806 477339 478771 480120 481425 482781 484209 485390 485822 485410 484690 484279
60233 484279 484324 484615 485012 485573 486510 488123 490474 493044 495083 496506 498008 500016 502085 503769 505620 508612
60217 508612 512920 517899 523094 528532 534152 539742 545594 552415 560286 568330 575782 582906 590381 598161
60203 598161 605486 611890 617758 623891 630807 638501 646616 654685 662233 668792 673990 677751 680302 681866
60189 681866 682472 682202 681395 680280 678532 675576 671273 665990 660019 653473 646725 640408 634663 628899 622641
$$ packed form
60291F67549k1252k2236k0982j8203j4921j1822r086o762m963l671k687j990j826
60278E27148k206k586k500k185k178k415k346j879j620j958k437k413j936j628
60264D96861j915k695l618m334m592m302l532k401j099m2L46J51J2L39Q26R98
60248D71003R27J015J319J542J533J432J349J305J356J428J181M32m12p20m11
60233D84279M5K91L97N61R37J613K351K570K039J423J502K008K069J684J851K992
60217E08612M308M979N195N438N620N590N852O821P871Q044P452P124P475P780
60203E98161P325O404N868O133O916P694Q115Q069P548O559N198L761K551J564
60189F81866O06k70q07j115j748k956m303n283n971o546o748o317n745n764o258
$$ plain form
60174 622641 616299 610734 606283 602622 599388 596530 594033 591687 589245 586639 583962 581339 578879 576758
60160 576758 575255 574569 574480 574323 573596 572596 572245 573162 575067 577106 578558 579204 579315 579430 579997 581069 582407
60143 582407 583863 585497 587417 589775 592894 597001 601822 606875 612306 619007 627596 637586 647793 657314
60129 657314 665919 673883 681679 689505 696769 702325 705570 706997 707406 706990 705718 704189 703324 703303 703515 703629
60113 703629 704045 705123 706562 707885 709059 710269 711414 712228 712681 712822 712354 710841 708388 705700 703224
60098 703224 700541 696933 692433 687890 683988 680621 677474 674786 673041 672146 671569 671284 671922 673698 675745
60083 675745 676923 676974 676553 676450 677135 678670 680604 682156 682943 683267 683317 682439 679783 675412 670035 663794 656139
60066 656139 646976 637115 627280 617309 606793 596001 585733 576556 568552 561548 555268 549527 544566
$$ packed form
60174F22641o342n565m451l661l234k858k497k346k442k606k677k623k460k121
60160E76758j503o86q9j57p27j000l51R17J905K039J452O46J11J15N67J072J338
60143E82407J456J634J920K358L119M107M821N053N431O701Q589R990J0207R521
60129F57314Q605P964P796P826P264N556L245J427M09m16j272j529q65k1K12J14
60113G03629M16J078J439J323J174J210J145Q14M53J41m68j513k453k688k476
60098G03224k683l608m500m543l902l367l147k688j745q95n77k85O38J776K047
60083F75745J178N1m21j03O85J535J934J552P87L24N0q78k656m371n377o241p655
60066F56139r163r861r835r971j0516j0792j0268r177q004p004o280n741m961
$$ plain form
60053 544566 540977 538967 537933 537081 536298 536127 537016 538909 541473 544434 547736 551553 556063 561052 565976
60038 565976 570571 575150 579982 584686 588698 592136 595569 598925 601228 601717 600711 599050 596991 594097
60024 594097 590033 584980 579228 572675 564932 555871 545995 536255 527388 519427 511939 504753 498181 492417
60010 492417 487057 481639 476426 472141 468953 466320 463996 462530 462315 462631 462358 461429 460879 461387 462453 463214
59994 463214 463522 463854 464651 466177 468710 472290 476338 480003 482993 485819 489174 493230 497575 501576 504776
59979 504776 507041 508451 509169 509498 509954 510899 511993 512386 511629 510150 508609 507266 506329 506360 507684 509748
59963 509748 511831 514238 517915 522928 528353 533845 540265 548146 556399 563351 568457 572125 574309 574319 571985
59948 571985 568071 563426 558429 553407 548843 544847 541013 537138 533557 530380 526931 522525 517569 513304
$$ packed form
60053E44566l589k010j034q52p83j71Q89J893K564K961L302L817M510M989M924
60038E65976M595M579M832M704M012L438L433L356K303M89j006j661k059k894
60024E94097m064n053n752o553p743r061r876r740q867p961p488p186o572n764
60010D92417n360n418n213m285l188k633k324j466k15L16k73r29n50N08J066P61
59994D63214L08L32P97J526K533L580M048L665K990K826L355M056M345M001L200
59979E04776K265J410P18L29M56R45J094L93p57j479j541j343r37L1J324K064
59963E09748K083K407L677N013N425N492O420P881Q253O952N106L668K184J0k334
59948E71985l914m645m997n022m564l996l834l875l581l177l449m406m956m265
$$ plain form
59934 513304 510509 508906 507823 507030 506862 507794 510028 513316 517138 521203 525745 531110 537142 543201 548752
59919 548752 553530 557122 558930 558918 558016 557377 557397 557923 559192 561912 566313 571718 577403 583506 590656 598900
59903 598900 607372 614910 620700 624496 626593 627601 627910 627340 625598 623021 620480 618473 616745 614993 613570
59888 613570 613185 614161 616349 619565 623701 628497 633614 638973 644698 650724 656796 662989 669871 677878 686671
59873 686671 695297 702893 709095 713938 717613 720281 721963 722636 722540 722236 722107 721854 720758 718532 715692 712968
59857 712968 710517 707870 704506 700385 696071 692509 690525 690261 691098 692263 693509 695020 696767 698242 698837
59842 698837 698134 695712 691120 684590 677627 672353 669916 669699 670152 670090 669024 666625 662582 657138 651280
59827 651280 646018 641690 638238 635853 634800 634648 634317 633104 631247 629172 626627 623084 618722 614403 610651
$$ packed form
59934E13304k795j603j083p93j68R32K234L288L822M065M542N365O032O059N551
59919E48752M778L592J808j2r02o39K0N26J269K720M401N405N685O103P150Q244
59903E98900Q472P538N790L796K097J008L09n70j742k577k541k007j728j752j423
59888F13570l85R76K188L216M136M796N117N359N725O026O072O193O882Q007Q793
59873F86671Q626P596O202M843L675K668J682O73r6l04j29k53j096k226k840k724
59857G12968k451k647l364m121m314l562j984k64Q37J165J246J511J747J475N95
59842F98837p03k422m592o530o963n274k437k17M53o2j066k399m043n444n858
59827F51280n262m328l452k385j053j52l31j213j857k075k545l543m362m319l752
$$ plain form
59812 610651 607180 603545 599832 596446 593516 590783 587957 585011 582210 579846 577857 575735 573021 569855
59798 569855 566753 563876 560941 557948 555460 553847 552659 551117 549045 546927 545152 543585 541852 539862
59784 539862 538048 537136 537450 538406 539016 539097 539502 540910 542870 544578 546083 548034 550516 553038 555565 558637
59768 558637 562297 565773 568577 571262 574636 578841 583646 589143 595572 602796 610469 618450 626609 634587
59754 634587 642346 650672 660435 671336 682077 691861 701239 711326 722610 734707 746844 758312
59742 758312 768802 778588 788133 797288 805116 810808 814590 817419 819811 821266 820841 818091 813490 808197
59728 808197 803382 799497 796004 791958 786996 781738 777181 773741 770983 768142 764757 760820 756553 752205
59714 752205 748007 744136 740563 736958 732902 728375 723972 720453 717977 715939 713705 711380 709674 709083
$$ packed form
59812F10651l471l635l713l386k930k733k826k946k801k364j989k122k714l166
59798E69855l102k877k935k993k488j613j188j542k072k118j775j567j733j990
59784E39862j814r12L14R56O10Q1M05J408J960J708J505J951K482K522K527L072
59768E58637L660L476K804K685L374M205M805N497O429P224P673P981Q159P978
59754F34587P759Q326R763J0901J0741R784R378J0087J1284J2097J2137J1468
59742G58312J0490R786R545R155P828N692L782K829K392J455m25k750m601n293
59728H08197m815l885l493m046m962n258m557l440k758k841l385l937m267m348
59714G52205m198l871l573l605m056m527m403l519k476k038k234k325j706n91
$$ plain form
59700 709083 709480 710423 711521 712398 712737 712621 712588 713015 713587 713721 713424 713310 713682 713911 712948 710288 706364 702153
59682 702153 698586 696125 694621 693426 691770 689126 685350 680510 674652 667769 660056 652173 645024 639136
59668 639136 634304 629991 625964 622375 619345 616743 614431 612482 611037 610175 609962 610442 611449 612668 614085
59653 614085 616174 619404 623632 628210 632579 636506 639786 642112 643396 643899 643807 642774 640148 635600 629391
59638 629391 622123 614488 607188 600700 594945 589474 584218 579782 576684 574518 572326 569732 567178 565028
59624 565028 562936 560426 557595 554795 551889 548388 544267 540162 536635 533582 530563 527447 524489 521842
59610 521842 519274 516497 513722 511668 510934 511483 512903 514986 517650 520322 521982 522160 521593 521483 522306 523664
59594 523664 525087 526506 528050 529768 531657 533663 535633 537428 538982 540108 540411 539714 538384 536884 535183
$$ packed form
59700G09083L97R43J098Q77L39j16l3M27N72J34k97j14L72K29r63k660l924m211
59682G02153l567k461j504j195j656k644l776m840n858o883p713p883p149n888
59668F39136m832m313m027l589l030k602k312j949j445q62k13M80J007J219J417
59653F14085K089L230M228M578M369L927L280K326J284N03r2j033k626m548o209
59638F29391p268p635p300o488n755n471n256m436l098k166k192k594k554k150
59624E65028k092k510k831k800k906l501m121m105l527l053l019l116k958k647
59610E21842k568k777k775k054p34N49J420K083K664K672J660J78n67j10Q23J358
59594E23664J423J419J544J718J889K006J970J795J554J126L03o97j330j500j701
$$ plain form
59579 535183 533002 530497 528167 526136 524081 521881 519811 517991 516186 514357 512911 512113 511648 511032 510131
59564 510131 509041 507845 506766 506276 506682 507761 509008 509987 510304 509587 507911 506002 504679 504217 504528 505733
59548 505733 508072 511333 514777 517815 520558 523645 527717 533102 539870 547955 557207 567512 579145 592918
59534 592918 609405 627452 643609 653777 655903 651159 642663 633394 625093 618331 613031 609076 606664
59521 606664 606029 606924 608759 611224 614279 617440 619661 620246 619324 617112 613343 607920 601595 595261 588892
59506 588892 581871 574201 566658 559798 553471 547442 541933 537302 533526 530195 526863 523382 520084 517569
59492 517569 516096 515284 514655 514309 514705 515932 517655 519680 522060 524644 527089 529498 532524 536506 540887
59477 540887 544854 548318 551914 556152 560893 565649 570144 574444 578654 582583 585820 588238 590341 592877
$$ packed form
59579E35183k181k505k330k031k055k200k070j820j805j829j446p98m65o16r01
59564E10131j090j196j079m90M06J079J247R79L17p17j676j909j323m62L11J205
59548E05733K339L261L444L038K743L087M072N385O768Q085R252J0305J1633J3773
59534E92918J6487J8047J6157J0168K126m744q496r269q301o762n300l955k412
59521F06664o35Q95J835K465L055L161K221N85r22k212l769n423o325o334o369
59506E88892p021p670p543o860o327o029n509m631l776l331l332l481l298k515
59492E17569j473q12o29l46L96J227J723K025K380K584K445K409L026L982M381
59477E40887L967L464L596M238M741M756M495M300M210L929L237K418K103K536
$$ plain form
59463 592877 595967 598823 600500 600891 600748 600774 601026 601368 602204 604280 607795 612168 616888 622169 628408 635344
59447 635344 642267 648844 655141 660944 665662 668914 670590 670218 667046 661152 653919 646936 640825 635414
59433 635414 630506 625967 621484 616905 612654 609408 607509 607066 608310 611429 616249 622486 630090 638992
59419 638992 648855 659536 671557 685684 702304 721539 743476 767800 793681 820554 848237 875244
59407 875244 897530 910402 912024 904442 891471 876650 863002 853001 847901 847818 852824 862846 875781
59394 875781 886696 890153 883511 867922 846950 824637 803967 785966 770131 756066 744347 735559
59382 735559 729260 724628 721580 720334 720231 719966 718984 717852 717194 716968 716940 717134 717550 717900 717938 717725 717442 717199
59364 717199 717147 717424 717890 718252 718672 719941 722843 727451 733214 739536 746155 753150 760787 769292 778664 788754
$$ packed form
59463E92877L090K856J677L91j43K6K52L42Q36K076L515M373M720N281O239O936
59447F35344O923O577O297N803M718L252J676l72l172n894p233o983o111n411
59433F35414m908m539m483m579m251l246j899m43J244L119M820O237P604Q902
59419F38992R863J0681J2021J4127J6620J9235K1937K4324K5881K6873K7683K7007
59407H75244K2286J2872J622p582j2971j4821j3648j0001n100q3N006J0022J2935
59394H75781J0915L457o642j5589k0972k2313k0670j8001j5835j4065j1719q788
59382G35559o299m632l048j246j03k65r82j132o58k26k8J94M16L50L8k13k83k43
59364G17199n2K77M66L62M20J269K902M608N763O322O619O995P637Q505R372J0090
$$ plain form
59348 788754 799598 811478 824576 838732 853645 869122 884855 900077 913883 925991 936930
59337 936930 947202 956452 963695 968252 970070 969184 965367 958573 949351 938427 926095 912407 897811
59324 897811 883109 868750 854617 840635 827210 814825 803502 792848 782482 772253 762204
59313 762204 752572 743740 736062 729762 725018 721901 720143 719138 718463 718402 719836 723544 729619 737462 746353
59298 746353 755940 765953 775199 781106 780897 773586 760728 745060 728620 712203 696204 681384 668683
59285 668683 658558 650743 644716 640297 637651 636698 636814 637414 638770 641885 647475 655313 664585 674633
59271 674633 685293 696838 709745 724262 739962 755844 771031 785150 797965 808971 817667 823999
59259 823999 828216 830333 830098 827471 822936 817265 811118 804897 798778 792817 787120 782010 777992 775421
$$ packed form
59348G88754J0844J1880J3098J4156J4913J5477J5733J5222J3806J2108J0939
59337I36930J0272R250P243M557J818q86l817o794r222j0924j2332j3688j4596
59324H97811j4702j4359j4133j3982j3425j2385j1323j0654j0366j0229j0049
59313G62204r632q832p678o300m744l117j758j005o75o1J434L708O075P843Q891
59298G46353R587J0013R246N907k09p311j2858j5668j6440j6417j5999j4820j2701
59285F68683j0125p815o027m419k646r53J16O00J356L115N590P838R272J0048
59271F74633J0660J1545J2907J4517J5700J5882J5187J4119J2815J1006Q696O332
59259H23999M217K117k35k627m535n671o147o221o119n961n697n110m018k571
$$ plain form
59245 775421 774127 773417 772645 771846 771726 772937 775460 778728 782091 785047 787299 789000 790760 792996 795190
59230 795190 796155 795054 791994 787715 783031 778470 773937 768682 762019 754137 745806 737238 727889 717550
59216 717550 707065 697540 689282 681940 675301 669443 664294 659568 655063 650704 646393 642129 638183 634913
59202 634913 632521 631155 630990 631836 632878 633262 632995 633003 634264 637057 640944 645167 649079 652423 655300 657875
59186 657875 660274 662848 666259 670998 676958 683691 690893 698324 705464 711700 716916 721549 725980 730114
59172 730114 733593 736162 737734 738375 738366 738115 737809 737245 736166 734769 733734 733597 734120 734376 733557 731591 728877
59155 728877 725599 721544 716486 710354 703035 694442 684936 675331 666218 657551 649093 640940 633259 625856
59141 625856 618426 611104 604278 597970 591868 586028 581094 577609 575381 573778 572428 571407 570893 570927 571574
$$ packed form
59245G75421j294p10p72p99j20J211K523L268L363K956K252J701J760K236K194
59230G95190R65j101l060m279m684m561m533n255o663p882q331q568r349j0339
59216G17550j0485r525q258p342o639n858n149m726m505m359m311m264l946l270
59202F34913k392j366j65Q46J042L84k67QJ261K793L887M223L912L344K877K575
59186F57875K399K574L411M739N960O733P202P431P140O236N216M633M431M134
59172G30114L479K569J572O41rk51l06n64j079j397j035j37N23K56q19j966k714
59155G28877l278m055n058o132p319q593r506r605r113q667q458q153p681p403
59141F25856p430p322o826o308o102n840m934l485k228j603j350j021n14L4O47
$$ plain form
59126 571574 573029 575390 578452 581980 586103 591127 596928 602921 608820 615098 622347 630464 638922 647548
59112 647548 656484 665516 674105 682070 689594 696499 702270 707072 711965 717627 723392 728026 731034 732729
59098 732729 733545 733854 734080 734293 733903 732358 729997 727707 725865 724170 722443 720985 720112 719778 719708 719529 718726
59081 718726 716850 713861 710035 705511 700140 693710 686129 677552 668615 660373 653575 648119 643488 639528
59067 639528 636333 633494 630105 625660 620621 615926 612206 609474 607316 605319 603477 602145 601396 600623 599082
59052 599082 596770 594392 592534 591162 589905 588486 586917 585545 584859 585002 585583 586233 587120 588469 589855
59037 589855 590615 590847 591392 592745 594625 596713 599175 602241 605899 610393 616506 624847 635118 646474
59023 646474 658462 671351 685775 702261 720816 740658 760538 779490 797050 812620 825030
$$ packed form
59126E71574J455K361L062L528M123N024N801N993N899O278P249Q117Q458Q626
59112F47548Q936R032Q589P965P524O905N771M802M893N662N765M634L008J695
59098G32729Q16L09K26K13l90j545k361k290j842j695j727j458q73l34p0j79q03
59081G18726j876k989l826m524n371o430p581q577q937q242o798n456m631l960
59067F39528l195k839l389m445n039m695l720k732k158j997j842j332p49p73j541
59052E99082k312k378j858j372j257j419j569j372o86J43N81O50Q87J349J386
59037E89855P60K32N45J353J880K088K462L066L658M494O113Q341J0271J1356
59023F46474J1988J2889J4424J6486J8555J9842J9880J8952J7560J5570J2410
$$ plain form
59012 825030 833131 836553 835583 830620 822258 811703 800405 789171 778090 767446 758167 751143 746478
58999 746478 743812 743026 744124 746560 749324 751845 754336 757023 759371 760500 760122 758683 756706 754386 751802
58984 751802 749042 746041 742639 738973 735556 732862 731083 730355 730867 732612 735352 739068 744228 751374 760525
58969 760525 771121 782359 793593 804690 816048 827976 840089 851638 862439 872861 882786 891232
58957 891232 897333 901151 903091 903068 900685 895734 888046 877378 864033 849163 833824 818189 802307
58944 802307 787075 773510 761407 749770 738484 728549 720668 714606 710056 707092 705403 703979 702171
58931 702171 700444 699540 699476 699968 701442 704825 710318 716790 722568 726650 729142 730603 731152 730372 728057 724654
58915 724654 720714 716200 710859 705104 700040 696640 695216 695544 697008 698833 700790 703718 708763 716021
$$ packed form
59012H25030Q101L422r70m963q362j0555j1298j1234j1081j0644r279p024m665
58999G46478k666p86J098K436K764K521K491K687K348J129l78j439j977k320k584
58984G51802k760l001l402l666l417k694j779p28N12J745K740L716N160P146R151
58969G60525J0596J1238J1234J1097J1358J1928J2113J1549J0801J0422R925Q446
58957H91232O101L818J940k3k383m951p688j0668j3345j4870j5339j5635j5882
58944H02307j5232j3565j2103j1637j1286r935p881o062m550k964j689j424j808
58931G02171j727r04o4M92J474L383N493O472N778M082K492J461N49p80k315l403
58915G24654l940m514n341n755n064l400j424L28J464J825J957K928N045P258
$$ plain form
58901 716021 724533 733668 743877 755729 768762 781792 794118 806027 818116 830347 841944 852380
58889 852380 862408 873683 887185 902414 918476 935252 952801 970130 985660 998793 1010006
58878 1010006 1019382 1026114 1029688 1030528 1029132 1025493 1019846 1013157 1006178 998652 990057 980667 971335 962730
58864 962730 955223 949078 944131 939625 934846 929640 923975 917432 909674 901017 891998 882636 872655 862205
58850 862205 851861 842066 833079 825298 819170 814729 811530 808941 806249 802654 797532 790684 782135 771881
58836 771881 760082 747359 734587 722398 710994 700303 690180 680628 671975 664683 658898 654437
58824 654437 651276 649679 649596 650312 651021 651593 652533 654369 657246 660863 664585 667829 670556 673181 675876 678300
58808 678300 680215 681914 683626 684876 685002 684104 682919 681741 680041 677279 673631 669587 665196 660177 654675
$$ packed form
58901G16021Q512R135J0209J1852J3033J3030J2326J1909J2089J2231J1597J0436
58889H52380J0028J1275J3502J5229J6062J6776J7549J7329J5530J3133J1213
58878A010006R376O732L574Q40j396l639n647o689o979p526q595r390r332q605
58864I62730p507o145m947m506m779n206n665o543p758q657r019r362r981j0450
58850H62205j0344r795q987p781o128m441l199k589k692l595n122o848q549j0254
58836G71881j1799j2723j2772j2189j1404j0691j0123r552q653p292n785m461
58824F54437l161j597q3P16P09N72R40J836K877L617L722L244K727K625K695K424
58808F78300J915J699J712J250J26q98j185j178j700k762l648m044m391n019n502
$$ plain form
58793 654675 649372 644612 639816 634180 627766 621408 615659 610510 606278 603987 604329 606735 610053 613696
58779 613696 617554 621351 624952 629065 634588 641245 647578 652305 654964 655337 653321 649577 645383 641351
58765 641351 636891 631291 624851 618680 613832 610762 609108 607875 606387 605096 604910 605856 607265 609206 612624
58750 612624 617745 623381 628228 631931 634415 635228 634270 632372 630415 628539 626847 626139 627158 629642 632815
58735 632815 636331 640153 644059 647940 652121 656818 661718 666626 671861 677463 682654 686833 690506 694516
58721 694516 698944 703565 708784 715178 722514 730190 738343 747728 758666 770781 783386 795371 805155
58708 805155 811679 815371 817389 818093 816849 812965 806073 795915 782592 766845 749449 730573 710389
58695 710389 689851 670030 651049 632608 615249 600073 587380 576593 567439 560092 554159 548619
$$ packed form
58793F54675n303m760m796n636o414o358n749n149m232k291L42K406L318L643
58779F13696L858L797L601M113N523O657O333M727K659L73k016l744m194m032
58765F41351m460n600o440o171m848l070j654j233j488j291j86R46J409J941L418
58750F12624N121N636M847L703K484Q13r58j898j957j876j692p08J019K484L173
58735F32815L516L822L906L881M181M697M900M908N235N602N191M179L673M010
58721F94516M428M621N219O394P336P676Q153R385J0938J2115J2605J1985R784
58708H05155O524L692K018P04j244l884o892j0158j3323j5747j7396j8876k0184
58695G10389k0538j9821j8981j8441j7359j5176j2693j0787r154p347n933n540
$$ plain form
58683 548619 543044 537989 533887 530319 526655 522762 518808 515017 511851 509876 509135 509073 509272 509928 511488
58668 511488 514170 517889 522311 527044 532161 538438 546603 556409 566791 576708 585312 591551 594521 594329
58654 594329 591991 588329 583416 577191 570064 562744 555834 549717 544495 539968 535893 532211 528865 525598
58640 525598 522253 519033 516141 513441 510844 508711 507434 506964 507198 508428 510773 513571 515911 517481 518254
58625 518254 517886 516261 514271 513049 512609 512131 511439 511212 511844 513156 515284 518845 523967 530034 536609 543784
58609 543784 551378 558542 564503 569100 572417 574525 575790 576819 577875 578825 579699 580664 581372 581127 579930
58594 579930 578648 577932 577587 577295 577247 577730 578716 580227 582589 585960 590138 595210 601865 610486 620265 629763
58578 629763 638272 646238 654439 663128 672034 680949 690014 699381 708800 717933 727142 737591 750416 766042
$$ packed form
58683E48619n575n055m102l568l664l893l954l791l166j975p41o2J99O56J560
58668E11488K682L719M422M733N117O277Q165R806J0382R917Q604O239K970j92
58654E94329k338l662m913o225p127p320o910o117n222m527m075l682l346l267
58640E25598l345l220k892k700k597k133j277m70K34J230K345K798K340J570P73
58625E18254l68j625j990j222m40m78o92k27O32J312K128L561N122O067O575P175
58609E43784P594P164N961M597L317K108J265J029J056R50Q74R65P08k45j197
58594E79930j282p16l45k92m8M83R86J511K362L371M178N072O655Q621R779R498
58578F29763Q509P966Q201Q689Q906Q915R065R367R419R133R209J0449J2825J5626
$$ plain form
58564 766042 784408 805331 828312 852513 877386 903000 929314 955521 980553 1003731 1024381
58553 1024381 1041312 1053435 1060576 1063072 1061059 1054928 1046036 1036015 1025593 1014864 1004426 995173
58541 995173 987037 978810 969287 957871 944187 927973 909494 889453 868428 846845 825299 804376
58529 804376 784407 765918 749864 736710 725692 715793 707062 700105 694770 690369 686748 683992 681456
58516 681456 678344 675030 672469 670409 667518 663346 658883 655097 652176 650363 650151 651195 652073 651642 649946
58501 649946 647730 645866 645190 645872 646814 646695 645709 645358 646497 648578 650774 652799 654678 656840 660379 666005
58485 666005 672765 679128 685299 693056 703232 714875 727076 740051 754022 768586 783699 799818
58473 799818 816483 832046 845282 856004 863731 867365 866807 863398 857968 849941 839281 827932 818175
$$ packed form
58564G66042J8366K0923K2981K4201K4873K5614K6314K6207K5032K3178K0650
58553A024381J6931J2123P141K496k013o131q892j0021j0422j0729j0438r253
58541I95173q136q227r523j1416j3684j6214j8479k0041k1025k1583k1546k0923
58529H04376j9969j8489j6054j3154j1018r899q731o957n335m401l621k756k536
58516F81456l112l314k561k060k891m172m463l786k921j813k12J044Q78m31j696
58501F49946k216j864o76O82R42j19r86l51J139K081K196K025J879K162L539N626
58485F66005O760O363O171P757J0176J1643J2201J2975J3971J4564J5113J6119
58473G99818J6665J5563J3236J0722P727L634n58l409n430q027j0660j1349r757
$$ plain form
58460 818175 810629 804877 801046 799729 801157 805383 812548 822193 833053 844209 855727 867659 879255
58447 879255 889618 898118 903618 904468 900113 891836 881302 869274 856329 843663 832274 822247 813619
58434 813619 807066 802975 800630 799142 798505 799137 801134 804465 809096 814489 819906 825670 833121 842784 853559
58419 853559 864088 873735 881681 886453 887229 884663 879770 873016 865066 857182 850062 843268 836361 829539
58405 829539 822721 815448 808275 802777 799350 796553 793505 791406 791518 793126 794812 796522 799022 802431
58391 802431 806532 811579 817559 823525 828705 833410 837981 841869 844692 847081 849551 851756 853765 856666
58377 856666 860773 864608 867032 869160 872746 877773 883053 888258 893950 900465 907937 916601 926031 935126
58363 935126 943866 953929 966420 980232 993842 1007397 1021731 1036538 1050973 1064849 1077851 1088736
$$ packed form
58460H18175p546n752l831j317J428M226P165R645J0860J1156J1518J1932J1596
58447H79255J0363Q500N500Q50m355q277j0534j2028j2945j2666j1389j0027q628
58434H13619o553m091k345j488o37O32J997L331M631N393N417N764P451R663J0775
58419H53559J0529R647P946M772P76k566m893o754p950p884p120o794o907o822
58405H29539o818p273p173n498l427k797l048k099J12J608J686J710K500L409
58391H02431M101N047N980N966N180M705M571L888K823K389K470K205K009K901
58377H56666M107L835K424K128L586N027N280N205N692O515P472Q664R430R095
58363I35126Q740J0063J2491J3812J3610J3555J4334J4807J4435J3876J3002J0885
$$ plain form
58351 1088736 1096794 1103005 1108416 1112587 1115101 1117294 1120786 1125393 1130115 1135178 1141386 1148476 1155752 1163596
58337 1163596 1172850 1183540 1195509 1209312 1225104 1241696 1258056 1274669 1292170 1309866 1327003
58326 1327003 1343997 1360893 1376039 1388071 1397919 1407148 1415596 1422388 1427950 1433202 1438015 1442275 1447180
58313 1447180 1453689 1460974 1468174 1476390 1487125 1500165 1514735 1531100 1549090 1566787 1582927 1599100
58301 1599100 1617416 1637518 1658059 1679283 1701703 1723976 1744900 1765988 1789299 1814064 1838183
58290 1838183 1861694 1885955 1910779 1935301 1960464 1987660 2015983 2043628 2071014 2099836 2130215
58279 2130215 2161462 2194355 2229850 2266845 2304071 2342800 2384763 2428886 2473151 2518244 2566240
58268 2566240 2617152 2670008 2725787 2785818 2848774 2912747 2978904 3049615 3124436 3201489 3281171
$$ packed form
58351A088736Q058O211N411M171K514K193L492M607M722N063O208P090P276P844
58337A163596R254J0690J1969J3803J5792J6592J6360J6613J7501J7696J7137
58326A327003J6994J6896J5146J2032R848R229Q448O792N562N252M813M260M905
58313A447180O509P285P200Q216J0735J3040J4570J6365J7990J7697J6140J6173
58301A599100J8316K0102K0541K1224K2420K2273K0924K1088K3311K4765K4119
58290A838183K3511K4261K4824K4522K5163K7196K8323K7645K7386K8822L0379
58279B130215L1247L2893L5495L6995L7226L8729M1963M4123M4265M5093M7996
58268B566240N0912N2856N5779O0031O2956O3973O6157P0711P4821P7053P9682
$$ plain form
58257 3281171 3364646 3450254 3535348 3620318 3707022 3794913 3882644 3971753 4064550 4160183 4257114
58246 4257114 4357552 4464844 4578358 4695836 4818784 4950434 5090324 5236300 5390000
58237 5390000 5554674 5729415 5911483 6102689 6307382 6525754 6755377 6997802 7257149
58228 7257149 7533669 7825435 8134976 8467591 8824707 9205849 9615365 10059908 10541220
58219 10541220 11059079 11619264 12230557 12896276 13617706 14403569 15266808 16214603 17251938
58210 17251938 18392926 19658086 21063378 22624186 24368493 26334642 28559792 31085525
58202 31085525 33974559 37311259 41193982 45749315 51157235 57648394 65476085 74897959
58194 74897959 86170648 99544613 115282264 133700597 155151378 179887440 207937302
$$ packed form
58257C281171Q3475Q5608Q5094Q4970Q6704Q7891Q7731Q9109R2797R5633R6931
58246D257114J00438J07292J13514J17478J22948J31650J39890J45976J53700
58237E390000J64674J74741J82068J91206K04693K18372K29623K42425K59347
58228G257149K76520K91766L09541L32615L57116L81142M09516M44543M81312
58219A0541220N17859N60185O11293O65719P21430P85863Q63239R47795J037335
58210A7251938J140988J265160J405292J560808J744307J966149K225150K525733
58202C1085525K889034L336700L882723M555333N407920O491159P827691R421874
58194G4897959J1272689J3373965J5737651J8418333K1450781K4736062K8049862
$$ plain form
58187 207937302 239094517 272816803 307737605 341029670 368447835 385544960 389428687
58180 389428687 379806984 358721650 329480658 295639759 260383356 226190158 194682807
58173 194682807 166687341 142447728 121841061 104522567 90042901 77953106 67854911
58166 67854911 59397249 52274341 46241057 41110077 36726300 32955627 29694638 26868608
58158 26868608 24412138 22262192 20369191 18699005 17220029 15899301 14712362 13644936
58150 13644936 12682567 11808548 11012929 10292966 9642667 9050742 8509836 8018627 7573463
58141 7573463 7166442 6792813 6451889 6139198 5845706 5566418 5302658 5054828 4820048
58132 4820048 4597956 4391526 4200409 4020034 3848714 3689344 3542681 3405080 3274337
$$ packed form
58187B07937302L1157215L3722286L4920802L3292065K7418165J7097125L883727
58180C89428687r621703k1085334k9240992l3840899l5256403l4193198l1507351
58173A94682807k7995466k4239613k0606667j7318494j4479666j2089795j0098195
58166F7854911q457662p122908o033284n130980m383777l770673l260989k826030
58158B6868608k456470k149946j893001j670186j478976j320728j186939j067426
58150A3644936r62369q74019p95619p19963o50299n91925n40906m91209m45164
58141G573463m07021l73629l40924l12691k93492k79288k63760k47830k34780
58132D820048k22092k06430j91117j80375j71320j59370j46663j37601j30743
$$ plain form
58123 3274337 3151845 3037462 2928044 2822750 2724424 2633954 2548294 2465654 2387811 2315724
58113 2315724 2247525 2182394 2122026 2066684 2013958 1962849 1915080 1871188 1829257 1788703 1751334
58102 1751334 1717386 1684306 1650691 1617851 1586327 1554463 1521542 1488826 1456459 1422859 1388328
58091 1388328 1355784 1326665 1299274 1272299 1246710 1223038 1199947 1176811 1154882 1134627 1114551
58080 1114551 1093625 1072411 1051105 1029113 1007135 986939 968464 949902 931032 913528 897577
58069 897577 881430 864905 849980 837013 823727 809133 795355 784190 774787 766136 758987 753696
58057 753696 748612 742205 734792 726950 718256 708685 699211 690101 680549 670662 661714 653879 645993 638084
58043 638084 631593 626461 620704 613736 607450 602978 599001 594339 589559 584856 578950 571544 564399 558458
$$ packed form
58123C274337j22492j14383j09418j05294r8326r0470q5660q2640p7843p2087
58113B315724o8199o5131o0368n5342n2726n1109m7769m3892m1931m0554l7369
58102A751334l3948l3080l3615l2840l1524l1864l2921l2716l2367l3600l4531
58091A388328l2544k9119k7391k6975k5589k3672k3091k3136k1929k0255k0076
58080A114551k0926k1214k1306k1992k1978k0196j8475j8562j8870j7504j5951
58069H97577j6147j6525j4925j2967j3286j4594j3778j1165r403q651p149n291
58057G53696n084o407p413p842q694r571r474r110r552r887q948p835p886p909
58043F38084o491n132n757o968o286m472l977m662m780m703n906p406p145n941
$$ plain form
58029 558458 552167 544154 535380 527094 518786 509852 501359 494392 488215 481671 474964 468764 462955 457500
58015 457500 453110 449933 446979 443802 441288 439912 438801 437346 436057 435046 433470 431365 430079 429863
58001 429863 429006 426527 423823 422351 421509 420100 418142 415818 412336 407340 402027 397541 393599 389867 387130
57986 387130 385880 385273 384747 385105 386666 387890 387343 385675 384252 383163 381921 380862 380355 379785 378643 377557
57970 377557 377133 376969 376887 377770 379926 381981 382713 382674 382725 382423 381374 380803 381986 384085 385203 384828 383793
57953 383793 382546 380857 378627 375797 372094 367837 364263 362150 360985 360243 360351 361554 363118 364709 367269
57938 367269 371404 376222 380993 386591 393873 401923 409443 416656 424201 431211 436250 439264 440942 440937 438372
57923 438372 433455 427067 419446 410745 402129 394645 387636 379855 371632 364355 358325 352779 347661 343724
$$ packed form
58029E58458o291q013q774q286q308q934q493o967o177o544o707o200n809n455
58015D57500m390l177k954l177k514j376j111j455j289j011j576k105j286k16
58001D29863q57k479k704j472q42j409j958k324l482m996n313m486l942l732k737
57986C87130j250o07n26L58J561J224n47j668j423j089j242j059n07n70j142j086
57970C77557m24j64q2Q83K156K055P32l9N1l02j049n71J183K099J118l75j035
57953C83793j247j689k230k830l703m257l574k113j165p42J08J203J564J591K560
57938C67269M135M818M771N598P282Q050P520P213P545P010N039L014J678nk565
57923D38372m917o388p621q701q616p484p009p781q223p277o030n546n118l937
$$ plain form
57909 343724 341052 338966 337327 336625 336822 337225 337436 337413 336844 335469 333790 332539 331727 331081 330929 331670 332813
57892 332813 333628 334385 336054 339076 343270 348402 353967 358956 362828 366217 369839 373370 376304 379059 382099
57877 382099 384789 386375 387383 388646 389602 389096 387378 385742 384513 382876 380490 377869 375253 372518 370099
57862 370099 368670 367917 366956 366051 366670 369610 374096 378902 383427 387507 391087 394347 397586 400827 403900
57847 403900 406671 408733 409330 408208 406109 403813 401268 398401 395997 394756 394119 393147 392007 391401 391093
57832 391093 390295 389131 388471 388627 389409 391097 393984 397258 399698 401292 402811 404061 404114 403199 402731 403183
57816 403183 403366 402234 400129 397804 395260 392040 387791 382235 375392 367985 360809 353636 345683 337261
57802 337261 329902 324598 320846 317694 314807 312225 309932 308051 306731 305624 304182 302636 301891 302202 302790
$$ packed form
57909C43724k672k086j639p02J97M03K11k3n69j375j679j251q12o46j52P41J143
57892C32813Q15P57J669L022M194N132N565M989L872L389L622L531K934K755L040
57877C82099K690J586J008J263R56n06j718j636j229j637k386k621k616k735k419
57862C70099j429p53r61r05O19K940M486M806M525M080L580L260L239L241L073
57847D03900K771K062N97j122k099k296k545k867k404j241o37r72j140o06l08
57832C91093p98j164o60J56P82J688K887L274K440J594J519J250N3r15m68M52
57816D03183J83j132k105k325k544l220m249n556o843p407p176p173p953q422
57802C37261p359n304l752l152k887k582k293j881j320j107j442j546p45L11N88
$$ plain form
57787 302790 303025 303230 303916 304956 305971 307055 308700 311360 315269 320337 326030 331672 336970 342070 347149
57772 347149 352173 356870 360685 363089 364307 365227 366135 366117 364356 361420 358441 355620 352636 350017 348781
57757 348781 348944 349641 350628 352390 354689 356361 356929 357342 358703 361142 364270 367796 371207 373630 374629 374737
57741 374737 374785 375076 375393 375453 375137 374562 373998 373620 373487 373883 375066 376378 376346 374390 371762 369942 368868 367804
57723 367804 367189 368031 369863 370954 370552 369467 368401 367265 366353 366574 367964 369304 369842 370265 371366 372812
57707 372812 373887 374506 374855 374854 374622 374771 375668 376980 378334 379777 381299 382633 383862 385443 387298 388646
57691 388646 389075 388949 388361 386581 383103 378509 373796 369507 365950 363539 362393 362229 363141 365898 371047
57676 371047 378328 387373 398405 411859 428014 447473 471360 500508 534933 574502 619299 668472
$$ packed form
57787C02790K35K05O86J040J015J084J645K660L909N068N693N642N298N100N079
57772C47149N024M697L815K404J218R20R08j8j761k936k979k821k984k619j236
57757C48781J63O97R87J762K299J672N68M13J361K439L128L526L411K423R99J08
57741C74737M8K91L17O0l16n75n64l78j33L96J183J312l2j956k628j820j074j064
57723C67804o15Q42J832J091m02j085j066j136r12K21J390J340N38M23J101J446
57707C72812J075O19L49jk32J49Q97J312J354J443J522J334J229J581J855J348
57691C88646M29j26n88j780l478m594m713m289l557k411j146j64R12K757N149
57676C71047P281R045J1032J3454J6155J9459K3887K9148L4425L9569M4797M9173
$$ plain form
57664 668472 718802 764644 799097 815691 810620 784798 743697 694530 643315 594121 549703 511689
57652 511689 480319 454793 434060 417206 403406 391897 382066 373643 366930 362529 360334 359065 357507
57639 357507 355968 355634 356644 357902 358820 359916 361299 361874 360834 359007 357873 357891 358518 359183 359462 358875
57623 358875 357307 355299 353321 351216 348864 346857 345842 345573 345248 344487 343417 342159 340763 339430 338330
57608 338330 337423 336777 336718 337324 338177 338993 340076 341755 343778 345696 347447 349125 350504 351234 351202 350455 349157
57591 349157 347895 347476 347981 348528 348432 348098 348225 348605 348450 347627 346868 346801 347270 347671 347572 346960 346105 345259 344525
57572 344525 344070 344203 344906 345515 345460 345181 345595 346654 347313 347127 346984 347818 349417 351068 352731 354868 357511
57555 357511 360114 362151 363514 364613 366305 369440 374202 380108 386471 392370 396454 397810 397219 396596 396918
$$ packed form
57664F68472N0330M5842L4453J6594n071k5822m1101m9167n1215m9194m4418l8014
57652E11689l1370k5526k0733j6854j3800j1509r831q423o713m401k195j269j558
57639C57507j539l34J010J258R18J096J383N75j040j827j134J8O27O65K79n87
57623C58875j568k008j978k105k352k007j015k69l25p61j070j258j396j333j100
57608C38330r07o46n9O06Q53Q16J083J679K023J918J751J678J379P30l2p47j298
57591C49157j262m19N05N47r6l34J27L80j55q23p59o7M69M01r9o12q55q46p34
57572C44525m55J33P03O09n5k79M14J059O59j86j43Q34J599J651J663K137K643
57555C57511K603K037J363J099J692L135M762N906O363N899M084J356n91o23L22
$$ plain form
57540 396918 397606 398142 399037 400649 402224 403016 403443 404229 405218 405905 406421 407046 407396 407024 406280 405762 405491 405506
57522 405506 406535 408994 411895 413957 415472 417914 421907 426693 431486 436289 441389 446975 453300 460341
57508 460341 467261 473033 477699 482263 487292 492354 496939 501256 505829 510760 515556 519378 521550 522166
57494 522166 522167 522445 523005 523321 523215 523012 523166 524258 526975 531391 536454 540809 544020 546499 548565 550292
57478 550292 552094 554607 557868 561185 563948 566168 568231 570435 572769 574872 576323 577181 577990 579130 580638
57463 580638 582854 586429 591180 595667 598821 601392 604886 609514 614185 618207 621921 625840 630183 635186
57449 635186 640895 646650 651680 656181 660941 665980 670578 674674 679120 684250 689246 693365 697000 701053
57435 701053 705969 711764 718324 725145 731317 736342 740700 745271 750490 756252 762253 768147 773657 778840
$$ packed form
57540C96918O88N36Q95J612J575P92M27P86R89O87N16O25L50l72p44n18k71J5
57522D05506J029K459K901K062J515K442L993M786M793M803N100N586O325P041
57508D60341O920N772M666M564N029N062M585M317M573M931M796L822K172O16
57494E22166JK78N60L16j06k03J54J092K717M416N063M355L211K479K066J727
57478E50292J802K513L261L317K763K220K063K204K334K103J451Q58Q09J140J508
57463E80638K216L575M751M487L154K571L494M628M671M022L714L919M343N003
57449F35186N709N755N030M501M760N039M598M096M446N130M996M119L635M053
57435G01053M916N795O560O821O172N025M358M571N219N762O001N894N510N183
$$ plain form
57421 778840 784046 789501 795105 800686 806206 811727 817461 823787 830855 838199 845118 851453 857651 864193
57407 864193 871347 879321 888078 897036 905482 913301 920815 927972 934370 940171 946270 953323 961091 969046
57393 969046 977200 986022 995811 1006357 1017090 1027551 1037855 1048625 1060199 1072142 1083860 1095403
57381 1095403 1107112 1118737 1129668 1139954 1150315 1161078 1171817 1182161 1192202 1201904 1210884 1219196
57369 1219196 1227660 1236921 1246651 1256134 1265220 1274302 1283694 1293469 1303668 1314246 1324961 1335628 1346421
57356 1346421 1357752 1369934 1383008 1396606 1409952 1422361 1434041 1446147 1459714 1474635 1489839
57345 1489839 1504350 1518021 1531366 1544889 1558619 1572286 1585860 1599718 1614172 1629050 1643943
57334 1643943 1658692 1673351 1687945 1702619 1717837 1733878 1750213 1765906 1780716 1795360 1810592
$$ packed form
57421G78840N206N455N604N581N520N521N734O326P068P344O919O335O198O542
57407H64193P154P974Q757Q958Q446P819P514P157O398N801O099P053P768P955
57393I69046Q154Q822R789J0546J0733J0461J0304J0770J1574J1943J1718J1543
57381A095403J1709J1625J0931J0286J0361J0763J0739J0344J0041R702Q980Q312
57369A219196Q464R261R730R483R086R082R392R775J0199J0578J0715J0667J0793
57356A346421J1331J2182J3074J3598J3346J2409J1680J2106J3567J4921J5204
57345A489839J4511J3671J3345J3523J3730J3667J3574J3858J4454J4878J4893
57334A643943J4749J4659J4594J4674J5218J6041J6335J5693J4810J4644J5232
$$ plain form
57323 1810592 1826458 1842550 1858521 1874156 1889348 1904378 1919960 1936718 1954617 1973036 1991308
57312 1991308 2009145 2026618 2043863 2060917 2077982 2095759 2115107 2136130 2157853 2179153 2199804
57301 2199804 2220317 2241065 2262005 2283112 2304502 2326094 2347556 2368709 2389777 2411178 2433175
57290 2433175 2455682 2478281 2500610 2522803 2545320 2568261 2591341 2614685 2639014 2664523 2690189
57279 2690189 2714828 2738455 2761936 2785692 2809540 2833483 2857802 2882483 2907356 2932698 2958916
57268 2958916 2985644 3011954 3037486 3062722 3088136 3113821 3139949 3166762 3193920 3220616 3246656
57257 3246656 3272877 3300191 3328649 3357567 3386191 3414187 3441918 3470172 3499169 3527966 3555482
57246 3555482 3581969 3608711 3636331 3664205 3691627 3718632 3745471 3772149 3798882 3826306 3854727
$$ packed form
57323A810592J5866J6092J5971J5635J5192J5030J5582J6758J7899J8419J8272
57312A991308J7837J7473J7245J7054J7065J7777J9348K1023K1723K1300K0651
57301B199804K0513K0748K0940K1107K1390K1592K1462K1153K1068K1401K1997
57290B433175K2507K2599K2329K2193K2517K2941K3080K3344K4329K5509K5666
57279B690189K4639K3627K3481K3756K3848K3943K4319K4681K4873K5342K6218
57268B958916K6728K6310K5532K5236K5414K5685K6128K6813K7158K6696K6040
57257C246656K6221K7314K8458K8918K8624K7996K7731K8254K8997K8797K7516
57246C555482K6487K6742K7620K7874K7422K7005K6839K6678K6733K7424K8421
$$ plain form
57235 3854727 3883638 3912311 3940461 3968155 3995570 4023047 4050845 4078626 4105657 4131649 4156862
57224 4156862 4181263 4204297 4225781 4246412 4266988 4287589 4307810 4327406 4346479 4365455 4385058
57213 4385058 4405846 4427584 4449577 4471662 4494390 4518075 4542365 4567030 4592465 4619037 4646463
57202 4646463 4674297 4702589 4731664 4761521 4791792 4822000 4851664 4880415 4908272 4935582 4962627
57191 4962627 4989527 5016455 5043534 5070545 5097143 5123317 5149162 5174336 5198378 5221498 5244324
57180 5244324 5266849 5288370 5308567 5327858 5346483 5364038 5380162 5394922 5408221 5419614 5429091
57169 5429091 5437384 5444960 5451226 5455179 5456454 5455453 5452797 5448891 5443558 5435910 5424997 5410810 5394228
57156 5394228 5375923 5355839 5333829 5310187 5285337 5259517 5233018 5206411 5180555 5156741 5136524
$$ packed form
57235C854727K8911K8673K8150K7694K7415K7477K7798K7781K7031K5992K5213
57224D156862K4401K3034K1484K0631K0576K0601K0221J9596J9073J8976J9603
57213D385058K0788K1738K1993K2085K2728K3685K4290K4665K5435K6572K7426
57202D646463K7834K8292K9075K9857L0271L0208K9664K8751K7857K7310K7045
57191D962627K6900K6928K7079K7011K6598K6174K5845K5174K4042K3120K2826
57180E244324K2525K1521K0197J9291J8625J7555J6124J4760J3299J1393R477
57169E429091Q293P576O266L953J275j001k656l906n333p648j0913j4187j6582
57156E394228j8305k0084k2010k3642k4850k5820k6499k6607k5856k3814k0217
$$ plain form
57145 5136524 5120720 5108685 5099309 5092523 5089045 5088920 5091403 5096092 5102820 5110327 5116388 5119659 5120282 5118374
57131 5118374 5113202 5104361 5092684 5079510 5066107 5054360 5046816 5045267 5050094 5061454 5080077 5106217
57119 5106217 5138835 5176563 5218837 5265709 5317619 5376027 5443436 5522186 5613976 5720931 5846066
57108 5846066 5992193 6161393 6356264 6581099 6841847 7146301 7504943 7930712 8437925
57099 8437925 9043006 9767017 10636512 11682064 12937563 14440502 16229565 18339544 20798431
57090 20798431 23627448 26839152 30433423 34397391 38708244 43327145 48179122 53131315
57082 53131315 57984769 62483323 66340659 69291643 71159984 71904633 71607673 70412401
57074 70412401 68461622 65873921 62751368 59192194 55296891 51171235 46926840 42675579
$$ packed form
57145E136524j5804j2035r376o786l478j25K483M689O728P507O061L271O23j908
57131E118374n172q841j1677j3174j3403j1747p544j549M827J1360J8623K6140
57119E106217L2618L7728M2274M6872N1910N8408O7409P8750R1790J06955J25135
57108E846066J46127J69200J94871K24835K60748L04454L58642M25769N07213
57099H437925O05081P24011Q69495J045552J255499J502939J789063K109979K458887
57090B0798431K829017L211704L594271L963968M310853M618901M851977M952193
57082E3131315M853454M498554L857336K950984J868341P44649k96960j195272
57074G0412401j950779k587701l122553l559174l895303m125656m244395m251261
$$ plain form
57066 42675579 38520045 34546441 30821382 27389983 24275489 21482555 19002692 16818413
57058 16818413 14905814 13237463 11785318 10522188 9422377 8462865 7624161 6889631
57050 6889631 6244482 5675944 5173806 4729823 4336625 3987456 3676378 3398203 3148501
57041 3148501 2923967 2722289 2541321 2378850 2233354 2104285 1991182 1892998 1808573 1737168
57031 1737168 1678278 1631511 1597002 1575413 1567177 1571677 1586313 1604927 1617110 1610985 1578559 1519174
57019 1519174 1438494 1345128 1247805 1153523 1066466 988319 919623 860377 809538 765183 725777
57008 725777 690738 659696 632147 608077 587963 571675 558223 546842 537358 529200 521208 512930
56996 512930 505031 497797 490363 482183 474244 467860 463090 459262 456314 454696 454507 455714 458738 463935
$$ packed form
57066D2675579m155534l973604l725059l431399l114494k792934k479863k184279
57058A6818413j912599j668351j452145j263130j099811r59512q38704p34530
57050F889631o45149n68538n02138m43983l93198l49169l11078k78175k49702
57041C148501k24534k01678j80968j62471j45496j29069j13103r8184q4425p1405
57031A737168n8890m6767l4509k1589q236M500J4636J8614J2183o125l2426n9385
57019A519174q0680r3366r7323r4282q7057p8147o8696n9246n0839m4355l9406
57008G25777l5039l1042k7549k4070k0114j6288j3452j1381r484q158p992q278
56996E12930p899p234p434q180p939o384m770l828k948j618j89J207L024N197
$$ plain form
56982 463935 470680 477459 482450 483632 479174 468630 453359 435201 415226 394292 373948 355732
56970 355732 339978 326210 314415 305184 298848 295271 294323 295939 299909 306133 314877 326367 340397
56957 340397 356721 375221 394983 413523 427593 434674 433546 424173 407899 387364 365310 343370
56945 343370 322328 303179 287173 274971 266410 261175 259310 261084 266599 275535 287249 301414 318583
56932 318583 339634 364439 391506 418956 444963 466887 480943 483850 474789 455534 429199 399275
56920 399275 369006 340552 314655 291416 271087 253763 238914 225941 214879 205937 198674 192276
56908 192276 186440 181409 177299 173873 170920 168447 166571 165419 164918 164678 164509 165117 167623 172156 177632
56893 177632 183212 189247 196458 205105 215460 228103 243000 259119 275735 293113 310801 326071
$$ packed form
56982D63935O745O779M991J182m458j0544j5271j8158j9975k0934k0344j8216
56970C55732j5754j3768j1795r231o336l577r48J616L970O224Q744J1490J4030
56957C40397J6324J8500J9762J8540J4070P081j128r373j6274k0535k2054k1940
56945C43370k1042j9149j6006j2202q561n235j865J774N515Q936J1714J4165J7169
56932C18583K1051K4805K7067K7450K6007K1924J4056K907r061j9255k6335k9924
56920C99275l0269k8454k5897k3239k0329j7324j4849j2973j1062q942p263o398
56908A92276n836n031m110l426k953k473j876j152n01k40j69O08K506M533N476
56893A77632N580O035P211Q647J0355J2643J4897J6119J6616J7378J7688J5270
$$ plain form
56881 326071 335434 337415 332904 323387 310136 294833 279514 265676 254156 245782 241232 240446 243128
56868 243128 249778 261302 277772 298575 323773 354272 390579 432330 479111 530595 585231 639241
56856 639241 687123 722884 741414 740272 721056 688704 649089 607203 566963 531395 502368 480646
56844 480646 466529 460217 461571 470163 485844 509065 540651 581550 632603 693962 764688 843096
56832 843096 926818 1011500 1089368 1150138 1184195 1185758 1154525 1096003 1020134 937796 857072 782283
56820 782283 715813 659599 614747 580913 556976 542006 535413 536832 546384 564624 591865 627809
56808 627809 671969 723837 782027 843042 900718 946808 972938 973630 948576 902228 841248 772391
56796 772391 701903 635147 575667 524751 482229 447602 420489 400694 388166 382617 383130 388634
$$ packed form
56881C26071R363J981m511r517j3251j5303j5319j3838j1520q374m550p86K682
56868B43128O650J1524J6470K0803K5198L0499L6307M1751M6781N1484N4636N4010
56856F39241M7882L5761J8530j142j9216l2352l9615m1886m0240l5568k9027k1722
56844D80646j4117o312J354Q592J5681K3221L1586M0899N1053O1359P0726P8408
56832H43096Q3722Q4682P7868O0770L4057J563l1233n8522p5869q2338q0724p4789
56820G82283o6470n6214m4852l3834k3937j4970o593J419R552J8240K7241L5944
56808F27809M4160N1868N8190O1015N7676M6090K6130O92k5054m6348o0980o8857
56796G72391p0488o6756n9480n0916m2522l4627k7113j9795j2528n549N13N504
$$ plain form
56784 388634 398801 413972 434124 458504 486252 516326 546112 570747 584783 584803 570635 544684
56772 544684 510557 471832 431351 391314 353739 320276 291384 266246 243924 224261 207427
56761 207427 193087 180609 169793 160756 153182 146230 139345 132766 127045 122263 117928 113596 109437
56748 109437 106089 103972 102851 102128 101407 100548 99335 97427 94812 92115 90287 89910 90725 91794 92259 92035
56732 92035 91673 91512 91228 90398 89267 88645 89171 90806 92899 94598 95505 96190 97747 100595 104063 107392
56716 107392 110627 114014 117082 119148 120442 121884 123797 125582 126665 127108 127280 127579 128529 130508 133229
56701 133229 136003 138485 140595 141881 141809 140799 140136 140554 141544 142319 142756 143056 143141 142882 142515 142379 142555 143030
56683 143030 143880 145021 146098 146846 147310 147644 148011 148749 150103 151722 152834 153042 152500 151312 149441 147303
$$ packed form
56784C88634J0167J5171K0152K4380K7748L0074K9786K4635J4036K0j4168k5951
56772E44684l4127l8725m0481m0037l7575l3463k8892k5138k2322j9663j6834
56761B07427j4340j2478j0816r037p574o952o885o579n721m782m335m332m159
56748A09437l348k117j121p23p21q59j213j908k615k697j828l77Q15J069M65k24
56732I2035l62j61k84q30j131o22N26J635K093J699R07O85J557K848L468L329
56716A07392L235L387L068K066J294J442J913J785J083M43J72K99R50J979K721
56701A33229K774K482K110J286p2j010o63M18R90P75M37L00Q5k59l67j36J76M75
56683A43030Q50J141J077P48M64L34L67P38J354J619J112K08n42j188j871k138
$$ plain form
56667 147303 145720 144953 144427 143757 143356 143634 144226 144593 144784 144963 144647 143188 140724 137996 135455 133162 131369
56650 131369 130430 130083 129483 128139 126393 124833 123629 122691 122133 122209 122890 123790 124598 125398 126417 127536 128297
56633 128297 128482 128491 128955 130120 131774 133628 135480 137132 138448 139547 140716 142113 143678 145194 146275
56618 146275 146528 146019 145374 145045 144682 143672 142095 140607 139475 138351 137022 135794 134977 134445 133920 133381
56602 133381 133049 133233 134123 135448 136427 136495 136019 135903 136576 137778 139098 140186 140590 140064 139024 138132 137533
56585 137533 137169 137599 139527 142522 145206 146961 148503 150481 152477 153874 154799 155579 156025 156011 156223 157578
56569 157578 160188 163459 166948 170689 174931 180016 186282 193727 201941 210636 220059 230749 243053 256710
56555 256710 270432 281891 288890 290932 289312 285671 281042 276191 271871 268273 264972 261823 259213 257101
$$ packed form
56667A47303j583p67n26o70m01K78N92L67J91J79l16j459k464k728k541k293j793
56650A31369r39l47o00j344j746j560j204r38n58P6O81R00Q08Q00J019J119P61
56633A28297J85RM64J165J654J854J852J652J316J099J169J397J565J516J081
56618A46275K53n09o45l29l63j010j577j488j132j124j329j228q17n32n25n39
56602A33381l32J84Q90J325R79O8m76j16O73J202J320J088M04n26j040q92n99
56585A37533l64M30J928K995K684J755J542J978J996J397R25P80M46j4K12J355
56569A57578K610L271L489L741M242N085O266P445Q214Q695R423J0690J2304J3657
56555B56710J3722J1459O999K042j620l641m629m851m320l598l301l149k610k112
$$ plain form
56541 257101 254653 251371 247849 244802 242045 239083 236026 233195 230366 227207 224104 221797 220449 219630
56527 219630 218958 218213 217147 215657 213903 211900 209441 206704 204342 202455 200204 197032 193624 190869 188504
56512 188504 185745 182725 180267 178534 176963 175395 174256 173555 172596 170906 168782 166786 165243 164303 163968
56497 163968 163987 164132 164560 165458 166439 166826 166468 165794 165116 164451 163999 164202 165160 166318 166944 166732 166004 165535 166019
56478 166019 167399 168867 169799 170428 171278 172236 172720 172605 172432 172741 173657 175131 177133 179487 181768 183502
56462 183502 184405 184561 184481 184767 185543 186373 186816 186841 186622 186340 186306 186814 187655 188283 188714 189704 191698 194202 196621
56443 196621 199121 202090 205249 207922 209780 210775 210765 209804 208390 206849 204924 202542 200471 199459 199202
56428 199202 198953 198764 199188 200091 200681 200634 200310 199946 199424 198819 198384 198004 197357 196659 196574 197364 198682 200140 201553
$$ packed form
56541B57101k448l282l522l047k757k962l057k831k829l159l103k307j348q19
56527B19630o72p45j066j490j754k003k459k737k362j887k251l172l408k755k365
56512A88504k759l020k458j733j571j568j139p01r59j690k124j996j543r40l35
56497A63968J9J45M28Q98R81L87l58o74o78o65m52K03R58J158O26k12p28m69M84
56478A66019J380J468R32O29Q50R58M84j15j73L09R16J474K002K354K281J734
56462A83502R03J56q0K86P76Q30M43K5k19k82l4N08Q41O28M31R90J994K504K419
56443A96621K500K969L159K673J858R95j0r61j414j541j925k382k071j012k57
56428A99202k49j89M24R03N90m7l24l64n22o05m35l80o47o98q5P90J318J458J413
$$ plain form
56409 201553 202726 203645 204768 206439 208043 208521 207743 206757 206588 207389 208812 210488 211944 212624 212367 211657
56393 211657 211236 211636 213003 215063 217238 219005 220160 220764 221159 222044 223966 226430 228126 228426 228027 227729
56377 227729 227409 226912 227016 228414 230357 231544 231952 232563 233552 234036 233600 232895 232640 233070 234387 236680 239254
56360 239254 241069 242068 243132 244565 245595 245690 245394 245509 246251 247560 249477 251771 253824 255270 256265 256932
56344 256932 257142 257084 257413 258540 260200 261886 263259 264074 264378 264915 266773 270378 275260 280766 286446 291774
56328 291774 296240 299879 303137 306123 308585 310642 312786 315024 316647 317087 316416 314921 312830 310627 309022
56313 309022 308385 308621 309670 311649 314422 317561 320753 323829 326567 329009 331799 335610 340403 345886 352291
56298 352291 359783 367443 373970 379326 384564 390065 395161 399604 404092 408965 413620 417746 422108 427485
$$ packed form
56409B01553J173R19J123J671J604M78p78r86j69Q01J423J676J456O80k57p10
56393B11657m21M00J367K060K175J767J155O04L95Q85J922K464J696L00l99k98
56377B27729l20m97J04J398J943J187M08O11R89M84m36p05k55M30J317K293K574
56360B39254J815R99J064J433J030R5k96J15P42J309J917K294K053J446R95O67
56344B56932K10n8L29J127J660J686J373Q15L04N37J858L605M882N506N680N328
56328B91774M466L639L258K986K462K057K144K238J623M40o71j495k091k203j605
56313C09022o37K36J049J979K773L139L192L076K738K442K790L811M793N483O405
56298C52291P492P660O527N356N238N501N096M443M488M873M655M126M362N377
$$ plain form
56284 427485 433703 440341 447574 455743 464753 474493 485200 496834 508593 519561 529530 538996 548854
56271 548854 560233 573953 589783 606765 624436 643249 663779 686273 711062 738495 768228
56260 768228 799517 832702 869634 912139 960720 1015150 1075673 1143045 1217874 1300491 1391225
56249 1391225 1490609 1599433 1718516 1847912 1986351 2131951 2283249 2438840 2596174 2751567
56239 2751567 2901328 3042029 3169924 3281241 3373124 3443313 3489034 3507691 3498994 3465249 3409212
56228 3409212 3332815 3238298 3129181 3009286 2881641 2748856 2613644 2478383 2344898 2215029
56218 2215029 2090560 1972288 1860063 1754031 1654864 1562559 1476233 1395495 1320893 1252517
56208 1252517 1189380 1130698 1076671 1027455 982478 941342 904289 871146 840933 813121 788125
$$ packed form
56284D27485O218O638P233Q169R010R740J0707J1634J1759J0968R969R466R858
56271E48854J1379J3720J5830J6982J7671J8813K0530K2494K4789K7433K9733
56260G68228L1289L3185L6932M2505M8581N4430O0523O7372P4829Q2617R0734
56249A391225R9384J08824J19083J29396J38439J45600J51298J55591J57334J55393
56239B751567J49761J40701J27895J11317R1883P0189M5721J8657q697l3745n6037
56228C409212p6397r4517j09117j19895j27645j32785j35212j35261j33485j29869
56218B215029j24469j18272j12225j06032r9167r2305q6326q0738p4602o8376
56208A252517o3137n8682n4027m9216m4977m1136l7053l3143l0213k7812k4996
$$ plain form
56197 788125 766041 746068 727801 711786 698017 685217 672520 660717 650929 643101 636594 631075
56185 631075 626024 620661 615313 611549 609842 608453 605884 603201 602391 603459 604787 605564 606218 606974 607604
56170 607604 608416 610185 613077 616563 620257 624187 628575 633936 640894 649333 658302 667242 676592 686750
56156 686750 697441 708729 721594 736692 753627 772273 793721 818903 847385 878670 913713
56145 913713 954010 1000138 1052398 1112043 1180537 1258076 1343836 1436826 1535325 1635959 1734296
56134 1734296 1825991 1907182 1975318 2030850 2077254 2118283 2155813 2190668 2223648 2254310 2280021
56123 2280021 2297836 2306643 2306589 2297904 2281674 2260258 2234877 2203417 2162041 2108169 2040893 1960216
56111 1960216 1868129 1769671 1670951 1576318 1488449 1409746 1341641 1283339 1233111 1190377 1155174
$$ packed form
56197G88125k2084j9973j8267j6015j3769j2800j2697j1803r788p828o507n519
56185F31075n051n363n348l764j707j389k569k683q10J068J328P77O54P56O30
56170F07604Q12J769K892L486L694L930M388N361O958Q439Q969Q940R350J0158
56156F86750J0691J1288J2865J5098J6935J8646K1448K5182K8482L1285L5043
56145I13713M0297M6128N2260N9645O8494P7539Q5760R2990R8499J00634R8337
56134A734296R1695Q1191O8136N5532M6404M1029L7530L4855L2980L0662K5711
56123B280021J7815Q807n4q685j6230k1416k5381l1460m1376n3872o7276q0677
56111A960216r2087r8458r8720r4633q7869p8703o8105n8302n0228m2734l5203
$$ plain form
56100 1155174 1126621 1103611 1086080 1073777 1064689 1056667 1049915 1045993 1044992 1045546 1046955 1049396 1052550
56087 1052550 1055837 1059553 1064108 1068797 1072976 1077796 1084956 1094356 1104608 1115189 1126397 1138003 1149710
56074 1149710 1162183 1175914 1189969 1203589 1218006 1234719 1253056 1271465 1290112 1309949 1330363
56063 1330363 1350178 1370011 1391153 1412973 1434021 1454887 1477290 1501005 1524328 1546991 1569960
56052 1569960 1592953 1614868 1636155 1658082 1680157 1701048 1721571 1743954 1768454 1793417 1818311
56041 1818311 1844033 1870672 1897802 1926614 1958896 1994148 2030396 2067423 2106489 2147506 2189460
56030 2189460 2233097 2280067 2329890 2380854 2433373 2489199 2547827 2607086 2666991 2729595 2795417
56019 2795417 2863353 2933704 3007824 3085280 3164877 3247820 3336034 3428094 3520929 3614957 3713204
$$ packed form
56100A155174k8553k3010j7531j2303r088q022o752l922j001N54J409K441L154
56087A052550L287L716M555M689M179M820P160R400J0252J0581J1208J1606J1707
56074A149710J2473J3731J4055J3620J4417J6713J8337J8409J8647J9837K0414
56063A330363J9815J9833K1142K1820K1048K0866K2403K3715K3323K2663K2969
56052A569960K2993K1915K1287K1927K2075K0891K0523K2383K4500K4963K4894
56041A818311K5722K6639K7130K8812L2282L5252L6248L7027L9066M1017M1954
56030B189460M3637M6970M9823N0964N2519N5826N8628N9259N9905O2604O5822
56019B795417O7936P0351P4120P7456P9597Q2943Q8214R2060R2835R4028R8247
$$ plain form
56008 3713204 3815932 3920852 4028370 4141700 4261704 4386445 4515978 4652769 4797132
55999 4797132 4947184 5103626 5269710 5446218 5631458 5826359 6034274 6255518 6487607
55990 6487607 6731258 6990513 7266597 7557697 7865379 8195123 8549865 8929264 9335921
55981 9335921 9775760 10251641 10763474 11315433 11915926 12569755 13277967 14046506 14887284
55972 14887284 15809959 16821190 17933209 19164617 20532229 22052138 23750516 25664301
55964 25664301 27831847 30295950 33119444 36388809 40206082 44697068 50035665 56449711
55956 56449711 64199024 73552741 84776327 98120517 113833603 132208805 153591542
55949 153591542 178270305 206334849 237633904 271699097 307312848 341808681 370876439
$$ packed form
56008C713204J02728J04920J07518J13330J20004J24741J29533J36791J44363
55999D797132J50052J56442J66084J76508J85240J94901K07915K21244K32089
55990F487607K43651K59255K76084K91100L07682L29744L54742L79399M06657
55981I335921M39839M75881N11833N51959O00493O53829P08212P68539Q40778
55972A4887284R22675J011231J112019J231408J367612J519909J698378J913785
55964B5664301K167546K464103K823494L269365L817273M490986N338597O414046
55956E6449711P749313R353717J1223586J3344190J5713086J8375202K1382737
55949A53591542K4678763K8064544L1299055L4065193L5613751L4495833K9067758
$$ plain form
55942 370876439 389593239 394347129 384359671 361784128 330545207 294889183 258403328
55935 258403328 223625295 192039245 164281053 140424712 120227405 103282228 89118112
55928 89118112 77280097 67370994 59049399 52022576 46054181 40962959 36601689 32843018
55920 32843018 29584787 26751643 24281127 22114945 20205969 18521778 17034551 15714629
55912 15714629 14537181 13486114 12546596 11700739 10934115 10239284 9609159 9033259 8503538
55903 8503538 8017264 7570860 7156949 6770521 6412109 6081670 5774732 5487519 5220611
55894 5220611 4974500 4746290 4533529 4336692 4155273 3985783 3826135 3677851 3541686
55885 3541686 3415215 3296830 3187854 3088263 2994185 2901862 2810502 2719544 2627289 2534466 2445178
$$ packed form
55942C70876439J8716800M753890r987458k2575543l1238921l5656024l6485855
55935B58403328l4778033l1586050k7758192k3856341k0197307j6945177j4164116
55928H9118112j1838015r909103q321595p026823n968395n091222m361270l758671
55920C2843018l258231k833144k470516k166182j908976j684191j487227j319922
55912A5714629j177448j051067r39518q45857p66624o94831o30125n75900n29721
55903H503538m86274m46404m13911l86428l58412l30439l06938k87213k66908
55894E220611k46111k28210k12761j96837j81419j69490j59648j48284j36165
55885C541686j26471j18385j08976r9591r4078r2323r1360r0958r2255r2823q9288
$$ plain form
55874 2445178 2361872 2282746 2206043 2133114 2065084 2000270 1937404 1878006 1823187 1771348 1721474
55863 1721474 1675436 1634549 1596835 1560165 1525166 1492461 1459941 1425626 1390793 1357565 1325602
55852 1325602 1293737 1262708 1233632 1205599 1177285 1149284 1122579 1096320 1069260 1041856 1014917
55841 1014917 987800 960095 933589 910303 889733 870016 850791 833062 817148 802470 788610
55830 788610 775289 762109 749375 738105 728391 719022 709527 700938 693526 685567 675656 664615 653738
55817 653738 642790 631239 619968 610060 601109 592263 583871 576741 570861 566044 562726 560934 559726
55804 559726 558797 559375 562306 566546 570786 575330 581022 587549 594168 600972 608053 614406 618892 621415 622132
55789 622132 620644 616946 611970 606125 598713 589934 581917 576119 570909 563331 552331 538856 523884
$$ packed form
55874B445178q3306p9126p6703p2929o8030o4814o2866n9398n4819n1839m9874
55863A721474m6038m0887l7714l6670l4999l2705l2520l4315l4833l3228l1963
55852A325602l1865l1029k9076k8033k8314k8001k6705k6259k7060k7404k6939
55841A014917k7117k7705k6506k3286k0570j9717j9225j7729j5914j4678j3860
55830G88610j3321j3180j2734j1270r714r369r495q589p412p959r911j1041j0877
55817F53738j0948j1551j1271r908q951q846q392p130n880m817l318j792j208
55804E59726r29N78K931M240M240M544N692O527O619O804P081O353M486K523P17
55789F22132j488l698m976n845p412q779q017n798n210p578j1000j3475j4972
$$ plain form
55776 523884 508096 492811 479683 469722 463509 461608 463866 469094 476206 484515 492128 495601 492675
55763 492675 484328 472978 459914 445766 431917 419557 408264 397234 387032 378504 370872 362637
55751 362637 353644 344599 335313 325246 315252 306936 300559 295088 290054 285883 282719 280349 279073 279299
55737 279299 280475 281550 282148 282200 281057 278260 274711 271675 269021 265809 262124 258839 255934 252643 249066
55722 249066 246016 243301 239694 234823 229808 225790 223002 221460 221478 223172 226259 230517 235800 241607 247315
55707 247315 252692 257527 261002 262293 261571 259690 257138 254030 250682 247301 243408 238449 232720 226902
55693 226902 221134 215367 210099 205780 201998 198349 195577 194699 195421 196669 198271 200792 204063 207293 210511
55678 210511 214499 219316 224169 228685 232977 236447 237976 237596 236700 236243 235817 234806 233310 231558 229451
$$ packed form
55776E23884j5788j5285j3128r961o213j901K258N228P112Q309P613L473k926
55763D92675q347j1350j3064j4148j3849j2360j1293j1030j0202q528p632q235
55751C62637q993r045r286j0067r994q316o377n471n034m171l164k370j276K26
55737B79299J176J075N98N2j143k797l549l036k654l212l685l285k905l291l577
55722B49066l050k715l607m871n015m018k788j542J8J694L087M258N283N807N708
55707B47315N377M835L475J291p22j881k552l108l348l381l893m959n729n818
55693B26902n768n767n268m319l782l649k772q78P22J248J602K521L271L230L218
55678B10511L988M817M853M516M292L470J529l80q96m57m26j011j496j752k107
$$ plain form
55663 229451 227159 225375 224532 224422 224782 225568 226493 227066 227305 227757 228733 230175 232241 235115 238144 240110
55647 240110 240577 240266 239920 239611 239277 239047 238666 237407 234969 231849 228474 224505 219276 212581 204805 196661
55631 196661 188912 182017 176018 170919 166919 163883 161056 157993 155361 154035 153669 153079 151792 150253 148719
55616 148719 147017 145379 144323 143555 142009 139317 136338 133980 132278 130846 129358 127338 124391 121026
55602 121026 118461 117204 116507 115539 114354 113290 112209 110923 109786 109239 109083 108678 107708 106451 105494 105353
55586 105353 106160 107612 109317 111085 112714 113832 114398 115034 116290 117808 118893 119700 121105 123497 126496
55571 126496 129797 133547 137879 142745 148162 153874 158859 161998 163241 163372 162718 160946 158028 154441 150364
55556 150364 145673 140794 136578 133138 129770 126221 123103 120851 119253 118219 117938 117977 117300 115714 114352
$$ packed form
55663B29451k292j784q43j10L60P86R25N73K39M52R76J442K066K874L029J966
55647B40110M67l11l46l09l34k30l81j259k438l120l375l969n229o695p776q144
55631A96661p749o895n999n099m000l036k827l063k632j326l66n90j287j539j534
55616A48719j702j638j056p68j546k692k979k358j702j432j488k020k947l365
55602A21026k565j257o97r68j185j064j081j286j137n47j56m05r70j257r57j41
55586A05353Q07J452J705J768J629J118N66O36J256J518J085Q07J405K392K999
55571A26496L301L750M332M866N417N712M985L139J243J31o54j772k918l587m077
55556A50364m691m879m216l440l368l549l118k252j598j034k81L9o77j586j362
$$ plain form
55541 114352 114192 114949 115918 117039 118508 120091 121377 122132 122031 120766 118821 117393 117136 117656 118498 119674
55525 119674 120762 120612 118721 116083 113915 112271 110609 108914 107443 106036 104575 103575 103464 103735 103604
55510 103604 103092 102704 102478 102177 102108 102880 104437 106005 106921 107110 106884 106644 106551 106210 105046 103211 101569 100495
55492 100495 99368 97674 95845 94371 92801 90527 87977 86074 84849 83509 81756 80243 79807 80816
55478 80816 83112 85943 88126 88865 88390 87460 86479 85472 84562 83912 83457 83127 83011 82934 82374 81303 80528 80615
55460 80615 81017 80976 80694 80742 80831 80216 79010 78066 77761 77842 78298 79304 80366 80565 79803 78863 78140 77253 76138
55441 76138 75574 76170 77523 78769 79505 79897 80355 81269 82609 83666 83704 82919 82203 81879 81345 80134 78641
55424 78641 77540 77065 77120 77572 78108 78350 78344 78495 78788 78657 77883 77063 76788 76918 77118 77605 78771 80455 82120
$$ packed form
55541A14352j60P57R69J121J469J583J286P55j01j265j945j428k57N20Q42J176
55525A19674J088j50j891k638k168j644j662j695j471j407j461j000j11K71j31
55510A03604n12l88k26l01o9P72J557J568R16J89k26k40r3l41j164j835j642j074
55492A00495j127j694j829j474j570k274k550j903j225j340j753j513m36J009
55478H0816K296K831K183P39m75r30r81j007r10o50m55l30j16p7n60j071p75Q7
55460H0615M02m1k82M8Q9o15j206r44l05Q1M56J006J062J99p62r40p23q87j115
55441G6138n64N96J353J246P36L92M58R14J340J057L8p85p16l24n34j211j493
55424G8641j101m75N5M52N36K42oJ51K93j31p74q20k75J30K00M87J166J684J665
$$ plain form
55405 82120 83460 84347 84431 83438 81761 80202 79131 78372 77894 78055 78964 80055 80654 80715 80704 80894 81166 81438
55387 81438 81888 82522 82852 82439 81600 81108 81129 80923 79884 78344 76991 75863 74539 73070 72036 71640 71380
55370 71380 70783 69932 69033 67976 66643 65317 64430 64173 64593 65773 67515 69143 70030 70260 70363 70572 70734
55353 70734 70906 71472 72480 73330 73478 73194 73256 74002 75026 75774 76044 75879 75324 74559 73931 73641 73570 73610 73878
55334 73878 74250 74033 72748 71138 70664 71757 73172 73461 72610 71741 71567 71754 71652 71077 70331 69871 70043 70814
55316 70814 71654 71939 71564 71020 70885 71403 72463 73667 74482 74636 74439 74461 74829 75134 75071 74849 74785 74798 74642 74422
55296 74422 74491 74825 74848 74093 72882 72111 72369 73422 74543 75185 75292 75157 75190 75691 76639 77662 78370 78694 78864
55277 78864 79154 79739 80607 81358 81325 80288 78972 78403 78740 79196 79138 78812 78832 79437 80521 81958 83461 84405
$$ packed form
55405H2120J340Q87Q4r93j677j559j071p59m78J61R09J091N99O1j1J90K72K72
55387H1438M50O34L30m13q39m92K1k06j039j540j353j128j324j469j034l96k60
55370G1380n97q51q99j057j333j326q87k57M20J180J742J628Q87K30J03K09J62
55353G0734J72N66J008Q50J48k84O2P46J024P48K70j65n55p65o28k90p1M0K68
55334G3878L72k17j285j610m74J093J415K89q51q69j74J87j02n75p46m60J72P71
55316G0814Q40K85l75n44j35N18J060J204Q15J54j97K2L68L05o3k22o4J3j56k20
55296G4422O9L34K3p55j211p71K58J053J121O42J07j35L3N01R48J023P08L24J70
55277G8864K90N85Q68P51l3j037j316n69L37M56n8l26K0O05J084J437J503R44
$$ plain form
55259 84405 84235 83034 81476 80256 79636 79417 79246 79045 79060 79294 79127 78019 76506 75795 76231 76912 77052 76992
55241 76992 77356 77951 78149 77856 77384 76784 75995 75325 75117 75181 75150 75071 75017 74566 73471 72511 72667 73624 74083 73597
55221 73597 73081 73333 74058 74694 75328 76248 77295 78189 79023 79895 80465 80375 79801 79191 78706 78278 77968 77958 78356
55202 78356 79236 80654 82340 83608 83892 83283 82333 81413 80410 79008 77129 75144 73667 73020 72945 72940 72819
55185 72819 72733 72783 72905 73095 73424 73838 74215 74573 74939 75109 74882 74428 74077 73888 73847 74245 75211 76030 75772 74713
55165 74713 74319 75522 77754 79973 81869 83559 84804 85279 85222 85200 85437 85850 86462 87267 87988 88419 88748 89114
55147 89114 89187 88706 88079 87805 87589 86785 85586 84954 85265 85831 85965 85841 85882 85920 85509 84692 83870 83086 82078
55128 82078 81047 80798 81782 83348 84349 84404 84188 84485 85292 86043 86352 86202 85641 84755 83906 83491 83367 82968
$$ packed form
55259H4405j70j201j558j220o20k19j71k01J5K34j67j108j513p11M36O81J40o0
55241G6992L64N95J98k93m72o00p89o70k08O4l1p9n4m51j095r60J56R57M59m86
55221G3597n16K52P25O36O34R20J047Q94Q34Q72N70r0n74o10m85m28l10j0L98
55202G8356Q80J418J686J268K84o09r50r20j003j402j879j985j477o47p5nj21
55185G2819q6N0J22J90L29M14L77L58L66J70k27m54l51j89m1L98R66Q19k58j059
55165G4713l94J203K232K219J896J690J245M75n7k2K37M13O12Q05P21M31L29L66
55147H9114P3m81o27k74k16q04j199o32L11N66J34j24M1L8m11q17q22p84j008
55128H2078j031k49R84J566J001N5k16K97Q07P51L09j50n61q86q49m15j24l99
$$ plain form
55110 82968 82210 81868 82715 84548 86497 88042 89320 90470 91229 91368 91213 91429 92336 93562 94411 94502 94106
55093 94106 93877 94232 94961 95476 95451 95227 95481 96466 97666 98324 98286 98110 98407 99342 100825 102736 104681 105946
55075 105946 106157 105766 105407 104981 103960 102446 101186 100491 99864 98979 98317 98366 98732 98576 97674 96543 95726 95319
55057 95319 95059 94570 93643 92521 91741 91499 91406 91113 90849 90979 91335 91425 91152 90898 90977 91384 91999 92645 93008 92887
55037 92887 92618 92873 93868 94944 95094 93947 92201 91071 91183 92001 92533 92558 92794 93785 95097 96004 96543 97371
55019 97371 98767 100339 101697 102886 104010 104808 104837 103961 102557 101313 100760 100900 101328 101828 102638 104007 105680
55002 105680 107076 107823 107849 107111 105559 103356 100944 98893 97730 97648 98256 98944 99712 101236 103699 106036
54986 106036 106919 106234 104936 103720 102626 101873 102057 103186 104236 104192 103132 101908 101128 100769 100488 99919 98868
$$ packed form
55110H2968p58l42Q47J833J949J545J278J150P59J39j55K16R07J226Q49R1l96
55093I4106k29L55P29N15k5k24K54R85J200O58l8j76K97R35J483J911J945J265
55075A05946K11l91l59m26j021j514j260o95o27q85o62M9L66j56r02j131q17m07
55057I5319k60m89r27j122p80k42r3k93k64J30L56R0k73k54P9M07O15O46L63j21
55037I2887k69K55R95J076J50j147j746j130J12Q18N32K5K36R91J312R07N39Q28
55019I7371J396J572J358J189J124P98K9q76j404j244n53J40M28N00Q10J369J673
55002A05680J396P47K6p38j552k203k412k051j163q2O08O88P68J524K463K337
54986A06036Q83o85j298j216j094p53J84J129J050m4j060j224p80l59k81n69j051
$$ plain form
54969 98868 97560 96615 96609 97706 99687 102050 104042 104987 104805 103995 103004 101963 101092 100819 101230 101866 102435 103277
54951 103277 104627 105806 105819 104601 103073 102031 101574 101637 102299 103268 103636 102762 101205 100300 100778 102126 103321
54934 103321 103849 103897 103825 103823 104039 104738 106065 107772 109385 110668 111818 113214 115141 117764 121123 125013 129028
54917 129028 132962 137137 142150 148183 154600 160204 163888 165176 164342 162121 159271 156258 153168 149815
54903 149815 145992 141756 137470 133490 129875 126552 123632 121289 119344 117366 115341 113844 113269 113181 112844
54888 112844 112221 111971 112491 113418 114200 114757 115386 116315 117646 119517 122033 125104 128559 132369 136583 141171
54872 141171 146132 151596 157492 163154 167622 170424 171786 171949 170627 167453 162712 157202 151457 145512
54858 145512 139485 133924 129343 125678 122526 119740 117443 115585 113852 112063 110350 108849 107463 106022
$$ packed form
54969I8868j308r45oJ097J981K363J992R45j82q10r91j041q71k73M11O36N69Q42
54951A03277J350J179J3j218j528j042m57O3O62R69L68q74j557r05M78J348J195
54934A03321N28M8p2kK16O99J327J707J613J283J150J396J927K623L359L890M015
54917A29028L934M175N013O033O417N604L684J288q34k221k850l013l090l353
54903A49815l823m236m286l980l615l323k920k343j945j978k025j497n75q8l37
54888A12844o23k50N20R27P82N57O29R29J331J871K516L071L455L810M214M588
54872A41171M961N464N896N662M468K802J362J63j322l174m741n510n745n945
54858A45512o027n561m581l665l152k786k297j858j733j789j713j501j386j441
$$ plain form
54844 106022 104450 102675 100737 99127 98654 99569 101012 101765 101459 100661 99853 98955 97935 97263 97367 98029 98727
54827 98727 99256 99598 99505 98808 98008 97933 98750 99830 100640 101250 101782 101996 101756 101484 101678 102253 102783 103199 103834
54808 103834 104853 105961 106699 106817 106460 106116 106241 106768 107206 107369 107687 108488 109354 109645 109386 109085 108882 108506
54790 108506 107996 107795 108071 108496 108834 109218 109672 109908 109810 109722 110012 110735 111868 113395 114954 115886 116013 116025 116754
54771 116754 118356 120439 122671 124976 127460 130439 134227 138686 143364 148291 154055 160676 167002 171878
54757 171878 175443 178524 181031 181860 180330 176919 172432 167161 161167 154868 148908 143681 139166 135110
54743 135110 131332 128019 125650 124347 123445 122137 120481 119264 118821 118528 117718 116658 116265 117095 118859 120781
54727 120781 122237 123221 124387 126609 130281 135000 139816 143871 146993 149861 153392 157684 161731 164456
$$ packed form
54844A06022j572j775j938j610m73R15J443P53l06p98q08q98j020o72J04O62O98
54827I8727N29L42r3o97q00p5Q17J080Q10O10N32K14k40k72J94N75N30M16O35
54808A03834J019J108P38J18l57l44J25N27M38J63L18Q01Q66K91k59l01k03l76
54790A08506n10k01K76M25L38L84M54K36r8q8K90P23J133J527J559R32J27J2P29
54771A16754J602K083K232K305K484K979L788M459M678M927N764O621O326M876
54757A71878L565L081K507Q29j530l411m487n271n994o299n960n227m515m056
54743A35110l778l313k369j303r02j308j656j217m43k93q10j060l93Q30J764J922
54727A20781J456R84J166K222L672M719M816M055L122K868L531M292M047K725
$$ plain form
54713 164456 165792 166343 166245 165041 162644 159645 156426 152653 148025 143042 138522 134676 131138 127675 124396
54698 124396 121436 118882 116990 116090 116125 116481 116327 115132 112988 110557 108581 107327 106563 106131 106235 107016
54682 107016 108119 108982 109413 109556 109405 108745 107593 106363 105505 105157 105275 105874 106973 108390 109734 110620 110840
54665 110840 110369 109363 108167 107177 106535 105953 105026 103784 102821 102799 103931 105977 108425 110530 111516 111219 110477
54648 110477 110402 111211 112118 112389 112093 111678 111321 110974 110715 110674 110832 111205 111990 113145 113955 113499 111649 109347
54630 109347 107769 107332 107513 107442 106574 105005 103345 102329 102419 103575 105223 106538 106982 106742 106471 106544 106703
54613 106703 106571 106309 106474 107278 108275 108874 108941 108754 108573 108496 108678 109282 110091 110491 110201 109803 110073 110805 110949
54594 110949 110099 109241 109515 110732 111766 112151 112518 113431 114538 115068 114690 113664 112607 112220 112796 113782 114281
$$ packed form
54713A64456J336N51r8j204k397k999l219l773m628m983m520l846l538l463l279
54698A24396k960k554j892r00L5L56j54j195k144k431j976j254p64m32J04P81
54682A07016J103Q63M31J43j51o60j152j230q58l48J18N99J099J417J344Q86K20
54665A10840m71j006j196r90o42n82r27j242r63k2J132K046K448K105R86k97p42
54648A10477p5Q09R07K71k96m15l57l47k59m1J58L73P85J155Q10m56j850k302
54630A09347j578m37J81p1q68j569j660j016R0J156J648J315M44k40k71P3J59
54613A06703j32k62J65Q04R97N99O7j87j81p7J82O04Q09M00k90l98K70P32J44
54594A10949q50q58K74J217J034L85L67R13J107N30l78j026j057l87N76R86M99
$$ plain form
54577 114281 114133 114025 114362 114619 114183 113291 112629 112387 112235 111947 111549 111018 110325 109689 109445 109697 110323 111088 111537
54558 111537 111170 110149 109526 110221 111960 113649 114610 114914 114771 114331 114088 114723 116286 118035 119296 120083 120675
54541 120675 121063 121101 120927 120852 120943 120921 120487 119717 119195 119577 120824 122005 122207 121564 121038 121188 121650 121870 121814 121680
54521 121680 121356 120544 119243 117780 116468 115459 114777 114294 113783 113202 112880 113240 114351 115853 117271 118348
54505 118348 119079 119515 119564 119093 118249 117520 117301 117519 117869 118307 119005 119860 120408 120338 119847 119403 119391 119989 121119
54486 121119 122394 123368 123970 124510 125186 125769 125872 125395 124682 124371 125023 126577 128166 128741 127997 126496 125008
54469 125008 124048 123929 124682 125822 126698 127307 128292 129971 131845 133279 134156 134639 134880 135320 136562 138384 139465
54452 139465 138813 137064 135618 134898 134261 133296 132251 131271 130202 129241 128869 128979 128865 128312 127913 127985 127915 127014
$$ packed form
54577A14281j48j08L37K57m36q92o62k42j52k88l98n31o93o36k44K52O26P65M49
54558A11537l67j021o23O95J739J689R61L04j43m40k43O35J563J749J261P87N92
54541A20675L88L8j74p5R1k2m34p70n22L82J247J181K02o43n26J50M62K20n6j34
54521A21680l24q12j301j463j312j009o82m83n11n81l22L60J111J502J418J077
54505A18348P31M36M9m71q44p29k19K18L50M38O98Q55N48p0m91m44j2N98J130
54486A21119J275R74O02N40O76N83J03m77p13l11O52J554J589N75p44j501j488
54469A25008r60j19P53J140Q76O09R85J679J874J434Q77M83K41M40J242J822J081
54452A39465o52j749j446p20o37r65j045r80j069r61l72J10j14n53l99P2p0r01
$$ plain form
54434 127014 125414 123776 122700 122741 124199 126373 127732 127534 126754 126788 127747 128815 129731 130896 132288 133301
54418 133301 133682 133741 133614 133161 132656 132661 133009 132765 131542 130050 128921 127832 126484 125736 126788 129512 132445
54401 132445 134444 135655 136759 137905 138688 138808 138400 137840 137432 137284 137439 138010 139072 140431 141676 142580
54385 142580 143237 143725 143879 143621 143296 143430 144202 145307 146164 146147 144926 142932 141291 140936 141858 143453 145409
54368 145409 147849 150791 153941 157039 160044 162914 165502 167689 169352 170290 170519 170564 170997 171674 171872 171250
54352 171250 170119 168651 166436 163238 159724 156830 154623 152303 149381 146448 144596 144259 144713 144696 143526
54337 143526 141643 140079 139466 139684 140289 140892 141093 140533 139277 137930 137119 137025 137596 138856 140614 142131 142617
54320 142617 142095 141362 141040 141020 140950 140882 141069 141364 141259 140551 139631 138939 138386 137652 136845 136455 136607 136810 136641 136304
$$ packed form
54434A27014j600j638j076M1J458K174J359j98p80L4R59J068R16J165J392J013
54418A33301L81N9j27m53n05NL48k44j223j492j129j089j348p48J052K724K933
54401A32445J999J211J104J146P83J20m08n60m08j48J55N71J062J359J245R04
54385A42580O57M88J54k58l25J34P72J105Q57j7j221j994j641l55R22J595J956
54368A45409K440K942L150L098L005K870K588K187J663R38K29M5M33O77J98o22
54352A71250j131j468k215l198l514k894k207k320k922k933j852l37M54j7j170
54337A43526j883j564o13K18O05O03K01n60j256j347q11r4N71J260J758J517M86
54320A42617n22p33l22k0p0o8J87K95j05p08r20o92n53p34q07l90J52K03j69l37
$$ plain form
54300 136304 136155 136002 135351 134171 132923 131919 131156 130769 131050 131885 132671 133010 133101 133272 133606 134194 135275 136811
54282 136811 138321 139483 140536 141813 143249 144619 145874 146893 147341 147186 146950 146961 146717 145566 143709 141985
54266 141985 140934 140615 141042 142079 143120 143630 143943 144809 146194 147323 147962 148787 150221 151741 152795 153706
54250 153706 155020 156386 156813 155885 154237 152823 152090 151840 151571 150870 149661 148204 146909 146129 145993 146291
54234 146291 146594 146700 146889 147513 148434 149209 149735 150283 150891 151169 150874 150267 149709 149243 148769 148340 148054 147919 147962
54215 147962 148193 148337 147946 147003 146130 145928 146342 146848 147000 146602 145682 144619 144013 144116 144516 144611 144180 143304 142102
54196 142102 140903 140397 141066 142582 144134 145300 146230 147116 147921 148648 149404 150093 150407 150292 150141 150368 150979
54179 150979 151751 152619 153636 154634 155175 154963 154227 153575 153379 153396 153090 152280 151321 150657 150433 150591 151090 151838 152536
$$ packed form
54300A36304j49j53o51j180j248j004p63l87K81Q35P86L39R1J71L34N88J081J536
54282A36811J510J162J053J277J436J370J255J019M48j55k36J1k44j151j857j724
54266A41985j051l19M27J037J041N10L13Q66J385J129O39Q25J434J520J054R11
54250A53706J314J366M27r28j648j414p33k50k69p01j209j457j295p80j36K98
54234A46291L03J06J89O24R21P75N26N48O08K78k95o07n58m66m74m29k86j35M3
54215A47962K31J44l91r43q73k02M14N06J52l98r20j063o06J03M00R5m31q76j202
54196A42102j199n06O69J516J552J166R30Q86Q05P27P56O89L14j15j51K27O11
54179A50979P72Q68J017R98N41k12p36o52j96J7l06q10r59o64k24J58M99P48O98
$$ plain form
54160 152536 152848 152648 151979 150910 149669 148803 148847 149727 150651 150766 149892 148606 147674 147409 147551 147674 147666 147761 148152
54141 148152 148670 148864 148333 147043 145475 144397 144255 144737 145156 145317 145750 146937 148563 149769 149996 149366 148401
54124 148401 147632 147426 147900 148880 150007 150954 151573 152004 152629 153739 155112 156126 156468 156651 157574 159630 162353
54107 162353 164925 166873 168306 169618 171026 172459 173930 175855 178663 182093 185225 187391 188744 189719
54093 189719 190268 189979 188706 186670 184128 181395 179094 177810 177383 176995 176180 175450 175666 177057 179143 181444
54077 181444 183867 186377 188626 190142 190787 190853 190715 190526 190232 189717 188816 187391 185561 183724 182167 180779
54061 180779 179322 177807 176359 174924 173495 172392 171832 171415 170730 170405 171569 174126 176557 177969 179343
54046 179343 181914 185183 187734 189483 191767 195344 199579 203772 208050 212528 216713 220397 224367 229477
$$ packed form
54160A52536L12k00o69j069j241q66M4Q80R24J15q74j286r32k65J42J23qR5L91
54141A48152N18J94n31j290j568j078j42M82M19J61M33J187J626J206K27o30r65
54124A48401p69k06M74R80J127R47O19M31O25J110J373J014L42J83R23K056K723
54107A62353K572J948J433J312J408J433J471J925K808L430L132K166J353R75
54093A89719N49k89j273k036k542k733k301j284m27l88q15p30K16J391K086K301
54077A81444K423K510K249J516O45O6j38j89k94n15r01j425j830j837j557j388
54061A80779j457j515j448j435j429j103n60m17o85l25J164K557K431J412J374
54046A79343K571L269K551J749K284L577M235M193M278M478M185L684L970N110
$$ plain form
54032 229477 235556 241822 247871 253578 258502 262210 265037 267752 270489 272549 273363 273156 272559 271957 271337
54017 271337 270483 269118 267085 264565 262046 259965 258363 256853 254844 251852 247725 242640 236978 231291
54003 231291 226286 222488 219726 217144 213977 210305 206900 204448 203083 202503 202270 201910 200965 199178 196756
53988 196756 194376 192797 192284 192432 192610 192461 191860 190688 189052 187639 187288 188057 189178 190123 191201 192809
53972 192809 194652 196296 198142 201137 205584 210844 216307 222159 228979 236948 245580 253938 261025 266188
53958 266188 269245 270048 268132 263269 256384 249244 242972 237326 231797 226930 223939 223264 224149 225614 227365
53943 227365 229616 232469 235710 238968 241899 244442 247051 250440 254860 259717 264085 267522 270230 272592
53929 272592 274788 276859 278821 280625 282216 283803 285960 289204 293436 297942 302086 305894 309842 314142
$$ packed form
54032B29477O079O266O049N707M924L708K827K715K737K060Q14k07n97o02o20
54017B71337q54j365k033k520k519k081j602j510k009k992m127n085n662n687
54003B31291n005l798k762k582l167l672l405k452j365n80k33l60r45j787k422
53988A96756k380j579n13J48J78j49o01j172j636j413l51P69J121R45J078J608
53972A92809J843J644J846K995M447N260N463N852O820P969Q632Q358P087N163
53958B66188L057Q03j916m863o885p140o272n646n529m867k991o75Q85J465J751
53943B27365K251K853L241L258K931K543K609L389M420M857M368L437K708K362
53929B72592K196K071J962J804J591J587K157L244M232M506M144L808L948M300
$$ plain form
53915 314142 318483 322620 326958 332257 338724 345636 351946 357071 360996 363894 365886 367028 367219 366221 364067
53900 364067 361441 359260 357782 356380 354296 351330 347670 343389 338397 332671 326232 319066 311396 303877
53886 303877 297132 291085 285123 278986 273212 268580 265359 263177 261377 259357 256822 253926 251075 248430
53872 248430 245691 242465 238754 234974 231592 228851 226746 225099 223667 222227 220519 218166 214885 210914
53858 210914 207066 204159 202435 201577 201150 200848 200428 199706 198666 197465 196301 195411 195068 195335 195755 195582 194553
53841 194553 193301 192728 193008 193461 193440 193096 193049 193494 193950 193939 193590 193411 193675 194308 195192 196271 197335 198035 198262
53822 198262 198306 198481 198724 198709 198258 197544 197003 197131 198233 200147 202301 204161 205642 207030 208674 210909 214099
53805 214099 218407 223478 228552 233028 236833 240291 243820 247771 252256 256940 261223 264825 268117 271626
$$ packed form
53915C14142M341M137M338N299O467O912O310N125L925K898J992J142J91r98k154
53900C64067k626k181j478j402k084k966l660m281m992n726o439p166p670p519
53886C03877o745o047n962o137n774m632l221k182j800k020k535k896k851k645
53872B48430k739l226l711l780l382k741k105j647j432j440j708k353l281l971
53858B10914l848k907j724q58m27l02m20p22j040j201j164q90l43K67M20j73j029
53841A94553j252n73K80M53k1l44m7M45M56j1l49j79K64O33Q84J079J064P00K27
53822A98262M4J75K43j5m51p14n41J28J102J914K154J860J481J388J644K235L190
53805B14099M308N071N074M476L805L458L529L951M485M684M283L602L292L509
$$ plain form
53791 271626 275270 278381 280545 282175 284066 286483 288889 290551 291243 291284 290988 290207 288429 285266 280799
53776 280799 275471 269807 264341 259652 256077 253263 250309 246659 242681 239025 235581 231588 226805 222010
53762 222010 218064 214948 212135 209513 207375 205726 204238 202888 201987 201418 200470 198742 196790 195496 195105
53747 195105 195288 195846 196780 197783 198201 197740 196841 196204 196150 196582 197345 198321 199321 200150 200860 201722 202826 203848
53729 203848 204432 204788 205638 207445 209835 212003 213552 214701 215803 217014 218423 220058 221609 222568 222947
53714 222947 223545 225110 227435 229679 231468 233197 235266 237493 239472 241199 243062 245375 248104 250975
53700 250975 253684 256067 258148 260089 262117 264527 267589 271302 275303 279222 283044 286844 290301 292831
53686 292831 294220 294703 294325 292705 289787 286428 283809 282363 281621 280921 279917 278533 276910 275484 274692
$$ packed form
53791B71626L644L111K164J630J891K417K406J662O92M1k96p81j778l163m467
53776B80799n328n664n466m689l575k814k954l650l978l656l444l993m783m795
53762B22010l946l116k813k622k138j649j488j350r01n69r48j728j952j294l91
53747A95105J83N58R34J003M18m61q99o37n4M32P63R76J000Q29P10Q62J104J022
53729B03848N84L56Q50J807K390K168J549J149J102J211J409J635J551R59L79
53714B22947N98J565K325K244J789J729K069K227J979J727J863K313K729K871
53700B50975K709K383K081J941K028K410L062L713M001L919L822L800L457K530
53686B92831J389M83l78j620k918l359k619j446p42p00j004j384j623j426p92
$$ plain form
53671 274692 274452 274236 273806 273588 274089 275184 276262 276953 277395 277798 278025 277796 277196 276762 276958 277656 278270 278408
53653 278408 278272 278313 278648 278919 278653 277685 276411 275768 276737 279438 282754 285211 286268 286500 286599 286750 287138 288409
53635 288409 291097 294866 298799 302324 305530 308714 312036 315561 319204 322607 325402 327644 329717 331807
53621 331807 333788 335651 337691 340141 342895 345703 348442 351122 353835 356761 359958 363189 366191 369110
53607 369110 372359 375986 379564 382726 385415 387533 388941 390001 391574 394024 396602 398265 398808 398790 398678
53592 398678 398628 398845 399513 400378 400907 400842 400205 398861 396618 393795 391126 388944 386902 384620 382182 379815
53576 379815 377578 375645 374472 374239 374317 373708 372039 369918 368349 367876 368147 368208 367294 365477 363528 362178
53560 362178 361677 361995 363001 364262 365030 364882 364318 364404 365782 368186 370891 373419 375757 378101 380534 382964
$$ packed form
53671B74692k40k16m30k18N01J095J078O91M42M03K27k29o00m34J96O98O14J38
53653B78408j36M1L35K71k66r68j274o43R69K701L316K457J057K32R9J51L88J271
53635B88409K688L769L933L525L206L184L322L525L643L403K795K242K073K090
53621C31807J981J863K040K450K754K808K739K680K713K926L197L231L002K919
53607C69110L249L627L578L162K689K118J408J060J573K450K578J663N43j8j12
53592C98678n0K17O68Q65N29o5o37j344k243k823k669k182k042k282k438k367
53576C79815k237j933j173k33P8o09j669k121j569m73K71O1r14j817j949j350
53560C62178n01L18J006J261P68j48n64Q6J378K404K705K528K338K344K433K430
$$ plain form
53544 382964 385300 387606 390052 392766 395864 399538 403914 408727 413317 417192 420602 424462 429669 436441
53530 436441 444238 452268 460126 468055 476701 486613 497889 510114 522617 534975 547437 560702 575212
53517 575212 590794 607161 624507 643282 663521 684719 706336 728116 750006 772142 794916
53506 794916 818572 842640 866211 888922 911286 933809 956217 977899 998802 1019441 1040176
53495 1040176 1060859 1081090 1100486 1118709 1135622 1151528 1167100 1182995 1199505 1216551 1233857
53484 1233857 1251123 1268131 1284763 1301023 1317110 1333369 1349936 1366364 1381780 1395418 1406866
53473 1406866 1415854 1422163 1425876 1427376 1426880 1424155 1418884 1411128 1401244 1389618 1376737 1363393 1350440
53460 1350440 1338256 1326576 1314799 1302388 1289058 1274723 1259272 1242458 1224147 1204713 1184905
$$ packed form
53544C82964K336K306K446K714L098L674M376M813M590L875L410L860N207O772
53530D36441P797Q030P858P929Q646R912J1276J2225J2503J2358J2462J3265J4510
53517E75212J5582J6367J7346J8775K0239K1198K1617K1780K1890K2136K2774
53506G94916K3656K4068K3571K2711K2364K2523K2408K1682K0903K0639K0735
53495A040176K0683K0231J9396J8223J6913J5906J5572J5895J6510J7046J7306
53484A233857J7266J7008J6632J6260J6087J6259J6567J6428J5416J3638J1448
53473A406866Q988O309L713J500m96k725n271p756r884j1626j2881j3344j2953
53460A350440j2184j1680j1777j2411j3330j4335j5451j6814j8311j9434j9808
$$ plain form
53449 1184905 1165299 1146112 1127610 1110288 1094339 1079213 1064104 1048873 1034320 1021637 1011694
53438 1011694 1004591 999685 996125 993515 991916 991165 990639 990031 990049 991853 995839 1001373 1007665 1014547 1022344
53423 1022344 1031287 1041278 1052166 1064132 1077707 1093251 1110407 1128306 1146419 1165036 1184841 1206316
53411 1206316 1229651 1254836 1281600 1309603 1338969 1370291 1403782 1438785 1474527 1511092 1549188
53400 1549188 1589275 1631432 1675819 1722566 1771234 1820955 1871172 1921890 1973296 2025558 2078811
53389 2078811 2132753 2186359 2238596 2289410 2339348 2388237 2435014 2479009 2520615 2560306 2597620
53378 2597620 2631519 2661212 2686194 2706065 2720910 2731486 2738401 2741292 2739330 2732296 2720498 2703693
53366 2703693 2680833 2651151 2615147 2574273 2530040 2483664 2436219 2388564 2340980 2293227 2245113
$$ packed form
53449A184905j9606j9187j8502j7322j5949j5126j5109j5231j4553j2683r943
53438A011694p103m906l560k610j599p51n26o08J8J804L986N534O292O882P797
53423A022344Q943R991J0888J1966J3575J5544J7156J7899J8113J8617J9805K1475
53411A206316K3335K5185K6764K8003K9366L1322L3491L5003L5742L6565L8096
53400A549188M0087M2157M4387M6747M8668M9721N0217N0718N1406N2262N3253
53389B078811N3942N3606N2237N0814M9938M8889M6777M3995M1606L9691L7314
53378B597620L3899K9693K4982J9871J4845J0576O915K891j962p034j1798j6805
53366B703693k2860k9682l6004m0874m4233m6376m7445m7655m7584m7753m8114
$$ plain form
53355 2245113 2196924 2149248 2102625 2057594 2014840 1974837 1937277 1901163 1865621 1830336 1795142
53344 1795142 1759660 1723688 1687644 1652292 1618275 1586222 1556940 1530890 1507582 1485996 1465553
53333 1465553 1446298 1428329 1411667 1396599 1383457 1371822 1360474 1348366 1335248 1321227 1306219
53322 1306219 1290122 1273166 1255873 1238932 1223181 1209247 1197022 1185860 1175490 1166346 1158854 1152879
53310 1152879 1148173 1144914 1143383 1143390 1144374 1145928 1148031 1150983 1155344 1161644 1169992 1180160 1192104 1206015
53296 1206015 1221794 1239061 1257920 1279062 1302594 1327331 1351820 1375680 1399281 1422528 1444829
53285 1444829 1466073 1486691 1506578 1524657 1539841 1551928 1561291 1568146 1572456 1574232 1573511 1570158 1563987
53272 1563987 1555070 1543729 1530253 1514788 1497513 1478759 1458811 1437645 1415054 1391073 1366124
$$ packed form
53355B245113m8189m7676m6623m5031m2754m0003l7560l6114l5542l5285l5194
53344A795142l5482l5972l6044l5352l4017l2053k9282k6050k3308k1586k0443
53333A465553j9255j7969j6662j5068j3142j1635j1348j2108j3118j4021j5008
53322A306219j6097j6956j7293j6941j5751j3934j2225j1162j0370r144p492n975
53310A152879m706l259j531PR84J554K103K952M361O300Q348J0168J1944J3911
53296A206015J5779J7267J8859K1142K3532K4737K4489K3860K3601K3247K2301
53285A444829K1244K0618J9887J8079J5184J2087R363O855M310J776p21l353o171
53272A563987q917j1341j3476j5465j7275j8754j9948k1166k2591k3981k4949
$$ plain form
53261 1366124 1340630 1314711 1288475 1262353 1236707 1211250 1185416 1159393 1134164 1110302 1087252
53250 1087252 1064185 1041087 1018503 996596 975042 953589 932169 910567 888635 866803 845852
53239 845852 826100 807282 789308 772579 757353 743275 729945 717665 707143 698497 690958 683698
53227 683698 676590 669854 663086 655175 645394 634188 622470 610393 597322 582940 567710 552180
53215 552180 536504 520938 506170 492639 480014 467921 456807 447394 439457 431818 423583 414917
53203 414917 406537 398845 391575 383982 375408 366001 356803 348788 341805 334781 326902 318299 309746 302107
53189 302107 296028 291664 288524 285851 283195 280453 277546 274458 271433 268704 266052 263183 260506 258988
53175 258988 258986 259693 259927 259098 257267 254742 252027 249865 248870 249092 250033 251022 251483 251098 249888 248127 246146
$$ packed form
53261A366124k5494k5919k6236k6122k5646k5457k5834k6023k5229k3862k3050
53250A087252k3067k3098k2584k1907k1554k1453k1420k1602k1932k1832k0951
53239H45852j9752j8818j7974j6729j5226j4078j3330j2280j0522q646p539p260
53227F83698p108o736o768p911r781j1206j1718j2077j3071j4382j5230j5530
53215E52180j5676j5566j4768j3531j2625j2093j1114r413p937p639q235q666
53203D14917q380p692p270p593q574r407r198q015o983p024p879q603q553p639
53189C02107o079m364l140k673k656k742k907l088l025k729k652k869k677j518
53175B58988kP07K34q29j831k525k715k162r95K22R41R89M61l85j210j761j981
$$ plain form
53158 246146 244290 242960 242428 242519 242725 242726 242628 242685 242960 243358 243733 243847 243376 242133 240331 238552 237394 236936
53140 236936 236528 235419 233786 232843 233594 235676 237814 239226 240124 241039 242210 243662 245340 246999 248364
53125 248364 249514 250762 252084 253082 253559 253772 254044 254491 255201 256265 257515 258641 259653 260864 262326 263686
53109 263686 264670 265343 265813 266052 266033 265592 264229 261617 258346 255476 253266 251096 248781 247054 246348 246014
53093 246014 245312 244439 243845 243229 242056 240558 239402 238730 238332 238343 238871 239210 238454 236824 235507 235140 235300
53076 235300 235506 235825 236187 235945 234588 232467 230472 229286 229049 229300 229182 228197 226881 226256 226536 226945 226909
53059 226909 226736 226841 227025 226989 226956 227199 227392 227053 226396 226126 226545 227355 228208 228963 229488 229748 230107 231079 232634
53040 232634 234077 234749 234642 234292 234278 234800 235515 235803 235421 234869 234781 235025 234818 233846 232859 232905 234268 236367 238420
$$ packed form
53158B46146j856j330n32R1K06Jr8N7K75L98L75J14m71j243j802j779j158m58
53140B36936m08j109j633r43P51K082K138J412Q98R15J171J452J678J659J365
53125B48364J150J248J322R98M77K13K72M47P10J064J250J126J012J211J462J360
53109B63686R84O73M70K39j9m41j363k612l271k870k210k170k315j727p06l34
53093B46014p02q73n94o16j173j498j156o72l98J1N28L39p56j630j317l67J60
53076B35300K06L19L62k42j357k121j995j186k37K51j18r85j316o25K80M09l6
53059B26909j73J05J84l6l3K43J93l39o57k70M19Q10Q53P55N25K60L59R72J555
53040B32634J443O72j07l50j4N22P15K88l82n52q8K44k07r72r87M6J363K099K053
$$ plain form
53021 238420 239829 240234 239684 238808 238425 238824 239634 240348 240712 240622 240071 239425 239375 240324 242007 243927 245903 247782
53003 247782 248988 248926 247856 246779 246335 246280 246214 246252 246594 246888 246608 245870 245336 245360 245635 245735 245576 245360 245481
52984 245481 246564 249109 252774 256317 258610 259656 260434 261890 264282 267321 270511 273305 275270 276414
52970 276414 277251 278278 279348 279710 278867 277272 275980 275610 275853 276041 275900 275524 274894 273853 272510 271294
52954 271294 270486 269962 269416 268584 267221 265280 263285 262095 261962 262111 261650 260609 259547 258421 256624 254255
52938 254255 252510 252311 253057 253406 252972 252557 252782 253227 253174 252605 252074 251936 252113 252416 252694 252758 252466 251922 251390
52919 251390 251027 250842 250801 250776 250505 249854 249043 248374 247804 247078 246175 245309 244501 243568 242570 241866 241565 241351 241082
52900 241082 241197 242184 243898 245713 247212 248450 249692 251132 252724 254093 254754 254642 254198 253748 253086 252013
$$ packed form
53021B38420J409M05n50q76l83L99Q10P14L64r0n51o46n0R49J683J920J976J879
53003B47782J206o2j070j077m44n5o6L8L42K94k80p38n34K4K75J00j59k16J21
52984B45481J083K545L665L543K293J046P78J456K392L039L190K794J965J144
52970B76414Q37J027J070L62q43j595j292l70K43J88j41l76o30j041j343j216
52954B71294q08n24n46q32j363j941j995j190j33J49m61j041j062j126j797k369
52938B54255j745j99P46L49m34m15K25M45n3n69n31j38J77L03K78O4k92n44n32
52919B51390l63j85m1k5k71o51q11o69n70p26r03q66q08r33r98p04l01k14k69
52900B41082J15R87J714J815J499J238J242J440J592J369O61j12m44m50o62j073
$$ plain form
52884 252013 250931 250364 250101 249493 248589 248292 249222 250963 252720 254220 255637 257034 258277 259273 259919 260029
52868 260029 259674 259380 259619 260210 260623 260785 261219 262394 264288 266593 268898 270591 270958 269758 267531 265090
52852 265090 262755 260210 257059 253341 249537 246204 243611 241646 239968 238206 236062 233428 230600 228284
52838 228284 227107 227008 227316 227480 227486 227435 227142 226531 226181 226878 228529 230028 230473 230138 229993 230539 231522 232496 233155
52819 233155 233114 231977 229896 227716 226281 225787 225989 226747 227970 229272 230137 230512 230873 231615 232666 233756
52803 233756 234697 235200 234805 233363 231391 229541 227836 225842 223547 221583 220489 220198 220431 221152 222315 223532
52787 223532 224428 225122 225923 226735 227216 227438 227880 228705 229526 229988 230186 230347 230439 230222 229436 227882 225741 223863
52769 223863 223186 223649 224162 223983 223593 223775 224365 224547 224041 223316 222851 222875 223654 225203 226709 227048 226157 225292
$$ packed form
52884B52013j082n67k63o08r04k97R30J741J757J500J417J397J243R96O46J10
52868B60029l55k94K39N91M13J62M34J175J894K305K305J693L67j200k227k441
52852B65090k335k545l151l718l804l333k593j965j678j762k144k634k828k316
52838B28284j177r9L08J64On1k93o11l50O97J651J499M45l35j45N46R83R74O59
52819B33155m1j137k081k180j435m94K02P58J223J302Q65L75L61P42J051J090
52803B33756R41N03l95j442j972j850j705j994k295j964j094k91K33P21J163J217
52787B23532Q96O94Q01Q12M81K22M42Q25Q21M62J98J61R2k17p86j554k141j878
52769B23863o77M63N13j79l90J82N90J82n06p25m65K4P79J549J506L39q91q65
$$ plain form
52751 225292 225697 227457 229791 231863 233076 233247 233000 233513 235367 237901 240114 241900 243909 246475 249234
52736 249234 251716 253766 255294 256036 255805 254790 253475 252284 251391 250823 250721 251323 252569 253820 254292 253825
52720 253825 252958 252184 251479 250634 249652 248592 247388 246156 245386 245411 245853 245996 245640 245256 245311 245695 245866 245407
52702 245407 244424 243483 243106 243299 243714 244219 245057 246338 247715 248730 249238 249292 248927 248285 247697 247387 247272 247180
52684 247180 246969 246348 245022 243300 242115 241991 242326 242102 241012 239526 238182 237322 237194 237802 238811 239952
52668 239952 241230 242371 242582 241531 240141 239626 240063 240745 241593 243123 245137 246661 247443 248462 250502 253150
52652 253150 255721 258345 261438 264669 267145 268304 268136 266901 265115 263405 261889 260024 257577 255392
52638 255392 254599 255204 256063 256234 255881 255768 256347 257528 259148 261339 264325 267982 271867 275792 280004 284370
$$ packed form
52751B25292M05J760K334K072J213J71k47N13J854K534K213J786K009K566K759
52736B49234K482K050J528P42k31j015j315j191q93n68j02O02J246J251M72m67
52720B53825q67p74p05q45r82j060j204j232p70K5M42J43l56l84N5L84J71m59
52702B45407r83r41l77J93M15N05Q38J281J377J015N08N4l65o42n88l10j15r2
52684B47180k11o21j326j722j185j24L35k24j090j486j344q60j28O08J009J141
52668B39952J278J141K11j051j390n15M37O82Q48J530K014J524P82J019K040K648
52652B53150K571K624L093L231K476J159j68j235j786j710j516j865k447k185
52638B55392p93O05Q59J71l53j13N79J181J620K191K986L657L885L925M212M366
$$ plain form
52622 284370 287672 288463 286671 283671 280642 277566 274170 270972 268688 267120 265451 263410 261409 259695
52608 259695 258039 256301 254724 253568 252880 252697 253094 253899 254691 255207 255548 255926 256413 256971 257520 257923 258092
52591 258092 258171 258445 259053 259863 260630 261208 261617 262010 262595 263530 264864 266459 267936 268850 269144 269283 269675 270124
52573 270124 270240 270203 270517 270999 270788 269597 268249 267508 267039 266088 264702 263533 262804 262248 261893 262127 262943 263732
52555 263732 263939 263472 262423 260844 258880 256757 254648 252844 252000 252698 254633 256595 257473 257079 256010 254976
52539 254976 254283 253779 253260 252972 253549 255238 257406 259097 259891 259953 259579 259154 259225 259990 260851 261088 260862 260859 261037
52520 261037 260592 259361 258430 258900 260606 262531 264056 265290 266482 267668 268868 270295 272263 274957 278268
52505 278268 281830 285271 288340 290639 291505 290521 288106 285197 282455 280116 278432 277584 277148 276321 274839
$$ packed form
52622B84370L302P91j792l000l029l076l396l198k284j568j669k041k001j714
52608B59695j656j738j577j156o88j83L97Q05P92N16L41L78M87N58N49M03J69
52591B58092P9K74O08Q10P67N78M09L93N85R35J334J595J477R14K94J39L92M49
52573B70124J16l7L14M82k11j191j348p41m69r51j386j169p29n56l55K34Q16P89
52555B63732K07m67j049j579j964k123k109j804q44O98J935J962Q78l94j069j034
52539B54976o93n04n19k88N77J689K168J691P94O2l74m25P1P65Q61K37k26lJ78
52520B61037m45j231r31M70J706J925J525J234J192J186J200J427J968K694L311
52505B78268L562L441L069K299Q66r84k415k909k742k339j684q48m36q27j482
$$ plain form
52490 274839 273114 271344 269222 266822 265029 264495 264669 264450 263482 262296 261470 261177 261379 261960 262676 263334 263992
52473 263992 264776 265656 266536 267390 268177 268955 270179 272420 275538 278632 281196 283809 287164 290847 293777 295520
52457 295520 296452 296804 296321 294913 292982 290958 288940 286835 284416 281308 277381 273227 269771 267331 265435
52442 265435 263582 261772 260313 259546 259741 260755 261774 261967 261457 261123 261324 261455 260964 260158 259647 259546 259666
52425 259666 260049 260835 261941 263299 265103 267389 269643 271315 272527 273845 275456 277045 278393 279735 281562
52410 281562 284373 288490 293764 299593 305595 312180 319998 328879 337709 345308 350989 354281 354736 352313
52396 352313 347668 341816 335686 329927 324732 319755 314644 309853 306427 304734 303906 302946 301911 301470 301765
52381 301765 302460 303665 305883 308941 311868 314172 316512 319667 323394 326934 330214 333861 338218 343021
$$ packed form
52490B74839j725j770k122k400j793n34J74k19r68j186q26k93K02N81P16O58O58
52473B63992P84Q80Q80Q54P87P78J224K241L118L094K564K613L355L683K930J743
52457B95520R32L52m83j408j931k024k018k105k419l108l927m154l456k440j896
52442B65435j853j810j459p67J95J014J019J93n10l34K01J31m91q06n11j01J20
52425B59666L83P86J106J358J804K286K254J672J212J318J611J589J348J342J827
52410B81562K811M117N274N829O002O585P818Q881Q830P599N681L292M55k423
52396C52313m645n852o130n759n195m977n111m791l426j693q28r60j035m41K95
52381C01765O95J205K218L058K927K304K340L155L727L540L280L647M357M803
$$ plain form
52367 343021 348020 353313 358901 364327 368864 371765 372398 370678 367557 364641 363019 362678 363045 363660 364159
52352 364159 364234 364123 364763 366862 369949 372851 375010 376926 379388 382833 387421 393122 399444 405577 411146
52337 411146 416626 422747 429761 437558 446259 456244 467653 480168 493443 507571 523001 540071 558712
52324 558712 578585 599439 621260 644119 667988 692726 718055 743368 767792 790784 812674
52313 812674 834270 855917 877251 897997 918520 939286 960031 979861 998120 1014838 1030433
52302 1030433 1045281 1059575 1073216 1085738 1096575 1105582 1113180 1119820 1125303 1128705 1128991 1125737 1119376
52289 1119376 1110794 1100745 1089687 1078060 1066471 1055476 1045290 1035901 1027405 1020109 1014411 1010718
52277 1010718 1009420 1010754 1014655 1020794 1028676 1037737 1047587 1058403 1070870 1085397 1101457 1117972 1134260
$$ packed form
52367C43021M999N293N588N426M537K901O33j720l121k916j622l41L67O15M99
52352C64159P5j11O40K099L087K902K159J916K462L445M588N701O322O133N569
52337D11146N480O121P014P797Q701R985J1409J2515J3275J4128J5430J7070J8641
52324E58712J9873K0854K1821K2859K3869K4738K5329K5313K4424K2992K1890
52313H12674K1596K1647K1334K0746K0523K0766K0745J9830J8259J6718J5595
52302A030433J4848J4294J3641J2522J0837R007P598O640N483L402K86l254o361
52289A119376q582j0049j1058j1627j1589j0995j0186r389q496p296n698l693
52277A010718j298J334L901O139P882R061R850J0816J2467J4527J6060J6515J6288
$$ plain form
52264 1134260 1150299 1166158 1181662 1196715 1211557 1226444 1241340 1256082 1270557 1284490 1297273
52253 1297273 1308345 1317690 1325796 1333176 1339985 1345804 1349618 1350229 1347066 1340552 1331514 1320356 1307038
52240 1307038 1291679 1274824 1257125 1239125 1221395 1204516 1188695 1173595 1158709 1143873 1129322
52229 1129322 1115383 1102223 1089822 1078094 1067038 1056793 1047564 1039513 1032861 1028056 1025615 1025539 1026921
52216 1026921 1028395 1029221 1029884 1031366 1033844 1036441 1038483 1040649 1044349 1049961 1056235 1061582 1065584 1069000
52202 1069000 1072735 1077095 1081767 1086100 1089596 1092486 1095670 1099840 1104854 1110180 1115564 1120809 1125334 1128719
52188 1128719 1131541 1134839 1138684 1142017 1144064 1145182 1145943 1146055 1144683 1141380 1136170 1129099 1120256 1110137
52174 1110137 1099569 1089353 1080188 1072637 1066768 1062036 1057970 1054814 1053093 1052664 1052718 1052787 1053318 1055059 1058157
$$ packed form
52264A134260J6039J5859J5504J5053J4842J4887J4896J4742J4475J3933J2783
52253A297273J1072R345Q106P380O809N819L814O11l163o514r038j1158j3318
52240A307038j5359j6855j7699j8000j7730j6879j5821j5100j4886j4836j4551
52229A129322j3939j3160j2401j1728j1056j0245r229q051o652m805k441p6J382
52216A026921J474Q26O63J482K478K597K042K166L700N612O274N347M002L416
52202A069000L735M360M672M333L496K890L184M170N014N326N384N245M525L385
52188A128719K822L298L845L333K047J118P61J12j372l303n210p071q843j0119
52174A110137j0568j0216r165p551n869m732m066l156j721m29N4O9N31J741L098
$$ plain form
52159 1058157 1062019 1065955 1069751 1073630 1077726 1081745 1085250 1088101 1090379 1091967 1092636 1092621 1092609 1092945 1093353 1093756
52143 1093756 1094863 1097387 1101020 1104800 1108263 1111603 1114872 1117809 1120520 1123692 1127885 1133199 1139862 1148654
52129 1148654 1160318 1174887 1191914 1211177 1232843 1257111 1283978 1313288 1344736 1377815 1411888
52118 1411888 1446401 1481038 1515646 1549925 1583175 1614456 1643150 1669210 1692758 1713638 1731568
$$ packed form
52159A058157L862L936L796L879M096M019L505K851K278J588O69j5j2L36M08M03
52143A093756J107K524L633L780L463L340L269K937K711L172M193N314O663Q792
52129A148654J1664J4569J7027J9263K1666K4268K6867K9310L1448L3079L4073
52118A411888L4513L4637L4608L4279L3250L1281K8694K6060K3548K0880J7930
$$ [...]
##END NTUPLES=NMR SPECTRUM
##END=
