
##TITLE=AC1317_SSGAH12146_6535293_p0zfnNsTiN
##JCAMPDX= 6.0         $$ Bruker NMR JCAMP-DX V2.0
##DATA TYPE= NMR SPECTRUM
##DATA CLASS= NTUPLES
##ORIGIN= BRUKER
##OWNER= Administrator
$$ 1.72 TOPSPIN		Version 2.1
$$ 2012-07-17 19:00:51.937 -0500  Administrator@TOPSPIN
$$ Compression mode = diff/dup
##.OBSERVE FREQUENCY= 400.02188249412
##.OBSERVE NUCLEUS= ^1H
##.ACQUISITION MODE= SIMULTANEOUS (DQD)
##.ACQUISITION SCHEME= undefined
##.AVERAGES= 8
##.DIGITISER RES= 22
##SPECTROMETER/DATA SYSTEM= spect
##.PULSE SEQUENCE= zg30
##.SOLVENT NAME= COFFEE_meoh
##.SHIFT REFERENCE= INTERNAL, COFFEE_meoh, 1, 14.98509
##AUDIT TRAIL= $$ (NUMBER, WHEN, WHO, WHERE, PROCESS, VERSION, WHAT)
$$ ##TITLE= Audit trail, TOPSPIN		Version 2.1
$$ ##JCAMPDX= 5.01
$$ ##ORIGIN= Bruker BioSpin GmbH
$$ ##OWNER= Administrator
$$ $$ C:\Bruker\TOPSPIN/data/COFFEE/nmr/AC1317_SSGAH12146_6535293_p0zfnNsTiN/10/pdata/1/auditp.txt
$$ ##AUDIT TRAIL=  $$ (NUMBER, WHEN, WHO, WHERE, PROCESS, VERSION, WHAT)
(   1,<2012-07-17 19:00:44.890 -0500>,<Administrator>,<TOPSPIN>,<go>,<TOPSPIN 2.1>,
      <created by zg
	started at 2012-07-17 18:59:38.312 -0500,
	POWCHK enabled, PULCHK disabled,
       configuration hash MD5:
       6B 1B 68 BB D9 2E 58 E2 7F 35 AD 54 07 DF 0E 41
       data hash MD5: 64K
       5E 04 BE C3 D9 BD 1C 50 F6 98 DB 77 C0 53 CD 1B>)
(   2,<2012-07-17 19:00:47.562 -0500>,<Administrator>,<TOPSPIN>,<proc1d>,<TOPSPIN 2.1>,
      <Start of raw data processing
       efp LB = 0 FT_mod = 6 PKNL = 1 PHC0 = 0 PHC1 = 0 SI = 32K 
       data hash MD5: 32K
       5B 2E D0 32 A5 FA A9 3B 16 91 26 28 9A 96 22 7D>)
(   3,<2012-07-17 19:00:48.250 -0500>,<Administrator>,<TOPSPIN>,<proc1d>,<TOPSPIN 2.1>,
      <pk PHC0 = 179.4122 PHC1 = 0 
       data hash MD5: 32K
       30 92 61 73 63 2E 5B 97 1F C9 66 56 1A FB 8D 31>)
(   4,<2012-07-17 19:00:48.359 -0500>,<Administrator>,<TOPSPIN>,<proc1d>,<TOPSPIN 2.1>,
      <abs ABSG = 1 
       data hash MD5: 32K
       F1 51 F6 48 AE 71 8D E1 9D B1 EF CD 64 BF D3 71>)
(   5,<2012-07-17 19:00:48.390 -0500>,<Administrator>,<TOPSPIN>,<proc1d>,<TOPSPIN 2.1>,
      <abs ABSG = 2 
       data hash MD5: 32K
       B5 64 D2 40 C7 5E 3F C6 54 31 B4 CD 73 19 DF 12>)
(   6,<2012-07-17 19:00:48.421 -0500>,<Administrator>,<TOPSPIN>,<proc1d>,<TOPSPIN 2.1>,
      <abs ABSG = 3 
       data hash MD5: 32K
       13 7E 1E 2C 5B 64 91 A3 E1 6A 6D AA 8D 2D 43 19>)
(   7,<2012-07-17 19:00:48.453 -0500>,<Administrator>,<TOPSPIN>,<proc1d>,<TOPSPIN 2.1>,
      <abs ABSG = 4 
       data hash MD5: 32K
       9D DA D7 3C C7 7B 54 69 C1 21 DE A0 4B BD B7 92>)
(   8,<2012-07-17 19:00:48.468 -0500>,<Administrator>,<TOPSPIN>,<proc1d>,<TOPSPIN 2.1>,
      <abs ABSG = 5 
       data hash MD5: 32K
       AF 4E 3D 52 D8 DB AA 17 D3 AE 54 75 47 5A 28 2C>)
$$ ##END=
$$ 
$$ $$ hash MD5
$$ $$ 24 CA 01 62 3A C7 E6 AF E5 50 51 41 4E 04 54 7C
##$RELAX= 
##$RELAX= 
##$RELAX= 
##$RELAX= 
##$RELAX= 
##$RELAX= 
##$RELAX= 
$$ Bruker specific parameters
$$ --------------------------
$$ [...]
150 150 150 150 150 150 150 150
##$TP07= 0
##$TPNAME0= <>
##$TPNAME1= <>
##$TPNAME2= <>
##$TPNAME3= <>
##$TPNAME4= <>
##$TPNAME5= <>
##$TPNAME6= <>
##$TPNAME7= <>
##$TPOAL= (0..7)
0.5 0.5 0.5 0.5 0.5 0.5 0.5 0.5
##$TPOFFS= (0..7)
0 0 0 0 0 0 0 0
##$TUNHIN= 0
##$TUNHOUT= 0
##$TUNXOUT= 0
##$USERA1= <user>
##$USERA2= <user>
##$USERA3= <user>
##$USERA4= <user>
##$USERA5= <user>
##$V9= 5
##$VALIST= <valist>
##$VCLIST= <CCCCCCCCCCCCCCC>
##$VD= 0
##$VDLIST= <DDDDDDDDDDDDDDD>
##$VPLIST= <PPPPPPPPPPPPPPP>
##$VTLIST= <TTTTTTTTTTTTTTT>
##$WBST= 2048
##$WBSW= 25
##$XGAIN= (0..3)
0 0 0 0
##$XL= 0
##$YL= 0
##$YMAX_a= 512168
##$YMIN_a= -655712
##$ZGOPTNS= <>
##$ZL1= 120
##$ZL2= 120
##$ZL3= 120
##$ZL4= 120
##$ABSF1= 14.98509
##$ABSF2= -5.573092
##$ABSG= 5
##$ABSL= 3
##$ALPHA= 0
##$AQORDER= 0
##$ASSFAC= 0
##$ASSFACI= 0
##$ASSFACX= 0
##$ASSWID= 0
##$AUNMP= <proc_prof1d_extract_pilot.lims>
##$AXLEFT= 0
##$AXNAME= <>
##$AXNUC= <1H>
##$AXRIGHT= 0
##$AXTYPE= 0
##$AXUNIT= <>
##$AZFE= 0.1
##$AZFW= 0.1
##$BCFW= 0
##$BC_mod= 0
##$BYTORDP= 0
##$COROFFS= 0
##$CY= 15
##$DATMOD= 1
##$DC= 0
##$DFILT= <>
##$DTYPP= 0
##$F1P= 0
##$F2P= 0
##$FCOR= 0.5
##$FTSIZE= 32768
##$FT_mod= 6
##$GAMMA= 0
##$GB= 0
##$INTBC= 1
##$INTSCL= 1
##$ISEN= 128
##$LB= 0
##$LEV0= 0
##$LPBIN= 0
##$MAXI= 10000
##$MC2= 0
##$MEAN= 0
##$ME_mod= 0
##$MI= 0
##$NCOEF= 0
##$NC_proc= -8
##$NLEV= 6
##$NOISF1= 0
##$NOISF2= 0
##$NSP= 0
##$NTH_PI= 0
##$NZP= 0
##$OFFSET= 14.98509
##$PC= 1
##$PHC0= 179.4122
##$PHC1= 0
##$PH_mod= 1
##$PKNL= yes
##$PPARMOD= 0
##$PPDIAG= 0
##$PPIPTYP= 0
##$PPMPNUM= 2147483647
##$PPRESOL= 1
##$PSCAL= 4
##$PSIGN= 0
##$PYNMP= <proc.py>
##$REVERSE= no
##$SF= 400.02
##$SI= 32768
##$SIGF1= 0
##$SIGF2= 0
##$SINO= 400
##$SIOLD= 32768
##$SPECTYP= <>
##$SREGLST= <1H.CDCl3>
##$SSB= 0
##$STSI= 32768
##$STSR= 0
##$SW_p= 8223.68421052631
##$SYMM= 0
##$S_DEV= 0
##$TDeff= 65536
##$TDoff= 0
##$TI= <>
##$TILT= no
##$TM1= 0
##$TM2= 0
##$TOPLEV= 0
##$USERP1= <user>
##$USERP2= <user>
##$USERP3= <user>
##$USERP4= <user>
##$USERP5= <user>
##$WDW= 1
##$XDIM= 32768
##$YMAX_p= 476259653
##$YMIN_p= -753376
##$CURPLOT= <Network HP LaserJet P1505>
##$CURPRIN= <$Network HP LaserJet P1505>
##$DFORMAT= <normdp>
##$LAYOUT= <+/1D_H.xwp>
##$LFORMAT= <normlp>
##$PFORMAT= <normpl>
##$SURQMSG= 1
$$ End of Bruker specific parameters
$$ ---------------------------------
##NTUPLES= NMR SPECTRUM
##VAR_NAME=  FREQUENCY,     SPECTRUM/REAL,   SPECTRUM/IMAG
##SYMBOL=    X,             R,               I
##VAR_TYPE=  INDEPENDENT,   DEPENDENT,       DEPENDENT
##VAR_FORM=  AFFN,          ASDF,            ASDF
##VAR_DIM=   32768,         32768,           32768
##UNITS=     HZ,            ARBITRARY UNITS, ARBITRARY UNITS
##FACTOR=    0.250966925370066, 1,           1
##FIRST=     8223.43324360094, -247814,      -100278
##LAST=      0,             -209034,         -65770
##MIN=       0,             -753376,         0
##MAX=       8223.43324360094, 476259653,    0
$$ Real data points
##PAGE= N=1
##DATA TABLE= (X++(R..R)), XYDATA
$$ [...]
19521b18157a01484C6827a71178j4976A04680c81712A58929i3451A16696h6625
19510b46925A78339C5987B783J48819a39984j10074G7384J23319b72565c5922
19499B3227b87307B54764c61643f5558j83799i4461J382c1617E1849b18809I1695
19487B12947G3070A7592a31543A00088j9090O552J0284b10483E536a47237C83625
19475b38263c2968j78856C1314a13697a0269j67804D809a62715a1930D8607J54763
19464B03370j35J63f3868E5970J92536B8591b60695M8129P2723A66437f9089k019
19452g1108D2532g3964j9767I2333G151J88685b88253A20464a51213K7953j08316
19441b31576g7624n3197G9704a94587e1179k13790H4976N9407Q3564C4701b4879
$$ plain form
19521 -218157 -101484 36827 -171178 -186154 104680 -381712 158929 -93451 116696 -86625
19510 -246925 178339 35987 2783 151602 -139984 -250058 77384 200703 -272565 -35922
19499 23227 -287307 254764 -361643 -65558 -249357 -94461 -93079 -31617 51849 -218809 91695
19487 212947 73070 17592 -131543 100088 80998 87550 97834 -210483 5536 -147237 383625
19475 -238263 -32968 -211824 31314 -113697 -10269 -178073 4809 -162715 -11930 48607 203370
19464 203370 203235 203398 -63868 55970 248506 28591 -260695 -212566 -139843 166437 -69089 -71108
19452 -71108 42532 -73964 -93731 92333 7151 195836 -288253 120464 -151213 -123260 -231576
19441 -231576 -77624 -130821 79704 -194587 -51179 -264969 84976 144383 227947 34701 -24879
19429b0238k32356n2051g7823F3133c15377a53430j8113A15721g4520A26712O6995
19418A93707l5519e51038g3434D71696a51325j02281a21678N2785A60001B9162
19407h471l0411k53419f143H0150P2362b56207J18429j13586c5418j480k22241
19396b59139A37222K76013e9659j18372k5860j0449n6689h2136j21573a6993A85424
19384b7362G0209a21801B60903C5955c2205n937k1092H8488L2484b6546k7697
19373e4243k56279Q1161D4064K4484a55717B6174B321a04508c9530A25249K26213
19362C51462c45114b7433l15760a12372j25750c2004j05036b5663B1671Q8751
19352A10422a42363B61854b45101O1455j13601J47531C19443b16896A19133b59517
$$ plain form
19429 -20238 -252594 -304645 -77823 63133 -315377 -153430 -171543 115721 -74520 126712 193707
19418 193707 158188 -551038 -73434 471696 -151325 -253606 -121678 -68893 160001 29162
19407 -8471 -38882 -292301 -6143 80150 152512 -256207 -137778 -251364 -35418 -36898 -259139
19396 -259139 137222 413235 -59659 -178031 -203891 -214340 -271029 -82136 -203709 -16993 185424
19384 -27362 70209 -121801 260903 35955 -32205 -38142 -59234 88488 120972 -26546 -54243
19373 -54243 -310522 -229361 44064 68548 -155717 26174 2321 -104508 -39530 125249 351462
19362 351462 -345114 -27433 -343193 -112372 -238122 -32004 -137040 -25663 21671 110422
19352 110422 -142363 261854 -245101 -183646 -297247 -149716 319443 -216896 119133 -259517
19341e3374j20256b9420k4103A03096b6928j561j94436a00955K3686l67578J50412
19330b94435A6557a58137K4536o5178C38c5228F3401a55902j32370a32714J6309
19319a16405H5236K00171a49444j71642a03910G6401R3236a17278j42345d117
19308C53485A68530L4018b17373C6796b86681C42721I4589M9357a70221I3811
19297a27602C2106J46587K4697C990J25236P3236H109g7037A69033o1812h9215
19285a38077B19853D1419b31009Q4534d0706A66100j8526Q794f5050k6092j23014
19274b14156A09659J6242n4936K6145J311l638C4724l721J3057g5912C1595J0884
19262D2479b58635B78238g2851E4614R6626d00980C54190A8494J57610J24295
$$ plain form
19341 -53374 -173630 -29420 -53523 103096 -26928 -28489 -222925 -100955 -77269 -444847 -294435
19330 -294435 16557 -158137 -133601 -198779 338 -35228 63401 -155902 -288272 -132714 -116405
19319 -116405 85236 285407 -149444 -321086 -103910 76401 169637 -117278 -259623 -4117
19308 353485 168530 202548 -217373 36796 -286681 342721 94589 143946 -170221 93811
19297 -127602 32106 178693 203390 3990 129226 202462 8109 -77037 169033 107221 -89215
19285 -138077 219853 41419 -231009 -146475 -40706 166100 147574 156368 -65050 -91142 -214156
19274 -214156 109659 125901 70965 97110 98421 94783 34724 31003 44060 -75912 31595 42479
19262 42479 -258635 278238 -72851 54614 151240 -400980 354190 18494 176104 300399
19252C00399I7914e3967H8639J1889C2308b83064K5063J25738k451c5515l5554
19241g1069k2081j12176L7097Q219A24857c69892I8386j0619i9877j7072M1490
19230g5459L0666j45487j91610a70883j3511c7084j14663K4355j82869F1137O3775
19219A24912b7296A88295a37460N6243a9079A81197g7617j00335f7507B996b90933
19207a76065N1182G4092b80819F0730b89550p6159a7695A25976a09759B09958
19196c62203C0518L65854j64050b92076E5182O880a11729j25489G3115i9479n639
19185a05118j82089H8006a12254j9208r3501g1937I2209c59543J27387A54677
19174e6048F3000A8240J69903a44495l27318C4996M4804J86960P3911b29726j2459
$$ plain form
19252 300399 97914 -53967 88639 100528 32308 -283064 -258001 -132263 -134714 -35515 -71069
19241 -71069 -93150 -205326 -168229 -160010 124857 -369892 98386 87767 -99877 -116949 -75459
19230 -75459 -44793 -190280 -381890 -170883 -184394 -37084 -151747 -127392 -310261 61137 124912
19219 124912 -27296 188295 -137460 -81217 -19079 181197 -77617 -177952 -67507 2996 -290933
19207 -176065 -124883 74092 -280819 60730 -289550 -365709 -17695 125976 -109759 209958
19196 -362203 30518 396372 232322 -292076 55182 62062 -111729 -237218 73115 -99479 -105118
19185 -105118 -287207 88006 -112254 -131462 -224963 -71937 92209 -359543 -232156 154677
19174 -56048 63000 18240 188143 -144495 -471813 34996 79800 266760 340671 -229726 -242185
19163b42185R9060l4436B04850c77811B0585a72622e6709o6127I7257P3603n4520
19152A16340K294C2988K0110a45432r5682A32872a70817q7383A71125c6640B8809
19140c39687J11023p0931B88199p5907d6723m3377C0899c16238a32324a3126N358
19129g768j83445c4292A81010b67155H7753l5981h8615A72219a74686J8451G2373
19117b33140J15000p9080E1202K96588b60039A84845b34802c6939l31216A04009
19106H8253a13510H7611i7237F7549K44626E3252L12496b35575G8673a09154r5662
19095b04816j8574J9906b4789A58074a62155N8626l4529j10404a01857G8682a54432
19083F7081d14114B8510f641k41830A18940d7137n1345L1069m4591F2764i5450
$$ plain form
19163 -242185 -143125 -177561 204850 -377811 20585 -172622 -56709 -122836 97257 170860 116340
19152 116340 118634 32988 53098 -145432 -241114 132872 -170817 -258200 171125 -36640 28809
19140 -339687 -228664 -299595 288199 212292 -46723 -90100 30899 -316238 -132324 -13126 -7768
19129 -7768 -191213 -34292 181010 -267155 87753 51772 -88615 172219 -174686 -156235 72373
19117 -233140 -118140 -197220 51202 347790 -260039 184845 -234802 -36939 -368155 104009
19106 88253 -113510 87611 -97237 67549 312175 53252 365748 -235575 78673 -109154 -204816
19095 -204816 -223390 -203484 -24789 158074 -162155 -103529 -138058 -248462 -101857 78682 -154432
19083 67081 -414114 28510 -6641 -248471 118940 -47137 -98482 -67413 -112004 62764 -95450
19071A5264L2003a38418B74132a47554j75003A7487e4994j60167J006O3563P1648
19060g8944j0410B38460i2680N651N956H227a96845j45479B95568b39797A38245
19048a44839A52920a62518O6029j78923f3513E7656c6742C8310J26097D5635b66451
19036a31077b499k2838m2103H54P4784J75896A5959L50899a45334O9120A41637
19024a28482B36505J27351I6251O2163J05357A9377d1239C7453a70516P4557A77131
19012h3330m8009j72308C5420K1425J40752o6453K07454A27075K09946a04891
19001E9033c42031a64900A85005f3416o3099d0484l2586k13557B65628a98560
18990a80559H0304c1221R487B99619m5167b91335L8353K9193d1248A23931a45282
$$ plain form
19071 15264 47267 -138418 274132 -147554 -322557 17487 -54994 -215161 -214155 -150592 -78944
19060 -78944 -89354 238460 -92680 -87029 -81073 8227 -196845 -342324 295568 -239797 138245
19048 -144839 152920 -162518 -96489 -275412 -63513 57656 -36742 38310 164407 45635 -266451
19036 -131077 -2499 -25337 -67440 854 75638 251534 15959 366858 -145334 -76214 141637
19024 -128482 236505 363856 96251 158414 263771 19377 -41239 37453 -170516 -95959 177131
19012 -83330 -131339 -303647 35420 56845 197597 131144 338598 127075 337021 -104891
19001 59033 -342031 -164900 185005 -63416 -126515 -40484 -73070 -286627 265628 -198560
18990 -180559 80304 -31221 -21734 299619 254452 -291335 -252982 -223789 -41248 123931 -145282
18978A34163f1564C64936j49759i8944H5926c14059d8627j6609o4391l37738A0749
18966e4794l70911c8101m37440a0130E6085K06057b94755J25230j02549R1016
18956a81058A21674a08693H9056d71250G3753R115K18556a47418A53983f9277
18945C73794b70464I4766J16765G3202a62098j5297c006l94305d8081B44449F9681
18933b22693f055j94951A11498Q4114a6497C4802c68960f3675J3378k04490j42029
18922c96816a72666b4006A1204b6157F2881b24556f1966k40232a866B9454J68018
18911A97472a3656m02997B19517R8907g5754o3854f1749L917j20919H1500h5071
18899i4257J5759G5945a21168j04965e0385q8347q7167A81551a89938B9916c28712
$$ plain form
18978 134163 -61564 364936 215177 -98944 85926 -314059 -48627 -65236 -129627 -467365 10749
18966 -54794 -425705 -38101 -475541 -10130 56085 262142 -294755 -169525 -272074 -181058
18956 -181058 121674 -108693 89056 -471250 73753 82868 301424 -147418 153983 -69277
18945 373794 -270464 94766 211531 73202 -162098 -177395 -3006 -397311 -48081 244449 69681
18933 -222693 -6055 -201006 111498 195612 -16497 34802 -368960 -63675 -50297 -254787 -396816
18922 -396816 -172666 -24006 11204 -26157 62881 -224556 -61966 -302198 -1866 29454 197472
18911 197472 -13656 -416653 219517 318424 -75754 -139608 -61749 -57832 -178751 81500 -85071
18899 -94257 -78498 75945 -121168 -226133 -50385 -138732 -225899 181551 -189938 29916 -328712
18887C62422a68870B9104c7082j46808j63222q970b1519k97169Q3291i3132E6296
18875c15909A41883c0799I6651O2696i2387A88430a5092A01517f3490k48752B6640
18863A5237J3478i212I654J48885b7565j55929B7267b76906A46908k7972a39968
18851a90078A03719b51012A98967d1026C95334F0495b49572a21268b0711k17247
18841b37958R8003M5266B43397J1011E9904B0251f9623A37088K3912b41624h7147
18829C51192b69597a21962A298K7244a21985A39020C4896b54745j27869e0014
18818a42621A40214n5964Q2604D0318J27348a43928F8145N4157k8249b349C40766
18806I9887K04264j42906a45390C0490c14545d7916k32801e3281q7462a3799q5654
$$ plain form
18887 362422 -168870 29104 -37082 -183890 -347112 -356082 -21519 -318688 -235397 -93132 56296
18875 -315909 141883 -30799 96651 159347 -92387 188430 -15092 101517 -63490 -312242 26640
18863 15237 28715 -9212 9654 158539 -27565 -183494 27267 -276906 146908 118936 -139968
18851 -190078 103719 -251012 198967 -41026 395334 60495 -249572 -121268 -20711 -237958
18841 -237958 -139955 -94689 243397 254408 59904 20251 -69623 137088 161000 -241624 -87147
18829 351192 -269597 -121962 1298 28542 -121985 139020 34896 -254745 -382614 -50014
18818 -142621 140214 84250 166854 40318 167666 -143928 68145 122302 94053 -2349 340766
18806 99887 304151 161245 -145390 30490 -314545 -47916 -280717 -53281 -140743 -13799 -99453
18795i9453k38947f758A1872L53530A62586k9814f9271j50204B03282a78962A91991
18783c51400C6590e3568B03466N0120d75591a81309J7264O0680b3444H1469c31673
18771i0312k21475d7466l5589m1977B59358a38557B8410a44811E935K7605c1579
18759a69964H2431b61009L4640D2177a02879B2913a54985C17230a77809d4655
18748A08867a95198A6158e7325C23061c7576B9337f8611j19492e8205p4106A16709
18736a29277j32822D5667i201B58461d6846l16613J11479Q1576H2472b9027A39929
18724f0829B18586j7728c48631J29390l2627J02914A56315d1823p5222C0890a19840
18712A17787k9612d01225Q7365a18947D22891b25502p2793A25895b51000J17851
$$ plain form
18795 -99453 -338400 -6758 11872 365402 162586 132772 -69271 -219475 203282 -178962 191991
18783 -351400 36590 -53568 203466 253586 -475591 -181309 -164045 -103365 -23444 81469 -331673
18771 -90312 -311787 -47466 -83055 -125032 259358 -138557 28410 -144811 5935 33540 -31579
18759 -169964 82431 -261009 -226369 42177 -102879 22913 -154985 317230 -177809 -44655
18748 108867 -195198 16158 -57325 323061 -37576 29337 -68611 -188103 -58205 -132311 116709
18736 -129277 -262099 45667 -9201 258461 -46846 -363459 -251980 -170404 82472 -29027 139929
18724 -60829 218586 200858 -348631 -219241 -251868 -148954 156315 -41823 -117045 30890 -119840
18712 117787 88175 -401225 -313860 -118947 422891 -225502 -298295 125895 -251000 -133149
18702a33149M3620M0472K1175F1578q074a47854A1401h1710H8041f23128a94993
18690F416a5683k57292a479j53021A89135a13513l6525c2466F5870h4166K92j46530
18678b30404A01124K65893b86127b6271J607A16289a31309b625r4965l7039A75323
18666h5466A85428q3310h2033q3508g0485D5930a76330l9979i9805O658A45751
18654b0653D9574b14251A28464b26448g4026r7005K6207k05445G2369f8933J659
18643f7274k0291k20725A22364b17472i9658F5003a50304A73200i4623C9635K27030
18632B66665a20747q752j24166L25A7942J23506a07004k05149C2120J73285f6569
18620g856B04056f4619I6714c2928k09592e019j16959l9167c6526m7744a8077
$$ plain form
18702 -133149 -89529 -49057 -27882 61578 53504 -147854 11401 -81710 88041 -623128 -194993
18690 6416 -15683 -272975 -1479 -154500 189135 -113513 -150038 -32466 65870 -84166 -83874 -230404
18678 -230404 101124 367017 -286127 -26271 -24664 116289 -131309 -2625 -97590 -134629 175323
18666 -85466 185428 102118 -82033 -165541 -70485 45930 -176330 -216309 -99805 -93147 145751
18654 -20653 49574 -214251 128464 -226448 -74026 -171031 -144824 -350269 72369 -68933 -67274
18643 -67274 -87565 -308290 122364 -217472 -99658 65003 -150304 173200 -94623 39635 266665
18632 266665 -120747 -129499 -253665 -253340 17942 141448 -107004 -312153 32120 205405 -66569
18620 -7856 204056 -64619 96714 -32928 -242520 -5019 -121978 -161145 -36526 -84270 -18077
18608h1361B1232i145C69158b4140j78926j94217C07505d2259b63D0935a81539
18596B2002b59123O4952N1578f1910k06949G1244J51597Q9511a81310d9124a7648
18584d7555n9871d9871H1640a86326A2346K07805J30983h3049j35169f7346A24574
18572I3196b96661B74627j24871a02708F8283J61690r1920a49105c7721j03308
18562a41029I4572K1337l9122e3033j08509B16066b50816k9681F5459f39753a47433
18550B2183a86831A98938q1931a85888C223a62838j33507J37590A65014D7412
18539I4717A5780J87080A173d34276J93004a06743c3816j33673O6094J070B83868
18527a08906A7385a5103l3413D3895H859J68114q0833h4410K4597o7193j59623
$$ plain form
18608 -81361 21232 -9145 369158 -24140 -203066 -397283 307505 -42259 -263 40935 -181539
18596 22002 -259123 -194171 -142593 -61910 -268859 71244 222841 312352 -181310 -49124 -17648
18584 -47555 -107426 -49871 81640 -186326 12346 220151 351134 -83049 -218218 -67346 124574
18572 93196 -296661 274627 149756 -102708 68283 229973 138053 -149105 -37721 -141029
18562 -141029 94572 115909 76787 -53033 -161542 216066 -250816 -280497 65459 -639753 -147433
18550 22183 -186831 198938 117007 -185888 3223 -162838 -296345 -158755 165014 47412
18539 94717 15780 202860 1173 -434276 -241272 -106743 -33816 -167489 -101395 -100325 283868
18527 -108906 17385 -15103 -48516 43895 8859 176973 96140 -84410 -59813 -127006 -286629
18516b86629d8493j51479f7504B69666d64279a54123j81361B43386i4846I0293
18505B62408h7582j38943o3660E0494A8372K75725a7484q994A51417J7434h8844
18493d57637a97801A6463J2964a38998I2500A3692a49019j06836i6950b5446m11024
18482d36470h402k68752l5937I1543b334j52555d8355B05112j8360d9351B22145
18470D72512a31349J0340c6882j53274B02674b17693r94r0319A74442a25970b8197
18458a06623k05946A13737g2793b8663k10077A51306e7304m11474B2399c73697
18447g3544n6371c0879j20966A6820d3692j33644f0893A98736A3713a8724B51668
18435a43872A29381f2516l89740I941c20004F4246a58472H0385b39455I136L7553
$$ plain form
18516 -286629 -48493 -199972 -67504 269666 -464279 -154123 -335484 243386 -94846 90293
18505 262408 -87582 -226525 -290185 50494 18372 294097 -17484 -26478 151417 168851 -88844
18493 -457637 -197801 16463 29427 -138998 92500 13692 -149019 -255855 -96950 -25446 -436470
18482 -436470 -8402 -277154 -313091 91543 -2334 -154889 -48355 205112 186752 -49351 222145
18470 472512 -131349 -121009 -36882 -190156 202674 -217693 -218687 -309006 174442 -125970 -28197
18458 -106623 -312569 113737 -72793 -28663 -238740 151306 -57304 -468778 22399 -373697
18447 -73544 -129915 -30879 -151845 16820 -43692 -177336 -60893 198736 13713 -18724 251668
18435 -143872 129381 -62516 -452256 9941 -320004 64246 -158472 80385 -239455 9136 46689
18424D6689d4499j90327B329b47203N8635C04620E2426R8373a11408C93494c10197
18412A85675C1855i2753D02326E4234h3702j68411e4920E2814J69997a1119j94953
18401b06072D7847f8177j24003f8097I5006Q4089e044j9558m0054j52863h0576
18389c08359a47514A71995c7305q4336A48072C7796q395J36519J81677b64139
18378a00856A24469F1912a02760k89015B28648a26524f356I2705d0796j1501A29512
18366B46098F1099K6994C7220J13702c36843C54604a55507p9925b6305B21740
18355B36057A2564a31182J40k31978O4230I1380k8317K60524b1390m255j7684
18344d3329k40889a38107j01967n8820A01048b81447A14170g3860o534j60706
$$ plain form
18424 46689 -44499 -234826 2329 -247203 -188568 304620 52426 150799 -111408 393494 -310197
18412 185675 31855 -92753 402326 54234 -83702 -252113 -54920 52814 222811 -11119 -206072
18401 -206072 47847 -68177 -192180 -68097 95006 179095 -5044 -24602 -64656 -217519 -80576
18389 -308359 -147514 171995 -37305 -121641 148072 37796 29401 165920 347597 -264139
18378 -100856 124469 61912 -102760 -391775 228648 -126524 -6356 92705 -40796 -52297 129512
18366 246098 61099 88093 37220 150922 -336843 354604 -155507 -235432 -26305 221740
18355 236057 12564 -131182 -131042 -363020 -298790 91380 63063 323587 -21390 -25645 -43329
18344 -43329 -284218 -138107 -240074 -298894 101048 -281447 114170 -73860 -80394 -241100
18334b41100f7991j80014A01962l6427J61112a96719K5349Q5532p5497g6440j49475
18323b25915b8437C638K59965m6177h3694c0005A77980a83926g9356j6216C3753
18311a09476j73542J17145N6913j3881J5673H6410a30468K3868A00202a73569
18300B9489K07100G5794Q9926o7461h5184B59103g2383b4203B35936m1627B2973
18288e6727j41362I991J34465b8700C3099R221M6894L8435N2884a93148k39416
18277d32564i7887d5157j60420c8890i24r601q4800j43006A16782a354j70071
18266a71425F5431R3842D7964a23380c98o3195B29850h1558G3912K1271b6027
18254A8745J66057e07538a18011B79156i3550b7586j47186F482L43450j74261
$$ plain form
18334 -241100 -67991 -248005 101962 65535 226647 -196719 -171370 -85838 -161335 -76440 -225915
18323 -225915 -28437 3638 263603 217426 -83694 -30005 177980 -183926 -79356 -95572 33753
18311 -109476 -283018 -165873 -108960 -122841 -107168 86410 -130468 -106600 100202 -173569
18300 29489 236589 75794 165720 98259 -85184 259103 -72383 -24203 235936 194309 22973
18288 -56727 -198089 9991 144456 -28700 33099 42320 89214 127649 180533 -193148 -432564
18277 -432564 -97887 -45157 -205577 -38890 -924 -10525 -95325 -238331 116782 -1354 -171425
18266 -171425 65431 159273 47964 -123380 -398 -63593 229850 -81558 73912 95183 -26027
18254 18745 184802 -507538 -118011 279156 -93550 -27586 -174772 6482 349932 175671
18244A75671a41846B98882A5002f5705B21397f7129k8994B20640n247a84247M6281
18233a37966p6618n7824M860B67429c36724b5725k5755p2326A63262b59989k8516
18222b88505A92200c5303j11173C3017b51380A53831b19999r2341b0935l8266
18212e9201A85045R8757b24577c4584k45796J14537H3217P7669b2513j52047N7675
18201a16885A19778L6385g5527A55980k4406b05925A6194N9339a21261j40726
18191b61987J3014J5130a6246j05797d7488p1371k95067Q5307A66146g2235H532
18179E6377h3640K7606B1797b02351c8720l70978c9143j30972C89598A66093p1813
18168I4280b30000c1467B9622d0642k68652a05543L5856q8319j18630J2268D903
$$ plain form
18244 175671 -141846 298882 15002 -65705 221397 -67129 -96123 220640 215393 -184247 -137966
18233 -137966 -214584 -272408 -267548 267429 -336724 -25725 -51480 -123806 163262 -259989 -288505
18222 -288505 192200 -35303 -146476 33017 -251380 153831 -219999 -312340 -20935 -59201
18212 -59201 185045 283802 -224577 -34584 -280380 -165843 83217 160886 -22513 -174560 -116885
18201 -116885 119778 156163 -75527 155980 131574 -205925 16194 75533 -121261 -261987
18191 -261987 -248973 -233843 -16246 -122043 -47488 -118859 -413926 -328619 166146 -72235 8532
18179 56377 -83640 -56034 21797 -202351 -38720 -409698 -39143 -170115 389598 166093 94280
18168 94280 -230000 -31467 29622 -40642 -309294 -105543 -69687 -158006 -276636 -264368 4903
18156a02363A37849C2847i7918A24382d3961H1710a53849A94002A7354J18031
18146A35385a27851B8147b86851A35235b99741J46550A13744d3630H8029i9659
18135d87428A21658a70646A88695c51685a30179j06976A31661a77858I2475L9691
18125A32166F2719d42367B00658b7603n4148N508F0119a38818C13046E4048K8374
18114H2422f5883a5422H0377I268L47789B1306a10989L2675J7191B8483a10816
18102d9384D221c42120a52511B25740G6305a0965j78405B8826a24848q9291p7935
18091b92074B6957L5034h4792A21889K82002c6937k45600C7886L708L031M1885
18080H6510B1148Q8704J3172Q4691K374B0602c97301J45704m3398R8791D05790
$$ plain form
18156 -102363 137849 32847 -97918 124382 -43961 81710 -153849 194002 17354 135385
18146 135385 -127851 28147 -286851 135235 -299741 -153191 113744 -43630 88029 -99659
18135 -487428 121658 -170646 188695 -351685 -130179 -237155 131661 -177858 92475 132166
18125 132166 62719 -442367 200658 -27603 -81751 -76243 60119 -138818 313046 54048 82422
18114 82422 -65883 -15422 80377 9268 357057 21306 -110989 -78314 -61123 28483 -110816
18102 -49384 4221 -342120 -152511 225740 76305 -10965 -189370 28826 -124848 -214139 -292074
18091 -292074 26957 61991 -84792 121889 403891 -36937 -282537 37886 41594 44625 86510
18080 86510 21148 109852 123024 207715 210089 20602 -397301 -251597 -294995 -196204 405790
18068d6606l39008I6852a44263H5519b66987A548d4675j10818f0826l3583q6289
18057a80698e7467n5329A27600C2865Q6678a07217D5990b20562B3458b22595h7134
18045A79921d5973A00577J89421a29196G1986h6730J1595F9377J20712Q4768a23145
18033A56899b9643j54250L5666L2661A8091J33581b93532K4291C1440f924E8491
18021E1549a2044j84264O2235k60253f2858r3031O801b2520o0536C4405b26181
18009a66222L0483A19850A2012a36877j58368J23623C705d0692j57087k7626d1729
17997a13117K2002d5470j37808Q1634j88482A72977h1342H3037a52633A46018
17986A07059K0663a7011F9181l1684b51027G2178B2559L29687A43155J45818b62725
$$ plain form
18068 -46606 -385614 96852 -144263 85519 -266987 1548 -44675 -155493 -60826 -94409 -180698
18057 -180698 -57467 -112796 127600 32865 119543 -107217 45990 -220562 23458 -222595 -87134
18045 179921 -45973 100577 289998 -129196 71986 -86730 -75135 69377 190089 274857 -123145
18033 156899 -29643 -183893 -148227 -115566 18091 151672 -293532 -269241 31440 -6924 58491
18021 51549 -12044 -196308 -134073 -394326 -62858 -155889 -149088 -22520 -83056 34405 -226181
18009 -166222 -135739 119850 12012 -136877 -295245 -171622 3705 -40692 -197779 -225405 -41729
17997 -113117 -91115 -45470 -183278 -101644 -290126 172977 -81342 83037 -152633 146018
17986 107059 127722 -17011 69181 37497 -251027 72178 22559 352246 143155 288973 -262725
17974C66418c3479j66929A05915a94795Q6798g34A81191M223o3054D0474O4247
17963A04721g0121K7443l6721j12758B2818H588J51686j7091F5964Q2709J95240
17952C43913a5857C46754i8470F7135b31645a1327I7988L3076J57809i7284G5678
17940A82612a45268B01344N5887a66916G9582a0836B42117I7858a63228H21a83538
17928b90191a03788A26490a13042e4648A48407G0392K04083A01401c6650A13721
17917a3513A90167l8794L0h6599a591A15868e4859j4607r7237N5891I0445J05917
17905A96362k1780b85500A64685A4406b11407M1905F5676e6875j17335D786K22304
17894B27090j05007J7856a615A09371J09144d6362F5388b53043a1955k38666J06436
$$ plain form
17974 366418 -33479 -200408 105915 -194795 -107997 -734 181191 185414 122360 40474 104721
17963 104721 -70121 -42678 -79399 -192157 22818 8588 160274 143183 65964 148673 343913
17952 343913 -15857 346754 -98470 67135 -231645 -11327 97988 131064 288873 -97284 75678
17940 182612 -145268 201344 257231 -166916 79582 -10836 242117 97858 -163228 821 -183538
17928 -290191 -103788 126490 -113042 -54648 148407 70392 274475 101401 -36650 113721
17917 -13513 190167 151373 151403 -86599 -1591 115868 -54859 -69466 -166703 -110812 90445 196362
17905 196362 174582 -285500 164685 14406 -211407 -169502 65676 -56875 -174210 4786 227090
17894 227090 122083 139939 -1615 109371 218515 -46362 65388 -253043 -11955 -250621 -144185
17883a44185f4783F8789b45357A48775c4807l0972A25358i333A08362b2983k2350
17872d5333B18915f7836k89445b9870l5362A71415j3594a32326k21250A63723
17861d39312D33090a03762G2091H068a03152H9258a99637E8432J80943G215M7697
17850E4912K537b39072f1949A96562i5736C55069b80618a07064j81376d8704H770
17838e2902A10291C8230d11962a6439l5152l4841E6362b38301i6597J6911r2049
17827a71735K0176A24888b7953j01865E2917J51817P5249l9446a74723g0382c596
17815b01626l379F0587g7029A35898B7273f3433B04732B814b9010A22699g8894
17803c40811E05023A49067n328b45618A65460n6961c8190A37373f0108A55254
$$ plain form
17883 -144185 -64783 68789 -245357 148775 -34807 -65779 125358 -9333 108362 -22983 -45333
17872 -45333 218915 -67836 -357281 -29870 -65232 171415 157821 -132326 -353576 163723
17861 -439312 433090 -103762 72091 8068 -103152 89258 -199637 58432 239375 7215 54912
17850 54912 57449 -239072 -61949 196562 -95736 355069 -280618 -107064 -288440 -48704 8770
17838 -52902 110291 38230 -411962 -16439 -51591 -86432 56362 -238301 -96597 -79686 -171735
17827 -171735 -151559 124888 -27953 -129818 52917 204734 279983 240537 -174723 -70382 -3596
17815 -201626 -205005 60587 -77029 135898 27273 -63433 204732 2814 -29010 122699 -78894
17803 -340811 505023 149067 143739 -245618 165460 108499 -38190 137373 -60108 155254
17792I3902K18802a14012F1725a1027A24581e7248k55390L6442P0905A54060G4620
17780e9240a0128I5220b14593j2413b3385j20261m9273A46189o5259a55817q2783
17769b38600C03087A02406l0245j6785R8936L1163G0253a60138B99131f9365B18453
17757C95120a28458p0096g6067m7999P018A91813b96929A31292a49047r7650A4450
17745A70725E6014J58266r2173K4571E1580J85875a05080j94100J744d2095j50113
17734a92208D8900K5583Q4434f6680B12681K43391j43416i5175A5652K89203k9680
17723B75175a41902A55283J43618a30349A74168G5402b782B65714f383A62699
17712A42427a502m50224C0736b5243q1819d5421j54197E021f535A39210K2392
$$ plain form
17792 93902 312704 -114012 61725 -11027 124581 -57248 -312638 -276196 -205291 154060 74620
17780 -59240 -10128 95220 -214593 -227006 -23385 -143646 -192919 146189 80930 -155817 -238600
17769 -238600 303087 102406 72161 55376 154312 185475 70253 -160138 299131 -69365 218453
17757 395120 -128458 -198554 -76067 -124066 -117048 191813 -296929 131292 -149047 -246697 14450
17745 170725 56014 214280 122107 146678 51580 237455 -105080 -299180 -297436 -42095 -192208
17734 -192208 48900 74483 158917 -66680 212681 456072 312656 -95175 15652 304855 275175
17723 275175 -141902 155283 298901 -130349 174168 75402 -2782 265714 -6383 162699
17712 142427 -1502 -451726 30736 -25243 -107062 -45421 -199618 5021 -6535 139210 161602
17701A61602K07930A47951C8782b16312A59939g1126q0146j01685A23692i8792
17690h954m2932k5204n5506C09184J39261a79380C39561E2826g9435L1846o634
17679e4223A37895j7458A4393J00575a05641B1276M3371P7768E4132d2914B92490
17667A3034f4933c1275k93710f2771A98009a16795a1075A58388G7506L4825e8290
17655d3515A21423c4493C8844c8730A70739J4029a38154C17386G2162a59195H9686
17643a920p2357j5918A63525k984J15900c18860A7995c5212j04343H3521j7991
17632F5530b4925A91233j3843l8507N3197A9329M1171M3474J22125j01884E9174
17620A26909c57195R0044M4049A3933J68835m0705b0356A84451c66482a52018
$$ plain form
17701 161602 369532 147951 38782 -216312 159939 -71126 -151272 -252957 123692 -98792
17690 -8954 -51886 -77090 -132596 309184 448445 -179380 339561 52826 -79435 -47589 -54223
17679 -54223 137895 120437 14393 114968 -105641 21276 64647 142415 54132 -42914 292490
17667 13034 -64933 -31275 -324985 -62771 198009 -116795 -11075 158388 77506 112331 -58290
17655 -43515 121423 -34493 38844 -38730 170739 184768 -138154 317386 72162 -159195 89686
17643 -1920 -74277 -90195 163525 160541 276441 -318860 17995 -35212 -139555 83521 65530
17632 65530 -24925 191233 177390 138883 192080 19329 60500 103974 226099 124215 59174
17620 126909 -357195 -267151 -223102 13933 182768 142063 -20356 184451 -366482 -152018
17609D17264A69749p8433N6393e389G1119f0734j18720h5249C68223d1299k7912
17598f9211B05229a08045A50690E3017a639l453A34991E5552a48303d6204G4228
17586C62001h0300F3751H369K03466a2331j74647A55226e1867B11164A6973Q9339
17575A06312i038D9507b54117b4170j37606B53883j16060M269P5678a02937d3843
17563A84544d0468B8161b32190F0423J70304J82688A52637E6655J48704i9714
17552A34207J05474o9660c11899C72041j56695r0803K01294K47198r1851F5800
17541a01497B26713c74572H6859c7108l66972D49332I0500J65906h826C24186
17530a27462C10251A9930R9238D7761a45196B07244a77421A40623h657D5992J21458
$$ plain form
17609 417264 169749 91316 147709 -5389 71119 -60734 -179454 -85249 368223 -41299 -69211
17598 -69211 205229 -108045 150690 53017 -1639 -5092 134991 55552 -148303 -46204 74228
17586 362001 -80300 63751 8369 211835 -12331 -186978 155226 -51867 211164 16973 106312
17575 106312 -9038 49507 -254117 -24170 -161776 253883 137823 142092 217770 -102937 -43843
17563 184544 -40468 28161 -232190 60423 230727 413415 152637 56655 205359 -99714
17552 134207 239681 170021 -311899 372041 215346 124543 325837 573035 481184 65800
17541 -101497 226713 -374572 86859 -37108 -404080 449332 90500 256406 -8826 324186
17530 -127462 310251 19930 119168 47761 -145196 207244 -177421 140623 -8657 45992 167450
17519A67450a94042I1477b56275d3552F02647b7501k41988A3132b02582a5751
17508D6421A5082K6442a47689C54175C7132N874d9673C54938A22014Q4474K3017
17497B29505q0202K81119k08396J57935a6910B63582f1543A80319R8467h7750
17486B56196F4018L82644A49575k0572d4165F5577k8661C742J02488J13264J38560
17475C58054b5289D99053B33708b12036A949K27756K60428B11606r5854g4401
17464B07294I4609J01149m4529M4904Q734g3833n6063A0895L78262E5493J82957
17453B38450M036J36555l0494j27228I1084N7011R4236J1694j09626m4247o304
17442I3848b29772B14318K1692J81148L25077B19567K3679b35763C29752L0877
$$ plain form
17519 167450 -194042 91477 -256275 -43552 602647 -27501 -269489 13132 -202582 -15751
17508 46421 15082 41524 -147689 354175 37132 43006 -49673 354938 122014 206488 229505
17497 229505 149303 430422 222026 379961 -16910 263582 -61543 180319 278786 -87750
17486 256196 64018 446662 149575 129003 -44165 65577 36916 3742 106230 219494 358054
17475 358054 -25289 499053 233708 -212036 1949 229705 490133 211606 115752 -74401
17464 207294 94609 195758 151229 196133 204867 -73833 -129896 10895 389157 55493 238450
17453 238450 242486 379041 348547 221319 91084 148095 242331 254025 144399 100152 93848
17442 93848 -229772 214318 236010 417158 742235 219567 243246 -235763 329752 360629
17432C60629j34572J34581J13759k9790B12960K2680h0570b2179j6272A75838
17421B56536J63043j22131k6463a65082C10566Q5257q0206J25293k08833A09332
17410B98464N2593j37795M2022p6444n3519O2291J6716P9243C4757R7864J35534
17399B68155I7198L57813k23508M209m2342O6945a09318A78073N9271G1243d0675
17387B66809M5657c5173C08526j26142E8069J62084N7184a37851k6109P6156A09611
17375D8125J64053J75336p7791J7505A13702b1589n3937k6102a7675B7674M01936
17364D29610j61829C7461R7676J08229K8045j17963n795J90169b30955A61252
17353a06052A36532N2290F7492K68841J4474j20261H1723K2669J68117j34108
$$ plain form
17432 360629 226057 360638 474397 444607 212960 235640 -80570 -22179 -38451 175838
17421 256536 419579 297448 270985 -165082 310566 395823 315617 440910 232077 109332
17410 298464 351057 213262 255284 178840 125321 187612 204328 283571 34757 132621 268155
17399 268155 97198 455011 231503 235712 193370 260315 -109318 178073 237344 71243 -40675
17387 266809 312466 -35173 308526 182384 58069 220153 277337 -137851 -163960 -87804 109611
17375 48125 212178 387514 309723 327228 113702 -21589 -75526 -101628 -17675 27674 429610
17364 429610 267781 37461 135137 243366 271411 153448 147653 337822 -230955 161252
17353 -106052 136532 188822 67492 336333 350807 230546 81723 104392 272509 138401
17343A38401M5289H0659c716D32392I7989J51412p3999K1565a39189A11168K78385
17332C89553j15781f9112F5106e1438A96997K28996B08821p8309L11412A47974
17321C7549b06129A67595f9106A85735G613J93154m1935J89472I0263B8699J04507
17310A33206k7318J42814q4163o911n5921J75476m5181r2185n7014l3126M4451
17299I4128K10503J65598j65219D5708K95285m6723A07120L32982H6051K80498
17289C66549P6584A62203O6459D3708P8994J23419B5765J59196C3043K18524j06972
17278A44595n3251J64846J29554j40101c1959A79368q7447L25679J27692A31498
17267A27664J27675j09080L7328L0691LL884e6707C65059B378K87129A26964k8800
$$ plain form
17343 138401 183690 80659 -3716 432392 97989 249401 175402 196967 -139189 111168 389553
17332 389553 273772 -69112 65106 -51438 196997 425993 208821 130512 441924 147974
17321 37549 -206129 167595 -69106 185735 7613 200767 158832 348304 90263 28699 133206
17310 133206 105888 248702 164539 157628 101707 277183 232002 139817 82803 49677 94128
17299 94128 304631 470229 305010 45708 340993 294270 107120 440102 86051 366549
17289 366549 443133 162203 228662 43708 122702 246121 25765 184961 33043 251567 144595
17278 144595 91344 256190 385744 245643 -31959 179368 91921 417600 545292 131498
17267 127664 255339 146259 183587 214278 214281 218165 -56707 365059 2378 289507 126964 98164
17255I8164J73605K3297j39935L86793B59474J95572f3809B2830R5596K88143
17245D06569J7826k08564J32109l4791L9046i7439A00794a16458f766B05461K17509
17234D22970A62812E8886J83416D4896J79712K07395j73769P3324C1677J97331
17224B29008g1351C61121r1026A07450l8878L28034D6295K23490n7123B5365a9571
17212A12442B8014N705e3547H7171J77211c1211E37514k57130m3856O4160Q8618
17201C89306r3310j40149O9414M9494K27622p7341J04667B15334I9062K1742p634
17190A13170J60639a48622C20566A46315K87577q3415L8118A03376P804L08462
17180D19642o7427P9092A67776h1587C59902j47529j0749k0484J93753j25338
$$ plain form
17255 98164 271769 295066 155131 541924 259474 455046 -63809 22830 118426 406569
17245 406569 424395 215831 347940 313149 352195 -97439 100794 -116458 -6766 205461 422970
17234 422970 162812 58886 242302 44896 224608 432003 258234 331558 31677 229008
17224 229008 -71351 361121 270095 107450 68572 396606 46295 269785 212662 25365 -19571
17212 112442 28014 33719 -53547 87171 264382 -31211 537514 280384 236528 300688 389306
17201 389306 295996 155847 225261 274755 502377 425036 529703 215334 99062 120804 113170
17190 113170 273809 -148622 320566 146315 433892 350477 388595 103376 111180 419642
17180 419642 352215 431307 167776 -81587 359902 212373 201624 181140 374893 249555
17170B49555J6175M1086q8962L6145n4368J19758N871A23274k0007L02503J88061
17159E93831k41661m6190o4705k6082A8159J99616p9178M35942B16087H3866K74920
17148C58786k4467L58848B54501A07154L11624j57574K40219j61291M0992j20694
17138B60430J0332K03737A87200q6111N57246B68713J73043R157e79A25963K06750
17127C32713K11878Q3425B84399j12060p720J38147P9863l6551K92596j64942
17117D73732L07505a02849D26281J08470B62736H6762C7850L96715l27p2009A70515
17105B87032J86539J20438B83880P4979K84838J587L0333j97438j92893A11786
17094B88215J43835A29417M22913j08025J92501n1328j83261o3585Q8329P4899
$$ plain form
17170 249555 265730 306816 217854 253999 199631 319389 325260 123274 103267 405770 593831
17159 593831 352170 305980 241275 215193 18159 217775 138597 574539 216087 83866 358786
17148 358786 334319 693167 254501 107154 418778 261204 501423 340132 381124 260430
17138 260430 270762 474499 187200 101089 658335 268713 441756 450913 -579 125963 332713
17127 332713 544591 628016 284399 172339 164619 302766 382629 346078 638674 473732
17117 473732 781237 -102849 426281 534751 262736 86762 37850 434565 434238 362229 170515
17105 287032 473571 594009 283880 358859 643697 645284 675617 478179 285286 111786
17094 288215 432050 129417 552330 444305 636806 585478 402217 338632 426961 501860
17084E01860J2457j37462K66976q4556k55218a23458C17637J40704J37973j17142
17074D79172J10158B51794L98807N691j93483A75806K30229M62914D34461O2147
17064D96608p0479j70422L11040k14540L88945j70843k04659L4126K20148P7937
17054F97861l9426J53322K3314l09753M7970K6816j18540M4491Q5442j55075m6602
17043D09820l0298J89669B71102K60867J59026K0622C18207J01446K22319k29770
17033D12202j87623O97832J18665k79420Q3712l10666K6621J51768k3802O0760
17023G50049C71754L12232J32872l10204q4798J5675N16198m0825M7574k70053
17013F90425l22909R0058K02809K18780M218l33068L81190C49842L83217J25713
$$ plain form
17084 501860 514317 376855 643831 559275 304057 -123458 317637 458341 596314 479172
17074 479172 589330 251794 650601 656292 462809 175806 406035 868949 434461 496608
17064 496608 426129 255707 566747 352207 741152 570309 365650 399776 619924 697861
17054 697861 658435 811757 835071 525318 573288 600104 481564 526055 611497 456422 409820
17043 409820 379522 569191 271102 531969 690995 711617 318207 419653 641972 412202
17033 412202 224579 922411 1041076 761656 845368 534702 561323 713091 689289 750049
17023 750049 371754 683986 816858 506654 421856 437531 953729 912904 960478 690425
17013 690425 367516 457574 660383 879163 883381 550313 931503 349842 733059 858772
17003H58772M051J08850D36663J04806K22734J76680k81766K4665K5324R1366
16993H00472l78563M50856j19857j64147m2300K86599r1881m5253N24999m53743
16983G67182M00362n35800q6623L92985L11957k34489j53172J01108k49182L1333
16973G45661J22921n1306K06535l86L00203o33070J31210J08553k39991L42363
16963A032693l08209L67676k06920Q1226J98097j77138J50651j02666K59505j65599
16953A129316J55256j27082j37491R0187j88222K39513m3796K70345j04778q2724
16943A200524N412k2112K9298J80917l11190k6084M30726l75590K43360J74211
16933A529472p30868K24124J21062J22144J82028l98657L82889k54878L96170
$$ plain form
17003 858772 862823 971673 436663 541469 764203 940883 659117 683782 709106 800472
16993 800472 421909 872765 752908 588761 546461 833060 741179 695926 1220925 767182
16983 767182 1167544 631744 545121 938106 1250063 1015574 862402 963510 714328 745661
16973 745661 868582 817276 1023811 1023425 1323628 690558 821768 930321 690330 1032693
16963 1032693 724484 1092160 885240 966466 1164563 987425 1138076 1035410 1294915 1129316
16953 1129316 1284572 1157490 1019999 1110186 921964 1161477 1117681 1388026 1283248 1200524
16943 1200524 1205936 1183824 1213122 1394039 1082849 1056765 1487491 1111901 1355261 1529472
16933 1529472 798604 1022728 1143790 1265934 1447962 1049305 1432194 1177316 1573486
16924A573486k59221L50617j22258k52435L48264j24804J39038l46014J39181
16915A445854p090k50669L90474q3790L62759k22713J59098m22388M66385M533
16905A842453l69015l1316L28134j07405R9198L0727k79805N08229j04057o3198
16895A853945J37907n8850Q5235l01492J63203J32389k34630L20331J75610k46857
16885B026791M70988k82350r5037l2876O03652n03001L41808k45826M2989j06383
16875B220755J88408J63265J45977n07245K82909j14222K17433k81811J15871
16866B431340L77110j20589j08912J61504k06068K99586M3526k65185M48469J26589
16856C187370m17816M36632r9571M40915m46702L22271k29363J24969k02995M19043
$$ plain form
16924 1573486 1314265 1664882 1542624 1290189 1638453 1513649 1652687 1306673 1445854
16915 1445854 1438764 1188095 1578569 1494779 1857538 1634825 1793923 1371535 1837920 1842453
16905 1842453 1473438 1442122 1770256 1662851 1762049 1792776 1512971 2021200 1917143 1853945
16895 1853945 1991852 1933002 2018237 1716745 1879948 2012337 1777707 2098038 2273648 2026791
16885 2026791 2497779 2215429 2120392 2087516 2691168 2188167 2529975 2284149 2327138 2220755
16875 2220755 2409163 2572428 2718405 2211160 2494069 2379847 2597280 2315469 2431340
16866 2431340 2808450 2687861 2578949 2740453 2534385 2833971 2877497 2612312 3060781 3187370
16856 3187370 2769554 3206186 3106615 3547530 3100828 3423099 3193736 3318705 3115710 3534753
16846C534753j50204k8255J51752n2507L58720J77617j56828l4333N8812k86867
16836C572660O05919j56293N8018J03895R346J25174K19649l08802M24903n9619
16826D594850p3999L55901M174K71580K29748J5396k58241M67822o567O6649J59850
16815E827163j65384L86745J22136K00905P3041o5865J50721J20669K78838L17574
16805G246543K7169l5833K15623L5461L40253P87L89471L39032l1137J39994N20775
16794I188138K6474M61340j77306Q57405k23530j23843J115593j48563K8204L51804
16784A1355716M86501M92054q712Q23596J87620M68155J38946M73989O51275N20735
16774A5589875L65813O51708M26213K30998Q18296M73446L88901Q49364J095368
$$ plain form
16846 3534753 3384549 3356294 3508046 3455539 3814259 3991876 3835048 3800715 3859527 3572660
16836 3572660 4178579 4022286 4080304 4184199 4193545 4318719 4538368 4229566 4654469 4594850
16826 4594850 4520851 4876752 4880926 5152506 5382254 5397650 5139409 5607231 5600664 5667313 5827163
16815 5827163 5661779 6048524 6170660 6371565 6444606 6378741 6529462 6650131 6928969 7246543
16805 7246543 7273712 7237879 7453502 7488963 7829216 7830003 8219474 8558506 8527369 8667363 9188138
16794 9188138 9214612 9675952 9498646 10356051 10132521 10008678 11124271 10975708 11003912 11355716
16784 11355716 11842217 12334271 12325559 13149155 13336775 13804930 13943876 14417865 15069140 15589875
16774 15589875 15955688 16607396 17033609 17264607 18082903 18556349 18945250 19794614 20889982
16765B0889982M61088N37594J239649O44757Q92814J052016J000676J511076Q15778
16756B9045430J008208J436112J692151J198452J747618J555637J668512J936330
16748D1288450J999551K360886J930278K584140K740041K931251K904801L313380
16740F2052778L261156M020557M094581M292600M712839M749009N399990N561144
16732I8144654O141825O333756P009647P137813P447166P674399P884525Q274931
16724A56048716P931068P695389P851516O940203O185872N148442M440107K956283
16716B05197596J209151L29376j539584k921654m118656n318266o257768o854138
16708A79726057p897482p852727p889509q451522q030170p771948p801849p428541
$$ plain form
16765 20889982 21351070 21888664 23128313 23773070 24665884 25717900 26718576 28229652 29045430
16756 29045430 30053638 31489750 33181901 34380353 36127971 37683608 39352120 41288450
16748 41288450 43288001 45648887 47579165 50163305 52903346 55834597 58739398 62052778
16740 62052778 65313934 69334491 73429072 77721672 82434511 87183520 92583510 98144654
16732 98144654 104286479 110620235 117629882 124767695 132214861 139889260 147773785 156048716
16724 156048716 163979784 171675173 179526689 186466892 192652764 197801206 202241313 205197596
16716 205197596 206406747 206736123 205196539 202274885 198156229 192837963 186580195 179726057
16708 179726057 171828575 163975848 156086339 147634817 139604647 131832699 124030850 116602309
16700A16602309p096484o560241n945532n831887n340430n423347m703637m310191
16692G1390560m083921l958671l388183l356753l018658l114379k482760k465563
16684D5521672k173565k244555k279704j507111j671779j873084j506858j757630
16676C0507386j080144j377084j563027q18966o12933j215474j013241r96467
16668B1830050r83079q24491m48983n69092o71660r99666o62331n70011l63731
16659A5737006p72730k42031m93725k28663n67665n30659k75707n09269m08500
16650A1708057m30354l47508o17587j32388J13875n20501k13316l42785l13967
16641H903526l55880j53686j2249m29513r7515m23869J80305o81514J41760r2949
$$ plain form
16700 116602309 109505825 102945584 97000052 91168165 85827735 80404388 75700751 71390560
16692 71390560 67306639 63347968 59959785 56603032 53584374 50469995 47987235 45521672
16684 45521672 43348107 41103552 38823848 37316737 35644958 33771874 32265016 30507386
16676 30507386 29427242 28050158 26487131 25668165 25055232 23839758 22826517 21830050
16668 21830050 20846971 20022480 19573497 19004405 18332745 17333079 16670748 16100737 15737006
16659 15737006 14964276 14722245 14228520 13999857 13432192 12901533 12625826 12116557 11708057
16650 11708057 11277703 10930195 10312608 10180220 10294095 9773594 9560278 9217493 8903526
16641 8903526 8547646 8393960 8381711 7952198 7854683 7430814 7611119 6929605 7071365 6978416
16631F978416m22408N7790K7971n0876l45439l18448K99684o02780j22316l35974
16621E165620K81227N7954o1120n07483p4246j48920J08714J8889p2633j3824
16611D754178k57907k53793j89108J71660J75524n53605K73105j5950l75499k14379
16601C514226L17913n5320k92495n5615l33375K57880l51489j37614L42990J71487
16591C378588k24956k70286K22587L0345j74605l3085m87884L23293q4785j31325
16581B547887K0271j75447n8204J04779J49467j80675k14032o6839R419k31250
16571A905376L75666J7465k9324l31050L55163l43523L45133m38693j30284K93117
16561B019046k08951k80973M67383k82258N2207K50106n12723J79767o1173P8699
$$ plain form
16631 6978416 6556008 6613798 6641769 6590893 6245454 5927006 6226690 5623910 5501594 5165620
16621 5165620 5446847 5504801 5443681 4936198 4861952 4713032 4821746 4840635 4768002 4754178
16611 4754178 4496271 4242478 4053370 4225030 4400554 3846949 4120054 4104104 3728605 3514226
16601 3514226 3832139 3776819 3484324 3428709 3095334 3353214 3001725 2864111 3207101 3378588
16591 3378588 3153632 2883346 3105933 3136278 2961673 2928588 2440704 2763997 2679212 2547887
16581 2547887 2568158 2392711 2334507 2439286 2588753 2408078 2194046 2127207 2136626 1905376
16571 1905376 2281042 2298507 2269183 1938133 2293296 1949773 2294906 1856213 1725929 2019046
16561 2019046 1810095 1529122 1996505 1714247 1766454 2016560 1503837 1683604 1622431 1701130
16551A701130j42730N65Q8546n44930L41531J9161K64206k25851j32290j23493
16541A245845J50917j65371L50078l4672n2918k0954J1478j48629R0785k82266
16531A144293m6513J84281j00437J37124J19539l26346K81107l43310K19841j51177
16521A118402L56046m55643m34878M94648K21412l57734l31975M45846l11696
16512G44428O6338N07833l9221l1313n88278J50223J31938Q271L56461k55328
16502A051352k74397K04124j30559M5273J97214l43477J68853l1483j79190N02090
16492A209800l74854Q2940k3158j04112j71401L02360o7689l70806M42572j44819
16482G80833k06710J04614M9410q821p3086j47920P1315L59421l34844K00995
$$ plain form
16551 1701130 1558400 1558965 1647511 1102581 1444112 1463273 1727479 1501628 1369338 1245845
16541 1245845 1396762 1231391 1581469 1546797 1493879 1472925 1484403 1335774 1426559 1144293
16531 1144293 1097780 1282061 1181624 1318748 1438287 1111941 1393048 1049738 1269579 1118402
16521 1118402 1474448 1018805 583927 1078575 1299987 942253 610278 1056124 744428
16512 744428 810766 1318599 1279378 1248065 659787 810010 941948 950219 1306680 1051352
16502 1051352 776955 981079 850520 895793 1093007 749530 918383 886900 707710 1209800
16492 1209800 834946 917886 894728 790616 619215 921575 853886 483080 925652 780833
16482 780833 574123 678737 728147 719326 646240 498320 569635 929056 594212 795207
16472G95207j83589K8868J74033l21965J48389J18528K24408D33699J95146L9623
16462F68468P2878j65759q3453J33475p3036M19741l72323B10768M66432P5107
16452G52307B90513O11866j98348j18137J29094B62714K83738o8976L3629J88214
16442F99319B20421K97220B16287Q0287L40257j63638j58734J94511L5965K91718
16432H36653l92292n0590j07420g7864B04080p7102K31061J37961j48856J84967
16422E32111J5586j44527n2763O5521j14199a1881C79854K4412K46774l5556n2098
16411E63386J5474A61440A1547M77845j15022A74323K34369l455L2213o573N37
16400D31414j49551K24715F3033L78792j10574q8825k4768p1904J58378j0045
$$ plain form
16472 795207 611618 640486 814519 492554 640943 759471 983879 433699 628845 668468
16462 668468 741346 575587 492134 625609 552573 972314 599991 210768 677200 752307
16452 752307 290513 902379 704031 585894 714988 262714 546452 477476 511105 699319
16442 699319 220421 517641 216287 296574 636831 473193 314459 508970 544935 836653
16432 836653 444361 393771 286351 -77864 204080 126978 358039 496000 347144 532111
16422 532111 547697 403170 350407 415928 301729 -11881 379854 404266 651040 615484 563386
16411 563386 578860 161440 11547 489392 374370 174323 408692 405237 437450 430877 431414
16400 431414 281863 506578 63033 441825 331251 242426 217658 145754 304132 294087
16390B94087j02325L40339A88148e4674C02819j9082M0564A24635L59431l1642
16380D52424c3913D13167C2097K49678J16026K18223B20214j069J31051J26514
16370D76710A19328m929i1537C51407j7813N1932j16723L1300j09367j7414K70920
16359D44242j34286A05851R0561b4183A81640j9727K92357f6440H6205J61434
16349B47639K57933A75271H34J73827N81772A09757L00379A00751L2699Q509n8729
16338H3230J98081J63777j79314K03121d9835G6602L74404d0905C09141A25892
16327A08136L45141j59773j0242e6807b2081D5960K10495A06719k2016J5653A3203
16315B86117A31549N7127p1003J26000i1744A76031K87704j52951A18395b32899
$$ plain form
16390 294087 191762 532101 188148 -54674 302819 283737 324301 124635 484066 452424
16380 452424 -33913 413167 32097 281775 397801 616024 220214 219145 350196 476710
16370 476710 119328 114399 -91537 351407 333594 385526 268803 300103 190736 173322 444242
16359 444242 309956 105851 196412 -24183 181640 161913 454270 -66440 86205 247639
16349 247639 505572 175271 834 174661 756433 109757 410136 100751 133450 141959 83230
16338 83230 281311 445088 265774 468895 -49835 76602 451006 -40905 309141 125892
16327 108136 453277 293504 283262 -56807 -22081 45960 256455 106719 84703 100356 13203
16315 286117 131549 188676 117673 243673 -91744 176031 463735 310784 118395 -232899
16304B16979B2305O1943a14797I0623K82132D7642L05899F6613a3510p0895A25800
16292A60435a84476b2844A33427K0805f4009B41580d6980L491B46383b0625C39203
16280f2294o8803C45685E0212Q8922d8448j81115H2427K86030b30347A64744L27122
16269D91866i0591b5092D5022g8150F9312J0730K62931n4723r2972B7596K4422
16258E2018A248g7859A75087L7480k5935h7284d649k2023j33118q7966r863i1408
16245a34255G562O4506J2182a39514C87436A39340B6859i750r3066A00334n0029
16234E0305I731K61815b58204o3122H9096J50343b17696C86368A12718K5535l488
16223A34765j211J67793j31336J93551N929b03328F4619A9580R8495Q5853b21075
$$ plain form
16304 216979 22305 84248 -114797 90623 372755 47642 353541 66613 -13510 -84405 125800
16292 160435 -184476 -22844 133427 154232 -64009 241580 -46980 -43489 246383 -20625 339203
16280 -62294 -131097 345685 50212 139134 -48448 -229563 82427 368457 -230347 164744 491866
16269 491866 -90591 -25092 45022 -78150 69312 80042 342973 288250 195278 27596 52018
16258 52018 1248 -77859 175087 212567 186632 -87284 -4649 -26672 -159790 -247756 -257619 -91408
16245 -134255 7562 72068 84250 -139514 387436 139340 26859 -9750 -102816 100334 50305
16234 50305 9731 271546 -258204 -321326 89096 239439 -217696 386368 112718 138253 134765
16223 134765 133554 301347 170011 363562 369491 -203328 64619 19580 118075 203928 -221075
16211A39663K3498c5652A59219a5737p8200A86914J55959j03035J09666H6283
16200C05475A28928J28285a20099B85232o2778k3446b6865j69234M3379A48450
16189C05593A13110C5304e6569C213J2600J19526E9178k2672Q996a34585B15411
16177a2867l6294E0889a3433A1673N6595N9297b1290A29889c06399A48910J04467
16166B53377a4558A90224K4034B5J52280g3289F7341J72962I7541b51497F8567
16154A0285a4501q1824a7992A41889a10912j70739A72534g1088L1586B4933N7784
16143H2717C959a70767B21415J07128b39248B34156K0538A20483l7134J07741
16133A91090E2252j6094R6466D8046L9658J912L1441p71P6730L1947M06570g6552
$$ plain form
16211 139663 163161 -35652 159219 -15737 -93937 186914 342873 239838 349504 86283
16200 305475 128928 257213 -120099 285232 222454 199008 -26865 -196099 -152720 148450
16189 305593 113110 35304 -56569 3213 15813 135339 59178 36506 45502 -134585 215411
16177 -12867 -49161 50889 -13433 11673 68268 127565 -21290 129889 -306399 148910 253377
16166 253377 -14558 190224 214258 25 152305 -73289 67341 240303 97541 -251497 68567
16154 10285 -14501 -96325 -17992 141889 -110912 -281651 172534 -71088 -39502 24933 82717
16143 82717 3959 -170767 221415 328543 -239248 234156 254694 120483 83349 191090
16133 191090 52252 36158 132624 48046 87704 89616 121057 120286 197016 228963 635533 -76552
16120b7135N387H878N4792B757b06687g9930B56292E5254c9104j99810A86125
16108A46123C204b25260A86486H3287A4736N2408h112m07618i3937A25194B3992
16096c48931N6443N8594Q0022c8353B7233n771F752c06382O0822d979G4003e3584
16083A66989a53368d5513B55225A21268K06415p9228i0831j0244l07659A53308
16072e9578A07878g5511D05711i5324j24650b7897A00963a53883C02435H7354
16061b12709D0628K34477F4989k6475J3493a79476J8896d9132A8519J04567a20745
16049A39965a78574P0968c1670i980B33874b5982B84394A18343g3796p0579A55697
16037A57576a62376A47727p76a32751A02682c3074k17172d1700J0264A86328A8090
$$ plain form
16120 -27135 -21748 8878 63670 2757 -206687 -79930 256292 55254 -39104 -238914 186125
16108 146123 3204 -225260 186486 83287 14736 67144 -8112 -415730 -93937 125194 23992
16096 -348931 -292488 -233894 -153872 -38353 27233 21462 6752 -306382 -245560 -4979 74003 -53584
16083 166989 -153368 -45513 255225 121268 327683 248455 -90831 -101075 -408734 153308
16072 -59578 107878 -75511 405711 -95324 -219974 -27897 100963 -153883 302435 87354
16061 -212709 40628 275105 64989 38514 52007 -179476 -160580 -49132 18519 123086 -120745
16049 139965 -178574 -107606 -31670 -9980 233874 -25982 284394 118343 -73796 -144375 155697
16037 157576 -162376 147727 146951 -132751 102682 -33074 -250246 -41700 -31436 186328 18090
16025a55879c7326j08283A67495e378A17309J60436A17808k541a74903A06370
16014B49551b80044M9937a7308m2660a0130A45036f3009l9269k2663b6533H0446
16002A56976P3405a88229A27583E2908c5374k402O034a4752j52066A09465a02634
15990H0076d3599l44993J23094I0676g4794E1992N8994J55783k6902L928J49965
15979C93760j79252c66729K1912F9878N7274J44969A19104b97686F2163b90958
15968H1350a6029l9916j13383q3B86559j21931L6569e3183I191c05140A0324D287
15955c5753C0202e3715k25550J33030f2390m31007A21895c57233l885P4433a16853
15943A56804L8174C2552K86008a04747B61906m1340b19687B4825R651o4j5924
$$ plain form
16025 -155879 -37326 -145609 167495 -5378 117309 277745 117808 115267 -174903 106370
16014 249551 -280044 -230107 -17308 -59968 -10130 145036 -63009 -102278 -124941 -26533 80446
16002 156976 230381 -188229 127583 52908 -35374 -37776 -31742 -14752 -166818 109465 -102634
15990 80076 -43599 -388592 -265498 90676 -74794 51992 110986 266769 239867 243795 393760
15979 393760 214508 -366729 -344817 69878 127152 272121 119104 -297686 62163 -290958
15968 81350 -16029 -55945 -169328 -169411 286559 164628 201197 -53183 9191 -305140 10324 4287
15955 -35753 30202 -53715 -279265 -146235 -62390 -493397 121895 -357233 -361118 -286685 -116853
15943 156804 194978 32552 318560 -104747 261906 220566 -219687 24825 34476 34412 18488
15932A8488b03793B04510g9970j13176A8518b80057J34102a3928A8781a84742
15921c49619B6786N6172k745c61812L7012b0039k0852A076K04312a13479A21564
15909a15284G2121h5406k62927J55985B2822a17093M6147l32317c3142B38912
15898A28408b70403A39258o4944L34317A38634a9377o3160c5722B48667h3580
15887H9002C6820P3716a2753j15582A36151L6827B8240c2519A67228b31338O3214
15876a68124A27736b201n418p7401j00489b1004j05848I1724a30683k4570i618
15864a91227A12590a20562A21963g9659O07n471b395C16475a47454C5186M9715
15853H4901l9182g5034H9905b25600E6664f241B37700g620A8189O2537K06670
$$ plain form
15932 18488 -203793 204510 -79970 -193146 18518 -280057 -145955 -13928 18781 -184742
15921 -349619 26786 82958 80213 -361812 -324800 -20039 -40891 1076 205388 -113479 121564
15909 -115284 72121 -85406 -348333 -192348 22822 -117093 -70946 -403263 -33142 238912
15898 128408 -270403 139258 74314 408631 138634 -19377 -82537 -35722 248667 -83580
15887 89002 36820 110536 -12753 -128335 136151 172978 28240 -32519 167228 -231338 -168124
15876 -168124 127736 -2201 -7619 -85020 -185509 -21004 -126852 91724 -130683 -155253 -9618
15864 -191227 112590 -120562 121963 -79659 -79052 -84523 -2395 316475 -147454 35186 84901
15853 84901 45719 -75034 89905 -225600 56664 -6241 237700 -7620 18189 80726 287396
15842B87396a18276j07951A36846b4257B4075L32119p5617O9760a33294n7212
15832a90506h1533B41882a24343M4042A21804a03941A56336n9491f342j28589
15822a34931j27190a28247A93636o9103g4063A97810b5951n2379B11925a9283
15811B8375c4729H2970c4384B54384p0532M9825b53841d8595g645C7754a04010
15799B82511B9566c57804a25786B3855H080J35050j8552a20094d2929k91172d3619
15787e08052b48597M4869Q6918B9173d1830D1464b6864A27046a38545j32865c7108
15775H7332Q3440A0365J15480M6360c68063a18194A22764b11456K6911A92766
15764c71488C2223R9965h6874J8138j54197A98639b64346c9039L772F2909K86307
$$ plain form
15842 287396 -118276 -226227 136846 -24257 24075 356194 280577 350337 -133294 -190506
15832 -190506 -81533 241882 -124343 -80301 121804 -103941 156336 96845 -6342 -134931
15822 -134931 -262121 -128247 193636 124533 -74063 197810 -25951 -78330 211925 -19283
15811 28375 -34729 82970 -34384 254384 183852 233677 -253841 -48595 -7645 37754 -104010
15799 282511 29566 -357804 -125786 23855 8080 143130 124578 -120094 -42929 -334101 -43619
15787 -508052 -248597 -203728 -116810 29173 -41830 41464 -26864 127046 -138545 -271410 -37108
15775 87332 170772 10365 125845 172205 -368063 -118194 122764 -211456 -184545 192766
15764 -371488 32223 132188 -86874 -68736 -222933 198639 -264346 -39039 -35267 62909 349216
15753C49216a40613a3911k17307m7498A32707m137b38372q9967A10039A1710a41347
15741A8707a16140d4303A38447a80232D8140a07182H2350a42584A21966g3254
15730e977m4733A06788A5096f6366B6989b6349k30113d9193q4818C3629a51618
15718I7338J5361B6646c63674g4855A5834J69001a15617e2005B43184a76571n0271
15707b26842F5277b08861p0346g4951A7413b59763I0032M131k024B3075e173F0455
15694A0782a04041l9795A09747D9362i0664A51194J80407j64978b16834J04532
15684a12302d0741B46066b64579b4151j23601B10954D7813a65729A4786a7908
15673b1965C47595A38078l7492P6215J49293A21712a74383k00627A07781d1887
$$ plain form
15753 349216 -140613 -13911 -231218 -278716 132707 128570 -238372 -328339 110039 11710 -141347
15741 18707 -116140 -44303 138447 -180232 48140 -107182 82350 -142584 121966 -73254
15730 -5977 -50710 106788 15096 -66366 26989 -26349 -256462 -49193 -134011 33629 -151618
15718 97338 112699 26646 -363674 -74855 15834 184835 -115617 -52005 243184 -176571 -226842
15707 -226842 65277 -208861 -279207 -74951 17413 -259763 90032 94163 92139 23075 -5173 60455
15694 10782 -104041 -143836 109747 49362 -90664 151194 331601 166623 -216834 -112302
15684 -112302 -40741 246066 -264579 -24151 -147752 210954 47813 -165729 14786 -17908
15673 -21965 347595 138078 100586 176801 326094 121712 -174383 -375010 107781 -41887
15662A00282a86979A4832N9405b7355l13777f9731k14702B30070i7897b8040G7334
15650b71301a4411j68896B04431p8588a7054C59192e6340B11794a07966c2230
15639B04633q4025K14189f1631k90354g6782p1652a9582F1921d729B25411a21348
15627C63228A39400h731E0055M672k4331M40170a14468J4139j18449A15072d4108
15615a36092C0396g2285k45110c2678k05695J08760q1768B4437O423b17215A1224
15603F4526J75161g9860H953b52479i3992A34139B1578R6325j5804m7936B0043
15591B20698i5836C2183d4357H5188J52743b79863B3966J76937H8986a27234G7593
15579D6279K13400b32624a06999J5008C60920a12447A08063m0632d806l4950k68639
$$ plain form
15662 100282 -186979 14832 74237 -27355 -341132 -69731 -284433 230070 -97897 -28040 77334
15650 -271301 -14411 -183307 204431 125843 -17054 359192 -56340 211794 -107966 -32230
15639 204633 120608 334797 -61631 -351985 -76782 -148434 -19582 61921 -4729 225411 -121348
15627 363228 139400 -8731 50055 54727 30396 470566 -114468 -100329 -218778 115072 -44108
15615 -136092 30396 -72285 -317395 -32678 -238373 -129613 -211381 24437 30860 -217215 11224
15603 64526 239687 -79860 8953 -252479 -93992 134139 21578 117903 102099 54163 20043
15591 220698 -95836 32183 -44357 85188 237931 -279863 23966 200903 88986 -127234 77593
15579 46279 259679 -232624 -106999 -91991 360920 -112447 108063 67431 -4806 -39756 -308395
15568c08395C86354a62781f0207A11551K08407k8693p1303L40198c23992d6640
15557H67J45157c20910B05719b37744F385J11518O391B3432b5911m8677j73413
15546b48001O9618L247A76648q1679a01149b6374H437M7484c8484A54970g4870
15534a80452m5565a459k865r3047A4395J2614M03325A69934H1355J11633a08917
15522F8377L00450A04559K18088p4220b13612p5516a29570A40079C5535K6089
15512F1624g9566k53676J37516d2517B16415B7241L005N4318f4264C03743b28146
15500a6306j53531d8725l27985A39414A2476a12464A72606F1532J40993M5195
15490B47720J40357F6873j1032c174j17630p562d2032K0675B6550h1591r2271
$$ plain form
15568 -308395 386354 -162781 -60207 111551 319958 291265 219962 560160 -323992 -46640
15557 867 146024 -320910 205719 -237744 6385 117903 124294 23432 -25911 -74588 -248001
15546 -248001 -178383 -175136 176648 94969 -101149 -26374 8437 55921 -38484 154970 -74870
15534 -180452 -226017 -1459 -4324 -97371 14395 27009 430334 169934 81355 192988 -108917
15522 68377 368827 104559 322647 248427 -213612 -289128 -129570 140079 35535 61624
15512 61624 -79566 -333242 -195726 -42517 216415 27241 30246 84564 -64264 303743 -228146
15500 -16306 -169837 -48725 -376710 139414 12476 -112464 172606 61532 202525 247720
15490 247720 388077 66873 55841 -3174 -120804 -128366 -42032 -21357 26550 -81591 -173862
15479a73862b8327A97804a41537j16981N9136A20732m1315R7005L6216m0756C3549
15467G158a6049A74523b07187h6031C31201c03414B25238H3872a60333C3609P6186
15456A09795b07875C22386f2396k7832p9839B08444c28032A56702a71808K5029
15446a46779o2276j6084a8641H1071a53117O2092g142p337A65504a57689d4644
15434f5862H4455J25819c9951J1526B52347a3160A06474k3999f5382A73379C2667
15422D6920a0887q1983A22834K1716O7985G963P2514d6269i38j96079h3086b049
15409A8627M4825a31513B31272f3885B33027c15057C7736f6101k7409B84389C8557
15397C5377h9291j6905B08127a96219b6431k59150B90549f2411C9754A3456a86716
$$ plain form
15479 -173862 -28327 197804 -141537 -258518 -199382 120732 79417 176422 212638 171882 33549
15467 7158 -16049 174523 -207187 -86031 331201 -303414 225238 83872 -160333 33609 109795
15456 109795 -207875 322386 -62396 -90228 -170067 208444 -328032 156702 -171808 -146779
15446 -146779 -209055 -225139 -18641 81071 -153117 -91025 -7142 -14479 165504 -157689 -44644
15434 -65862 84455 210274 -39951 -28425 252347 -13160 106474 82475 -65382 173379 32667
15422 46920 -10887 -92870 122834 144550 212535 7963 80477 -46269 -938 -197017 -83086 -2049
15409 18627 63452 -131513 231272 -63885 233027 -315057 37736 -66101 -93510 284389 38557
15397 35377 -89291 -106196 208127 -196219 -26431 -285581 290549 -62411 39754 13456 -186716
15385h8476A67506a02770a7050B96664A21361K68174A55066c63983G9772l4566
15375D5206L85356o3151b59368f486A07126a13187p4394A7849O7316a25896A99969
15363A13212c8458n6746A36436i9728I9182L60551G7207a9516C54150B3158a40862
15351h0386A401c14022a7333A36749a83907a9677A86556P0703h2304k34956A49747
15339a75435A98048c1218m603B94105a71183B65062J09717a03138A39859K80367
15329D20226j96932f6600A87999i2663j95145A82281j8724a38190K2949K6075
15319h9166q7529K8540j6625A46029c43423h5279M0643A11072g8592k01906A93094
15307A47295a2091B35636a08460L9896C29318c9097J7373D3598A8888J24262h1483
$$ plain form
15385 -88476 167506 -102770 -17050 296664 121361 389535 155066 -363983 79772 45206
15375 45206 430562 367411 -259368 -6486 107126 -113187 -187581 17849 85165 -125896 199969
15363 113212 -38458 -95204 136436 -99728 99182 459733 77207 -19516 354150 23158 -140862
15351 -80386 1401 -314022 -17333 136749 -183907 -19677 186556 257259 -82304 -317260 149747
15339 -175435 198048 -31218 -35821 294105 -171183 265062 374779 -103138 139859 420226
15329 420226 223294 -66600 187999 -92663 -287808 182281 163557 -138190 -115241 -89166
15319 -89166 -176695 -148155 -164780 146029 -343423 -85279 -44636 111072 -78592 -280498 193094
15307 147295 -12091 235636 -108460 -68564 329318 -39097 -21724 43598 18888 143150 -81483
15295E1561M6555J7380h1103L3586k96348B22351n1587d24894I1663c41022a16706
15283g0038j44389A39345L30818A39388a38840M3108C61407j50953a41212j24373
15273b65585D6761D400N264a20693q7142Q2181h697A07528b2565k9422A13853
15261E31755B0478e078A34799R4642d6899A86836q8261l0956L07620O5937k13299
15250B27877R6995p8649Q39804J184881j027316M90454r3033E44687n0559E9109
15239A56540a03543A30247e7859A06189a33538H7786J13454H6022J23793a13786
15228b9636J114k11995B36899k7007C2508L65929a27176k41217B44688c6746j18917
15217a55663B13247p4951n0419l671h4453C08991F6714J90424d7671K395D2202
$$ plain form
15295 51561 98116 115496 -81103 -47517 -343865 222351 170764 -424894 91663 -341022 -116706
15283 -70038 -214427 139345 470163 139388 -138840 -95732 361407 210454 -141212 -265585
15273 -265585 46761 4400 9664 -120693 -207835 -125654 -8697 107528 -22565 -51987 113853
15261 531755 20478 -5078 134799 229441 -46899 186836 98575 67619 375239 441176 227877
15250 227877 324872 246223 1086027 2270908 1243592 1734046 1641013 544687 494128 59109
15239 156540 -103543 130247 -57859 106189 -133538 87786 201240 86022 209815 -113786
15228 -29636 -28522 -240517 236899 209892 32508 398437 -127176 -368393 244688 -36746 -155663
15217 -155663 213247 138296 87877 84206 -84453 308991 66714 257138 -47671 -45276 42202
15205b49798A07921b50531b1084D38914a3620k0250I4094a35914A58162n7675
15195A00487a5572D02285A41054n8701a14245A70832R7018d0289j51630H2442
15184b02544Q0371J9043B24477J46064A77437B6779a36050A92749a1581H5177
15173e2181a789j64948A60770G145K07138e2769A90562q260H9463B0651P0126
15162I0777r603j9659e9940G7508a8231r4085A51483C9363n941L11968A39371
15150B8701L5176O106J49179Q772A2473K18872A06673J22236j07494c2848C36468
15138a67470B97509C0278Q5673P3513f9660C03972m6654A20716f7488H2132j3776
15127F8356K63029j55775A6377J23272L2719F9865a4618A28232J47432N2625j43293
$$ plain form
15205 -249798 107921 -250531 -21084 438914 -13620 -33870 94094 -135914 158162 100487
15195 100487 -15572 402285 141054 82353 -114245 170832 267850 -40289 -191919 82442
15184 -202544 -122173 -103130 224477 370541 177437 26779 -136050 192749 -11581 85177
15173 -52181 -1789 -166737 160770 7145 214283 -52769 190562 182302 89463 20651 90777
15162 90777 81174 61515 -59940 77508 -18231 -112316 151483 39363 33422 345390 139371
15150 28701 63877 69983 219162 227934 12473 231345 106673 228909 121415 -32848 336468
15138 -167470 297509 30278 115951 189464 -69660 303972 257318 120716 -67488 82132 68356
15127 68356 331385 175610 16377 139649 172368 69865 -14618 128232 275664 328289 184996
15116A84996K01302j36295B3862Q5923L6718A4655K56455I5872D2788M29a14635
15104C90381j29221h2204A45675a64589B23757F2313L50313b00710A54303J48693
15094C02996G8618P7278J50455J7797G3430i5653B20981q5605f6907B59054p7730
15083A81324c24385I54J70848a21262A66278h4519C14154j14842I1071J6195a8682
15071c2713B87704L5277q7855l1764R1351J0788d6786B70763H1284L63987h1301
15059e8065E37254D8276K68871o4522J59384j97485L24685j11938F8643H159M57493
15048D65652E0547K5341L04660r2318m6664A14495N0265l0478f796D6480M423
15037E0903K80874A07625K5679l9527K49094j43297K66023A52749J2260J89106
$$ plain form
15116 184996 386298 250003 23862 109785 146503 14655 271110 95872 42788 43217 -114635
15104 390381 261160 -82204 145675 -164589 223757 62313 412626 -200710 154303 302996
15094 302996 78618 155896 306351 324148 73430 -95653 220981 135376 -66907 259054 181324
15083 181324 -324385 954 171802 -121262 166278 -84519 314154 199312 91071 107266 -18682
15071 -32713 287704 322981 235126 203362 294713 305501 -46786 270763 81284 445271 -81301
15059 -58065 537254 48276 317147 252625 412009 214524 539209 427271 68643 8159 465652
15048 465652 50547 75888 380548 288230 241566 114495 164760 134282 -6796 46480 50903
15037 50903 331777 107625 133304 93777 342871 199574 465597 152749 165009 354115
15027C54115b6720B0922J06311N02818B03164q8055J99088r1240L12795j20182
15017D15570H6791b3084B27996q3763O0187M9342D3148k354J06514O2732R1078
15006C01118N642P8494A05124J19409J473J02982J74434k11951A43030E7174K21880
14995B79054J87350A53729K85825J38992G4855J74438D2461K672M38661j27320
14985C56474E5813M64001k45995p9942K97137e6607B84551m0757J32756N5626
14975D32176C1024J28408L15834q0472A11065N4534K37234A95256a4614B1686
14964E65961B67931l2883L67130F5510J79971L3851J35824A06492Q0466o7865
14954A19093M21469B70105M21248j43421k35246J57912R380I9955q073K2180K22476
$$ plain form
15027 354115 -26720 20922 127233 630051 203164 115109 314197 222957 535752 415570
15017 415570 86791 -23084 227996 144233 204420 253762 43148 40794 147308 210040 301118
15006 301118 306760 385254 105124 224533 226006 328988 503422 291471 143030 57174 279054
14995 279054 466404 153729 439554 578546 74855 249293 42461 45133 483794 356474
14985 356474 55813 519814 273819 193877 491014 -56607 284551 243794 376550 432176
14975 432176 31024 159432 475266 394794 111065 165599 402833 195256 -14614 21686
14964 565961 267931 235048 602178 65510 245481 279332 415156 106492 186958 119093
14954 119093 540562 270105 691353 547932 312686 470598 479978 99955 91882 114062 336538
14943C36538j53779K55745j87133O5926J63386A76080K04028O1313n7369k2436
14933C61616K94014j69212j80709M0718K74866A26559P8844O1483K59595B42618
14922C02325M0173j41014K12072L865j34558k4673L54637a81289A94378K94305
14912D88683j21534J42171H9758M50408j25397J25329A46723j500L2749K36716
14902D14688n338j3947A2557K38656J19398K09025k85998K88132C9753L63312
14892D03065A24699K31288J08364A51042J26035M59161j67230k82471L80m8116
14882B38801k9640M17705j58699m1992n3405J32403k06080L03405j91758m9470
14872C61270K93862k90371k4244o4295J9161K21622Q2097j77877A31681A4005
$$ plain form
14943 336538 182759 438504 251371 317297 480683 176080 380108 441421 384052 361616
14933 361616 655630 486418 305709 346427 621293 126559 205403 266886 526481 242618
14922 302325 342498 201484 413556 417421 282863 258190 612827 -181289 194378 488683
14912 488683 367149 509320 89758 540166 414769 540098 146723 145223 177972 414688
14902 414688 409350 395403 12557 251213 370611 579636 293638 581770 39753 403065
14892 403065 124699 355987 464351 151042 277077 736238 569008 286537 286917 238801
14882 238801 209161 626866 468167 426175 372770 505173 299093 602498 410740 361270
14872 361270 655132 364761 340517 276222 295383 517005 599102 421225 131681 14005
14861B94017R2687J66471q9322J7656j57869J28540j39928J44478J50494k62725
14851C44499J05783J64661k52763L03244K0503j49822Q4340P8525C10600J49832
14841D60432n5731J23314I2384M72445B63979L46774l2938k362k62718L42203
14831F54938j60643j16883J48141J05897O2307Q3789l78478j91575J34167K27609
14821E69269j24465n8258n2399L35987R4106l42491J05231o5908J2781o3138R2331
14810E03046j63027k6853r3912O96440l51747O1713j69083J83449j72898k0149
14800D46979J22534j11842K65418j93863A95610O16345j99650J70685l30787M4737
14790D96940q390L43061J26580l34563j31952q4711L5498J5067j41115K11889
$$ plain form
14861 294017 386704 553175 463853 481509 323640 452180 312252 456730 607224 344499
14851 344499 450282 614943 362180 665424 685927 536105 620445 698970 310600 460432
14841 460432 404701 528015 92384 564829 263979 610753 577815 575453 312735 654938
14831 654938 494295 377412 525553 631450 693757 777546 399068 207493 341660 569269
14821 569269 444804 386546 334147 670134 764240 421749 526980 461072 473853 410715 503046
14810 503046 340019 313166 219254 915694 563947 625660 456577 640026 467128 446979
14800 446979 569513 457671 723089 529226 195610 811955 612305 782990 452203 496940
14790 496940 488550 831611 958191 623628 491676 406965 442463 457530 316415 528304
14780E28304R4653J03053k08260L00732l53139K1974K32690k3105L6420j45668
14770E87654P2798j57903P2454j21060K38444k19909N759J83949N8729J9553o3921
14759F76547L76816m43059J2219K78919k05792J0143j21227K54614j64344n4634
14749F20202J06054P3001j6849k23276K96306l70611J1275J25969J73246M348
14739G99665j76202L6210K58092P4204l27920K29457D17228L97596l3554l3930
14729G47340j41794K23297J15017P5916K3983P5460L73834j87592k25505P6858
14719A156814k67599K61130j22098L7350k25859M2156J4222j00968N5409n7541
14709G93016J01960j23883l6455K64962k91648J17929k08622L29300j5514K53060
$$ plain form
14780 528304 622957 726010 517750 818482 465343 487317 720007 696902 733322 587654
14770 587654 660452 502549 575003 453943 692387 472478 478237 662186 720915 740468 676547
14759 676547 1053363 610304 622523 901442 695650 705793 584566 839180 674836 620202
14749 620202 726256 799257 782408 559132 855438 484827 496102 622071 795317 799665
14739 799665 623463 659673 917765 991969 664049 893506 417228 814824 781270 747340
14729 747340 605546 828843 943860 1019776 1043759 1119219 1493053 1305461 1079956 1156814
14719 1156814 889215 1150345 1028247 1065597 839738 881894 896116 795148 850557 793016
14709 793016 894976 771093 734638 999600 707952 825881 617259 946559 931045 1184105
14699A184105r7928j73182L8417Q8894q2815p1598J0212L1898j9218J54803p7720
14688I85868p4843K38842l45569K93807j2902j07328q544K58450m00941P8191
14678I05031m7217J09133j64073N28115l72664K32620p572L4973j86121K82596
14668A314821F45691L13411N3299j79176N19877l39078M2611J68606j36505L14237
14658A402973k83600p3728R4415J69134J01307J3853j53487j85445K16316L37330
14648A639068l14980K5081r2196r9387N48849n16692L08835K17893n99108K59096
14638A376459q1545K09722j60646k22619K69067o576J70364j53387j07001L6697
14628A330535L350O6610J81182l27833K48074o1434Q0895j59602L80131p9826
$$ plain form
14699 1184105 1086177 912995 951412 1040306 957491 885893 896105 928003 908785 1063588 985868
14688 985868 911025 1149867 804298 1098105 1085203 977875 969331 1227781 826840 905031
14678 905031 857814 966947 802874 1330989 958325 1190945 1183373 1218346 1032225 1314821
14668 1314821 645691 959102 1012401 833225 1353102 1014024 1056635 1225241 1088736 1402973
14658 1402973 1119373 1045645 1140060 1309194 1410501 1424354 1270867 1085422 1301738 1639068
14648 1639068 1324088 1349169 1256973 1157586 1706435 1189743 1498578 1716471 1117363 1376459
14638 1376459 1294914 1504636 1343990 1121371 1390438 1383862 1554226 1400839 1293838 1330535
14628 1330535 1333885 1400495 1581677 1253844 1501918 1440484 1521379 1361777 1741908 1662082
14618A662082n18666K90225R3905L25966j77683j46814M23527l93507J72698P9254
14608A810987k1270j44159J84171N4950l76631j641M6849K52608N4858j69256
14598A691466o8821K12018j50911J90346k02723K66932j38718P7077J82564n5906
14588B003324L4601r6314J02888r4686M52660k97899k18171L06901k40485L61033
14578B313852J56660l53301J86159j42606K07316j38330J58856k46481j09423
14569B032702K87470K37341m97285K23851m093O95535k84126j42166K85911j74718
14559B660422L03047R4187k09416P06654j79856J92727M89363J31102N99263M21422
14549E208915J833195L372443Q638795K1480025J0984453B4013379A1972110n947091
$$ plain form
14618 1662082 1143416 1433641 1527546 1853512 1675829 1529015 1952542 1559035 1731733 1810987
14608 1810987 1789717 1645558 1829729 1884679 1508048 1506407 1553256 1805864 1860722 1691466
14598 1691466 1622645 1834663 1683752 1874098 1671375 1938307 1799589 1876666 2059230 2003324
14588 2003324 2037925 1941611 2044499 1949813 2402473 2104574 1886403 2193304 1952819 2313852
14578 2313852 2470512 2117211 2303370 2160764 2368080 2229750 2388606 2142125 2032702
14569 2032702 2320172 2557513 2060228 2284079 2279986 2975521 2691395 2549229 2835140 2660422
14559 2660422 2963469 3057656 2848240 3554894 3375038 3567765 4057128 4188230 4787493 5208915
14549 5208915 7042110 10414553 19053348 40533373 51517826 24013379 11972110 6025019
14541F025019k399427p71228J24410p57722j12337K00699l2765k59007J52423
14532B170065K3814J2932L16314l26265J363M17234m28118N85403k73492o3056
14522B436194L13144J1004j41716K30889J15862M18166n19472j11842J46025j20869
14512B777385j35557M08704j81751J71530J88578l01460J28624J39956n3786J48372
14502C290595o2720j45372K71365l58746K70521J09637K26070j39389J10019K06823
14492C778803R5613l67075L85394o4101j05101K32414j79999J87228l94779R6309
14482C664706L65270J52470N72506o08499K16718j52067j12649M50531J15195
14473D664181M6821l32732J38991k26360L20492J98498l26124J83724J62582r762
$$ plain form
14541 6025019 3625592 2854364 2978774 2221052 2108715 2309414 2276649 2017642 2170065
14532 2170065 2193879 2206811 2523125 2196860 2198223 2615457 2187339 2772742 2499250 2436194
14522 2436194 2749338 2760342 2618626 2849515 2965377 3383543 2864071 2752229 2898254 2777385
14512 2777385 2641828 3050532 2868781 3040311 3228889 2927429 3056053 3196009 3142223 3290595
14502 3290595 3227875 3082503 3353868 2995122 3265643 3375280 3601350 3461961 3571980 3778803
14492 3778803 3874416 3507341 3892735 3828634 3723533 3955947 3775948 3963176 3568397 3664706
14482 3664706 4029976 4182446 4754952 4146453 4363171 4211104 4098455 4548986 4664181
14473 4664181 4711002 4378270 4517261 4290901 4611393 4809891 4483767 4667491 4830073 4820311
14463D820311N1826M39305j88460O2126J19862L76616o585l52518L93528j38988
14453E577023N6244J4257R690K10205L8203Q2157K5281K94412k71000M16250j21789
14442F330933J54056K46530k33369J23118P2164O1583J32552r7228K54853K37182
14432G282374L55640l64913R1966q2994N46499j46230L45502r7750J50817N7213
14422H138124L51376j19801L2816K62394K16463P4906l95744L21109K76461J51598
14412I309702J16339j05189M38624j00452K37673M34600j27513J61445J31575
14403A0496804O96348Q7723k84078Q5769L67684q2955M60503K94704J83794j92526
14393A2113770K55929Q96667l90794N69400J36758K1176K72493M56504J97394
$$ plain form
14463 4820311 4872137 5311442 5122982 5185108 5304970 5681586 5675001 5322483 5716011 5577023
14453 5577023 5633267 5647524 5657214 5867419 5905622 5987779 6013060 6307472 6036472 6452722 6330933
14442 6330933 6484989 6731519 6498150 6621268 6693432 6755015 6887567 6790339 7045192 7282374
14432 7282374 7638014 7273101 7365067 7282073 7828572 7682342 8027844 7930094 8080911 8138124
14422 8138124 8489500 8369699 8402515 8664909 8881372 8956278 8560534 8881643 9158104 9309702
14412 9309702 9426041 9320852 9759476 9659024 9896697 10331297 10203784 10365229 10496804
14403 10496804 11193152 11280875 10996797 11082566 11450250 11367295 11827798 12122502 12306296 12113770
14393 12113770 12369699 13266366 12875572 13444972 13581730 13602906 13875399 14331903 14529297
14384A4529297L7455K15390N67305Q2895N72449Q6432J40055O25604J5271J07456
14374A6979609K90543N68856N67054J21885M71584K83089M94879J01980P47876
14365B0627355O47081N13379J4544O62579M68529P65989L36192N44431K17578
14356B4797657P18045P43948M98332N45108O40336N28420J081100N33803N23315
14347C0610064R31105O38790J031602P61305R89217O61701J130363J078176N85802
14338C8418125J444086R07364J151451J552289R13026J625740J156034J845543
14330D9013658J047650J483110K001613J609055J713419J637742K154623K001255
14322F2662125K215935K029429K432587K331229K627495K578665K886187L143319
$$ plain form
14384 14529297 14566752 14782142 15349447 15432342 16004791 16091223 16231278 16856882 16872153 16979609
14374 16979609 17270152 17839008 18406062 18527947 18999531 19282620 19777499 19879479 20627355
14365 20627355 21274436 21787815 21802359 22464938 22933467 23699456 24035648 24580079 24797657
14356 24797657 25515702 26259650 26757982 27303090 27943426 28471846 29552946 30086749 30610064
14347 30610064 31541169 32179959 33211561 33972866 34962083 35623784 36754147 37832323 38418125
14338 38418125 39862211 40769575 41921026 43473315 44386341 46012081 47168115 49013658
14330 49013658 50061308 51544418 53546031 55155086 56868505 58506247 60660870 62662125
14322 62662125 64878060 66907489 69340076 71671305 74298800 76877465 79763652 82906971
14314H2906971L111400L174183L740357L690566L839710M004846M393918M434112
14306A13296063N138511M934585N368030N945823O165283O844829O533787P361874
14298A61588785P915527Q120841Q334453R209465R591261J0209134J0807886J1149372
14290B36926724J1931333J2556539J2451762J3639271J3900824J4523423J4821354
14283C30751230J5078890J5145926J5231152J5279058J4378189J4387228J3200160
14276D33451833J2219627J0815387R353544O947965L458493J2804k131475k206924
14268D71921254m040638n889448o937914q337297r370241j1226533j2861226j3573213
14260C99684744j4377174j5079861j5418280j5789483j6001769j5066234j4040257
$$ plain form
14314 82906971 86018371 89192554 92932911 96623477 100463187 104468033 108861951 113296063
14306 113296063 118434574 123369159 128737189 134683012 140848295 147693124 154226911 161588785
14298 161588785 169504312 177625153 185959606 195169071 204760332 214969466 225777352 236926724
14290 236926724 248858057 261414596 273866358 287505629 301406453 315929876 330751230
14283 330751230 345830120 360976046 376207198 391486256 405864445 420251673 433451833
14276 433451833 445671460 456486847 465840391 472788356 476246849 476259653 474128178 471921254
14268 471921254 467880616 461991168 455053254 446715957 437345716 426119183 413257957 399684744
14260 399684744 385307570 370227709 354809429 339019946 323018177 307951943 293911686
14253B93911686j3908628j3481451j3456178j2035843j1890148j1245353j0496699
14246B07397386j0317491r369755q539950q197336q057931p783322o912424o619902
14238A41599275o078379n860367n429577n386102n119507m693317m462380l595832
14230A00973814m338137l551033l799321l476372l422758k827239k802210k966044
14222G3790700k669282k148356k180667k621966j895357k019027k081455j958403
14214E6216187j324411j231310j934111j621054k064630j085251j125039q61540
14206D4968841j489673j314285j552963r67086j020855r64652l31900j275533
14198C6051894r79463j321224p87690r93068n07438p57644p16039q14077m67445
$$ plain form
14253 293911686 280003058 266521607 253065429 241029586 229139438 217894085 207397386
14246 207397386 197079895 187710140 179170190 170972854 162914923 155131601 148219177 141599275
14238 141599275 135520896 129660529 124230952 118844850 113725343 109032026 104569646 100973814
14230 100973814 96635677 93084644 89285323 85808951 82386193 79558954 76756744 73790700
14222 73790700 71121418 68973062 66792395 64170429 62275072 60256045 58174590 56216187
14214 56216187 54891776 53660466 51726355 50105301 48040671 46955420 45830381 44968841
14206 44968841 43479168 42164883 40611920 39644834 38623979 37659327 37327427 36051894
14198 36051894 35072431 33751207 32963517 31970449 31463011 30705367 29989328 29175251 28707806
14189B8707806j150621m80907n55590o46205n50104p49333k56962o41856p30768
14180B2945460j21134m87675n98191l43379m09655p86406l38458l281n53842j98673
14170A9104766o41754l412n38731m19231J8107p58566j27358n06110j28113L1065
14160A6030663n84869p56912J92253j48609m71693k55927N8787j66528m45341
14151A3451824k76505J5928n06963J36869k72065k37621l82593k87941k4540L7214
14141A1653607n60885N200J81769p59114J16867k2584m67802l06963k33090j28974
14131I478031J68954j78237r3489M0499k27900l86214r3315j8133N9219k12940
14121H536475l27354m6576q7383m30580P1393n0660Q2120j16917K27233m45506
$$ plain form
14189 28707806 27557185 27076278 26520688 25874483 25324379 24575046 24318084 23676228 22945460
14180 22945460 22824326 22336651 21738460 21395081 20985426 20199020 19860562 19857281 19303439 19104766
14170 19104766 18463012 18459600 17920869 17501638 17519745 16761179 16633821 16127711 15999598 16030663
14160 16030663 15445794 14688882 14881135 14732526 14260833 14004906 14063693 13897165 13451824
14151 13451824 13175319 13191247 12684284 12821153 12549088 12311467 11928874 11640933 11616393 11653607
14141 11653607 11092722 11097922 11279691 10520577 10637444 10614860 10147058 9840095 9607005 9478031
14131 9478031 9646985 9468748 9375259 9415758 9187858 8801644 8708329 8690196 8749415 8536475
14121 8536475 8209121 8162545 8075162 7644582 7715975 7665315 7747435 7630518 7857751 7412245
14111G412245J20194k99971m1355R9883n25772m2002K79937j59317k14107N1494
14101F681229m9922m75432M27923p14304O01634k70118j24805l6346k42644J23577
14091E920792J86828k77183k58266j28217K48506j52872k85555J57120k73871
14082E137282J51405l22627K53090R2941k56659k26131L8425l8853k22216J37891
14072D744548O402k34595N7505j92066J09068N0810n4904J95589l68356J76275
14062D490276m17812J88925o4934L13879n94628N92348k23409j24320L96706p08539
14052C848492L24455m41144J47890k64890P9240M1066J3142k07606P308p6214
14042C471739q5656O2174j9303l25192N67012j43723k75764M7782L160k79153
$$ plain form
14111 7412245 7532439 7232468 7191113 7290996 6765224 6723222 7003159 6843842 6629735 6681229
14101 6681229 6631307 6155875 6583798 5869494 6471128 6201010 6076205 6039859 5797215 5920792
14091 5920792 6107620 5830437 5572171 5443954 5692460 5539588 5254033 5411153 5137282
14082 5137282 5288687 4966060 5219150 5312091 5055432 4829301 4867726 4828873 4606657 4744548
14072 4744548 4750950 4516355 4573860 4381794 4490862 4541672 4486768 4682357 4314001 4490276
14062 4490276 4072464 4261389 4196455 4510334 3915706 4508054 4284645 4160325 4557031 3848492
14052 3848492 4172947 3731803 3879693 3614803 3694043 3735109 3748251 3540645 3547953 3471739
14042 3471739 3386083 3448257 3428954 3103762 3670774 3527051 3251287 3299069 3302229 3023076
14032C023076K00976N6926j02175K10745l10329k1877J59328k48232j66463L20369
14022C122344q5004o4833l99872M56324k50108J54012j84391n1741L5282p751
14012B724262k26553L83801j66383k37323n1526J25591k21826k27458K89197k95132
14002B096650J88986j48020K61267k53939j64541M1204N68974m74987J90492j53585
13992B152501J60648j78918M66428N28206J828977O343343K0288315K1616325
13984E3205825k4506379j3975434n324812k458786j839151m97575k19585l93408
13976C990695m26766k39835k0787p64254J06621L4793K00770l10399j93454J73268
13966B550652l05171k2990Q188J29806j56509J19152m09497L81990k4687K46847
$$ plain form
14032 3023076 3224052 3280978 3178803 3389548 3079219 3057342 3216670 2968438 2801975 3122344
14022 3122344 3037340 2972507 2572635 3028959 2778851 2932863 2748472 2696731 2732013 2724262
14012 2724262 2497709 2881510 2715127 2477804 2426278 2551869 2330043 2102585 2391782 2096650
14002 2096650 2285636 2137616 2398883 2144944 1980403 2021607 2590581 2115594 2306086 2152501
13992 2152501 2313149 2134231 2600659 3128865 4957842 11301185 31589500 53205825
13984 53205825 28699446 14724012 9399200 6940414 5101263 4603688 4384103 3990695
13976 3990695 3563929 3324094 3303307 2539053 2645674 2680467 2881237 2570838 2377384 2550652
13966 2550652 2245481 2222491 2230679 2360485 2203976 2323128 1913631 2295621 2270934 2517781
13956B517781m57491j01268K42167k32525K94413l47812K38455k80578j56854
13947A716288J41246L88851o54572L26245K69025j87293k19864Q9081j14511J62547
13937A917043J6537l34401K10870J85578l07278L39390l00953j60735Q8995K87372
13927A942418k59348q9376P6715K07149k20992K64251j81098N5460K711r3172
13917A704718j83825j46019J96729N1010j30340j80496J90349l0596l8823n1152
13907A381555N56101p04202L48274j84923L0741j9843O0642K33573k59596m58026
13897I84296M75087Q7979J08450l15526k45466L41567j98663J37820K14362j74751
13887A415155j2668o0476J41668n26970K21456Q4238m4368j10160O6787J91706
$$ plain form
13956 2517781 2060290 1959022 2201189 1968664 2263077 1915265 2153720 1873142 1716288
13947 1716288 1857534 2246385 1591813 1918058 2187083 1999790 1779926 1869007 1754496 1917043
13937 1917043 1933580 1599179 1810049 1995627 1688349 2027739 1726786 1566051 1655046 1942418
13927 1942418 1683070 1593694 1670409 1877558 1656566 1920817 1739719 1795179 1797890 1704718
13917 1704718 1520893 1374874 1571603 1622613 1492273 1311777 1502126 1471530 1432707 1381555
13907 1381555 1937656 1233454 1581728 1396805 1427546 1407703 1468345 1701918 1442322 984296
13897 984296 1459383 1547362 1655812 1340286 1094820 1436387 1237724 1375544 1589906 1415155
13887 1415155 1402487 1342011 1483679 956709 1178165 1262403 1218035 1107875 1174662 1366368
13877A366368l39805m7658J97730k3005j0896K14980j90097m9372M57671k98362
13867A277554k32313N5607J40633j79096k8680M11919j91098j65701r9607L48554
13857A337772j37863k82466L57415k46789K17021k25446j26471J93076J03120
13848A189369j77400n8355K90822l26019l502K67256J5284k46472K13364l2456
13838A131891n32955L20796N1223J62893n5798P2784j11073l4964J58620j66288
13828I97129l22828L44048K0569K15782k30939K50906m60766P6946j02316M11281
13818A199812m52492K46759j12188K472J04225J67256k2984J1276q3516P7731
13808A138351n9951m21873N86994n83817K42454j50409O6878j31981n3688J230
$$ plain form
13877 1366368 1026563 978905 1176635 1153630 1142734 1357714 1167617 1118245 1575916 1277554
13867 1277554 1045241 1100848 1241481 1062385 1033705 1445624 1254526 1088825 989218 1337772
13857 1337772 1199909 917443 1274858 1028069 1245090 1019644 893173 1086249 1189369
13848 1189369 1011969 953614 1244436 918417 914915 1182171 1197455 950983 1164347 1131891
13838 1131891 598936 919732 970955 1133848 1078050 1150834 1039761 1004797 1163417 997129
13828 997129 674301 1018349 1038918 1254700 1023761 1274667 813901 890847 788531 1199812
13818 1199812 747320 994079 881891 884363 988588 1155844 1132860 1144136 1060620 1138351
13808 1138351 1078400 656527 1243521 659704 902158 751749 818627 686646 632958 634188
13798F34188J25736J33076k08603m4723L62250k15823O1731L493J86642k26862
13788H11105k03517L66201J10213l47745K46379j52405n5412k16058J82604r681
13778G31684K41323k30493k25106J09695L4810M50919E21328J07625J97669l681
13768H22941q2025j29j01601J9617k2657J64758j34454m4766j9578O8176j75429
13757D94853K98083m0501k84527j77426L05948n9924M9152n854m9182J17755K0368
13746F68745C19754L63453J54384J5204m19169O59953j47332B22731M65466j37756
13736E50441k29914J73821B19890J77219N72331k16521k59929K24171j0228o9226
13726F37707K25546l12188j18619K98662O7260q5829J08159m585O6904m16619
$$ plain form
13798 634188 759924 893000 684397 639674 1001924 786101 847832 851325 1037967 811105
13788 811105 607588 973789 1084002 736257 982636 830231 774819 558761 741365 731684
13778 731684 973007 742514 517408 627103 661913 1112832 521328 628953 826622 822941
13768 822941 740916 740787 639186 658803 636146 800904 666450 621684 602106 670282 494853
13757 494853 792936 752435 467908 290482 596430 536506 585658 579804 530622 648377 668745
13746 668745 319754 683207 837591 852795 433626 1093579 946247 222731 688197 550441
13736 550441 320527 494348 219890 397109 969440 752919 492990 717161 706933 637707
13726 637707 863253 551065 432446 731108 798368 712539 820698 816113 883017 466398
13716D66398p5560K10593J98930l55958J32147l1823K44211C08931K20836P8206
13706F07973L8225j7736k01427K22728r4228J97970k91929n8968j44428P05151
13696I63331l70156j62551K73538j69733L6609J38407l0022B232N83854B60581
13685G25471k63179j30464L74930j23381J23694j47735j38515J08352j62024j54296
13675B12853L65669k8483m952k15222J19821J69475l00009L29928j58447p4448
13665D16185K22383k07035j63440L60410B79996L46709A64278K39611K03133j29197
13655D77825K70433B60535J84038j41290J3136N2953J23824J59886k14157l6946
13645D01979L27214k72237p687N1785L59577D17743J37128l3518A48544M42990
$$ plain form
13716 466398 390838 601431 800361 444403 576550 544727 788938 308931 529767 607973
13706 607973 646198 628462 427035 649763 555535 753505 461576 402608 258180 963331
13696 963331 593175 430624 704162 534429 571038 709445 679423 2232 586086 260581
13685 725471 462292 331828 706758 583377 707071 559336 420821 529173 367149 212853
13675 212853 578522 550039 545087 329865 449686 619161 319152 649080 490633 416185
13665 416185 638568 431533 268093 628503 279996 626705 164278 403889 607022 477825
13655 477825 748258 260535 444573 303283 316419 369372 493196 653082 438925 401979
13645 401979 729193 456956 449269 501054 860631 417743 554871 521353 148544 591534
13635E91534k4978A63667K28880j1552K50782k69963P065A36367R5450L61700
13625E93517j36360k3241j20968J81539J30438k68534n7205j6226A05719N71187
13615F76906j48299A67650d279C96275o5689L35292k73844J90196j06172K31106
13605G07164B74793j8125k2024J37033J35336j31440m2672a37716E79309j26410
13595D52899E422N17576j96922Q5021A72191n3226L27312J11843O3423j13815
13585E07728H8253L70140m9925j45919P8369n4711j32552l1669R0138Q5762K4541
13574C22427p6379K90257B40704J88651k01346J67196A87011K06365J12578j43427
13564C62527K34710B19421J82001r591j45999N8102J14538N2646A12041P04885
$$ plain form
13635 591534 566556 163667 392547 380995 631777 361814 368879 136367 231817 593517
13625 593517 457157 433916 312948 494487 624925 356391 299186 282960 105719 676906
13615 676906 528607 167650 -4279 396275 330586 665878 392034 582230 476058 707164
13605 707164 274793 256668 234644 371677 507013 375573 332901 -137716 579309 452899
13595 452899 5422 522998 326076 411097 172191 118965 446277 558120 621543 507728
13585 507728 88253 458393 408468 262549 340918 286207 153655 121986 212124 297886 322427
13574 322427 246048 536305 240704 429355 228009 395205 187011 393376 505954 362527
13564 362527 597237 219421 401422 391831 245832 303934 418472 471118 112041 816926
13554H16926B93414J63241j36520K71311A02955B8572M50085j02894q4611J03940
13544C95092A91439k2064J41804n5904J90319A5306J40134J6602M14523B05549
13533I0324J56519L04427j56222A26482g7511I9554M9397P06039D07054A35422
13522C19369L23176A8085K64414b3237A34886J83285k8674G7358a13618G31097
13511E69962F4953J1933M71799B45203m7369O9228A06390L94250j97354n3532
13501B49754a31143C35559Q7867d09j11439D18658m5677A26396L15518l1970j35152
13490B74792J31116J548j59825M38893C10162R4239O8313A59569L48594c4051
13479A49020a4104D04887K10704k63227p9581K85102B51941K40010j28570j01746
$$ plain form
13554 816926 293414 456655 320135 591446 102955 28572 478657 375763 291152 395092
13544 395092 191439 169375 311179 255275 445594 15306 155440 172042 586565 205549
13533 90324 246843 551270 395048 126482 -77511 99554 148951 854990 407054 135422
13522 319369 642545 18085 282499 -23237 134886 318171 289497 77358 -113618 731097
13511 569962 64953 76886 548685 245203 197834 267062 106390 500640 303286 249754
13501 249754 -131143 335559 423426 -409 -111848 418658 372981 126396 441914 409944 274792
13490 274792 405908 407456 247631 686524 310162 404401 472714 159569 508163 -34051
13479 149020 -14104 404887 615591 352364 272783 557885 251941 491951 363381 261635
13469B61635I4985Q6115Q7586J1487j17583N0492C5401M29712B20464J12024d1264
13457F2963J79716o8040p8611K50789m7950P9806J41083m2467D2275L00289e1644
13445a01911A01881A9007f8675C86813j82171q6687R9318m774N7444a32613B45007
13433C56083j50963a9383A60768J02313L4518O1383c9847D58160j85262L12091
13423E84989b80714D32417b9710H429M67007j13536I3934k6471L33960j92197
13413B09226p8524L58368A34805O9263K86596j59584J22921B25139N4835J26775
13403D06749j37227E9514A8122L00504J39377k03656L76229a96270g1458A10264
13392A08451a85479A49114L5921a7360G3409K76710j22441G2926J98659o7579
$$ plain form
13469 261635 94985 181100 268686 280173 162590 213082 35401 465113 220464 332488 -41264
13457 62963 242679 174639 96028 346817 298867 378673 519756 477289 42275 342564 -51644
13445 -101911 101881 19007 -68675 386813 204642 117955 217273 212499 269943 -132613 245007
13433 356083 205120 -19383 160768 263081 297599 358982 -39847 458160 272898 584989
13423 584989 -280714 432417 -29710 8429 475436 361900 93934 67463 401423 209226
13413 209226 130702 489070 134805 204068 490664 331080 454001 225139 279974 406749
13403 406749 269522 59514 18122 318626 458003 254347 630576 -196270 -71458 110264
13392 108451 -185479 149114 185035 -17360 73409 350119 227678 72926 271585 204006
13382B04006m2167a60104C84397I7227K36206J37180g7000C63120A64536L05239
13372D69775O5639A6552J81530R9889E2134K51173j06772a771A46191D1430K28729
13361B70159n5504q5927P1012j4992M4606P5313A50685J23178a28762F1213e8177
13349B98102N5393r0494M92975B02734L21015l7345k40908K75376j70407a1707
13338B12576a97385C50084F9211M22128B07053H5853M8295J45108j09999R7870
13328B67127J52343a2347B43563j11563K59995c6060j7203B21053a50033D98993
13317B58439r2330k2876q965k8123M9491K40578n6754E7336J08838N1981H1100
13305C49641A04641m2473K10866n8075a45895D5054J72040k7987a71338B34803
$$ plain form
13382 204006 161839 -160104 384397 97227 333433 470613 -77000 363120 164536 469775
13372 469775 535414 16552 198082 297971 52134 303307 196535 -1771 146191 41430 270159
13361 270159 214655 128728 199740 184748 229354 304667 150685 273863 -128762 61213 -58177
13349 298102 353495 263001 755976 202734 523749 486404 245496 520872 350465 -11707
13338 212576 -197385 350084 69211 491339 207053 85853 134148 279256 169257 267127
13328 267127 419470 -12347 243563 132000 391995 -36060 -53263 221053 -150033 498993
13317 258439 166109 143233 134268 106145 155636 396214 339460 57336 166174 218155 81100
13305 349641 104641 62168 273034 214959 -145895 45054 217094 189107 -171338 234803
13294D70232d0400A26036J08038G1842L10050A65657c9938C47226a0560B45807
13283A86085r0151C7059j0121M7696Q9776K03367f020A91661l0898j3409J29778
13272B77132A08178a0021C60241j67123O6661E8824a69988A03577f820A39466
13261C50067n0649o5066C2604K2166K08396G1146a94825G9948k9245K3976k3640
13250E1039J06408D4836a26210C18441F1914J28778Q6212E9871O7482J86916a840
13238A68237J24296j37714F2570J00324q1042c4790A49147P4961A03970J07063
13228B11033J5546j10615A9691O0531C1299K87643e5496A08887E1811J61790k8373
13217A85228C4450K07958a48804E43178A88414d8731B69637a61024P2225A60747
$$ plain form
13294 470232 -40400 126036 234074 71842 381892 165657 -39938 347226 -10560 245807
13283 186085 95934 37059 26938 74634 164410 367777 -6020 191661 160763 147354 277132
13272 277132 108178 -10021 360241 193118 259779 58824 -169988 103577 -6820 139466
13261 350067 299418 234352 32604 54770 263166 71146 -194825 79948 50703 74679 51039
13250 51039 157447 44836 -126210 318441 61914 190692 276904 59871 127353 314269 -1840
13238 168237 292533 154819 62570 162894 81852 -34790 149147 224108 103970 211033
13228 211033 226579 115964 19691 80222 31299 318942 -55496 108887 51811 213601 185228
13217 185228 34450 242408 -148804 543178 188414 -48731 269637 -161024 -88799 160747
13206f7046E70329A92941m1600L4114f3813A79986P3979k8402c9434B80739D6689
13194A37987d3551A16933N2181D807b85573A87561a08848J5468P042K2172C15982
13182A12693c1870C74471k2466A34834O4481r4882K48151a20421F243O3064O2634
13171A31941L4697N7295I3720J88452P997a0702l419C3842P3246D9343J64254
13160B13597d0415J2761D6950L4453J92586R8043A25681b9490A60212M376J08437
13149B73025C1044J05795J727a48169I9304g5089j9101D5069b27007O3974f7929
13137D3988K47509O976J1972k1573H6866a67448g0198j3870A27319a14247D5638
13125A46084a05900A51247l5865c11885E0891B5344J46407F9755J45765J97314
$$ plain form
13206 -67046 570329 192941 151341 185455 -63813 179986 253965 225563 -39434 280739 46689
13194 137987 -43551 116933 169114 4807 -285573 187561 -108848 -93380 -86338 -64166 315982
13182 112693 -31870 374471 352005 134834 199315 104433 352584 -120421 6243 69307 131941
13171 131941 166638 223933 93720 282172 290169 -10702 -14121 33842 107088 49343 213597
13160 213597 -40415 -27654 46950 81403 273989 372032 125681 -29490 160212 164588 273025
13149 273025 31044 136839 138566 -148169 99304 -75089 -94190 45069 -227007 -163033 -67929
13137 43988 291497 298473 310445 288872 86866 -167448 -70198 -84068 127319 -114247 45638
13125 146084 -105900 151247 115382 -311885 50891 25344 171751 69755 215520 412834
13115D12834A73704J55474A18498K48990A72162g4856B22233a02878B06987H2891
13104b63529B61721a57924B20741i9858A73455M1152I6904N4903O8093d569j60426
13093a64995A14164l9192l2618a28073A79296b87424c596E1569a48620C0617K48514
13082B79131j02347h8671k38506I4671c7795D44996a87807c5586B50188H7226
13071A50620K0989a43360e900r6156e002C22511k5577q7024h4591K4109B0677
13059G0228K10327j05811Q5854c3786A27047K5712M8339H5500K39699e6331C59754
13047B88904h1552C22467P8153A73483f5428C1338M95449A66900o3153d9654C22313
13035i5649g299E1883K69941J44659A43171N761J51982A46973J67018A38824g5532
$$ plain form
13115 412834 173704 329178 118498 367488 172162 -74856 222233 -102878 206987 82891
13104 -263529 261721 -157924 220741 -99858 173455 214607 96904 151807 219900 -4569 -164995
13093 -164995 114164 74972 42354 -128073 179296 -287424 -3596 51569 -148620 30617 279131
13082 279131 176784 -88671 -327177 94671 -37795 444996 -187807 -35586 250188 87226
13071 150620 171609 -143360 -5900 -102056 -5002 322511 296934 209910 -84591 -60482 20677
13059 70228 280555 174744 260598 -33786 127047 152759 201098 85500 325199 -56331 359754
13047 288904 -81552 322467 400620 173483 -65428 31338 526787 166900 103747 -49654 322313
13035 -95649 -7299 51883 321824 466483 143171 148932 300914 146973 313991 138824 -75532
13023B82205A28688J19433a78047Q6181D37972b02706C1873L9288O9728B0879
13012A64866K27582a291q2028m2780B74820a42663D854b12148B56924H9264J98538
13001B87802G9471d9976C76763i5363a5787G9546b5653A0760M00789f2204q3679
12990a45883A10492P0286p1312l0919J41806B6434b82548J26602j36130B59005
12979e3818h782A12702P3949a5916k04379i6394A03603b1287k72451B3654a13266
12967h054C352J08046c06110a20860A76989J50061A0297N6663b8711A17768h2036
12955B1101K06317E545P1142b5610A80660a38972E8246a07668B14853l180L9445
12944B51118d040G9782J48080b07386q779B79268l2079F4728e9918A62033a9063
$$ plain form
13023 282205 128688 248121 -178047 -91866 437972 -202706 31873 71161 140889 20879
13012 164866 392448 -1291 -83319 -126099 274820 -142663 4854 -212148 256924 89264 287802
13001 287802 79471 -49976 376763 -95363 -15787 79546 -25653 10760 411549 -62204 -145883
12990 -145883 110492 180778 109466 78547 220353 26434 -282548 -155946 -292076 259005
12979 -53818 -8782 112702 186651 -15916 -220295 -96394 103603 -21287 -293738 23654 -113266
12967 -8054 3352 111398 -306110 -120860 176989 327050 10297 66960 -28711 117768 -82036
12955 21101 227418 5545 76687 -25610 180660 -138972 58246 -107668 214853 211673 251118
12944 251118 -4040 79782 227862 -207386 -216165 279268 247189 64728 -59918 162033 -19063
12932c35775B16846b29148g3700B56380a8382E0592B4274J35183l3855K40220
12922C65822l9002A11616K9162a34312p313d0387L764H0230e352B08991F3545
12910d4733A29785J70165A40274C1069f7628n4529C79156j50295r5360o4743J38239
12899B06997B2530a61008A90734a02172K911A84510a90105F27352B38000K47691
12889D85691B17034a93706j74353G7789Q0481O3894J1179A03663a99084A23455
12878b66460a20207A45535a34495f3642C67464B7513c37388A74387a57845a4394
12867C82326b61757D22632i8036L0886B49613g0937o1772q902p8691B40983D3654
12855A98171D4248A0781a66031G3200J13858p8910R7178F4615e547H1481f2511
$$ plain form
12932 -335775 216846 -229148 -73700 256380 -18382 50592 24274 159457 125602 365822
12922 365822 326820 111616 140778 -134312 -141625 -40387 -36623 80230 -5352 208991 63545
12910 -44733 129785 299950 140274 31069 -67628 -122157 379156 228861 133501 68758 206997
12899 206997 22530 -161008 190734 -102172 -99261 184510 -190105 627352 238000 485691
12889 485691 217034 -193706 -368059 77789 158270 222164 233343 103663 -199084 123455
12878 -266460 -120207 145535 -134495 -63642 367464 27513 -337388 174387 -157845 -14394
12867 382326 -261757 422632 -98036 -67150 249613 -70937 -132709 -141611 -220302 240983 43654
12855 198171 44248 10781 -166031 73200 187058 108148 205326 64615 -5547 81481 -62511
12843A18531i7182j21134A6416J43211b48816A29494J35263b30803A00068a98809
12832F9057R0139J56386j38063k2567e6137k62702F7170O0841O0131f5100A50263
12820b13512C8859a09918C1928g2954p428C4028P9052b8695o9217B03721p9213
12809A24508N3331b3627o8112A37967R9738j14449g1142j74652A95970G6095b9164
12797C0608a4669q3267j2588C42385i832A58417l2105a2383l75392b1931A27281
12785B1621b53371B89407a48044C01383b26881A37574d140n8916E9012a33523
12774A64540a26538A64782k8780a05269M1586H7559J27262i9355E3730K06364
12764B60094F5688a54663C19475G9001g1490B72781m2345o4615d7147n3754j01074
$$ plain form
12843 118531 -97182 -218316 16416 159627 -248816 129494 264757 -230803 100068 -198809
12832 69057 159196 315582 177519 154952 -56137 -318839 67170 128011 188142 -65100 150263
12820 -213512 38859 -109918 31928 -72954 -80382 34028 113080 -28695 -97912 203721 124508
12809 124508 177839 -23627 -91739 137967 237705 123256 -71142 -245794 195970 76095 -29164
12797 30608 -14669 -97936 -110524 342385 -9832 158417 126312 -12383 -387775 -21931 127281
12785 21621 -253371 289407 -148044 301383 -226881 137574 -4140 -63056 59012 -133523
12774 164540 -126538 164782 136002 -105269 -63683 87559 214821 -99355 53730 260094
12764 260094 65688 -154663 319475 79001 -71490 272781 230436 165821 -47147 -100901 -201975
12753b01975h5240j44335B21034A09752f80C0903a79622A83968d34601i4172j36337
12742b30509M1404B36618c34193f9389q11D46459k14676a74431A19003E5080D333
12730A42514l3562i2632C19589r1560m6446g168a289j17761B71303K8244a90364
12718d6926A5464J20988a40282D9347K5828L20541C6775K12750R7615H362L72551
12707C80913J22424B00922b46271C57709H8248c3017J4795B68715c6667A00370
12696b14422c1098H1067J00252H3286Q4027F9821j8194J47077a12214L0480D7932
12684a9953J875k79873A68998J99030F9964K86715r1441d6609B62244q3055A8030
12672C10711a3262A93283a21416H1769J96426p8637K45223k13140J15909j48823
$$ plain form
12753 -201975 -85240 -229575 221034 109752 -680 30903 -179622 183968 -434601 -94172 -230509
12742 -230509 -189105 236618 -334193 -69389 -70200 446459 231783 -174431 119003 55080 4333
12730 142514 108952 -92632 319589 228029 181583 -7168 -1289 -119050 271303 299547 -190364
12718 -46926 15464 136452 -140282 49347 75175 395716 36775 249525 347140 8362 380913
12707 380913 503337 200922 -246271 357709 88248 -33017 -18222 268715 -36667 100370
12696 -214422 -31098 81067 181319 83286 167313 69821 51627 198704 -112214 -81734 47932
12684 -19953 -18078 -297951 168998 368028 69964 356679 265238 -46609 262244 179189 18030
12672 310711 -13262 193283 -121416 81769 278195 199558 444781 231641 347550 198727
12662A98727n5660d6194B54154p21Q3700r7306a93932C55265j62068i5058B89495
12650C0173J69218R6737b07793C11009c69922e8525A34150L0447K5351A8747Q4694
12639A03441j5083d5503A5052J63249g4203o8512e6967r804A38767K43955H6388
12627a60924B99718A05907N7784h95A79871d2817D55688j32608A29310L98782
12617E28092a86853C2782K367h3637j2560A0414a18728E9374J22735m1453O3741
12606B04397J6736j04873M3660C4987J15957J21927b29968J07639G9603a02120
12595a11723A54256C4628J17612G2558J25059f4939A16134O537a64202A60520
12584C4427J7157a56621B74704b76856J22004o9181G2255c9986l18682a71706
$$ plain form
12662 198727 143067 -46194 254154 253433 337133 239827 -193932 355265 193197 -95058 289495
12650 30173 199391 296128 -207793 311009 -369922 -58525 134150 164597 189948 18747 103441
12639 103441 88358 -45503 15052 178301 -74203 -142715 -56967 -66771 138767 382722 86388
12627 -160924 299718 105907 163691 -895 179871 -42817 455688 323080 129310 528092
12617 528092 -186853 32782 35149 -83637 -96197 10414 -118728 59374 182109 140656 204397
12606 204397 221133 116260 159920 34987 150944 272871 -229968 -122329 79603 -102120
12595 -111723 154256 34628 152240 72558 197617 -64939 116134 122671 -164202 160520
12584 34427 51584 -156621 274704 -276856 -154852 -224033 72255 -39986 -358668 -171706
12573h381C50630D0640g7204A61137N32206g7476C94656C8902J6940b35538F1393
12561h1462E5710L56064i9908r2525q9421e1312A61357B6600d7367G4479b63002
12549a2912k4457j80488e6309j14665A29037a6687A74616p6825J3188a04458A63660
12537C3335L36230a73238b3208A39589K32551b149A43182l0091d7760m8195q0635
12526a76590F9889J2921J15116q9376a86850O4720d9200r3045C15667A40252b99338
12514a25528A62703c22838E402f5022O855J1649A22704L5002c29784f2443A31216
12502B38942N5617a11354C92725c2299C08092f060A47364A4073a30995B7379a93156
12490B62333a40583n4155C6331J71092F9140J17642c5828R712l0371l05887a60041
$$ plain form
12573 -8381 350630 40640 -77204 161137 693343 -77476 394656 38902 55842 -235538 61393
12561 -81462 55710 411774 -99908 -192433 -281854 -51312 161357 26600 -47367 74479 -263002
12549 -12912 -37369 -217857 -56309 -170974 129037 -16687 174616 97791 110979 -104458 163660
12537 33335 369565 -173238 -23208 139589 372140 -2149 143182 113091 -47760 -95955 -176590
12526 -176590 69889 82810 197926 108550 -186850 -122130 -49200 -142245 315667 140252 -299338
12514 -125528 162703 -322838 5402 -65022 -58167 -46518 122704 157706 -329784 -62443 131216
12502 238942 294559 -111354 392725 -32299 308092 -6060 147364 14073 -130995 27379 -193156
12490 262333 -140583 -194738 36331 207423 69140 186782 -35828 -26116 -56487 -362374 -160041
12478B18052a37382A78332d1247n8220a7359j69527m8181C9737K41299a46898
12467c7231H4434a15349A44268a35920M4601k23099D27820g3927b8020R417m0135
12456e8738A59973B979g2671G7382h8299I1124k3924g7424C1086J5713j7169a21260
12443B03034C458g0619a518k11000A62904l4078c5516E0923a45189A58370h3851
12431f4194F185a43036j7073A66570a19305c8372A91917a98943h4783B11348a63816
12419H3354J43459G5733C746J18696R5672j8971J31512j7320a47207c238j52483
12408a55721d3637A23113k1412L5845k7532d8268H1052j7470a67455G1344e1541
12396B18286e3867B04872J83950a75739A00303a29403A45823H449f2240F7963
$$ plain form
12478 218052 -137382 178332 -41247 -99467 -17359 -186886 -235067 39737 281036 -146898
12467 -37231 84434 -115349 144268 -135920 -91319 -314418 427820 -73927 -28020 -18603 -58738
12456 -58738 159973 2979 -72671 77382 -88299 91124 67200 -77424 31086 46799 29630 -121260
12443 203034 3458 -70619 -1518 -212518 162904 128826 -35516 50923 -145189 158370 -83851
12431 -64194 6185 -143036 -160109 166570 -119305 -38372 191917 -198943 -84783 211348 -163816
12419 83354 226813 75733 3746 122442 218114 199143 330655 313335 -147207 -3238 -155721
12408 -155721 -43637 123113 101701 137546 110014 -48268 81052 63582 -167455 71344 -51541
12396 218286 -53867 204872 388822 -175739 100303 -129403 145823 8449 -62240 67963
12385H4918b14390Q396c5372J3298j04435a9443l4588J6241q8655I4254f33I9357
12372a08510A81343a06031i926j31128H1038a59180B55276E5986c42703A54398
12361A22433r775a00002e288l63196h4979B2323J60382j742d3060H2905J23104
12350B06009a59402d9035A1801i7475J795m2511L2648A97244m3599j2821n1776
12339H9048N547c45014J21537e2084A48723k9187k7051Q4006f1248K419D4591
12327C83789c9451A37287j6362b44929A03746M5546J30405j17382J20576i9436
12316g6933l1165d3810j52794B03652B3999a37052L2824A43626b7484A21739B4959
12304c0141A79301F4875c73274A12097N5986o9307L5470Q092h5989B73193A08549
$$ plain form
12385 84918 -214390 -205994 -35372 -22074 -126509 -19443 -54031 -37790 -126445 94254 -633 99357
12372 -108510 181343 -106031 -9926 -141054 81038 -159180 255276 55986 -342703 154398
12361 122433 112658 -100002 -5288 -368484 -84979 22323 182705 180963 -43060 82905 206009
12350 206009 -159402 -49035 11801 -97475 -95680 -138191 -105543 197244 153645 140824 89048
12339 89048 94595 -345014 -223477 -52084 148723 119536 92485 176491 -61248 -58829 44591
12327 383789 -39451 137287 120925 -244929 103746 149292 279697 162315 282891 -99436
12316 -76933 -108098 -43810 -196604 203652 23999 -137052 -104228 143626 -27484 121739 24959
12304 -30141 179301 64875 -373274 112097 168083 98776 134246 142338 -85989 273193 108549
12292H5514l3396R7160c1564I5184a37938B75042B7770K65391a40074A74730b8819
12280a2981D26564i2682A87787o1450E0303O84755B12291L61554B21403J79289
12270D00692b3928q0167B93996B0243M1101j5880K95771D2401K66217H5453b1559
12258b12331N2159G7470r617H85a994j60540C45272G8309d5621l771D29759c560
12245a11659M9779A14097a66279l5767A79069a00444A05722J73021p4661b22703
12234B33196P3970j53495K11910D2917J53614D5039L52119b37275H2060m0225
12224D1835g951C69290G9290p599K17691a29149E3881J03830R7349b3991F5418
12212d4038I0460k4847c809l8994B20349R9935a00086C76341j60882K43725o8891
$$ plain form
12292 85514 52118 149278 -31564 95184 -137938 275042 27770 293161 -140074 174730 -28819
12280 -12981 426564 -92682 187787 126337 50303 735058 212291 573845 221403 400692
12270 400692 -23928 -104095 293996 20243 61344 45464 341235 42401 308618 85453 -21559
12258 -212331 -160172 77470 67853 885 -1994 -162534 345272 78309 -45621 -49392 429759 -3560
12245 -111659 -61880 114097 -166279 -202046 179069 -100444 105722 278743 204082 -222703
12234 233196 307166 153671 365581 42917 196531 45039 397158 -237275 82060 41835
12224 41835 -7951 369290 79290 71691 289382 -129149 53881 157711 255060 -23991 65418
12212 -44038 90460 65613 -3809 -42803 220349 320284 -100086 376341 215459 459184 390293
12201C90293j71261P3258m4576J49255e3653j0335J6355B75901p2470J82075A17718
12189C8875L11535A6708J88443j00954B5952K89135E219M9856K4849K64826A41636
12177E07297j44114j846A2715K26640p5261a85103B2019J41571R1327R9622L0483
12166C85022a4345A69601q1519m2005c02534A76848c6233j57462D3752d5603C64398
12154E7381K54425E0961K87922A25218M301a525E8084K7585e2465E0521i015B59052
12141a7508B16528L2055r2102f6959A25201J24661b1931B2325a54427A14909a24980
12129C78306a24059N3640A38472B789L5511c51812a20982b8936j31152I1203k7475
12118F3728b36899e6886A99863b284o6583j43232O0704N6228D5840f2358k3323
$$ plain form
12201 390293 219032 292290 247714 396969 -53653 -63988 -47633 275901 203431 385506 117718
12189 38875 350410 16708 205151 104197 25952 315087 5219 55075 79924 344750 141636
12177 507297 363183 361337 12715 239355 164094 -185103 22019 163590 254917 354539 385022
12166 385022 -14345 169601 88082 46077 -302534 176848 -36233 -193695 43752 -45603 364398
12154 57381 311806 50961 338883 125218 129519 -1525 58084 85669 -52465 50521 -9015 259052
12141 -17508 216528 248583 156481 -66959 125201 249862 -21931 22325 -154427 114909 -124980
12129 378306 -124059 -70419 138472 2789 38300 -351812 -120982 -28936 -160088 91203 63728
12118 63728 -236899 -56886 199863 -2284 -68867 -212099 -151395 -95167 45840 -62358 -85681
12107h5681m3539C1286f985B20767N220a67610c2591k46342a12892m7408O7361
12096i2939A39717O5341b64276C8037J43387J199f4370m2058d6795B35806a50913
12084e02273a72211O170J9830b728j96047M355j92297D5411a51459C55630O37328
12073I92958J501427A066969A70106a9204C10829K120E1211a6434A3333b89149
12062I8239L3089c6327A69816K019f6064k20373H6590a58051I9194J08823A9472
12050i2911B0040L2860K00966e8891l1785B10864e9713j12920M2889j54839A85949
12038A65803b8278A7509J33118e6696k10264h5403j64072j07933C28L59292b64387
12026b66423A6261N5099c0435n0068A51542n0145b50353A54796L5433J78981F0051
$$ plain form
12107 -85681 -129220 31286 -6985 220767 225987 -167610 -32591 -278933 -112892 -160300 -92939
12096 -92939 139717 205058 -264276 38037 181424 182623 -64370 -106428 -46795 235806 -150913
12084 -502273 -172211 -166041 -146211 -2728 -198775 -194420 -386717 45411 -151459 355630 992958
12073 992958 2494385 1066969 170106 -19204 310829 312949 51211 -16434 13333 -289149
12062 98239 131328 -36327 169816 171835 -66064 -286437 86590 -158051 99194 208017 19472
12050 -92911 20040 52900 253866 -58891 -90676 210864 -59713 -172633 -129744 -284583 185949
12038 165803 -28278 17509 150627 -56696 -266960 -85403 -249475 -357408 328 359620 -264387
12026 -266423 16261 71360 -30435 -80503 151542 101397 -250353 154796 190229 369210 60051
12014h6030A17185J9499f1060F7815q121a0820C24091j25990N8043A737J39453
12003A41190J38870A13387L2923m3890k8278j7660J22664D4923O8616m5577L1526
11992I9488f061A68278a07819A7022J50777H1795a36655k21114d1489j93386P7689
11981a57186e4127E75499F0119a99316R8034A35481g9466G1730B7895N4992a76985
11969f35759a99491m0518N3993l4743j04707N448h9871a0436l54012a25277o6606
11958a91883j07085G6548a86284A00924d6114L014B32544o7216a12737j38357
11948b51094A1567K72818I5218e5398A54545d1965b0047B17225b57674F9936i171
11936g0109E7147a43867C06845n7941a8422p1892M4915j12266A9485J25196b08005
$$ plain form
12014 -86030 117185 136684 -61060 67815 59694 -10820 324091 198101 256144 1737 141190
12003 141190 280060 113387 146310 102420 74142 56482 179146 44923 113539 67962 99488
11992 99488 -6061 168278 -107819 17022 167799 81795 -136655 -357769 -41489 -234875 -157186
11981 -157186 -54127 575499 60119 -199316 -101282 135481 -79466 71730 27895 82887 -176985
11969 -635759 -199491 -240009 -186016 -220759 -325466 -320018 -89871 -10436 -364448 -125277 -191883
11958 -191883 -298968 76548 -186284 100924 -46114 -43100 232544 165328 -112737 -251094
11948 -251094 11567 284385 95218 -55398 154545 -41965 -20047 217225 -257674 69936 -9171
11936 -70109 57147 -143867 306845 248904 -18422 -90314 -45399 -157665 19485 144681 -208005
11924A90644a672r5785E8604j5265p944O7375J48554I6712a91999e6041B31475
11912c72450A02258B9259K9556b84334c3336o9664k7562K5025j69053K4064B9493
11900E8915f0775o1279B4160A1185a48647m1301G7600J2326a12145C41857g5957
11888b55058A07898i17A13394N2188M6688b68919a2646A58459g601k84216g7462
11876b78538A20644j3670A8977c434r0903A79447G0524g8202k1995A35154B1685
11864A31682L436a0422I8824h5733L4307B6162c19146B02370b59995A377b16029
11852F844K00287a81139A20110d66763a22348G9731c680A3778h5167j11145R5233
11841a01079k12778a31884r4975Q1070E340a88276h2424K6160n87640I2295B8475
$$ plain form
11924 190644 -1672 -97457 58604 43339 35395 102770 251324 96712 -191999 -56041 231475
11912 -372450 102258 29259 58815 -284334 -33336 -103000 -130562 -105537 -274590 -250526 29493
11900 58915 -60775 -122054 24160 11185 -148647 -189948 77600 89926 -112145 341857 -75957
11888 -255058 107898 -917 113394 165582 212270 -268919 -12646 158459 -7601 -291817 -77462
11876 -278538 120644 106974 18977 -3434 -94337 179447 70524 -78202 -100197 135154 21685
11864 131682 135118 -10422 98824 -85733 -51426 26162 -319146 202370 -259995 1377 -216029
11852 6844 207131 -181139 120110 -466763 -122348 79731 -3680 13778 -85167 -196312 -101079
11841 -101079 -313857 -131884 -226859 -145789 5340 -188276 -82424 -56264 -643904 92295 28475
11829b53999E7433k1365a83667e0918H1126e85340C0575N3648k8327J46273c12913
11817a8341r7291A26646b25764b6121k4225r668o6926j2102B0596b80734C21510
11805D086a76001m2452K3240l3612n2691c7446B17239I0611c5324i057F6570b31877
11792a0786o1086A39114k5204Q830a06713p3555B6339d901k73621I9107m1386
11781E7721i8243J1927m354I6845N4514b36283e8214A03763R6025J7035b78812
11769C00021a48188E24f9555j40930A66005M4783f9933j31043A9557c9843D43315
11757d1737B68841j28825a15471B7744K90954j43256a9679C248a56868G2597J12418
11746A85015b75993D62532C4253J37467E6543f7004A12188K3040a24673G2013
$$ plain form
11829 -253999 57433 36068 -183667 -50918 81126 -585340 30575 84223 55896 202169 -312913
11817 -18341 -115632 126646 -225764 -26121 -50346 -60014 -126940 -139042 20596 -280734 321510
11805 4086 -176001 -218453 -195213 -228825 -281516 -37446 217239 90611 -35324 -9057 66570 -231877
11792 -10786 -71872 139114 113910 122740 -106713 -180268 26339 -4901 -278522 99107 57721
11781 57721 -98243 -86316 -90670 96845 151359 -236283 -58214 103763 199788 216823 -278812
11769 300021 -148188 524 -69555 -210485 166005 210788 -69933 -200976 19557 -39843 443315
11757 -41737 268841 140016 -115471 27744 318698 175442 -19679 3248 -156868 72597 185015
11746 185015 -275993 462532 34253 171720 56543 -67004 112188 135228 -124673 72013
11735F6902r395B4961a14577j1632A92842b40496f905A37577a24045K6755C2226
11723e9938o3349j58744C8194a94127A43399E0583J01753K0414A0405N1097c34334
11711a82366A24090K3395a8589E8297k2417A4299L59123A29761b40871A54327
11700d1724k5364A04790b47424Q2132E7380J99588A03035J03209M8298D4722L48007
11689C92729C7823b36760d7866A56182J09970j23113d3655I7637b12039i7866
11678C64088G2928J98859f1270B14436B663J16821m4764c52631C9502f3059l65776
11667d28835B01412f8829A03972m8048a14830A3715a78580B37457E2223K4994
11657G7217f40k22024A99115A6513K54565A03347b52891A44516P665a03918A05248
$$ plain form
11735 66902 57507 24961 -114577 -126209 192842 -240496 -6905 137577 -124045 -97290 32226
11723 -59938 -123287 -282031 38194 -194127 143399 50583 152336 172750 10405 61502 -334334
11711 -182366 124090 147485 -18589 58297 35880 14299 373422 129761 -240871 154327
11700 -41724 -67088 104790 -247424 -165292 57380 256968 103035 206244 254542 44722 392729
11689 392729 37823 -236760 -47866 156182 266152 143039 -43655 97637 -212039 -97866
11678 364088 72928 271787 -61270 214436 2663 119484 74720 -352631 39502 -63059 -428835
11667 -428835 201412 -68829 103972 55924 -114830 13715 -178580 237457 52223 77217
11657 77217 -640 -222664 199115 16513 271078 103347 -252891 144516 152181 -103918 105248
11645A36269L0009k1455a80589M6934B23247b73765A01255c4813j63422n215r2792
11634b96242F6099k0933k613Q5425A1717h2755B29531L16442A14020J84933a70459
11622a31731E1280c3561m72410a09827l5915j829c2183j42654D9973L3372C1038
11610C0363K57549o8771J50646A04462g8674A81340b17083B0383c40200F9773
11599D04180b04479F0197J15940R6737o1659P166a13307B5514f1019A54341P5922
11588B30263d563C6955g3127A96591p9439K02281L4611b23106G1270P3474m1244
11577A03500Q0641P688H3770j3049L6561N641K65738e0561b844A32638c267B7765
11564C66505g0885n1795C93427A85369r1396J988J10849c79515A44947J86968
$$ plain form
11645 136269 166278 144823 -180589 -133655 223247 -273765 101255 -34813 -198235 -203450 -296242
11634 -296242 66099 45166 42553 127978 11717 -82755 229531 545973 114020 298953 -170459
11622 -131731 51280 -33561 -505971 -109827 -145742 -147571 -32183 -174837 49973 83345 31038
11610 30363 287912 219141 369787 104462 -78674 181340 -217083 20383 -340200 69773
11599 404180 -204479 60197 176137 272874 211215 218381 -113307 25514 -61019 154341 230263
11588 230263 -4563 36955 -73127 196591 117152 319433 354044 -223106 71270 144744 103500
11577 103500 184141 191829 83770 70721 107282 112923 378661 -50561 -2844 132638 -3267 27765
11564 366505 -70885 -122680 393427 185369 93973 95961 206810 -379515 144947 331915
11554C31915b27882A23606R3265I3416C7942K62132F8762M9194P1201P1671A08412
11542C9208a22437A11586K1142A0758L2843a26803M7347E0639K76862b7285C61532
11530F9543d37B70365D766J10250J55341a43059A23838m868j4246i6119B55182
11518A02445o688a23019C52218A58572a54323D4602K75687A7972J278K36594I2369
11506C53068O5368i9125I8103J77998N5774j40096K783a44851A37449J29958j2859
11495B54548A15194Q2403n0132a09724A81602E4212Q6425B0495L37891r0225a52818
11483b5646B83521b378l0446A42472K40102o5706d288A65918g5962A39004O5739
11472B04743r644j9291E2153J86515e9188B63249E4694b4195I9935K2184J70128
$$ plain form
11554 331915 -227882 123606 216871 93416 37942 300074 68762 117956 189157 260828 108412
11542 39208 -122437 111586 132728 10758 43601 -126803 -79456 50639 327501 -27285 361532
11530 69543 -437 270365 4766 115016 270357 -143059 123838 118970 104724 -96119 255182
11518 102445 95757 -123019 352218 158572 -154323 44602 320289 17972 19250 255844 92369
11506 353068 418436 -99125 98103 276101 331875 191779 194562 -144851 137449 267407 254548
11495 254548 115194 197597 147465 -109724 181602 54212 140637 20495 358386 268161 -152818
11483 -25646 283521 -2378 -32824 142472 382574 316868 -4288 165918 -75962 139004 204743
11472 204743 195099 175808 52153 238668 -59188 263249 54694 -24195 99935 122119 292247
11461B92247f0986H8791C262J87118C2418R0270k3991L1393b7303C06376b1579
11449B7391i7945j44235E4016M59116e170o7365A8176J07060b8137B08986j6870
11438A92116D2767K26971a13972D2885c6199A73606m9261a63372h0300B704K0897
11427B3601a60848C21515A07464B8444d4268B20416j06359d6613B85891a81227
11416d9489A35782D2444L7290K5299J4403l4560K16132H3827N3265b8015H1557
11404A91128r2223a87261B49355F3238j7305A1153K00122P0368g7979m5341B2418
11392A37300f4310A12915O8532d3097B35734h0708k00688A64157b00939q0238
11382b81177i3402B50792A00398b25108A27705g5180J6863B22150c4502A70407
$$ plain form
11461 292247 -60986 88791 3262 190380 32418 122688 98697 130090 -27303 306376 -21579
11449 27391 -97945 -242180 54016 513132 -5170 -72535 18176 125236 -28137 208986 192116
11438 192116 42767 269738 -113972 42885 -36199 173606 124345 -163372 -80300 2704 23601
11427 23601 -160848 321515 107464 28444 -44268 220416 114057 -46613 285891 -181227
11416 -49489 135782 42444 79734 105033 119436 84876 301008 83827 137092 -28015 81557
11404 191128 98905 -187261 249355 63238 45933 11153 211275 281643 -77979 -123320 22418
11392 137300 -64310 112915 181447 -43097 235734 -80708 -281396 164157 -200939 -281177
11382 -281177 -93402 250792 100398 -225108 127705 -75180 -58317 222150 -34502 170407
11371b0034k2218j15059g3966C02072J62703a66881K7764d8975A7338J1098h6383
11359f781A0487g3130k17126J39862d9876A9310h8861n3417D001b04552R8589
11348a05963j85901f1241C9151a98212j37922F7094K52937a18473Q369j24598
11338b34702A69404F260a36055b2735k35642E5039O584J67957b1094j15897G9079
11326A01593J8920A4499b58769B12438F6504K7321c6144m3506f159C56668a7768
11314A48502a8056j04839C53359c6868I0862a0837k20902g5396a0206A00782a38805
11302h6512A11767b17291N8476B27554p0436b960G7720f0642k0925C10h7258Q91
11290h6367H258P5603K43438r55a50878A4826a06868c2455B39968m2182D0793
$$ plain form
11371 -20034 -42252 -157311 -73966 302072 464775 -166881 -139117 -48975 17338 28436 -86383
11359 -6781 10487 -73130 -290256 -150394 -49876 19310 -88861 -142278 4001 -204552 -105963
11348 -105963 -291864 -61241 39151 -198212 -336134 67094 320031 -118473 -110104 -234702
11338 -234702 169404 6260 -136055 -22735 -258377 55039 61623 229580 -21094 -136991 79079
11326 101593 120513 14499 -258769 212438 66504 93825 -36144 -79650 -6159 356668 -17768
11314 148502 -18056 -122895 353359 -36868 90862 -10837 -231739 -75396 -10206 100782 -138805
11302 -86512 111767 -217291 -158815 227554 157118 -2960 77720 -60642 -81567 310 -87258 -86367
11290 -86367 8258 83861 327299 326344 -150878 14826 -106868 -32455 239968 197786 40793
11278a25319O0399b2295l34393i9600A6603O6002L1048h6052A8651a8347j7321
11267c5668j45345D9281B365f2591q9808i471A5023a79378e9550a9373E1304b7928
11254H3449a39234a7404A531J1217g7899q3805D5903b2833B8065i3608Q646c6200
11241A88176a86147C4856P6925D3235O8117a37566G3884O64O8679O0634j3149
11230A90712o3329a09675O791n5873E3806b48763O0705D2207c27603F3161a12187
11218a2704G965g133E9257L426c35799D9060L4966C45a14312k54470J23738B22456
11205b85041e4431a9014B2802c9123k22040M5602C41525b21261b9942j26217O3237
11194i2922j60789M798F2519R4533E72a94458C8560d9A05663D221a23163M8469
$$ plain form
11278 -125319 -64920 -22295 -356688 -99600 16603 82605 113653 -86052 18651 -18347 -35668
11267 -35668 -181013 49281 2365 -62591 -152399 -9471 15023 -179378 -59550 -19373 51304 -27928
11254 83449 -139234 -17404 1531 12748 -77899 -161704 45903 -22833 28065 -93608 -84962 -36200
11241 188176 -186147 34856 111781 43235 111352 -137566 73884 74548 143227 203861 190712
11230 190712 127383 -109675 -102884 -158757 53806 -248763 -188058 42207 -327603 63161 -112187
11218 -12704 7965 -7133 59257 62683 -335799 49060 84026 345 -114312 -368782 -245044 222456
11205 -285041 -54431 -19014 22802 -39123 -261163 -215561 341525 -221261 -29942 -156159 -92922
11194 -92922 -253711 -248913 62519 157052 572 -194458 38560 -49 105663 4221 -123163 -74694
11182g4694B66090E4045b55778i3467B29168b09401G185i0027J6404j5485j56856
11171b45964B63600a25827L0462i444r0305C54248c16342B8759P9934l6108J66724
11160B39309b03047M8642l0786n2827R3625g663B2391c13456P8362n8099A58404
11148A00516J33890a73376C2177J56034k2008O1932H1953h1651J3657C25466n4368
11137B71098a96685D2797L83783I8379b26569F6413J92381b37379a922j95238
11127a97160b8118j32917B16445q4729k5002F784J2082J9256a0324A4414a05134
11115B81556j31487g0376B21264C1271e552F9593l4441K36068a1377k6892G5356
11103c28406D39624G5036n625P2721k5316N05249B37495l2169D6191L14488j30006
$$ plain form
11182 -74694 266090 54045 -255778 -93467 229168 -209401 7185 -90027 -73623 -89108 -245964
11171 -245964 263600 -125827 -95365 -9444 -99749 354248 -316342 28759 108693 72585 239309
11160 239309 -203047 -154405 -185191 -238018 -144393 -7663 22391 -313456 -235094 -293193 158404
11148 100516 234406 -173376 32177 188211 166203 228135 81953 -81651 -67994 325466 271098
11137 271098 -196685 42797 426580 98379 -226569 66413 258794 -237379 -1922 -197160
11127 -197160 -28118 -161035 216445 131716 106714 6784 18866 38122 -10324 14414 -105134
11115 281556 150069 -70376 221264 31271 -5552 69593 35152 271220 -11377 -38269 75356
11103 -328406 439624 75036 69411 142132 116816 622065 237495 205326 46191 360679 230673
11092B30673a96300A13900A4123L76463m0209K45589k83128J67786L0839j74144
11082C37319n807A58574K08407E7434K40098O8675G4212M05201k30200I9820l0326
11071F9494L6114D9958J95864O0031O9245K16044E7299M00534k22114N09982l24691
11060D21010L34639l47574J01761J24172C12035J45621J05772P2778j66405L72671
11050H42472k58953J44299j71147K08590K3202k66491L75319J9005m02803M84978
11040I98471l49195j02194L35218j17192B60504P74678m00883J51477l15025L00469
11030G71220J5258j38391O0457K72741l5352j98930l3572J14723k09114J46448
11020G65488j10977k3180o0814J71235j76517j30029j67546K57859m495Q184J53706
$$ plain form
11092 230673 -196300 113900 14123 390586 350377 595966 312838 480624 511463 337319
11082 337319 331512 158574 366981 57434 297532 366207 74212 479413 249213 99820 69494
11071 69494 105608 49958 245822 305853 375098 591142 57299 457833 235719 745701 421010
11060 421010 755649 408075 509836 634008 312035 457656 563428 636206 469801 842472
11050 842472 583519 727818 556671 765261 788463 521972 897291 916296 513493 998471
11040 998471 649276 547082 882300 765108 260504 1035182 634299 785776 470751 771220
11030 771220 786478 648087 708544 981285 945933 747003 713431 828154 619040 765488
11020 765488 654511 631331 570517 741752 565235 435206 267660 525519 521024 529208 682914
11009F82914o1981Q3713l9501k79023j3589J79104j08230M55503k90514o334K41232
10998H43294m18238M11680J20057k53610N5285l0376j26692L46540m4511r1526
10988H11903j15094K73865K6893l58693K20627J53752R0172K20409q3227J63338
10978A403945R9087n1526K91156K91454M57990O7108N30561j71500o2625r325
10968B846325j6797m93157l33227j88669k0741k27893J69513l4211K52057k10486
10958A742714J53990J68321k31372K57040k26314o13247N00527n73422k38274
10949I39963k36l81010j83971K40640B77712K76801A98423K69761A04356J20029
10939B24385q6228J55512b6187C65238A31397J31035a11707L4280A53286a00587
$$ plain form
11009 682914 620933 704646 665145 386122 372533 551637 443407 898910 608396 602062 843294
10998 843294 425056 836736 956793 703183 758468 728092 601400 947940 903429 811903
10988 811903 696809 970674 997567 638874 859501 1013253 1103425 1323834 1240607 1403945
10978 1403945 1503032 1451506 1742662 2034116 2492106 2559214 3089775 2918275 2855650 2846325
10968 2846325 2829528 2336371 2003144 1814475 1793734 1565841 1735354 1701143 1953200 1742714
10958 1742714 1896704 2065025 1833653 2090693 1864379 1251132 1751659 1178237 939963
10949 939963 939727 558717 374746 615386 277712 554513 198423 468184 104356 224385
10939 224385 138157 293669 -26187 365238 131397 262432 -111707 -77427 153286 -100587
10928C9102J13991J20694p0324N8457b3504q6459j18977J5404m9485A1318a54190
10916B9035M35016F764a20567J3260L8585A73522p2101a11214i784k07463Q3920
10905a33327A49384b95537A04112d895D8878J93649b28069A66811b37031A45652
10894a64713f129H7155k9575D154a1580l3829D19718a44705A08723D7957K2916
10883G0873F86J23570c6325j90012l7262g9809j06784B40068a18535B0371R5479
10872A15850c8620A90946b28492A12898a27749L9693p2514P1079k6303A0539b91858
10860d5352j18449g2865J6492j9504G7210R585J81303A25659a16605q4316i8653
10848d45143A08617A0517a35281a1063j77159C2124d344I0148a26715O3103j24836
$$ plain form
10928 39102 153093 273787 203463 261920 -23504 -109963 -228940 -213536 -263021 11318 -154190
10916 29035 464051 6764 -120567 -107307 -68722 173522 101421 -111214 -9784 -217247 -133327
10905 -133327 149384 -295537 104112 -4895 48878 242527 -228069 166811 -237031 145652
10894 -164713 -6129 87155 57580 4154 -11580 -45409 419718 -144705 108723 47957 70873
10883 70873 686 124256 -36325 -226337 -263599 -79809 -186593 240068 -118535 20371 115850
10872 115850 -38620 190946 -228492 112898 -127749 -88056 -160570 -89491 -115794 10539 -291858
10860 -45352 -163801 -72865 -56373 -75877 77210 86795 268098 125659 -116605 -200921 -98653
10848 -445143 108617 10517 -135281 -11063 -188222 32124 -4344 90148 -126715 -63612 -188448
10837a88448B23310q0094q313a1813A01071O3174b00263A04627a24507B25969
10826D9251B2651a35600J8721b4454j04744l3529K6378N9052j87325D6088K08771
10815B54859a86477A51441h9128B60976f5988k42800E6735J30343b73786r3706
10805c67492H8056h8102j08679Q7001I5647L606a98701f1441A38663a22521c7335
10793b03745B94092j7963a00032F8799H336f2377A78391c71466F2206a79407F775
10781H8375B3993K9060J76266a14047n127j49043F5459c08818i6082B30128f936
10769C33080A59219A6275b03754G5939a9674E6551J46123a26633A18110m8663
10759F9447J00976Q4606c43922g1381j09811a5921j4672j43715N9870o4349j8195
$$ plain form
10837 -188448 223310 143216 134903 -11813 101071 164245 -200263 104627 -124507 225969
10826 49251 22651 -135600 -116879 -24454 -129198 -162727 -136349 -77297 -264622 46088 254859
10815 254859 -186477 151441 -89128 260976 -65988 -308788 56735 187078 -273786 -367492
10805 -367492 88056 -88102 -196781 -109780 95647 99253 -198701 -61441 138663 -122521 -37335
10793 -203745 294092 276129 -100032 68799 8336 -62377 178391 -371466 62206 -179407 6775
10781 88375 23993 53053 229319 -114047 -119174 -268217 65459 -308818 -96082 230128 -6936
10769 333080 159219 16275 -203754 75939 -19674 56551 202674 -126633 118110 69447
10759 69447 170423 255029 -343922 -71381 -181192 -15921 -30593 -174308 -114438 -178787 -196982
10748a96982I3116d3518r2952C51575h2113k00967A18846J34769j19174A7239
10737f13j4129C29803A02691k540h3231p0244B01750r7333K90909b58288a20873
10725a48372j16343i3270E4324e41320a03939F6738d6366J5865I8040b82811J30128
10714a52683j86833a51968A54337e24215H3019h5734l676O1B8599K4170a2109
10702a13327k58071d6561B24400i8343a5143m7715G4803A5679J59684b96535A34052
10690a63428g3142A28150c11058O8309A38124b25607G3961i6290A76779g1963
10679c5167l80253B68339b45273A29600a98057I5166b86626k9646A84640b42352
10668a33595f2945A60967o4144b93456k87954C2069K1959d08483a53817j34082
$$ plain form
10748 -196982 93116 -43518 -136470 351575 -82113 -283080 118846 253615 134441 17239
10737 -613 -14742 329803 102691 100151 -83231 -153475 201750 104417 395326 -258288 -120873
10725 -148372 -264715 -93270 54324 -541320 -103939 66738 -46366 -30501 98040 -282811 -152683
10714 -152683 -339516 -151968 154337 -524215 83019 -85734 -89410 -89349 28599 52769 -12109
10702 -113327 -371398 -46561 224400 -98343 -15143 -62858 74803 15679 175363 -296535 134052
10690 -163428 -73142 128150 -311058 -242749 138124 -225607 73961 -96290 176779 -71963
10679 -35167 -415420 268339 -245273 129600 -198057 95166 -286626 -316272 184640 -242352
10668 -133595 -62945 160967 96823 -293456 -581410 32069 54028 -408483 -153817 -287899
10658b87899f7472I5319K01043b86747B31805b38684m4793a763B380J19730b70952
10646b50611c9202k36573B47001l9358a08172C20407d6865E604i1842j21768D2115
10634b51989g1906A12957c52132g2664b4000k32759A15129b02960E3315K6128
10624G9443b46803C13814b49091q6575f2299K286A4372a03873F8812A1122O9772
10613H0894g3228j95806q279A6850N9001b06453E5684K8344c73826B00517a94857
10601G3276a94712j72146H8503I35a53623N3639I5152J60487d50425A60711a48321
10589b04656A32220a16100D9250c15704B992b29510c7303B11200f08343h8282
10578A39109b54765H021b94267a2141q201A02823a73360F148c4110k86490B43454
$$ plain form
10658 -287899 -67472 95319 296362 -286747 231805 -238684 -283477 -1763 2380 122110 -270952
10646 -250611 -39202 -275775 247001 207643 -108172 320407 -46865 5604 -91842 -213610 42115
10634 -251989 -71906 112957 -352132 -72664 -24000 -256759 115129 -202960 53315 79443
10624 79443 -246803 313814 -249091 -335666 -62299 -60013 14372 -103873 68812 11122 80894
10613 80894 -73228 -269034 -277313 16850 75851 -206453 55684 84028 -373826 200517 -194857
10601 73276 -194712 -366858 88503 935 -153623 -99984 95152 255639 -450425 160711 -148321
10589 -204656 132220 -116100 49250 -315704 2992 -229510 -37303 211200 -608343 -88282
10578 139109 -254765 8021 -294267 -12141 -20342 102823 -173360 6148 -34110 -320600 243454
10566F9537J16017a21590k73115J41170d4831D4044a10061B9800a87578e7425
10555A71427a52965a7910I6752a38562A34055m3635e2984E8613c4603B39938b3086
10543G7417N4164b60l11520J5512J25039g4914B5251M0877J25335l7737L8989
10532A92715G1038a26810A5755b97250H4904b96057Q1295r734A78557p9643a18657
10520D02383E2888b68814A52073m5660J66064p6364r7855g858m15220P3406O4860
10509b84812o8771J59229h4935j7905k45629A52773c28222h2513B69484b1368
10498B6145a98388m6717b9295l47082B0759P1723b18051j2838J09718c6873G526
10486i0556B93746A44184c1636A79428p4779K52399K20178j60253F5806L15933
$$ plain form
10566 69537 185554 -121590 -394705 -253535 -44831 44044 -110061 29800 -187578 -57425
10555 171427 -152965 -17910 96752 -138562 134055 90420 -52984 58613 -34603 239938 -23086
10543 77417 131581 -260 -311780 -296268 -171229 -74914 25251 66128 191463 153726 192715
10532 192715 71038 -126810 15755 -297250 84904 -296057 -214762 -224496 178557 98914 -118657
10520 402383 52888 -268814 152073 106413 272477 196113 98258 -7858 -423078 -349672 -284812
10509 -284812 -353583 -194354 -84935 -102840 -348469 152773 -328222 -82513 269484 -21368
10498 26145 -198388 -245105 -29295 -376377 20759 92482 -218051 -230889 -121171 -36873 7526
10486 -90556 293746 144184 -31636 179428 104649 357048 577226 416973 65806 381739
10476C81739r6495a02355G8689N8625Q4551b1755C68049A80274d819j04772j48377
10465b57968A79752E6640j0775i0033A52753e4273O140j05505j71728J43269l08615
10454d90712A46146i829k77725b1196B0817J62930p8678J0773e4233n6536n6461
10443a67230A03318l4906a26292B18683G1772L16366B7578a4526q5564n4205A07078
10431F0251c2299j07372A40324D9045K93300k9360p1383a79889d8084A01853b55640
10419a05828c8239A97338a09221e3910k5704C0529a49767c0337j21454A80432
10408A16962e17913a1872B24168p5228a18743K2487A24316K6124b1881j88105
10398b09986H6590k0338a48968A37007L6228i9394H3289J59340K08461e2523B24396
$$ plain form
10476 381739 285244 -102355 78689 137314 221865 -21755 368049 180274 -4819 -109591 -257968
10465 -257968 179752 56640 45865 -90033 152753 -54273 -48133 -153638 -325366 -182097 -490712
10454 -490712 146146 -9829 -287554 -21196 20817 183747 105069 115842 -54233 -110769 -167230
10443 -167230 103318 68412 -126292 218683 71772 388138 27578 -14526 -100090 -154295 107078
10431 60251 -32299 -139671 140324 49045 342345 312985 241602 -179889 -48084 101853 -255640
10419 -105828 -38239 197338 -109221 -53910 -79614 30529 -149767 -30337 -151791 180432
10408 116962 -517913 -11872 224168 148940 -118743 -96256 124316 150440 -21881 -209986
10398 -209986 86590 66252 -148968 137007 173235 -99394 83289 242629 451090 -52523 224396
10386i1112j5905D05243A03523J91325b30181A26851g2230C28600A55802F1987
10375G9387K8755O9435F5399L14158N3876j47521r3572L46354K6658h8047F44803
10363D45931I4187Q6192k9644K29854a88010B56334j07994o8998L02619J278J78074
10352E61313k0013j99105j46176L46385j75627A17726m7040L81171A67372N0618
10342B17990J71114a7478B06342i751C56547k3487E2384K3516K23170r8650J19518
10331C19938M8236h7798c8529C3904b23792a7511H0425A0102a25874b0618A00158
10319F8909L94065e1034A13103e0109C39755f6354G947K26866e0592l74762A14438
10307a83801D897J11224a76045A87638G757N0169A8473a8762p3392o2857g816
$$ plain form
10386 -91112 -107017 405243 103523 294848 -230181 126851 -72230 328600 155802 61987
10375 79387 108142 177577 65399 379557 433433 285912 192340 538694 565352 -88047 644803
10363 445931 94187 180379 150735 380589 -188010 256334 148340 79342 381961 383239 561313
10352 561313 541300 342195 196019 542404 366777 117726 70686 451857 167372 217990
10342 217990 389104 -17478 206342 -9751 356547 333060 52384 75900 299070 200420 319938
10331 319938 368174 -87798 -38529 33904 -223792 -17511 80425 10102 -125874 -20618 100158
10319 68909 462974 -51034 113103 -50109 339755 -66354 7947 234813 -50592 -425354 114438
10307 -183801 4897 116121 -176045 187638 7757 57926 18473 -18762 -92154 -155011 -7816
10295C5029c0367A25311m2469c88144c423k28686l8316A47520m8687b17536c0031
10283a97087f925l5913n7547J2244O898K8002o4936B45647L6855o6149a86503
10271C28371b1905A34416a75154J7128g8205E507J60889F8289R553b25314D5743
10259H4341O7747K20245O9846a5055C45015D9030a54755d1240j19200E0196J58483
10248B08679p9015a87329E5791a64441j0502B74319k6533b34730E0896J99721
10238B50617B9244A0294a616j48051c8921A20326f8942j02263M0237B1127J3933
10227C5060a97202l4896B4517i4378c3146H7555J4357b4961j83208j19549A81838
10215D5535a16260B11837b56054a8181l22038J39469p1281J08530A07770P4377
$$ plain form
10295 35029 -30367 125311 82842 -388144 -3423 -232109 -270425 147520 98833 -217536 -30031
10283 -197087 -6925 -42838 -100385 -88141 -81243 -53241 -118177 245647 282502 216353 -186503
10271 328371 -21905 134416 -175154 -158026 -78205 5507 166396 68289 77842 -225314 45743
10259 84341 152088 372333 442179 -15055 345015 49030 -154755 -41240 -160440 50196 208679
10248 208679 129664 -187329 55791 -164441 -174943 274319 247786 -234730 50896 250617
10238 250617 29244 10294 -1616 -149667 -38921 120326 -68942 -171205 -130968 21127 35060
10227 35060 -197202 -232098 24517 -94378 -33146 87555 101912 -24961 -208169 -327718 181838
10215 45535 -116260 211837 -256054 -18181 -340219 -200750 -272031 -163501 107770 182147
10205A82147f9191a5876p9225e320A3402b83457J08383k2651p5698g6245B6170
10193b56234P8824e1930B46259a66366O7404k01362N3887m3340N9304E1422O0226
10182A11648C2353h782J250j55902j62058l6947c1427m2707B54292a47405a7052
10170c6073j59549E9662b17798A39372h8739B70653a6357g276j25640a9313B92230
10158H4859L18240m6092A46237b80553A58002l8599D8945a09028d049k15366h0060
10146A48413F754a95421q7762d6509l70261h7842j21688j95852h8900A45324h6797
10134d9125m6474L1611j29249d7637j89856B54677d3878j56080M4939o1309g196
10122c3000l26035A35972i7644q6457A07365a44419G7257J47618Q357b38818C10627
$$ plain form
10205 182147 -69191 -15876 -95101 -5320 13402 -283457 -175074 -197725 -273423 -76245 26170
10193 -256234 -177410 -51930 246259 -166366 -98962 -300324 -246437 -289777 -230473 51422 111648
10182 111648 32353 -8782 -7532 -163434 -325492 -362439 -31427 -74134 254292 -147405 -17052
10170 -36073 -195622 59662 -217798 139372 -88739 270653 -16357 -7276 -132916 -19313 292230
10158 84859 403099 357007 146237 -280553 158002 119403 48945 -109028 -4049 -219415 -80060
10146 148413 6754 -195421 -283183 -46509 -416770 -87842 -209530 -405382 -88900 145324 -86797
10134 -49125 -95599 -63988 -193237 -47637 -237493 254677 -43878 -199958 -155019 -216328 -7196
10122 -33000 -359035 135972 -97644 -184101 107365 -144419 77257 224875 233232 -238818 310627
10110f5493m8757A12093m6002J0527f3068q4432M381E6484d4558j07843B97747
10098A51900c71238C98200a0524b460o7636J9704A57999b04780h3798A79662o7095
10087A12567h487A14761b48360O1815K2751q3881A99331a14403j3845A9267a44519
10075a01739A06124a85840l1747C4123e136B42628b24559A07868b36668B33198
10064f4486B70549b47939R7742m2822G1840a91373H677K61972a10678j1935b7132
10052a71525B08570n7405D4040J0960b48099k3724B04930o9805c6894k71731a9255
10040c98825A1127J1412a58561J3280B37715b00229G6657c11036a33434A60883
10029f2874A17015e3258k94109H3000a45574B93055d0269g199k78329A21963b6467
$$ plain form
10110 -65493 -114250 112093 66091 76618 -63068 -147500 -143119 56484 -44558 -152401 297747
10098 151900 -371238 398200 -10524 -2460 -70096 -50392 157999 -204780 -83798 179662 112567
10087 112567 -8487 114761 -248360 -186545 -163794 -247675 199331 -114403 -128248 19267 -144519
10075 -101739 106124 -185840 -217587 34123 -5136 242628 -224559 107868 -236668 233198
10064 -64486 270549 -247939 -150197 -193019 71840 -191373 8677 270649 -110678 -122613 -27132
10052 -171525 208570 151165 44040 55000 -248099 -271823 204930 135125 -36894 -308625 -19255
10040 -398825 11127 22539 -158561 -145281 237715 -200229 76657 -311036 -133434 160883
10029 -62874 117015 -53258 -347367 83000 -145574 293055 -40269 -7199 -285528 121963 -26467
10017a41760M1756a5848G102Q1628c96669a03528D8905A4361g9491E4640j9290
10006C5350b4229o9884H9128e9596j48510i2840r4022e2754j04411j17509g8113
9994a92511A3036N180a01508C7663a70479I0930R8960d15198a91583I8602J05895
9983B04497D0750R5497f3320k54130B22505j01613b18528a0487j76739q833K087
9972a93972o315A03352a65292A18031J7833b80093a11548j36917G3697i5569a6365
9960e1228A11224a3845p5127B88886J4158b20349f6646k21185c2962e313k08529
9949b13842R6631k1891A03457g0852L469m1785A7153J5480e937C2731a79098M0540
9937a38558k7989a9854l5653G6735c1054G464K96802a59786k03443A64911A0648
$$ plain form
10017 -141760 -100004 -15848 7102 88730 -396669 -103528 48905 14361 -79491 54640 35350
10006 35350 -24229 -94113 89128 -59596 -208106 -92840 -186862 -52754 -157165 -274674 -78113
9994 -192511 13036 18216 -101508 37663 -170479 90930 189890 -415198 -191583 98602 204497
9983 204497 40750 136247 -63320 -317450 222505 120892 -218528 -10487 -187226 -196059 -193972
9972 -193972 -200287 103352 -165292 118031 135864 -280093 -111548 -248465 73697 -95569 -16365
9960 -51228 111224 -13845 -88972 288886 303044 -220349 -66646 -287831 -32962 -5313 -213842
9949 -213842 -117211 -139102 103457 -70852 -67383 -109168 17153 32633 -5937 32731 -179098 -138558
9937 -138558 -166547 -19854 -55507 76735 -31054 7464 304266 -159786 -363229 164911 10648
9925a49404A34085i6313A19158b03959B579h4321K5090I1451K00643b41181j28293
9914c69474N783J7422a47025B13975r3245C3344K2853B2669K68057h7175p9928
9903a67103G7150c60325A432a13143j50675j58181J24494I1361b0254j14877N4034
9892h1097B50455b85518A15848a04007A33969a77182A10171b4759j47388e4918
9881C2237J67783d30096h4416A79195b07637d7254k16458m0725n7448a47953m0214
9870a88167M025p977M0074A09839a1072A89019M1878a63162h251j6916l49514
9859c74681a60371m1318h0205r0033p6148F7727a9594B51699E1407c25956R1143
9848b34813A72219h2760b5209k14098c5149m8596k71974A00079b3880n3064l5524
$$ plain form
9925 -149404 134085 -96313 119158 -203959 2579 -84321 -59231 91451 292094 -241181 -369474
9914 -369474 -363691 -346269 -147025 213975 120730 33344 56197 22669 290726 -87175 -167103
9903 -167103 77150 -360325 1432 -113143 -263818 -421999 -297505 91361 -20254 -135131 -81097
9892 -81097 250455 -285518 115848 -104007 133969 -177182 110171 -24759 -172147 -54918
9881 32237 200020 -430096 -84416 179195 -207637 -47254 -263712 -304437 -361885 -147953 -188167
9870 -188167 -184142 -192119 -152045 109839 -11072 189019 230897 -163162 -8251 -25167 -374681
9859 -374681 -160371 -201689 -80205 -170238 -246386 67727 -19594 251699 51407 -325956 -234813
9848 -234813 172219 -82760 -25209 -239307 -35149 -83745 -355719 100079 -23880 -76944 -112468
9837a12468a4866m0829A18590Q5693a03966A54982a4294l9901B1879R4662a37753
9825a3120j04369C4440i1335K8763A46347j5158i6939A15061B0371f9213A25419
9813g5119n4200L209H995c65036B52370C2310c6927G0415K11394f1265R498k49098
9801c00865h7944q553p6540A66441m454c88161A7012O5139b72671d9685l6303
9790h5988j6992B3784a11333G7568b33736a11717d3756A81300i254C5175Q3687
9779A18862g8281n1425A18558e3270B43660k3285c2011r1398j24534B30884G1515
9767A07783d0966G4716k7899e57382A15038a11662A86197b65809a17798L6829
9757h0969B9813e0237B26595A6245c82719J73292m6930a9111D65654d0582G0927
$$ plain form
9837 -112468 -14866 -55695 118590 204283 -103966 154982 -14294 -54195 21879 116541 -137753
9825 -13120 -117489 34440 -91335 -62572 146347 131189 -96939 115061 20371 -69213 125419
9813 -75119 -129319 -126110 8995 -365036 252370 32310 -36927 70415 281809 -61265 -51767 -300865
9801 -300865 -87944 -96497 -173037 166441 161987 -388161 17012 82151 -272671 -49685 -85988
9790 -85988 -102980 23784 -111333 77568 -233736 -111717 -43756 181300 -9254 35175 118862
9779 118862 -78281 -129706 118558 -53270 243660 220375 -32011 -123409 -247943 230884 71515
9767 107783 -40966 74716 46817 -557382 115038 -111662 186197 -265809 -117798 -80969
9757 -80969 29813 -50237 226595 16245 -382719 -209427 -256357 -19111 465654 -40582 70927
9745b9252B51173d4458I1939J4230a73723p5360J06090q8585B22147q787p6989
9734A36371b46239h5526n5839c8891l48571f7712A37363g5435k59200g2131A54219
9722i0973j4172d6895A36619c2186C0101a79374B79481G0690L2748H250R7699
9711A05949D6722k1565a13558I087a12647q6341A69178i2858j1553c1969A69125
9699a36537J4915C98a30030A26628E9227g1870j56127H0858a84595g8678D1030
9687d35316N3814B05244a3486k37334E290M784e3354p0297e0487j10878A59826
9675a20782m9162B10927a99382j11925Q6767A74937a32942j26284B4960K01726
9665B26686a40723G9945J32458a89077D00836b86699O3892m6736d0115j52154
$$ plain form
9745 -29252 251173 -44458 91939 106169 -173723 -249083 -142993 -231578 222147 213360 136371
9734 136371 -246239 -85526 -141365 -38891 -387462 -67712 137363 -75435 -334635 -72131 154219
9722 -90973 -105145 -46895 136619 -32186 30101 -179374 279481 70690 103438 8250 105949
9711 105949 46722 25157 -113558 9087 -112647 -198988 169178 -92858 -104411 -31969 169125
9699 -136537 -121622 398 -130030 126628 59227 -71870 -227997 80858 -184595 -78678 41030
9687 -435316 -381502 205244 -13486 -250820 5290 10074 -53354 -123651 -50487 -161365 159826
9675 -120782 -169944 210927 -199382 -311307 -224540 174937 -132942 -259226 24960 226686
9665 226686 -140723 79945 212403 -189077 400836 -286699 -222807 -269543 -40115 -192269
9655a92269M5166E2819a94203f9140l4052k03490O5880k6820j91165i9523A53318
9643b19616p0164J24629p0904L2213F07a39795J0471O0536H5057P3535a65644
9631a32693N6697K4448A64548b7458k61315J28590B9419J29523a39784e1519B0702
9619A98481n328a9938C88618c2152A63267a84363c0539n2908k72486J60745D7898
9607e5758I1987k4048J24514a67585d2536k10553a15567k30029a51525J1032H2814
9595A37974h8459l6253L8322H3032a56160j52631C1890i6490A81100c03853a23104
9583b51258l08979a19837I4887J24641J6102b00956I2544a36194c3645k1902j41506
9572a97053A43436b47758K9071o7729B5967h7366F73196h5681j6269k36798C6814
$$ plain form
9655 -192269 -147103 52819 -194203 -69140 -103192 -306682 -240802 -267622 -458787 -99523 153318
9643 -219616 -289780 -165151 -236055 -203842 607 -139795 -129324 -68788 85057 158592 -165644
9631 -132693 -75996 -51548 164548 -27458 -288773 -160183 29419 158942 -139784 -51519 20702
9619 198481 193153 -19938 388618 -32152 163267 -184363 -30539 -83447 -355933 -195188 47898
9607 -55758 91987 67939 192453 -167585 -42536 -253089 -115567 -345596 -151525 -140493 82814
9595 137974 -88459 -124712 -86390 83032 -156160 -308791 31890 -96490 181100 -303853 -123104
9583 -251258 -560237 -119837 94887 219528 235630 -200956 92544 -136194 -33645 -55547 -197053
9572 -197053 143436 -247758 -218687 -286416 25967 -87366 673196 -85681 -101950 -338748 36814
9560c20597a11945k18296f9167L2445l33958c816A35391c28221e8698l0394A66602
9548g2818j8223C80903h8831A12813f3484n8910a5854H8053J01420f6864A73223
9536d6688A81609F282f1137l55777i7129R344C1112Q3294a22769J2741C11831
9524c04213a6974j6515I2618a78043A2176B738b13966h4540E9369J27701g0794
9512B12572b6101k75994E0917a79630h1941I0479c12713d4270r4906j38523P6361
9501b01338E1435f6371j25916r8710O6980P6478g0339m7316o7915b4840j6721
9490d1561A29487a10678N739A47394E7001c67498M4209M0754A21103g274A98729
9478A73968O8047b51473K0733f848b462l57597a992j67470B48503b11190a2974
$$ plain form
9560 -320597 -111945 -330241 -69167 -36722 -370680 -3816 135391 -328221 -58698 -89092 166602
9548 -72818 -91041 380903 -88831 112813 -63484 -122394 -15854 88053 189473 -66864 173223
9536 -46688 181609 6282 -61137 -416914 -97129 -87785 31112 114406 -122769 -110028 311831
9524 -304213 -16974 -33489 92618 -178043 12176 2738 -213966 -84540 59369 187070 -70794
9512 212572 -26101 -302095 50917 -179630 -81941 90479 -312713 -44270 -139176 -277699 -201338
9501 -201338 51435 -66371 -192287 -290997 -224017 -147539 -70339 -117655 -185570 -24840 -41561
9490 -41561 129487 -110678 -104939 147394 57001 -367498 -323289 -282535 121103 -7274 198729
9478 173968 242015 -251473 -230740 -6848 -2462 -360059 -1992 -169462 248503 -211190 -12974
9466i0183j81831M9653R002B29688l3335a50178k0738A20552l8703a69297l5209
9455b04506I6370b47968A37789a72484L1706J5308n2189j34151E4730J38981J44650
9444C38361A4724a23285K6434R249j93591J34771C1714e18440N6896C9820a90948
9432A9291L24987h049l8994n7641P788A67615i4066j61176C1213a55310m6385
9421b01695C93624a03439C5132e1757I0122a73083j36147a31435A00930k9092
9411G1838R162a31875C58496a24935E260a69585N3791m6126j49743c6603j90691
9400b27294B44048C8827b60360Q6171A53578B877n81M7193a69005p900D9148a33593
9387b12883a01543I175f396k17037A7490h9799m1482E6392b16674g6052A5126
$$ plain form
9466 -90183 -272014 -222361 -213359 229688 196353 -150178 -170916 120552 81849 -169297 -204506
9455 -204506 96370 -247968 137789 -172484 -140778 -125470 -177659 -311810 54730 193711 338361
9444 338361 14724 -123285 -96851 -87602 -281193 -146422 31714 -518440 -461544 39820 -190948
9432 19291 344278 -8049 -47043 -104684 -96896 167615 -94066 -255242 31213 -155310 -201695
9421 -201695 393624 -103439 35132 -51757 90122 -173083 -309230 -131435 100930 71838
9411 71838 81000 -131875 358496 -124935 5260 -169585 -115794 -161920 -311663 -36603 -227294
9400 -227294 244048 38827 -260360 -174189 153578 2877 2296 49489 -169005 -176905 49148 -133593
9387 -212883 -101543 9175 -6396 -223433 17490 -89799 -131281 56392 -216674 -76052 15126
9375b119I906f48q4677G7613K04092c03427M9599J01491f250l11721f8622B4133
9362A07724A1755a95384j39282O2743C8357d44432a73626A83076a27665I0599
9351b16303g3593j20965e2631n5343M0275j57660N122h88j81373N6736A6204Q0253
9339I6457g0570q8341B42184b07840a8984j93830D5684a06271k9696a060A9380
9327d7211r9156a8749j45959d2266k04045d8545c689k55301g823A44680J4289
9316A58969b08110j02274g8560j1921c3977m8508j29201O8377E9364b19378M6156
9305a73222m7243o3007B5890a5615B6287a13993E9133P6077N0401c31358f3076
9293A4207a28631A07766A9065L6799J59203b22735n2592A82418L0589a07045j5564
$$ plain form
9375 -2119 9906 -648 -85325 77613 281705 -303427 -253828 -152337 -6250 -317971 -68622 24133
9362 107724 11755 -195384 -334666 -271923 38357 -444432 -173626 183076 -127665 90599
9351 -216303 -73593 -194558 -52631 -107974 -67699 -225359 -220237 -888 -182261 -125525 16204 96457
9339 96457 -70570 -158911 242184 -207840 -18984 -212814 45684 -106271 -135967 -1060 19380
9327 -47211 -146367 -18749 -164708 -42266 -246311 -48545 -3689 -258990 -7823 144680 158969
9316 158969 -208110 -310384 -78560 -90481 -33977 -82485 -211686 -143309 59364 -219378 -173222
9305 -173222 -220465 -283472 25890 -15615 26287 -113993 59133 135210 185611 -331358 -63076
9293 14207 -128631 107766 19065 55864 215067 -222735 -275327 182418 213007 -107045 -122609
9282a22609M9305k12849a8559j26822n2451A08535d4383C7939b78591O5800F0770
9270f1182k10468J15735B58520A6238a79007j6688j44318a68014a6420C28287
9259A6375g1312G5154a86590I0111a78623d2690j85060a11715c5466o9783k90538
9248c95787a31214L2353A05068a94332A44997i8013L5160m23809O3280A16423
9237c56339a22930l2204d7123j08501O2236l17351C84890b43793a5205A2852L60483
9226C73335j31198H4963g2757A42699G546e8016C5163K3070b4060j290j08967
9215a34317I0353C5121g4953k7254q5617C43501C402P6693c71645J78672j25144
9204c18117R3513l3732B7470O51515b76624A9355J23679e7223P163B0111f4118
$$ plain form
9282 -122609 -73304 -286153 -18559 -145381 -197832 108535 -44383 37939 -278591 -212791 60770
9270 -61182 -271650 -155915 258520 16238 -179007 -195695 -340013 -168014 -16420 328287
9259 16375 -71312 75154 -186590 90111 -178623 -42690 -227750 -111715 -35466 -105249 -395787
9248 -395787 -131214 -98861 105068 -194332 144997 -98013 -62853 -486662 -423382 116423
9237 -356339 -122930 -155134 -47123 -155624 -93388 -410739 384890 -243793 -15205 12852 373335
9226 373335 242137 84963 -72757 142699 7546 -58016 35163 58233 -24060 -25350 -134317
9215 -134317 90353 35121 -74953 -102207 -187824 343501 3402 80095 -371645 -192973 -318117
9204 -318117 -224604 -258336 27470 678985 -276624 19355 143034 -57223 -50060 20111 -64118
9192c8103j25936B12239a49191N7327k10324a4846A92451b3764A4106d5504j20622
9181a66126p847A74504b92580N3082N4488k25584J49587J05651C3022a7004k0424
9170c7428d211A44364h9522A1619R7474h2429A63083b21095f8467A08195k5547
9159H2648a70384L7096E1039b35079C31390j60709a63429A63589K51365c29156
9148B7698b3930n7015n1778D7427b30658B21899A9286a74645I8608B6081c9700
9136c23036A91569l7566d3080j72497I17c89454i5031A43226c23111j13803a86928
9124f4071A12354j5632a24081l933a9968i301j00322o4961B2591K19688a55870
9112A57731K3619a1958k0139j34933j46649D954a17148j69219c948B95981a22151
$$ plain form
9192 -38103 -164039 212239 -149191 -91864 -302188 -14846 192451 -23764 14106 -45504 -166126
9181 -166126 -173973 174504 -292580 -239498 -185010 -410594 -261007 -155356 33022 -17004 -37428
9170 -37428 -4211 144364 -89522 11619 109093 -82429 163083 -221095 -68467 108195 82648
9159 82648 -170384 -133288 51039 -235079 331390 170681 -163429 163589 414954 -329156
9148 27698 -23930 -80945 -132723 47427 -230658 221899 19286 -174645 98608 26081 -39700
9136 -323036 191569 154003 -43080 -215577 917 -389454 -95031 143226 -323111 -436914 -186928
9124 -64071 112354 96722 -124081 -128014 -19968 -9301 -109623 -174584 22591 242279 -155870
9112 157731 181350 -11958 -32097 -167030 -313679 4954 -117148 -286367 -3948 295981 -122151
9100c82384J38864E367a18537a8696l17910a07439M4883j294k48865L8719P9764
9089a94232r483O0642k03958m9134A00518a95798c4026j2119k14040c218G9131
9077D3910i4877k26732N5699i6929j9521b7149F5720h2189A12335h6296A02145
9065b44303D1516a73097G8302a56454D07590f2518l07775a44202D470K03718a46303
9053a57325A3101j277a54683l70104a52953L369H4582c2777j24773q9057J02978
9042a43629g0297B54587a92124B49375I7588L8928a23239A34939K33465A00896
9031e4073C89762a20535A86295N935F9777c01372a39194p7933L9113g1019k76336
9020c47355Q9967C7566c5075A4236b54211c7607A45717a06325k45729d5101B57592
$$ plain form
9100 -382384 -243520 5367 -118537 -18696 -336606 -107439 -62556 -63850 -312715 -273996 -194232
9089 -194232 -203715 -143073 -347031 -396165 100518 -195798 -34026 -46145 -260185 -3218 79131
9077 43910 -94877 -321609 -265910 -96929 -116450 -27149 65720 -82189 112335 -86296 102145
9065 -244303 41516 -173097 78302 -156454 407590 -62518 -370293 -144202 4470 208188 -146303
9053 -157325 13101 11824 -154683 -524787 -152953 -149584 84582 -32777 -157550 -246607 -143629
9042 -143629 -70297 254587 -192124 249375 97588 136516 -123239 134939 368404 100896
9031 -54073 389762 -120535 186295 192230 69777 -301372 -139194 -217127 -178014 -71019 -347355
9020 -347355 -257388 37566 -35075 14236 -254211 -37607 145717 -106325 -352054 -45101 257592
9008C16710C3751b18791B5705L2764k4277a31666e1245n7780j46347R1140L500
8997a60732l2439e3270l15631A65407b0068l43752D5546c41435J32659d2582E1229
8985b99300e7192J2903A5974J33873a31644A58684C1729a78800P5637b4553j8980
8974d3533l1950k50887a47735p8212A19412k4906b35146B52639B2227c6721c941
8962A7699b58006P2861c6101A77053p5292e0980H8120A2789J41036a60092C6939
8950c79899a37295H7743b38149H7801A5153a60870H5917a88996M4924N1049D7673
8938A18763O5748A1886a21755A07123e0227j0342j19293B6274e9757o5853k6395
8927a52005K4703E5338L1886K9840N47587M051224p2356A384973F76320C17328
$$ plain form
9008 316710 33751 -218791 25705 58469 34192 -131666 -51245 -109025 -255372 -164232 -160732
8997 -160732 -193171 -53270 -368901 165407 -20068 -363820 45546 -341435 -208776 -42582 51229
8985 -299300 -57192 -44289 15974 149847 -131644 158684 31729 -178800 -103163 -24553 -43533
8974 -43533 -75483 -326370 -147735 -225947 119412 94506 -235146 252639 22227 -36721 -3941
8962 17699 -258006 -185145 -36101 177053 101761 -50980 88120 12789 153825 -160092 36939
8950 -379899 -137295 87743 -238149 87801 15153 -160870 85917 -188996 -144072 -93023 47673
8938 118763 184511 11886 -121755 107123 -50227 -60569 -179862 26274 -59757 -125610 -152005
8927 -152005 -127302 55338 87224 117064 664651 4715875 4643519 1384973 676320 317328
8916C83463A02923a54299B37590a58802F5913a72884l8845C22462j33348l6278
8906A52836E6424j3373a83295k36130J95826B32N0237b52760B71879A9727K32829
8895B52556a12721q4784A12843c6641f20B84878d98153D2587e4471A66587b24491
8883a13735C04882A5441b70575a34107A18593j5034a82432a4815k013j01005a5747
8871b64398g7538A6049a8660A39868k4596a14943D6872a0351j06979A15434a77506
8859A09073a03209A20156A2199P125b70990A41652c13902a26441B5007J93347
$$ plain form
8916 383463 102923 -154299 237590 -158802 65913 -172884 -211729 322462 189114 152836
8906 152836 56424 43051 -183295 -419425 -223599 232 50469 -252760 271879 19727 252556
8895 252556 -112721 -197505 112843 -36641 -620 284878 -498153 42587 -54471 166587 -224491
8883 -113735 304882 15441 -270575 -134107 118593 103559 -182432 -14815 -16828 -117833 -15747
8871 -264398 -77538 16049 -18660 139868 115272 -114943 46872 -10351 -117330 115434 -177506
8859 109073 -103209 120156 12199 19324 -270990 141652 -313902 -126441 25007 218354
$$ [...]
##END NTUPLES=NMR SPECTRUM
##END=
