
##TITLE=AC1318_SSUAH12147_6535344_7FNUsokbu0
##JCAMPDX= 6.0         $$ Bruker NMR JCAMP-DX V2.0
##DATA TYPE= NMR SPECTRUM
##DATA CLASS= NTUPLES
##ORIGIN= BRUKER
##OWNER= Administrator
$$ 1.72 TOPSPIN		Version 2.1
$$ 2012-07-17 18:01:03.234 -0500  Administrator@TOPSPIN
$$ Compression mode = diff/dup
##.OBSERVE FREQUENCY= 400.02188249412
##.OBSERVE NUCLEUS= ^1H
##.ACQUISITION MODE= SIMULTANEOUS (DQD)
##.ACQUISITION SCHEME= undefined
##.AVERAGES= 64
##.DIGITISER RES= 22
##SPECTROMETER/DATA SYSTEM= spect
##.PULSE SEQUENCE= noesygpps1d.comp
##.SOLVENT NAME= COFFEE_meoh
##.SHIFT REFERENCE= INTERNAL, COFFEE_meoh, 1, 14.9608
##AUDIT TRAIL= $$ (NUMBER, WHEN, WHO, WHERE, PROCESS, VERSION, WHAT)
$$ ##TITLE= Audit trail, TOPSPIN		Version 2.1
$$ ##JCAMPDX= 5.01
$$ ##ORIGIN= Bruker BioSpin GmbH
$$ ##OWNER= Administrator
$$ $$ C:\Bruker\TOPSPIN/data/COFFEE/nmr/AC1318_SSUAH12147_6535344_7FNUsokbu0/12/pdata/1/auditp.txt
$$ ##AUDIT TRAIL=  $$ (NUMBER, WHEN, WHO, WHERE, PROCESS, VERSION, WHAT)
(   1,<2012-07-17 18:00:58.093 -0500>,<Administrator>,<TOPSPIN>,<go>,<TOPSPIN 2.1>,
      <created by zg
	started at 2012-07-17 17:49:27.843 -0500,
	POWCHK enabled, PULCHK disabled,
       configuration hash MD5:
       6B 1B 68 BB D9 2E 58 E2 7F 35 AD 54 07 DF 0E 41
       data hash MD5: 64K
       43 4A CB 31 A1 2F 9F 03 A7 6B C0 56 F8 7D E7 AB>)
(   2,<2012-07-17 18:01:01.093 -0500>,<Administrator>,<TOPSPIN>,<proc1d>,<TOPSPIN 2.1>,
      <Start of raw data processing
       efp LB = 0.3 FT_mod = 6 PKNL = 1 PHC0 = 0 PHC1 = 0 SI = 128K 
       data hash MD5: 128K
       47 82 DC 9B 5D DF E6 60 22 C0 4F 2F C4 22 4E 8B>)
(   3,<2012-07-17 18:01:02.140 -0500>,<Administrator>,<TOPSPIN>,<proc1d>,<TOPSPIN 2.1>,
      <pk PHC0 = -3.164063 PHC1 = 0 
       data hash MD5: 128K
       0A 75 C0 D4 0B AB C6 00 48 7A 6F 61 2B 6C C1 4C>)
(   4,<2012-07-17 18:01:02.875 -0500>,<Administrator>,<TOPSPIN>,<proc1d>,<TOPSPIN 2.1>,
      <abs ABSG = 1 
       data hash MD5: 128K
       6C 06 0E 17 B6 EC 46 DA 73 0E 24 2B C1 92 AE 7A>)
(   5,<2012-07-17 18:01:02.953 -0500>,<Administrator>,<TOPSPIN>,<proc1d>,<TOPSPIN 2.1>,
      <abs ABSG = 2 
       data hash MD5: 128K
       CB C7 B8 3F 6F 94 39 89 A3 E7 62 34 48 EA 4C F3>)
(   6,<2012-07-17 18:01:03.000 -0500>,<Administrator>,<TOPSPIN>,<proc1d>,<TOPSPIN 2.1>,
      <abs ABSG = 3 
       data hash MD5: 128K
       72 24 8A E3 55 DF 6C C6 4A E9 65 73 99 07 6C 24>)
(   7,<2012-07-17 18:01:03.062 -0500>,<Administrator>,<TOPSPIN>,<proc1d>,<TOPSPIN 2.1>,
      <abs ABSG = 4 
       data hash MD5: 128K
       BA 7E 41 92 19 9C 39 90 D0 CB FE 9D F6 1F 45 57>)
(   8,<2012-07-17 18:01:03.125 -0500>,<Administrator>,<TOPSPIN>,<proc1d>,<TOPSPIN 2.1>,
      <abs ABSG = 5 
       data hash MD5: 128K
       D7 1D 6E 5B C6 71 B1 09 FC A2 6D 65 16 6B 44 7E>)
$$ ##END=
$$ 
$$ $$ hash MD5
$$ $$ 1F 7F 8B AF 6D 63 5C 1C 1E 73 EC 08 15 80 4E 09
##$RELAX= 
##$RELAX= 
##$RELAX= 
##$RELAX= 
##$RELAX= 
##$RELAX= 
##$RELAX= 
##$RELAX= 
$$ Bruker specific parameters
$$ [...]
150 150 150 150 150 150 150 150
##$TP07= 0
##$TPNAME0= <>
##$TPNAME1= <>
##$TPNAME2= <>
##$TPNAME3= <>
##$TPNAME4= <>
##$TPNAME5= <>
##$TPNAME6= <>
##$TPNAME7= <>
##$TPOAL= (0..7)
0.5 0.5 0.5 0.5 0.5 0.5 0.5 0.5
##$TPOFFS= (0..7)
0 0 0 0 0 0 0 0
##$TUNHIN= 0
##$TUNHOUT= 0
##$TUNXOUT= 0
##$USERA1= <user>
##$USERA2= <user>
##$USERA3= <user>
##$USERA4= <user>
##$USERA5= <user>
##$V9= 5
##$VALIST= <valist>
##$VCLIST= <CCCCCCCCCCCCCCC>
##$VD= 0
##$VDLIST= <DDDDDDDDDDDDDDD>
##$VPLIST= <PPPPPPPPPPPPPPP>
##$VTLIST= <TTTTTTTTTTTTTTT>
##$WBST= 2048
##$WBSW= 25
##$XGAIN= (0..3)
0 0 0 0
##$XL= 0
##$YL= 0
##$YMAX_a= 11519024
##$YMIN_a= -9293472
##$ZGOPTNS= <>
##$ZL1= 120
##$ZL2= 120
##$ZL3= 120
##$ZL4= 120
##$ABSF1= 14.9608
##$ABSF2= -5.597382
##$ABSG= 5
##$ABSL= 3
##$ALPHA= 0
##$AQORDER= 0
##$ASSFAC= 0
##$ASSFACI= 0
##$ASSFACX= 0
##$ASSWID= 0
##$AUNMP= <proc_prof1d_extract.lims>
##$AXLEFT= 0
##$AXNAME= <>
##$AXNUC= <1H>
##$AXRIGHT= 0
##$AXTYPE= 0
##$AXUNIT= <>
##$AZFE= 0.1
##$AZFW= 0.1
##$BCFW= 0
##$BC_mod= 0
##$BYTORDP= 0
##$COROFFS= 0
##$CY= 15
##$DATMOD= 1
##$DC= 0
##$DFILT= <>
##$DTYPP= 0
##$F1P= 0
##$F2P= 0
##$FCOR= 0.5
##$FTSIZE= 131072
##$FT_mod= 6
##$GAMMA= 0
##$GB= 0
##$INTBC= 1
##$INTSCL= 1
##$ISEN= 128
##$LB= 0.3
##$LEV0= 0
##$LPBIN= 0
##$MAXI= 10000
##$MC2= 0
##$MEAN= 0
##$ME_mod= 0
##$MI= 0
##$NCOEF= 0
##$NC_proc= -2
##$NLEV= 6
##$NOISF1= 0
##$NOISF2= 0
##$NSP= 0
##$NTH_PI= 0
##$NZP= 0
##$OFFSET= 14.9608
##$PC= 1
##$PHC0= -3.164063
##$PHC1= 0
##$PH_mod= 1
##$PKNL= yes
##$PPARMOD= 0
##$PPDIAG= 0
##$PPIPTYP= 0
##$PPMPNUM= 2147483647
##$PPRESOL= 1
##$PSCAL= 4
##$PSIGN= 0
##$PYNMP= <proc.py>
##$REVERSE= no
##$SF= 400.020009717612
##$SI= 131072
##$SIGF1= 0
##$SIGF2= 0
##$SINO= 400
##$SIOLD= 131072
##$SPECTYP= <>
##$SREGLST= <1H.CDCl3>
##$SSB= 0
##$STSI= 131072
##$STSR= 0
##$SW_p= 8223.68421052631
##$SYMM= 0
##$S_DEV= 0
##$TDeff= 65536
##$TDoff= 0
##$TI= <>
##$TILT= no
##$TM1= 0
##$TM2= 0
##$TOPLEV= 0
##$USERP1= <user>
##$USERP2= <user>
##$USERP3= <user>
##$USERP4= <user>
##$USERP5= <user>
##$WDW= 1
##$XDIM= 131072
##$YMAX_p= 420115997
##$YMIN_p= -11205
##$CURPLOT= <Network HP LaserJet P1505>
##$CURPRIN= <$Network HP LaserJet P1505>
##$DFORMAT= <normdp>
##$LAYOUT= <+/1D_H.xwp>
##$LFORMAT= <normlp>
##$PFORMAT= <normpl>
##$SURQMSG= 1
$$ End of Bruker specific parameters
$$ ---------------------------------
##NTUPLES= NMR SPECTRUM
##VAR_NAME=  FREQUENCY,     SPECTRUM/REAL,   SPECTRUM/IMAG
##SYMBOL=    X,             R,               I
##VAR_TYPE=  INDEPENDENT,   DEPENDENT,       DEPENDENT
##VAR_FORM=  AFFN,          ASDF,            ASDF
##VAR_DIM=   131072,        131072,          131072
##UNITS=     HZ,            ARBITRARY UNITS, ARBITRARY UNITS
##FACTOR=    0.0627417313425164, 1,          1
##FIRST=     8223.62146879497, -1832,        -58970
##LAST=      0,             -797,            -60017
##MIN=       0,             -11205,          0
##MAX=       8223.62146879497, 420115997,    0
$$ Real data points
##PAGE= N=1
##DATA TABLE= (X++(R..R)), XYDATA
$$ [...]
61606C84491l841n039n621n122m302l932l713l167k740k978l334l032k533k794
$$ 384491 380650 375611 369990 364868 360566 356634 352921 349754 347014 344036 340702 337670 335137 332343
61592C32343l471l288k139j342j685k454k695k328j707j008l83o9p8k86p56j457
$$ 332343 328872 325584 323445 322103 320418 317964 315269 312941 311234 310226 309843 309774 309696 309410 308654 307197
61576C07197j849j540j068j130j368r41j02O8n75j009p17l76n06o74m49j62j08
$$ 307197 305348 303808 302740 301610 300242 299301 299199 299267 298692 297683 296966 296590 296084 295410 294961 294799 294691
61559B94691J07Q79J899K611K850K705K255J756J519J478J303J033R73R64M93
$$ 294691 294798 295677 297576 300187 303037 305742 307997 309753 311272 312750 314053 315086 316059 317023 317516
61544C17516l62q57o04RN17Q58J018R60J013J558K287K515K296K311K617K460
$$ 317516 317154 316297 315693 315702 316219 317077 318095 319055 320068 321626 323913 326428 328724 331035 333652 336112
61528C36112J605P66M38K35j91n56p38j203k042k422j749o77k48n74j008j137
$$ 336112 337717 338483 338921 339156 338965 338409 337671 336468 334426 332004 330255 329578 329330 328756 327748 326611
61512C26611j025p92n78n50n96l33K70O86N57J35k71p13j142j120m81K47N29N13
$$ 326611 325586 324794 324216 323666 323070 322737 323007 323693 324250 324385 324114 323401 322259 321139 320658 320905 321434 321947
61494C21947O05P67P80P59R25J161J234J176J053O70k5n39l55L91J135J640K109
$$ 321947 322552 323319 324099 324858 325783 326944 328178 329354 330407 331077 331052 330513 330158 330549 331684 333324 335433
61477C35433K664L116L225K967K511K072J734J308N37n03j352j538r81rP63P67
$$ 335433 338097 341213 344438 347405 349916 351988 353722 355030 355567 355064 353712 352174 351193 351184 351947 352714
61461C52714n0j061j533j309p07PO44Q16K25p17j168p83m5L93L33Lj18M16J523
$$ 352714 352664 351603 350070 348761 348054 348061 348705 349521 349746 349029 347861 347078 347033 347426 347759 347762 347644 348060 349583
61442C49583K384K231J230K30k02k6P33J948L056L449L186K727K144J263M01M5
$$ 349583 351967 354198 355428 355658 355456 355430 356163 358111 361167 364616 367802 370529 372673 373936 374337 374382
61426C74382M2j18k55K00R53J037L55j03J78O91J097J719K388K144Q57p8L28J086
$$ 374382 374424 374306 374051 374251 375204 376241 376596 376493 376671 377362 378459 380178 382566 384710 385567 385489 385817 386903
61408C86903O59p91j816j829j597j793k177k290k095j770j362r08n21k89k53m30
$$ 386903 387562 386771 384955 383126 381529 379736 377559 375269 373174 371404 370042 369134 368613 368324 368071 367641
61392C67641p22r19r08p29l81J24N40O65P61J308K210K800K706K159J410N11k00
$$ 367641 366919 366000 365092 364363 363982 364106 364646 365311 366072 367380 369590 372390 375096 377255 378665 379176 378976
61375C78976j11Q25J869K433K625K642K292J552R52R91J562K229K646K515J776
$$ 378976 378865 379690 381559 383992 386617 389259 391551 393103 394055 395046 396608 398837 401483 403998 405774
61360D05774R66P87J149J451J831L078M993O134N850N413O166P579Q245P986P709
$$ 405774 406740 407527 408676 410127 411958 415036 420029 426163 432013 437426 443592 451171 459416 467402 475111
61345D75111P660P152N818M086K469J275Q57J330K044K170J792J703K158K466
$$ 475111 482771 489923 495741 499827 502296 503571 504428 505758 507802 509972 511764 513467 515625 518091
61331E18091J959O88q87k419l711m597m951m714l997l252k950k879k265r21J84
$$ 518091 520050 520738 519851 517432 513721 509124 504173 499459 495462 492210 489260 486381 484116 483195 483379
61316D83379Q4q12j165k98J288K816M041N160O465Q111R966J1747J3367J4862
$$ 483379 483463 482651 481486 481188 482476 485292 489333 494493 500958 509069 519035 530782 544149 559011
61302E59011J5818J5439J3592J1204R073O790L674L32j824k507l030m544o587
$$ 559011 574829 590268 603860 615064 624137 630927 634601 634933 633109 630602 627572 623028 616441
61289F16441p769p420o149n114n045n802o623o817o300n470m703m102l591l013
$$ 616441 608672 601252 595103 589989 584944 579142 572519 565702 559402 553932 549229 545127 541536 538523
61275E38523k155r08N54J866K737L102L064K760K201J369N28L02J124K749M575
$$ 538523 536368 535460 536014 537880 540617 543719 546783 549543 551744 553113 553641 553943 555067 557816 562391
61260E62391O365Q078R304R456Q600P401O195M908L861L658L987L578J977L75
$$ 562391 568756 576834 586138 595594 604194 611595 617790 622698 626559 630217 634204 637782 639759 640134
61246F40134r7M4l09j062j388j400k007l314m419m834m947m993m607l777l180
$$ 640134 640037 640081 639772 638710 637322 635922 633915 630601 626182 621348 616401 611408 606801 603024 599844
61231E99844l170l137k401j149QQ79J597K118K381K638L126L568L531L242L531
$$ 599844 596674 593537 591136 589987 589995 590874 592471 594589 596970 599608 602734 606302 609833 613075 616606
61216F16606M795O352P107O713N862N453N638N769N180L877K479J541J060O80
$$ 616606 621401 627753 634860 641573 647435 652888 658526 664295 669475 673352 675831 677372 678432 679112
61202F79112L66O14J844L710N417O699Q003R606J1180J2588J4383J6731J8366
$$ 679112 679478 680092 681936 685646 691063 697762 705765 715371 726551 739139 753522 770253 788619
61189G88619J7687J4844J1707R654Q329O816N087L686K768K127J686J297M67j116
$$ 788619 806306 821150 832857 842511 850840 857656 862743 866429 869197 871324 873010 874307 874774 873658
61175H73658k998m446n325o003o620o990p173p549q237q822q900q693q920r971
$$ 873658 870660 866214 860889 854886 848266 841276 834103 826554 818317 809495 800595 791902 782982 773011
61161G73011j1442j2588j3182j3595j3994j3884j2824j1205r799q755p550n799
$$ 773011 761569 748981 735799 722204 708210 694326 681502 670297 660498 651743 644193 638394
61149F38394l557r69J611L309L248J540q80l428o136q680j0109r943q791p505
$$ 638394 634837 633868 635479 638788 642036 643576 642696 639268 633132 624452 614343 604400 595609 588104
61135E88104o303n125m129l301k193o02R10J789K343L288M768O390P997R800J1797
$$ 588104 581801 576676 572547 569246 567053 566451 567361 569150 571493 574781 579549 585939 593936 603736 615533
61120F15533J3625J5083J6430J7995J9661K0979K1800K2588K3848K5295K6109
$$ 615533 629158 644241 660671 678666 698327 719306 741106 763694 787542 812837 838946
61109H38946K6074K5935K6228K6386K5621K4204K2998K2103K0789J8580J5495
$$ 838946 865020 890955 917183 943569 969190 993394 1016392 1038495 1059284 1077864 1093359
61098A093359J1425O331J022l288o414r265j2316j4984j6781j8099j9406k0467
$$ 1093359 1104784 1111115 1112137 1108849 1102435 1093170 1080854 1065870 1049089 1030990 1011584 991117
61086I91117k0854k0683k0379k0131j9879j9495j8790j7636j6208j4729j3152
$$ 991117 970263 949580 929201 909070 889191 869696 850906 833270 817062 802333 789181
61075G89181j1403r690q175o648n066l850l067j894J66K196L085L191L600M405
$$ 789181 777778 768088 759913 753265 748199 744349 741282 739388 739554 741750 744835 748026 751626 756031
61061G56031N113O125Q122J0336J1326J1358J2130J4115J5975J6856J7421J8371
$$ 756031 761144 767269 775391 785727 797053 808411 820541 834656 850631 867487 884908 903279
61049I03279J9584K1082K3257K5705K7433K8437K9701L1492L3253L5106L7638
$$ 903279 922863 943945 967202 992907 1020340 1048777 1078478 1109970 1143223 1178329 1215967
61038A215967M0208M1482M1767M2723M4560M5782M5970M6485M8034M9834N1617
$$ 1215967 1256175 1297657 1339424 1382147 1426707 1472489 1518459 1564944 1612978 1662812 1714429
61027A714429N4009N6482N7350N6397N4995N3349N0442M7108M5966M7721N0700
$$ 1714429 1768438 1824920 1882270 1938667 1993662 2047011 2097453 2144561 2190527 2238248 2288948
61016B288948N4689O1436P0414P8128Q3086Q7681R4069J02630J15710J37682J69422
$$ 2288948 2343637 2405073 2475487 2553615 2636701 2724382 2818451 2921081 3036791 3174473 3343895
61005C343895K08308K55717L17812L96644M89329O00457P45080R34078J171494
$$ 3343895 3552203 3807920 4125732 4522376 5011705 5612162 6357242 7291320 8462814
60996H462814J475449J871313K317631K639474K597578K085091J259555M47816
$$ 8462814 9938263 11809576 14127207 16766681 19364259 21449350 22708905 23156721
60988B3156721r1144k99973k46864Q015M12085Q15769R63518O61738m2298q78383
$$ 23156721 23065577 22765604 22518740 22526755 22938840 23754609 24718127 25379865 25337567 24459184
60978B4459184j556198j944827k080321k057584j948048j792424j617821j439549
$$ 24459184 22902986 20958159 18877838 16820254 14872206 13079782 11461961 10022412
60970A0022412j261181j086013r23672p81888o59739n53793m64680l93299l36147
$$ 10022412 8761231 7675218 6751546 5969658 5309919 4756126 4291446 3898147 3562000
60961C562000k88957k50847k21348j97235j75742j57417j42802j29456j15192
$$ 3562000 3273043 3022196 2800848 2603613 2427871 2270454 2127652 1998196 1883004
60952A883004j01103q8685p6945o5155n5588n0537m8817m7770m6550m5265m3179
$$ 1883004 1781901 1693216 1616271 1551116 1495528 1444991 1396174 1348404 1301854 1256589 1213410
60941A213410m0140l7646l6381l4718l1694k9093k8499k8567k7489k5948k5272
$$ 1213410 1173270 1135624 1099243 1064525 1032831 1003738 975239 946672 919183 893235 867963
60930H67963k4739k3109k1032j9548j7973j5509j3274j2465j2093j0791r327r046
$$ 867963 843224 820115 799083 779535 761562 746053 732779 720314 708221 697430 688103 679057
60918F79057r270q542p161o298n708m518l210k771k796k305j507j134r55m25J70
$$ 679057 669787 661245 654084 647786 642078 637560 634350 631579 628783 626478 624971 623837 622882 622457 622627
60903F22627N93J421K587K686J171l03l44Op08j844k130k108k974m268m836m912
$$ 622627 623220 624641 627228 629914 631085 630782 630438 630444 629736 627892 625762 623654 620680 616412 611576 606664
60887F06664n313n662n431n556o962q603r006q755r342j0427j0431r154p826p100
$$ 606664 601351 595689 590258 584702 577740 569137 560131 551376 542034 531607 521176 512022 504196 497096
60873D97096o742o683o761o111m395k776k262k075j159j03J43K63J412L164M462
$$ 497096 490354 483671 476910 470799 466404 463628 461366 459291 458132 458029 458172 458435 459847 463011 467473
60858D67473N435O367O176M092J703J045J629J688J376K168L892M921M876M601
$$ 467473 472908 479275 485451 489543 491246 492291 493920 495608 496984 499152 503044 507965 512841 517442
60844E17442L988K273K51l52L56N63l83j456k238l382m752n190m517l798l500
$$ 517442 521430 523703 523954 523602 523958 524521 524138 522682 520444 517062 512310 507120 502603 498805 495305
60829D95305l128k812l321m318m437l392k367k137k400k996m084m945m433k898
$$ 495305 492177 489365 486044 481726 477289 473897 471530 469393 466993 463997 459913 454968 450535 447637
60815D47637k061k638l574l970m194m705n095m943m531m287m259m311m169l449
$$ 447637 445576 442938 439364 435394 431200 426495 421400 416457 411926 407639 403380 399069 394900 391451
60801C91451k321j756k227k763k330j439j211j577j824k068k571k433q34J045
$$ 391451 389130 387374 385147 382384 380054 378615 377404 375827 374003 371935 369364 366931 366097 367142
60787C67142J407O59P06J787K264J557R44J168J377R46N22O06P72P85J069J650
$$ 367142 368549 369208 369914 371701 373965 375522 376466 377634 379011 379957 380479 381085 381857 382642 383711 385361
60771C85361J975K032K367K835K767K382K518K915K471J247M89M63J18p80j084
$$ 385361 387336 389368 391735 394570 397337 399719 402237 405152 407623 408870 409359 409822 409940 409160 408076
60756D08076m14k8p60j755k067k030k174k084j367n67k89k79r2J51K64L76L64
$$ 408076 407662 407634 406874 405119 403052 401022 398848 396764 395397 394830 394541 394262 394170 394321 394585 394961 395325
60739C95325k22j278k085k434k899l714m353m532m579m547m054l312l225l949
$$ 395325 395103 393825 391740 389306 386407 382693 378340 373808 369229 364682 360628 357316 354091 350142
60725C50142m391l681k282j161o14l50m0N71J512K287K332J838J487J446J317
$$ 350142 345751 342070 339788 338627 338013 337663 337623 338194 339706 341993 344325 346163 347650 349096 350413
60710C50413R67O44M07K63O50J837L089L450L093K814K560J751Q38R83K143K920
$$ 350413 351380 352024 352431 352694 353344 355181 358270 361720 364813 367627 370187 371938 372776 373759 375902 378822
60694C78822K564J782J343J125Q70P66R18J117J307J452J113Q6p65n03K86K72
$$ 378822 381386 383168 384511 385636 386506 387272 388190 389307 390614 392066 393179 393265 392500 391997 392283 392555
60678C92555n03p70j59L64K92K24M91O39N38N74N34k87j627k331k156k075k532
$$ 392555 392052 391282 391123 391487 391779 392003 392494 393133 393671 394245 394779 394492 392865 390534 388378 386303 383771
60661C83771k818k561k328k374k185j669j441j534j201l58J69K72R02K302L387
$$ 383771 380953 378392 376064 373690 371505 369836 368395 366861 365660 365302 365471 365743 366645 368947 372334
60646C72334L502L344L500L443K682J635O26p46k533l856m141l878l548k858j725
$$ 372334 375836 379180 382680 386123 388805 390440 391066 390320 387787 383931 379790 375912 372364 369506 367781
60631C67781r13r75j387j416j046n89j49J82K92M64R89J356Q78L7j3O95R28K77
$$ 367781 366868 365893 364506 363090 362044 361455 361306 361488 361780 362244 363233 364589 365467 365504 365491 366186 367114 367391
60613C67391k43P7P19J051J080P70m4p55m12P50J494J522J629J858J269p2p29
$$ 367391 367148 367225 367944 368995 370075 370845 370801 370046 369634 370384 371878 373400 375029 376887 378156 378084 377355
60596C77355j62M26J77j90N1N28R58J770K734K690J544Q33J339J813J147J60%
$$ 377355 377193 377619 377796 377606 377657 378185 379143 380913 383647 386337 387881 388714 390053 391866 393013 393173 393173
60579C93173L52N64J008J976K542K049J551K327L961N240O039P004Q225R437J0827
$$ 393173 393525 394089 395097 397073 399615 401664 403215 405542 409503 414743 420782 427786 436011 445448 456275
60564D56275J2513J3881J4351J4083J3234J1399Q558N516K704m39m025o854p970
$$ 456275 468788 482669 497020 511103 524337 535736 544294 549810 552514 552075 548050 541196 533226
60551E33226p988p909p644o658n116l424j591J28J051J342K303M540P007Q796
$$ 533226 525238 517329 509685 503027 497911 494487 492896 493024 494075 495417 497720 502260 509267 518063
60537E18063J0597J3288J6324J8732K0556K2118K2858K2132K0200J7403J3362
$$ 518063 528660 541948 558272 577004 597560 619678 642536 664668 684868 702271 715633
60526G15633Q088K813j387m780p782r777j0298j0284j0754j1312j1100j0264r219
$$ 715633 723721 726534 725147 720367 712585 702808 692510 682226 671472 660160 649060 638796 629577
60513F29577p612n331l528l132l281k613j259j15R22K483M314N896P862J1233
$$ 629577 621965 616634 613106 609974 606693 604080 602821 602706 603628 606111 610425 616321 624183 635416
60499F35416J5739K0241K4447K8974L4070L9387M4566M9072N1901N2453N1126
$$ 635416 651155 671396 695843 724817 758887 798274 842840 891912 943813 996266 1047392
60488A047392M8453M4379L9040L3225K7209K0199J1827K968n834j5363k5858l5621
$$ 1047392 1095845 1140224 1179264 1212489 1239698 1259897 1271724 1274692 1268858 1253495 1227637 1192016
60476A192016m2951m8196n2340n4822n4605n2314m9395m6012m1668l7065l3421
$$ 1192016 1149065 1100869 1048529 993707 939102 886788 837393 791381 749713 712648 679227
60465F79227l0490k7150k3448k0364j7940j5422j2844j0899r563q425p886q431
$$ 679227 648737 621587 598139 577775 559835 544413 531569 520670 511107 502682 494796 486365
60453D86365r181q771p382o282n798n267m585m204l896l151k456k595l024k551
$$ 486365 477184 468413 461031 454749 448951 443684 439099 434895 430999 427848 425392 422797 419773 417222
60439D17222j318m65j81K45P02M05l27l61K24J20r26j602j150m74n73j214j662
$$ 417222 415904 415439 415258 415503 416205 416610 416283 415922 416146 416266 415340 413738 412588 412114 411541 410327 408665
60422D08665j648j203l92M34Q37Q36P01L85j34k89L43J153J326J171J546K292
$$ 408665 407017 405814 405422 405856 406693 407529 408230 408615 408481 408192 408535 409688 411014 412185 413731 416023
60406D16023K459J842J197J023J164J385J481J050J14m26J44J340K338L145L914
$$ 416023 418482 420324 421521 422544 423708 425093 426574 427624 427738 427312 427456 428796 431134 434279 438193
60391D38193M013L086K204K449L086K752J792J613K280K620K434K612L151K976
$$ 438193 442206 445292 447496 449945 453031 455783 457575 459188 461468 464088 466522 469134 472285 475261
60377D75261J952J319J789K651L134L358L586L674L489L057K290J337R16J360
$$ 475261 477213 478532 480321 482972 486106 489464 493050 496724 500213 503270 505560 506897 507813 509173
60363E09173J847J552J004J050J267Q63N26J518L377M387M125L814M251N164O448
$$ 509173 511020 512572 513576 514626 515893 516756 517282 518800 522177 526564 530689 534503 538754 543918 550366
60348E50366Q250R770R820Q669P696P080N552K637n65l092n001o253o359n563
$$ 550366 558616 568386 578206 586875 594571 601651 607203 609840 609275 606183 601182 594929 588570 583007
60334E83007m929m851m729m320m097m106l848l482l712m351m398l781l512l973
$$ 583007 578078 573227 568498 564178 560081 555975 552127 548645 544933 540582 536184 532403 528891 524918
60320E24918m361m143l677l177k387j459q09n4J598L849N606O834Q550J0911J2844
$$ 524918 520557 516414 512737 509560 507173 505714 504905 504851 506449 510298 515904 522738 531288 542199 555043
60305E55043J3830J4497J5358J6296J7332J8312J7938J4911J0124N785K283k071
$$ 555043 568873 583370 598728 615024 632356 650668 668606 683517 693641 699426 701709 699638
60293F99638p803j3043j6160j7587j8103j7328j5063j2462j0625r277p884o797
$$ 699638 691835 678792 662632 645045 626942 609614 594551 582089 571464 562187 554303 547506
60281E47506o308n725m404k807j753j435j725k509l256l254k718k586k957k970
$$ 547506 541198 535473 531069 528262 526509 525074 523349 520840 517584 514330 511612 509026 506069 503099
60267E03099k456k344k979l456l134k513k123j869j872k518l241k838j470p65
$$ 503099 500643 498299 495320 491864 488730 486217 484094 482225 480353 477835 474594 471756 470286 469521
60253D69521j275j552o17L81J33o72n15P47K046K709K780K398J724J059M80j34
$$ 469521 468246 466694 466077 466458 466591 465919 465404 466151 468197 470906 473686 476084 477808 478867 479347 479213
60237D79213n81o16p12j436k099j437K24J134P22L61J005J869K178K465L172L523
$$ 479213 478632 478016 477304 475868 473769 472332 472556 473690 474412 474773 475778 477647 479825 482290 485462 488985
60221D88985L039K701L413M474M732M248L810L728M049M980O269P089P269P681
$$ 488985 492024 494725 498138 502612 507344 511592 515402 519130 523179 528159 534428 541517 548786 556467
60207E56467Q712R461R160Q301P644P211O943P168P676P550O624N912N847N501
$$ 556467 565179 574640 583800 592101 599745 606956 613899 621067 628743 636293 642917 648829 654676 660177
60193F60177M328L297L236L375K648J298Q6r76k078k821l051l519m761o169p076
$$ 660177 664505 667802 671038 674413 677061 678359 678445 677469 675391 672570 669519 666000 661239 655070 647994
60178F47994p651p955p312n658m357m496n364n597m982m112l265k582k458k792
$$ 647994 640343 632388 625076 619418 615061 610565 605201 599604 594622 590510 587245 584663 582205 579413
60164E79413k734j950j180q62l94M76Q49K49l74k52k4k74k57N70J193P31J93Q49
$$ 579413 576679 574729 573549 572687 572293 572769 573618 573867 573493 573241 573217 572943 572686 573256 574449 575180 575373 576222
60146E76222J892J644K67n11j1Q18J168J320J867L061M791O450P196P036P010
$$ 576222 578114 579758 580025 579514 579503 580321 581489 582809 584676 587737 592528 598978 606174 613210 620220
60131F20220P655Q124P614O673O086N442M070K536J864J924J876J666J819K209
$$ 620220 627875 635999 643613 650286 656372 661814 665884 668420 670284 672208 674084 675750 677569 679778
60117F79778K256K052K138K499K657K594K674K941L142L160K957K408J561N34
$$ 679778 682034 684086 686224 688723 691380 693974 696648 699589 702731 705891 708848 711256 712817 713351
60103G13351r47l109n114n717n188n187o209o793n966m852m688m843m159k946
$$ 713351 712404 709295 704181 698464 693276 688089 681880 675087 669121 664269 659581 654738 650579 647633
60089F47633k149j638p67K52Q60J232J663J768J327R76J017O60m25j126o95k92
$$ 647633 645484 643846 643079 643331 644191 645423 647086 648854 650181 651157 652174 652834 652409 651283 650588 650296
60073F50296j292l229m894o258p716q610q275p574p605p817p116n984n649n888
$$ 650296 649004 645775 640881 634623 626907 618297 610022 602448 594843 587026 579910 573926 568277 562389
60059E62389n517m503l790l573l336l137l292l317k667j940j799j500r4J632K309
$$ 562389 556872 552369 548579 545006 541670 538533 535241 531924 529257 527317 525518 524018 523924 525556 527865
60044E27865K380L370N264O585O850O953P245P087O367N839N760N600N091M321
$$ 527865 530245 533615 538879 545464 552314 559267 566512 573599 579966 585805 591565 597165 602256 606577
60030F06577K992R20r71j509j008q87j834l481n460p440q669q849q958r825j0557
$$ 606577 609569 610489 609518 608009 607001 606114 604280 600799 595339 587899 579230 570381 561423 551598 541041
60015E41041r926q696q589r454r477q041o351n246m291l262k682k567k168j355
$$ 541041 531115 522419 513830 504376 494899 486858 480507 475261 470970 467708 465026 462459 460291 458936
60001D58936q34p47m06L11O20K09k42j91J52N66J127J681J922K072K641L498M036
$$ 458936 458102 457355 456949 457260 457880 458089 457847 457656 457808 458374 459501 461182 463104 465176 467817 471315 475351
59984D75351M116M065L959L689L404L153K512J375L80k02j152k787l902l502k601
$$ 475351 479467 483532 487491 491180 494584 497737 500249 501624 502004 501802 500650 497863 493961 490459 487858
59969D87858k692l362l207k292j703j339k24J341J966J481J129J553K229K795
$$ 487858 485166 481804 478597 476305 474602 473263 473039 474380 476346 477827 478956 480509 482738 485533
59955D85533L324L422K622J490Q45L02p86j543o92R92J490N39k24l2K67K25L18
$$ 485533 488857 492279 494901 496391 497236 497538 496752 495209 494517 495509 496999 497538 497314 497282 497549 497774 498092
59938D98092L37o18k236l061k748k340k155j432l10j8o29o72N11J952L100M646
$$ 498092 498429 497811 495575 492514 489766 487426 485271 483839 483529 483511 482882 482210 482721 484673 487773 492419
59922D92419O652P818P409O234M934L058N89j306j958k104k342k086r29L87J155
$$ 492419 499071 506889 514298 520532 525466 528524 529113 527807 525849 523745 521403 519317 518388 518775 519930
59907E19930J675K324K807K926K971K910K322J556J581K311K447J488N44O31J459
$$ 519930 521605 523929 526736 529662 532633 535543 537865 539421 541002 543313 545760 547248 547792 548423 549882
59892E49882K331L046L474L482L634M716O281P011O697O444O710O784O453O494
$$ 549882 552213 555259 558733 562215 565849 570565 576846 583857 590554 596998 603708 610492 616945 623439
59878F23439P055P225O765O576O889O637N313L803K665J173j106l253m454n136
$$ 623439 630494 637719 644484 651060 657949 664586 669899 673702 676367 677540 676434 673181 668727 663591
59864F63591n807o134n871n512n285m691l691l075l052k805k009j465j604j723
$$ 663591 657784 651650 645779 640267 634982 630291 626600 623525 620473 617668 615659 614194 612590 610867
59850F10867j241m28P06K775N664Q215R824J0845J0962Q928M834Q83j118j564
$$ 610867 609626 609198 609904 612679 618343 626558 636382 647227 658189 667117 671951 672834 671716 670152
59836F70152j444n04J701M200N375M589K269p03l088l952l826m141n060n286m413
$$ 670152 668708 668204 669905 674105 679480 684069 686338 685635 682547 678595 674769 670628 665568 660282 655869
59821F55869l803m373n285n744o368p621q474p952o727n926n547n215n270n900
$$ 655869 652066 647693 642408 636664 630296 622675 614201 606249 599522 593596 588049 582834 577564 571664
59807E71664o237n501m170l031k086j242r69j335j458q68l56o16j173j420j544
$$ 571664 565427 559926 555756 552725 550639 549397 548428 547093 545635 544767 544411 543795 542622 541202 539658
59792E39658j629j141j70J47n96j247r55m38m17l03L50N85k82j176r02j43k19
$$ 539658 538029 536888 536718 536865 536269 535022 534067 533629 533212 532909 533259 533844 533562 532386 531484 531341 531122
59775E31122r06j030m12K82Q58J527K106K396K747L270L344K745K246K290K150
$$ 531122 530216 529186 528774 529056 529914 531441 533547 535943 538690 541960 545304 548049 550295 552585 554735
59760E54735J436J075J667K212J839J549K658M592N857O295O744P294P436P351
$$ 554735 556171 557246 558913 561125 562964 564513 567171 571763 577620 583915 590659 597953 605389 612740
59746F12740P573P912P972Q114Q648Q767P643N895M722M202L691L180K924K474
$$ 612740 620313 628225 636197 644311 652959 661726 669369 675264 679986 684188 687879 691059 693983 696457
59732F96457J402L72J06Np76j620j384m99l90j151j502j001o66j227k113k533
$$ 696457 697859 698231 698337 698342 697566 695946 694562 694063 693673 692522 691020 690019 689353 688126 686013 683480
59716F83480k515k496k663k968l256l235k789k180j700j298q63n13l22k03k23
$$ 683480 680965 678469 675806 672838 669582 666347 663558 661378 659678 658380 657517 657004 656682 656479 656256
59701F56256m94o21K4J267K195K457K560K790K909L036L527L716K423N6j503j632
$$ 656256 655762 655141 655165 656432 658627 661084 663644 666434 669343 672379 675906 679622 682045 682101 680598 678966
59685F78966j735k573k916j948r63j117j460r50o38j826l598m344m525n613p255
$$ 678966 677231 674658 671742 669794 668831 667714 666254 665304 664666 662840 659242 654898 650373 644760 637505
59670F37505p767o879n840n240m655m148m223m424l654j872j29R06J281J002K29
$$ 637505 629738 622859 617019 611779 607124 602976 598753 594329 590675 588803 588674 589580 590861 591863 592092
59655E92092j63N42J835K802L486M320M966M957M736M715M064J927q31k657l472
$$ 592092 591929 592471 594306 597108 600594 604914 609880 614837 619573 624288 628352 630279 629448 626791 623319
59640F23319m258n093n294n070n277n744n461m359l442l171l062k769k406j935
$$ 623319 619061 613968 608674 603604 598327 592583 587122 582763 579321 576150 573088 570319 567913 565978
59626E65978j360j328k369l767m248l589k607j958j880k579l766m351l704k722
$$ 565978 564618 563290 560921 557154 552906 549317 546710 544752 542872 540293 536527 532176 528472 525750
59612E25750k552k937k906k383j832j033L63J674K023J807J976K404K370K014
$$ 525750 523198 520261 517355 514972 513140 512107 512470 514144 516167 517974 519950 522354 524724 526738
59598E26738J836J378P0j143p86P80J773J596J360J831K400K326J610M98p78j668
$$ 526738 528574 529952 530022 528879 528093 528873 530646 532242 533602 535433 537833 540159 541769 542267 541489 539821
59582E39821j724j358j314j576j605j353j176j133j285k043l297l881l046j767
$$ 539821 538097 536739 535425 533849 532244 530891 529715 528582 527297 525254 521957 518076 515030 513263
59568E13263j414j766j646q78k76j95l94q12j301j154j20P59N42q9k4M23K72k94
$$ 513263 511849 510083 508437 507559 507283 507088 506694 505882 504581 503427 503307 504066 504608 504519 504495 504918 505190 504896
59550E04896m27k42k93j75P66J895K162J935K382L564M685N713P251R491J2698
$$ 504896 504469 504227 503934 503759 504525 506420 508582 510517 512899 516463 521148 526861 534112 543603 556301
59535E56301J7531K2942K5006K0428J0841J351m784p892r030q339o423m690l544
$$ 556301 573832 596774 621780 642208 653049 654400 649616 641724 632694 624355 617932 613242 609698
59522F09698k051Q3J907K870L482L928L597K315P56o27j983l350m668o227p986
$$ 609698 607647 607730 609637 612507 615989 619917 623514 625829 626585 625958 623975 620625 615957 609730 601744
59507F01744q950q435p436p299p775p826p518p338o570m416k066j370j989k116
$$ 601744 592794 584359 576923 569624 561849 554023 546505 539167 532597 528181 526115 524745 522756 520640
59493E20640j489j298j466p10P66J216K54n31j67O93J510K514L344L222K681L073
$$ 520640 519151 517853 516387 515677 516443 517659 517913 517382 517215 517908 519418 521932 525276 528498 531179 534252
59477E34252M174M380L476K996L563M074L931L883M206M024L041K080J511R02
$$ 534252 538426 542806 546282 549278 552841 556915 560846 564729 568935 572959 576000 578080 579591 580493
59463E80493L95N74Q89K25q62o51Q95K060K359L169N022O691P491Q160Q846Q568
$$ 580493 580888 581462 582351 582576 581714 581063 581958 584018 586377 589546 594568 601259 608750 616910 625756 634324
59447F34324P366O700P013O951N749M135K325n91m428p281q106p866p419o401
$$ 634324 641690 648390 655403 662354 668103 672238 674563 673972 669544 662263 654157 646291 638872 632471
59433F32471m992m507n223n682n071m311l905k875p83J270K668M249O404Q182
$$ 632471 627479 622972 617749 612067 606996 602685 598780 595905 595122 596392 599060 603309 609713 617895
59419F17895R277J0759J2987J4934J6339J8298K0940K3217K5765L0618L6367L6964
$$ 617895 627172 637931 650918 665852 682191 700489 721429 744646 770411 801029 837396 874360
59407H74360K8150J2926j730j1614j6530j7320j5016j1522p914k572O109J5361
$$ 874360 902510 915436 913706 902092 885562 868242 853226 841704 833790 831218 837327 852688
59395H52688J9016J3454J221j1478j9705k2467k1880k0368j8574j5946j2748j0266
$$ 852688 871704 885158 886379 874901 855196 832729 810849 790481 771907 755961 743213 732947
59383G32947q881p562n731m204l614l331k678j914j287m63M00M55k41m20L33P46
$$ 732947 724066 716504 710773 706569 702955 699624 696946 695032 693745 693282 693682 694137 693896 693476 693809 694555
59367F94555pr36r52m74k66j16K97O06P87J596L029L874L700L807N111O738P737
$$ 694555 694548 693612 692660 692186 691920 691804 692101 692707 693494 695090 698119 701993 705693 709500 714611 721349 729086
59350G29086Q699J0361J2050J2936J3518J4625J5972J6919J7525J7879J7439J6047
$$ 729086 737785 748146 760196 773132 786650 801275 817247 834166 851691 869570 887009 903056
59338I03056J4457J3058J1194Q545N817L359N28k817n720p822j0087j2912j5132
$$ 903056 917513 930571 941765 950310 956127 959486 960014 957197 951477 943655 933568 920656 905524
59325I05524j5871j5852j5928j5897j5631j5695j5924j5107j3100j1413j0816
$$ 905524 889653 873801 857873 841976 826345 810650 794726 779619 766519 755106 744290
59314G44290j0236r070q464r076r622r098q388q263p765o220m841m521l921j668
$$ 744290 734054 724984 716520 707444 697822 688724 680336 672073 664308 658088 653247 648726 644805 643137
59300F43137J258L318N105Q219J2638J6751J8789J6996J0266L30q374j2885j4367
$$ 643137 644395 647713 652818 661037 673675 690426 709215 726211 736477 736807 728433 715548 701181
59287G01181j5177j5319j3816j1559j0205r476p996n751l691j820L16K234L527
$$ 701181 686004 670685 656869 645310 635105 625629 617633 611882 608191 606371 606687 608921 612448
59274F12448N112P686J0011J0676J0508J1282J3017J4460J5309J6006J6186J5168
$$ 612448 617560 625246 635257 645933 656441 667723 680740 695200 710509 726515 742701 757869
59262G57869J3249J1054Q379N116K179Q3k169n261p906q696q292q018p685o665
$$ 757869 771118 782172 790551 795667 797846 797929 795760 790499 782593 773897 765605 757587 749902 743237
59248G43237n769o014o549n863m104k396q18J047K663L384L820M707N461N474
$$ 743237 737468 731454 724905 719042 714938 712542 711724 712771 715434 718818 722638 727345 732806 738280
59234G38280N533O311O774N895M566L935L270J473o76j940k915m758o892q162
$$ 738280 743813 750124 756898 762793 767359 771294 774564 776037 775361 773421 770506 765748 758856 750694
59220G50694r002j0224j1030j0491r726j0205j1086j0712r486q803q269o763n134
$$ 750694 741692 731468 720438 709947 700221 690016 678930 668218 658732 649929 641660 634897 629763
59207F29763n018n755n334l729k582k186j443m09k29p77p82q1M87J007K164L385
$$ 629763 624745 618990 613656 609927 607345 605159 603716 603307 603078 602301 601519 601438 601925 602932 605096 608481
59191F08481L552L075L161L589L372K970L588M824N326N163N366N739N394M852
$$ 608481 612033 615108 618269 621858 625230 628200 631788 636612 641938 647101 652467 658206 663600 668452
59177F68452N167N622M690K797J671J448Q38k12m37M12J383K152K993L432K966
$$ 668452 673619 679241 683931 686728 688399 689847 690685 690473 690036 690448 691831 693983 696976 700408 703374
59162G03374K527L107L746K948J249N8r32k756m645n275n488o895q743r227r001
$$ 703374 705901 709008 712754 715702 716951 717009 716077 713321 708676 703401 697913 691018 682275 673048 664047
59147F64047j0060j1813j1798r943q637q657q441p476p006p192o693n476m943
$$ 664047 653987 642174 630376 620433 611796 603139 594698 587222 580216 573024 566331 560855 555912
59134E55912n074m391l024k644l103k320l3J527J317R43J603K514L125M174N686
$$ 555912 550838 546447 543423 540779 537676 535356 535323 536850 538167 539110 540713 543227 546352 550526 556212
59119E56212O529O693P549R222J0206J0199J0682J2012J2605J1806J1021J1097
$$ 556212 562741 569434 576983 586205 596411 606610 617292 629304 641909 653715 664736 675833
59107F75833J1010J0091R226Q906Q257O850N518M634L544K175J281P28l71j621
$$ 675833 686843 696934 706160 715066 723323 730173 735691 740325 743869 746044 747325 748053 747682 746061
59093G46061j679p95o90j604k001j434j144j446j166j73J06p76j808k911n089
$$ 746061 744382 743587 742897 741293 739292 737858 736714 735268 734102 733929 734035 733259 731451 728540 723451
59078G23451p780q904q263p978q874r327q541p967q327q181o759n563n678n976
$$ 723451 715671 706767 698504 690526 681652 672325 663784 655817 647490 639309 632550 626987 621309 615333
59064F15333n410m752m760m760m283l956l800k773j029l21j156j916j742j774
$$ 615333 609923 605171 600411 595651 591368 587412 583612 580839 579810 579489 578333 576417 574675 572901
59050E72901k522k582j328l36o54j019k98M50k9j086j577j569j392p60M8Lp36
$$ 572901 570379 567797 566469 566133 565479 564460 564162 564612 564583 563497 561920 560351 558959 558199 558247 558250 557514
59033E57514o33O03J359R99J025K339L757M474N569P681R497J0134J0745J2297
$$ 557514 556881 557484 558843 559842 560867 563206 566963 571437 577006 584687 594184 604318 615063 627360
59019F27360J3828J4441J4932J5816J5762J3662J0461P389M227P36k009l317m126
$$ 627360 641188 655629 670561 686377 702139 715801 726262 733651 737878 738614 736605 733288 729162
59006G29162n221n834n364m642m158k917m38J917L049L799N082O134O088N556
$$ 729162 723941 718107 712743 708101 703943 701026 700588 702505 705554 709353 714435 720569 726657 732213
58992G32213N189M301K375M27n48r78j427j421q07o79j705l028l820m399m837
$$ 732213 737402 741703 744078 744505 743957 742979 741552 740131 739324 738645 736940 733912 730092 725693 720856
58977G20856m223k378n24P68K512N155P397Q309Q764R694J0652J1167J1682J2191
$$ 720856 716633 714255 713731 714499 717011 722166 729563 737872 746636 756330 766982 778149 789831 802022
58963H02022J1789J0547R818R796Q993P041N710N875N806L875P78k315n659r425
$$ 802022 813811 824358 834176 843972 852965 860006 865716 871591 877397 881272 882050 879735 874076 864651
58949H64651j2463j4094j5313j6787j7567j7050j6263j5866j4908j2805j0581
$$ 864651 852188 838094 822781 805994 788427 771377 755114 739248 724340 711535 700954
58938G00954q903p017m750l426l448l329k258j391j318q35M56R11k19j197p96
$$ 700954 692051 685034 680284 676858 673410 670081 667823 666432 665114 664279 664735 665646 665427 664230 663434
58923F63434k98q27j266p34n45j710k833k558j834j824j826j169q30j283j137
$$ 663434 663136 662309 661043 660309 659764 658054 655221 652663 650829 649005 647179 646010 645180 643897 642760
58908F42760K13J068N62P44L235O416Q220R348J1215J3058J3690J3889J4563J4576
$$ 642760 642973 644041 644603 645347 648582 654998 663218 672566 683781 696839 710529 724418 738981 753557
58894G53557J2933J1159J1055J1991J2715J3816J6008J8062J8868J9557K1187
$$ 753557 766490 777649 788704 800695 813410 827226 843234 861296 880164 899721 920908
58883I20908K2356K1479J9426J7546J5181J1589Q124N954L741Q5l833o592r167
$$ 920908 943264 964743 984169 1001715 1016896 1028485 1036609 1042563 1046304 1046389 1042556 1035964 1026797
58870A026797j2563j5155j5262j4196j3752j2983j0528q019p760q876r084q608
$$ 1026797 1014234 999079 983817 969621 955869 942886 932358 924339 916579 907703 898619 890011
58858H90011r097j0255j0767j1082j2139j2846j1889j0564j0709j1330j0368q370
$$ 890011 880914 870659 859892 848810 836671 823825 811936 801372 790663 779333 768965 760595
58846G60595p310p203o920o937q112r194q618p528p882q969q883q040q010q211
$$ 760595 753285 746082 739162 732225 724113 714919 706301 698773 690891 681922 673039 664999 656989 648778
58832F48778p079n312m743m980m338l066k654k921k674k126j945j191R91L093
$$ 648778 641699 636387 631644 626664 622326 619260 616606 613685 611011 608885 606940 605749 606740 609833
58818F09833L464L241M108M979M194L084L773N034M213J932R94J725K130J762
$$ 609833 613297 616538 620646 625625 629819 632903 636676 641710 645923 647855 648849 650574 652704 654466
58804F54466J709J662N15r35j312j567l200m817m218k622k961m971n998n727n981
$$ 654466 656175 657837 658352 657417 656105 654538 651338 646521 642303 639681 636720 631749 625751 620024 614043
58789F14043o538n435l013j621j528r08L84Q79R85K492M834N595M714M482N412
$$ 614043 607505 602070 599057 597436 595908 595000 595384 596263 597248 599740 604574 610169 614883 619365 624777
58774F24777N750M976M214L256P85k450m221m542n395o964p579p236p566q373
$$ 624777 630527 635503 639717 642973 643758 641308 637087 632545 627150 620186 612607 605371 597805 589432
58760E89432p809n981m835m407k842j96J374J409J662K649L043K697K866L288
$$ 589432 581623 575642 570807 566400 563558 563362 564736 566145 567807 570456 573499 576196 579062 582350
58746E82350K368N19%J206K345K897M155O172P366P426P511P602O670N379N399
$$ 582350 584718 585237 585237 586443 588788 591685 595840 602012 609378 616804 624315 631917 638587 643966 649365
58731F49365O191N758M356M204N542O390O102N798N513M276K907L191M464M527
$$ 649365 655556 661314 665670 669874 675416 681806 687908 693706 699219 703495 706402 709593 714057 718584
58717G18584L691M224O017O716O072O283P778Q547P858O948N875L390J39j729
$$ 718584 722275 726499 732516 739232 745304 751587 759365 767912 775770 782718 788593 791983 792122 790393
58703G90393k389m124p217r738j1382j3696j6390j7423j6881j6921j7707j7340
$$ 790393 788004 783880 776663 766925 755543 741847 725457 708034 691153 674232 656525 639185
58691F39185j5860j5107j4692j2371q713o808p021o541m670l899m984n557m711
$$ 639185 623325 608218 593526 581155 572442 565634 558613 552072 547402 543503 538519 532962 528251
58678E28251m423n298n275l793k967l420l085j395l87m75O62L612N875O446P603
$$ 528251 523828 518530 513255 509462 506495 503075 499990 498595 498208 497733 498395 502007 507882 514328 521931
58663E21931J0518J3073J3686J3458J2870J0199N085J46k679m213n221m943l680
$$ 521931 532449 545522 559208 572666 585536 595735 600820 600966 598287 594074 588853 583910 580230
58650E80230l410m523n190m892n131n828m954k596j471k282k589j402p69j517
$$ 580230 576820 572297 567107 562215 557084 551256 546302 543706 542235 539953 537364 535962 535193 533676
58636E33676j549R9J499J594J897K954K999J581P85J373J463L21l64j45p90k383
$$ 533676 532127 532226 533725 535319 537216 540170 543169 544750 545535 546908 548371 548692 548328 548183 547393 545010
58620E45010k567r74k83j504k408j968k119l545m015k493q59q7J139K757K655
$$ 545010 542443 541469 541186 539682 537274 535306 533187 529642 525627 523134 522275 522188 523327 526084 528739
58605E28739J071J026K953L664K130J340K576K986J033o69l92l20j897k875j699
$$ 528739 529810 530836 533789 537453 539583 540923 543499 546485 547518 546849 546457 546137 544240 541365 539666
58590E39666m07m56L8K295M314M887N951Q474J0303J0433J1073J3026J3608J1697
$$ 539666 539259 538803 538841 541136 545450 550337 556288 564762 575065 585498 596571 609597 623205 634902
58576F34902J0191J0756J0837Q729O948P428P970O759O027P808J0260J1534J3354
$$ 634902 645093 655849 666686 675415 682363 689791 697761 704520 710547 718355 728615 740149 753503
58563G53503J7380K1800K4606K6724K9112L0500L0495L0871L1365K8564K1566
$$ 753503 770883 792683 817289 844013 873125 903625 934120 964991 996356 1024920 1046486
58552A046486J4260R379M978n25m785o115o715q037p858n229l506m924p043q064
$$ 1046486 1060746 1070125 1075103 1074578 1069793 1063678 1056963 1048926 1041068 1035839 1032333 1027409 1020366 1012302
58538A012302j0602j6335k1901k4192k5019k6522k6756k4041k0998j9942j8722
$$ 1012302 1001700 985365 963464 939272 914253 887731 860975 836934 815936 795994 777272
58527G77272j5324j2095j1162j0268p409n021n172n275l066j213k290l815l021
$$ 777272 761948 749853 738691 728423 721014 715993 710821 705546 702480 701267 698977 695162 692141
58514F92141k025l372m921m114k953l694m084j910O2j044k694j624K23k71j559
$$ 692141 690116 686744 681823 677709 674756 671062 666978 665068 665130 664086 661392 659768 659991 659720 658161
58499F58161j041l80j774k934j291P17R0j005N27K725K566J904L577N464M507
$$ 658161 657120 656740 654966 652032 650741 651458 651548 650543 651070 653795 656361 658265 661842 667306 671813
58484F71813L003M691P959R064Q907J0578J3282J4660J6070J9669K3114K2916
$$ 671813 674816 679507 687466 696530 705437 716015 729297 743957 760027 779696 802810 825726
58472H25726K0208J7756J4439Q190J202l290o284r763j1886j0840r625j1154j2444
$$ 825726 845934 863690 878129 886319 887521 884231 877947 868184 856298 845458 835833 824679 812235
58459H12235r673n122k919j696J974O583Q762R903J2938J5957J5612J3607J3110
$$ 812235 802562 797440 794521 792825 794799 801382 810144 820047 832985 848942 864554 878161 891271
58446H91271J2038O788n88n622q734j2589j5596j4934j2820j2760j2812r569n426
$$ 891271 903309 910097 909509 903887 895153 882564 866968 852034 839214 826454 813642 804073 798647
58433G98647m561n051k566J252J935P67K289N801P164O832Q394J1237J2023J1343
$$ 798647 794086 789035 786469 787721 789656 790423 792712 798513 805677 812509 820903 832140 844163 855506
58419H55506J1798J1756Q157L106N39r69m937r468j0405r109r567j0632q912o415
$$ 855506 867304 879060 887217 890323 890862 889893 884956 875488 865083 855974 846407 835775 826863 820448
58405H20448p315r810r213o478n726o068m003j133j202k224J18L937M405K778
$$ 820448 813133 803323 794110 787632 781906 775838 771835 770702 769500 767276 767394 771331 775736 778514
58391G78514L588N620M481J480J168K541J481o79O2J888M75k083q72K230J976
$$ 778514 782102 787722 792203 793683 794851 797392 798873 798194 798256 800144 800619 798536 797664 799894 801870
58376H01870q3J356M953N406L812N185Q241P957N869P310J0781J0752Q718J0569
$$ 801870 801787 803143 808096 813502 817314 822499 830740 838697 844566 851876 862657 873409 882127 892696
58362H92696J5010J5751J3320J3661J6636J6931J4778J4725J5563J2556P799P117
$$ 892696 907706 923457 936777 950438 967074 984005 998783 1013508 1029071 1041627 1049426 1056543
58350A056543Q625N897M58p48J716J551o40R85N021M961K170L727Q736J0065Q356
$$ 1056543 1065168 1071065 1071523 1070775 1072491 1074042 1073402 1074387 1079408 1084369 1086539 1090266 1099002 1109067 1117423
58335A117423J0655J6198J7484J4775J5517J9773K0418J7497J7975K1320J9851
$$ 1117423 1128078 1144276 1161760 1176535 1192052 1211825 1232243 1249740 1267715 1289035 1308886
58324A308886J3688J0866J2100J0077M430K640N312N202J791K090O097O317K667
$$ 1308886 1322574 1333440 1345540 1355617 1360047 1362687 1367999 1373201 1374992 1377082 1383179 1389496 1392163
58311A392163K935P572R038P025Q849J4108J4779J1282J2278J7642J8365J4328
$$ 1392163 1395098 1402670 1411708 1418733 1427582 1441690 1456469 1467751 1480029 1497671 1516036 1530364
58299A530364J4953K0842K2347J8092J7196K1135K1407J7279J7583K2658K3063
$$ 1530364 1545317 1566159 1588506 1606598 1623794 1644929 1666336 1683615 1701198 1723856 1746919
58288A746919J8571J9432K6209K8006K3506K3688L0283L2214K7284K6534L2567
$$ 1746919 1765490 1784922 1811131 1839137 1862643 1886331 1916614 1948828 1976112 2002646 2035213
58277B035213L4604K9932K9188L5143L7423L3675L4624M2553M6324M3330M4494
$$ 2035213 2069817 2099749 2128937 2164080 2201503 2235178 2269802 2312355 2358679 2402009 2446503
58266B446503N1946N4228M9372M9694N7876O1823N9096O1889P1645P4241O7221
$$ 2446503 2498449 2552677 2602049 2651743 2709619 2771442 2830538 2892427 2964072 3038313 3105534
58255C105534O5607P3406P6201O9818O8587P6730P9980P4578P5476Q6246R0896
$$ 3105534 3171141 3244547 3320748 3390566 3459153 3535883 3615863 3690441 3765917 3852163 3943059
58244C943059Q5653Q7853J02462J11737J09648J13639J29782J40331J39116J44373
$$ 3943059 4028712 4116565 4219027 4330764 4440412 4554051 4683833 4824164 4963280 5107653
58234E107653J62302J73956J73239J80554K02847K18868K21044K31743K59830
$$ 5107653 5269955 5443911 5617150 5797704 6000551 6219419 6440463 6672206 6932036
58225F932036K82842K91670L09357L44925L74029L87714M12952M60920N04569
$$ 6932036 7214878 7506548 7815905 8160830 8534859 8922573 9335525 9796445 10301014
58216A0301014N32856N74819O42611P06281P54658Q22340R24242J026424J116893
$$ 10301014 10833870 11408689 12051300 12757581 13512239 14334579 15258821 16285245 17402138
58207A7402138J237768J409009J593567J780960K025565K354252K723899L125877
$$ 17402138 18639906 20048915 21642482 23423442 25449007 27803259 30527158 33653035
58199C3653035L637745M311159N118091O080241P328420Q950444J0927902J3328855
$$ 33653035 37290780 41601939 46720030 52800271 60128691 69079135 80007037 93335892
58191I3335892J6389245K0280167K5027186L0786425L7655580M4489711M8077498
$$ 93335892 109725137 130005304 155032490 185818915 223474495 267964206 316041704
58184C16041704M4586420L2696945J5292660k275863j5675971k3613499k7271554
$$ 316041704 360628124 393325069 408617729 406341866 390665895 367052396 339780842
58177C39780842k8590520k9007024k9045512k8519588k7098358k4824592k2127148
$$ 339780842 311190322 282183298 253137786 224618198 197519840 172695248 150568100
58170A50568100j9425535j6889216j4561952j2506721j0747872r219330p867074
$$ 150568100 131142565 114253349 99691397 87184676 76436804 67217474 59350400
58163E9350400o716804n783987n007169m326703l749522l284109k885526k516673
$$ 59350400 52633596 46849609 41842440 37515737 33766215 30482106 27596580 25079907
58155B5079907k198462j950493j740509j537378j359629j228055j119591j008838
$$ 25079907 22881445 20930952 19190443 17653065 16293436 15065381 13945790 12936952
58147A2936952r09745q37634p72267o95025o23456n74718n31602m76860m25699
$$ 12936952 12027207 11189573 10417306 9722281 9098825 8524107 7992505 7515645 7089946
58138G089946l93487l65288l27240k95452k84439k77677k57768k36508k27832
$$ 7089946 6696459 6331171 6003931 5708479 5424040 5146363 4888595 4652087 4424255
58129D424255k19510j98662j78328j72055j67579j51287j34509j30519j28709
$$ 4424255 4204745 4006083 3827755 3655700 3488121 3336834 3202325 3071806 2943097
58120B943097j16110j02386r9638r8549q7706p6368p5628p6495o8465o0819o3986
$$ 2943097 2826987 2724601 2624963 2526414 2438708 2362340 2286712 2210217 2141752 2080933 2016947
58109B016947o8241o2035n3799n4770n7361n1151m3778m5611m9365m4844l8769
$$ 2016947 1948706 1886671 1832872 1778102 1720741 1669590 1625812 1580201 1530836 1485992 1447223
58098A447223m0536m2998l6675k8910k9944l3544k9964k4881k7087l0253k5216
$$ 1447223 1406687 1363689 1327014 1298104 1268160 1234616 1204652 1179771 1152684 1122431 1097215
58087A097215j8225j8917k1948j8208j2911j4938j9142j6677j2542j5562k0781
$$ 1097215 1078990 1060073 1038125 1019917 1007006 992068 972926 956249 943707 928145 907364
58076I07364j8793j3500j4014j7555j6439j3642j5834j8967j6051j1464j2683
$$ 907364 888571 875071 861057 843502 827063 813421 797587 778620 762569 751105 738422
58065G38422j5614j2629p531q064j0988q918m819n680q699p553n491q677j3138
$$ 738422 722808 710179 702648 694584 683596 674678 669859 664179 655480 647927 642436 633759 620621
58052F20621j1875q384r800j2992j0807n966n580p703o223l528n403q842p459
$$ 620621 608746 600362 590562 577570 566763 560797 555217 547514 541291 537763 532360 523518 516059
58039E16059l847m362o839n531k909m548p480n670k024l096o682o524m444o084
$$ 516059 512212 507850 501011 495480 492571 488023 480543 474873 472849 469753 463071 456547 452103 446019
58025D46019r305q551o178p813j0899r409n596n509p210n046j441k561o145n457
$$ 446019 436714 428163 421985 414172 403273 393864 388268 382759 375549 370503 369062 366501 360356 354899
58011C54899j840j689m161l477n00o99l187k837o88j560l903k666L81k53l031
$$ 354899 353059 351370 347209 343732 343232 342533 339346 336509 335821 334261 330358 327692 328073 327820 324789
57996C24789k337N48O0k518j378K567L396J287J404L498L004Q72J925M918M399
$$ 324789 322452 323000 323060 320542 319164 321731 325127 326414 327818 331316 334320 335192 337117 342035 346434
57981C46434J131N43K126N70l581m618k275j779l687l440p68p2j562j110J171
$$ 346434 347565 348108 350234 350804 347223 342605 340330 338551 334864 331424 330656 330584 329022 327912 329083
57966C29083J044j290j385Q17J079p43p07J091P76j289j074R06K56k739l527k012
$$ 329083 330127 328837 327452 328269 329348 328605 327898 328989 329765 328476 327402 328308 328564 325825 322298 320286
57950C20286k506n123n528l359k671l813k867M16K007J229J485L136L192K242
$$ 320286 317780 312657 307129 303770 301099 297286 294419 294835 296842 298071 299556 302692 305884 308126
57936C08126M062Q172J0181R710J0521J2715J2416R388P435O890M254l01k597
$$ 308126 312188 320360 330541 340251 350772 363487 375903 385291 392726 399616 403870 403569 400972
57923D00972k128k729n136o076n251n943q190q528p001p227r082q656n963n189
$$ 400972 398844 396115 390979 384903 379652 373709 365519 356991 349990 342763 333681 325025 319062 313873
57909C13873o676o174k967j133j726j159J301J884l44j663p87p32k119j569J408
$$ 313873 307197 301023 298056 296923 295197 294038 295339 297223 296879 295216 294429 293697 291578 290009 291417
57894B91417K851J505R75K884M337M057M628O660P001M808L425M248M494K901
$$ 291417 294268 295773 296748 299632 303969 308026 312654 319314 326315 331123 334548 338796 343290 346191
57880C46191J851K158J356j122k678k816m045o293o334m024l093m322m170j683
$$ 346191 348042 350200 351556 350434 347756 344940 340895 334602 328268 324244 321151 316829 312659 310976
57866C10976m72k020l243k619k591l818l304l99J293M27L71K774M585M000L700
$$ 310976 310504 308484 305241 302622 300031 296213 292909 292510 293803 294230 294601 297375 301960 305960 309660
57851C09660N393O607N682M764N189M934L132K151K767K270l03k081j687j582
$$ 309660 315053 321660 327342 332106 337295 342229 345361 347512 350279 352549 352246 350165 348478 346896
57837C46896k854l025j274n24j856k229l86M14j576l184k097q23j586k226o85
$$ 346896 344042 341017 339743 339219 337363 335134 334748 335162 333586 330402 328305 327482 325896 323670 322985
57822C22985R74O08j72L73P47l52j103j58O24j21n98L20M80j665m248n681p306
$$ 322985 323959 324567 324395 324768 325515 325163 324060 323902 324526 324405 323807 324127 324607 322942 318694 313013 305707
57805C05707r804j0993r845q749r170q943o619m459m287m348l070k139k826l063
$$ 305707 295903 284910 275065 266316 257146 248203 241584 237125 232838 228490 225420 223281 220455 217392
57791B17392j213Q15J094Q71J501J743Q98J049L330N404N391M919N620O223N842
$$ 217392 216179 216994 218088 218959 220460 222203 223101 224150 227480 232884 238275 243194 248814 255037 260879
57776B60879O516R364J1751J1304R600Q905Q390O575M403L059J611n16j630q52
$$ 260879 267395 276759 288510 299814 309414 318319 326709 333284 337687 340746 342357 341841 340211 339359
57762C39359q8o26q66K03O35r38k698l063l438n091o580o646o376o270m765j938
$$ 339359 339271 338645 337779 337982 338617 337679 334981 331918 328480 323389 316809 310163 303787 297517 292752 290814
57746B90814q17k394l349j445P84O73l00j14j68k045l954l987l522m058l965j916
$$ 290814 289997 287603 284254 282809 283593 284266 283966 283852 283684 281639 277685 273698 270176 266118 262153 260237
57730B60237j40p41j958j583q32j282j353M85K279K084J689L030M254L294K126
$$ 260237 260097 259356 257398 255815 254983 253701 252348 252833 255112 257196 258885 261915 266169 269463 271589
57715B71589L138M373K987N77M09J711J491q5o91m69j203k370k199j270j211j332
$$ 271589 274727 279100 282087 282664 283073 284784 286275 286190 285499 285030 283827 281457 279258 277988 276777 275445
57699B75445k68O63m72k350k372j061p70j463j473j087j716k735k689k439l630
$$ 275445 275177 275840 275368 273018 270646 269585 268815 267352 265879 264792 263076 260341 257652 255213 251583
57684B51583n177m769k850j732j706j148L61K008L936O699R520J1634J4242J8802
$$ 251583 246406 241637 238787 237055 235349 234201 234562 236570 240506 247205 256725 268359 282601 301403
57670C01403K4726L1051L8826M9375O1484P2042P7472P3121N4952K5223o217k9853
$$ 301403 326129 357180 396006 445381 506865 578907 656379 729500 784452 809675 803458 773605
57658G73605m3842n1268n3720n1577m7398m3966m0544l5219k9278k5317k2757
$$ 773605 729763 678495 624775 573198 525800 481834 441290 406071 376793 351476 328719
57647C28719j9401j5734j3604j2196r516o482n317n220l871j923j736k718k356
$$ 328719 309318 293584 279980 267784 258268 251786 246469 241249 237378 235455 233719 231001 228645
57634B28645r10p42j658j290L60R11l9m38M60J438K058K721K481K76k260k645
$$ 228645 227735 226993 225335 224045 224405 225316 225277 224839 225299 226737 228795 231516 233997 234273 232013 229368
57618B29368j537j399k048j350L86P55l82q11n9K12j73K73J310J026n06j163m99
$$ 229368 227831 226432 224384 223034 223420 224175 223793 222982 222923 223135 222962 223235 224545 225571 225065 223902 223403
57601B23403k35q52r73l03j16o14p40n86j160j956j630p95j119k082j743l81n2
$$ 223403 223168 222316 221343 221040 220924 220310 219570 218984 217824 215868 214238 213443 212324 210242 208499 208118 208066
57584B08066p82o09O88J256O35L41Q37R64M98L97M78k97j463j692j463k075k700
$$ 208066 207284 206675 207363 208619 209254 209595 210432 211396 211894 212291 212769 212472 211009 209317 207854 205779 203079
57567B03079j620J67R8j520j936o14K68L1L79J721K283J540J150J833K369K349
$$ 203079 201459 201626 201724 200204 198268 197654 197922 197953 198332 200053 202336 203876 205026 206859 209228 211577
57551B11577K917M267N264N877P077Q153P142M291K085J616J723J862K704L775
$$ 211577 214494 218761 224025 229902 236979 245132 252274 256565 258650 260266 261989 263851 266555 270330
57537B70330L629K601K344K667J997Q64J428L425M242L334K873L594L732K766
$$ 270330 273959 276560 278904 281571 283568 284432 285860 289285 293527 296861 299734 303328 307060 309826
57523C09826K463L305L423K128J081J025O16m91q34l49j079l518n520n933o119
$$ 309826 312289 315594 319017 321145 322226 323251 323867 323376 322542 322193 321114 317596 312076 306143 300024
57508C00024o806o771n826n741o807o789m759k816k412k114p01M85K07m13r8N65
$$ 300024 293218 286447 280621 274880 268073 261284 256525 253709 251297 249183 248482 248967 249174 248761 248663 249228
57492B49228R43J808L356M198L754L439M076M492M011L915M954N769N235M253
$$ 249228 250171 251979 255335 259533 263287 266726 270802 275294 279305 283220 288174 293943 299178 303431
57478C03431L853L684L466L795M376L808K141J290J829J998R94N43J734K983K801
$$ 303431 307284 310968 314434 318229 322605 326413 328554 329844 331673 333671 334665 335208 336942 339925 342726
57463C42726K177K532L395L741L708L594L059K418K736L659L393J715O18J019
$$ 342726 344903 347435 350830 354571 358279 361873 364932 367350 370086 373745 377138 378853 379471 380490
57449C80490J447J072J243K643L724L519L372M255M836M069L191L401L815L505
$$ 380490 381937 383009 384252 386895 390619 394138 397510 401765 406601 410670 413861 417262 421077 424582
57435D24582L332L892L941K720J741K368L558L844L635L817L943L505L261L659
$$ 424582 427914 431806 435747 438467 440208 442576 446134 449978 453613 457430 461373 464878 468139 471798
57421D71798L668K667J728J663J694J366J765L457N184O000O659P592P694O598
$$ 471798 475466 478133 479861 481524 483218 484584 486349 489806 494990 500990 507649 515241 522935 529533
57407E29533N895O550P222O623N448M516L306J875J832L690N497N763N526N887
$$ 529533 535428 541978 549200 555823 561271 565787 569093 570968 572800 576490 581987 587750 593276 599163
57393E99163N999N281N116O320P310O910O594P735Q998Q830Q276Q891R827R541
$$ 599163 605162 610443 615559 621879 629189 636099 642693 650428 659426 668256 676532 685423 695250 704791
57379G04791Q534P992P467O277N443N905O532O077N401N565N580M405L240L450
$$ 704791 713325 721317 728784 735061 740504 746409 752941 759018 764419 769984 775564 779969 783209 786659
57365G86659M016L565L155M345O188O849O747P426Q590Q942Q772R151R692R485
$$ 786659 790675 794240 797395 801740 807928 814777 821524 828950 837540 846482 855254 864405 874097 883582
57351H83582R221R945J0851J0638R954J0197J0962J1009J0635J0859J1235J0763
$$ 883582 892803 902748 913599 924237 934191 944388 955350 966359 976994 987853 999088 1009851
57339A009851R956R873J0114R742R136Q953Q536P348O618P457Q745Q991Q841R504
$$ 1009851 1019807 1029680 1039794 1049536 1058672 1067625 1076161 1083509 1090127 1097584 1106329 1115320 1124161 1133665
57325A133665J0253R990R688J0684J1931J1665J0578J0550J1361J1453J0913J0924
$$ 1133665 1143918 1153908 1163596 1174280 1186211 1197876 1208454 1219004 1230365 1241818 1252731 1263655
57313A263655J1277J1107J1153J2486J3966J3806J2807J3063J4310J4508J3514
$$ 1263655 1274932 1286039 1297192 1309678 1323644 1337450 1350257 1363320 1377630 1392138 1405652
57302A405652J3097J3694J4098J4177J4985J6280J6607J5974J5894J6762J7453
$$ 1405652 1418749 1432443 1446541 1460718 1475703 1491983 1508590 1524564 1540458 1557220 1574673
57291A574673J7503J7513J7462J6827J6144J6377J6929J6428J5186J4715J5128
$$ 1574673 1592176 1609689 1627151 1643978 1660122 1676499 1693428 1709856 1725042 1739757 1754885
57280A754885J5209J4745J4606J4743J4343J3691J3759J4121J3516J2253J1882
$$ 1754885 1770094 1784839 1799445 1814188 1828531 1842222 1855981 1870102 1883618 1895871 1907753
57269A907753J2623J3256J3406J3914J4998J6038J7081J8606K0091K0557K0326
$$ 1907753 1920376 1933632 1947038 1960952 1975950 1991988 2009069 2027675 2047766 2068323 2088649
57258B088649K0392K0545K0060J9623K0490K2150K2960K2756K2725K3085K3019
$$ 2088649 2109041 2129586 2149646 2169269 2189759 2211909 2234869 2257625 2280350 2303435 2326454
57247B326454K2595K2638K2991K2910K2777K3398K4160K4005K3586K4267K5505
$$ 2326454 2349049 2371687 2394678 2417588 2440365 2463763 2487923 2511928 2535514 2559781 2585286
57236B585286K5712K5142K5420K6662K7562K8032K9135L0665L1406L1667L2855
$$ 2585286 2610998 2636140 2661560 2688222 2715784 2743816 2772951 2803616 2835022 2866689 2899544
57225B899544L4649L5232L4368L3672L3717L3514L2964L3199L4179L4526L4089
$$ 2899544 2934193 2969425 3003793 3037465 3071182 3104696 3137660 3170859 3205038 3239564 3273653
57214C273653L4227L5087L5127L3900L2934L3244L4015L4302L4059L3064L0894
$$ 3273653 3307880 3342967 3378094 3411994 3444928 3478172 3512187 3546489 3580548 3613612 3644506
57203C644506K8278K6550K5456K3551K0857J8981J8364J7766J6822J6767J8080
$$ 3644506 3672784 3699334 3724790 3748341 3769198 3788179 3806543 3824309 3841131 3857898 3875978
57192C875978J9574K0513K1595K3189K4522K5210K5833K6529K6729K6571K6821
$$ 3875978 3895552 3916065 3937660 3960849 3985371 4010581 4036414 4062943 4089672 4116243 4143064
57181D143064K7160K6423K4754K3623K3442K3103K2107K1167K0450J9235J7657
$$ 4143064 4170224 4196647 4221401 4245024 4268466 4291569 4313676 4334843 4355293 4374528 4392185
57170D392185J6781J6568J5718J3849J1914J0151P738M787K654J723Q15p95k578
$$ 4392185 4408966 4425534 4441252 4455101 4467015 4477166 4484904 4489691 4492345 4494068 4494883 4494088 4491510
57157D491510m351o742r632j1994j3613j5295j7107j8209j8654j9451k0704k1542
$$ 4491510 4487159 4480417 4470785 4458791 4445178 4429883 4412776 4394567 4375913 4356462 4335758 4314216
57145D314216k1941k2649k3387k3242k2829k3654k5186k5122k2912k0547j9229
$$ 4314216 4292275 4269626 4246239 4222997 4200168 4176514 4151328 4126206 4103294 4082747 4063518
57134D063518j7835j5457j3107j1853j1310j0992j1272j2167j2768j2703j2584
$$ 4063518 4045683 4030226 4017119 4005266 3993956 3982964 3971692 3959525 3946757 3934054 3921470
57123C921470j2473j1445r156o245k865J588O986J2356J7491K3062K9145L5262
$$ 3921470 3908997 3897552 3888396 3882151 3879286 3880874 3887860 3900216 3917707 3940769 3969914 4005176
57111D005176M1911N0207O0134P1033Q3743J00332J21886J48523J81393K22583
$$ 4005176 4047087 4097294 4157428 4228461 4312204 4412536 4534422 4682945 4864338 5086921
57101E086921K73260L34113M07665M98523O11935P53978R32239J153658J421796
$$ 5086921 5360181 5694294 6101959 6600482 7212417 7966395 8898634 10052292 11474088
57092A1474088J737417K099769K504425K940730L393017L841869M261999M622836
$$ 11474088 13211505 15311274 17815699 20756429 24149446 27991315 32253314 36876150
57084C6876150M894777N050860N059916M889550M529979M009933L370468K619838
$$ 36876150 41770927 46821787 51881703 56771253 61301232 65311165 68681633 71301471
57076G1301471J733123P09916l76919j403891k268039k933370l419963l765163
$$ 71301471 73034594 73744510 73367591 71963700 69695661 66762291 63342328 59577165
57068E9577165l995649m120915m140971m059334l891349l661012l391862l102753
$$ 59577165 55581516 51460601 47319630 43260296 39368947 35707935 32316073 29213320
57060B9213320k809252k523787k253963k003836j777048j576511j401808j249791
$$ 29213320 26404068 23880281 21626318 19622482 17845434 16268923 14867115 13617324
57052A3617324j117508j002586r01692q11467p30688o59424n96582n40225m89627
$$ 13617324 12499816 11497230 10595538 9784071 9053383 8393959 7797377 7257152 6767525
57043F767525m44921m05314l69543l37487l09630k85469k63922k44610k27339
$$ 6767525 6322604 5917290 5547747 5210260 4900630 4615161 4351239 4106629 3879290
57034C879290k11062j94698j78198j61791j45048j27495j09210r0110o9531m6602
$$ 3879290 3668228 3473530 3295332 3133541 2988493 2860998 2751788 2661678 2592147 2545545
57024B545545k0045J0502L9433N2742L7178n156n5497r4471j16368j26128j28343
$$ 2545545 2525500 2536002 2575435 2628177 2665355 2660199 2604702 2510231 2393863 2267735 2139392
57013B139392j24470j16844j08588j00157r0384q0277p2054o5504n8913n2726
$$ 2139392 2014922 1898078 1789490 1689333 1598949 1518672 1446618 1381114 1322201 1269475
57003A269475m8654m6018m2555l8244l4987l3000l0766k8120k6309k5292k3783
$$ 1269475 1220821 1174803 1132248 1094004 1059017 1026017 995251 967131 940822 915530 891747
56992H91747k1732k0035j8224j5091j1179q120n781k513K108O883J0697J2472
$$ 891747 870015 849980 831756 816665 805486 797366 791585 789072 791180 798063 808760 821232
56980H21232J0424L896m690j1986j7112k0871k2900k2351k0357j8880j7750j5493
$$ 821232 831656 835552 830862 818876 801764 780893 757993 735642 715285 696405 678655 663162
56968F63162j2424j0152q695o791m544k928j279K011O676J1192J5679K1286K6780
$$ 663162 650738 640586 631891 625100 620556 617628 616349 618360 625036 636228 651907 673193 699973
56955F99973K8609K4613J5647L887q201j7713k2863k4773k5724k5981k4385k1286
$$ 699973 728582 753195 768842 772729 764528 746815 723952 699179 673455 647474 623089 601803
56943F01803j8313j5725j2582r128o555m620j967J532N023Q890J4372K1304K8339
$$ 601803 583490 567765 555183 546055 539500 534880 532913 534445 539468 548358 562730 584034 612373
56930F12373L4584L8635L7104K7334J1578m365j6601k5021l0464l3056l3417l2685
$$ 612373 646957 685592 722696 750030 761608 757243 740642 715621 685157 652101 618684 585999
56918E85999l0981k7937k4503k2037k0045j7185j4013j2241j1762j1069j0036
$$ 585999 555018 527081 502578 480541 460496 443311 429298 417057 405295 394226 384190
56907C84190r549q977o993m545l913n009n572m826l931l049j191J002J680J172
$$ 384190 374641 365664 358671 354126 350213 345204 339632 334806 330875 327826 326635 327637 329317 330489
56893C30489J849M305O747Q516J1052J4958J9197K3562K8659L2759L2072K5351
$$ 330489 332338 336643 343390 351906 362958 377916 397113 420675 449334 482093 514165 539516
56881E39516J5590O125k170r122j3655j5399j5500j4609j2149q395n115l069r68
$$ 539516 555106 561231 559061 549939 536284 520885 505385 490776 478627 470232 465117 462048 461080
56868D61080K290O240J0418J5349K1298K7838L5193M4399N5514O6786P5153P6249
$$ 461080 463370 469610 480028 495377 516675 544513 579706 624105 679619 746405 821558 897807
56856H97807O5527M2587J4053j0939k8232l9348m5951m7617m4987m0736l6159
$$ 897807 963334 1005921 1019974 1009035 980803 941455 895504 847887 802900 762164 726005
56845G26005l0198k2763j5711r503k205P014J6585K5933L7034N1265O7730Q5699
$$ 726005 695807 673044 657333 647830 645625 652639 669224 695157 732191 783456 851186 936885
56833I36885J04895J21070J24844J08564P3554K9220j3431m6677o7708p8379q2592
$$ 936885 1041780 1162850 1287694 1396258 1469812 1499032 1485601 1438924 1371216 1292837 1210245
56822A210245q2601p8503p1099o2759n4743m6072l6089k5920j6366o539M184J5034
$$ 1210245 1127644 1049141 978042 915283 860540 814468 778379 752459 736093 729554 733738 748772
56810G48772K5767L7825N2303O8009Q1605Q7937Q0859N7489K2817j2516m0298
$$ 748772 774539 812364 864667 932676 1014281 1102218 1183077 1240566 1263383 1250867 1210569
56799A210569n8846o9587p3570p2409o8908o4448n8092m9744m1539l4737k8023
$$ 1210569 1151723 1082136 1008566 936157 867249 802801 744709 694965 653426 618689 590666
56788E90666k0462j3359p582j686N490J3060K0588K9459L9407M6008M4203L3031
$$ 590666 570204 556845 549263 547577 553067 566127 586715 616174 655581 701589 745792 778823
56776G78823J5553l859k0802l2021l7556m0317m2134m2065l9464l6024l3227l0271
$$ 778823 794376 790517 769715 737694 700138 659821 617687 575622 536158 500134 466907 436636
56764D36636k6326k2585k0226j8437j6265j4297j2954j1166q424o051m978m349
$$ 436636 410310 387725 367499 349062 332797 318500 305546 294380 285956 279905 274927 270578
56752B70578l696m064n491n950m509l004k879k938k083j561k391l078k227j059
$$ 270578 266882 262818 257327 251377 246868 243864 240985 238047 235964 234403 232012 228934 226707 225648
56738B25648j106j621j415j094j364j304l49K21k25j62J174J887P00n41l6R11
$$ 225648 224542 222921 221506 220412 219048 217744 217395 217616 217391 217229 218403 220290 220990 220449 220413 221324
56722B21324N91J06J024K260K204J790K409K887J631j13k34O90Q17L68N82R60
$$ 221324 221915 222021 223045 225305 227509 229299 231708 234595 236226 236113 235879 236569 237386 237754 238336 239296
56706B39296M78P1J009K168J790N63K79P12N80K21N93R75L03m63O3J073J132Q94
$$ 239296 239774 239845 240854 243022 244812 245375 245654 246366 246946 247167 247760 248735 249038 248575 248638 249711 250843 251737
56688B51737J623K396J591j04q65p46q87j043m21K00j81o46n3N53k47j413j168
$$ 251737 253360 255756 257347 257243 256378 255632 254745 253702 253281 253481 253300 252654 252601 253154 252907 251494 250326
56671B50326p7K18r8j9j24j149j723l94J504J952J635K259L061K257O52L35R75
$$ 250326 250249 250467 250369 250350 250226 249077 247354 246960 248464 250416 252051 254310 257371 259628 260280 260615 261590
56654B61590P02l31n71k66q01j770j928k068l653n533n417l864l409m343m736
$$ 261590 262292 261961 261390 261124 260323 258553 256625 254557 250904 245371 239954 236090 232681 228338 223602
56639B23602m087l613l365k333j066j034j694j197K54P64O0l77j67k11m68k28
$$ 223602 219515 215902 212537 210204 209138 208104 206410 205213 205467 206231 206291 205914 205747 205536 205068 204840
56623B04840r8r99j917j322j3K54k9P02J779J445L64N73J722J836J129J467K608
$$ 204840 204742 203743 201826 200504 200491 200745 200716 201418 203197 204642 205006 205579 207301 209137 210266 211733 214341
56606B14341K651J767J805K504J840%p43j26j74j289j626p22k03n03k10R02J315
$$ 214341 216992 218759 220564 223068 224908 224908 224165 224039 223865 222576 220950 220228 220025 219522 219312 220214 221529
56589B21529P00M45R00R81O03O91Q46n0j102m82J016Q91p01j095K81J102L83j37
$$ 221529 222229 222674 223574 224555 225158 225849 226695 226645 225543 225061 226077 226968 226267 225172 225453 226555 226938 226801
56571B26801N43J196J166J455K301K587K373L190N216O841P509Q385R987J1728
$$ 226801 227344 228540 229706 231161 233462 236049 238422 241612 246828 253669 261178 269563 279550 291278
56557B91278J3655J5798J6093J2248N675L09k457m339n968o027m756m319n036
$$ 291278 304933 320731 336824 349072 354747 355056 352599 348260 342292 336265 331509 327190 322154
56544C22154m924l692l387m436m681l392k558l144l534k865k572l413m042l686
$$ 322154 317230 313538 310151 305715 301034 297642 295084 291940 288406 285541 282969 279556 275514 271828
56530B71828l240k848j443M75Q23m56r63P2O31l03j122q91r51j894k191j194o03
$$ 271828 268588 265740 264297 264772 265595 265139 264176 264248 264879 264576 263454 262563 261612 259718 257527 256333 255730
56513B55730j509k683k993k930k788j941p81o97j469j383l86j89r56j039l64n98
$$ 255730 254221 251538 248545 245615 242827 240886 240105 239408 237939 236556 236170 235981 235025 233986 233622 233024
56497B33024j612j437k67n55k404k916j181J98k13n30M51J051K46l36K59N68p5
$$ 233024 231412 229975 229708 229153 226749 223833 222652 222850 222637 222107 222558 223609 223855 223519 223778 224346 224271
56480B24271p0J038J282K1n98M01J030K55k1J184J788M79p67k03J009J594K314
$$ 224271 224201 225239 226521 226542 225944 226345 227375 227630 227609 228793 230581 231060 230293 230090 231099 232693 235007
56463B35007L265K563n7j705p12P60P01M80J659K845K380J239P18K5j451k132
$$ 235007 238272 240835 240778 239073 238361 239121 239822 240302 241961 244806 247186 248425 249143 249168 247717 245585
56447B45585q64J026K220L293M363L897J768M25R91J377J54r89p44o75j904k723
$$ 245585 244721 245747 247967 251260 255623 259520 261288 261713 262704 264081 264235 263246 262502 261827 259923 257200
56431B57200j941j250j813j826j36J115K39q69k16Q12L44n64m36l33j391k197
$$ 257200 255259 254009 252196 250370 250234 251349 251588 250719 250503 251315 251659 251095 250659 250326 248935 246738
56415B46738j478p26j353j993j295n68r10o52J440L309K936J741J756K191J760
$$ 246738 245260 244534 243181 241188 239893 239325 238415 237763 239203 242512 245448 247189 248945 251136 252896
56400B52896J557K606L323K431J625K362K815J202p11p33j13q82j930j184O13
$$ 252896 254453 257059 260382 262813 264438 266800 269615 270817 270106 269373 269260 268378 266448 265264 265877
56385B65877J621K187L186L418J781n4j89L32k62j453k272l671o178p820p201
$$ 265877 267498 269685 272871 276289 278070 278016 277827 278159 277897 276444 274172 270501 264323 256503 249302
56370B49302o077o038n489k933l12K56K27J694L439L438K741L255M027L261J858
$$ 249302 243225 237187 231698 228765 228453 228709 228936 230630 234069 237507 240248 243503 247530 250791 252649
56355B52649J622K060K004K143K992K939J181k9R03J887Q42o24l60N68N62P38
$$ 252649 254271 256331 258335 260478 263470 266409 267590 267561 268464 270351 271193 270569 270209 270777 271339 272077
56339B72077K095K779J634J063K744M091K878J640L140N132M371K393K430L711
$$ 272077 274172 276951 278585 279648 282392 286483 289361 291001 294141 299273 303644 306037 308467 312178
56325C12178L860L852N447O602M704J771J193J892R23o98k66R63K5j923j651P6
$$ 312178 316038 319890 325337 331939 336643 338414 339607 341499 342422 341724 341458 342421 342446 340523 338872 338948
56309C38948Q7j222q77J075K211K529L628M555L450J900K683M636M627L078K731
$$ 338948 339035 337813 336936 338011 340222 342751 346379 350934 354384 356284 358967 363603 368230 371308 374039
56294C74039L443L170K548L571N163M966L922M396N424M677L331L982N580N515
$$ 374039 377482 380652 383200 386771 391934 396900 400822 405218 410642 415319 418650 422632 428212 433727
56280D33727M849O269Q686R157Q374Q941J0112R609Q762J0257J2697J3106J2836
$$ 433727 438576 444845 453531 462688 471062 480003 490115 499724 508486 518743 531440 544546 557382
56267E57382J5027J8159J8381J6604J6887J9287K0755K1764K5339L0602L3903
$$ 557382 572409 590568 608949 625553 642440 661727 682482 704246 729585 760187 794090
56256G94090L5639L9497M5676N1204N6332O4084P3997Q2649R0010R9075J09609
$$ 794090 829729 869226 914902 966106 1022438 1086522 1160519 1243168 1333178 1432253 1541862
56245A541862J18383J25158J32231J38657J41141J40114J38586J35508J26769
$$ 1541862 1660245 1785403 1917634 2056291 2197432 2337546 2476132 2611640 2738409
56236B738409J12408R6231P8784N7360L2816R599j1161l2038n2766o9796q2590
$$ 2738409 2850817 2947048 3025832 3083192 3116008 3125607 3114446 3082408 3029642 2959846 2877256
56225B877256r3986j04110j10237j12702j14724j16259j14347j09544j05543j02493
$$ 2877256 2783270 2679160 2568923 2456221 2341497 2225238 2110891 2001347 1895804 1793311
56215A793311r7204q9924q4363q0838p6104o9974o5449o2188n6759m9593m4847
$$ 1793311 1696107 1606183 1521820 1440982 1364878 1294904 1229455 1167267 1110508 1060915 1016068
56204A016068m2963m0158l5605l2388l0935k8312k4373k1976k0855j7977j4057
$$ 1016068 973105 932947 897342 864954 834019 805707 781334 759358 738503 720526 706469
56193G06469j2804j3707j2657r679q696r637q441n025l573m610m450k849l250
$$ 706469 693665 679958 667301 657622 648926 639289 630848 625823 622250 617640 613190 610341 607091
56180F07091n175m476j575j186l287k901M54J774L2j91K270L262J865K132M719
$$ 607091 601916 597440 595865 594679 591392 588491 588945 590719 590751 590560 592830 596092 597957 600089 604808
56165F04808N463L891M421P462Q177N897N768R021J0650Q978Q533J1040J2550
$$ 604808 610271 614162 618583 626045 634222 640119 645887 654908 665558 674536 683069 694109 706659
56152G06659J1984J3600J8326K1550K2129K4741L0680L5475L8261M4459N6069
$$ 706659 718643 732243 750569 772119 794248 818989 849669 885144 923405 967864 1023933
56141A023933O8428P9407R2592J08336J20812J27055J29733J28322J17518R7990
$$ 1023933 1092361 1171768 1264360 1372696 1493508 1620563 1750296 1878618 1996136 2094126
56131B094126P9036O6784N8832N3324N2871N5654N3235M2094K8213J6370M649
$$ 2094126 2173162 2239946 2298778 2352102 2404973 2460627 2513862 2555956 2584169 2600539 2605188
56120B605188o811j2437j1605j2514k0722l3155m7427o6515q9373j07361j15705
$$ 2605188 2598377 2585940 2574335 2561821 2541099 2507944 2460517 2394002 2304629 2197268 2081563
56109B081563j18961j20485j16639j06312r5589q7475p7216o3078n1353m5165
$$ 2081563 1962602 1842117 1725478 1619166 1523577 1436102 1358886 1295808 1244455 1199290
56099A199290l8983k9808k3103k1750j9970j4308r927r859q876m237j550l547
$$ 1199290 1160307 1130499 1107396 1085646 1065676 1051368 1041441 1031582 1022706 1018469 1016919 1013372
56087A013372m028M89M121L093K638N985P882N737N519R758J1664Q147O353J0072
$$ 1013372 1009344 1009833 1013954 1017047 1019685 1025670 1033552 1039289 1044808 1054566 1066230 1074377 1080730 1090802
56073A090802J2295Q941O967J0750J3482J0758R507J4342J8152J5781J3991J8105
$$ 1090802 1103097 1112038 1119005 1129755 1143237 1153995 1163502 1177844 1195996 1211777 1225768 1243873
56061A243873K1744J9745J8277K2051K4516K1036J8477K1473K2730J7561J4057
$$ 1243873 1265617 1285362 1303639 1325690 1350206 1371242 1389719 1411192 1433922 1451483 1465540
56050A465540J7849K0982J7287J4378J8486K2158J9418J8132K4342K9326K5814
$$ 1465540 1483389 1504371 1521658 1536036 1554522 1576680 1596098 1614230 1638572 1667898 1693712
56039A693712K2086K6009L0152K7151K4664L0046L5409L3238L1628L8303M4905
$$ 1693712 1715798 1741807 1771959 1799110 1823774 1853820 1889229 1922467 1954095 1992398 2037303
56028B037303M3197M1235M6927N1511M6553M1268M5183M9832M5981M2544M9367
$$ 2037303 2080500 2121735 2168662 2220173 2266726 2307994 2353177 2403009 2448990 2491534 2540901
56017B540901N7565N6584N4434O1110O8614O7633O7083P6370Q5644Q4754Q3773
$$ 2540901 2598466 2655050 2709484 2770594 2839208 2906841 2973924 3050294 3135938 3220692 3304465
56006C304465R3051J01782R8964R5992J04934J14702J13423J13279J26970J41328
$$ 3304465 3397516 3499298 3598262 3694254 3799188 3913890 4027313 4140592 4267562 4408890
55996D408890J41877J41478J55633J72072J75248J77752J95431K15117K20640
$$ 4408890 4550767 4692245 4847878 5019950 5195198 5372950 5568381 5783498 6004138
55987F004138K26466K50316K77470K89197L00617L31424L66038L84126M02705
$$ 6004138 6230604 6480920 6758390 7047587 7348204 7679628 8045666 8429792 8832497
55978H832497M44322M92427N24491N58914O19945O88274P39169P95887Q88727
$$ 8832497 9276819 9769246 10293737 10852651 11472596 12160870 12900039 13695926 14584653
55969A4584653R96932J092110J201166J360183J547276J733584J956601K263797
$$ 14584653 15581585 16673695 17874861 19235044 20782320 22515904 24472505 26736302
55961B6736302K632873L036969L535913M204427N031756O006979P234958Q836747
$$ 26736302 29369175 32406144 35942057 40146484 45178240 51185219 58420177 67256924
55953F7256924J0820312J3211995J6217968K0063955K4817016L0598698L7594712
$$ 67256924 78077236 91289231 107507199 127571154 152388170 182986868 220581580
55946B20581580M5019755M9932251M8101577L7195047J9285787k21534j6275094
$$ 220581580 265601335 315533586 363635163 400830210 420115997 419894463 403619369
55939D03619369k6805178l2400952l4517155l4366782l2817230l0467475k7634494
$$ 403619369 376814191 344413239 309896084 275529302 242712072 212244597 184610103
55932A84610103k4497753k1301744j8313177j5651192j3306275j1283001r603060
$$ 184610103 160112350 138810606 120497429 104846237 91539962 80256961 70653901
55925G0653901q215637p030378o019940n198938m532310l953449l447160l033369
$$ 70653901 62438264 55407886 49387946 44189008 39656698 35703249 32256089 29222720
55917B9222720k691584k376323k086440j849489j655518j470215j296054j159603
$$ 29222720 26531136 24154813 22068373 20218884 18563366 17093151 15797097 14637494
55909A4637494j053613r48353q45961p69806p13303o50292n84141n37936n07032
$$ 14637494 13583881 12635528 11789567 11019761 10306458 9656166 9072025 8534089 8027057
55900H027057m67531m21613l90272l70398l41469l06345k84671k73392k52844
$$ 8027057 7559526 7137913 6747641 6377243 6035774 5729429 5444758 5171366 4918522
55891D918522k25067k08711k02112j87461j65989j54421j51538j41345j24628
$$ 4918522 4693455 4484744 4282632 4095171 3929182 3774761 3623223 3481878 3357250
55882C357250j15474j11294r7585p8422p1860p8182q1314p8424q0268q5673q3221
$$ 3357250 3241776 3130482 3032897 2954475 2882615 2804433 2723119 2644695 2564427 2478754 2395533
55871B395533p5622p5992q2235q0439p1059o7036o8566o4229n4740n1534n3722
$$ 2395533 2319911 2243919 2161684 2081245 2010186 1943150 1874584 1810355 1755615 1704081 1650359
55860A650359m9859m0842l8225m1429l9020l1195k9015l2534l1202k5050k4353
$$ 1650359 1600500 1559658 1521433 1480004 1440984 1409789 1380774 1348240 1317038 1291988 1267635
55849A267635k8975k8659k3362k3087k7928k8032k3107k2591k6590k5726j9951
$$ 1267635 1238660 1210001 1186639 1163552 1135624 1107592 1084485 1061894 1035304 1009578 989627
55838I89627j8702k2153k0863j4491j2635j6328j6547j2000j0957j4257j3594
$$ 989627 970925 948772 927909 913418 900783 884455 867908 855908 844951 830694 817100
55827H17100q052n887q466q459n215o099j1276j2780r940j0432j4797j5198j0884
$$ 817100 809048 803161 794695 786236 781021 774922 763646 750866 740926 730494 715697 700499 689615
55814F89615r675j2598j2146p466o329r998j0686o337l742m719l119K041M123
$$ 689615 679940 667342 655196 647730 641401 631403 620717 614380 610638 605919 602800 604841 608964
55801F08964K004K396O683Q394O076N841Q774Q506L791R88J682J00m789o922n211
$$ 608964 610968 613364 620047 628441 634517 640358 649132 657638 661429 662417 664099 664199 659410 652488 647277
55786F47277n741r431r679n045k463m981p751q717j1744j6510j6900j2463j0170
$$ 647277 641536 632105 622426 617381 614918 609937 602186 593469 581725 565215 548315 535852 525682
55773E25682j1978j1690o861k579o68L314R263J0097L890k388m629o656j0251
$$ 525682 513704 502014 495153 492574 491906 495220 504483 514580 518470 516082 511453 504797 494546
55760D94546j1107q358p614j0527j1511q571p167r513j0201o670m015n108n580
$$ 494546 483439 475081 467467 456940 445429 436858 429691 420178 409977 403307 399292 394184 388604
55747C88604l124k187m877o364l979k145l713m917l271k105l101k653K48Q29k624
$$ 388604 385480 383293 378416 372052 368073 365928 362215 357298 354027 351922 348821 346168 346416 347245 344621
55732C44621n000l480k156l496l673p36Q29j700m343m157m175o277o843m164k520
$$ 344621 339621 336141 333985 330489 326816 326080 326909 325209 320866 316709 312534 306257 299414 295250 292730
55717B92730m284n299k725k41p99j323P45K623K381L093O217P667N164K767L551
$$ 292730 288446 283147 280422 280181 279382 278059 278804 281427 283808 286901 293118 300785 305949 308716 312267
55702C12267M255J849j086k019l134n834o951m997l913o097p798n989l661l744
$$ 312267 316522 318371 317285 315266 312132 306298 299347 294350 290437 284340 276542 270553 266892 263148
55688B63148l939k130r79k352l005n67J873J636J320L313N113M578M248N906O437
$$ 263148 259209 257079 256100 253748 250743 250176 252049 253685 255005 258318 263431 268009 272257 278163 284600
55673B84600L674Q85Q53R71j226l142k394j541k839l634j766k80j828l495k167
$$ 284600 288274 289159 290012 290983 289757 286615 284221 282680 279841 276207 274441 274161 272333 268838 266671
55658B66671m9J9j72J484K729J518N69K388M353L645K443L211L545Q36k319k622
$$ 266671 266622 266641 266469 267953 270682 272200 272769 275157 279510 283155 285598 288809 292354 293190 290871 288249
55642B88249j810k814m275l961l647n495p283o348m658n181o622o448n606n716
$$ 288249 286439 283625 279350 275389 271742 266247 258964 252616 247958 242777 236155 229707 224101 218385
55628B18385n223k783q17j275j717KJ233o27k872k096k43p83k499k338j149j338
$$ 218385 213162 210379 209562 208287 206570 206572 207805 207178 204306 202210 201967 201184 198685 196347 195198 193860
55612A93860j900q30L60n59k067j854j258k194k852j159O43k27j874j267J02p76
$$ 193860 191960 191130 191490 190931 188864 187010 185752 183558 180706 179547 180190 179963 178089 176822 176924 176148
55596A76148k618k367r39j160k287j752l65o96k074j985q37q18j634j527q76q69
$$ 176148 173530 171163 170224 169064 166777 165025 164660 163964 161890 159905 159068 158250 156616 155089 154213 153344
55580A53344n21J251K739K306J722K874L878K477N53R74K672L242L662N810P874
$$ 153344 152823 154074 156813 159119 160841 163715 167593 170070 170623 171597 174269 177511 181173 186983 194857
55565A94857P093M748L643K938L24k835l577k623k798l871l736k950l397m057
$$ 194857 201950 206698 210341 213279 213603 210768 207191 204568 201770 197899 194163 191213 187816 183759
55551A83759k804q30p55j825j569n68r93j992j217N07O75m5Q42K782L251K549
$$ 183759 180955 180125 179370 177545 175976 175408 174415 172423 171206 171713 172388 172343 173185 175967 179218 181767
55535A81767K971M253M244L229L174L703K978J624J514J797L65j794k000o30k14
$$ 181767 184738 188991 193235 196464 199638 203341 206319 207943 209457 211254 211619 209825 207825 207195 206981
55520B06981q08o08j25j371l637m459m111m920o783p566p312p827q654p597m892
$$ 206981 206173 205565 205440 204069 200432 195973 191862 186942 180159 172593 165281 157454 148800 141203 136311
55505A36311k862j828k00J870K702K447K491K190L0k658l067j485o56j213j486
$$ 136311 133449 131621 131421 133291 135993 138440 140931 143121 143151 140493 137426 135941 135285 134072 132586
55490A32586j321k093l388l441k540k333k356r05J256J898J361J771K860K581
$$ 132586 131265 129172 125784 122343 119803 117470 115114 114209 115465 117363 118724 120495 123355 125936
55476A25936J345J516K941L074J405o3p02j772l152l240k209j763j844j014J58
$$ 125936 127281 128797 131738 134812 136217 136154 135452 133680 130528 127288 125079 123316 121472 120458 120616
55461A20616k18j594j612l13nj036j418o14n6O3R37K075J637Jn45L68Q98M96L52
$$ 120616 120398 118804 117192 116879 116874 115838 114420 113806 113750 113813 114750 116825 118462 118463 117918 118286 119184 119680 120032
55442A20032N08r4q94m30N20K0j232q71P29R07n39j080QP64M27M14J050R52P6
$$ 120032 120540 120446 119552 119122 119642 119662 118430 117559 118288 119195 118656 117576 117584 118348 118775 119189 120239 121191 121267
55423A21267j63P2o80j772j117P31J015m41r20L61J143M72J45Q70Q87m60j373
$$ 121267 121104 121176 120496 118724 117607 118338 119353 118912 117992 118353 119496 119968 120113 120983 121870 121410 120037
55406A20037r12m29o23m22L18K05p28o30P28J288L85j31O78J295P44J30K29K82
$$ 120037 119125 118696 118073 117651 117969 118174 117446 116816 117544 118832 119217 119086 119764 121059 121803 121933 122162 122444
55388A22444L2K59O75J9j209j009O25J445O91M1L09L44j87j02N31P6j411j852
$$ 122444 122476 122735 123410 123429 122220 121211 121836 123281 123972 124013 124322 124666 124479 124377 124908 124984 123573 121721
55370A21721p68j35p31q75K22R42K69o81j137j796k502j739M06J604P30o25r96
$$ 121721 120953 120818 120087 119212 119434 120376 120645 119964 118827 117031 114529 112790 113196 114800 115530 114905 113909
55353A13909q08n37K09R62M98o95p46K96M58l99j45J542K174O22r60p94M9K43
$$ 113909 113101 112564 112773 113735 114233 113538 112792 113088 113546 113147 113002 114544 116718 117340 116380 115586 115635 115878
55335A15878L45Q55Q41l3n77l61n55j446j677q04j26j18K72J064P84n89j188n28
$$ 115878 116223 117078 117919 117886 117309 116948 116393 114947 113270 112466 112340 112222 112494 113558 114342 113753 112565 112037
55317A12037k53p80m39J079J705O29k98j4J37n22n99K89M10o42p80O74J379J38
$$ 112037 111784 111004 110565 111644 113349 113978 113680 113666 113803 113281 112682 112971 113381 112739 111959 112633 114012 114150
55299A14150p70L95J756J232l3j87J00l94p55J79J292J079K02q2j39o18p06J83
$$ 114150 113380 113775 115531 116763 116730 116543 116643 116249 115494 115673 116965 118044 118246 118164 118025 117407 116701 116884
55281A16884Q35K26o02m67k0j51k08L83O05l25j376j523j350j384p89P40J704
$$ 116884 117719 117945 117343 116876 116856 116705 116497 116880 117485 117160 115784 114261 112911 111527 110738 111478 113182
55264A13182J132K85M48Q70N30O5K48L17m78j263j026k37K88O30P78J45r12r24
$$ 113182 114314 114599 115047 115917 116447 116512 116760 117077 116599 115336 114310 114073 114361 114991 115769 115914 115002 114078
55246A14078L34J227Q85L65L56Q0n38j59J281J787N72m72KP01L72l9L45M80l36
$$ 114078 114412 115639 116524 116889 117245 117325 116787 116628 117909 119696 120268 119796 119798 120499 120871 120832 121177 121657 121321
55227A21321p90l0N34j89q76k25P20O43K10L81M88q1l91J17K46p36j583j355j031
$$ 121321 120531 120501 121035 120846 119970 119745 120465 121108 121318 121699 122187 122106 121715 121832 122078 121342 119759 118404 117373
55208A17373j276r74L13R70J51n40J5M34l29p95K23J320J162Q38J286J113o23
$$ 117373 116097 115123 115436 116406 116557 116017 116032 116466 116137 115342 115565 116885 118047 118885 120171 121284 120661
55191A20661k067j621o91q55r27L42J324L83q64l64O51J14r47m54O80K55j071
$$ 120661 118594 116973 116282 115427 114500 114842 116166 116549 115685 115321 115972 116086 115139 114685 115365 115620 114549
55174A14549r34O85J941K464L080L297K218Q92Q40J254M68q97j091l13J02L22
$$ 114549 113615 114300 116241 118705 121785 125082 127300 128192 129032 130286 130754 129857 128766 128453 128555 128877
55158A28877J066J307r7j685j380rJ40p73q38M5M00J58L03L71p24j989j609j85
$$ 128877 129943 131250 131153 129468 128088 128079 128219 127446 126608 126653 127053 127211 127514 127885 127161 125172 123563 123378
55140A23378J97m58l94M74N68k65n77r7M6l08k97j12o49j351q58M42R19M49L10
$$ 123378 123575 123117 122723 123197 123765 123500 122923 122826 122872 122564 122267 122155 121506 120155 119297 119739 120658 121107 121417
55121A21417O25K62q66j611j495r03J97J744K485J434j74m53L16O18N00J099K099
$$ 121417 122042 122304 121438 119827 118332 117429 117626 119370 121855 123289 123115 122662 122978 123596 124096 125195 127294
55104A27294K151J274N59P5p26j230o11K53R5l07N28J913K026J042O15Q96O96
$$ 127294 129445 130719 131278 131353 130627 129397 128786 129039 129134 128827 129355 131268 133294 134336 134951 135847 136543
55087A36543J8j93j79o89q77M31K063J926L95m87n54j215k190j793j99O56L99
$$ 136543 136561 136368 136189 135500 134623 135054 137117 139043 139438 138951 138397 137182 134992 133199 133000 133656 134055
55070A34055M22R42P78Q5K80J180J083j41q42o13p15j309j108q3K77l07n26j25
$$ 134055 134477 135419 136197 136282 136562 137742 138825 138684 137842 137229 136514 135205 134097 134014 134291 133984 133458 133333
55052A33333k46r13q03J18M28l6P0P98O22o16j197n44q2m36m08M71Q89J48o66
$$ 133333 133087 132174 131371 131489 131917 131881 131951 132749 133371 132755 131558 131014 130932 130496 130088 130559 131448 131596 130930
55033A30930p51p38j055j070n47j04J76P64J177M85o23n11O10R27J84j4O91P60
$$ 130930 130179 129441 128386 127316 126769 126665 126841 127605 128782 129267 128644 128133 128743 129670 129854 129840 130531 131291
55015A31291k55q14k46P3o20j047j96J035J547J519J290O56l5J56J024J238M82
$$ 131291 131036 130222 129976 130049 129429 128382 128186 129221 130768 132287 133577 134233 134198 134354 135378 136616 137098
54998A37098j72k99n48q07j63R75J045P2j72P58J180K79n80m03j04m57p05l44
$$ 137098 136926 136627 136079 135272 135109 136084 137129 137201 137029 137787 138967 139246 138666 138263 138159 137702 136997 136653
54980A36653k35p95r66l3J136J559J292N72n80j392q42M84R21L59K55P50K89j262
$$ 136653 136418 135623 134657 134624 135760 137319 138611 139183 138603 137211 136369 136853 137774 138133 138388 139138 139427 138165
54962A38165j842m65J164J464J138J263J420J107J042J637J815O49j149k382k708
$$ 138165 136323 135858 137022 138486 139624 140887 142307 143414 144456 146093 147908 148557 147408 145026 142318
54947A42318k195j017k1j8k48N78J647Q56j471k487j160K00q9n35N08J893J833
$$ 142318 140123 139106 139085 139067 138819 139397 141044 141900 140429 137942 136782 136982 136893 136358 136866 138759 140592
54930A40592P93K30K14J95O60K077L503L888L673L804M249M648N288O285O976
$$ 140592 141385 141615 141829 142024 142684 144761 148264 152152 155825 159629 163878 168526 173814 180099 187075
54915A87075P078P162P269O386M152J619m21k358m370n745o267o602o714n773
$$ 187075 194153 201315 208584 214970 219122 220741 220320 217962 213592 207847 201580 194978 188264 182491
54901A82491m182l549l972l662k113j215j979k728k048j163j500k068j296K62
$$ 182491 178309 174760 170788 167126 165013 163798 161819 159091 157043 155880 154380 152312 151016 151278
54887A51278J059R47O87L63o2P8J023J866K117K654L922M876M840M798N573O446
$$ 151278 152337 153284 153971 154334 154272 154350 155373 157239 159356 162010 165932 170808 175648 180446 186019 192465
54871A92465O788P157P461O132K704o92k245k961m500o316o991o699o298n511
$$ 192465 199253 206410 213871 220003 222707 222015 219770 216809 212309 205993 199002 192303 186005 180494
54857A80494m077l230l908m743m051k608k325l200l726l414k902k277j278n39
$$ 180494 176417 173187 169279 164536 160485 157877 155552 152352 148626 145212 142310 140033 138755 138216
54843A38216q67j716j864j103q2Q13J301R36N3o3R37J579P66n61j119j159j246
$$ 138216 137349 135633 133769 132666 132584 133397 134698 135634 135687 135624 136561 138140 138906 138345 137226 136067 134821
54826A34821p79O52J847J672Q43M91L24k14m75n9j11j239j753j78J940K136O92
$$ 134821 134042 134694 136541 138213 139056 139547 139871 139657 139182 139123 139012 137773 136020 135842 137782 139918 140610
54809A40610k30n4Q3r3J74P70Q93P53J116J527R63k76j050j254j403j078K95J822
$$ 140610 140380 140326 140409 140316 140490 141260 142153 142906 144022 145549 146512 146236 145186 143932 142529 141451 141746 143568
54791A43568K189J787J794J863Q26q61j578j175r90j367j255k95O01Q95R85R90
$$ 143568 145757 147544 149338 151201 152027 151166 149588 148413 147423 146056 144801 144506 145107 146002 146987 147977
54775A47977N65j4M5Q44J781K604L300L418K791K462L490N277O435O834P281P699
$$ 147977 148542 148528 148573 149417 151198 153802 157102 160520 163311 165773 169263 174540 180975 187809 195090 202789
54759B02789P265O064M907L700J598j291l768n150n845o323o591o579o157n088
$$ 202789 210054 216118 221025 224725 226323 225032 221264 216114 210269 203946 197355 190776 184619 179531
54745A79531l713l102l629m151l539k252j365r75p30r34j696j963r04N68J035
$$ 179531 175818 172716 169087 164936 161397 159145 157780 156805 156075 155141 153445 151482 150578 151146 152181
54730A52181N92K33J43J14O48K059L317L430L103L503M337M808N360O646P778
$$ 152181 152773 153006 153149 153263 153911 155970 159287 162717 165820 169323 173660 178468 183828 190474 198252
54715A98252P529O324N026K975n11l755m566l709l854n489o634o337n672n184
$$ 198252 205781 212105 217131 220106 219595 215840 211274 207565 203711 198222 191588 185251 179579 174395
54701A74395m104k476j631j908k069j504j110j441j818j752j608j479r57l21m25
$$ 174395 170291 167815 166184 164276 162207 160703 159593 158152 156334 154582 152974 151495 150538 150217 149792
54686A49792j208j706j636j510j261l81O80R02M37L05M91J09o33n87K13N26J35
$$ 149792 148584 146878 145242 143732 142471 142090 142770 143672 144109 144414 144905 145014 144381 143794 144007 144533 144668
54669A44668J53Q69J175N34k81p70j289j702j202K3O28Q0o59q27p69p49l70L37
$$ 144668 144821 145690 146865 147399 147118 146348 145059 143357 142155 142178 142806 142886 142227 141400 140631 139882 139512 139849
54651A39849O64M38K44K39J3j91L79J438J714Q46j58n71o69p13n68n06r74j492
$$ 139849 140513 140951 141195 141434 141447 141256 141635 143073 144787 145633 145475 144904 144235 143522 142954 142448 141474 139982
54633A39982j159k94N4R7J050K728L289J888p8r88p74k41O9j03o20o23N41J967
$$ 139982 138823 138529 138583 138680 139730 142458 145747 147635 147557 146569 145795 145554 145623 145520 144900 144277 144818 146785
54615A46785K107J032K38K72K14m24j034j345j789k148j555k08O22N74N98J055
$$ 146785 148892 149924 150162 150434 150648 150224 149190 147845 146056 143908 142353 142145 142767 143341 143939 144994
54599A44994J164O80M22O50N97R0n8L06K80l96q49p63q67j306j229m29J96L65
$$ 144994 146158 146838 147260 147910 148507 148597 148539 148845 149125 148729 147880 147117 146250 144944 143715 143286 143482 143847
54581A43847P91J425J197P7m11L94J196Q51n2n42o19m88j8L20m15j778j957m19
$$ 143847 144638 146063 147260 147337 146926 147320 148516 149367 149315 148773 148154 147666 147648 147968 147553 145775 143818 143399
54563A43399J081J100L94K26M47M54N26R61J127N36j89l82k51k0O08J414J425
$$ 143399 144480 145580 145974 146200 146647 147101 147627 148588 149715 150251 150062 149680 149429 149409 150017 151431 152856
54546A52856N01k01o8J80J62O69J843K327J379K66K64P53O91N55J213K067J881
$$ 152856 153357 153156 153088 153268 153430 154099 155942 158269 159648 159914 160178 160931 161622 162177 163390 165457 167338
54529A67338P24l50q84j100j126j069j320j861k013j466q01l93J03O16L23q00
$$ 167338 168062 167712 166828 165728 164602 163533 162213 160352 158339 156873 156072 155679 155782 156398 156721 155921
54513A55921j376n60N82P08M2m01l80j77K62Q48R38K59n19q63j093j375j154l15
$$ 155921 154545 153985 154567 155275 155317 154916 154536 154359 154621 155469 156407 156666 156147 155284 154191 152816 151662 151347
54495A51347L16L39M61R71R62k0q78o27J22L74K77L38L48J64L76J079J257M55
$$ 151347 151663 152002 152463 153434 154396 154376 153498 152871 152993 153367 153644 153982 154330 154494 154870 155949 157206 157661
54477A57661k13J09O01M12K45Q23J215M59l94K15J740K355J717J080J078J150
$$ 157661 157448 157557 158158 158570 158815 159638 160853 161312 160918 161133 162873 165228 166945 168025 169103 170253
54461A70253Q66M19l8l55p8P73J200M91o03j019r80j227j542j313r01j029j367
$$ 170253 171119 171538 171500 171145 171067 171840 173040 173531 172928 171909 170929 169702 168160 166847 165946 164917 163550
54444A63550j114m80k90n36o27n99q45j010m23O75J407J506J266P38l2m55j08
$$ 163550 162436 161956 161666 161130 160503 159904 159059 158049 157626 158301 159708 161214 162480 163218 163186 162731 162623
54427A62623M65N73M86P55J121J100J000J275J504J113N02L65M70K78O7K81M34
$$ 162623 163088 163661 164147 164902 166023 167123 168123 169398 170902 172015 172517 172882 173352 173630 173697 173978 174412
54410A74412r6p79p38k10J2K9L66P17M94J08K67N30P2o03l30O71J049M96M6K06
$$ 174412 174316 173537 172799 172589 172601 172630 172996 173713 174207 174315 174582 175112 175184 174581 174251 174922 175971 176467 176513 176719
54390A76719L12o0l94k09K96P78J012O46l66j219j105m60l30p52q24l14Q0N7J31
$$ 176719 177031 176971 176577 176368 176664 177442 178454 179100 178734 177515 176410 175950 175620 174868 174044 173730 173810 173867 173998
54371A73998O11J189J712K389L029L009K316J795K072K763K989K355J280O63J028
$$ 173998 174609 175798 177510 179899 182928 185937 188253 190048 192120 194883 197872 200227 201507 202170 203198
54356B03198J794J751O03n82r03q54j354k192k472k061j646j671k081k767l463
$$ 203198 204992 206743 207346 206764 205861 205007 203653 201461 198989 196928 195282 193611 191530 188763 185300
54341A85300l539k735j753j353j302r88n07k68o8M39P92L04p12j293j136o66j58
$$ 185300 181761 179026 177273 175920 174618 173630 173123 172855 172787 173226 174018 174322 173610 172317 171181 170515 170357
54324A70357L92P78Q81J100J662J918J185q8q77q87n32m0M43M40k25p98n93j25
$$ 170357 170749 171527 172408 173508 175170 177088 178273 178185 177308 176421 175889 175849 176292 176732 176507 175709 175116 174991
54306A74991l22j073j642j888k059j814p53M49P54K94M9K59L38J78K70O09O11
$$ 174991 174669 173596 171954 170066 168007 166193 165440 165889 166643 166937 166986 167245 167583 167761 168031 168640 169251
54289A69251J29l85o60o70j71R26J930K073J600J261J051M41m34q90p81n32k29
$$ 169251 169380 168995 168335 167665 167494 168420 170350 172423 174023 175284 176335 176776 176342 175452 174671 174139 173910
54272A73910L83J155J649J781J603Q83l44j229j079l86m4n5O5K21J65L23J076
$$ 173910 174293 175448 177097 178878 180481 181364 181020 179791 178712 178326 178282 178227 178292 178513 178678 179001 180077
54255A80077J735J515R49J048J586J498O33k24o85q72o54j7L03j83o24r3O86M19
$$ 180077 181812 183327 184276 185324 186910 188408 189041 188817 188132 187260 186606 186589 186892 186709 186085 185992 186678 187097
54237A87097n91j056r90j489k483k676j686m60M84J498K368K244J204L51P7k64
$$ 187097 186506 185450 184460 182971 180488 177812 176126 175666 176150 177648 180016 182260 183464 183815 183892 183628
54221A83628p94q20l23k05p00r74o09j74J3L41Q89J154J093J121J014J04j290
$$ 183628 182834 182014 181691 181486 180786 179812 179203 179029 179042 179383 180272 181426 182519 183640 184654 184758 183468
54204A83468k028j830j472j166l51Q33J379J141J105J598J733J058L34P8k03p93
$$ 183468 181440 179610 178138 176972 176621 177454 178833 179974 181079 182677 184410 185468 185802 185880 185677 184884
54188A84884j076p28l25k44o7L56M95K13J77O53J004Q79P78J035J236J123J010
$$ 184884 183808 183080 182755 182511 182444 182800 183295 183508 183685 184338 185342 186221 186999 188034 189270 190393 191403
54171A91403R75O35O0j08K10L80K34K33L00k72j384j955j553r79q58q66q12j112
$$ 191403 192378 193013 193073 192965 193175 193555 193789 194022 194322 194050 192666 190711 189158 188179 187321 186455 185643 184531
54153A84531j729j807j011r8K95M29O12N96K60j16m88j051j443j088l58j85n01
$$ 184531 182802 180995 179984 179886 180181 180610 181222 181818 182078 181962 181474 180423 178980 177892 177534 177349 176848
54136A76848m19L7J1l77p0Q58J084L57k9L60L19n91j005j74N49M5n88R0J464K004
$$ 176848 176429 176466 176477 176100 176030 176888 177972 178329 178300 178660 178979 178388 177383 177209 177758 177803 177215 177305 178769 180773
54116A80773J587J160J102J242J577J850J295Jn59M80J904K137J445J076J228
$$ 180773 182360 183520 184622 185864 187441 189291 190586 190587 190028 190508 192412 194549 195994 197070 198298
54101A98298J304J408K045K902L294L473M223N419O065N509L826J353j320l282
$$ 198298 199602 201010 203055 205957 209251 212724 216947 222366 228431 233940 237766 239119 237799 234517
54087B34517m052m083l981l750l269k818k512j964j125o68q64r34k93N07R24J536
$$ 234517 230465 226382 222401 218651 215382 212564 210052 208088 206963 206295 205431 204497 204204 204711 205635 207171
54071B07171K937M300M342L238K334K256K340J868R30J6o07r58j214j457j547
$$ 207171 210108 214408 218750 221988 224322 226578 228918 230786 231716 231732 231125 230167 228953 227496 225949
54056B25949j359j107j029r01m79k37p64j610j771j241q09m20Q10K692L781L553
$$ 225949 224590 223483 222454 221553 221074 220837 220073 218463 216692 215451 214642 214222 215032 217724 221505 225058
54040B25058L222L726M390M428M234M349M428M283M562N435N869N212M333M156
$$ 225058 228280 232006 236396 240824 245058 249407 253835 258118 262680 268115 273984 279196 283529 287685
54026B87685M263L979L617L526L143K121J271J218J206M34n48r44j051j345j421
$$ 287685 291948 295927 299544 303070 306213 308334 309605 310823 312029 312463 311915 310971 309920 308575 307154
54011C07154j126j525l262n058n379m614m168m316m466m551m645m082k539j208
$$ 307154 306028 304503 301241 296183 290804 286190 282022 277706 273240 268689 264044 259962 257423 256215
53997B56215j287k158k526k454k643k624j606l80m40j581k277k024j645j573j511
$$ 256215 254928 252770 250244 247790 245147 242523 240917 240537 240097 238516 236239 234215 232570 230997 229486
53982B29486j511j749j595n16M76K0j272j554n50K49J26l9M04R82J370J851K264
$$ 229486 227975 226226 224631 224115 224591 224611 223339 221785 221235 221484 221610 221571 221975 222957 224327 226178 228442
53965B28442J959J221J265K395L529L959M361N561P478R734J2194J4329J4863
$$ 228442 230401 231622 232887 235282 238811 242770 247131 252692 260170 269904 282098 296427 311290
53952C11290J2727P984J903l497o347o382n433n500o457o578n086k988j411l94
$$ 311290 324017 332001 333904 330407 324060 317678 312245 306745 300288 293710 288624 285636 284225 283831
53938B83831M37J090J491J796K055K121J964J629J043L74K51R82J963K532K918
$$ 283831 284268 285358 286849 288645 290700 292821 294785 296414 297457 297831 298082 299064 301027 303559 306477
53923C06477L542L982L644K925K651K829L104L827N363O832P067O509O637P635
$$ 306477 310019 314001 317645 320570 323221 326050 329154 332981 338344 345176 352243 358752 365389 373024
53909C73024Q205P624O474N287L920K485J476P12n71k263l220k868j915j199r13
$$ 373024 381229 388853 395327 400614 404534 407019 408495 409207 408636 406373 403153 400285 398370 397171 396258
53894C96258j140k084l462m611n392o137o728o714o338o351o756o786o203n596
$$ 396258 395118 393034 389572 384961 379569 373432 366704 359990 353652 347301 340545 333759 327556 321960
53880C21960n313n096m803m496l888k799j991k335l300l593l179l196l860m098
$$ 321960 316647 311551 306748 302252 298364 295565 293574 291239 287939 284346 281167 277971 274111 270013
53866B70013l500l043l304l522k966k005j199n82l18q60j864k194j602j230j796
$$ 270013 266513 263470 260166 256644 253678 251673 250474 249892 249574 248714 246850 244656 243054 241824 240028
53851B40028k437k151j293q42j027j423j685j482m73J062K194K423K110J565O15
$$ 240028 237591 235440 234147 233305 232278 230855 229170 227688 227215 228277 230471 232894 235004 236569 237184
53836B37184n82j247j105q99j134j231n48M77R73Q09N02M23O14R21R21K09q97
$$ 237184 236602 235355 234250 233351 232217 230986 230438 230915 231888 232697 233199 233622 234236 235157 236078 236287 235390
53819B35390j460j031q3Q32J650K309K466K063J574J351J333J524K057K630K697
$$ 235390 233930 232899 232816 233648 235298 237607 240073 242136 243710 245061 246394 247918 249975 252605 255302
53804B55302K437K611L290L669L486L518M263N083N272N030M770M277L377K648
$$ 255302 257739 260350 263640 267309 270795 274313 278576 283659 288931 293961 298731 303008 306385 309033
53790C09033K714L295L594L274K610K017J803J941J885J062l02j459k263l208
$$ 309033 311747 315042 318636 321910 324520 326537 328340 330281 332166 333228 332926 331467 329204 325996
53776C25996m292m784m500m199m316m301l822l583m160m877m751l940l378l410
$$ 325996 321704 316920 312420 308221 303905 299604 295782 292199 288039 283162 278411 274471 271093 267683
53762B67683l579l458l049k534k143k079k195k009j363p31n65p29q12o78m17j41
$$ 267683 264104 260646 257597 255063 252920 250841 248646 246637 245274 244543 243978 243249 242437 241759 241342 241201
53746B41201p4m67j209j782j803j270l71N66J003O63j0l39k70j87q3L16Q51J164
$$ 241201 241127 240660 239451 237669 235866 234596 234225 234791 235794 236457 236447 236108 235838 235651 235568 235884 236735 237899
53728B37899J474K154K679K122P34j37K15J169J948K346K180J290L48L60J152
$$ 237899 239373 241527 244206 246328 247062 246925 247140 248309 250257 252603 254783 256073 256421 256781 257933
53713B57933J512J170J227K174K954K698K071K006K299K370K405K768L115L003
$$ 257933 259445 260615 261842 264016 266970 269668 271739 273745 276044 278414 280819 283587 286702 289705
53699B89705K697K654K836L074L371L466K972K320K489L366L605K630J515J098
$$ 289705 292402 295056 297892 300966 304337 307803 310775 313095 315584 318950 322555 325185 326700 327798
53685C27798P12l31j314j417j167j342j476q54n4q9o86q62n75n11p55r01j062
$$ 327798 328510 328179 326865 325448 324281 322939 321463 320609 320555 320466 319780 318918 318343 317832 317077 316176 315114
53668C15114j498j724j159k45J75J90L57M43j09q20o73J67M67k17r58q93k13M13
$$ 315114 313616 311892 310733 310488 310663 310853 311210 311653 311544 310724 310051 310218 310685 310468 309510 308617 308404 308817
53650C08817O33M11q4n00o10n30l43J71R77J475J405J510K459L611L748K762J656
$$ 308817 309450 309861 309777 309277 308667 308137 307794 307965 308942 310417 311822 313332 315791 319402 323150 325912 327568
53633C27568J126J061J297J917K756L329L453L418L615M236N121N598M981L566
$$ 327568 328694 329755 331052 332969 335725 339054 342507 345925 349540 353776 358897 364495 369476 373042
53619C73042K574K603K857K565K321L068M382M968M446L606L089K889K996L479
$$ 373042 375616 378219 381076 383641 385962 389030 393412 398380 402826 406432 409521 412410 415406 418885
53605D18885L954L839L201K702K720L119L687M147L978K895J395K23m97j052j466
$$ 418885 422839 426678 429879 432581 435301 438420 442107 446254 450232 453127 454522 454745 454248 453196 451730
53590D51730j644j809k188k580k799l024l132k493j214p36k017l816m165k984
$$ 451730 450086 448277 446089 443509 440710 437686 434554 432061 430847 430111 428094 424278 420113 417129
53576D17129j820j428j215r60j279k144k515j965j346j286j216n51J67J32m77
$$ 417129 415309 413881 412666 411706 410427 408283 405768 403803 402457 401171 399955 399404 399571 399703 399226
53561C99226q26n38J19Q06J276J301P76q8p84p39K99J740K430J888J004Q79J293
$$ 399226 398400 397862 397981 398787 400063 401364 402140 402052 401268 400529 400828 402568 404998 406886 407890 408769 410062
53544D10062J197M96K96J221K497L069K952L020L863N218O297O548O313O538P588
$$ 410062 411259 411755 412051 413272 415769 418838 421790 424810 428673 433891 440188 446736 453049 459587 467175
53529D67175Q636Q732Q155Q025Q780R839J0674J1369J2085J2683J3108J3489J3844
$$ 467175 475811 484543 492698 500723 509503 519342 530016 541385 553470 566153 579261 592750 606594
53516F06594J4204J5007J6668J8796K0487K1474K2322K3409K4434K5035K5262
$$ 606594 620798 635805 652473 671269 691756 713230 735552 758961 783395 808430 833692
53505H33692K5263K5153K5205K5584K5826K5241K3893K2495K1339K0121J8861
$$ 833692 858955 884108 909313 934897 960723 985964 1009857 1032352 1053691 1073812 1092673
53494A092673J8127J8073J8123J7947J7959J8360J8473J7708J6629J6377J7265
$$ 1092673 1110800 1128873 1146996 1164943 1182902 1201262 1219735 1237443 1254072 1270449 1287714
53483A287714J8493J9077J8709J7785J6985J6651J6414J5613J4080J2280J0516
$$ 1287714 1306207 1325284 1343993 1361778 1378763 1395414 1411828 1427441 1441521 1453801 1464317
53472A464317Q483N853K987N53j436l655o460r193j0866j1441j1964j3194j4470
$$ 1464317 1472800 1478653 1481640 1482193 1480757 1477102 1470642 1461449 1450583 1439142 1427178 1413984 1399514
53459A399514j4563j3504j2833j3801j6004j8192j9767k0851k1453k1385k0867
$$ 1399514 1384951 1371447 1358614 1344813 1328809 1310617 1290850 1269999 1248546 1227161 1206294
53448A206294k0413k0172j9904j9531j9189j8688j7515j5406j2633r737p310n801
$$ 1206294 1185881 1165709 1145805 1126274 1107085 1088397 1070882 1055476 1042843 1033106 1025796 1019995
53436A019995n157m713l851k620j465n66K07R86J884L075M462N597O325P104Q353
$$ 1019995 1014838 1010125 1006274 1003654 1002189 1001623 1001830 1002816 1004700 1007775 1012237 1017834 1024159 1031263 1039616
53421A039616R862J1323J2908J4745J6334J7234J7881J9017K0679K2459K4343
$$ 1039616 1049478 1060801 1073709 1088454 1104788 1122022 1139903 1158920 1179599 1202058 1226401
53410A226401K6445K8386K9781L1030L2678L4317L5169L5490L6330L8048M0168
$$ 1226401 1252846 1281232 1311013 1342043 1374721 1409038 1444207 1479697 1516027 1554075 1594243
53399A594243M2507M5270M8012M9871N0933N2240N4043N5293N5293N4819N4917
$$ 1594243 1636750 1682020 1730032 1779903 1830836 1883076 1937119 1992412 2047705 2102524 2157441
53388B157441N5448N5498N4648N3168N1421M9641M8004M6440M4539M1884L8367
$$ 2157441 2212889 2268387 2323035 2376203 2427624 2477265 2525269 2571709 2616248 2658132 2696499
53377B696499L4129K9490K4902K0667J6728J2969R395N640P41n835j3252k0157
$$ 2696499 2730628 2760118 2785020 2805687 2822415 2835384 2844779 2850419 2851160 2845325 2832073 2811916
53365B811916k6306l2472l8876m4639m8878n1485n2748n3003n2854n2935n3230
$$ 2811916 2785610 2753138 2714262 2669623 2620745 2569260 2516512 2463509 2410655 2357720 2304490
53354B304490n3174n2509n1378m9733m7420m4869m2884m1683m0909m0484m0555
$$ 2304490 2251316 2198807 2147429 2097696 2050276 2005407 1962523 1920840 1879931 1839447 1798892
53343A798892m0640l9879l8261l6629l5262l3520l1096k8592k6449k4305k1838
$$ 1798892 1758252 1718373 1680112 1643483 1608221 1574701 1543605 1515013 1488564 1464259 1442421
53332A442421j9354j7056j4610j1944r741q683q834j0022j2041j4153j5255j5016
$$ 1442421 1423067 1406011 1391401 1379457 1369716 1361033 1352199 1342177 1330136 1315983 1300728 1285712
53320A285712j4167j3345j2466j1553j1164j1419j1413j0286q221n899l641j673
$$ 1285712 1271545 1258200 1245734 1234181 1223017 1211598 1200185 1189899 1181678 1175779 1172138 1170465
53308A170465m50l7K74J138K386L592M839O383Q107R778J1438J3161J4886J6841
$$ 1170465 1170015 1169978 1170252 1171390 1173776 1177368 1182207 1188590 1196697 1206475 1217913 1231074 1245960 1262801
53294A262801J9424K2372K4671K5814K6426K7122K7473K6725K4975K2968K1229
$$ 1262801 1282225 1304597 1329268 1355082 1381508 1408630 1436103 1462828 1487803 1510771 1532000
53283A532000J9979J9322J8941J7940J5720J2541Q965N230J615j312l508n812
$$ 1532000 1551979 1571301 1590242 1608182 1623902 1636443 1645408 1650638 1652253 1650941 1647433 1641621
53271A641621q842j1988j4367j6208j8364k0832k2753k3807k4686k6032k7595
$$ 1641621 1632779 1620791 1606424 1590216 1571852 1551020 1528267 1504460 1479774 1453742 1426147
53260A426147k8635k8793k8373k8071k8374k9122k9631k9386k8477k7312k6261
$$ 1426147 1397512 1368719 1340346 1312275 1283901 1254779 1225148 1195762 1167285 1139973 1113712
53249A113712k5619k5510k5595k5287k4440k3490k2832k2511k2501k2672k2440
$$ 1113712 1088093 1062583 1036988 1011701 987261 963771 940939 918428 895927 873255 850815
53238H50815k1228j9493j8410j8203j7658j5805j3169j0768q767o966n801n747
$$ 850815 829587 810094 791684 773481 755823 740018 726849 716081 707314 700348 694547 688800
53226F88800o325o756p194q263r671j0377j0140r901j0517j1913j3512j4778j5207
$$ 688800 682475 675719 668525 660262 650591 640214 630074 620173 609656 597743 584231 569453 554246
53213E54246j4525j3150j1936j1202j0499r477q501q091q095p879p159o400o228
$$ 554246 539721 526571 514635 503433 492934 483457 474956 466865 458770 450891 443732 437332 431104
53200D31104o615o878o546o038o149p004p886q126p731p004o101n226m825n175
$$ 431104 424489 417611 411065 405027 398878 391874 383988 375862 368131 361127 355026 349800 344975 339800
53186C39800n963o551o545n964n073m282l859l616l090k177j353j098j371j743
$$ 339800 333837 327286 320741 314777 309704 305422 301563 297947 294857 292680 291327 290229 288858 287115
53172B87115j828j478q60m44n63r48r38k69N78Q63K24j031k067k156j519j167
$$ 287115 285287 283809 282949 282505 281942 280994 280056 279787 280365 281228 281452 280421 278354 276198 274679 273512
53156B73512j555j894j389o05n83j153j314j014j077j462j126J33J172J268J000
$$ 273512 271957 270063 268674 268069 267486 266333 265019 264005 262928 261466 260340 260473 261645 262913 263913
53141B63913Q79M99l23q89q75r56j395j259m6J245J682J832K355K430J092p50
$$ 263913 264792 265291 264968 264079 263204 262248 260853 259594 259548 260793 262475 264307 266662 269092 270184 269434
53125B69434j316m24N77R04R33R80R25R73J465K014J976J627J772K247K057J046
$$ 269434 268118 267694 268271 269175 270108 271088 272013 272986 274451 276465 278441 280068 281840 284087 286144 287190
53109B87190K16J61K59k02r69j427j515j616j907k205k262k043j764j600j335
$$ 287190 287406 287567 287826 287624 286655 285228 283713 282097 280190 277985 275723 273680 271916 270316 268981
53094B68981o43K23N22J32j59J74N67L90L0J05K50k63j111j244n00J51l9q05j482
$$ 268981 268338 268561 269083 269215 269056 269230 269797 270187 270217 270322 270572 270309 269198 267954 267454 267605 267566 266761 265279
53075B65279j680j330o70k00j59k05RK07pm02n39n52q22j142j003m86j40j17j13
$$ 265279 263599 262269 261599 261399 261240 261035 261044 261251 261244 260842 260303 259751 258929 257787 256784 256298 256158 256041 255928
53056B55928K3K15N25R43J079O48J2k89k32O2P64J743K063J116k60p57l78j68
$$ 255928 255951 256166 256691 257634 258713 259361 259373 259084 258852 258914 259678 261421 263484 264600 264340 263583 263205 263037
53038B63037n05q15q33r60j339j581j519j335r72l05K01j7m68k5J358K372K057
$$ 263037 262532 261717 260884 259924 258585 257004 255485 254150 253178 252873 253074 253057 252589 252564 253922 256294 258351
53021B58351R00j3j80K58R00J254J077O86N45O03N37M32N38O04K22l49n48m94
$$ 258351 259251 259238 259058 259316 260216 261470 262547 263233 263778 264381 264918 265350 265888 266492 266714 266365 265817 265323
53003B65323o89q70k64R87J707J284L90j42l36n79q87r55n71K31J023J161O22
$$ 265323 264634 263764 263500 264487 266194 267478 267868 267726 267390 266811 265924 264969 264398 264629 265652 266813 267435
52986B67435L50J064K035K052J295J081J799K421K204J718J732K131K347K127
$$ 267435 267785 268849 270884 272936 274231 275312 277111 279532 281736 283454 285186 287317 289664 291791
52972B91791J469N31j34j8M98N53J63K27J016J630J353O31K13J17m4l98q36j209
$$ 291791 293260 293791 293657 293639 294137 294690 294853 295080 296096 297726 299079 299710 299923 300040 299996 299598 298762 297553
52954B97553j249q68o48j287k485l155k858k175j555q48j92k26r48j385r36k48
$$ 297553 296304 295436 294788 293501 291016 287861 285003 282828 281273 280425 280233 280007 279059 277674 276738 276490
52938B76490j65o05j039j327j529j504j240r80o83k9P36P89l8p96p12j38K46M10
$$ 276490 276325 275720 274681 273354 271825 270321 269081 268101 267418 267389 268125 268914 268876 268080 267368 267230 267476 267886
52920B67886O09O97M90J87m8l83p18n16K99R41P87J40m36r10j307j272p01j35
$$ 267886 268495 269192 269682 269869 269821 269438 268720 268204 268503 269444 270231 270371 269935 269025 267718 266446 265745 265610
52902B65610O0K54O93Q32K40n06o76m92n72p49m46J62L53L0j06M10J224J698J569
$$ 265610 265670 265924 266617 267449 267689 267183 266507 266015 265443 264694 264248 264410 264763 264793 264687 265097 266321 268019 269588
52883B69588J130R29J170J303N70r24k143k357j780q38M27J791K527K319J910
$$ 269588 270718 271647 272817 274120 274690 273766 271623 269266 267486 266648 267075 268866 271393 273712 275622
52868B75622K097K647K838K570K232J973J760J791K092K089J293R8p15r56r79
$$ 275622 277719 280366 283204 285774 288006 289979 291739 293530 295622 297711 299004 299102 298387 297431 296452
52853B96452j036j315k101l211l763l269k527k607l284l499l016k565k434k113
$$ 296452 295416 294101 292000 288789 285026 281757 279230 276623 273339 269840 266824 264259 261825 259712
52839B59712j425j000j238j663j714j524j439j308p59O2O25P38P97J224J898K251
$$ 259712 258287 257287 256049 254386 252672 251148 249709 248401 247642 247704 248329 249067 249864 251088 252986 255237
52823B55237J911J095K81l17p91j136j244j228j350j480j098r1Q86J176R57R60
$$ 255237 257148 258243 258524 258207 257416 256280 255036 253808 252458 250978 249880 249789 250675 251851 252808 253768
52807B53768J543K331K660K146J010p0o03q12j273k073k702k802k512j994j216
$$ 253768 255311 257642 260302 262448 263458 263388 262785 261973 260700 258627 255925 253123 250611 248617 247401
52792B47401l90Jj18k31L1L87M12K4o80j483j757r18N72J395J019L73L99P68P13
$$ 247401 247011 247012 246894 246663 246694 247081 247493 247517 246837 245354 243597 242679 243251 244646 245665 246038 246437 247205 247918
52773B47918K89Mj74n11o76j56P59J220Q66l7j177k247k685k134j018o8N12Q66
$$ 247918 248207 248211 248037 247526 246850 246694 247453 248673 249539 249502 248325 246078 243393 241259 240241 240173 240685 241551
52755B41551Q87M78J16L66R74J226J063J090J559K077K304K299K124J734J358
$$ 241551 242438 242916 243032 243398 244372 245598 246661 247751 249310 251387 253691 255990 258114 259848 261206
52740B61206J391J788K020J774J334J197J496J860J709Q50r0j58P40J566J395
$$ 261206 262597 264385 266405 268179 269513 270710 272206 274066 275775 276625 276535 276377 277117 278683 280078
52725B80078N03j62j87J30L93L09l61j446k245k260j833j554j394j007n07l40
$$ 280078 280581 280419 280232 280362 280755 281064 280703 279257 277012 274752 272919 271365 269971 268964 268457 268117
52709B68117n38o99n09P5Q59J223M68j066j929j272k1N54O11J000J423R05l22
$$ 268117 267579 266880 266371 266446 267305 268528 268996 267930 266001 264729 264708 265262 265873 266873 268296 269201 268879
52692B68879j032j041j367k158k142p91N26N38m5K18J234J606P03n83j114o58
$$ 268879 267847 266806 265439 263281 261139 260348 260874 261412 261367 261585 262819 264425 265128 264545 263431 262773
52676B62773K46R52J139Q60L10m33j262j701j209LR62J051O72N41P05P90P66Q64
$$ 262773 263019 263971 265110 265970 266280 265847 264585 262884 261675 261678 262640 263691 264363 264904 265609 266399 267165 268029
52658B68029R65O67Q1j2R88K717M136M544M091L285K285R83l22q47l44K60j66
$$ 268029 268994 269661 269742 269730 270718 273435 277571 282115 286206 289491 291776 292759 292437 291590 291246 291506 291340
52641B91340j474k429k412k143k382k678k079o77M44O60M83N67Q13Q55Q60J281
$$ 291340 289866 287437 285025 282882 280500 277822 275743 275066 275510 276170 276653 277220 278033 278888 279748 281029
52625B81029J989K357K123J588R17j34j488k366k134j196m89l92n57n75k77L41
$$ 281029 283018 285375 287498 289086 290003 289869 288381 286015 283881 282685 282196 281804 281247 280672 280395 280736
52609B80736R37P62m59j804j990r37L26J137J711K138J992J261O58N28L22l55
$$ 280736 281673 282435 281976 280172 278182 277245 277571 278708 280419 282557 284549 285810 286468 286996 287318 286963
52593B86963j025j184j103j157j107p27m26n67p72n59q6L62R64J743K050J493
$$ 286963 285938 284754 283651 282494 281387 280660 280234 279667 278895 278336 278250 278612 279576 281319 283369 284862
52577B84862O83L25J95r2m7Q07J679J410K63m83m66m70q53j012o20j81j41k71
$$ 284862 285545 285870 286065 285973 285926 286733 288412 289822 290085 289602 289136 288666 287813 286801 286181 286000 285859 285588
52559B85588k92l09l92l41n5K87M82L24l78j340j728j181m82m67p57m28M82J198
$$ 285588 285296 284987 284595 284254 284199 284486 284968 285292 284914 283574 281846 280665 280183 279716 278959 278531 279013 280211
52541B80211J533J748J507L61r25j024p8M06j24o05l63j93p74j377j050K8J164
$$ 280211 281744 283492 284999 285360 284435 283411 283333 283739 283615 283010 282647 282454 281680 280303 279253 279281 280445
52524B80445K119K729K487J423N45N27P18L19k51j30M45N39J15J65J301L057M566
$$ 280445 282564 285293 287780 289203 289748 290275 290993 291312 291061 290931 291376 291915 292030 292195 293496 296553 301119
52507C01119N324N237M468L361K198J021j52j160j932k588l116l268l067l002
$$ 301119 306443 311680 316148 319509 321707 322728 322576 321416 319484 316896 313780 310512 307445 304443
52493C04443l356l671l294k204r98k43j44o04j246j546j289p71m51m93p32q62
$$ 304443 301087 297416 294122 291918 290920 290677 290533 289929 288683 287137 285848 285077 284626 284133 283401 282539
52477B82539n85J47R40J359J519J911K527K670J835M34o07o56K73J640K700L028
$$ 282539 281954 282101 283041 284400 285919 287830 290357 293027 294862 295296 294689 294033 294306 295946 298646 301674
52461C01674K878K785K806K644K321K111J737N12j452k920k982k219j859k258
$$ 301674 304552 307337 310143 312787 315108 317219 318956 319468 318016 315096 312114 309895 308036 305778
52447C05778k803k981k877k763k663k379j759r33l64l46m77j9J002J575R12n75
$$ 305778 302975 299994 297117 294354 291691 289312 287553 286620 286256 285910 285433 285414 286416 287991 288903 288328
52431B88328j863k485k614k330j511l95L45L23m5kO84J485J785J613J526J794
$$ 288328 286465 283980 281366 279036 277525 277130 277475 277798 277753 277751 278435 279920 281705 283318 284844 286638
52415B86638K041J801J136L85k86p09l41J251L701O105Q030R680J1185J2154J2021
$$ 286638 288679 290480 291616 292001 291715 291006 290665 291916 295617 301722 309752 319432 330617 342771 354792
52400C54792J0412P275L151p95l531m992n737o016n767n271m957m612l621k084
$$ 354792 365204 372479 375630 374835 371304 366312 360575 354559 348792 343521 338564 333952 330331 328247
52386C28247q24k53o3j74r15j939k022o14J213K045J812J541J944K864L804M419
$$ 328247 327423 327170 327107 326933 326018 324079 322057 321443 322656 324701 326513 328054 329998 332862 336666 341085
52370C41085M663M775N018N290N244M805M174L304J911J28j428k362k731k538
$$ 341085 345748 350523 355541 360831 366075 370880 375054 378358 380269 380397 378969 376607 373876 371338
52356C71338j656m56K62J58l48q10j098r42j4J293K057K074K063K362K428K082
$$ 371338 369682 369226 369488 369646 369298 368488 367390 366448 366434 367727 369784 371858 373921 376283 378711 380793
52340C80793K120L026M039M337M280M622N212N466N476N777O444P363Q867J1132
$$ 380793 382913 385939 389978 394315 398595 403217 408429 413895 419371 425148 431592 438955 447822 458954
52326D58954J3316J4331J4356J4672J6016J7823J9124J9541J9290J8735J8152
$$ 458954 472270 486601 500957 515629 531645 549468 568592 588133 607423 626158 644310
52315F44310J7697J7459J7554J7966J8354J8369J8250J8544J9242J9697J9583
$$ 644310 662007 679466 697020 714986 733340 751709 769959 788503 807745 827442 847025
52304H47025J9187J8662J7811J6880J6673J7321J7836J7380J6241J4884J3023
$$ 847025 866212 884874 902685 919565 936238 953559 971395 988775 1005016 1019900 1032923
52293A032923J0247O920L647N19k416m695o181p486q880r605r178q478q457q619
$$ 1032923 1043170 1050090 1053737 1054256 1051840 1047145 1040964 1033478 1024598 1014993 1005815 997337 988880 980261
52279I80261p974o771n907n222l852j938m39N84K020M059N848O935P848Q965R974
$$ 980261 972287 965516 959609 954387 950535 948597 948158 948742 950762 954821 960669 967604 975452 984417 994391
52264I94391J0674J1365J2098J2486J2442J2408J2699J3302J4302J5655J6654
$$ 994391 1005065 1016430 1028528 1041014 1053456 1065864 1078563 1091865 1106167 1121822 1138476
52253A138476J6514J5605J5035J4989J4486J2941J0849Q647N983K606r12l922
$$ 1138476 1154990 1170595 1185630 1200619 1215105 1228046 1238895 1247542 1253525 1256131 1255219 1251297
52241A251297o424q591j0280j1488j2673j4020j5000j5138j4772j4575j4716j4918
$$ 1251297 1244873 1236282 1226002 1214514 1201841 1187821 1172821 1157683 1142911 1128336 1113620 1098702
52229A098702j5000j4988j4933j4874j4738j4145j2713j0730r053q133p540o657
$$ 1098702 1083702 1068714 1053781 1038907 1024169 1010024 997311 986581 977528 969395 961855 955198
52217I55198n399m065k929k248k203k504k408j438J28J775L302M568N052M234
$$ 955198 949799 945734 942805 940557 938354 935850 933442 932004 932132 933907 937209 941777 946829 951063
52203I51063K416P40K74J092K289K878K705K523L081M279N317N616N369N218N591
$$ 951063 953479 954219 954493 955585 957874 960752 963457 965980 969061 973340 978657 984273 989642 994860 1000451
52188A000451O296O688O279N229M101L118J979N02j030k414l978o012q157r736
$$ 1000451 1006747 1013435 1019714 1024943 1029044 1032162 1034141 1034643 1033613 1031199 1027221 1021209 1013052 1003316
52174A003316j0409j0135q943p299o185o094o248n551m017k517j394k90Q37J617
$$ 1003316 992907 982772 973829 966530 960345 954251 948003 942452 938435 935918 934524 934234 935071 936688
52160I36688K233L409N115O266O158N340M584L749K364Q22K2J03K43j26n34j12
$$ 936688 938921 942330 947445 953711 959869 965209 969793 973542 975906 976728 976750 976853 977096 976970 976436 976324
52144I76324J257K795L735M055M140L934K974J262l51r82n66L47J320K246L228
$$ 976324 977581 980376 984111 988166 992306 996240 999214 1000476 1000125 999143 998577 998924 1000244 1002490 1005718
52129A005718M624O838R712J2518J4953J7596K0873K4049K6086K7113K8159K9660
$$ 1005718 1010342 1017180 1026892 1039410 1054363 1071959 1092832 1116881 1142967 1170080 1198239 1227899
52117A227899L1112L2043L2360L1818L0125K7730K5680K4408K3266K1508J9082
$$ 1227899 1259011 1291054 1323414 1355232 1385357 1413087 1438767 1463175 1486441 1507949 1527031
52106A527031J6380J3787J1664J0135Q846P396O091N563N664N434M344K755J014
$$ 1527031 1543411 1557198 1568862 1578997 1587843 1595239 1601330 1606893 1612557 1617991 1622335 1625090 1626104
52093A626104j075l620o271q987j2364j6563k0532k2940k3596k3340k2763k1718
$$ 1626104 1625029 1621409 1615138 1606151 1593787 1577224 1556692 1533752 1510156 1486816 1464053 1442335
52081A442335j9982j7874j5961j4427j2967j1257r379p562n619l037K24L449N982
$$ 1442335 1422353 1404479 1388518 1374091 1361124 1349867 1340488 1332926 1327307 1324270 1324494 1327943 1333925
52068A333925P927R674J1186J2294J3306J4520J5440J5331J4402J3647J3562J3807
$$ 1333925 1341852 1351526 1362712 1375006 1388312 1402832 1418272 1433603 1448005 1461652 1475214 1489021
52056A489021J4068J4386J4581J4187J3246J2324J1516J0171P873N002J991j299
$$ 1489021 1503089 1517475 1532056 1546243 1559489 1571813 1583329 1593500 1601373 1606375 1608366 1607067
52044A607067n059q930j2348j5123j7366j9159k0451k1084k0908k0186j9685j9829
$$ 1607067 1602008 1593078 1580730 1565607 1548241 1529082 1508631 1487547 1466639 1446453 1426768 1406939
52032A406939j9949j9019j7117j5381j4527j4256j4175j4394j4866j5037j4621
$$ 1406939 1386990 1367971 1350854 1335473 1320946 1306690 1292515 1278121 1263255 1248218 1233597
52021A233597j4104j4029j4232j4165j3587j2679j1796j1197j0673r557p677o093
$$ 1233597 1219493 1205464 1191232 1177067 1163480 1150801 1139005 1127808 1117135 1107578 1099901 1093808
52009A093808o124p621r088r607r728j0292j1414j2921j4876j7063j8747j9458
$$ 1093808 1087684 1080063 1070975 1061368 1051640 1041348 1029934 1017013 1002137 985074 966327 946869
51997I46869j9378j8733j7429j5645j3925j2350j0462q452p449q006r120r471
$$ 946869 927491 908758 891329 875684 861759 849409 838947 830495 823046 815040 805920 796449
51985G96449q998q586q790r588j0814j2122j2936j3122j3356j4267j5547j6330
$$ 796449 787451 778865 770075 760487 749673 737551 724615 711493 698137 683870 668323 651993
51973F51993j6125j4963j3092j0942q988p255n392l378j615oK216N281Q168R731
$$ 651993 635868 620905 607813 596871 587883 580628 575236 571858 570243 570237 572453 577734 585902 595633
51959E95633R904R346Q447P234N650L400J81l438o068p026p118p296p307o419
$$ 595633 605537 614883 623330 630564 636214 639614 639795 636357 630289 623263 616145 608849 601542 595123
51945E95123m797l128j468O49L306O168R010J1567J3368J4460J5780J8011K0448
$$ 595123 590326 587198 585730 586379 589685 595853 604863 616430 629798 644258 660038 678049 698497
51932F98497K1859K2016K1580K0920J9852J8102J5042R527J166q438j6771k2641
$$ 698497 720356 742372 763952 784872 804724 822826 837868 847395 848561 840123 823352 800711
51920H00711k6433k8545k8866k7825k6586k5759k4772k2916k0371j7786j5477
$$ 800711 774278 745733 716867 689042 662456 636697 611925 589009 568638 550852 535375
51909E35375j3361j1301r176o924m597k216L27K921N056O392P243Q083Q827R023
$$ 535375 522014 510713 501537 494613 490016 487800 488127 491048 496104 502496 509739 517822 526649 535672
51895E35672Q445O837L643j119o039r329j0661j1119j1399j1101r842q042o226
$$ 535672 544117 550954 554597 553478 547439 538110 527449 516330 504931 493830 483988 475946 469720
51882D69720m411k576j031J58J443L085M673N856P017Q667J0477J1519J1295J0133
$$ 469720 465309 462733 461702 461860 463303 466388 471061 476917 483934 492601 503078 514597 525892 536025
51868E36025Q574O762M496J759j027l235m593n396o075o688o935o548n452l668
$$ 536025 544599 551361 555857 557616 556589 553354 548761 543365 537290 530602 523667 517119 511667 507999
51854E07999j371R83K793L721L803L270K315J076l13j642k752l772n034o451p266
$$ 507999 506628 507611 510404 514125 517928 521198 523513 524589 524276 522634 519882 516110 511076 504625 497359
51839D97359o975o286o404p311p653o598m888l523k390q57R16K242K929L185K974
$$ 497359 490384 484098 477694 470383 462730 456132 451244 447721 445331 444474 445390 447632 450561 453746 456720
51824D56720K266J472P74m99k792n039n711m880l989l607k829j137N70J424J895
$$ 456720 458986 460458 461232 460733 457941 452902 447191 442311 438322 434715 431886 430749 431319 432743 434638
51809D34638K780L744L880L170K391J809Q51p83k402l043k580j727j073m57N12
$$ 434638 437418 441162 445042 448212 450603 452412 453263 452480 450078 447035 444455 442728 441655 441198 441710
51794D41710J557J807Q57o45j740k138k187k151k054j959j888j526o30L32M72
$$ 441710 443267 445074 445931 445286 443546 441408 439221 437070 435016 433057 431169 429643 429013 429345 429817
51779D29817l85j322j270j02J373K283K435K339K633L507M623N616O424P177Q016
$$ 429817 429432 428110 426840 426738 428111 430394 432829 435168 437801 441308 445931 451547 457971 465148 473164
51764D73164R051J0228J1083J1050J0059Q443O207L011r10m474o894q405r480
$$ 473164 482215 492443 503526 514576 524635 533078 539285 542296 541386 536912 530018 521613 512133
51751E12133j0033r969r794r822r480q268o882o278o091n190l490j972r49L53
$$ 512133 502100 492131 482337 472515 463035 454767 447885 441607 435516 430326 426836 424864 423915 424268
51737D24268K283M185N663P333R615J1605J1906J0130P083L869J267l31q14k00
$$ 424268 426551 430736 436399 443732 453347 464952 476858 486988 494071 497940 499207 498876 498062 497862
51723D97862J343L168M047L031M78k260m208n322n752n317m026k476j428j264
$$ 497862 499205 502373 506420 509451 509929 507669 503461 498139 492387 487070 483044 480568 479140 477876
51709D77876k064l613n222n990n575m305k403K54L310N459N505L747J773Q33P32
$$ 477876 475812 472199 466977 460987 455412 451107 448704 448958 452268 457727 463232 466979 468752 469585 470317
51694D70317M05o44j690j601j61J648K591K148N15j830m160n585n628m665l471
$$ 470317 470722 470078 468388 466787 466626 468274 470865 473013 473528 471698 467538 461953 456325 451660 448189
51679D48189k536k004j885j849j273J9J359K114K558L227L850L821L517M195O438
$$ 448189 445653 443649 441764 439915 438642 438661 440020 442134 444692 447919 451769 455590 459107 463302 469740
51664D69740R428J1866J2963J2530J0714P813M010o60n638r484j0945j0277q784
$$ 469740 479168 491034 503997 516527 527241 535054 539064 538404 532766 523282 512337 502060 493276
51651D93276p107m712j152K941O299P862P157M459P57k828n705p743q831r049
$$ 493276 486169 481457 480305 483246 489545 497407 504564 509023 509780 506952 501247 493504 484673 475624
51637D75624q908q780q296o969n016k940p83J310K373J707L46k7N55M97q20k230
$$ 475624 466716 457936 449640 442671 437655 434715 433932 435242 437615 439322 439668 439641 440196 440693 439873 437643
51621D37643k792l012l459l650l130k522k538k917l158l438l977m275l891l277
$$ 437643 434851 431839 428380 424730 421600 419078 416540 413623 410465 407027 403050 398775 394884 391607
51607C91607k991k696j796n83J13J75K69Q56J797K777L673M541N644P362R750
$$ 391607 388616 385920 384124 383541 383654 383829 384098 384954 386751 389528 393201 397742 403386 410748 420498
51592D20498J2200J3667J3148J0195N417M32l175n002n638n632n158m419l565
$$ 420498 432698 446365 459513 469708 475125 475557 472382 467380 461742 456110 450952 446533 442968
51579D42968k335n94J034K057L425O587J1112J4616J5535J4800J4362J5182J7095
$$ 442968 440633 440039 441073 443130 446555 453142 464254 478870 494405 509205 523567 538749 555844
51566E55844J9326K0478J9247J6048J3104J2249J3482J6080J9914K4969L0719
$$ 555844 575170 595648 614895 630943 644047 656296 669778 685858 705772 730741 761460
51555G61460L6694M2411M6027M4654L7489K7446J8199J0457K559o225j4788k2037
$$ 761460 798154 840565 886592 931246 968735 996181 1014380 1024837 1027396 1021171 1006383 984346
51543I84346k7851l2274l5221l6995l7952l7690l5639l2261k8651k5099k1151
$$ 984346 956495 924221 889000 852005 814053 776363 740724 708463 679812 654713 633562
51532F33562j6985j3563j1326r753q291o933n846n153n095n674o380o831p411
$$ 633562 616577 603014 591688 581935 573644 566711 560865 555712 550617 544943 538563 531732 524321
51519E24321q469r266q775p264n997n511n266m940m889n130m999m227l502l506
$$ 524321 515852 506586 497811 490547 484550 479039 473773 468833 463944 458814 453815 449588 446086 442580
51505D42580m092m647m764m321l517k935l013l335l020j896p05n3K52O55J158
$$ 442580 438488 433841 429077 424756 421239 418304 415291 411956 408936 407040 406335 406282 406534 407189 408347
51490D08347J361R30j3o80r2J775L567L845K625J106J62k12l37n25j190k375l274
$$ 408347 409708 410638 410625 409945 409853 411628 415195 419040 421665 422771 422933 422721 422384 421859 420669 418294 415020
51473D15020l117k367k192k716k917k354j856k161k849l153l033k876k798k799
$$ 415020 411903 409536 407344 404628 401711 399357 397501 395340 392491 389338 386305 383429 380631 377832
51459C77832k977l125k616j241K10P50L25k81m27r7L94Q68J446K382L687N030
$$ 377832 374855 371730 369114 367873 368083 368833 369158 368877 368450 368353 368747 369615 371061 373443 377130 382160
51443C82160O276P998J0901J4589J7426J7921J5973J2577Q714M942J842K58O56
$$ 382160 388436 396434 407335 421924 439350 457271 473244 485821 494535 499477 501319 501577 502233
51430E02233K289L293K084j169m663o729p253p235p429p816q089q043p562o680
$$ 502233 504522 507815 509899 508730 504067 497338 490085 482850 475421 467605 459516 451473 443911 437231
51416D37231n634m594l514k495j913j790j443l51R41J458J069M85K05J93M63J110
$$ 437231 431597 427003 423489 420994 419081 417291 415848 415497 416438 417896 418965 419450 419655 419848 420311 421421
51400D21421J787J931J630J552J947K358K476K605L080L808M577N359O177P092
$$ 421421 423208 425139 426769 428321 430268 432626 435102 437707 440787 444595 449172 454531 460708 467800
51386D67800Q367J0196J2312J4389J6768K0144K4576K9444L4336L9229M4028M8731
$$ 467800 476167 486363 498675 513064 529832 549976 574552 603996 638332 677561 721589 770320
51374G70320N3876N9474O3402O2323N5079M4163L3028K2831J2617J740r249j9657
$$ 770320 824196 883670 947072 1009395 1064474 1108637 1141665 1164496 1177113 1178853 1169604 1149947
51362A149947k9219l7497m3776m7871n0374n1853n2180n0946m8113m4115l9529
$$ 1149947 1120728 1083231 1039455 991584 941210 889357 837177 786231 738118 694003 654474
51351F54474l4845l0394k6330k2701j9538j6887j4721j2917j1270r614q015o774
$$ 654474 619629 589235 562905 540204 520666 503779 489058 476141 464871 455257 447242 440468
51339D40468o042n563n007m482m322m371m011k984j763q38p7Q71J772J960J200
$$ 440468 434426 428863 423856 419374 415052 410681 406670 403686 401923 401085 401008 401879 403651 405611 406811
51324D06811O8o27o09k66j83o23j435k295k945l198k950k271j405m98M72J414
$$ 406811 406879 406252 405643 405377 405194 404571 403136 400841 397896 394698 391748 389477 388072 387574 388046 389460
51308C89460J953J764R34j27r88j288q76q2L75J27m42p84q62q72p44m67n43j429
$$ 389460 391413 393177 394111 393984 392996 391708 390832 390750 391125 391252 390810 390026 389164 388292 387548 387081 386538 385109
51290C85109k625l094k530j592q62j98P53J945L043L735L998M279N233O781P672
$$ 385109 382484 379390 376860 375268 374406 374208 374961 376906 379949 383684 387682 391961 397194 403975 411647
51275D11647O746M491K513J525P86l10j164r13K70J480K149K358K485K914L631
$$ 411647 418393 422884 425397 426922 427708 427398 426234 425321 425591 427071 429220 431578 434063 436977 440608
51260D40608L871K638j2k685m083m241m020l916l881l917m138m382m319l892l276
$$ 440608 444479 447117 447105 444420 440337 436096 432076 428160 424279 420362 416224 411842 407523 403631 400355
51245D00355k559j821j397j609k237k542j942o51M08L60p30j728j500j62J031
$$ 400355 397796 395975 394578 392969 390732 388190 386248 385597 386005 386365 385635 383907 382407 382245 383276
51230C83276J144M97K4J75P84J602K402K762K280J116qm94m12k82m47q41j259
$$ 383276 384420 384917 384941 385116 385900 387502 389904 392666 394946 396062 396054 395560 395148 394866 394419 393578 392319
51213C92319j648j913j636m70J157K181K120J731K051L081L968M201L961L439
$$ 392319 390671 388758 387122 386652 387809 389990 392110 393841 395892 398973 402941 407142 411103 414542
51199D14542K578J560Q87P64Q84R52R76R15N53o5n70p36o73m47m7K35l1o69r69
$$ 414542 417120 418680 419567 420331 421215 422167 423143 424058 424611 424546 423976 423240 422567 422120 422073 422308 422277 421608 420639
51180D20639p36o64j260k005k091j544r90n97J27J437K736L075K155P68J65Q59
$$ 420639 419903 419239 417979 415974 413883 412339 411349 410752 410879 412316 415052 418127 420282 421050 421215 422074
51164D22074K062K571K097J433J310J493J272N00j78j26M63O43j96j505k218k241
$$ 422074 424136 426707 428804 430237 431547 433040 434312 434812 434634 434508 434971 435614 435418 433913 431695 429454
51148D29454k597l704m330l161q79M55p9j446k333k470k085j206o4O99Q38Q84
$$ 429454 426857 423153 418823 415662 414783 415238 415159 413713 411380 408910 406825 405619 405555 406254 407092 407976
51132D07976J245J572J422R91O98O20P33J184J848K176J942J648J790K152K310
$$ 407976 409221 410793 412215 413206 413904 414524 415257 416441 418289 420465 422407 424055 425845 427997 430307
51117D30307K255K089J617Q12K26L75J001J457J486J208P23K30J74P53J522J892
$$ 430307 432562 434651 436268 437080 437306 437681 438682 440139 441625 442833 443556 443786 443960 444713 446235 448127
51101D48127J828J716J784K022K385K694K635K157J587J102M74l75r82q99k96
$$ 448127 449955 451671 453455 455477 457862 460556 463191 465348 466935 468037 468511 468136 467154 466255 465959
51086D65959M03J066J636J758J150J65n05n54j76L17O86P32M35O6mM38J319K262
$$ 465959 466362 467428 469064 470822 471972 472137 471632 471078 470902 471219 471905 472637 473072 473138 473134 473572 474891 477153
51068D77153K754K684K574K948L640M267N174P105J0138J3768J7863K2215K5208
$$ 477153 479907 482591 485165 488113 491753 496020 501194 508299 518437 532205 550068 572283 597491
51055E97491K4491J9765J3759R653Q515R744J2611J5995J7734J6046J1570O926
$$ 597491 621982 641747 655506 665159 673674 683418 696029 712024 729758 745804 757374 764300
51043G64300M142L101K091p63o036j2086j5859j5436j1623o767k756p74j829n975
$$ 764300 768442 771543 773634 772871 766835 754749 738890 723454 711831 705064 702308 701534 699705 693730
51029F93730j1347j5352j6896j6623j5320j3248j0901r056p778o244l956j467
$$ 693730 682383 667031 650135 633512 618192 604944 594043 584987 577209 570965 567009 565542
51017E65542L79J395K072L030M565O471Q294R859J1306J2489J2977J2860J2823
$$ 565542 565921 567316 569388 572418 576983 583454 591748 601607 612913 625402 638379 651239 664062
51004F64062J2935J2264J0443Q672Q158Q273P514N672L697J871l33k699m098m100
$$ 664062 676997 689261 699704 708376 716534 724807 732321 737993 741690 743561 743228 740529 736431 732331
50990G32331l522l158l002k856k635j950k99K101M619P327J0762J4595J7710J9698
$$ 732331 728809 725651 722649 719793 717158 715208 714909 717010 721629 728956 739718 754313 772023 791721
50976G91721K1002K1489K0410J8223J6954J7890K0203K2733K5853L0462L6156
$$ 791721 812723 834212 854622 872845 889799 907689 927892 950625 976478 1006940 1043096
50965A043096M1768M7066N2543N7913O2231O5436O8546P2002P4835P5902P5185
$$ 1043096 1084864 1131930 1184473 1242386 1304617 1370053 1438599 1510601 1585436 1661338 1736523
50954A736523P3283P0157O5108N7978M9727M1539L3657K5549J7104R115K457k705
$$ 1736523 1809806 1879963 1945071 2003049 2052776 2094315 2127972 2153521 2170625 2179740 2182197 2179492
50942B179492o495q699r268r219j0198j2946j6697k0103k2405k3614k4139k4454
$$ 2179492 2172997 2164298 2155030 2145811 2135613 2122667 2105970 2085867 2063462 2039848 2015709 1991255
50930A991255k4868k5490k6481k8141l0427l2734l4652l6708l9713m3574m7358
$$ 1991255 1966387 1940897 1914416 1886275 1855848 1823114 1788462 1751754 1712041 1668467 1621109
50919A621109n0316n2136n2397n0826m8120m5566m3567m1337l8259l4711l1303
$$ 1621109 1570793 1518657 1466260 1415434 1367314 1321748 1278181 1236844 1198585 1163874 1132571
50908A132571k8150k5344k3290k2037k0884j9307j7706j6693j6124j5377j4203
$$ 1132571 1104421 1079077 1055787 1033750 1012866 993559 975853 959160 943036 927659 913456
50897I13456j2750j1084r260p575o284n223m187l340k835k289j183L14J445J796
$$ 913456 900706 889622 880362 872787 866503 861280 857093 853753 850918 848629 847446 847760 849205 851001
50883H51001J671J567J632J860K412L479M838N910O446O989Q297J0265J1885J2448
$$ 851001 852672 854239 855871 857731 860143 863622 868460 874370 880816 887805 896102 906367 918252 930700
50869I30700J2479J3021J4339J5860J7206J8664K0591K2973K5666K8584L1516
$$ 930700 943179 956200 970539 986399 1003605 1022269 1042860 1065833 1091499 1120083 1151599
50858A151599L4177L6722L9833M4121M9675N6231O3576P1632Q0429R0048J00393
$$ 1151599 1185776 1222498 1262331 1306452 1356127 1412358 1475934 1547566 1627995 1718043 1818436
50847A818436J11019J21384J31239J40588J49417J57621J64991J70917J74340
$$ 1818436 1929455 2050839 2182078 2322666 2472083 2629704 2794695 2965612 3139952
50838C139952J74293J70249J61706J48056J29525J07772Q4716O0987L6356J1456
$$ 3139952 3314245 3484494 3646200 3794256 3923781 4031553 4116269 4177256 4213612 4225068
50828D225068j1898l2161m8890o2013p1109p5730p5821p1715o4316n5268m6143
$$ 4225068 4213170 4181009 4132119 4070106 3998997 3923267 3847446 3775731 3711415 3656147 3610004
50817C610004l7444k9235k2788k0487k3576l0806l9784m9073n8606o8800p9847
$$ 3610004 3572560 3543325 3520537 3500050 3476474 3445668 3405884 3356811 3298205 3229405 3149558
50806C149558r1441j02635j12202j19339j23729j25017j22946j18037j11446j03947
$$ 3149558 3058117 2955482 2843280 2723941 2600212 2475195 2352249 2234212 2122766 2018819
50796B018819r5719q7144p8896p0975o2688n3938m5661l8449l1732k4919j8519
$$ 2018819 1923100 1835956 1757060 1686085 1623397 1569459 1523798 1485349 1453617 1428698 1410179
50785A410179j3418r719p044n334m538m037l194k208j753k094l023m308n662o660
$$ 1410179 1396761 1387042 1379998 1374664 1370126 1366089 1362895 1360687 1358934 1356840 1353817 1349509 1343847 1337187
50771A337187p216p858r083j0784j2632j4507j6177j7187j7579j8123j9209k0053
$$ 1337187 1329971 1322113 1313030 1302246 1289614 1275107 1258930 1241743 1224164 1206041 1186832 1166779
50759A166779j9677j8207j6500j4970j3529j2197j0972r368o936m073j588L49
$$ 1166779 1147102 1128895 1112395 1097425 1083896 1071699 1060727 1051359 1044423 1040350 1038762 1039111
50747A039111K227M422P050J0367J4530J9080K3329K7233L1278L5605L9973M4476
$$ 1039111 1041338 1045760 1052810 1063177 1077707 1096787 1120116 1147349 1178627 1214232 1254205 1298681
50735A298681M9561N5196O0598O5043O8560P1763P5229P9100Q2896Q5749Q7075
$$ 1298681 1348242 1403438 1464036 1529079 1597639 1669402 1744631 1823731 1906627 1992376 2079451
50724B079451Q7073Q6389Q5363Q3791Q1150P6810P0142O0698M8299L2899J4879
$$ 2079451 2166524 2252913 2338276 2422067 2503217 2580027 2650169 2710867 2759166 2792065 2806944
50713B806944m384k2655l8081n0105n8875o4190o5515o2809n6890m9066m0635
$$ 2806944 2802560 2779905 2741824 2691719 2632844 2568654 2503139 2440330 2383440 2334374 2293739
50702B293739l2467k4753j7402j0857o140l896m029o540j1935k0151k9800l9311
$$ 2293739 2261272 2236519 2219117 2208260 2202120 2198224 2194195 2187655 2175720 2155569 2125769 2086458
50690B086458m8235n6509o3109o6666o7251o6249o4367o1004n5843m9934m4447
$$ 2086458 2038223 1981714 1918605 1851939 1784688 1718439 1654072 1593068 1537225 1487291 1442844
50679A442844l9182l3083k5912j8641j2325o959j610M488J1095J7172K2003K5815
$$ 1442844 1403662 1370579 1344667 1326026 1313701 1306742 1305132 1309620 1320715 1337887 1359890 1385705
50667A385705K9078L1460L1989L0230K6942K3425K0620J8802J7759J7019J6243
$$ 1385705 1414783 1446243 1478232 1508462 1535404 1558829 1579449 1598251 1616010 1633029 1649272
50656A649272J5552J5376J5836J6492J6884J7128J7740J8918K0326K1697K3356
$$ 1649272 1664824 1680200 1696036 1712528 1729412 1746540 1764280 1783198 1803524 1825221 1848577
50645A848577K5818K8942L1989L4639L7402M0701M4010M6523M8254M9712N0799
$$ 1848577 1874395 1903337 1935326 1969965 2007367 2048068 2092078 2138601 2186855 2236567 2287366
50634B287366N0848M9687M7777M5290M2037L8394L5416L3866L3918L5554L7518
$$ 2287366 2338214 2387901 2435678 2480968 2523005 2561399 2596815 2630681 2664599 2700153 2737671
50623B737671L5723K5145N081j8567l7825m8945n3096n2449m7928m0512l2144
$$ 2737671 2773394 2798539 2803620 2785053 2747228 2698283 2645187 2592738 2544810 2504298 2472154
50612B472154k4313j6968r557k221M391R610J2567J2357Q870K858n135j5180k7008
$$ 2472154 2447841 2430873 2421316 2419095 2423486 2433096 2445663 2458020 2466890 2469748 2464613 2449433 2422425
50599B422425l9310n0534n9833o6909p1440p3255p2826p1104o8885o6479o3875
$$ 2422425 2383115 2332581 2272748 2205839 2134399 2061144 1988318 1917214 1848329 1781850 1717975
50588A717975o1068n8246n5619n2977m9670m5374m0722l6732l3765l1339k8913
$$ 1717975 1656907 1598661 1543042 1490065 1440395 1395021 1354299 1317567 1283802 1252463 1223550
50577A223550k6304k3470k0319j6866j3211r477n954l080q11J599M670P775R866
$$ 1223550 1197246 1173776 1153457 1136591 1123380 1113903 1107949 1104869 1104058 1105657 1110327 1118102 1127968
50564A127968J0911J1859J3242J4759J6297J8452K1546K4819K7176K8329K8869
$$ 1127968 1138879 1150738 1163980 1178739 1195036 1213488 1235034 1259853 1287029 1315358 1344227
50553A344227K9472L0394L1468L2323L2673L2571L2278L1967L1687L1502L1413
$$ 1344227 1373699 1404093 1435561 1467884 1500557 1533128 1565406 1597373 1629060 1660562 1691975
50542A691975L1300L1363L2416L5238L9635M4591M9368N4065N9165O4994P1593
$$ 1691975 1723275 1754638 1787054 1822292 1861927 1906518 1955886 2009951 2069116 2134110 2205703
50531B205703P8586Q5204R0959R6298J02085J08418J14603J20251J25617J30629
$$ 2205703 2284289 2369493 2460452 2556750 2658835 2767253 2881856 3002107 3127724 3258353
50521C258353J34367J35963J35324J32448J26643J17148J04226Q8868P1498N1785
$$ 3258353 3392720 3528683 3664007 3796455 3923098 4040246 4144472 4233340 4304838 4356623
50511D356623K9899P207j4798l5869n6645p6898r4812j08412j17258j22162j23442
$$ 4356623 4386522 4393729 4378931 4343062 4286417 4209519 4114707 4006295 3889037 3766875 3643433
50500C643433j20218j11604r7994q0840o1700m1786k1930k484J6405L3892M8113
$$ 3643433 3523215 3411611 3313617 3232777 3171077 3129291 3107361 3104877 3121282 3155174 3203287
50489C203287N7145O0009N6355M5733K7994M368k2561m9959p5497r7328j14132
$$ 3203287 3260432 3320441 3376796 3422529 3450523 3454891 3432330 3382371 3306874 3209546 3095414
50478C095414j25448j31677j33692j32562j29334j24615j18398j10591j01545
$$ 3095414 2969966 2838289 2704597 2572035 2442701 2318086 2199688 2089097 1987552
50469A987552r1888q2269p3528o6615o1678n7737n3835n0086m6882m3560l8961
$$ 1987552 1895664 1813395 1739867 1673252 1611574 1553837 1500002 1449916 1403034 1359474 1320513
50458A320513l3151k7512k3066j9483j5865j1782p384l196P0K100L525N377P957
$$ 1320513 1287362 1259850 1236784 1217301 1201436 1189654 1182270 1179074 1179144 1181244 1184769 1190146 1198103
50445A198103J0719J3293J6015J9377K3335K7122K9337K8554K4575J8970J3838
$$ 1198103 1208822 1222115 1238130 1257507 1280842 1307964 1337301 1365855 1390430 1409400 1423238
50434A423238J0051P210M939L361K482K035K009K594L608M644N734P181Q863J0464
$$ 1423238 1433289 1440499 1445438 1448799 1451281 1453316 1455325 1457919 1461527 1466171 1471905 1479086 1487949 1498413
50420A498413J2166J4329J6738J9144K2297K7240L3587L9755M5015N0079N5446
$$ 1498413 1510579 1524908 1541646 1560790 1583087 1610327 1643914 1683669 1728684 1778763 1834209
50409A834209O0530O4850O8738P2150P3921P3056P0049O6197O2193N7953N3121
$$ 1834209 1894739 1959589 2028327 2100477 2174398 2247454 2317503 2383700 2445893 2503846 2556967
50398B556967M7159L9517L0224J9767Q164n140k0029l5236m9442o2110p2689p9974
$$ 2556967 2604126 2643643 2673867 2693634 2701798 2696658 2676629 2641393 2591951 2529841 2457152 2377178
50386B377178q3062q2411p9193p4078o7204n8816m9279l8829k7856j7062o921
$$ 2377178 2294116 2211705 2132512 2058434 1991230 1932414 1883135 1844306 1816450 1799388 1792467
50375A792467K608J1407J8701K3491K5115K3142J7433Q676j719j2686k3928l4975
$$ 1792467 1795075 1806482 1825183 1848674 1873789 1896931 1914364 1923040 1921321 1908635 1884707 1849732
50363A849732m4573n1580n5938n8268n9063n8603n7038n4107m9461m3703l8392
$$ 1849732 1805159 1753579 1697641 1639373 1580310 1521707 1464669 1410562 1361101 1317398 1279006
50352A279006l4456l1214k7440k2796j7820j3416j0938j1749j5696k0613k4169
$$ 1279006 1244550 1213336 1185896 1163100 1145280 1131864 1120926 1109177 1093481 1072868 1048699
50341A048699k5714k5675k4097k0898j6908j3288j0221p224m553l081k845k775
$$ 1048699 1022985 997310 973213 952315 935407 922119 911898 904674 900121 897040 894195 891420
50329H91420k059r21J55J218K504L879M932N408N400N286N463N917O196N899N079
$$ 891420 889361 888440 888595 889813 892317 896196 901128 906536 911936 917222 922685 928602 934798 940697 945776
50314I45776M028K989K198J884J971K151K372K890L694M456N222O424P959R018
$$ 945776 949804 952793 954991 956875 958846 960997 963369 966259 969953 974409 979631 986055 994014 1003032
50300A003032R292R606J0761J2466J4116J6029J9059K3326K8049L2550L7247M3814
$$ 1003032 1012324 1021930 1032691 1045157 1059273 1075302 1094361 1117687 1145736 1178286 1215533 1259347
50288A259347N3910O6074P3581O7613M5012J2602j7668l7827m7580n0577m9692
$$ 1259347 1313257 1379331 1452912 1520525 1565537 1578139 1560471 1522644 1475064 1424487 1374795
50277A374795m6258m1399l6234l1221k6236k1235j6494j2442r376p157n224l258
$$ 1374795 1328537 1287138 1250904 1219683 1193447 1172212 1155718 1143276 1133900 1126743 1121519 1118261
50265A118261j667r49p52j47J271L148N186P559J0473J3834J7391K0663K2795
$$ 1118261 1116594 1115645 1114893 1114746 1116017 1119165 1124351 1131910 1142383 1156217 1173608 1194271 1217066
50252A217066K3061K1638J9552J7771J6673J6304J6561J7114J7476J7275J6281
$$ 1217066 1240127 1261765 1281317 1299088 1315761 1332065 1348626 1365740 1383216 1400491 1416772
50241A416772J4168J0565N375j025p756j3687j8122k1252k3527k4587k3609k0842
$$ 1416772 1430940 1441505 1446880 1445855 1438099 1424412 1406290 1385038 1361511 1336924 1313315 1292473
50229A292473j7760j5235j2718j0099r249j2248j8576k5338l0138l2582l3288
$$ 1292473 1274713 1259478 1246760 1236661 1227412 1215164 1196588 1171250 1141112 1108530 1075242
50218A075242l2721l1200k9055k6485k3836k1781k0557j9280j6993j4153j2040
$$ 1075242 1042521 1011321 982266 955781 931945 910164 889607 870327 853334 839181 827141
50207H27141j0867r713q223p096o638o116n033l963l539l557l608l747l911l544
$$ 827141 816274 806561 798338 791242 784604 778488 773455 769492 765953 762396 758788 755041 751130 747586
50193G47586k499j704k045l088l644l339k887k953l458l968m283m434m463m365
$$ 747586 745087 743383 741338 738250 734606 731267 728380 725427 721969 718001 713718 709284 704821 700456
50179G00456m123l698l101k500k123k004j870j365m60M84J135J580K116K827L583
$$ 700456 696333 692635 689534 687034 684911 682907 681037 679672 679212 679696 680831 682411 684527 687354 690937
50164F90937M259M701M652M231M171M932N829N950N799O788Q957J0677J1145J1712
$$ 690937 695196 699897 704549 708780 712951 717883 723712 729662 735461 742249 751206 761883 773028 784740
50150G84740J3697J6259J7762J8215J8849K0014K1145K2355K4430K7373L0429
$$ 784740 798437 814696 832458 850673 869522 889536 910681 933036 957466 984839 1015268
50139A015268L3481L7023M0684M3200M4067M3996M3580M2709M1638M1389M2539
$$ 1015268 1048749 1085772 1126456 1169656 1213723 1257719 1301299 1344008 1385646 1427035 1469574
50128A469574M4413M5789M5629M2936L6946K7916J7012N161p327j9774l0784l9293
$$ 1469574 1513987 1559776 1605405 1648341 1685287 1713203 1730215 1735376 1728049 1708275 1677491 1638198
50116A638198m5342m9473n1924n2736n2105n0245m7312m3591l9373l4722k9832
$$ 1638198 1592856 1543383 1491459 1438723 1386618 1336373 1289061 1245470 1206097 1171375 1141543
50105A141543k5506k2692k1568k1595k2144k2455k1487j8951j6274j5321j6063
$$ 1141543 1116037 1093345 1071777 1050182 1028038 1005583 984096 965145 948871 933550 917487
50094I17487j6583j5484j3213j0863q882p287o061m853l108r30Q49J724K028K256
$$ 917487 900904 885420 872207 861344 852462 845175 839114 834261 831153 830223 831072 832796 834824 837080
50080H37080K596L115L699L845L342K917L235L570K771J338R49J818K258J256
$$ 837080 839676 842791 846490 850335 853677 856594 859829 863399 866170 867508 868457 870275 872533 873789
50066H73789j84q75j041j297j563j878k962m870o279o142n128m389l967l420k969
$$ 873789 873605 872730 871689 870392 868829 866951 863989 859119 852840 846698 841570 837181 833214 829794 826825
50051H26825k901k620j469J13J283K042K884L813M602N463O598P650Q380R236
$$ 826825 823924 821304 819835 819948 821231 823273 826157 829970 834572 840035 846633 854283 862663 871899
50037H71899J0522J1678J2232J2730J3823J5045J5465J5049J4519J4398J4904
$$ 871899 882421 894099 906331 919061 932884 947929 963394 978443 992962 1007360 1022264
50026A022264J6153J7707J8548J8400J8381J9585K1679K3759K5708K7599K8656
$$ 1022264 1038417 1056124 1074672 1093072 1111453 1131038 1152717 1176476 1202184 1229783 1258439
50015A258439K8031K6006K3174J9213J3926Q968O779P743R733J0471R187O011
$$ 1258439 1286470 1312476 1335650 1354863 1368789 1377757 1384536 1392279 1402012 1412483 1421670 1427681
50003A427681J060n539j3482k2200l0350l5811l7329l6004l4116l2656l0941k8517
$$ 1427681 1428741 1423202 1409720 1387520 1357170 1321359 1284030 1248026 1213910 1181254 1150313 1121796
49991A121796k6057k4244k2940k1742k0527j9187j7679j6454j6105j6498j6910
$$ 1121796 1095739 1071495 1048555 1026813 1006286 987099 969420 952966 936861 920363 903453
49980I03453j7074j7265j7415j7031j6100j5230j4729j4281j3606j2739j1626
$$ 903453 886379 869114 851699 834668 818568 803338 788609 774328 760722 747983 736357
49969G36357j0148q577p284o119m873m106m470n351n398m440l600l323k682j159
$$ 736357 726209 717632 710348 704229 699356 695250 690780 685429 680031 675591 671991 668668 665986 664827
49955F64827L28R76J531L140N667Q155J0270J2102J3126J2629J1112R992R785
$$ 664827 665155 666131 667662 670802 676469 684624 694894 706996 720122 732751 743863 753855 763640
49942G63640R476Q065N978M385L633K911J407q24l208n510p907j0387j2527j4012
$$ 763640 773116 781181 787159 791544 795177 798088 799495 798671 795463 789953 782046 771659 759132 745120
49928G45120j4999j5693j5815j4904j3029j0859r015p572o257m851l328j739q7
$$ 745120 730121 714428 698613 683709 670680 659821 650806 643234 636977 632126 628798 627059 626972
49915F26972J579K888L219K408J292R79J548K141K421L145M811O618P534P797
$$ 626972 628551 631439 634658 637066 638358 639337 640885 643026 645447 648592 653403 660021 667555 675352
$$ [...]
##END NTUPLES=NMR SPECTRUM
##END=
