
##TITLE=AC1318_SSUAH12147_6608726_lk79rY1aOC
##JCAMPDX= 6.0         $$ Bruker NMR JCAMP-DX V2.0
##DATA TYPE= NMR SPECTRUM
##DATA CLASS= NTUPLES
##ORIGIN= BRUKER
##OWNER= Administrator
$$ 1.72 TOPSPIN		Version 2.1
$$ 2012-08-01 18:12:42.453 -0500  Administrator@TOPSPIN
$$ Compression mode = diff/dup
##.OBSERVE FREQUENCY= 400.02188249412
##.OBSERVE NUCLEUS= ^1H
##.ACQUISITION MODE= SIMULTANEOUS (DQD)
##.ACQUISITION SCHEME= undefined
##.AVERAGES= 8
##.DIGITISER RES= 22
##SPECTROMETER/DATA SYSTEM= spect
##.PULSE SEQUENCE= zg30
##.SOLVENT NAME= COFFEE_meoh
##.SHIFT REFERENCE= INTERNAL, COFFEE_meoh, 1, 14.98509
##AUDIT TRAIL= $$ (NUMBER, WHEN, WHO, WHERE, PROCESS, VERSION, WHAT)
$$ ##TITLE= Audit trail, TOPSPIN		Version 2.1
$$ ##JCAMPDX= 5.01
$$ ##ORIGIN= Bruker BioSpin GmbH
$$ ##OWNER= Administrator
$$ $$ C:\Bruker\TOPSPIN/data/COFFEE/nmr/AC1318_SSUAH12147_6608726_lk79rY1aOC/10/pdata/1/auditp.txt
$$ ##AUDIT TRAIL=  $$ (NUMBER, WHEN, WHO, WHERE, PROCESS, VERSION, WHAT)
(   1,<2012-08-01 18:12:33.875 -0500>,<Administrator>,<TOPSPIN>,<go>,<TOPSPIN 2.1>,
      <created by zg
	started at 2012-08-01 18:11:26.906 -0500,
	POWCHK enabled, PULCHK disabled,
       configuration hash MD5:
       6B 1B 68 BB D9 2E 58 E2 7F 35 AD 54 07 DF 0E 41
       data hash MD5: 64K
       3B 92 2A B6 5A E1 2B 5A 84 6E BD 00 82 FE E3 85>)
(   2,<2012-08-01 18:12:38.359 -0500>,<Administrator>,<TOPSPIN>,<proc1d>,<TOPSPIN 2.1>,
      <Start of raw data processing
       efp LB = 0 FT_mod = 6 PKNL = 1 PHC0 = 0 PHC1 = 0 SI = 32K 
       data hash MD5: 32K
       73 D5 BB C7 F3 8E 56 ED 50 A7 7F 89 B9 77 CC 9E>)
(   3,<2012-08-01 18:12:38.640 -0500>,<Administrator>,<TOPSPIN>,<proc1d>,<TOPSPIN 2.1>,
      <pk PHC0 = 176.6656 PHC1 = 0 
       data hash MD5: 32K
       AD 41 DC FD 76 DB 8A 58 76 74 88 B4 26 90 21 F0>)
(   4,<2012-08-01 18:12:38.718 -0500>,<Administrator>,<TOPSPIN>,<proc1d>,<TOPSPIN 2.1>,
      <abs ABSG = 1 
       data hash MD5: 32K
       A8 78 62 B9 14 0C 24 CB 42 98 B9 8F 01 63 A4 CD>)
(   5,<2012-08-01 18:12:38.750 -0500>,<Administrator>,<TOPSPIN>,<proc1d>,<TOPSPIN 2.1>,
      <abs ABSG = 2 
       data hash MD5: 32K
       56 AF C9 9A A2 FC 67 C8 38 74 73 65 B0 64 43 20>)
(   6,<2012-08-01 18:12:38.781 -0500>,<Administrator>,<TOPSPIN>,<proc1d>,<TOPSPIN 2.1>,
      <abs ABSG = 3 
       data hash MD5: 32K
       03 4E 3E 52 92 86 3A 42 C1 F8 AA A6 ED 15 C9 A1>)
(   7,<2012-08-01 18:12:38.812 -0500>,<Administrator>,<TOPSPIN>,<proc1d>,<TOPSPIN 2.1>,
      <abs ABSG = 4 
       data hash MD5: 32K
       BC 49 07 43 74 33 E9 51 DB 5A 77 7F 0F 38 F5 98>)
(   8,<2012-08-01 18:12:38.843 -0500>,<Administrator>,<TOPSPIN>,<proc1d>,<TOPSPIN 2.1>,
      <abs ABSG = 5 
       data hash MD5: 32K
       2C 24 C5 2F 02 42 8C AB 52 2A 64 6D 04 75 38 0F>)
$$ ##END=
$$ 
$$ $$ hash MD5
$$ $$ 72 70 3E 88 44 25 B8 C0 6C 87 0E AD 2E B6 5D A0
##$RELAX= 
##$RELAX= 
##$RELAX= 
##$RELAX= 
##$RELAX= 
##$RELAX= 
##$RELAX= 
$$ Bruker specific parameters
$$ --------------------------
$$ [...]
150 150 150 150 150 150 150 150
##$TP07= 0
##$TPNAME0= <>
##$TPNAME1= <>
##$TPNAME2= <>
##$TPNAME3= <>
##$TPNAME4= <>
##$TPNAME5= <>
##$TPNAME6= <>
##$TPNAME7= <>
##$TPOAL= (0..7)
0.5 0.5 0.5 0.5 0.5 0.5 0.5 0.5
##$TPOFFS= (0..7)
0 0 0 0 0 0 0 0
##$TUNHIN= 0
##$TUNHOUT= 0
##$TUNXOUT= 0
##$USERA1= <user>
##$USERA2= <user>
##$USERA3= <user>
##$USERA4= <user>
##$USERA5= <user>
##$V9= 5
##$VALIST= <valist>
##$VCLIST= <CCCCCCCCCCCCCCC>
##$VD= 0
##$VDLIST= <DDDDDDDDDDDDDDD>
##$VPLIST= <PPPPPPPPPPPPPPP>
##$VTLIST= <TTTTTTTTTTTTTTT>
##$WBST= 1024
##$WBSW= 4
##$XGAIN= (0..3)
0 0 0 0
##$XL= 0
##$YL= 0
##$YMAX_a= 458856
##$YMIN_a= -619176
##$ZGOPTNS= <>
##$ZL1= 120
##$ZL2= 120
##$ZL3= 120
##$ZL4= 120
##$ABSF1= 14.98509
##$ABSF2= -5.573092
##$ABSG= 5
##$ABSL= 3
##$ALPHA= 0
##$AQORDER= 0
##$ASSFAC= 0
##$ASSFACI= 0
##$ASSFACX= 0
##$ASSWID= 0
##$AUNMP= <proc_prof1d_extract_pilot.lims>
##$AXLEFT= 0
##$AXNAME= <>
##$AXNUC= <1H>
##$AXRIGHT= 0
##$AXTYPE= 0
##$AXUNIT= <>
##$AZFE= 0.1
##$AZFW= 0.1
##$BCFW= 0
##$BC_mod= 0
##$BYTORDP= 0
##$COROFFS= 0
##$CY= 15
##$DATMOD= 1
##$DC= 0
##$DFILT= <>
##$DTYPP= 0
##$F1P= 0
##$F2P= 0
##$FCOR= 0.5
##$FTSIZE= 32768
##$FT_mod= 6
##$GAMMA= 0
##$GB= 0
##$INTBC= 1
##$INTSCL= 1
##$ISEN= 128
##$LB= 0
##$LEV0= 0
##$LPBIN= 0
##$MAXI= 10000
##$MC2= 0
##$MEAN= 0
##$ME_mod= 0
##$MI= 0
##$NCOEF= 0
##$NC_proc= -9
##$NLEV= 6
##$NOISF1= 0
##$NOISF2= 0
##$NSP= 0
##$NTH_PI= 0
##$NZP= 0
##$OFFSET= 14.98509
##$PC= 1
##$PHC0= 176.6656
##$PHC1= 0
##$PH_mod= 1
##$PKNL= yes
##$PPARMOD= 0
##$PPDIAG= 0
##$PPIPTYP= 0
##$PPMPNUM= 2147483647
##$PPRESOL= 1
##$PSCAL= 4
##$PSIGN= 0
##$PYNMP= <proc.py>
##$REVERSE= no
##$SF= 400.02
##$SI= 32768
##$SIGF1= 0
##$SIGF2= 0
##$SINO= 400
##$SIOLD= 32768
##$SPECTYP= <>
##$SREGLST= <1H.CDCl3>
##$SSB= 0
##$STSI= 32768
##$STSR= 0
##$SW_p= 8223.68421052631
##$SYMM= 0
##$S_DEV= 0
##$TDeff= 65536
##$TDoff= 0
##$TI= <>
##$TILT= no
##$TM1= 0
##$TM2= 0
##$TOPLEV= 0
##$USERP1= <user>
##$USERP2= <user>
##$USERP3= <user>
##$USERP4= <user>
##$USERP5= <user>
##$WDW= 1
##$XDIM= 32768
##$YMAX_p= 454438323
##$YMIN_p= -1540225
##$CURPLOT= <Network HP LaserJet P1505>
##$CURPRIN= <$Network HP LaserJet P1505>
##$DFORMAT= <normdp>
##$LAYOUT= <+/1D_H.xwp>
##$LFORMAT= <normlp>
##$PFORMAT= <normpl>
##$SURQMSG= 1
$$ End of Bruker specific parameters
$$ ---------------------------------
##NTUPLES= NMR SPECTRUM
##VAR_NAME=  FREQUENCY,     SPECTRUM/REAL,   SPECTRUM/IMAG
##SYMBOL=    X,             R,               I
##VAR_TYPE=  INDEPENDENT,   DEPENDENT,       DEPENDENT
##VAR_FORM=  AFFN,          ASDF,            ASDF
##VAR_DIM=   32768,         32768,           32768
##UNITS=     HZ,            ARBITRARY UNITS, ARBITRARY UNITS
##FACTOR=    0.250966925370066, 1,           1
##FIRST=     8223.43324360094, -421776,      -160640
##LAST=      0,             127615,          -111156
##MIN=       0,             -1540225,        0
##MAX=       8223.43324360094, 454438323,    0
$$ Real data points
##PAGE= N=1
##DATA TABLE= (X++(R..R)), XYDATA
$$ [...]
$$ plain form
19249 -292092 -81220 513605 -142146 -96026 368441 -423168 -159901 -87476 -111888 -210239
19239 -210239 -245432 -124646 126076 -497091 -88960 -140407 -264359 -308043 -651243 -425126
19229 -425126 -499413 47118 54805 -563404 59027 352253 -339494 36619 -209289 -81971 352843
19217 -718448 -232700 -323631 -186656 -364053 77324 330470 453464 -62138 902796 -251854
19206 -401376 -342925 -607913 -125671 283643 -316518 -342338 -108492 -329911 -682589 401153
19195 -316439 -27436 -25738 58889 840818 435020 -214246 -720412 -573733 165814 -369046
19184 -71025 149191 -419385 -253256 -772130 -148367 -393777 226328 38607 -390856 -173589
19173 177875 382931 -4480 -939153 -305619 555238 -48757 -387038 -522813 106703 -176139
$$ packed form
19249b92092h1220E13605a42146M6120C68441d23168a59901P2425k4412r8351
19239b10239l5193J20786A26076d97091h8960n1447j23952m3684l43200K26117
19229d25126p4287D7118P687e63404E9027K93226c39494C6619b09289h1971C52843
19217g18448b32700r0931J36975j77397G7324K53146J22994f2138I02796b51854
19206d01376N8451k64988a25671B83643c16518k5820a08492k21419l52678D01153
19195c16439b7436J698E8889P81929m05798b14246n06166J46679A65814c69046
19184g1025A49191d19385J66129n18874a48367k45410B26328C8607c90856a73589
19173A77875K05056d480r34673c05619E55238d8757l38281j35775A06703a76139
$$ plain form
19162 22457 -148210 -160891 -162297 306215 174980 -327136 132896 162371 -168722 11670 -33711
19150 513414 148769 -328063 -320648 -73573 -604791 -300771 299761 -263638 -479337 -288307
19140 -288307 -356618 -211377 299773 -330057 153482 -333678 -81746 -784807 -399458 -208253
19130 -208253 31511 210663 -155627 -831676 -125948 -783742 528061 -396466 356851 -411200
19119 -85756 -519692 -756513 -314703 -256221 -199190 -5668 -320453 308815 313387 -50031 141396
19107 -133306 -46912 -485429 -631476 428366 57383 395725 206009 536824 -534609 38171
19096 -155725 759364 -740151 -394658 136115 -210993 -256469 -632757 -207965 243791 -698345
19085 68326 -262381 142601 -337970 -288945 -445026 -531388 105899 -517245 -439402 47903
$$ packed form
19162B2457a48210j2681j406C06215j31235c27136A32896K9475a68722A1670c3711
19150E13414A48769c28063P415g3573n31218c00771B99761b63638k15699J91030
19140b88307o8311J45241B99773c30057A53482c33678h1746p03061L85349J91205
19130b08253C1511J79152a55627o76049a25948o57794E28061c96466C56851d11200
19119h5756m33936k36821c14703N8482N7031e668l14785C08815M572e0031A41396
19107a33306d6912m38517j46047D28366E7383L38342j89716L30815e34609C8171
19096a55725G59364g40151L45493A36115b10993m5476l76288b07965B43791f98345
19085F8326b62381A42601c37970M9025j56081q6362A05899e17245P7843D7903
$$ plain form
19074 -152212 -503888 611619 -257038 -475673 519176 101933 -32313 146017 -488069 -507943
19064 -507943 -73713 334990 -50002 183979 -260032 354599 -172619 90594 256905 161554
19054 161554 225563 196910 -24930 -156641 89507 -623526 -437235 276155 -34608 -47787 -152538
19043 -152538 130147 -132283 -499800 184807 375561 -330447 553787 589614 265926 314533
19033 314533 -571673 -504135 -74465 -119328 275677 -295090 103055 -471522 340908 -657170
19022 228410 135690 27280 368400 -360633 -237412 651958 -5997 -948780 -49997 -186951
19012 -186951 98726 338041 376937 1580 139738 167689 -13970 -242436 -389985 -348001 46419
19000 -257598 257633 -470693 153921 373599 -344917 345005 408457 -443224 -75304 351264
$$ packed form
19074a52212l51676F11619b57038k18635E19176A01933c2313A46017d88069j9874
19064e07943g3713C34990e0002A83979b60032C54599a72619I0594J66311r5351
19054A61554O4009k8653b4930j31711H9507f23526J86291B76155c4608j3179j04751
19043a52538A30147a32283l67517A84807J90754c30447E53787L5827B65926M8607
19033C14533e71673O7538g4465m4863B75677b95090A03055d71522C40908f57170
19022B28410r2720B7280L41120c60633J23221F51958e997r42783d9997j36954
19012a86951I8726K39315L8896A580J38158K7951a3970k28466j47549M1984D6419
19000b57598B57633d70693A53921K19678c44917C45005O3452d43224g5304C51264
$$ plain form
18989 75050 534405 -402486 -718316 -482 -930885 -340554 -429170 -76757 802172 -88775 -130071
18978 -130071 103830 591662 -61099 338988 889050 115094 421019 -447926 317410 -496886
18967 -89053 -611487 -320103 47296 618814 -71270 -65136 -142841 403012 -444075 -429875 102419
18955 -148538 -221833 -176911 -229414 -315167 62548 323910 -128090 706350 131423 -164618
18944 -84321 186188 270674 -375098 160805 -129308 -407608 68612 345925 387662 -140097
18933 -86729 170125 441681 -603430 -254668 -246544 -227564 367775 -470483 -415134 657917
18922 -15988 93986 238203 29057 -80223 -508373 194574 457690 359022 -621140 459169
18911 -655379 271020 -8415 -363520 -79691 234006 11774 -375700 121766 42634 -145572
$$ packed form
18989G5050M59355d02486l15830d82r30403c40554q8616g6757H02172h8775m1296
18978a30071A03830M87832f1099C38988N50062A15094L05925d47926C17410d96886
18967h9053n22434K91384D7296N71518g1270O134p7705D03012d44075J4200A02419
18955a48538p3295M4922n2503q5753F2548K61362a28090G06350A31423a64618
18944h4321A86188Q4486c75098A60805a29308k78300F8612K77313M1737a40097
18933h6729A70125K71556f03430b54668Q124J8980C67775d70483N5349F57917
18922a5988I3986J44217B9057h0223m28150A94574K63116r8668f21140D59169
18911f55379B71020h415l55105g9691B34006A1774c75700A21766D2634a45572
$$ plain form
18900 92765 -11896 -251730 355906 214080 -95999 -102200 -389335 -85319 145684 -599044 -789123
18889 -789123 -396405 192643 412666 -344007 57504 93321 -173166 293883 -12742 -133889
18879 -133889 -479829 -301681 -471449 -63353 -685687 316898 253922 20609 304007 368990
18869 368990 -492544 -172919 -33974 -85809 669884 438696 -468002 -174963 116398 -238826
18858 -111370 -553794 -88240 287571 -52958 -590631 241287 -805541 -290496 -333621 -154250
18847 -130874 423994 -407415 -572902 -22498 54113 18949 94914 -57827 81405 -442424 -88199
18835 -643591 -276812 237096 -421964 -474642 -437206 364657 -19038 -24747 83994 -116297 -246955
18824 -246955 113351 240797 -112438 276691 521983 194496 -1714 -350725 -509824 -455966
$$ packed form
18900I2765a1896k39834C55906j41826i5999o201k87135h5319A45684e99044j90079
18889g89123L92718A92643K20023c44007E7504L5817a73166B93883a2742j21147
18879a33889l45940J78148j69768f3353o22334C16898o2976B0609K83398O4983
18869C68990d92544a72919c3974n1835F69884k31188d68002a74963A16398b38826
18858a11370m42424h8240B87571e2958n37673B41287h05541b90496m3125a54250
18847a30874D23994d07415j65487b2498E4113A8949P5965e7827H1405d42424h8199
18835f43591b76812B37096d21964n2678L7436C64657a9038n709H3994a16297j30658
18824b46955A13351J27446a12438B76691K45292A94496a714l49011j59099N3858
$$ plain form
18814 -455966 -171793 -383311 -606789 -313812 -329217 -240706 -450351 -145556 165759 -339186
18803 463479 54789 103715 -84557 142518 192420 -51975 -242436 -473597 -231491 -117613
18793 -117613 -557404 232038 -287641 139390 170016 -231428 70057 281660 -859049 460034
18782 -118892 -296040 -84715 310468 429747 284651 -178963 11861 -25806 -120687 331819
18771 -436305 617051 -275686 -416924 -418663 -294950 -646318 96179 -705378 304331 -360651
18760 167663 495920 -374919 -701757 378434 13249 -84276 -90631 -330710 -155688 -140209
18750 -140209 112517 -56754 -378527 107262 -87927 316023 550247 52198 -406697 402491
18739 101669 -140606 -319635 -606057 49419 -322857 -47909 -659664 -434840 -412012 -11085
$$ packed form
18814d55966a71793k11518k23478K92977j5405Q8511k09645a45556A65759c39186
18803D63479E4789M8926h4557A42518M9902e1975j90461k31161b31491J13878
18793a17613m39791B32038b87641A39390L0626b31428G0057K11603h59049D60034
18782a18892j77148h4715C10468J19279j45096a78963A1861b5806r4881C31819
18771d36305F17051b75686j41238j739J23713l51368I6179g05378C04331c60651
18760A67663L28257c74919l26838C78434A3249h4276o355k40079a55688J5479
18750a40209A12517e6754l21773A07262h7927C16023K34224E2198d06697D02491
18739A01669a40606j79029k86422D9419c22857d7909o11755K24824K2828a1085
$$ plain form
18728 -133850 -179080 52462 -474179 134884 335734 -128787 383651 -737738 134262 -483240
18717 -257164 -368211 -127556 -815486 222948 445892 265870 -252239 82813 345646 -17729
18706 -277029 -79174 -50526 358477 469610 -242445 137609 471252 -230709 -235811 202539
18695 -176992 -649899 -470486 181101 -590144 -509897 -10551 -256787 244180 -199051 -124233
18685 -124233 575309 -356863 -256492 -123307 150443 -451487 -208889 -577985 -1031371 28743
18674 -452514 536412 171907 171831 -117673 -867330 -362639 -44301 -271826 408184 -644855
18663 -216251 495487 -404042 -267673 20609 -614869 -717251 -446891 -383343 -787946 -169483
18652 286802 -375568 -454648 373848 161162 11994 -109935 -392220 -13066 -261617 27639
$$ packed form
18728a33850m5230E2462d74179A34884K00850a28787C83651g37738A34262d83240
18717b57164j11047a27556o87930B22948K22944j80022b52239H2813K62833a7729
18706b77029g9174K8648C58477J11133b42445A37609L33643b30709n102B02539
18695a76992m72907J79413A81101e90144Q0247a0551k46236B44180a99051P4818
18685a24233E75309c56863J00371a23307A50443d51487b08889l69096m53386B8743
18674d52514E36412A71907p6a17673p49657c62639d4301k27525D08184f44855
18663b16251D95487d04042J36369B0609f14869j02382K70360O3548m04603a69483
18652B86802c75568p9080C73848A61162A1994a09935k82285a3066k48551B7639
$$ plain form
18641 67617 -223329 171437 187863 -209165 -594920 -558354 -308829 -128171 -675910 -395906
18631 -395906 48279 -630271 -430122 -243543 74153 -601149 -486470 401176 -546148 -377133
18621 -377133 285527 413488 -321061 -186554 -291232 45 404975 -169371 -145076 278340
18610 -208457 547733 156570 49892 273784 -166719 -602967 -116948 -436196 -697714 -53592
18599 366029 905 52730 -199773 382607 -438085 108575 -529865 56720 -362157 -657414
18589 -657414 -399997 -163960 124410 -58608 -133010 95736 470745 93753 -63286 209881
18578 -603559 -315626 -774093 -306176 -539891 132190 -668330 -415912 -61342 57870 -585665
18567 150301 -625828 197941 -294657 -236222 -75367 -425435 85932 -635352 -52707 -258608
$$ packed form
18641F7617b23329A71437J6426b09165l85755L6566K49525a28171n47739K80004
18631c95906D8279f30271K00149J86579G4153f01149J14679D01176e46148J69015
18621c77133B85527J27961c21061J34507j04678D5M04930a69371K4295B78340
18610b08457E47733A56570D9892K23892a66719m36248a16948l19248k61518e3592
18599C66029I05N1825a99773C82607d38085A08575e29865E6720c62157k95257
18589f57414K57417a63960A24410e8608p4402I5736L75009I3753f3286B09881
18578f03559K87933m58467c06176k33715A32190f68330K52418f1342E7870e85665
18567A50301f25828A97941b94657N8435g5367l50068H5932f35352e2707k05901
$$ plain form
18557 -258608 -659060 -464753 -99491 -25521 -483103 -109177 -169821 -181665 24888 -363272
18546 109720 -307906 -76813 354373 746782 -79270 -276422 -216050 270841 -552939 715235
18535 -734267 239627 -484604 -112285 498561 -97867 412656 -22730 466362 -660355 -362314
18525 -362314 317596 -204483 65385 -392181 -42165 -118600 -341670 57732 447243 -222999
18514 -100361 -91187 378092 -65752 -119537 -118898 -619950 -112356 -382322 160586 -380929 237492
18502 -183126 -130605 -427963 -153258 -610962 -871122 -2142 -255533 87768 -241673 -687073
18492 -687073 -655258 23569 436493 113089 -612241 -376458 253460 -198994 -450222 -144869
18481 -191135 -193731 555572 603459 158055 -271926 73490 -296169 698498 289677 62482
$$ packed form
18557b58608m00452J94307i9491b5521m57582a09177o0644j1844B4888c63272
18546A09720c07906g6813C54373L92409g9270j97152O0372B70841e52939G15235
18535g34267B39627d84604a12285D98561i7867D12656b2730D66362f60355K98041
18525c62314C17596b04483F5385c92181d2165p6435k23070E7732L89511b22999
18514a00361R174C78092f5752n3785O39n01052a12356k69966A60586c80929B37492
18502a83126N2521k97358a53258m57704k60160b142k53391H7768b41673m45400
18492f87073L1815B3569M12924A13089f12241K35783B53460a98994k51228a44869
18481a91135k596E55572M7887A58055b71926G3490b96169F98498B89677F2482
$$ plain form
18470 13612 -100473 -86652 -203677 -111571 -137856 -172402 190119 327490 1843 -644915 -279258
18458 76199 594442 12017 28373 4668 202600 -289733 -168228 -483864 -437634 -245872 -842402
18447 -842402 80330 -210308 -242912 17495 141461 -374794 -292355 263325 228414 -113881
18436 511215 130897 562268 -333619 491281 57257 402457 407587 778138 25207 15423 558151
18425 558151 -68702 -526050 -457609 -512789 553436 -292964 106416 -5329 104662 -262537
18414 317430 -880512 -205295 -322555 -97816 69706 93173 55944 532194 -56703 -465081
18404 -465081 598304 251996 -118502 -84831 -495384 414472 447451 -643230 277771 221085
18394 221085 352287 -96174 -411827 -43256 -521114 -52402 -7528 -276763 -56493 -626925 333436
$$ packed form
18470A3612a00473J3821j17025R2106k6285l4546A90119J37371A843f44915b79258
18458G6199N18243A2017J6356D668J97932b89733J21505l15636M6230J91762n96530
18447h42402H0330b10308l2604A7495J23966c74794Q2439B63325l4911a13881
18436E11215A30897M31371c33619D91281E7257L45200N130L70551B5207r784N42728
18425E58151f8702m57348O8441n5180E53436b92964A06416e329A04662b62537
18414C17430h80512b05295j17260i7816F9706K3467l7229M76250e6703m08378
18404d65081E98304B51996a18502L3671m10553D14472L2979f43230B77771n6686
18394B21085J31202i6174l15653d3256m77858e2402g528k69235e6493n70432C33436
$$ plain form
18382 -283202 -51083 339122 -472640 -122648 -205774 -177177 611973 288023 -59212 36306
18371 -295739 13444 -145967 -929519 52538 -56437 333135 -681299 -492009 -432425 -563782
18361 -563782 -156327 136830 -186751 75007 317394 83401 263989 -565342 -230417 -931878
18351 -931878 -81287 -159358 -382062 -415218 -84957 -286024 623792 -50395 413452 150468
18340 -100582 175342 -645347 672228 -134801 -81272 158671 410158 367544 -30829 309199
18329 543339 284503 -570616 -355467 -315778 448327 -470006 -425882 -401972 270571 166425
18319 166425 429878 -294700 150910 -172425 249474 658676 601993 479711 -396032 -279239
18309 -279239 82737 -107601 226291 -748665 -207950 -587626 -341023 157685 45032 -226872
$$ packed form
18382b83202e1083C39122d72640a22648q3126K8597F11973B88023e9212C6306
18371b95739A3444a45967p83552E2538e6437C33135f81299J89290N9584j31357
18361e63782a56327A36830a86751G5007K42387H3401J80588e65342b30417p01461
18351i31878h1287p8071k22704l3156h4957k01067F23792e0395D13452A50468
18340a00582A75342f45347F72228a34801N3529A58671K51487m2614c0829C09199
18329E43339k58836e70616K15149L9689D48327d70006M4124K3910B70571j04146
18319A66425K63453b94700A50910a72425B49474M09202n6683j22282c96032J16793
18309b79239H2737a07601B26291g48665b07950l79676K46603A57685D5032b26872
$$ plain form
18298 -465695 359540 -141884 -104619 441654 271340 -374358 -458785 -36920 815776 105014
18287 -231392 -54273 -150230 -127227 95138 -144600 -338929 -58229 -207329 -276097 1008891
18276 -182074 -85674 -736310 -307644 -68735 301973 179807 -279475 -360553 159387 -225998
18265 -133903 112369 108149 389270 195767 21894 -396306 346849 535078 -548403 -10587
18254 128811 -256492 25131 -388298 51645 140752 -82213 138908 -454949 92479 -463387
18243 157357 -73912 -98831 179049 231343 -303748 -120795 -34692 -370915 274471 -158553
18232 -415067 282111 81363 262813 -472650 456675 -60686 -706418 10031 -49310 -4936 -143580
18221 -143580 149877 -140987 -282291 -372582 72209 -131679 -619918 125894 39488 158858
$$ packed form
18298d65695C59540a41884L7265D41654j70314c74358q4427c6920H15776A05014
18287b31392e4273r5957K3003I5138a44600j94329e8229j49100o8768A008891
18276a82074h5674o50636c07644f8735C01973j22166b79475q1078A59387b25998
18265a33903A12369m220K81121j93503B1894c96306C46849J88229e48403a0587
18254A28811b56492B5131c88298E1645Q9107h2213A38908d54949I2479d63387
18243A57357g3912k4919A79049N2294c03748a20795c4692l36223B74471a58553
18232d15067B82111H1363J81450d72650D56675f0686o45732A0031d9310d936j38644
18221a43580A49877a40987j41304r0291G2209a31679m88239A25894C9488J19370
$$ plain form
18211 158858 31619 55692 -131175 -382683 -237743 338593 63669 -46789 -51104 -167373 89899
18199 607499 239652 -465938 -6916 -177494 260071 -630292 200968 -254571 -132157 122862
18188 131603 380742 -330731 -238484 -213245 -80660 -76752 -494058 -143035 129903 103507 168505
18177 168505 86342 -42356 -340351 235063 111124 -8181 -64614 373383 -61023 -4481 -495379
18166 -495379 -84715 -2778 50196 -672433 -347928 -193022 464970 -627087 654615 45780
18155 464629 -625864 -270845 10956 -144356 -769284 -33886 115882 -71139 74398 -98742
18144 -566922 -106427 -634353 -286718 578989 -439376 -438991 274372 -190085 -341224 413439
18133 112848 -33968 -57080 621398 -118137 149090 -215881 137459 -434763 -293014 -551841
$$ packed form
18211A58858C1619K4073a31175k51508J44940C38593F3669d6789m315j16269H9899
18199F07499B39652d65938f916j70578B60071f30292B00968b54571J22414A22862
18188A31603K49139c30731R2247K5239h0660L908m17306a43035A29903k6396O4998
18177A68505q2163d2356k97995B35063A11124h181n6433C73383f1023d481m90898
18166d95379h4715b778E0196f72433L24505J54906D64970f27087F54615D5780
18155D64629f25864b70845A0956a44356o24928c3886A15882g1139G4398i8742
18144e66922a06427n27926b86718E78989d39376L85B74372a90085j51139D13439
18133A12848c3968k3112F21398a18137A49090b15881A37459d34763J41749k58827
$$ plain form
18123 -551841 466851 82716 -165279 278615 -78669 -215842 340974 239700 -511507 -304441
18113 -304441 -120106 -551974 117801 -488219 -514934 -107756 595481 -42308 460046 -380188
18102 165138 40948 -142341 509318 -34456 10559 515986 317358 -232045 -123361 -378965
18092 -378965 -66766 -1730 489750 28098 -569748 295177 603378 -145842 -313967 74439
18081 -364415 -218054 -109809 274646 271605 -161369 17357 -1478 544371 -139539 -123591 232653
18069 -144160 -235348 -521619 87680 335294 259804 313907 611440 -224494 224910 221948 -110366
18057 467524 -98791 119201 461727 -357543 -297905 -631825 -114631 229715 144802 -427687
18046 347864 -45161 352660 -171597 187007 344383 -456013 403255 -39885 145436 -325292
$$ packed form
18123e51841D66851H2716a65279B78615g8669j37173C40974j01274e11507K07066
18113c04441a20106m31868A17801d88219k6715a07756E95481d2308D60046c80188
18102A65138D0948a42341E09318c4456A0559N05427j98628b32045J08684k55604
18092c78965f6766a730D89750B8098e69748B95177L08201a45842j68125G4439
18081c64415J46361J08245B74646l041a61369A7357a478E44371a39539J5948B32653
18069a44160r1188k86271H7680K47614p5490N4103K97533b24494B24910k962a10366
18057D67524i8791A19201L42526c57543N9638l33920a14631B29715q4913d27687
18046C47864d5161C52660a71597A87007J57376d56013D03255c9885A45436c25292
$$ plain form
18035 -222231 -409979 4908 -26838 211380 55123 93115 354708 -243697 344385 -216189
18024 350140 -172667 67038 -24164 -124216 153638 24646 390761 482677 191952 157647
18014 157647 -83250 -355460 341026 -138481 75816 -355857 316991 197219 33225 279602
18004 279602 619834 -219583 -482714 -453121 -128359 21774 218933 -269859 416955 -520869
17993 16011 -265541 -149499 -188930 176285 -228793 -264715 -164323 389450 27486 507015
17983 507015 -510731 -163556 -12739 -231938 183203 59953 -101168 -494468 122400 -283271
17972 353028 -937996 603341 -575838 -471 328834 129056 -157751 -294011 90223 57894
17962 57894 88081 302901 330733 -286491 154814 -31293 -600819 254152 194061 132753 -116687
$$ packed form
18035b22231j87748D908b6838B11380E5123L7992K61593b43697C44385b16189
18024C50140a72667F7038b4164j00052A53638B4646L66115R1916A91952l4305
18014A57647h3250k72210C41026a38481G5816c55857C16991j19772C3225K46377
18004B79602L40232b19583k63131K9593a28359B1774J97159b69859D16955e20869
17993A6011b65541J16042l9431A76285b28793l5922J00392C89450B7486M79529
17983E07015e10731a63556a2739k19199A83203E9953a01168l93300A22400b83271
17972C53028i37996F03341e75838d71C28834A29056a57751j36260I0223l2329
17962E7894L0187K14820K7832b86491A54814c1293n69526B54152o0091o1308a16687
$$ plain form
17950 14792 48351 -32551 -662506 -376884 482590 366443 -478130 -147963 -188029 253803
17939 -327803 259797 82368 -2341 311477 15721 75844 -270018 -219403 -294861 503215 -40784
17927 109884 -84996 367618 -41580 -232288 -297029 -316417 206431 -459922 732811 578049
17917 578049 -81002 96276 595395 -223205 -326962 -273715 -346159 123836 118137 110205 -468846
17905 -626133 582210 -498060 418177 731612 80204 22990 -545755 539161 23374 575013
17895 575013 21349 -274177 256939 165973 279535 -234920 500811 -87513 -55531 -717767
17885 -717767 -101999 348835 -283407 211212 380807 -13606 -12461 105451 331424 473987
17875 473987 163933 75631 -183547 -446357 87882 412187 623213 365886 482734 -207295
$$ packed form
17950A4792L3559c2551o29955K85622D82590j16147d78130a47963m0066B53803
17939c27803B59797H2368b341C11477A5721O0123b70018N0615p5458E03215d0784
17927A09884h4996C67618d1580j90708o4741j9388B06431d59922G32811j54762
17917E78049h1002I6276M99119b23205j03757N3247p2444A23836n699p932d68846
17905f26133E82210d98060D18177L13435H0204B2990e45755E39161B3374N51639
17895E75013B1349b74177B56939r0966J13562b34920E00811h7513L1982o62236
17885g17767a01999C48835b83407B11212J69595a3606J145A05451K25973J42563
17875D73987A63933G5631a83547k62810H7882L24305K11026k57327J16848b07295
$$ plain form
17864 11802 -116894 112369 154614 -67205 246888 123750 -96915 345367 675190 220669
17853 76727 150573 257789 -66515 -42560 -335679 240763 -255825 -618637 77384 -159759
17842 -553384 -155473 387178 227162 -406884 -147463 179834 757068 -250244 4067 -215254
17831 -40535 302404 60354 -81934 -268655 -194441 -268060 326646 -273010 -474614 -35367 168785
17819 -228444 -99329 596 19684 182733 322057 514505 -332808 -95218 37870 306741 319783
17808 319783 -218505 630469 507990 108428 -406326 -678529 397838 3741 -802772 -195089
17797 639741 32967 -360993 381992 493281 141383 124937 735511 -495502 -44953 -543787
17787 -543787 94803 331721 -206060 -269940 -500074 -53606 278180 42584 358199 -564699
$$ packed form
17864A1802a16894A12369M2245f7205B46888j23138i6915C45367L29823B20669
17853G6727P3846J07216f6515K3955k93119B40763b55825l62812G7384a59759
17842e53384a55473C87178j60016d06884a47463A79834N77234b50244D067b15254
17831d0535C02404F0354h1934j86721P4214p3619C26646b73010k01604c5367A68785
17819b28444i9329E96J9088J63049J39324J92448c32808i5218C7870K68871J3042
17808C19783b18505F30469j22479A08428d06326k72203C97838C741h02772a95089
17797F39741C2967c60993C81992J11289A41383j6446O10574d95502d4953m98834
17787e43787I4803K36918b06060o3880k30134e3606B78180D2584L15615e64699
$$ plain form
17776 -84811 -59308 -742972 260938 158819 -652610 548693 104837 -380894 576933 -74402
17765 -108626 99775 -11451 -250948 832750 99498 324151 -84924 220474 513593 528456
17755 528456 201367 168939 -286334 536686 773499 -33442 -54378 789694 -116981 365246
17744 -312495 678853 -463010 -185576 373748 281759 -290643 -276159 404830 -51332 1341
17733 -62019 -330383 305092 371249 170199 243003 1243213 -78224 179599 208876 592391
17723 592391 368109 560494 300673 -230397 299198 138122 612832 671106 -134642 -474785
17713 -474785 362640 361196 335075 339094 65766 349452 994051 -325277 541192 279610 530391
17702 530391 -107935 297315 429538 495191 736138 205712 910251 -7302 760289 500977
$$ packed form
17776h4811K5503o83664B60938j02119f52610E48693A04837c80894E76933g4402
17765a08626I9775a1451k39497H32750I9498K24653h4924B20474K93119J4863
17755E28456B01367l2428b86334E36686K36813c3442k0936G89694a16981C65246
17744c12495F78853d63010a85576C73748r1989b90643J4484D04830e1332A341
17733f2019k68364C05092O6157A70199P2804J000210g8224A79599K9277L83515
17723E92391k24282J92385k59821b30397B99198A38122M74710N8274a34642l40143
17713d74785C62640j444k6121M019F5766K83686O44599c25277E41192k61582K50781
17702E30391a07935B97315J32223O5653K40947B05712P04539g302G60289k59312
$$ plain form
17692 500977 -166347 -98174 235002 438991 -179979 471327 299727 -199138 -27227 654268
17681 -70295 147978 150158 209761 461871 934333 412563 -685159 562628 304973 596363
17671 596363 -152379 316932 -281763 317373 400781 679554 408241 680579 -97335 587574
17660 -302833 -203695 698141 453166 198150 691269 -119082 788819 275828 314828 525683
17650 525683 -654180 721133 756457 -447123 295016 -254731 -128059 415114 612361 537153
17640 537153 158142 -635997 -149650 -50996 622623 405082 76708 348057 69209 38270
17630 38270 71286 -260590 18520 213270 54534 190280 488386 476902 -25688 182650 354062
17619 354062 374644 479451 -791411 372261 339614 346819 -48772 305733 482155 65920 42644
$$ packed form
17692E00977a66347O8173B35002K03989a79979D71327j71600a99138b7227F54268
17681g0295A47978K180N9603K52110M72462D12563f85159E62628k57655K91390
17671E96363a52379C16932b81763C17373Q3408K78773k71313K72338i7335E87574
17660c02833R9138F98141k44975A98150M93119a19082G88819B75828L9000K10855
17650E25683f54180G21133L5324d47123B95016b54731J26672D15114J97247p5208
17640E37153A58142f35997a49650e0996F22623k17541G6708K71349F9209l0939
17630C8270L3016b60590A8520J94750E4534J35746K98106j1484b5688A82650J71412
17619C54062K0582J04807g91411C72261l2647P205d8772C05733J76422F5920k3276
$$ plain form
17608 42644 277384 169075 424101 -46473 358695 452457 523556 -117595 391687 -218387
17597 381471 383085 253863 370319 -23636 141942 487272 78531 852272 -155994 -243626
17587 -243626 362141 456944 753671 625904 716303 610902 -137606 206005 497413 135116
17576 462689 891104 285475 1160568 497461 704706 509697 603771 888731 331784 842804
17566 842804 932726 830184 355770 558622 704466 1049168 560004 431097 594295 968488
17556 968488 490282 780640 709176 1035511 308934 400376 607665 432310 -145564 512463
17545 835115 262144 325464 878052 994499 336881 1551605 169160 651321 1036619 1332783
17535 1332783 743582 397532 413106 406775 650673 99475 443846 864430 928920 544279
$$ packed form
17608D2644K34740j08309K55026d6473C58695R3762P1099a17595C91687b18387
17597C81471J614j29222J16456b3636A41942L45330G8531P73741a55994q7632
17587b43626C62141R4803K96727j27767R0399j05401a37606B06005K91408A35116
17576D62689M28415B85475Q75093D97461K07245j95009R4074K84960C31784N11020
17566H42804Q9922j02542C55770K02852J45844L44702m89164j28907J63198L74193
17556I68488m78206K90358p1464L26335C08934R1442K07289j75355a45564E12463
17545H35115B62144O3320N52588J16447C36881J214724A69160M82161L85298K96164
17535A332783n89201l46050J5574o331K43898I9475L44371M20584O4490l84641
$$ plain form
17525 544279 717744 132990 895151 681635 942563 1268938 375200 949431 365149 1070292
17515 1070292 740939 737141 1696114 923659 851434 1182953 867257 872011 550817 883187
17505 883187 365415 1316129 747630 674338 573539 885862 254183 1150629 990888 599941
17495 599941 482602 708769 827381 304124 39126 686290 1075993 1032015 735880 655837
17485 655837 1073582 729845 344590 813645 -52317 384862 387917 224697 372739 563689
17475 563689 -149231 1006946 704460 624565 574561 189125 458505 302930 832170 552821
17465 552821 390795 476074 628762 837182 720110 672592 373756 798023 704186 896281
17455 896281 517837 827435 399475 208205 852354 1099754 554330 749619 457644 365080
$$ packed form
17525E44279J73465A32990P62161k13516K60928L26375C75200N74231C65149P05143
17515A070292l29353l798R58973p72455p2225L31519l15696M754l21194L32370
17505H83187C65415R50714n68499p3292j00799L12323B54183Q96446j59741l90947
17495E99941j17339K26167J18612C04124C9126O47164L89703m3978k96135q0043
17485F55837M17745l43737C44590M69055e2317C84862L055j63220J48042J90950
17475E63689a49231A006946l02486p9895n0004A89125K69380j55575N29240k79349
17465E52821j62026Q5279J52688K08420j17072m7518k98836M24267r3837J92095
17455H96281l78444L09598C99475j91270O44149K47400n45424J95289k91975r2564
$$ plain form
17445 365080 991580 617860 315512 1251702 191959 599353 -18503 664938 847410 835227
17435 835227 1152999 335888 193320 1145443 305880 562221 742771 1270241 883779 647820
17425 647820 133227 663616 395439 351044 176288 800457 297648 575772 885651 546053
17415 546053 891132 800926 356659 -20234 199201 1017723 102119 1231942 889255 494466
17405 494466 274199 533690 396432 233037 1068070 439895 837052 356921 638277 375436
17395 375436 620462 1139471 738512 617388 1101480 1186018 147769 547426 731576 241531
17384 412087 1006886 825244 565107 721284 513736 1040781 4254 609234 847334 598211
17374 598211 438413 407798 82040 652199 362955 532287 692037 805602 721590 499636
$$ packed form
17445C65080O26500l73720l02348R36190A91959M07394a8503F64938J82472j2183
17435H35227L17772C35888j42568R52123C05880K56341J80550N27470l86462k35959
17425F47820A33227N30389k68177m4395j74756O24169B97648K78124L09879l39598
17415E46053L45079r0206C56659b0234A99201Q18522A02119J129823l42687l94789
17405D94466k20267K59491j37258j63395Q35033D39895L97157C56921K81356k62841
17395C75436K45026N19009m00959j21124M84092Q4538A47769L99657J84150B41531
17384D12087N94799j81642k60137J56177k07548N27045D254O04980K38100k49123
17374E98211j59798l0615H2040N70159k89244J69332J59750J13565q4012k21954
$$ plain form
17364 499636 1297181 62179 296942 445632 337320 411134 -23250 142469 700430 502086
17354 502086 843978 985220 583406 667813 374550 1017868 695470 553643 585612 578071
17344 578071 -1432 792235 220805 532597 350985 238057 504662 1048335 883454 447433
17334 447433 543142 969119 1213093 799108 356139 760245 430097 619118 790457 699544
17324 699544 626930 294154 455013 886990 220149 531491 47017 719702 500881 526914
17314 526914 579718 360660 934380 645164 1250222 594054 256651 881750 762553 242230
17303 915929 551876 161471 1041265 1069211 237544 1256760 -385292 613114 575427 754023
17293 754023 860164 76017 332206 466369 -141477 544877 653470 333782 1059722 289640
$$ packed form
17364D99636P97545F2179K34763J48690j08312P3814b3250A42469N57961j98344
17354E02086L41892J41242m01814Q4407k93263O43318l22398j41827L1969p541
17344E78071a432G92235B20805L11792j81612j12928K66605N43673j64881m36021
17334D47433R5709M25977K43974m13985C56139M04106l30148J89021J71339r0913
17324F99544p2614B94154J60859M31977B20149L11342D7017O72685k18821K6033
17314E26914N2804k19058N73720k89216O05058E94054B56651O25099j19197B42230
17303I15929l64053A61471Q79794K7946B37544J019216c85292F13114l7687J78596
17293G54023J06141G6017K56189J34163a41477E44877J08593l19688P25940B89640
$$ plain form
17282 1036051 138656 411347 672011 800631 1178816 275809 464258 477608 715501 981353
17272 981353 755331 904384 900513 900208 326481 803227 1356890 1236791 399745 93539 991937
17261 991937 1318694 1112835 627901 1145420 667538 622386 1250578 327819 617953 1025866
17251 1025866 632719 838178 806591 313202 433923 1259342 1157892 465344 403156 549851
17241 549851 1086076 1075123 1056795 737574 114548 1091265 1012556 1071602 669464 1085271
17231 1085271 1551693 891645 342629 538380 1251488 853300 1050968 1485177 1305363
17222 1305363 1534501 1414108 488125 757842 529850 867114 1113918 1494113 967866
17213 967866 961755 995767 979652 1078202 880876 1493791 1136441 314486 850627 1288846
$$ packed form
17282A036051A38656K72691K60664J28620L78185B75809J88449J3350K37893K65852
17272I81353k26022J49053l871l05C26481M76746N53663j20099C99745I3539Q98398
17261I91937L26757k05859m84934N17519m77882m5152O28192C27819K90134M07913
17251A025866l93147K05459l1587C13202J20721Q25419j01450D65344o2188J46695
17241E49851N36225j0953j8328l19221A14548R76717p8709N9046m02138M15807
17231A085271M66422o60048C42629J95751P13108l98188J97668M34209j79814
17222A305363K29138j20393D88125K69717k27992L37264K46804L80195n26247
17213I67866o111L4012j6115R8550j97326O12915l57350C14486N36141M38219
$$ plain form
17203 1288846 1262750 903348 488715 1255322 904943 794369 504356 1271215 1592283 1031799
17193 1031799 426141 1100325 1163080 968348 1150843 1112285 1539851 1604734 1235880 1515266
17183 1515266 957802 1661667 931016 965216 1340759 984543 1388342 1208555 1681660 1424510
17173 1424510 1290791 660879 984277 747645 1394028 1456206 1182824 1320491 1171295 1159239
17163 1159239 1491810 1197487 1614435 1301712 1036162 1576279 1487103 1367838 1228541 1695921
17153 1695921 1322118 1597531 1416083 1466302 1224412 1799011 1557536 1423569 1362104 1206275
17143 1206275 1458348 885924 1186280 1632698 2072554 856387 1396316 1600994 1628442 1126594
17133 1126594 1574812 1300637 1503723 2355361 1706980 1466177 991247 1800687 1647485
$$ packed form
17203A288846k6096l59402m14633P66607l50379j10574k90013P66859L21068n60484
17193A031799D26141O74184O2755j94732J82495l8558M27566O4883l68854K79386
17183A515266n57464P03865p30651L4200L75543l56216M03799j79787M73105k57150
17173A424510j33719o29912L23398k36632O46383O2178k73382J37667j49196j2056
17163A159239L32571k94323M16948l12723k65550N40117q9176j19265j39297M67380
17153A695921l73803K75413j81448N0219k41890N74599k41475j33967o1465j55829
17143A206275K52073n72424L00356M46418M39856H56387N39929K04678K7448n01848
17133A126594M48218k74175K03086Q51638o48381k40803m74930Q09440j53202
$$ plain form
17124 1647485 1321815 1891786 1646699 1978695 2508427 1326362 1802615 1298326 2067456
17115 2067456 1997005 2295287 977047 1818574 1628503 2001421 2345828 1767728 1810705 2026355
17105 2026355 1801658 1624849 2113710 2085703 1499306 1733988 2431061 1207936 1894580
17096 1894580 1779423 1502555 1832633 2069249 1794155 1925274 1889006 2404799 2533149 2695667
17086 2695667 2177878 1984352 2212158 1444581 1890961 2882177 2554960 2223469 2160480 2154588
17076 2154588 2081017 1612725 2478671 1937204 2091934 2443857 2257935 2825348 2632941 3104810
17066 3104810 2927517 2569296 2474033 2719237 1987144 3430473 3045721 2878719 3646585
17057 3646585 2929909 2210580 2984204 2060320 2502951 2843098 3036011 2852144 2520371
$$ packed form
17124A647485l25670N69971k45087L31996N29732j182065M76253n04289P69130
17115B067456p0451K98282I77047Q41527j90071L72918L44407n78100M2977K15650
17105B026355k24697j76809M88861k8007n86397K34682O97073A207936O86644
17096A894580j15157k76868L30078K36616k75094J31119l6268N15793J28350J62518
17086B695667n17789j93526K27806p67577M46380R91216l27217l31491o2989n892
17076B154588p3571m68292Q65946n41467J54730L51923j85922N67413j92407M71869
17066C104810j77293l58221r5263K45204p32093J443329l84752j67002P67866
17057C646585p16676p19329P73624r23884M42631L40147J92913j83867l31773
$$ plain form
17048 2520371 3038655 3291027 2481726 3113769 2781020 3224860 3146198 2687840 2919708 2981813
17038 2981813 3344735 3175742 3352316 3625653 3319783 3432444 3117833 3838292 3383585
17029 3383585 3244162 2952545 3174064 3222466 3462745 4035864 3433015 3298492 4164810 3611093
17019 3611093 3094470 3428747 3533765 4098262 3330316 4343637 3826240 4065309 3748308
17010 3748308 3407202 3718776 3911664 4299107 4691607 4529635 4373826 4895973 4600013
17001 4600013 4823993 4021548 3925382 4323844 4228846 4782418 4335579 4999057 4652161 4641216
16991 4641216 5092447 5309257 5010114 4833073 5214155 4962441 5604410 5473051 5270209
16982 5270209 4833415 5094946 5335300 5368966 5538826 5670315 5443272 5769945 5321237 5708035
$$ packed form
17048B520371N18284K52372q09301O32043l32749M43840p8662m58358K31868O2105
17038B981813L62922j68993J76574K73337l05870J12661l14611P20459m54707
17029C383585j39423k91617K21519M8402K40279N73119o02849j34523Q66318n53717
17019C611093n16623L34277J05018N64497p67946J013321n17397K39069l17001
17010C748308l41106L11574J92888L87443L92500j61972j55809N22147k95960
17001D600013K23980q02445r6166L98462r4998N53572m46839O63478l46896j0945
16991D641216M51231K16810k99143j77041L81082k51714O41969j31359k02842
16982E270209m36794K61531K40354L3666J69860J31489k27043L26673m48708L86798
$$ plain form
16972 5708035 5090241 6356781 6095666 6018766 5253453 6342999 6344198 6054477 6321874 6903565
16962 6903565 6461998 6364386 7146667 6946229 6230209 6609447 6595616 7935381 6916377
16953 6916377 6888899 7760940 7550705 7902631 6730355 7759498 6860630 7487620 7394263
16944 7394263 8189020 8099977 8163657 7950977 8920174 8713137 8313953 8403191 8645911 8582189
16934 8582189 8840995 8937387 8714498 8552238 9482059 9129091 9213194 9654361 9942548 9702316
16924 9702316 10070978 10070160 10466465 10216152 10363838 10331634 11168065 10674820 10739606 11044078
16914 11044078 11227542 11608533 11619125 11498558 11408883 11702988 12683134 12549531 13344242 11760614
16904 11760614 12808572 12822509 13238291 13079241 13774527 13539859 14055799 14504487 14218396
$$ packed form
16972E708035o17794J266540k61115p6900p65313J089546J199k89721K67397N81691
16962F903565m41567r7612P82281k00438p16020L79238j3831J339765j019004
16953F916377k7478Q72041k10235L51926j172276J029143q98868O26990r3357
16944G394263P94757q9043O3680k12680R69197k07037l99184Q9238K42720o3722
16934H582189K58806R6392k22889j62260R29821l52968Q4103M41167K88187k40232
16924I702316L68662q18L96305k50313J47686l2204Q36431m93245O4786L04472
16914A1044078J83464L80991J0592j20567q9675K94105R80146j33603P94711j583628
16904A1760614J047958J3937M15782j59050O95286k34668N15940M48688k86091
$$ plain form
16895 14218396 14310362 14337911 14757057 15123005 15412545 15303329 15366120 16068029 15999925 16837768
16885 16837768 16659259 16825548 16994848 17304838 18200865 18449738 18216036 18424957 19045010
16876 19045010 18723052 19770985 19590140 20127205 20588868 20143100 21174769 21004040 21483023
16867 21483023 21222992 22395567 23015463 22474742 22953098 23808366 23740045 24710330 24468391
16858 24468391 24984708 25181734 26335727 25886890 26817580 27106620 27876506 28025280 28022071
16849 28022071 28690874 30056763 30013527 29516724 30756008 30634678 31116489 32189934 31424859
16840 31424859 32464500 33959196 33997410 34553915 35234342 35605321 36083332 36692098 37550411
16831 37550411 38009588 38584378 39074512 39719652 39988869 41380402 42093486 41859645 43934550
$$ packed form
16895A4218396R1966K7549M19146L65948K89540j09216O2791P01909o8104Q37843
16885A6837768j78509J66289J69300L09990Q96027K48873k33702K08921O20053
16876A9045010l21958J047933j80845N37065M61663m45768J031669j70729M78983
16867B1483023k60031J172575O19896n40721M78356Q55268o8321R70285k41939
16858B4468391N16317J97026J153993m48837R30690K89040P69886J48774l209
16849B8022071O68803J365889m3236m96803J239284j21330M81811J073445p65075
16840C1424859J039641J494696L8214N56505O80427L70979M78011O08766Q58313
16831C7550411M59177N74790M90134O45140K69217J391533P13084k33841K074905
$$ plain form
16822 43934550 43482373 44542877 45596418 45897701 46615434 47202499 48396225 48597328 49759218
16813 49759218 50584500 51607755 51601031 53177891 54614806 54455249 55337800 56745517 57335033
16804 57335033 58276167 59404443 60160314 60988212 61758030 63038180 64157074 64719000 65593004
16795 65593004 67486979 68433455 69144636 70044215 71911177 72882881 73950847 75388517 75780211
16786 75780211 76871197 77772265 79282174 79958787 81177052 82811354 84356907 85149864
16778 85149864 86477892 88418922 88900770 90439936 91504741 93514729 94449159 96091659
16770 96091659 97318241 98657671 99703483 100730985 102262956 103677819 105588431 106363222
16762 106363222 108241443 108888993 110394629 111289273 112751307 113707529 114994963 116029462
$$ packed form
16822D3934550m52177J060504J053541L01283P17733N87065J193726K01103J161890
16813D9759218Q25282J023255o724J576860J436915j59557Q82551J407717N89516
16804E7335033R41134J128276P55871Q27898P69818J280150J118894N61926Q74004
16795F5593004J893975R46476P11181Q99579J866962R71704J067966J437670L91694
16786G5780211J090986R01068J509909O76613J218265J634302J545553P92957
16778H5149864J328028J941030M81848J539166J064805K009988R34430J642500
16770I6091659J226582J339430J045812J027502J531971J414863J910612P74791
16762A06363222J878221O47550J505636Q94644J462034R56222J287434J034499
$$ plain form
16754 116029462 117659819 118262460 120183906 121708804 121773181 123329622 124463942 125098088
16746 125098088 126355592 127040921 128426800 129742092 130537008 131514927 132080193 132812132 133142280
16737 133142280 134236241 135621780 135744070 136767439 136207915 136935793 137291884 138575271
16729 138575271 138097631 138431867 138483727 138701316 139070420 138165153 138902024 138288809 137212978
16720 137212978 137509633 137186516 136210238 135373392 133932447 133153929 131647918 130664940 128558715
16711 128558715 127047125 125155250 124393248 122735205 120080505 117968130 115425498 113892497
16703 113892497 110754050 109764755 106700272 103975941 101482513 99387808 96947040 93720638
16695 93720638 91836892 89433104 87529024 84703398 82707335 80711894 77892073 75198241
$$ packed form
16754A16029462J630357O02641J921446J524898O4377J556441J134320O34146
16746A25098088J257504O85329J385879J315292P94916R77919N65266P31939L30148
16737A33142280J093961J385539J22290J023369n59524P27878L56091J283387
16729A38575271m77640L34236N1860K17589L69104r05267P36871o13215j075831
16720A37212978K96655l23117r76278q36846j440945p78518j506011r82978k106225
16711A28558715j511590j891875p62002j658043k654700k112375k542632j533001
16703A13892497l138447r89295l064483k724331k493428k094705k440768l226402
16695I3720638j883746k403788j904080k825626j996063j995441k819821k693832
$$ plain form
16687 75198241 73543913 71378713 68771711 67309403 65133644 63156404 61385863 59480168
16679 59480168 57393953 56244730 54143742 52523726 50860466 49024114 47784292 47060057
16671 47060057 44759478 43856041 42400934 40727733 39149044 38815241 37804930 36553146
16663 36553146 34907312 34340191 33433927 32007219 31690294 30623228 29675392 29360617 27315355
16654 27315355 27636434 26965460 26156633 26082265 24546195 24119715 23782871 23035118 22108492
16645 22108492 21624845 19855935 20276898 20287495 19653343 19540216 18588359 18497622 17684946
16636 17684946 17379392 16844266 16459752 16118635 15048470 15675769 15175479 14775530 15068230
16627 15068230 14348524 14199182 13649295 13298638 13384056 12914650 13472642 12140064 12616084
$$ packed form
16687G5198241j654328k165200k607002j462308k175759j977240j770541j905695
16679E9480168k086215j149223k100988j620016j663260j836352j239822p24235
16671D7060057k300579r03437j455107j673201j578689l33803j010311j251784
16663C6553146j645834n67121r06264j426708l16925j067066r47836l14775k045262
16654B7315355L21079o70974q08827p4368j536070m26480l36844p47753r26626
16645B2108492m83647j768910M20963J0597o34152j13127r51857r0737q12676
16636A7684946l05554n35126l84514l41117j070165O27299n00290l99949K92700
16627A5068230p19706j49342n49887l50657Q5418m69406N57992j332578M76020
$$ plain form
16618 12616084 11689326 11401555 11252219 11092226 11559873 10556731 10908260 10527540 9966912
16609 9966912 10218344 9807564 10418497 9350720 9666575 9448060 9161181 9107392 8966449
16600 8966449 9234258 8589592 8500239 8254184 7997206 8014140 8189843 7469352 7335437 7502430
16590 7502430 7790489 8205860 7962761 7280485 7305737 7273281 6819097 7109419 6516856 7300422
16580 7300422 7089361 6975303 6969456 6093558 6724061 5666266 6423433 6080893 6420195 5825834
16570 5825834 5147943 5787348 5940837 5434734 5338270 5532124 5323516 4889488 4987475 5097688
16560 5097688 5027429 5214025 5264664 5009138 5037773 5262444 5096973 5023107 4756074 4670014
16550 4670014 4016642 4341670 3986290 3985870 4576321 4613575 4219507 3928862 4210935 4108892
$$ packed form
16618A2616084r26758k87771j49336j59993M67647j003142L51529l80720n60628
16609I966912K51432m10780O10933j067777L15855k18515k86879n3789j40943
16600H966449K67809o44666q9353k46055k56978J6934J75703p20491j33915J66993
16590G502430K88059M15371k43099o82276K5252l2456m54184K90322n92563P83566
16580G300422k11061j14058n847q75898O30503j057795P57167l42540L39302n94361
16570E825834o77891O39405J53489n06103r6464J93854k08608m34028R7987J10213
16560E097688p0259J86596N0639k55526K8635K24671j65471p3866k67033q6060
16550D670014o53372L25028l55380m20N90451L7254l94068k90645K82073j02043
$$ plain form
16540 4108892 4213342 4075391 3941180 3805013 3377796 3677268 3825920 4096007 3754940
16531 3754940 3410453 3500242 3556626 3827089 4048863 3407023 3235105 3512565 3644027 3004258
16521 3004258 3746532 4021992 3468635 2966065 2721087 2648212 2943845 2810518 3166113 2807111
16511 2807111 2246881 3081972 3289813 3105275 2738324 2989436 2807894 2537065 2895293
16502 2895293 2980124 2605143 2726441 2411469 3206606 2697980 2567227 2245547 2626621 2831749
16492 2831749 1655276 2897606 2569050 2845678 2668386 2549840 2711738 2747289 2535173
16483 2535173 2246190 2531077 2243577 2412993 1903179 2242030 2412266 2361506 2483610 1715785
16473 1715785 2628269 2067006 2826807 3089097 2644965 2163873 2097091 2638608 1898323 1301657
$$ packed form
16540D108892J04450j37951j34211j36167m27217K99472J48652K70087l41067
16531C754940l44487Q9789N6384K70463K21774o41840j71918K77460J31462o39769
16521C004258P42274K75460n53357n02570k44978p2875K95633j33327L55595l59002
16511B807111n60230Q35091K07841j84538l66951K51112j81542k70829L58228
16502B895293Q4831l74981J21298l14972P95137n08626j30753l21680L81074K05128
16492B831749j176473J242330l28556K76628j77292j18546J61898L5551k12116
16483B535173k88983K84887k87500J69416n09814L38851J70236n0760J22104p67825
16473A715785R12484n61263P59801K62290m44132m81092o6782N41517p40285n96666
$$ plain form
16463 1301657 2137265 2279357 1507315 2203059 2458494 2186635 2569394 1688165 2465969
16454 2465969 1583463 1877318 1923637 1746405 1996597 1688782 2106883 2267856 1843819 2230396
16444 2230396 2042714 1938809 1922642 2115997 1983222 1548189 1944055 1182576 2132510 1836042
16434 1836042 1726491 1668930 1920908 1673960 1749525 1710161 1390230 1539509 1483494 1870617
16424 1870617 929182 1616374 1153611 1503322 1703857 1266652 1686792 1328359 1539597
16415 1539597 1667194 1893663 987278 1959133 1533814 1319239 1226721 1155866 2023681 987639
16404 1540330 1265288 1374627 1368462 1285032 1643099 1172126 2003899 2084487 1777230 1061715
16394 1061715 1119648 821974 903009 1331250 1081138 994796 1260443 1795882 1177289 1084505
$$ packed form
16463A301657Q35608J42092p72042O95744K55435k71859L82759q81229P77804
16454B465969q82506K93855M6319j77232K50192l07815M18101J60973m24037L86577
16444B230396j87682j03905j6167J93355j32775m35033L95866p61479R49934k96468
16434A836042j09551n7561K51978k46948P5565l9364l19931J49279n6015L87123
16424A870617I29182O87192m62763L49711K00535m37205M20140l58433K11238
16415A539597J27597K26469r06385R71855m25319k14575r2518p0855Q67815I87639
16404A540330k75042J09339o165q3430L58067m70973Q31773Q0588l07257p15515
16394A061715N7933k97674Q1035M28241k50112q6342K65647N35439o18593r2784
$$ plain form
16384 1084505 1290569 1103004 1326446 1150452 937732 1552253 1509174 625594 1211802 1302680
16374 1302680 1523679 995630 1655349 705013 1142497 1270105 915355 996391 558961 1073541
16364 1073541 1247131 1407537 1052842 1213206 1032571 685963 1365466 1086411 734959
16355 734959 486122 2118300 411411 721128 1323590 1923983 927822 757647 1336301
16346 1336301 1679618 1285738 347281 1169879 1169499 435338 445600 669620 1506146 1087679
16336 1087679 592871 1398915 922477 949819 641954 1075875 37422 1081682 115731 274358
16326 274358 758704 484596 1516980 373912 859287 965441 733914 913501 863063 554392
16316 554392 239007 356901 534861 422214 1041069 182691 459921 49959 552914 402920
$$ packed form
16384A084505K06064j87565K23442j75994k12720O14521m3079F25594N86208R0878
16374A302680K20999n28049O59719G05013M37484J27608l54750Q1036m37430N14580
16364A073541J73590J60406l54695J60364j80635l46608O79503k79055l51452
16355G34959k48837J632178D11411L09717O02462O00393I27822j70175N78654
16346A336301L43317l93880C47281Q22598l80D35338J0262K24020Q36526m18467
16336A087679m94808Q06044m76438K7342l07865M33921C7422J044260A15731J58627
16326B74358M84346k74108J032384C73912M85375J06154k31527J79587n0438l08671
16316E54392B39007J17894J77960j12647O18855A82691K77230D9959N02955j49994
$$ plain form
16306 402920 217961 892425 745842 1126626 788733 23163 819939 870781 550628 719831
16296 719831 419855 530585 1084918 414706 610754 533350 679481 544835 666800 305630
16285 767250 471350 358461 538237 641344 601508 88225 806569 614434 348348 684529
16275 684529 1148283 766593 744076 183473 442751 458366 809120 661711 331064 -124401
16264 1214198 27257 574624 525279 866507 539147 664587 230869 864798 748484 856195
16254 856195 14242 488510 834496 736518 379499 118366 427117 1087146 -194936 391932
16243 322775 733882 201583 577707 290248 543700 -263298 260540 -278950 299626 730534
16233 730534 565938 339422 120968 275916 198405 -219326 187664 543692 619440 987659
$$ packed form
16306D02920j84959O74464j46583L80784l37893B3163P96776N0842l20153J69203
16296G19831k99976J10730N54333D14706J96048p7404J46131j34646J21965C05630
16285G67250k95900j12889J79776J03107l9836H8225P18344j92135k66086L36181
16275F84529M63754l81690k2517A83473K59278J5615L50754j47409l30647a24401
16264A214198B7257N47367m9345L41228l27360J25440B30869O33929j16314J07711
16254H56195A4242M74268L45986r7978l57019A18366L08751O60029a94936C91932
16243C22775M11107B01583L76124k87459K53452b63298B60540b78950B99626M30908
16233G30534j64596k26516A20968J54948p7511b19326A87664L56028P5748L68219
$$ plain form
16223 987659 18851 240148 102853 601685 -38360 19720 836744 1276576 535027 259170
16212 40411 292694 72930 570706 -239041 1252 35596 220540 -311465 397185 674252
16202 674252 251918 494857 576442 136766 163965 107845 508424 79385 18929 -2554 610105
16190 555389 568797 676999 382793 167841 544071 428817 579263 405600 -463036 340592
16179 -269790 168807 638753 467584 596222 951049 656893 324883 498065 506732 196424
16168 332287 -188425 -42795 246129 569958 548368 582042 138204 253618 558464 556911
16158 556911 677295 340077 569072 538831 393433 131594 429675 409969 30821 -168591
16147 142667 359075 37641 21508 1014188 -267660 116138 336432 283814 -111108 298803
$$ packed form
16223I87659A8851K21297A02853M98832c8360A9720Q17024M39832E35027B59170
16212D0411K52283G2930M97776b39041A252L4344J84944c11465C97185K77067
16202F74252B51918K42939Q1585A36766K7199n6120M00579G9385A8929b554F10105
16190E55389J3408J08202k94206A67841L76230j15254J50446j73663d63036C40592
16179b69790A68807M69946j71169J28638L54827k94156C24883J73182Q667A96424
16168C32287a88425d2795B46129L23829k1590L3674A38204J15414L04846j553
16158E56911J20384l37218K28995l0241j45398A31594K98081j9706C0821a68591
16147A42667K16408C7641j6133R92680b67660A16138K20294n2618a11108B98803
$$ plain form
16136 428731 319051 430435 -365866 203767 -30700 329739 405082 163976 677517 37347
16125 484462 307208 -172838 455061 560613 149564 -291208 -275131 794052 50416 280410
16115 280410 -351449 566151 338246 554237 -415924 75880 -120592 268405 779160 -655811
16104 -376393 257711 122318 395959 249930 -334199 -177916 159658 -115630 -468586 -214625
16093 -199174 -367654 -432394 503788 -318873 185880 111671 114007 -286066 -233829 924646
16082 669566 340505 469114 150979 829324 433869 179029 596080 515715 -28094 -518798
16072 -518798 432528 472430 923804 351266 53015 116328 401941 168775 812096 589358
16062 589358 193250 231848 614344 167247 53812 -137011 173523 492825 733944 -279662
$$ packed form
16136D28731j09680J11384c65866B03767c0700C29739P5343A63976N13541C7347
16125D84462j77254a72838D55061J05552A49564b91208J6077G94052E0416K29994
16115B80410c51449E66151k27905K15991d15924G5880a20592B68405N10755f55811
16104c76393B57711A22318K73641j46029c34199J56283A59658a15630l52956b14625
16093a99174j68480o4740E03788c18873A85880p4209K336b86066N2237I24646
16082F69566l29061J28609A50979O78345l95455A79029M17051q0365b8094m90704
16072e18798D32528L9902M51374C51266E3015O3313K85613A68775O43321k22738
16062E89358A93250L8598L82496A67247E3812a37011A73523L19302K41119b79662
$$ plain form
16051 434675 25702 391452 -247149 -367886 4054 198337 382627 408720 243230 160406
16041 160406 260128 148063 150490 -627366 371418 406949 -20432 -173556 -253451 -180355 337217
16029 509973 483104 -396419 -71137 59224 -124616 -422737 221827 -36245 619591 365617
16019 365617 -390373 623529 465704 616279 104639 -385987 343182 284832 -656823 665965
16008 122646 671914 -315309 871239 -345033 -667938 407863 -256984 123179 -121444 149680
15997 346201 -701987 153587 181894 108867 -237966 489590 450512 713880 -708969 175909
15986 1027241 -304575 -90133 -150127 609315 -266350 951112 123353 -45392 -101805 369143
15975 6769 -368944 82184 242929 -239899 414380 443241 -384131 -3954 225097 377470 -224486
$$ packed form
16051D34675B5702L65750b47149j20737D054J94283J84290K6093j65490q2824
16041A60406R9722j12065K427f27366C71418L5531b0432j53124p9895P3096C37217
16029E09973k6869c96419g1137E9224a24616k98121B21827c6245F19591k53974
16019C65617c90373F23529j57825J50575A04639c85987C43182n8350f56823F65965
16008A22646N49268c15309H71239c45033l22905D07863b56984A23179a21444A49680
15997C46201g01987A53587K8307p3027b37966D89590l9078K63368g08969A75909
15986A027241c04575i0133n9994F09315b66350I51112A23353d5392n6413C69143
15975F769c68944H2184J60745b39899D14380K8861c84131c954B25097J52373b24486
$$ plain form
15963 111763 -225455 -473599 -195748 -144993 474693 403125 355755 -82695 419609 -480474
15952 206266 -24948 -244474 459788 178552 107868 -138410 -215086 -199960 -245958 -203238 149705
15940 -7668 214790 158068 456894 209866 -159829 719103 224101 307519 134887 -403993
15929 -121604 385694 -180288 563481 236001 -50850 -145238 -39508 -273698 -339777 29781
15918 -637242 104082 63538 -28529 351499 -275185 -137479 -150103 -89935 -45024 29425 -161783
15906 -144283 146934 317212 -652269 128310 264161 -183721 -225650 -318026 -306947 -11659
15895 237339 203155 -85762 -136905 -82432 -244146 -223884 223833 -138893 -202718 355415 155461
15883 -105370 -148470 231048 -516958 291435 -214329 315687 621568 -1029248 244459 -635751
$$ packed form
15963A11763b25455k48144a95748N0755D74693p1568m7370h2695D19609d80474
15952B06266b4948k19526D59788A78552p0684a38410p6676J5126m5998M2720A49705
15940g668B14790n6722K98826B09866a59829G19103B24101Q3418A34887d03993
15929a21604C85694a80288E63481B36001e0850r4388c9508k34190o6079B9781
15918f37242A04082m0544b8529C51499b75185a37479j2624O0168M4911B9425a61783
15906a44283A46934J70278f52269A28310J35851a83721m1929r2376J1079a1659
15895B37339l4184h5762n1143N4473j61714K0262B23833a38893o3825C55415A55461
15883a05370m3100B31048e16958B91435b14329C15687L05881a029248B44459f35751
$$ plain form
15872 -423274 -58879 -272187 -53279 -124451 144374 -354208 85725 -577944 150116 83108
15862 83108 -161068 -196420 -842908 -16859 690025 910311 -106340 -563903 19393 196731
15852 196731 -19095 -155974 -176184 150251 -22938 109477 261044 731222 245228 617100
15842 617100 -639349 -704236 -275556 -661729 -123558 538743 -211379 -113507 -54899 -342730
15832 -342730 297080 95225 -147403 81424 254615 -84720 653065 10795 235953 82669
15821 519562 -273908 514900 388350 -563579 458717 171238 559827 294793 -226815 298839
15810 743439 -131838 -68807 247513 -133123 301598 159849 -126437 31000 46996 -171425
15799 -68376 -671450 84137 -61049 -165143 -146275 -94879 528084 -8300 337213 274613 -271528
$$ packed form
15872d23274e8879k13308e3279p1172A44374c54208H5725e77944A50116o7008
15862H3108a61068l5352o46488a6859F90025K20286a06340m57563A9393J77338
15852A96731a9095j36879k0210A50251b2938A09477J51567M70178B45228L71872
15842F17100f39349o4887b75556l86173a23558E38743b11379R7872e4899k87831
15832c42730B97080I5225a47403H1424J73191h4720F53065A0795K25158H2669
15821E19562b73908E14900j26550e63579D58717A71238L88589k65034b26815B98839
15810G43439a31838O3031B47513a33123C01598j41749a26437C1000J5996a71425
15799f8376o03074H4137f1049j04094J8868N1396E28084h300C37213o2600b71528
$$ plain form
15787 25202 117418 -54695 -697293 -56768 257616 23393 -347934 -148949 -84569 691207 306460
15775 -15886 371280 141778 -325085 127249 -134181 155858 -230613 -110096 -730567 261370
15764 -122732 339032 -366663 -19659 636591 -160149 338776 -468325 108918 299102 -59090
15753 -314696 -79764 183760 73681 -229242 -201570 51631 -525590 -107145 -215193 492113
15742 375985 -380131 369831 -165056 -87 -458972 -316346 -490793 -90217 -268051 126686
15731 -167567 -589703 -224576 -466114 -103241 304694 -312343 -138458 -37909 274703 -3091
15720 159327 92668 -557963 -310057 31612 -247654 6285 594761 -183133 284423 -277034
15709 294989 -500432 -706179 -200203 103757 -312990 149583 193308 300965 176371 -411179
$$ packed form
15787B5202R2216e4695o42598e6768B57616B3393c47934a48949O4380F91207C06460
15775a5886C71280A41778c25085A27249a34181A55858b30613a10096o20471B61370
15764a22732C39032c66663a9659F36591a60149C38776d68325A08918J90184e9090
15753c14696g9764A83760G3681b29242K7672E1631e25590a07145j08048D92113
15742C75985c80131C69831a65056h7m58885J42626j74447i0217j77834A26686
15731a67567m22136b24576k41538a03241C04694c12343a38458c7909B74703c091
15720A59327o6659e57963K47906C1612b47654F285N88476a83133B84423b77034
15709B94989e00432k05747b00203A03757c12990A49583M3725J07657j24594d11179
$$ plain form
15698 92582 -257573 -83862 -64415 213398 124444 -267423 -154454 520462 57647 288069
15688 288069 -582653 -146224 -161464 174764 -464785 305932 185385 344939 412418 -169223
15677 -580170 -810297 82438 -458651 559729 -106036 351991 -391701 -53162 53144 -88 -528317
15666 -528317 -263000 286924 88538 -241238 329586 -126066 370450 581129 -386667 -71622
15655 -40856 653887 -271669 -106476 85911 -32295 -40019 -314193 116188 -77279 -106170 -172243
15644 -172243 287136 -398012 131029 19348 -188307 -368774 -113986 546 11447 -61821 -153782
15633 -153782 -237138 -231898 785300 188029 -191679 -403250 49243 265819 1957 -301188 22646
15621 -76171 -198028 299375 241266 61106 875331 -218954 -510920 -603375 -284966 -210228
$$ packed form
15698I2582b57573h3862J9447B13398q8954b67423J12969E20462E7647K30422
15688B88069e82653a46224j5240A74764d64785C05932j20547J59554O7479a69223
15677e80170k30127H2438d58651E59729a06036C51991c91701e3162E3144h8n28229
15666e28317b63000B86924H8538b41238C29586a26066C70450K10679c86667g1622
15655d0856F53887b71669a06476H5911c2295p724k74174A16188g7279k8891o6073
15644a72243B87136c98012A31029A9348a88307j80467a13986E46J0901f1821r1961
15633a53782q3356N240G85300A88029a91679k11571D9243K16576A957c01188B2646
15621g6171j21857B99375n8109F1106Q14225b18954k91966r2455b84966P4738
$$ plain form
15611 -210228 -214850 -345248 -121269 -278431 -708430 421583 -517305 32211 -430363 -342248
15601 -342248 -234880 334691 -208100 157558 -463185 -607333 -164078 -350428 598313 50317
15590 338335 496294 428089 -365817 -7799 -946620 -605977 -68458 -855360 -115435 -324986
15580 -324986 546419 -223098 -42569 133123 98410 448616 -261448 -681280 174481 -225390
15569 479235 -170793 650660 72989 103874 -162918 147240 -251393 182888 -89093 -282880
15559 -282880 -137904 -20980 1184599 428525 521978 170197 -272927 -93255 285934 11413
15548 -348506 -136191 65040 188061 100806 -68869 -316628 277158 526514 -403146 -40328
15537 -408070 285272 216239 84682 310529 -511690 175696 -426166 95251 -68889 604810
$$ packed form
15611b10228m622j30398a21269j57162m29999D21583e17305C2211d30363Q8115
15601c42248J07368C34691b08100A57558d63185j44148a64078j86350E98313E0317
15590C38335J57959o8205c65817g799r38821L40643f8458p86902a15435k09551
15580c24986E46419b23098d2569A33123l4713L50206b61448m19832A74481b25390
15569D79235a70793F50660G2989L0885a62918A47240b51393A82888h9093j93787
15559b82880a37904b0980A184599D28525R3453A70197b72927i3255B85934A1413
15548c48506a36191F5040J23021q7255f8869k47759B77158K49356d03146d0328
15537d08070B85272o9033H4682K25847e11690A75696d26166I5251f8889F04810
$$ plain form
15526 441637 202632 702388 189391 -121399 389987 142318 -59393 -338295 -17265 507862
15515 -162327 -428905 -814419 524836 -48660 967917 -1032 363688 124528 311957 270088
15505 270088 846713 191881 -26445 889205 271151 244859 157454 678392 605815 -80437
15494 406950 -320499 408755 -363313 546118 242800 22369 543148 401865 349115 497078
15484 497078 147857 431750 -88339 246440 357629 478402 598412 430998 854696 365426
15473 -29938 2228 491426 71642 317034 408749 313533 -447408 273143 432825 808747 400203
15461 1270269 -189823 595411 103909 162306 587654 260476 85334 964586 707702 765027
15451 765027 1016766 208081 248104 -523754 152849 22665 972554 -66315 903418 1376172
$$ packed form
15526D41637B02632M99756A89391a21399C89987A42318e9393k78902a7265E07862
15515a62327k66578l85514E24836d8660I67917a032C63688A24528J87429m1869
15505B70088N76625A91881b6445H89205B71151k6292q7405N20938p2577h0437
15494D06950c20499D08755c63313E46118B42800B2369N20779j41283n2750J47963
15484D97078A47857K83893h8339B46440J11189J20773J20010j67414M23698C65426
15473b9938B228M89198G1642K45392R1715r5216d47408B73143J59682L75922D00203
15461A270269a89823E95411A03909N8397M25348B60476H5334Q79252k56884N7325
15451G65027K51739B08081M0023e23754A52849B2665R49889f6315I03418M72754
$$ plain form
15441 1376172 214114 -534938 418339 164751 287358 98655 186661 323453 749577 100213
15430 167030 -61625 201638 493644 48619 181640 89157 39205 137753 -21139 75445 -237973
15418 174170 382446 136294 -66013 -653672 457489 417784 383612 295215 30558 742733
15408 742733 369536 1152911 -284530 -58895 164175 -484989 -371289 213844 200553 470989
15398 470989 -79589 -80302 113749 -389397 75904 18675 240064 -313992 561192 -46504 852672
15386 284138 633677 622842 -417385 468896 9982 123528 332097 451481 142928 -57243
15375 269074 -388773 132168 405486 -212992 300227 358687 34177 319986 774131 335757
15364 -322311 -205848 -89975 453707 338055 662998 760297 -237736 436260 -79705 223495
$$ packed form
15441A376172B14114e34938D18339A64751J22607I8655Q8006J36792M26124A00213
15430A67030f1625B01638K92006D8619J33021H9157C9205R8548b1139G5445b37973
15418A74170K08276A36294f6013n87659D57489l9705l4172q8397C0558P12175
15408G42733C69536P83375b84530e8895A64175d84989J13700B13844j3291K70436
15398D70989g9589p13A13749c89397G5904A8675K21389c13992E61192d6504H52672
15386B84138L49539j0835d17385D68896I982J13546K08569J19384A42928e7243
15375B69074c88773A32168K73318b12992C00227N8460C4177K85809M54145C35757
15364c22311J16463h9975D53707j15652L24943R7299b37736D36260g9705B23495
$$ plain form
15353 373396 516170 373687 411261 -136292 303999 448558 216120 121950 181908 150811
15343 150811 -78065 467623 49923 550235 548619 126317 399217 308014 185438 259586 685033
15332 685033 207948 548485 307852 4804 593435 384339 362647 937046 -359604 64114
15321 743537 556064 253339 -189680 -373064 279025 411858 277377 -13413 -215905 576591
15310 701676 716886 366423 411521 138660 10315 409508 360668 -430772 69918 670203
15300 670203 -80851 91075 494618 104094 313495 102997 -11008 -96566 -60688 -137962 385812
15288 612222 -184817 565486 297858 186156 362241 -28065 425623 361253 101082 518834
15278 518834 -8743 -231709 578352 81633 -11658 148971 384470 -326699 175158 45901
$$ packed form
15353C73396J42774j42483L7574a36292C03999J44559B16120r4170N9958l1097
15343A50811g8065D67623D9923N00312j616A26317K72900r1203j22576P4148M25447
15332F85033B07948L40537k40633D804N88631k09096k1692N74399c59604F4114
15321G43537j87473B53339a89680j83384B79025J32833j34481a3413k02492E76591
15310G01676J5210l50463M5098A38660A0315L99193m8840d30772F9918O00285
15300F70203h0851I1075M03543A04094K09401A02997a1008q5558L5878p7274C85812
15288F12222a84817E65486k67628j11702J76085b8065D25623o4370A01082M17752
15278E18834h743k22966E78352H1633a1658A48971K35499c26699A75158D5901
$$ plain form
15267 351470 1091669 622712 162415 41804 261224 -687654 27597 130801 236934 -156761
15256 43332 -62317 799326 895096 537224 -121790 703554 471801 774585 74593 509687
15246 509687 604230 374436 390315 516690 763583 411126 -103438 595654 -22453 1341304
15235 559133 646234 655485 1018469 845329 260157 199347 322061 639060 1004070 -146121
15224 278358 425000 1183020 406811 698247 28969 133483 -22302 376326 372744 359359
15214 359359 568560 307969 467337 32590 372256 196931 645624 144377 -555074 -6413
15203 -416035 554333 721792 450224 82685 269750 648572 298236 451962 64402 203607
15193 203607 123665 -47426 -629723 198604 1160791 -108379 267337 405980 -157145 -9436
$$ packed form
15267C51470P40199m68957A62415D1804K19420f87654B7597J03204J06133a56761
15256D3332f2317G99326R5770l57872a21790G03554k31753L02784G4593M35094
15246E09687R4543k29794J5879J26375K46893l52457a03438E95654b2453A341304
15235E59133Q7101R251L62984j73140B60157o0810J22714L16999L65010a46121
15224B78358J46642P58020D06811K91436B8969J04514b2302C76326l582j3385
15214C59359K09201k60591J59368C2590L39666j75325M48693A44377e55074f413
15203d16035E54333J67459k71568H2685J87065L78822B98236J53726F4402J39205
15193B03607p9942d7426n82297A98604R62187a08379B67337J38643a57145i436
$$ plain form
15182 15090 -152163 344295 32483 -51980 178440 1067267 173538 305490 57839 474737
15172 474737 -87175 248443 230055 -193971 490749 503767 387865 580867 -4177 -73080 252268
15160 -75533 260041 1222697 275001 247469 64688 -40842 368862 188513 451996 -233418
15149 374170 145294 325447 158496 61772 401817 272243 -498785 859962 -149721 203653
15138 133445 697530 -43724 585802 -14109 -318593 287151 191198 606103 702336 -319926
15127 338282 792174 461013 287509 129668 370023 -179156 1058419 520807 536894 275392
15117 275392 208974 30116 512812 657194 205074 272690 282559 777913 61510 465311 233789
15106 233789 587738 843325 1116473 564825 579454 461449 76087 602490 281716 937948
$$ packed form
15182A5090a52163C44295C2483e1980A78440Q88827A73538J31952E7839M16898
15172D74737h7175B48443j8388a93971D90749J3018j15902J93002d177o8903B52268
15160g5533B60041R62656B75001k7532F4688d0842C68862j80349K63483b33418
15149C74170A45294J80153A58496F1772L40045j29574d98785H59962a49721B03653
15138A33445N64085d3724E85802a4109l04484B87151r5953M14905R6233c19926
15127C38282M53892l31161j73504A29668K40355a79156A058419E20807J6087k61502
15117B75392o6418C0116M82696J44382B05074O7616R869M95354F1510M03801k31522
15106B33789L53949K55587K73148n51648J4629j18005G6087N26403B81716O56232
$$ plain form
15096 937948 369110 610349 165945 387598 747467 576167 543328 511001 90332 599078
15086 599078 163597 814510 1028852 -202846 754567 532360 839033 355810 919096 770128
15076 770128 34502 935812 403289 648736 797757 696945 408015 219425 971385 727011
15066 727011 663584 733662 296186 893925 671257 751395 1468887 936270 757391 147291
15055 1049268 513773 137857 -167212 769692 635457 249065 -129227 1171886 521036
15045 511379 1337535 4778 951384 472344 503643 1240559 675220 1051316 584839 1158606
15035 1158606 1210821 814398 1271529 958718 675837 1403448 1382138 1493192 725442 818127
15025 818127 1350375 1485490 694299 616678 1492634 936508 1019424 552399 1288771 769334
$$ packed form
15096I37948C69110K41239A65945K21653L59869j71300l2839l2327I0332N08746
15086E99078A63597O50913K14342b02846G54567k22207L06673C55810N63286j48968
15076G70128C4502R01310D03289K45447J49021j00812k88930j88590P51960k44374
15066G27011o3427P0078B96186N97739k22668Q0138P17492n32617j78879A47291
15055A049268E13773A37857a67212G69692j34235B49065a29227A171886E21036
15045E11379Q26156D778R46606D72344L1299P36916n65339L76096m66477N73767
15035A158606N2215l96423M57131l12811k82881P27611k1310J11054G25442R2685
15025H18127N32248J35115F94299p7621Q75956n56126Q2916m67025P36372n19437
$$ plain form
15015 769334 686110 930436 891725 1311337 1395187 641208 1112209 1241225 1188848 722510
15005 722510 918423 1098123 1298680 1199809 2000654 1203832 1255157 1599087 880502 1151353
14995 1151353 1423756 1164363 953473 1180339 1102568 1553049 1246610 1569761 809093 1159506
14985 1159506 1734469 950473 1023023 978996 1157651 1111294 1476940 625570 1754160 1023040
14975 1023040 1270067 1928126 1689599 1456538 1373835 1466928 1334593 1249146 1560825 1886192
14965 1886192 1634946 1074303 1003354 1436923 1891232 817564 1181148 1517942 1391488 1720238
14955 1720238 997680 1502830 1014432 1545931 1521636 1861084 1579666 1733081 1570835 1456906
14945 1456906 2240261 1541165 1529128 1257242 1607635 2028871 1781560 1979204 1379430 1177668
$$ packed form
15015G69334q3224K44326l8711M19612Q3850F41208M71001J29016n2377m66338
15005G22510J95913J79700K00557r8871Q00845p96822N1325L43930p18585K70851
14995A151353K72403k59393k10890K26866p7771M50481l06439L23151p60668L50413
14985A159506N74963p83996P2550m4027J78655m6357L65646F25570J128590p31120
14975A023040K47027O58059k38527k33061q2703R3093j32335q5447L11679L25367
14965A886192k51246n60643p0949M33569M54309H17564L63584L36794j26454L28750
14955A720238p22558N05150m88398N31499k4295L39448k81418J53415j62246j13929
14945A456906P83355o99096j2037k71886L50393M21236k47311J97644n99774k01762
$$ plain form
14935 1177668 1986152 1107895 1918317 1441108 2129894 1680740 1542861 1587312 1615347 1692340
14925 1692340 1880717 2025935 1098147 1659631 1923067 1659713 1828924 1924152 1560545 1999449
14915 1999449 1539913 1998596 1489310 1825363 1607686 2200221 1653665 1611156 1301387 1287241
14905 1287241 1467095 1990186 1643333 1172693 1013822 1427967 1303797 1723270 1132378
14896 1132378 1309720 1791802 1264730 2152694 1696913 1102350 1874231 1243283 770904
14887 770904 1601582 1776368 1526491 1200261 1454945 1489820 1331473 1474495 1345449 2513527
14877 2513527 1707891 1404726 1088715 1515331 1247902 1997222 1660760 817950 1332534
14868 1332534 1925929 1872393 1333271 1500151 1360737 979573 1306918 1565754 899976 1336994
$$ packed form
14935A177668Q08484q78257Q10422m77209O88786m49154j37879M4451K8035P6993
14925A692340J88377J45218r27788N61484K63436k63354J69211R5228l63607M38904
14915A999449m59536M58683n09286L36053k17677N92535n46556m2509l09769j4146
14905A287241J79854N23091l46853m70640j58871M14145j24170M19473n90892
14896A132378J77342M82082n27072Q87964m55781n94563P71881o30948m72379
14887G70904Q30678J74786k49877l26230K54684L4875j58347J43022j29046J168078
14877B513527q05636l03165l16011M26616k67429P49320l36462H17950N14584
14868A332534N93395n3536n39122J66880j39414l81164L27345K58836o65778M37018
$$ plain form
14858 1336994 1413723 1154599 1681213 1737104 1293320 1835099 1445467 1687550 1637343 1183005
14848 1183005 1617327 1702429 716028 1674466 1933358 1475672 1876439 1438955 1547918 1456465
14838 1456465 1770784 1556113 1279000 1533558 871798 2268399 1744851 1902098 1198363
14829 1198363 1517974 1948550 1345229 1330689 1770279 1176741 1924535 1906089 1204488 1646921
14819 1646921 1594625 2006700 1876178 1685249 1661627 1843357 1914395 1604750 1789915 1880771
14809 1880771 1691659 1123969 1136204 1099154 2099757 1890215 2139026 1597955 1332454 1784180
14799 1784180 1376903 1689663 852488 1247320 1921276 1022975 1408804 1181476 1368884
14790 1368884 2031945 2340624 2206017 1881711 2228008 1913456 2011816 1930019 1762906 1927805
$$ packed form
14858A336994P6729k59124N26614N5891m43784N41779l89632K42083n0207m54338
14848A183005M34322Q5102G16028R58438K58892m57686M00767m37484J08963r1453
14838A456465L14319k14671k77113K54558o61760J396601n23548J57247p03735
14829A198363L19611M30576o03321j4540M39590n93538P47794j8446p01601M42433
14819A646921n2296M12075j30522j90929k3622J81730P1038l09645J85165R0856
14809A880771j89112n67690J2235l7050J000603k09542K48811n41071k65501M51726
14799A784180m07277L12760q37175L94832O73956q98301L85829k27328J87408
14790A368884O63061L08679j34607l24306L46297l14552R8360q1797j67113J64899
$$ plain form
14780 1927805 2080399 1902422 1912657 2307490 1697907 1993951 1946177 1715004 1958830 2284584
14770 2284584 1337122 1595443 2232688 2163481 1944381 1672930 1714247 2962663 2682206 1759583
14760 1759583 1987700 2444020 1875630 2478919 2663246 2352474 2251200 2482259 1912092
14751 1912092 2223684 2102415 3099497 2589293 2137253 1989999 1874970 2248740 1921917
14742 1921917 2664442 2161425 2417307 2320064 2588770 2606814 2156077 2378216 2616752 2115946
14732 2115946 2206521 2523529 2429006 3014166 3062374 2560149 2994963 3401538 2351656 2827158
14722 2827158 2377371 2772614 3015110 2704576 3410160 3113889 2954799 2637084 3060665
14713 3060665 2871170 3323499 2588461 3049929 2802994 2920127 2743599 3009684 3370540
$$ packed form
14780A927805J52594j77977J0235L94833o09583K96044m7774k31173K43826L25754
14770B284584r47462K58321O37245o9207k19100k71451M1317J248416k80457r22623
14760A759583K28117M56320n68390O03289J84327l10772j01274K31059n70167
14751A912092L11592j21269R97082n10204m52040j47254j15029L73770l26823
14742A921917P42525n03017K55882r7243K68706J8044m50737K22139K38536n00806
14732B115946R0575L17008r4523N85160M8208n02225M34814M06575j049882M75502
14722B827158m49787L95243K42496l10534P05584k96271j59090l17715M23581
14713C060665j89495M52329p35038M61468k46935J17133j76528K66085L60856
$$ plain form
14704 3370540 2815003 3199189 3902203 2872566 2879728 2970485 2939713 2602164 3651749 2365808
14694 2365808 3054493 2931040 3375362 2906248 3619570 3184039 2807329 2767014 3098027 3470131
14684 3470131 3681610 3765755 3604429 3615487 4087899 3006773 2920253 3055761 3965322 4337141
14674 4337141 3828383 4007566 3603804 3632502 4148910 3818328 3509245 4676582 3853233
14665 3853233 3674280 3586021 3446150 4168239 3302292 3851445 3713061 3935167 4729279 4090980
14655 4090980 3843872 4253186 4441229 4313669 4346502 4651958 4488639 4644769 4332385 4489728
14645 4489728 4887311 5025913 4871202 4137954 5156685 5226320 4521724 4995781 4821299
14636 4821299 5390369 4973227 5616267 4513540 5000425 5385904 5182988 5414105 5347847
$$ packed form
14704C370540n55537L84186P03014j029637P162R0757l0772l37549J049585j285941
14694B365808O88685j23453M44322m69114P13322m35531l76710m0315L31013L72104
14684C470131K11479Q4145j61326J1058M72412j081126q6520J35508R09561L71819
14674D337141n08758J79183m03762K8698N16408l30582l09083J167337q23349
14665C853233j78953q8259j39871P22089q65947N49153j38384K22106P94112o38299
14655D090980k47108M09314J88043j27560L2833L05456j63319J56130l12384J57343
14645D489728L97583J38602j54711p33248J018731O9635p04596M74057j74482
14636D821299N69070m17142O43040j102727M86885L85479k02916K31117o6258
$$ plain form
14627 5347847 5216301 6981757 5620213 5663765 5706196 5900238 5975690 6164391 5961350 6062647
14617 6062647 6562421 6177469 6246540 5704361 6098001 6517567 6801557 6746460 5979471 6495274
14607 6495274 6664696 7008492 7275438 6991544 6937877 6895848 7694576 7091766 7392592 7740805
14597 7740805 7680009 7940669 8196523 8085757 8093535 8712767 8575490 9005174 8648306 9150848
14587 9150848 9236835 9112189 9589157 9355929 8844365 9725174 9472476 9802961 9245488 10296495
14577 10296495 10462596 10349597 10119360 10605167 10949325 11024814 10828395 10786108 10887265 11709011
14567 11709011 10938401 11075851 11652053 12055698 11956207 11721569 12483876 12694199 12643954 12220437
14557 12220437 12588889 12410465 12989402 13490785 13510223 13483825 14286714 15010667 14388466 14441425
$$ packed form
14627E347847j31546J765456j361544M3552M2431J94042P5452J88701k03041J01297
14617F062647M99774l84952O9071n42179L93640M19566K83990n5097p66989N15803
14607F495274J69422L43796K66946k83894n3667m2029P98728o02810L00826L48213
14597G740805o0796K60660K55854j10766P778O19232j37277M29684l56868N02542
14587I150848Q5987j24646M76968k33228n11564Q80809k52698L30485n57473J051007
14577A0296495J66101j12999k30237M85807L44158P5489j96419m2287J01157Q21746
14567A1709011p70610J37450N76202M03645r9491k34638P62307K10323n0245m23517
14557A2220437L68452j78424N78937N01383J9438k6398Q02889P23953o22201N2959
$$ plain form
14547 14441425 14305055 15110882 13966877 14859779 14914685 14568180 15310348 14638438 15424419
14538 15424419 15026077 14687247 14940954 14837143 14093644 14858280 14537305 14639046 14350620
14529 14350620 13473455 13632492 13721167 13563833 14148075 14300927 14304428 13832296 14241757 14623713
14519 14623713 14546769 14204201 14372221 14264666 15293796 15608731 14962540 15197425 15167222
14510 15167222 15574956 15811245 15937566 15946753 16872342 16216808 16699574 16852235 17223723 16961950
14500 16961950 17284742 17640709 17751514 17780513 18180271 18297358 18057146 18794441 18873739 19635428
14490 19635428 20016496 19130833 20755777 20222319 20497453 21347592 21118599 21910103 21476776
14481 21476776 22465284 22302063 22123678 22537981 23289786 23831351 24259645 24270917 24222489 24423982
$$ packed form
14547A4441425j36370Q05827j144005Q92902N4906l46505P42168o71910P85981
14538A5424419l98342l38830K53707j03811p43499P64636l20975J01741k88426
14529A4350620q77165J59037Q8675j57334N84242J52852L501m72132M09461L81956
14519A4623713p6944l42568J68020j07555J029130L14935o46191K34885l0203
14510A5167222M07734K36289J26321R187R25589o55534M82766J52661L71488k61773
14500A6961950L22792L55967J10805K8999L99758J17087k40212P37295P9298P61689
14490A9635428L81068q85663J624944n33458K75134Q50139k28993P91504m33327
14481B1476776R88508j63221j78385M14303P51805N41565M28294J1272m8428K01493
$$ plain form
14471 24423982 26013423 25596514 26320209 26874184 27110391 27187054 27623267 27541219 28515401
14462 28515401 28330805 28984131 30055458 29696738 29767686 30985413 31836994 31934606 32233061
14453 32233061 32982202 33691704 33686063 35010017 35363623 34900374 35839310 36704694 37106772
14444 37106772 37713339 37744526 38273840 39908306 39757154 40293464 41505756 41615068 42946046
14435 42946046 43545183 43897334 44902296 45720478 46425942 46533925 47950628 48982251 49123399
14426 49123399 50074843 50598568 51760670 52888899 54162779 54879412 55300998 57245426 57952067
14417 57952067 59698067 60240730 61586776 62221361 62865142 64166150 65138193 66497696 68133221
14408 68133221 69188878 70034483 71173403 71541646 73885689 74356598 76034240 76781763 78120673
$$ packed form
14471B4423982J589441m16909P23695N53975K36207P6663M36213q2048R74182
14462B8515401j84596O53326J071327l58720P0948J217727Q51581R7612K98455
14453C2233061P49141P09502n641J323954L53606m63249R38936Q65384M02078
14444C7106772O06567L1187N29314J634466j51152N36310J212292J09312J330978
14435D2946046N99137L52151J004962Q18182P05464J07983J416703J031623J41148
14426D9123399R51444N23725J162102J128229J273880P16633M21586J944428P06641
14417E7952067J746000N42663J346046O34585O43781J301008R72043J359503J635525
14408F8133221J055657Q45605J138920L68243K344043M70909J677642P47523J338910
$$ plain form
14399 78120673 79419333 81163116 82426645 83929487 84949332 86653929 88227605 89928080
14391 89928080 91595023 92104550 94668060 95813470 98413584 99092248 100053053 102456289
14383 102456289 103846059 105889258 107241953 109302658 111736132 114147690 115857518 117618782
14375 117618782 119144438 120960229 123031004 125823966 127186385 129260544 130688459 133304171
14367 133304171 135792486 139309769 141150895 143581770 145584081 147565075 151057442 153000101
14359 153000101 155233329 158197116 161391503 164226082 166269343 168733338 170282163 173716251
14351 173716251 177167660 180372825 182887150 184730321 189516221 192406261 195163997 198942832
14343 198942832 202190973 205203746 207969888 211088757 213924801 217774043 221075977 223440442
$$ packed form
14399G8120673J298660J743783J263529J502842J019845J704597J573676J700475
14391H9928080J666943N09527K563510J145410K600114O78664R60805K403236
14383A02456289J389770K043199J352695K060705K433474K411558J709828J761264
14375A17618782J525656J815791K070775K792962J362419K074159J427915K615712
14367A33304171K488315L517283J841126K430875K002311J980994L492367J942659
14359A53000101K233228K963787L194387K834579K043261K463995J548825L434088
14351A73716251L451409L205165K514325J843171M785900K890040K757736L778835
14343A98942832L248141L012773K766142L118869K836044L849242L301934K364465
$$ plain form
14335 223440442 225849344 229005786 232371594 235925744 239412857 242823057 245268516 249055372
14327 249055372 252316884 256715429 260918577 265023622 268631028 273139732 276580283 281707510
14319 281707510 286338035 289951761 294726685 298534034 301800755 307713279 311460899 317219659
14311 317219659 322024603 326394924 331248708 332764193 336297152 338387178 340201036 343242403
14303 343242403 349614234 349803481 350529412 351603319 353162728 356482987 359006382 362111972
14295 362111972 364428740 365968996 368459516 370488992 371764833 377179965 382541874 384333680
14287 384333680 383465473 382972874 384407993 385995319 383550790 383881656 384683747 387012174
14279 387012174 391734025 396213498 406648768 417541611 425096499 437780056 452746735
$$ packed form
14335B23440442K408902L156442L365808L554150L487113L410200K445459L786856
14327B49055372L261512M398545M203148M105045L607406M508704L440551N127227
14319B81707510M630525L613726M774924L807349L266721N912524L747620N758760
14311C17219659M804944M370321M853784J515485L532959K090026J813858L041367
14303C43242403O371831J89247P25931J073907J559409L320259K523395L105590
14295C62111972K316768J540256K490520K029476J275841N415132N361909J791806
14287C84333680q68207m92599J435119J587326k444529L30866Q02091K328427
14279C87012174M721851M479473J0435270J0892843P554888J2683557J4966679
$$ plain form
14272 452746735 454438323 447203684 447843119 447658660 446640590 445158547 447829581 451896614
14264 451896614 452340619 451627048 450384351 447333117 442611253 436264041 431362018 424535029
14256 424535029 414882307 406471609 393983338 382775356 372262671 360801230 348556538
14249 348556538 336338223 323467303 311330989 300094090 290549152 278301789 266137369
14242 266137369 255621306 245349529 235475441 225921836 217918200 210192256 203287123 194509932
14234 194509932 188532688 182194165 175377215 169866982 164922289 158800057 153755226 147701509
14226 147701509 143392424 138999203 133379706 128356130 123232601 117800212 112729205 107358190
14218 107358190 103077365 98771630 94877504 91790089 86704744 83445239 78839740 75880050
$$ packed form
14272D52746735J691588p234639O39435j84459j018070j482043K671034M067033
14264D51896614M44005p13571j242697l051234m721864o347212m902023o826989
14256D24535029r652722q410698j2488271j1207982j0512685j1461441j2244692
14249C48556538j2218315j2870920j2136314j1236899r544938j2247363j2164420
14242B66137369j0516063j0271777r874088r553605q003636p725944o905133q777191
14234A94509932n977244o338523o816950n510233m944693o122232n044831o053717
14226A47701509m309085m393221n619497n023576n123529n432389n071007n371015
14218A07358190m280825m305735l894126l087415n085345l259505m605499k959690
$$ plain form
14210 75880050 73007077 69744934 67479848 64828528 62865875 59970400 58994046 56747402
14202 56747402 54855696 52914431 52413845 49372203 48006373 46961717 45958302 44548002
14194 44548002 42387059 42130913 40914102 40404804 38982645 37104583 37168519 35469808 35027271
14185 35027271 33968792 33514689 33013640 32411205 31649871 30747065 29824496 29823683 28550793
14176 28550793 28562401 27467140 27212851 26296220 26236889 25622196 25748411 24957949 23850472
14167 23850472 23692631 23265262 23301165 22864619 22656209 22224823 20675174 20963749 20546857
14158 20546857 20818416 19785438 19456074 19379896 19173911 18961711 18854587 17741248 18435433
14149 18435433 17339779 17395870 17460322 16779250 17045181 16186889 15942535 15511011 15973087
$$ packed form
14210G5880050k872973l262143k265086k651320j962653k895475r76354k246644
14202E6747402j891706j941265n00586l041642j365830j044656j003415j410300
14194D4548002k160943k56146j216811n09298j422159j878062O3936j698711m42537
14185C5027271j058479m54103n01049o02435p61334r02806r22569q13j272890
14176B8550793J1608j095261k54289r16631n9331o14693J26215p90462j107477
14167B3850472j57841m27369L5903m36546k08410m31386j549649K88575m16892
14158B0546857K71559j032978l29364p6178k05985k12200j07124j113339O94185
14149A8435433j095654N6091O4452o81072K65931q58292k44354m31524M62076
$$ plain form
14140 15973087 15722768 15888713 15262385 15182063 15035830 15198918 15346309 13865414 13976048
14131 13976048 13716154 13779356 13913962 13755842 12729725 13209730 13298439 12844684 12025715
14122 12025715 13137278 12009678 12027064 11983012 12262841 12144116 11433600 11219435 11391038
14113 11391038 10636870 11256617 11193614 10819469 11049198 10361338 10314550 10535284 10497170 10210560
14103 10210560 9942509 10094152 9615659 9992900 9559114 9651408 9810563 10116255 9149318
14094 9149318 9514413 9158554 9255214 8573089 9397392 8521743 8723130 8612098 8795643 8572492
14084 8572492 7188097 8669591 8259578 8322387 8591519 8399231 8237466 8208567 7374294
14075 7374294 8090691 7010508 7828620 7987688 7802978 7656242 7562177 7087780 7036402 7020725
$$ packed form
14140A5973087k50319J65945o26328q0322j46233J63088J47391j480895J10634
14131A3976048k59894O3202J34606j58120j026117M80005Q8709m53755q18969
14122A2025715J111563j127600J7386m4052K79829j18725p10516k14165J71603
14113A1391038p54168O19747o3003l74145K29729o87860m6788K20734l8114k86610
14103A0210560k68051J51643m78493L77241m33786R2294J59155L05692r66937
14094I149318L65095l55859R6660o82125Q24303q75649K01387j11032J83545k23151
14084H572492j384395J481494m10013O2809K69132j92288j61765k8899q34273
14075G374294P16397j080183Q18112J59068j84710j46736r4065m74397n1378j5677
$$ plain form
14065 7020725 7527188 7273204 6877960 7152306 7786340 7120406 7032819 6974114 7236048 6505590
14055 6505590 6260973 7290134 6622380 6803123 6998570 6878383 6955666 6614378 6758564
14046 6758564 6889853 6694444 7010959 6665144 6886966 6332965 6787581 7028022 6943305 7156870
14036 7156870 6178751 6442731 6739307 5956105 6527367 6901843 6352727 7212528 6543351
14027 6543351 6367767 6628968 6622398 7175107 7152245 6577031 6822598 6608560 6893688 7743257
14017 7743257 7296023 6435466 7248840 6816496 6963961 8149720 7366064 6065863 6900477
14008 6900477 6954087 7991140 7569204 7146225 7545721 7111113 6893575 7076525 6715935
13999 6715935 6878245 7366626 7168628 7321258 6655894 7650997 7795046 7670323 7845715
$$ packed form
14065G020725N06463k53984l95244K74346O34034o65934q7587n8705K61934p30458
14055F505590k44617J029161o67754J80743J95447j20187P7283l41288J44186
14046F758564J31289j95409L16515l45815K21822n54001M54616K40441q4717K13565
14036G156870r78119K63980K96576p83202N71262L74476n49116Q59801o69177
14027F543351j75584K61201o570N52709k2862n75214K45567k14038K85128Q49569
14017G743257m47234q60557Q13374m32344J47465J185759p83656j300201Q34614
14008F900477N3610J037053m21936m22979L99496m34608k17538J82950l60590
13999F715935J62310M88381j97998J52630o65364R95103J44049j24723J75392
$$ plain form
13990 7845715 7792792 8423730 8269702 7841141 7387264 7944630 8226709 8020120 7591703 7973325
13980 7973325 8171920 8530531 7736076 7178927 7386970 7262137 6339148 6350603 6170939 6339778
13970 6339778 6178677 5626069 5073119 4763084 5190370 4727795 4478527 4066131 4529904
13961 4529904 4008818 3837975 4698249 4481598 4272279 3871288 3723613 4211819 3824109
13952 3824109 3875155 3047836 3800045 3814056 3477536 4036694 3306064 3151819 3598480 3578621
13942 3578621 2942874 2808233 3232188 3001077 3866676 2928622 2843614 3209893 3170754 2768846
13932 2768846 2205099 2435606 2983400 2622893 2040406 2794557 2373769 2735702 2534338
13923 2534338 2564430 2428513 2585230 2925031 2692329 2742512 2387322 2788217 2342071 1822830
$$ packed form
13990G845715n2923O30938j54028m28561m53877N57366K82079k06589m28417L81622
13980G973325J98595L58611p94455n57149K08043j24833r22989J1455j79664J68839
13970F339778j61101n52608n52950l10035M27286m62575k49268m12396M63773
13961D529904n21086j70843Q60274k16651k09319m00991j47675M88206l87710
13952C824109N1046q27319P52209J4011l36520N59158p30630j54245M46661j9859
13942C578621o35747j34641M23955k31111Q65599r38054q5008L66279l9139m01908
13932B768846n63747K30507N47794l60507n82487P54151m20788L61933k01364
13923B534338L0092j35917J56717L39801k32702N0183l55190M00895m46146n19241
$$ plain form
13913 1822830 2535271 3051169 2366386 1958997 2835785 2410508 1957974 2693763 2388631
13904 2388631 2668266 2272490 2387865 1746790 2626276 2515791 2330862 2368669 2325427 2925308
13894 2925308 2083127 2230433 2340154 2176150 2094023 1986174 2189511 2277174 2205287 1979190
13884 1979190 2363612 2588744 2031399 1884496 1958985 2254245 2172074 1584661 2066299 2342146
13874 2342146 1248016 1812791 2002547 1577689 2290694 1620557 1782050 2054452 2280316
13865 2280316 2327204 1331499 2254652 2523016 2246175 1438050 1298612 1341484 1928774 1990694
13855 1990694 2035518 1914314 2349420 1807418 1783245 1730294 1979704 1544194 1345561 1346720
13845 1346720 1775653 1561909 1596991 1909215 1902997 1145851 1477091 1784574 1716308 2138280
$$ packed form
13913A822830P12441N15898o84783m07389Q76788m25277m52534P35789l05132
13904B388631K79635l95776J15375o41075Q79486j10485j84929L7807m3242N99881
13894B925308q42181J47306J09721j64004q2127j07849K03337Q7663p1887k26097
13884A979190L84422K25132n57345j46903P4489K95260q2171n87413M81638K75847
13874B342146j094130N64775J89756m24858P13005o70137J61493K72402K25864
13865B280316M6888r95705R23153K68364k76841q08125j39438M2872N87290O1920
13855A990694M4824j21204M35106n42002k4173n2951K49410m35510j98633J159
13845A346720M28933k13744L5082L12224o218p57146L31240L07483o8266M21972
$$ plain form
13835 2138280 1376481 1789334 2021663 1309686 2076967 1217427 1991577 2035936 1553893 1276156
13825 1276156 1187864 1469228 1166305 1496640 1802289 1913703 2009910 1854341 1855609 1174618
13815 1174618 1614659 665986 1766238 1795252 718908 891671 1835437 1341269 1311745 1651810
13805 1651810 1412009 1162324 995771 1885135 1006039 1138874 1183701 1821358 1039896 1553328
13795 1553328 778539 1167223 778928 2123272 1098121 671691 1079525 1643174 1044597
13786 1044597 1538939 1387380 993404 885945 1070608 1103720 794938 1176334 1075879 1344612
13776 1344612 1119000 1297557 1354889 1135300 1419527 416117 931752 1362921 318036 1161123
13766 1161123 1041116 293419 1227439 1421254 843413 1045601 1213443 806249 314121
$$ packed form
13835B138280p61799M12853K32329p11977P67281q59540P74150M4359m82043k77737
13825A276156q8292K81364l02923L30335L05649J11414R6207j55569J268o80991
13815A174618M40041F65986J100252K9014G18908J72763R43766m94168k9524L40065
13805A651810k39801k49685j66553Q89364q79096J32835M4827O37657p81462N13432
13795A553328p74789L88684l88295J344344j025151m26430M07834N63649n98577
13786A044597M94342j51559l93976j07459J84663L3112l08782L81396j00455K68733
13776A344612k25612J78557N7332k19589K84227D16117N15635M31169C18036Q43087
13766A161123j20007B93419R34020J93815n77841K02188J67842m07194C14121
$$ plain form
13756 1429937 1406167 1033475 1228427 1117853 1291171 1666748 747615 311164 910361 1785300
13746 1785300 794422 1736170 112437 1222662 2078750 1163646 1013183 569853 1539976
13737 1539976 970376 558788 1433145 677992 1083944 1622958 900998 1305500 1407225
13728 1407225 1473410 950349 1192106 1392390 1337615 398064 1514849 1084030 266158 582506
13718 582506 837726 1234145 1320185 607005 977274 652826 746244 1108964 448749 682006
13708 682006 442671 1173868 1386434 864613 898996 788766 871480 784454 1289982 874512
13698 874512 1004257 780498 1434332 911647 648780 323358 398485 330370 282759 904555
13688 904555 593691 575669 1390728 691747 275660 233449 556559 1158914 351307 1481708
$$ packed form
13756A429937k3770l72692J94952j10574J73318L75577G47615C11164N99197Q74939
13746A785300G94422R41748A12437J110225Q56088r15104j50463m43330R70123
13737A539976n69600m11588Q74357F77992M05952N39014p21960M04502J01725
13728A407225O6185n23061K41757K00284n4775C98064J116785m30819B66158L16348
13718E82506K55220L96419Q6040F07005L70269l24448R3418L62720D48749K33257
13708F82006k39335P31197K12566n21821L4383j10230Q2714q7026N05528m15470
13698H74512J29745k23759O53834n22685k62867C23358P5127o8115m7611O21796
13688I04555l10864j8022Q15059F91747B75660m2211L23110O02355C51307J130401
$$ plain form
13678 1481708 1222406 1012369 1278053 618769 514584 1334070 800206 783548 1128315 613835
13668 613835 804716 920653 699669 587632 428742 702315 851825 911669 633654 216488
13657 490045 888614 509154 671731 855914 535550 826530 421734 606086 580545 314352
13647 314352 650277 255798 715229 1013301 812550 462726 612938 572260 168521 424237
13637 424237 851938 393606 284030 621289 902869 460028 1048704 1237444 942049 489963
13627 489963 736148 372889 812535 -41044 885013 285506 902500 741215 567203 919007
13617 919007 677990 613520 589551 464371 522187 -39480 597690 453183 384279 71159 731759
13606 731759 306936 418164 242588 730011 61626 807479 762857 1116578 112215 1255167
$$ packed form
13678A481708k59302k10037K65684F18769j04185Q19486n33864j6658L44767n14480
13668F13835J90881J15937k20984j12037j58890K73573J49510N9844k78015B16488
13657D90045L98569l79460J62577J84183l20364K90980m04796J84352k5541k66193
13647C14352L35925B55798M59431K98072k00751l49824J50212m0678A68521K55716
13637D24237M27701C93606j09576L37259K81580m42841N88676J88740k95395m52086
13627D89963K46185l63259M39646d1044H85013B85506O16994j61285j74012L51804
13617I19007k41017o4470k3969j25180N7816c9480E97690j44507o8904G1159O60600
13606G31759C06936J11228j75576M87423F1626P45853m4622L53721A12215J142952
$$ plain form
13596 1255167 996517 44349 108496 548687 302033 833550 -415238 899666 754579 495740
13586 495740 338162 785924 656286 511967 1162332 457938 1333699 566805 897959 808132
13576 808132 1109047 309824 683884 3990 317865 342604 553439 683134 491935 401779
13566 401779 358149 1092526 662858 806078 413950 653682 908160 830654 538558 653950
13556 653950 630028 1026150 1327464 350307 95404 356440 568954 129834 457608 648142
13546 648142 798013 70062 221013 468063 544446 347299 471416 430435 634843 68649
13535 34814 -82863 841969 83055 17604 398434 462539 871596 781753 437007 -67070 249589
13523 304968 708559 548486 385670 690647 842098 397844 -13127 328006 83189 884176
$$ packed form
13596A255167k58650D4349O4147M40191k46654N31517d15238H99666j45087k58839
13586D95740j57578M47762j29638j44319O50365D57938Q75761E66805L31154q9827
13576H08132L00915C09824L74060C990L13875K4739K10835J29695j91199r0156
13566D01779m3630P34377m29668J43220l92128K39732K54478p7506k92096J15392
13556F53950k3922L96122L01314C50307I5404K61036K12514A29834L27774J90534
13546F48142J49871G0062J50951K47050P6383j97147J24117m0981K04408F8649
13535C4814h2863H41969H3055A7604L80830O4105M09057q9843l44746f7070B49589
13523C04968M03591j60073j62816L04977J51451C97844a3127C28006H3189Q00987
$$ plain form
13513 884176 623648 -127234 656431 172006 327531 -232389 247691 -203560 715028 996451
13503 996451 1160678 506199 461881 634912 -105115 274105 -256335 484135 171374 360622
13493 360622 331998 231174 417965 76323 426398 769086 456313 680706 -47143 -6927
13482 289774 421887 -127161 243468 334193 179513 717596 -265891 368277 13512 213893
13472 213893 557719 103661 758928 743663 -220263 94898 -31425 738277 477648 88754
13461 52680 224648 676401 856751 367364 559759 200119 261041 773289 646645 810423
13451 810423 544391 473121 238025 -121473 -211761 762007 477599 5452 860291 44070
13440 697779 -14217 336734 250985 110351 567641 198084 512551 445185 624126 501806
$$ packed form
13513H84176k60528a27234F56431A72006J55525b32389B47691b03560G15028K81423
13503I96451J64227E06199m4318J73031a05115B74105b56335D84135A71374J89248
13493C60622k8624j00824J86791G6323L50075L42688l12773K24393d7143f927
13482B89774J32113a27161B43468R0725j54680N38083b65891C68277A3512K00381
13472B13893L43826A03661O55267j5265b20263I4898c1425G38277k60629H8754
13461E2680J71968M51753J80350C67364J92395B00119O0922N12248j26644J63778
13451H10423k66032p1270k35096a21473r0288G62007k84408E452Q54839D4070
13440F97779a4217C36734q5749A10351M57290A98084L14467o7366J78941j22320
$$ plain form
13430 501806 431531 249258 340496 -179402 237539 -22739 92651 505275 145541 250875
13420 250875 272880 580698 -246091 268555 471546 72709 207150 722385 432483 393278
13410 393278 229131 931136 158826 1434184 410057 -10435 217620 271557 703771 21224
13399 469000 186861 -107261 773778 281842 209693 636395 17893 32045 -269449 350824
13388 561750 388382 33874 342375 379747 379160 471207 103120 280379 577298 647395 412270
13377 412270 530316 364509 655803 222694 117948 658571 331550 518264 395025 377998
13367 377998 38003 563318 754441 590312 -155076 323151 79463 556629 239469 788290
13357 788290 186158 753190 345100 81177 411689 216900 156020 263897 415361 475790
$$ packed form
13430E01806p0275j82273R1238a79402B37539b2739I2651M12624A45541J05334
13420B50875K2005L07818b46091B68555K02991G2709J34441N15235k89902l9205
13410C93278j64147P02005A58826J275358D10057a0435B17620N3937M32214B1224
13399D69000A86861a07261G73778B81842p2149M26702A7893J4152b69449C50824
13388E61750j73368C3874L08501L7372n87R2047A03120J77259K96919P0097k35125
13377D12270J18046j65807K91294B22694j04746N40623l27021J86714j23239j7027
13367C77998C8003N25315J91123j64129a55076C23151G9463M77166B39469N48821
13357G88290A86158N67032C45100H1177L30512j94789o0880J07877J51464O0429
$$ plain form
13347 475790 728074 187987 110434 5420 -130233 492355 367934 582634 919591 96753
13336 377128 -256811 82369 649375 168087 525001 791752 35266 356757 -71165 462770
13325 425148 84903 226628 359255 743810 372827 207759 930656 218537 488202 309955
13315 309955 215388 -1574 -47348 -202487 252130 386269 -14606 342063 118908 285788
13305 285788 194137 47695 124076 234820 -204028 299698 354996 291251 188944 -444735
13294 126843 364073 951975 294032 214758 -598644 419697 313042 -318458 10611 4606
13283 296742 640116 -68561 248451 762222 -85714 134631 3472 339130 53531 375277
13273 375277 338759 220344 78534 -409069 -297502 39741 577696 -269800 -128861 -108446
$$ packed form
13347D75790K52284A87987p7553E420a30233D92355j24421K14700L36957I6753
13336C77128b56811H2369N67006A68087L56914K66751C5266L21491g1165D62770
13325D25148H4903J41725J32627L84555l70983j65068P22897B18537K69665j78247
13315C09955r4567a574m5774j55139B52130J34139a4606C42063A18908J66880
13305B85788r1651D7695P6381J10744b04028B99698N5298o3745j02307d44735
13294A26843K37230N87902B94032p9274e98644D19697j06655c18458A0611D606
13283B96742L43374f8561B48451N13771h5714A34631C472L35658E3531L21746
13273C75277l6518j18415G8534d09069J11567C9741N37955b69800a28861K0415
$$ plain form
13263 -108446 29313 -121347 134973 -374051 168690 -80590 -428036 -472181 -730132 269140
13252 358884 518125 365585 -70405 187955 -43974 -290378 556108 -75565 125476 569406
13242 569406 24157 425669 -180846 205167 -159834 611348 115962 622369 103684 368682
13232 368682 269105 526634 34667 443898 -468308 -299573 -34161 -317680 532616 235441
13221 140919 146325 -30313 118134 208652 -414740 243307 776487 -190402 154407 179710
13211 179710 40744 -55965 -163436 443037 -201874 -129969 -70900 -198348 164834 -95175
13200 211485 -68439 756416 39110 -53097 1052882 595910 306858 291337 363210 266268
13190 266268 279914 455930 920764 -19213 -345278 233789 175537 -142051 -123015 276322
$$ packed form
13263a08446B9313a21347A34973c74051A68690h0590l47446m4145k57951B69140
13252C58884J59241j52540g0405A87955d3974k46404E56108g5565A25476M43930
13242E69406B4157M01512a80846B05167a59834F11348A15962N06407A03684K64998
13232C68682r9577K57529C4667M09231d68308J68735c4161k83519E32616B35441
13221A40919N406c0313A18134R0518d14740B43307N33180a90402A54407K5303
13211A79710D0744e5965j07471D43037b01874P1905N9069j27448A64834i5175
13200B11485f8439G56416C9110e3097A052882m56972k89052j5521P1873r6942
13190B66268J3646J76016M64834a9213l26065B33789n8252a42051J9036B76322
$$ plain form
13179 485824 79670 -282269 -160962 6268 -179008 400818 -706505 272145 486420 17124
13168 -376754 575104 502776 476498 -12105 106462 -235724 239272 122719 301355 266366
13158 266366 539270 609293 755700 37185 -5165 -39489 -1159 297189 6489 475729 422279
13147 422279 222437 -55899 -32927 68630 -124494 -239621 -387841 64249 -3642 325144 173330
13136 173330 -14479 -117563 -194235 398193 250443 189837 -12561 3909 -228394 194639 56939
13124 13012 -176840 39023 -530065 355670 381620 376852 -62313 -75954 415168 73059 -90957
13112 336468 316818 47992 282454 299087 -139271 370749 159379 -184477 104566 -125081
13101 -515569 -155078 620319 -345098 612272 505904 148527 -84410 320424 62170 -30493
$$ packed form
13179D85824G9670b82269J21307F268a79008D00818g06505B72145K14275A7124
13168c76754E75104p2328k6278a2105A06462b35724B39272j16553J78636l4989
13158B66366K72904P0023J46407C7185e165l4324a159B97189F489M69240n3450
13147D22279j99842e5899K2972F8630a24494j15127j48220F4249c642C25144j51814
13136A73330a4479j03084p6672C98193j47750o0606a2561C909b28394A94639E6939
13124A3012a76840C9023e30065C55670K5950m768f2313j3641D15168G3059i0957
13112C36468j9650D7992K34462J6633a39271C70749A59379a84477A04566a25081
13101e15569a55078F20319c45098F12272j06368A48527h4410C20424F2170c0493
$$ plain form
13090 -89591 8609 411377 272777 49652 -268069 426304 -37685 -21418 -12235 -116950 710267
13078 -452796 145957 143022 659337 382262 297135 -442974 410196 -226689 683770 219782
13067 264195 81939 290279 -157213 505107 191774 -164481 85433 69903 295920 58812
13056 303556 -18757 700588 116046 197220 -528615 324966 8778 573800 277788 263320
13046 263320 407238 241739 -87501 151807 -65042 52544 -207426 12469 -483087 203566
13035 -314496 212179 787376 419105 542574 329371 223982 -63590 275410 -16493 -222275
13025 -222275 -311985 -112765 -82081 165470 123005 -203622 -159962 143748 264779 705 -3027
13013 285380 407907 -165628 -118534 550145 -415194 49357 407539 380220 46322 376895
$$ packed form
13090h9591H609M02768j38600D9652b68069D26304c7685J6267R183j04715G10267
13078d52796A45957k935N16315k77075q5127d42974D10196b26689F83770B19782
13067B64195H1939K08340a57213E05107A91774a64481H5433j5530K26017E8812
13056C03556a8757G00588A16046Q1174e28615C24966H778N65022B77788j4468
13046B63320J43918j65499h7501A51807f5042E2544b07426A2469d83087B03566
13035c14496B12179N75197l68271J23469k13203j05389f3590B75410a6493k05782
13025b22275q9710a12765L0684A65470m2465b03622M3660A43748J21031G05c027
13013B85380J22527a65628M7094E50145d15194D9357L58182k7319D6322L30573
$$ plain form
13003 376895 -41721 153469 -456769 308908 356312 -229592 -260408 132711 51099 38489
12993 38489 -78519 102557 -547860 -318811 -84806 491166 353698 282361 6078 90127 -128176
12981 -441067 172555 -38338 285540 539407 628724 96290 3178 419269 -61636 495335 579126
12970 579126 -435927 481623 -29735 164526 -512175 213899 383308 78785 132945 -575553
12959 -207611 301742 -157834 14381 -87678 -415413 -813507 -291978 80148 -463087 209803
12948 -522906 -52091 -21583 625328 -59648 374830 683398 -226154 99216 -432354 388410
12937 409222 -60542 -226837 211545 151665 769817 -446728 -936235 187861 -390010 -304531
12927 -304531 -19446 147133 547533 68516 -836658 -64869 -17243 -766294 79157 213758
$$ packed form
13003C76895d1721A53469d56769C08908M7404b29592l0816A32711E1099j2610
12993C8489g8519A02557e47860K29049h4806D91166j37468p1337F078Q4049a28176
12981d41067A72555c8338B85540K53867Q9317I6290C178M16091f1636D95335Q3791
12970E79126d35927D81623b9735A64526e12175B13899J69409G8785N4160e75553
12959b07611C01742a57834A4381h7678l27735l98094b91978H0148d63087B09803
12948e22906e2091b1583F25328e9648C74830L08568b26154I9216d32354C88410
12937D09222f0542j66295B11545n9880O18152d46728m89507A87861c90010Q5479
12927c04531a9446A47133M00400F8516h36658f4869a7243p49051G9157J34601
$$ plain form
12917 213758 -112172 249161 -274704 -31436 88505 257966 129490 -166817 317854 171109
12907 171109 -21396 369725 218270 -214549 420147 521256 -226573 -382094 310455 -174934
12896 786082 143126 109509 -533025 153544 -358666 351268 -458269 -108871 -231175 12905
12885 635458 -108034 349469 262883 875795 203757 -257643 176374 129188 97022 -217889
12874 -299824 389050 138523 143848 140162 610789 -245609 318362 90841 -68583 625339 -196306
12862 39250 316381 206041 800421 -328004 559132 -76688 -197907 272492 -83273 8939
12851 -627613 188791 -254713 159528 -297264 97080 280981 -62728 -544975 -155870 -425004
12841 -425004 882261 -3546 13527 -574698 507707 -13212 631780 -323578 693746 -539409
$$ packed form
12917B13758a12172B49161b74704c1436H8505J69461j28476a66817C17854j46745
12907A71109b1396C69725j51455b14549D20147J01109b26573j55521C10455a74934
12896G86082A43126l3617e33025A53544c58666C51268d58269a08871j22304A2905
12885F35458a08034C49469q6586O12912B03757b57643A76374m7186l2166b17889
12874b99824C89050A38523N325l686M70627b45609C18362I0841f8583F25339a96306
12862C9250K77131j10340N94380c28004E59132g6688j21219B72492h3273H939
12851f27613A88791b54713A59528b97264I7080J83901f2728m82247a55870k69134
12841d25004H82261c546A3527e74698E07707a3212F31780c23578F93746e39409
$$ plain form
12830 -573409 -157105 226721 316975 968106 240242 169518 827906 366634 -913983 55994
12819 38705 23887 595157 -864918 160100 364843 375992 -320855 -806525 49561 -397815
12808 -132588 -430116 -446514 -588506 -511096 -245084 -377370 -316590 -79493 -352687 231492
12797 -16354 -1042255 -1905 601224 -34338 396830 -95603 234738 -186150 -770458 33115
12786 74017 104268 -265148 616080 361035 544453 -441728 -335934 186227 -185028 251684
12775 -151821 -285309 -442864 -10374 144091 34279 -15616 720137 457841 -76588 -176424
12765 -176424 -353498 204910 877 733352 575952 -259209 269160 -333817 -91123 -50156
12755 -50156 -94360 -302615 193111 114034 -120662 44587 -1252 25558 6279 -278372 55314
$$ packed form
12830e73409a57105B26721R0254O51131B40242p0724O58388C66634i13983E5994
12819C8705j4818N71270h64918A60100K04743J1149c20855m85670D9561c97815
12808a32588k97528j6398j41992P7410b45084j32286O0780g9493k73194B31492
12797a6354j025901a905F01224c4338C96830i5603B34738a86150n84308C3115
12786G4017L0251b65148F16080k55045J83418d41728J05794A86227a85028B51684
12775a51821j33488j57555a0374A44091C4279a5616G20137k62296g6588r9836
12765a76424j77074B04910H77P32475j57400b59209B69160c33817i1123M0967
12755e0156m4204k08255A93111p9077a20662D4587a252B5558F279b78372E5314
$$ plain form
12743 -118135 85773 -144328 265550 234040 348397 631567 -81037 -141962 148622 481437
12733 481437 -63884 -616153 -644117 429301 237479 -258020 309113 11479 258085 485308
12723 485308 -187890 26566 14652 -641034 179114 379199 111419 440648 122305 462381
12713 462381 -113158 555558 521664 313587 635402 -420626 -63150 -485520 608481 878111
12703 878111 -203100 571278 542425 -52065 232805 -145995 -239730 -570094 701759 -38709
12692 -441227 288946 -310067 -279036 339273 -77280 332689 417900 -51774 -97716 -458599
12682 -458599 -250868 -162848 -11903 570586 419736 41713 72224 190158 -72723 109267
12671 -105666 217943 -420731 -54519 56289 -110075 -23176 -179193 754372 423220 -369824
$$ packed form
12743a18135H5773a44328B65550l1510J14357K83170h1037o0925A48622L32815
12733D81437f3884n52269k7964D29301j91822b58020C09113A1479K46606K27223
12723D85308a87890B6566j1914f41034A79114K00085A11419L29229A22305L40076
12713D62381a13158E55558l3894k08077L21815d20626f3150m22370F08481K69630
12703H78111b03100E71278k8853e2065B32805a45995r3735l30364G01759c8709
12692d41227B88946c10067L1031C39273g7280C32689Q5211e1774m5942l60883
12682d58599K07731Q8020a1903E70586j50850D1713L0511J17934g2723A09267
12671a05666B17943d20731e4519E6289a10075b3176j56017G54372l31152c69824
$$ plain form
12660 49473 314997 515148 -151115 -296923 -746696 205249 -156903 441579 215561 -134082
12649 437857 309418 -585693 115434 321812 -30976 -99452 517682 375836 -90518 71331
12638 294408 285286 56543 -270520 -136893 -115487 185771 247216 188690 476699 340879 486157
12627 486157 -269186 353378 172646 177952 -318878 700592 130140 63080 600115 -289927
12616 -39296 -40322 733283 -124605 -39402 -242863 -313982 -54579 132479 -114915 -150156 526855
12604 799076 -559815 -153676 -537364 -327420 -76854 -144749 611038 59603 640000 397098
12594 397098 -438138 -344368 -286717 -586401 -667102 386925 175718 284285 -227373 -504370
12584 -504370 -197080 -747741 -265345 94653 13957 -276933 73739 29856 57039 -350595
$$ packed form
12660D9473K65524K00151a51115j45808m49773B05249a56903D41579B15561a34082
12649D37857j28439e85693A15434K06378c0976o8476E17682j41846i0518G1331
12638B94408r122E6543b70520J33627K1406A85771O1445n8526K88009j35820J45278
12627D86157b69186C53378A72646N306c18878G00592A30140F3080N37035b89927
12616c9296j026G33283a24605c9402k03461p1119e4579A32479a14915l5241E26855
12604G99076e59815a53676l83688K09944g6854o7895F11038E9603N80397k42902
12594C97098d38138R3770N7651k99684q0701C86925A75718J08567b27373k76997
12584e04370a97080n50661b65345I4653A3957b76933G3739B9856K7183c50595
$$ plain form
12573 -644195 202120 514635 230370 -435562 167226 -62348 265424 -312876 684007 -171323
12562 -366703 21687 -79243 229651 387227 341996 -328161 213025 692998 289839 -321152
12551 739839 150440 -166709 -225394 -33278 -783553 49090 506874 -155975 -62877 -352703
12541 -352703 -463611 628484 334850 280345 -406576 6320 -205872 541344 -296650 -110321
12530 504459 -547718 232594 -560433 -278244 -1142 -172985 292342 -131255 -161728 -693856
12520 -693856 -15047 -205113 -437121 -309794 -358090 172713 248197 -145207 -278293 24245
12509 -575697 -268844 -178800 85442 -256705 -97473 -301007 -147231 -344962 443089 -11780
12498 -110495 -83701 -166709 75297 -164310 -362480 312999 -221057 -479281 16225 -29243
$$ packed form
12573f44195B02120L12515B30370d35562A67226f2348B65424c12876F84007a71323
12562c66703B1687g9243B29651J57576m5231c28161B13025M79973B89839c21152
12551G39839A50440a66709n8685c3278p50275D9090M57784a55975f2877k89826
12541c52703j10908F28484k93634n4505d06576F320b05872E41344b96650a10321
12530E04459e47718B32594e60433b78244a142j71843B92342a31255l0473n32128
12520f93856a5047j90066k32008J27327m8296A72713P5484a45207j33086B4245
12509e75697b68844R0044H5442b56705i7473k03534a47231j97731D43089a1780
12498a10495K6794q3008G5297a64310j98170C12999b21057k58224A6225b9243
$$ plain form
12487 -72331 -349079 -105482 737965 -133699 -130033 -60817 241109 -827984 -31683 -440040
12477 -440040 211137 -216733 -147129 502822 -406631 -291719 738257 -103001 -741186 -170286
12466 360447 876318 -595895 439495 -353396 -182086 8705 189896 -395651 -65187 598103
12455 472623 210951 140418 -148448 -792792 138243 -191082 22441 -483625 -132217 -423004
12445 -423004 -329073 -151571 119139 46868 -358852 -202126 72815 -535134 -79188 -216168
12435 -216168 50152 236556 -160400 613781 223921 416334 -86746 -62485 495512 51097
12424 -779654 -47727 535817 -305985 -1226 471767 -517165 408903 -311298 -434148 -286107
12414 -286107 780720 285284 14268 -186544 563714 -444698 60300 603772 -252726 4445
$$ packed form
12487g2331k76748a05482G37965a33699L666f0817B41109h27984c1683m08357
12477d40040B11137b16733O9604E02822d06631J14912G38257a03001o38185a70286
12466C60447N15871e95895D39495c53396J71310H705J81191c95651f5187E98103
12455D72623B10951p0533a48448o44344A38243a91082B2441d83625a32217k90787
12445d23004R3931a51571A19139D6868c58852J56726G2815e35134g9188j36980
12435b16168E0152J86404a60400F13781B23921J92413h6746K4261D95512E1097
12424g79654d7727E35817c05985a226D71767e17165D08903c11298j22850J48041
12414b86107G80720B85284A4268a86544E63714d44698F0300N43472b52726D445
$$ plain form
12403 125344 160542 -103427 114995 13070 -64394 -415356 -34185 230039 -40240 181178
12392 381065 -21347 56187 574796 183709 -300994 -66388 474650 315749 203260 259086
12382 259086 -37259 -332762 -87852 -98306 -71721 370471 125364 269253 489502 -57384
12371 -653733 129372 60022 -282091 70750 809723 464048 441875 728344 384503 -139265
12360 -182034 66061 -248643 -240702 101953 -70673 -173391 -14622 -129952 204081 -794461
12349 -79683 96152 194747 -247653 168613 749894 254631 -213190 171839 165549 508586
12339 508586 364817 474862 -184601 28853 -116249 238079 376411 -5638 345580 -5590
12328 306066 870525 91597 476307 2874 806187 171185 -415764 637133 334260 498183
$$ packed form
12403A25344L5198a03427A14995A3070f4394l50962c4185B30039d0240A81178
12392C81065b1347E6187N18609A83709c00994f6388D74650j58901j12489N5826
12382B59086c7259k95503h7852j0454K6585C70471A25364J43889K20249e7384
12371f53733A29372F0022b82091G0750P38973l45675k2173K86469l43841a39265
12360a82034F6061b48643P941A01953g0673j02718a4622j15330B04081g94461
12349g9683I6152R8595b47653A68613N81281B54631b13190A71839o290L43037
12339E08586j43769J10045a84601B8853a16249B38079J38332e638C45580e590
12328C06066N64459I1597L84710B874Q03313A71185d15764F37133l02873J63923
$$ plain form
12318 498183 -262823 236498 -632553 554751 250885 312785 549553 23115 945315 -299347
12307 73476 232986 104758 -622377 -139549 333417 113507 573873 371675 173071 610041
12297 610041 363339 437860 -111289 550033 -105543 436023 582837 -91204 522560 700666
12287 700666 1095675 104953 328166 39406 305211 833391 -9490 769634 -538872 186572
12276 -67333 -252490 166019 65331 372198 -128775 805272 -205644 137174 56688 326234
12266 326234 43818 724063 138748 388597 -144191 -2598 -27875 95895 -500717 -600742
12256 -600742 -256926 378337 -352321 67900 174123 519400 -443300 94543 -35293 -362462
12246 -362462 -196291 306537 288838 386447 225895 121313 282396 698467 195493 172247
$$ packed form
12318D98183b62823B36498f32553E54751B50885O1900K36768B3115R22200b99347
12307G3476J59510A04758f22377a39549C33417A13507M60366k02198A73071M36970
12297F10041k46702P4521a11289E50033a05543D36023J46814i1204E22560J78106
12287G00666L95009A04953K23213C9406K65805N28180i490G69634e38872A86572
12276f7333j85157A66019F5331L06867a28775H05272b05644A37174E6688K69546
12266C26234D3818O80245A38748K49849a44191b598k5277I5895e00717j00025
12256f00742b56926C78337c52321F7900J06223L45277d43300I4543c5293l27169
12246c62462J66171C06537j7699R7609j60552j04582J61083M16071A95493k3246
$$ plain form
12236 172247 719717 -549835 447411 -160049 246562 584907 409125 169131 640058 124389
12225 -532695 667324 353822 984514 345899 -172418 -121730 363233 686599 4308 290974
12215 290974 -94516 751103 474211 53455 110892 81216 292097 208559 144737 491040 272767
12204 272767 230473 287706 244219 2349 -213010 365863 370232 333057 -450357 279683 323532
12193 323532 245572 -396 628852 -677830 285003 331157 -23692 174333 567111 -85722 -8852
12181 22533 379469 752791 193614 444284 593968 362470 374664 -117483 688845 111570
12170 329651 466438 781877 76531 770009 -51630 -203120 258512 6126 156750 11463
12159 -189646 569837 404465 184241 125070 197504 219551 -199113 -58030 -26873 355340
$$ packed form
12236A72247N47470e49835D47411a60049B46562L38345j75782A69131M70927A24389
12225e32695F67324l13502O30692C45899a72418N0688C63233L23366D308K86666
12215B90974i4516G51103k76892E3455N7437k9676K10881q3538o3822L46303k18273
12204B72767m2294N7233m3487B349b13010C65863M369l7175d50357B79683M3849
12193C23532p7960c96F28852f77830B85003M6154b3692A74333L92778h5722h852
12181B2533L56936L73322A93614K50670J49684k31498J2194a17483F88845A11570
12170C29651J36787L15439G6531O93478e1630j51490B58512F126J50624A1463
12159a89646E69837j65372A84241n9171P2434K2047a99113e8030b6873C55340
$$ plain form
12148 410131 -82637 19167 85129 733142 -160971 -30843 13593 153443 -251316 -48939 64048
12136 223392 159505 -170374 -216489 273173 202567 -84507 199659 249005 75299 169146 -485975
12124 -115184 -149881 63089 -121672 -490435 -465679 -315388 -271675 360266 219290 -490564
12113 438363 1670 -44655 298571 -447032 430779 442548 481980 -487527 40101 198901 -65051
12101 -88312 382688 12029 -409516 521243 540805 229273 89605 861198 285910 220118
12091 220118 -281273 79321 -305051 397655 388148 603028 502235 437919 29650 440910
12081 440910 171341 224665 348702 270355 438725 301932 199008 1185188 -235623 276905
12070 6574 403444 90336 -509097 164989 -49311 326295 -222217 363703 -282193 548758
$$ packed form
12148D10131h2637A9167O5962O48013a60971c0843A3593J39850b51316d8939F4048
12136B23392o3887a70374m6115B73173p0606h4507A99659M9346G5299R3847d85975
12124a15184l4697F3089a21672l68763K4756J50291M3713C60266j40976d90564
12113D38363A670d4655B98571d47032D30779J1769L9432d87527D0101J58800f5051
12101h8312C82688A2029d09516E21243J9562B29273H9605P71593B85910o5792
12091B20118b81273G9321c05051C97655r507K14880j00793o4316B9650M11260
12081D40910A71341N3324J24037p8347J68370j36793j02924R86180b35623B76905
12070F574L96870I0336e09097A64989d9311C26295b22217C63703b82193E48758
$$ plain form
12059 -21645 221734 113493 -121068 -74480 189330 338042 478987 240024 -295834 472594
12048 -544526 24989 90699 379427 17248 -16599 191302 324344 330472 -187129 231661 -251882
12036 -56001 -137077 -30338 18932 332302 -253522 -119005 411201 -438391 -175620 -294315
12026 -294315 261722 496620 363333 -378431 181425 -143360 -38858 -216130 -28015 330
12015 -126182 -418155 -65659 -242936 263870 370728 429828 -960123 -104490 -235642 294359
12004 -213242 129450 225214 -333475 -138096 -317441 -265643 35761 2020 -233195 131646
11993 125111 196644 41299 1255 283750 531145 -5417 -230783 -39136 718098 259917 179140
11982 179140 6488 111338 -138316 -97649 -62379 63341 -662208 76004 -97057 -606528 46313
$$ packed form
12059b1645B21734j08241a21068M6588A89330J48712J40945k38963b95834D72594
12048e44526B4989O5710K88728A7248a6599A91302J33042O128a87129B31661b51882
12036e6001q1076c0338A8932L13370b53522a19005D11201d38391a75620j18695
12026b94315B61722K34898j33287c78431A81425a43360c8858j77272b8015C30
12015a26182k91973f5659j77277B63870J06858N9100i60123a04490j31152B94359
12004b13242A29450R5764c33475a38096j79345N1798C5761B020b33195A31646
11993A25111P1533D1299A255K82495K47395e417k25366c9136G18098B59917q0777
11982A79140F488J04850a38316M0667L5270F3341f62208G6004i7057n09471D6313
$$ plain form
11970 -313475 285660 61785 21034 -235050 428806 -564493 83990 -431671 -710364 71590
11959 46814 208153 -398637 -176273 40249 -326200 337439 251131 45009 -138626 -236768
11949 -236768 -411012 29571 -96222 -68296 -287507 567048 -97260 759181 -251301 28941
11938 -622944 31763 359849 439203 209075 266654 260987 -163168 39881 -112721 -431201 317898
11926 -543968 84870 -29826 -178547 -27922 -366489 -1176807 -749896 200877 -165732 252075
11915 537175 659295 -165976 -164857 268509 -93748 -940000 48269 302085 484137 -451116
11904 70597 -228667 -264156 -166102 124279 -163735 129640 -343420 496021 -262960 -561667
11894 -561667 -56718 -91566 -503572 -572331 139295 -648192 230659 -208688 -479140 196873
$$ packed form
11970c13475B85660F1785B1034b35050D28806e64493H3990d31671k78693G1590
11959D6814J61339c98637a76273D0249c26200C37439q6308D5009a38626r8142
11949b36768j74244B9571i6222K7926k19211E67048i7260G59181b51301B8941
11938f22944C1763L28086P9354B09075N7579n667a63168C9881a12721l18480C17898
11926e43968H4870b9826j48721b7922l38567q10318M26911B00877a65732B52075
11915E37175J22120a65976J119B68509i3748q46252D8269K53816J82052d51116
11904G0597b28667l5489R8054A24279a63735A29640c43420D96021b62960k98707
11894e61667e6718l4848m12006o8759A39295f48192B30659b08688k70452A96873
$$ plain form
11883 -373898 -260842 328546 51965 115641 85632 -446005 314704 -274799 128514 62508
11872 -801323 -491120 -163707 114585 240403 660854 -117937 337928 -482096 -241712 399114
11861 -470369 -284894 -438046 174989 -258175 217131 -139518 -161456 -4213 464029 -180104
11850 809167 -415232 607516 -230435 19132 286941 495594 -75576 -387279 300618 -833564
11839 129803 -122064 176118 -498995 -170403 111249 308744 99869 -429020 -418530 320416
11828 34550 -100183 -164326 -72079 -292342 39342 -49201 91847 -251329 -625011 466258 -584582
11816 -523733 6234 -563982 334278 -678130 -37001 -192317 -450001 -225673 -245902 91027
11805 380099 -94423 -124936 -95454 -413141 406697 -553413 -2510 769138 -609093 -400900
$$ packed form
11883c73898J13056C28546E1965O3676l0009d46005C14704b74799A28514F2508
11872h01323L10203a63707A14585J25818M20451a17937C37928d82096K40384C99114
11861d70369J85475j53152A74989b58175B17131a39518k1938d213D64029a80104
11850H09167d15232F07516b30435A9132K67809K08653g5576l11703C00618h33564
11839A29803a22064A76118d98995a70403A11249J97495I9869d29020J0490C20416
11828C4550a00183o4143g2079k20263C9342d9201I1847b51329l73682D66258e84582
11816e23733F234e63982C34278f78130c7001j55316k57684K24328k0229I1027
11805C80099i4423l0513K9482l17687D06697e53413b510G69138f09093K08193
$$ plain form
11795 -400900 -201368 -41874 -14253 8103 -161928 -46931 200460 350731 -133980 -336506
11785 -336506 -235723 -628558 -164360 288201 -308725 -39848 -293058 -189595 -687727 -86605
11774 -647835 -284967 31719 162 333012 -7896 496330 -629755 -202126 -451425 325106 -243666
11762 -108781 724861 -587359 76886 -158592 329229 26196 -51439 30194 101463 -198135
11751 -290983 156008 112564 289582 -169761 -157455 -173694 138720 -130173 -159796 -152681 -409570
11740 -409570 -122568 76472 -56554 -157995 -701606 -582537 241691 69921 69493 106295 144753
11729 144753 -283470 -387813 -360627 -49494 -141276 455353 -268726 -88458 -188867 542134
11718 20688 -165494 -639587 -394459 52073 -611256 281857 -99090 -145266 419570 272378
$$ packed form
11795d00900J99532d1874a4253H103a61928d6931B00460J50271a33980k02526
11785c36506J00783l92835a64360B88201c08725c9848k53210J03463m98132h6605
11774f47835b84967C1719A62L32850g896D96330f29755b02126k49299C25106b43666
11762a08781G24861e87359G6886a58592C29229B6196e1439C0194P1269a98135
11751b90983A56008m3444J77018a69761J2306j6239A38720a30173k9623P115k56889
11740d09570a22568G6472e6554j01441n43611J19069B41691F9921m28L6802L8458
11729A44753b83470j04343K7186d9494r1782D55353b68726h8458j00409E42134
11718B0688a65494m74093K45128E2073f11256B81857i9090m6176D19570j47192
$$ plain form
11708 272378 -472870 290234 120952 -31257 221222 348466 -852127 -428709 40096 -666198
11697 213747 -90820 -345084 317657 233512 17285 -220654 714382 501484 619338 271681
11686 502269 159474 620545 425226 114031 -187890 -310426 594109 350805 277590 351694
11676 351694 -375243 591573 109306 277648 -172948 -165197 -551411 392633 415962 -105308
11665 464666 -19427 -292772 186044 -246498 307219 126994 87272 702171 -82008 31739
11654 -100860 -344128 -295162 34394 207995 732751 -197809 411390 -614008 121974 53653
11643 367520 -130212 -128492 15736 -74795 -53588 74629 304986 -174163 -79508 205142 278555
11632 278555 366481 17974 -874758 -137439 370114 217578 -75670 368584 -248027 -211499
$$ packed form
11708B72378d72870B90234A20952c1257B21222J27244h52127M23418D0096f66198
11697B13747i0820k54264C17657q4145A7285b20654G14382k12898J17854B71681
11686E02269A59474M61071j95319A14031a87890j22536E94109k43304p3215P4104
11676C51694c75243E91573A09306J68342a72948P751l86214C92633K3329a05308
11665D64666a9427k73345A86044b46498C07219A26994l9722O14899h2008C1739
11654a00860k43268M8966C4394J73601N24756a97809D11390f14008A21974E3653
11643C67520a30212J720A5736g4795K1207G4629K30357a74163g9508B05142P3413
11632B78555Q7926A7974h74758a37439C70114j52536g5670C68584b48027L6528
$$ plain form
11622 -211499 97979 548634 -12102 -315830 112886 493378 223702 82691 -59238 605301
11611 -54506 222676 183385 177283 -292070 510194 436899 343875 23642 277842 -270495 -449129
11600 -449129 -410055 -11404 -45593 193560 -105075 -1148203 156338 223286 -179866 -439763
11590 -439763 -329610 -317660 389162 42867 308814 173140 -344462 -249103 449094 233586
11580 233586 -316887 488031 122006 250604 -321738 324271 188624 71793 -2262 192299
11569 294200 -245422 313712 -83756 369940 115301 373077 -220145 -200913 -110809 418478
11558 33790 122538 -269053 216724 -444605 -93722 -224795 508676 78471 -101026 137099
11547 32805 -149759 -2909 63590 -134878 375255 163867 587334 -297150 398315 420254
$$ packed form
11622b11499I7979M50655a2102l03728A12886L80492B23702H2691e9238F05301
11611e4506B22676l9291o102b92070E10194p3295r3024B3642K54200b70495j78634
11600d49129L9074a1404l4189A93560a05075j043128A56338O6948a79866k59897
11590d39763J10153J1950C89162D2867K65947j35674c44462R5359D49094k15508
11580B33586c16887D88031A22006J28598c21738C24271j35647G1793b262A92299
11569B94200b45422C13712h3756C69940A15301K57776b20145J9232R0104D18478
11558C3790Q8748b69053B16724d44605i3722j31073E08676G8471a01026A37099
11547C2805a49759b909F3590a34878C75255A63867M23467b97150C98315K1939
$$ plain form
11537 420254 462144 86937 -59267 385284 498616 -22755 365074 -239874 358429 3445 309243
11526 309243 -526376 -260472 155784 64711 396290 -257964 125044 120839 363439 -208339
11515 505545 529443 600962 599642 357743 449423 -540627 579996 -303469 43323 -165363 -28858
11503 -198674 16272 -355399 12432 315856 56876 -418097 103165 691821 214276 500163
11493 500163 -146329 -227270 102382 428039 -102727 156971 -235054 452048 -491169 -44340
11482 -275624 -514571 172818 587873 665791 -57025 560511 42431 264473 -391101 29617
11471 266463 -263881 -61473 -502201 -529492 97637 -265723 115473 470633 417346 77795
11460 -778751 188246 438691 -41467 210127 -119211 841231 -247791 -498374 358327 -4123
$$ packed form
11537D20254M1890H6937e9267C85284J13332b2755C65074b39874C58429C445L05798
11526C09243e26376b60472A55784F4711L31579b57964A25044m205K42600b08339
11515E05545K3898P1519j320k41899R1680e40627E79996c03469D3323a65363b8858
11503a98674A6272c55399A2432L03424E6876d18097A03165N88656B14276K85887
11493E00163a46329q0941A02382L25657a02727A56971b35054D52048d91169d4340
11482b75624k38947A72818M15055P7918e7025E60511D2431K22042c91101B9617
11471B66463b63881f1473m40728k7291I7637b65723A15473L55160n3287G7795
11460g78751A88246K50445d1467B10127a19211H41231b47791k50583C58327d123
$$ plain form
11449 604143 -32934 -137745 181446 94910 198454 382004 -54783 513520 328264 -73494
11438 -574280 -242871 3176 -230448 -96349 143083 -255379 692330 116649 311957 423224
11428 423224 58283 599191 -512478 -227275 533612 458475 -673768 387937 541920 -156212
11417 -541702 98238 -76240 -64717 -143943 315757 287875 -377387 -405485 -38820 -165026 152960
11405 -83527 509109 111989 -301950 -554413 53422 -106330 -100381 -284934 -78574 -61660 -40514
11394 -40514 -391918 75653 -27025 -818323 154040 360058 -57958 -172866 297351 -252983
11383 -74215 -120119 604864 23517 393852 653490 -73910 374435 171707 -218181 -589459
11373 -589459 -518364 -433538 -3417 83984 127823 77737 879716 59885 43184 -524119 -284240
$$ packed form
11449F04143c2934j04811A81446q6536J03544J83550e4783E13520j85256g3494
11438e74280b42871C176b30448i6349A43083b55379F92330A16649J95308J11267
11428D23224E8283N40908e12478b27275E33612p5137f73768C87937J53983a56212
11417e41702I8238g6240J1523p9226C15757k7882c77387k8098c8820j26206A52960
11405h3527E09109A11989c01950k52463E3422a06330N949j84553g8574J6914K1146
11394d0514l51404G5653b7025p91298A54040K06018e7958j14908B97351b52983
11383g4215m5904F04864B3517L70335K59638g3910C74435A71707b18181l71278
11373e89459P1095Q4826c417H3984M3839n0086Q01979E9885j6701e24119K39879
$$ plain form
11362 -284240 -122272 -357621 -116174 -320156 518561 -407337 -221027 -51574 -149042 35880
11351 -32264 -151629 -1013019 -587919 -310944 48621 129419 1825 42826 -192342 -457015 205900
11339 -306322 -585611 -241182 307992 -647248 -126118 202350 -251484 -448828 -311941 -286274
11329 -286274 355501 353928 110702 130624 6699 -210978 -326280 -749226 -428382 -73074 484317
11317 -72762 -87398 -55839 -636229 -655867 -71049 141219 183182 617162 -301976 -384925 -119125
11305 745025 -167442 -632344 40703 225528 759320 -351350 -215298 -145626 358022 -180349
11294 -298317 -464964 26777 -763383 -464400 -4610 502756 371107 87570 -520987 -537824
11284 -537824 -261667 -697435 -73924 -300761 -78097 -318908 87115 -411619 -392607 -86425
$$ packed form
11362b84240a22272k35349a16174k03982E18561d07337J86310e1574r7468C5880
11351c2264j19365q61390M25100K76975D8621Q0798A825M1001a92342k64673B05900
11339c06322k79289b41182C07992f47248a26118B02350b51484j97344J36887K5667
11329b86274C55501j573A10702J9922F699b10978j15302m22946L20844g3074D84317
11317g2762j4636L1559n80390j9638g1049A41219M1963M33980c01976q2949a19125
11305G45025a67442m64902D0703J84825N33792c51350J36052O9672C58022a80349
11294b98317j66647B6777g63383K98983d610E02756j31649H7570e20987j6837
11284e37824b61667m35768g3924k26837g8097k40811H7115d11619J9012h6425
$$ plain form
11273 751626 -755234 -233862 -371528 13850 -30362 71915 -143967 321646 -596155 -436976
11263 -436976 192900 71162 205789 -483921 69008 -389365 -67929 -185800 59500 73198
11253 73198 633931 142755 -244341 -888341 111700 -172970 290110 -396820 257866 609827
11243 609827 -111406 88263 319850 -75574 105018 234238 188599 109656 527584 -117543
11232 467984 -772633 -458037 -76275 -91991 116646 104155 261545 105327 147809 232102
11222 232102 39292 665978 -319091 47153 -701996 -537605 862466 340260 104243 -383661
11211 170595 -41535 232682 136820 -164572 525857 -532966 242175 -123800 -545604 162167
11200 -75399 280215 -429541 225938 700822 94166 -116301 -164609 57345 -602341 81587
$$ packed form
11273G51626g55234b33862j37666A3850c0362G1915a43967C21646e96155J59179
11263d36976A92900G1162J34627d83921F9008c89365f7929j17871E9500J3698
11253G3198N60733A42755b44341o44000A11700a72970B90110c96820B57866L51961
11243F09827a11406H8263K31587g5574A05018J29220m5639p8943M17928a17543
11232D67984g72633L14596g6275j5716A16646j2491J57390A05327M2482Q4293
11222B32102C9292O26686c19091D7153g01996J64391H62466C40260A04243c83661
11211A70595d1535B32682r5862a64572E25857e32966B42175a23800m21804A62167
11200g5399B80215d29541B25938M74884I4166a16301m8308E7345f02341H1587
$$ plain form
11189 -74581 -548006 -160000 -418698 1302 235673 -301578 -625972 1983 45635 347983 -276754
11177 -108927 133440 -555453 -329494 602369 -160928 68923 -218605 288691 595775 -774015
11166 220456 80339 -804159 -393073 -58673 -30666 -397859 319567 -318476 -21663 -92992
11156 -92992 276844 -279147 501259 -517923 -169814 312702 77906 179939 -42946 -311695
11146 -311695 219737 -228413 705223 115699 138919 492850 436926 260953 648019 -416602
11135 -108122 232542 -139782 -258731 793065 -411531 75020 547670 200938 -151357 372365
11124 477150 702462 603346 562567 301672 569970 -257888 358060 149563 436718 -145784
11113 682251 632846 -319432 295784 336725 1224062 547007 971006 645020 555376 -168699
$$ packed form
11189g4581m73425a60000k58698A302K34371c01578l24394A983M3652L02348b76754
11177a08927A33440e55453K25959F02369a60928F8923b18605B88691L07084g74015
11166B20456H0339h04159c93073e8673K8007l67193C19567c18476b1663p1329
11156i2992B76844b79147E01259e17923a69814C12702G7906J02033d2946k68749
11146c11695B19737b28413G05223A15699K3220L53931n5924j75973L87066d16602
11135a08122B32542a39782j18949G93065d11531G5020M72650B00938a51357C72365
11124D77150K25312r9116m0779k60895K68298b57888C58060A49563K87155a45784
11113F82251m9405c19432B95784M0941Q87337E47007M23999l25986q9644a68699
$$ plain form
11102 1119179 441398 541920 516431 390158 842745 392762 869334 274737 158404 533284
11092 533284 760625 559260 555806 555378 117041 578933 708398 870429 925129 212584 276599
11081 276599 886826 427046 230071 265297 500851 201100 576064 919209 713469 823471
11071 823471 1448195 773817 713338 832237 800079 293288 923269 967405 899109 912356
11061 912356 1365377 423097 212902 185938 1282031 1325164 741866 1190950 430307 1304843
11051 1304843 315741 1244096 1010941 872872 1448978 1386121 1011499 1785261 1300782 956940
11041 956940 1327434 640082 1461514 1279570 1147530 932896 1587411 1476883 1718079 1261947
11031 1261947 1200591 1038625 885072 1505972 1092454 915851 1576307 1283987 1500952 953934
$$ packed form
11102A119179D41398J00522k5489j26273M52587C92762M76572B74737j16333L74880
11092E33284K27341k01365l454m28A17041M61892J29465J62031N4700B12584O4015
11081B76599O10227D27046j96975L5226K35554B01100L74964L43145k05740J10002
11071H23471O24724o74378o0479J18899l2158B93288O29981M4136o8296J3247
11061I12356M53021D23097k10195k6964J096093M3133n83298M49084D30307Q74536
11051A304843C15741R28355k33155j38069N76106o2857l74622P73762m84479l43842
11041I56940L70494F40082Q21432j81944j32040k14634O54515j10528K41196m56132
11031A261947o1356j61966j53553O20900m13518j76603O60456k92320K16965n47018
$$ plain form
11021 953934 1595254 2101780 1622498 1522403 1368384 1254767 1297087 1222002 992017 979789
11011 979789 864166 1523806 872667 1637595 904547 1198975 1023132 1058874 925909 1203918
11001 1203918 1432885 1184501 1365615 1583813 1196184 1506606 1650700 1122865 1497654
10992 1497654 1058602 1593313 1198380 1505742 708491 1314718 1398791 1667849 1583891 2380736
10982 2380736 1344082 1792551 985279 1265429 856249 1560828 2140756 1603803 1911441
10973 1911441 1376912 1830967 1907081 1892658 1834306 1626655 2078774 1649506 1684759 1153384
10963 1153384 1921853 1407556 1186224 1456905 1618668 1055081 726658 1589387 1072569
10954 1072569 1741201 1177602 734299 747839 1232601 859807 805384 1148174 1312486 482791
$$ packed form
11021I53934O41320N06526m79282j00095j54019j13617M2320p5085k29985j2228
11011I79789j15623O59640o51139P64928p33048K94428j75843L5742j32965K78009
11001A203918K28967k48384J81114K18198l87629L10422J44094n27835L74789
10992A497654m39052N34711l94933L07362G08491O06227Q4073K69058q3958P96845
10982B380736j036654M48469q07272K80150m09180P04579N79928n36953L07638
10973A911441n34529M54055P6114j4423n8352k07651M52119m29268L5253n31375
10963A153384P68469n14297k21332K70681J61763n63587l28423Q62729n16818
10954A072569O68632n63599m43303J3540M84762l72794n4423L42790J64312D82791
$$ plain form
10943 1059796 367826 828522 283823 613768 332449 1447956 253192 -12706 561473
10933 184151 121485 336130 440250 76636 423207 -220949 550722 373351 556015 170859
10922 379083 -103887 253433 -292133 -20236 86917 -22594 208027 -29886 557247 56145
10911 -446257 486059 -897223 44375 -255610 370376 -132948 -529142 14752 155426 -304348
10900 -643450 123502 -207543 -242221 881858 -160822 -364952 111285 -162940 699675 310520
10889 610743 258676 -224618 -205100 -115509 232738 -499770 3450 22509 270551 -262090
10878 -241993 -606399 7316 -56864 60572 -578988 -241231 -354238 -271292 -20198 -214994 -103752
10866 55 258350 -165603 -1222102 2148 -408903 -239481 -127811 -431256 691627 -216358
$$ packed form
10943A059796C67826M60696B83823L29945k81319J115507B53192a2706E61473
10933A84151o2666K14645J04120G6636L46571b20949E50722j77371J82664A70859
10922C79083a03887B53433b92133b0236H6917b2594B08027b9886E57247E6145
10911d46257D86059h97223D4375b55610C70376a32948l96194A4752J40674c04348
10900f43450A23502b07543l4678H81858a60822k04130A11285a62940F99675C10520
10889F10743B58676b24618J9518Q9591B32738d99770C450J9059K48042b62090
10878b41993l64406G316e6864F0572e78988b41231j13007Q2946b0198j94796a03752
10866E5K58295a65603j056499B148d08903J69422J11670l03445F91627b16358
$$ plain form
10855 -91765 135302 -246697 221493 -349272 -323698 -287770 -866907 -22272 295288 -383382
10844 -405510 315828 -696541 -748045 294932 -790929 469906 -452536 143534 93753 -262987
10833 395430 -144093 -280937 601396 202132 -268842 -62542 271445 -98210 150573 86626
10823 86626 -82706 -320644 -1230661 268962 -527930 268733 -173200 -77676 -149956 -368582
10813 -368582 -323072 582361 -156313 -89831 6696 -294802 -435229 -54864 -102201 58732 -18790
10801 -187258 486919 -411464 -765069 4406 573999 50377 -233704 -461970 -479364 155173
10790 -7074 92348 -19495 -486809 -126645 -258829 -99393 111154 -382988 514376 196074
10779 -514996 -27674 -415281 -336102 31615 -297929 -184246 -379006 -463165 -513595 -44628 108165
$$ packed form
10855i1765A35302b46697B21493c49272K5574L5928n79137b2272B95288c83382
10844d05510C15828f96541n1504B94932g90929D69906d52536A43534m9781b62987
10833C95430a44093j36844F01396B02132b68842f2542B71445i8210A50573o3947
10823H6626h2706k37938r10017B68962e27930B68733a73200g7676p2280k18626
10813c68582M5510E82361a56313O6482F696b94802j40427e4864m7337E8732a8790
10801a87258D86919d11464l53605D406N69593E0377b33704k28266j7394A55173
10790g074I2348a9495m67314a26645j32184i9393A11154c82988E14376A96074
10779e14996b7674l87607P9179C1615b97929J13683j94760q4159n0430d4628A08165
$$ plain form
10767 93607 -470559 -109140 193241 -185512 148170 -392155 96017 -103589 -229702 -146538
10757 -146538 -85819 218981 -931954 -148511 -633773 23200 75725 -61686 -670069 46246
10746 -76834 319115 415351 -1048741 -246460 -269605 -281475 -81681 577809 -480846 -470943 -236965
10735 -236965 -262118 101063 -474541 -270002 93935 -1551 -555825 -800406 -179592 13144
10724 -641092 557609 -39576 354328 -251551 -374014 -437599 80270 310871 -239151 -545569
10714 -545569 -411714 775892 -200319 -319943 -165435 -851201 201005 314444 173101 381359
10704 381359 366362 536924 176535 -205200 356545 -302536 -632727 -606973 174134 -45950
10693 367984 -374907 -347671 307068 100838 122542 -137832 -408315 100229 -161828 -13796
$$ packed form
10767I3607d70559a09140A93241a85512A48170c92155I6017a03589j26113Q3164
10757a46538O0719B18981i31954a48511m85262B3200N2525f1686o08383D6246
10746g6834C19115R6236a048741b46460k3145j1870h1681E77809d80846R903K33978
10735b36965k5153A01063d74541K04539I3935a551n54274k44581a79592A3144
10724f41092E57609c9576C54328b51551j22463o3585H0270K30601b39151l06418
10714e45569J33855G75892b00319j19624J54508o85766B01005J13439j41343K08258
10704C81359j4997J70562A76535b05200C56545c02536l30191K5754A74134d5950
10693C67984c74907K7236C07068A00838K1704a37832k70483A00229a61828a3796
$$ plain form
10682 -634043 -393744 -113117 346450 -498917 -616975 381835 -646121 370688 199340 288209
10672 288209 431930 -356338 -126301 -283738 -238766 -336576 -315696 -21655 -295850 -92372
10661 -520707 -225325 -328823 -263866 130870 145629 53160 -428811 -877083 225064 -688060
10650 523642 -103039 215120 -316144 -1020193 93007 -110197 106343 297360 -306739 -659060
10640 -659060 -473117 -91363 -484578 -162542 82383 155894 359196 217809 438169 414518
10630 414518 -171759 48667 815963 -311395 -231513 -185574 -527396 193268 -10195 76737
10619 325753 -238055 -380749 100703 27268 -299009 -131776 -341664 -424350 344990 117921
10608 12931 -943469 135833 -124105 16624 -498121 -95967 551665 247302 -724587 -8736
$$ packed form
10682f34043K40299a13117C46450d98917j18058C81835f46121C70688j71348Q8869
10672B88209J43721c56338a26301j57437M4972r7810K0880b1655k74195i2372
10661e20707b25325j03498O4957A30870J4759E3160d28811m48272B25064f88060
10650E23642a03039B15120c16144p04049I3007a10197A06343J91017c06739l52321
10640f59060J85943i1363l93215a62542H2383P3511K03302j41387K20360k3651
10630D14518a71759D8667P67296c11395P9882M5939l41822A93268a0195G6737
10619C25753b38055j42694A00703B7268b99009a31776k09888q2686C44990A17921
10608A2931i43469A35833a24105A6624d98121i5967E51665B47302g24587h736
$$ plain form
10597 -240789 -616344 -165468 -206937 -65562 -427625 -200105 127310 1338 -26652 -16449 -743314
10586 -743314 -207493 -137015 -877662 212714 -397347 -38852 -430883 47119 11413 -7894 -272577
10575 -272577 -139786 60792 223175 -44674 -357152 273217 285857 -14957 -304043 108996
10564 21406 -340549 -277765 -973805 -45264 -133212 333600 301314 -916843 -111016 92519 -30782
10552 -82129 -99443 325785 -211628 246729 -305295 141275 30574 -572495 198763 -93006
10541 -106744 -2766 468784 534703 99821 -253161 104445 -955646 92153 -148134 278424
10530 -189818 318685 -194555 179054 -376217 -312787 -628199 68112 -33009 -186560 177839
10519 -107362 139571 632186 -165924 -686104 40432 300066 -145157 -196432 -298249 313285
$$ packed form
10597b40789l75555a65468m1469f5562l62063b00105A27310A338b6652J0203p26865
10586g43314b07493P0478p40647B12714c97347c8852l92031D7119A1413g894k64683
10575b72577J32791F0792J62383d4674l12478B73217J2640a4957k89086A08996
10564B1406c40549O2784o96040d5264q7948C33600l2286i16843a11016I2519c0782
10552h2129j7314C25785b11628B46729c05295A41275C0574e72495A98763i3006
10541a06744b766D68784O5919I9821b53161A04445i55646I2153a48134B78424
10530a89818C18685a94555A79054c76217O3430l15412F8112c3009j53551A77839
10519a07362A39571M92615a65924n20180D0432K59634a45157n1275j01817C13285
$$ plain form
10508 460194 -578990 53695 -248889 -117421 519141 242900 -45339 -524189 -547001 -39528
10497 24211 -105493 312583 549446 351688 -337626 2686 -246853 -1175 418504 239008
10487 239008 -142232 232353 -171066 -357925 96116 234902 -454659 326723 96020 -44460
10476 -203929 -32385 -180421 69242 70409 125984 162011 -675613 380142 -526330 22508 -203509
10464 420417 -455459 339035 239060 -10453 -260738 -353177 23632 355334 -537061 155395
10453 13567 -188579 -213818 423336 -395803 222979 130184 37070 -83868 -336512 -144401
10442 -195356 149721 -568901 145159 -223472 -238783 71679 163355 -92661 -357834 652344
10431 -439974 -57763 -270076 -113848 325101 -333658 343291 390665 121490 636876 306810
$$ packed form
10508D60194e78990E3695b48889a17421E19141B42900d5339m78850k2812c9528
10497B4211a05493C12583K36863j97758c37626B686b46853a175D18504j79496
10487B39008a42232B32353a71066j86859I6116J38786d54659C26723I6020d4460
10476b03929c2385j48036F9242J167N5575L6027f75613C80142e26330B2508b03509
10464D20417d55459C39035r9975a0453k50285r2439B3632L31702e37061A55395
10453A3567a88579k5239D23336c95803B22979r2795C7070h3868k52644a44401
10442a95356A49721e68901A45159b23472j5311G1679R1676i2661k65173F52344
10431d39974e7763k12313a13848C25101c33658C43291M7374A21490N15386C06810
$$ plain form
10420 27244 -124049 359956 547813 696516 477419 -673622 -61486 381586 411396 885112
10410 885112 -440748 -36088 173354 -102069 -39383 -106712 128704 -185009 588667 -408891
10399 381424 -132678 372479 101059 -317297 238055 -61728 255238 -110157 629200 550521
10389 550521 360024 297886 -6550 -305489 300924 -519448 -263373 235334 381356 -63850
10378 222644 1179484 468957 -302328 138673 352040 111288 583486 572752 100093 649592
10368 649592 -100254 149179 460989 330999 -250896 302241 90151 33122 369318 -30301
10357 196618 612100 559119 464788 360159 -23406 431106 210660 204065 24736 253006 321657
10346 321657 286347 -123828 543120 385605 -110592 433743 49690 -85852 378471 -27085
$$ packed form
10420B7244a24049C59956J87857J48703k19097f73622f1486C81586K9810M73716
10410H85112d40748c6088A73354a02069c9383o7329A28704a85009E88667d08891
10399C81424a32678C72479A01059c17297B38055f1728B55238a10157F29200p8679
10389E50521j90497o2138f550k98939C00924e19448K56075B35334J46022f3850
10378B22644R56840D68957c02328A38673K13367A11288M72198j0734A00093N49499
10368F49592a00254A49179L11810j29990b50896C02241I0151C3122L36196c0301
10357A96618M15482n2981r4331j04629b3406D31106B10660o595B4736K28270O8651
10346C21657l5310a23828E43120j57515a10592D33743D9690h5852C78471b7085
$$ plain form
10335 398209 260368 239555 96623 -349867 20814 426289 9417 1423 334714 544185 292665
10324 292665 385454 151962 -140115 -504641 9604 -732674 -216227 756110 122208 385813
10314 385813 -50596 -554470 -274704 -450943 589803 23291 475490 164578 -101267 -995648
10304 -995648 467352 -916335 -232913 268039 262003 363222 417440 212245 -93237 36969
10293 -360047 366973 9355 -651646 -109400 175746 235534 15401 -418073 -70437 -330805
10283 -330805 217934 -293604 -357323 -170766 188955 -285931 -214026 -99087 251158 -333644
10272 -206590 -435762 -9021 -72181 -534736 -75614 133798 -593052 -104206 574 -607116 -290310
10260 -155306 163226 -295042 -289632 201795 -23818 627724 -115996 59811 -271971 -129684
$$ packed form
10335C98209j37841k0813I6623c49867B0814M05475I417A423L33291K09471k51520
10324B92665R2789A51962a40115l64526I604g32674b16227G56110A22208K63605
10314C85813e0596n03874b74704j76239E89803B3291M52199A64578a01267q94381
10304i95648D67352i16335b32913B68039o036J01219N4218k05195i3237C6969
10293c60047C66973I355f51646a09400A75746N9788A5401d18073g0437k60368
10283c30805B17934b93604o3719a70766A88955b85931P1905i9087B51158c33644
10272b06590k29172i021o3160m62555g5614A33798e93052a04206E74f07116b90310
10260a55306A63226b95042N410B01795b3818F27724a15996E9811b71971a29684
$$ plain form
10249 -213792 -87042 913570 62450 -255407 157703 -645924 -29720 517720 -322171 -332308
10239 -332308 173214 101349 67452 -489483 -325593 211541 -339708 -101128 -458021 -409898
10229 -409898 -165454 -181913 -195913 -868985 -280882 1574 360651 -296854 -124435 159930
10218 -75667 -622494 113984 -716513 -630753 465195 15129 -45641 329890 16006 76598 -328363
10206 -79343 -396576 -167772 -55907 -704266 -156487 243189 439702 206052 228911 -126633
10195 -136225 -523480 85082 -187031 -345524 -313775 135589 17069 -403897 651988 -215852
10184 -308365 -630214 41303 -543074 -132793 -152432 -315346 -387069 805190 280602 251465
10174 251465 -432873 -521460 -479179 -187290 -589756 -111888 -217908 -154466 10002 132624
$$ packed form
10249b13792h7042I13570F2450b55407A57703f45924b9720E17720c22171j0137
10239c32308A73214p1865l3897d89483J63890B11541c39708a01128l56893M8123
10229d09898a65454j6459j4000o73072b80882A574L59077b96854a24435A59930
10218g5667n46827A13984g16513Q5760D65195A5129d5641C29890A6006O0592c28363
10206g9343l17233a67772e5907o48359a56487B43189J96513B06052K2859a26633
10195a36225l87255H5082a87031j58493L1749A35589A7069d03897F51988b15852
10184c08365l21849D1303e43074a32793j9639j62914p1723H05190B80602k9137
10174B51465d32873q8587M2281a87290m02466a11888j06020O3442A0002J22622
$$ plain form
10164 132624 -143116 -403934 -402069 -277083 73497 -280852 -27660 -339520 -367694 129929
10153 -402255 -573753 -559281 -107086 -326061 -141390 -140336 -290431 -34844 -102831 -589308
10143 -589308 166994 288571 -573894 -208597 -95431 306302 -647068 -16765 -86774 -58799
10133 -58799 398872 61394 79809 650473 142764 304445 -261545 409621 8981 -440716
10122 -493676 -138000 -186588 155855 -49469 583 -461535 -141757 -541549 -518448 -329004 -430953
10111 -430953 -461167 165248 -572630 443934 300759 -495735 -515433 247642 150688 -361341
10100 -644092 514426 57206 -680687 -7140 -384464 46947 -544824 220953 -73989 -341292
10090 -341292 -562931 -278930 -141028 -220521 -128884 -146079 -314235 -381817 22018 -169845
$$ packed form
10164A32624a43116k60818J865J24986G3497b80852b7660l11860k8174A29929
10153d02255j71498J4472a07086k18975a41390J054j50095c4844o7987m86477
10143e89308A66994J21577e73894b08597i5431C06302f47068a6765p0009K7975
10133e8799C98872F1394J8415N70664A42764J61681b61545D09621H981d40716
10122d93676a38000m8588A55855d9469E83d61535a41757l99792K3101J89444j01949
10111d30953l0214A65248e72630D43934j43175d95735j9698B47642r6954c61341
10100f44092E14426E7206f80687g140l77324D6947e44824B20953g3989k67303
10090c41292k21639b78930J37902p9493R1637j7195j68156o7582B2018a69845
$$ plain form
10079 142220 -572701 224650 -804488 -249220 254091 174125 -459019 224376 -104166 -453727
10069 -453727 -207378 -430277 -129533 -100557 -696654 -303670 -13268 188112 -535553 -302459
10059 -302459 -94301 -283710 -163303 -1015 -392582 -318386 -78458 -341006 22484 -429186 11497
10047 86054 524132 108479 -110927 -528661 -96487 -517070 115374 10577 122120 -308546
10036 -286643 -123788 -229510 -115590 14881 395329 -527940 -421664 -720331 -461421 -468274
10026 -468274 -201423 -158346 -3961 180788 311773 -593197 -324982 -86895 62979 37169 342278
10015 342278 88964 -436403 -163837 -454471 -855073 -271512 149289 -638337 -166668 -353054
10005 -353054 29236 -49316 455538 -475966 -40264 -119171 -98706 -281486 -223348 -362613 -477020
$$ packed form
10079A42220e72701B24650h04488b49220B54091p9966d59019B24376a04166l49561
10069d53727b07378k22899a29533K8976n96097c03670a3268A88112e35553K33094
10059c02459i4301j89409J20407a015l91567P4196g8458k62548B2484d29186A1497
10047H6054M38078A08479a10927m17734i6487m20583A15374A0577J11543c08546
10036b86643a23788j05722J13920A4881L80448e27940J06276k98667K58910o853
10026d68274b01423M3077c961A80788J30985e93197K68215h6895F2979k5810L05109
10015C42278H8964d36403a63837k90634m00602b71512A49289f38337a66668j86386
10005c53054B9236d9316D55538d75966d0264p8907K0465j82780N8138j39265j14407
$$ plain form
9994 -477020 136278 -452070 -467411 -145000 -573959 412905 135244 342018 31115 359853
9984 359853 334070 -490361 -109794 340671 -114943 -299044 369247 -671121 -34039 -5921
9973 19743 -548961 -132751 133834 62983 -354645 -386738 121399 -422984 -188913 -783073
9963 -783073 -565773 35084 -232495 463925 -213014 -478915 -159247 -196738 -191273 -181008 -352410
9952 -352410 265107 -534379 301971 167370 160107 -757326 -398787 -96855 357447 -508308
9941 329801 -744039 289199 -233224 23827 -550497 -249835 -1180043 -120020 57289 -322907
9930 29859 -506301 382885 -165932 170061 -353998 -45216 457513 -613888 -329088 123044
9919 133937 208471 -314126 -148752 519150 378527 -433710 440242 -126038 -513286 -170933
$$ packed form
9994d77020A36278d52070j5341a45000m28959D12905A35244K06774C1115L28738
9984C59853k5783d90361a09794C40671a14943j84101C69247f71121c4039e921
9973A9743e48961a32751A33834F2983c54645l2093A21399d22984a88913n94160
9963g83073K17300C5084b32495D63925b13014k65901a59247l7491N465J0265j71402
9952c52410B65107e34379C01971j34601p263g57326L58539i6855C57447e08308
9941C29801g44039B89199b33224B3827e50497b49835r30208a20020E7289c22907
9930B9859e06301C82885a65932A70061c53998d5216D57513f13888K84800A23044
9919A33937P4534c14126a48752E19150j40623d33710D40242a26038l87248a70933
$$ plain form
9908 -320645 -588992 472905 301057 -41099 -855261 14039 189617 -658104 294840 -252304
9897 -83526 574615 -609777 -545442 150402 -160469 -161383 -267830 19287 -327643 -207250 355972
9885 719671 -189296 -495729 -398618 -136663 260740 -183703 -265435 264471 431653 -497139
9874 -435949 -323429 -562850 -314764 178946 -280652 -176944 64417 32602 176584 -460734
9863 164129 -219179 -97271 97313 -544007 614261 -622876 -148690 175314 -115073 -784140
9853 -784140 134334 -93529 -360423 264133 -340836 -797369 70937 11589 -747854 -269449
9842 616783 -115917 416764 198320 -296188 -130693 148277 -999729 111750 -55536 -135598
9832 -135598 -98280 481381 -323322 -213375 -222 232015 420020 -735990 -589106 329068
$$ packed form
9908c20645k68347D72905j71848d1099q14162A4039J75578f58104B94840b52304
9897h3526E74615f09777O4335A50402a60469r14j06447A9287c27643J20393C55972
9885G19671a89296l06433R7111a36663B60740a83703q1732B64471J67182d97139
9874d35949J12520k39421K48086A78946b80652J03708F4417l1815J43982d60734
9863A64129b19179i7271I7313e44007F14261f22876a48690A75314a15073o69067
9853g84140A34334i3529k66894B64133c40836m56533G0937A1589g47854b69449
9842F16783a15917D16764A98320b96188a30693A48277i99729A11750e5536q0062
9832a35598L7318D81381c23322J09947b22B32015J88005g35990J46884C29068
$$ plain form
9821 -275586 -275165 45104 149945 -96415 -253135 -314174 395702 77915 -105895 -176303 -353627
9810 -353627 303008 551399 -88576 -55644 50287 411031 94560 -306123 -200068 422939
9799 -361910 149766 -253606 -642488 152315 -278423 -266386 -190437 -49118 -64497 145411
9788 203855 -212004 164882 94706 270879 -500402 -2132 37073 -135148 163717 -87019 -109282
9777 -109282 -334306 -926746 -115475 -421518 149380 76502 -604099 -700832 -112331 79722
9766 171256 -653590 -189124 -364224 175412 230982 -23021 284103 244060 -207210 -650132
9756 -650132 -140748 19895 199316 -121621 -25389 -852847 -79735 101196 -198962 -278092
9746 -278092 382491 -85266 -440043 202225 -456117 -161717 -42709 40032 -777641 -118514
$$ packed form
9821b75586M21D5104J04841i6415j56720o1039C95702G7915a05895p0408j77324
9810c53627C03008K48391h8576L2932E0287L60744I4560c06123J06055D22939
9799c61910A49766b53606l88882A52315b78423J2037P5949d9118j5379A45411
9788B03855b12004A64882p0176J76173e00402b132C7073a35148A63717h7019k2263
9777a09282k25024n92440a15475l06043A49380p2878f04099r6733a12331G9722
9766A71256f53590a89124j75100A75412N5570b3021B84103m0043b07210m42922
9756f50132a40748A9895J79421a21621b5389q27458g9735A01196a98962p9130
9746b78092C82491h5266l54777B02225d56117a61717d2709D0032g77641a18514
$$ plain form
9735 219274 -228831 -82148 60490 -29392 143664 -39035 18240 -399201 -391017 -441002 439957
9723 -550852 690752 -37092 -680358 -123349 -453089 -493088 -879837 -404216 118035 -281825
9712 -10383 3487 520335 -367812 -443268 -464966 -290442 -27397 -678000 -289855 -286384 -456520
9701 -456520 -166926 -13856 -176030 -82661 -374577 -9192 -447574 -187658 -503298 -265561
9691 -265561 284501 -341110 344603 -175455 -269298 30849 841036 -494654 -142879 -372881
9681 -372881 -164476 260016 -270786 -19760 -649593 -147303 -425373 -393133 -586063 -324262
9671 -324262 -625624 -433427 71603 -179347 -38794 93076 -236032 -430675 -432894 -54965 -197450
9660 -197450 696412 -399411 -288711 361450 77382 124373 -172120 38527 434855 -418219
$$ packed form
9735B19274b28831h2148F0490b9392A43664c9035A8240c99201Q184m9985D39957
9723e50852F90752c7092o43266a23349l29740l9999l86749d04216A18035b81825
9712a0383C487N16848c67812p5456k1698J74524b7397o50603b89855L471j70136
9701d56520a66926a3856j62174h2661k91916i192m38382a87658l15640K37737
9691b65561B84501c41110C44603a75455r3843C0849Q10187d94654a42879k30002
9681c72881a64476B60016b70786a9760o29833a47303k78070L2240j92930K61801
9671c24262l01362J92197G1603a79347c8794I3076b36032j94643k219e4965j42485
9660a97450F96412c99411J10700C61450G7382M6991a72120C8527L96328d18219
$$ plain form
9649 562294 -287444 293167 -278867 178074 -142536 224255 -25983 -263733 118214 198158
9639 198158 -46301 169011 -180812 -138272 -208817 98435 9554 -547866 -404267 -473143 548134
9627 -229433 -622063 -1113936 406810 417507 -357007 -126631 -195031 -188457 -203364 -19266 -83921
9616 -83921 -830727 114040 24304 525529 -881943 -279715 -95711 -249771 213850 -89190
9605 -210887 139476 -38934 -685105 -544386 -92579 -10453 -142448 -39074 -170578 204574
9594 -457871 -165695 -371262 -49077 353694 377000 -431868 399883 -506602 -178353 -733361
9584 -733361 44621 315247 60603 -431569 -584128 -245911 -174951 225265 -713917 -181820
9573 -375086 89679 -709406 93073 -102862 89374 -109258 -550748 -589164 -162609 409688
$$ packed form
9649E62294b87444B93167b78867A78074a42536B24255b5983k37750A18214P9944
9639A98158d6301A69011a80812M2540p0545I8435I554e47866J43599o8876E48134
9627b29433l92630m91873D06810J0697c57007a26631o8400O574j4907a9266o4655
9616h3921p46806A14040B4304N01225h81943b79715i5711j54060B13850h9190
9605b10887A39476c8934o46171J40719i2579a0453j31995c9074j31504B04574
9594d57871a65695k05567d9077C53694K3306d31868C99883e06602a78353n55008
9584g33361D4621K70626F0603d31569j52559b45911P0960B25265g13917a81820
9573c75086H9679g09406I3073a02862H9374a09258m41490l8416a62609D09688
$$ plain form
9562 233295 117939 140803 164407 -91408 -162145 -214406 -484397 222731 257675 -682417 -254637
9550 76221 182796 -592792 -111450 35543 -395155 18455 -536052 -351712 -464154 -206745
9539 -487043 82123 121147 322302 -11113 -425060 305837 -368174 81293 351741 123137
9528 -497351 129875 145751 196654 -115402 -226006 496858 -332145 -42355 -85396 461628
9517 -98204 150197 -397990 -179235 -212029 -42880 75181 112899 79475 -358336 92487 -506521
9505 -262396 -664118 -537658 195818 -395041 -532718 -291491 -271999 -806 -50697 -816768 -194758
9493 -66028 -318405 566795 -18674 -222883 138068 590303 675636 -17721 -518020 -111744
9482 504946 20883 -58718 178480 -269042 -154160 -1172631 -483684 277640 -10501 719131
$$ packed form
9562B33295j15356K2864K3604i1408p0737n2261k69991B22731L4944f82417b54637
9550G6221J06575e92792a11450C5543c95155A8455e36052J84340j12442b06745
9539d87043H2123L9024K01155a1113m13947C05837c68174H1293K70448A23137
9528d97351A29875J5876N0903a15402j10604D96858c32145d2355m3041D61628
9517i8204A50197c97990a79235l2794d2880G5181L7718l3424c58336I2487e06521
9505b62396m01722J26460A95818c95041j37677K41227J9492h06m9891p66071a94758
9493f6028k52377E66795a8674k04209A38068M52235Q5333a7721n00299a11744
9482E04946B0883e8718A78480b69042J14882j018471d83684B77640a0501G19131
$$ plain form
9471 621273 -318901 -264142 -301216 75320 -466260 422994 -539935 53131 -485036 -518805 228296
9459 245231 127877 -282195 -105441 -40277 8785 -536643 -405754 -16314 35905 -334560 395115
9447 -58639 -683401 301237 158328 -253814 -621585 50160 -328643 -41311 599877 -721622
9436 671474 -949013 -456488 178591 350885 -275230 198223 -664534 -206439 -493598 -381111
9426 -381111 -502489 -219471 -446904 125631 -130341 88660 -130646 214945 -3391 35632
9415 -406169 -708068 -149993 -388940 -133158 216768 -122845 325399 770830 -318776 -303146
9405 -303146 77927 351275 486072 303382 -412054 401115 -388722 -476201 -528497 -852812
9395 -852812 -905880 -131198 299548 -68240 202419 -201887 571893 -550587 22789 -217177
$$ packed form
9471F21273c18901N4759l7074G5320d66260D22994e39935E3131d85036l3769B28296
9459B45231j17354b82195a05441d0277H785e36643J30889a6314C5905c34560C95115
9447e8639o24762C01237j42909b53814l67771E0160c28643d1311E99877g21622
9436F71474i49013d56488A78591J72294b75230A98223f64534b06439k87159J12487
9426c81111j21378b19471k27433A25631a30341H8660a30646B14945c391C5632
9415d06169l01899a49993k38947a33158B16768a22845C25399M45431c18776J5630
9405c03146G7927K73348J34797j82690d12054D01115c88722q7479n2296l24315
9395h52812n3068a31198B99548f8240B02419b01887E71893e50587B2789b17177
$$ plain form
9384 13068 -353363 143857 -214379 -1017627 -529381 -514997 -518686 -344689 -238966 215323
9373 -214382 -9687 -102343 -569728 19911 -336782 38714 -325888 -999946 43631 -276989 -488787
9362 -488787 -251288 -200476 -463410 186117 -589298 -400750 76000 53899 -121081 96773
9351 -642703 538372 18520 -299708 201651 -449847 -79560 -181525 -48868 -74683 -198723
9341 -198723 -98841 31912 303069 238127 358433 -49594 -240629 110361 -280510 89244 -378687
9329 -656517 -2314 414829 -589648 -651597 71123 -584261 -207965 101465 -192413 -861484
9319 -861484 -78754 -120065 -467135 -199729 -71505 -337949 285720 88793 114956 358535 -162761
9307 22233 229719 -394955 273118 9697 243380 -656574 -547220 -700039 -183258 -434377
$$ packed form
9384A3068c53363A43857b14379q03248M88246J4384l689J73997J05723B15323
9373b14382i687r2656m67385A9911c36782C8714c25888o74058D3631b76989k11798
9362d88787K37499N0812k62934A86117e89298J88548G6000k2101a21081I6773
9351f42703E38372A8520b99708B01651d49847g9560j01965d8868k5815j24040
9341a98723i8841C1912K71157o4942J20306d9594j91035A10361b80510H9244c78687
9329f56517b314D14829e89648o1949G1123e84261b07965A01465a92413o69071
9319h61484g8754m1311l47070a99729g1505k66444B85720H8793K6163K43579a62761
9307B2233K07486c94955B73118I697K33683f56574J09354j52819a83258k51119
$$ plain form
9297 -434377 398967 155740 -615415 -460091 -386523 29418 -394085 452148 83908 -143349
9286 616994 454116 10482 -1951 -520324 -451084 -281896 -271403 -37014 33829 -364969 73450
9274 -287717 420166 -651672 -422280 99452 95310 101163 -745563 236386 -186875 -336686 -124838
9262 -875121 350011 374407 330379 -193318 -157237 104613 -324368 -43883 -761973 233283
9251 -503663 -479199 -80040 111097 -571574 -607511 -362930 -133301 -44502 -791182 -69944 173136
9239 -22291 -466687 52718 240184 -46432 -252784 -245934 -202871 -291727 -388040 -769998 -87940
9227 -1385 -18987 134507 -98920 -763285 -412220 126868 -494154 -26693 118755 308903 -652274
9215 -529755 -310356 370176 -488685 -364000 -633261 -33500 -149471 -212061 -239382 -200723
$$ packed form
9297d34377C98967A55740f15415J55324P3568B9418c94085D52148H3908a43349
9286F16994j62878A0482a951n18373O9240J69188J0493c7014C3829c64969G3450
9274b87717D20166f51672K29392I9452m142N853g45563B36386a86875j49811a24838
9262h75121C50011K4396m4028a93318L6081A04613c24368d3883p18090B33283
9251e03663K4464h0040A11097e71574l5937K44581a33301d4502p46680f9944A73136
9239b2291m44396E2718J87466d6432k06352O850M3063q8856r6313l81958h7940
9227a385j7602A34507i8920o64365L51065A26868d94154b6693A18755J90148f52274
9215e29755K19399C70176d88685J24685k69261c3500j15971o2590k7321L8659
$$ plain form
9205 -200723 -454133 -234144 -615666 -66961 -157173 93266 130198 245 -232472 -464038 -673580
9194 -673580 -79609 497769 -331172 -94494 374725 -502856 -78004 -471732 -304477 -17356
9183 -156380 21030 92033 -199877 18936 -238745 -230476 -154682 -399677 312160 33518 -75333
9171 484349 31133 -379886 158576 475149 -143570 -307634 -388653 191791 -253248 -174352
9161 -174352 -229522 -513863 341806 15384 -656660 -80729 -375006 -367331 414221 -247667 297220
9149 -534664 -24515 -199349 -519202 167013 -351711 357906 3598 -251231 -117500 -624932
9139 -624932 -44443 -449608 83435 -86926 36609 -62400 -73583 -263144 120429 -160509 -43067
9127 376853 -131011 480160 -38794 -183351 84382 -274068 -206892 777408 -253986 -372252
$$ packed form
9205b00723k53410K19989l81522f6961r0212I3266L6932B45b32472k31566k09542
9194f73580g9609D97769c31172i4494C74725e02856g8004l93728J67255a7356
9183a56380B1030P1003a99877A8936b38745Q269P5794k44995C12160C3518g5333
9171D84349C1133c79886A58576L16573a43570j64064q1019A91791b53248P8896
9161a74352n5170k84341C41806A5384f56660h0729k94277P675D14221b47667B97220
9149e34664b4515j74834l19853A67013c51711C57906C598b51231a17500n07432
9139f24932d4443m05165H3435h6926C6609f2400j1183j89561A20429a60509d3067
9127C76853a31011D80160c8794j44557H4382b74068O7176G77408b53986j18266
$$ plain form
9117 -372252 -544599 -515154 -473426 -459001 -410636 -383492 -419399 -132964 158132 -202861 54466
$$ packed form
9117c72252j72347K9445M1728J4425M8365K7144l5907a32964A58132b02861E4466
$$ [...]
##END NTUPLES=NMR SPECTRUM
##END=
