
##TITLE=AC1318_SSUAH12147_6608726_lk79rY1aOC
##JCAMPDX= 6.0         $$ Bruker NMR JCAMP-DX V2.0
##DATA TYPE= NMR SPECTRUM
##DATA CLASS= NTUPLES
##ORIGIN= BRUKER
##OWNER= Administrator
$$ 1.72 TOPSPIN		Version 2.1
$$ 2012-08-01 18:28:48.312 -0500  Administrator@TOPSPIN
$$ Compression mode = diff/dup
##.OBSERVE FREQUENCY= 400.02188249412
##.OBSERVE NUCLEUS= ^1H
##.ACQUISITION MODE= SIMULTANEOUS (DQD)
##.ACQUISITION SCHEME= undefined
##.AVERAGES= 8
##.DIGITISER RES= 22
##SPECTROMETER/DATA SYSTEM= spect
##.PULSE SEQUENCE= zg30
##.SOLVENT NAME= COFFEE_meoh
##.SHIFT REFERENCE= INTERNAL, COFFEE_meoh, 1, 14.98509
##AUDIT TRAIL= $$ (NUMBER, WHEN, WHO, WHERE, PROCESS, VERSION, WHAT)
$$ ##TITLE= Audit trail, TOPSPIN		Version 2.1
$$ ##JCAMPDX= 5.01
$$ ##ORIGIN= Bruker BioSpin GmbH
$$ ##OWNER= Administrator
$$ $$ C:\Bruker\TOPSPIN/data/COFFEE/nmr/AC1318_SSUAH12147_6608726_lk79rY1aOC/10/pdata/1/auditp.txt
$$ ##AUDIT TRAIL=  $$ (NUMBER, WHEN, WHO, WHERE, PROCESS, VERSION, WHAT)
(   1,<2012-08-01 18:28:41.031 -0500>,<Administrator>,<TOPSPIN>,<go>,<TOPSPIN 2.1>,
      <created by zg
	started at 2012-08-01 18:27:34.453 -0500,
	POWCHK enabled, PULCHK disabled,
       configuration hash MD5:
       6B 1B 68 BB D9 2E 58 E2 7F 35 AD 54 07 DF 0E 41
       data hash MD5: 64K
       9B 26 A8 94 48 DB A7 62 59 FB DF F7 90 AC 3C 07>)
(   2,<2012-08-01 18:28:43.828 -0500>,<Administrator>,<TOPSPIN>,<proc1d>,<TOPSPIN 2.1>,
      <Start of raw data processing
       efp LB = 0 FT_mod = 6 PKNL = 1 PHC0 = 0 PHC1 = 0 SI = 32K 
       data hash MD5: 32K
       A4 72 AA FE 16 ED 62 83 2B FD 03 62 81 20 26 8C>)
(   3,<2012-08-01 18:28:44.218 -0500>,<Administrator>,<TOPSPIN>,<proc1d>,<TOPSPIN 2.1>,
      <pk PHC0 = 176.0889 PHC1 = 0 
       data hash MD5: 32K
       57 BA BE 63 34 D4 5E E9 2B AC CD 69 CE 86 4F 28>)
(   4,<2012-08-01 18:28:44.328 -0500>,<Administrator>,<TOPSPIN>,<proc1d>,<TOPSPIN 2.1>,
      <abs ABSG = 1 
       data hash MD5: 32K
       E3 83 2D E7 A7 28 F8 60 E3 E5 E2 9C C8 BD 2E 0F>)
(   5,<2012-08-01 18:28:44.375 -0500>,<Administrator>,<TOPSPIN>,<proc1d>,<TOPSPIN 2.1>,
      <abs ABSG = 2 
       data hash MD5: 32K
       BE 16 D2 5D E5 F4 0E 7A 43 56 6E B9 FE 3B A4 69>)
(   6,<2012-08-01 18:28:44.421 -0500>,<Administrator>,<TOPSPIN>,<proc1d>,<TOPSPIN 2.1>,
      <abs ABSG = 3 
       data hash MD5: 32K
       9A 0D E7 F1 B2 EB 69 A4 58 5C 59 D9 A8 8D 60 E3>)
(   7,<2012-08-01 18:28:44.453 -0500>,<Administrator>,<TOPSPIN>,<proc1d>,<TOPSPIN 2.1>,
      <abs ABSG = 4 
       data hash MD5: 32K
       69 54 5A BF F7 58 47 DD 84 37 97 55 FE 48 D8 0D>)
(   8,<2012-08-01 18:28:44.484 -0500>,<Administrator>,<TOPSPIN>,<proc1d>,<TOPSPIN 2.1>,
      <abs ABSG = 5 
       data hash MD5: 32K
       EF 17 6E 29 22 04 31 9F 55 A7 4C 4E 1C 41 E6 C4>)
$$ ##END=
$$ 
$$ $$ hash MD5
$$ $$ D2 FA 72 8E 36 11 14 81 5A 68 E8 8C 5F 71 C5 FD
##$RELAX= 
##$RELAX= 
##$RELAX= 
##$RELAX= 
##$RELAX= 
##$RELAX= 
##$RELAX= 
$$ Bruker specific parameters
$$ --------------------------
$$ [...]
150 150 150 150 150 150 150 150
##$TP07= 0
##$TPNAME0= <>
##$TPNAME1= <>
##$TPNAME2= <>
##$TPNAME3= <>
##$TPNAME4= <>
##$TPNAME5= <>
##$TPNAME6= <>
##$TPNAME7= <>
##$TPOAL= (0..7)
0.5 0.5 0.5 0.5 0.5 0.5 0.5 0.5
##$TPOFFS= (0..7)
0 0 0 0 0 0 0 0
##$TUNHIN= 0
##$TUNHOUT= 0
##$TUNXOUT= 0
##$USERA1= <user>
##$USERA2= <user>
##$USERA3= <user>
##$USERA4= <user>
##$USERA5= <user>
##$V9= 5
##$VALIST= <valist>
##$VCLIST= <CCCCCCCCCCCCCCC>
##$VD= 0
##$VDLIST= <DDDDDDDDDDDDDDD>
##$VPLIST= <PPPPPPPPPPPPPPP>
##$VTLIST= <TTTTTTTTTTTTTTT>
##$WBST= 1024
##$WBSW= 4
##$XGAIN= (0..3)
0 0 0 0
##$XL= 0
##$YL= 0
##$YMAX_a= 476470
##$YMIN_a= -621367
##$ZGOPTNS= <>
##$ZL1= 120
##$ZL2= 120
##$ZL3= 120
##$ZL4= 120
##$ABSF1= 14.98509
##$ABSF2= -5.573092
##$ABSG= 5
##$ABSL= 3
##$ALPHA= 0
##$AQORDER= 0
##$ASSFAC= 0
##$ASSFACI= 0
##$ASSFACX= 0
##$ASSWID= 0
##$AUNMP= <proc_prof1d_extract_pilot.lims>
##$AXLEFT= 0
##$AXNAME= <>
##$AXNUC= <1H>
##$AXRIGHT= 0
##$AXTYPE= 0
##$AXUNIT= <>
##$AZFE= 0.1
##$AZFW= 0.1
##$BCFW= 0
##$BC_mod= 0
##$BYTORDP= 0
##$COROFFS= 0
##$CY= 15
##$DATMOD= 1
##$DC= 0
##$DFILT= <>
##$DTYPP= 0
##$F1P= 0
##$F2P= 0
##$FCOR= 0.5
##$FTSIZE= 32768
##$FT_mod= 6
##$GAMMA= 0
##$GB= 0
##$INTBC= 1
##$INTSCL= 1
##$ISEN= 128
##$LB= 0
##$LEV0= 0
##$LPBIN= 0
##$MAXI= 10000
##$MC2= 0
##$MEAN= 0
##$ME_mod= 0
##$MI= 0
##$NCOEF= 0
##$NC_proc= -8
##$NLEV= 6
##$NOISF1= 0
##$NOISF2= 0
##$NSP= 0
##$NTH_PI= 0
##$NZP= 0
##$OFFSET= 14.98509
##$PC= 1
##$PHC0= 176.0889
##$PHC1= 0
##$PH_mod= 1
##$PKNL= yes
##$PPARMOD= 0
##$PPDIAG= 0
##$PPIPTYP= 0
##$PPMPNUM= 2147483647
##$PPRESOL= 1
##$PSCAL= 4
##$PSIGN= 0
##$PYNMP= <proc.py>
##$REVERSE= no
##$SF= 400.02
##$SI= 32768
##$SIGF1= 0
##$SIGF2= 0
##$SINO= 400
##$SIOLD= 32768
##$SPECTYP= <>
##$SREGLST= <1H.CDCl3>
##$SSB= 0
##$STSI= 32768
##$STSR= 0
##$SW_p= 8223.68421052631
##$SYMM= 0
##$S_DEV= 0
##$TDeff= 65536
##$TDoff= 0
##$TI= <>
##$TILT= no
##$TM1= 0
##$TM2= 0
##$TOPLEV= 0
##$USERP1= <user>
##$USERP2= <user>
##$USERP3= <user>
##$USERP4= <user>
##$USERP5= <user>
##$WDW= 1
##$XDIM= 32768
##$YMAX_p= 463915359
##$YMIN_p= -695385
##$CURPLOT= <Network HP LaserJet P1505>
##$CURPRIN= <$Network HP LaserJet P1505>
##$DFORMAT= <normdp>
##$LAYOUT= <+/1D_H.xwp>
##$LFORMAT= <normlp>
##$PFORMAT= <normpl>
##$SURQMSG= 1
$$ End of Bruker specific parameters
$$ ---------------------------------
##NTUPLES= NMR SPECTRUM
##VAR_NAME=  FREQUENCY,     SPECTRUM/REAL,   SPECTRUM/IMAG
##SYMBOL=    X,             R,               I
##VAR_TYPE=  INDEPENDENT,   DEPENDENT,       DEPENDENT
##VAR_FORM=  AFFN,          ASDF,            ASDF
##VAR_DIM=   32768,         32768,           32768
##UNITS=     HZ,            ARBITRARY UNITS, ARBITRARY UNITS
##FACTOR=    0.250966925370066, 1,           1
##FIRST=     8223.43324360094, -51452,       -34734
##LAST=      0,             -29168,          -309044
##MIN=       0,             -695385,         0
##MAX=       8223.43324360094, 463915359,    0
$$ Real data points
##PAGE= N=1
##DATA TABLE= (X++(R..R)), XYDATA
$$ [...]
19496B50347G3509a27110H7508a16065J2527A02437b27207c6736b879m2115l0798
$$ 250347 73509 -127110 87508 -116065 -103538 102437 -227207 -36736 -2879 -44994 -75792
19485g5792j14833m7099n4284f3474b0089j26456r9966a08652j7592D1226M2621
$$ -75792 -190625 -237724 -292008 -63474 -20089 -146545 -246511 -108652 -126244 41226 83847
19474H3847d63850A68502b40799A7644O6488a39560k36086J60497j96438A0348
$$ 83847 -463850 168502 -240799 17644 84132 -139560 -375646 -215149 -411587 10348
19463b98758B97336a09490d1979A21623i5388j07533L4545q4991J00884b4972
$$ -298758 297336 -109490 -41979 121623 -95388 -202921 -168376 -253367 -152483 -24972
19452a8215k6403K1234J0191l64035a34680R239c0221N29k76299J48697k16043
$$ -18215 -44618 -23384 -13193 -377228 -134680 -125441 -30221 -29692 -305991 -157294 -373337
19441c73337C48398m1845b23779c8916j61044r7875B61104C3001a83432E7912
$$ -373337 348398 306553 -223779 -38916 -199960 -297835 261104 33001 -183432 57912
19430A70033a05250N1813J1955q8232k22483B63953c08283C02676a41345G3559
$$ 170033 -105250 -53437 -41482 -129714 -352197 263953 -308283 302676 -141345 73559
19419A50259n6393A3392i2206B6905a18490m713L8662L8800j72339L1676G0281
$$ 150259 93866 13392 -92206 26905 -118490 -123203 -84541 -45741 -218080 -186404 70281
19407b08730p9384M9762P0668c0912A3969d63254K17039J11189I6912c5592l9944
$$ -208730 -288114 -238352 -167684 -30912 13969 -463254 -246215 -135026 96912 -35592 -75536
19396g5536N638G759L8661d27904B35771J45293c8009k0794A50102k9379d06743
$$ -75536 -69898 7759 46420 -427904 235771 381064 -38009 -58803 150102 120723 -406743
19384c55882E7861b75677P5279A28640e7883K2633m2355F0695b73112G6640b73222
$$ -355882 57861 -275677 -200398 128640 -57883 -35250 -77605 60695 -273112 76640 -273222
19372b4768A02366b7563J2371l96577J64815A39446e496I6500j6405E159K26807
$$ -24768 102366 -27563 -15192 -411769 -246954 139446 -5496 96500 80095 5159 231966
19361B31966b40856B1689a34391A33941C2363a5843k54733A44818a08993k15003
$$ 231966 -240856 21689 -134391 133941 32363 -15843 -270576 144818 -108993 -323996
19351c23996C6360j6425c12139a37956A24212b54525G1138b07113A87188c01311
$$ -323996 36360 19935 -312139 -137956 124212 -254525 71138 -207113 187188 -301311
19340i8275C8694b44818a11201B5778Q346b60737k7694a07076A75214m0187O5218
$$ -98275 38694 -244818 -111201 25778 34124 -260737 -288431 -107076 175214 135027 200245
19329B00245m6181l1390L590c65649J47091c7319A3806J29724e5436j07085o2121
$$ 200245 154064 122674 126264 -365649 -218558 -37319 13806 143530 -55436 -162521 -224642
19318b24642R8336j02122e0087I2031c63236h8820g621k03012A80695m1819b17644
$$ -224642 -126306 -228428 -50087 92031 -363236 -88820 -7621 -210633 180695 138876 -217644
19306c46674M4069C06676e90201B280K64265r3419C2581c56285d4980k36855A77418
$$ -346674 -302605 306676 -590201 2280 266545 173126 32581 -356285 -44980 -281835 177418
19294G713a52109A52239c78597H9527d2209A02576b59815a10313m7473l3404E52387
$$ 7713 -152109 152239 -378597 89527 -42209 102576 -259815 -110313 -157786 -191190 552387
19282d3284k04037i6007o0339L8050j27526A478g6275b0971l3462m2531A30556
$$ -43284 -247321 -96007 -156346 -118296 -245822 1478 -76275 -20971 -54433 -96964 130556
19270b04846A51899j7431g4517A02152a99727j63627A87525c717A59300a49996
$$ -204846 151899 134468 -74517 102152 -199727 -363354 187525 -3717 159300 -149996
19259E9006J92442F4702l1653K5481a01359P480L3228k083j55172A35883a55296
$$ 59006 251448 64702 33049 58530 -101359 -93879 -60651 -62734 -217906 135883 -155296
19247a63458r0387j02207a40751k5684n323M4782j32567a3804k6587j63837A231
$$ -163458 -253845 -356052 -140751 -166435 -171758 -126976 -259543 -13804 -40391 -204228 1231
19235h7161B3901O1183c28495I1127a7849A35584c45571a35089n6548L3154H4627
$$ -87161 23901 85084 -328495 91127 -17849 135584 -345571 -135089 -191637 -158483 84627
19223f9211c98p9401L5728j28078e1110G352J39677a22335D6763b08397A40648
$$ -69211 -398 -79799 -44071 -172149 -51110 7352 147029 -122335 46763 -208397 140648
19211B44509i8920q3734m3105I4539L5921D7430f8211n6287G9121A7550c8220
$$ 244509 -98920 -182654 -225759 94539 130460 47430 -68211 -124498 79121 17550 -38220
19199H7954b51939A75152A6850a74771A16407J04973e2556k36989C1891J08988
$$ 87954 -251939 175152 16850 -174771 116407 221380 -52556 -289545 31891 140879
19189A40879c79145J7241a61984j3948A63393h3625A8532Q1764C8001j2829a33326
$$ 140879 -379145 -361904 -161984 -175932 163393 -83625 18532 100296 38001 25172 -133326
19177D9422b23210J5851j11997d6256j09210r6953e5958n1728B0257a51397j64857
$$ 49422 -223210 -207359 -319356 -46256 -155466 -252419 -55958 -107686 20257 -151397 -316254
19166c16254D2573A6468f6410b7093q7682C2783a19326k87190a81413A60437e2590
$$ -316254 42573 16468 -66410 -27093 -114775 32783 -119326 -406516 -181413 160437 -52590
19154B23995a74467B0117P1504l3325J60373a56645B48617a3369F5034J3487C6488
$$ 223995 -174467 20117 91621 58296 218669 -156645 248617 -13369 65034 78521 36488
19142a49833A03583C7644d99508g7A81587h1727p8559p3015P1542B76590a4409
$$ -149833 103583 37644 -499508 -77 181587 -81727 -160286 -233301 -161759 276590 -14409
19130A79300e4130l82844a29630M0193k42563b2161j0337k96003J45413A60596
$$ 179300 -54130 -436974 -129630 -89437 -332000 -22161 -32498 -328501 -183088 160596
19119c51057J56376B35224f061j27877B7580b31499J15048n4905C31134f2425
$$ -351057 -194681 235224 -6061 -133938 27580 -231499 -116451 -171356 331134 -62425
19108a0204B24064b31552B60893d4232n8198j31845J11350g673E2316a57110F8733
$$ -10204 224064 -231552 260893 -44232 -102430 -234275 -122925 -7673 52316 -157110 68733
19096F0042j4298Q3299b54730D2787J7236J88117l2375b19061H0121n606h6738
$$ 60042 45744 129043 -254730 42787 60023 248140 215765 -219061 80121 74515 -86738
19084a32917F6019B0169b30928A36432g2313A34398o2752q112g5977o7275G3495
$$ -132917 66019 20169 -230928 136432 -72313 134398 71646 63534 -75977 -143252 73495
19072a1438E3119Q4764B4316e7864k28421A52558a73527I3808c6483E3435e4021
$$ -11438 53119 137883 24316 -57864 -286285 152558 -173527 93808 -36483 53435 -54021
19060c557F7033j2830c17023h939j27022A77132G4941R5976F4190a5875o2247
$$ -3557 67033 54203 -317023 -8939 -135961 177132 74941 170917 64190 -15875 -78122
19049g8122j92813e7919A26810m8167a34444A74104g804D1443h6735j09478q3922
$$ -78122 -270935 -57919 126810 78643 -134444 174104 -7804 41443 -86735 -196213 -280135
19038b80135j02576a71303f4842k5698k60216I5039b03308Q490e2845j1685o4803
$$ -280135 -382711 -171303 -64842 -90540 -350756 95039 -203308 -194818 -52845 -64530 -129333
19027a29333E1273j022K83976B4525J63542q9569c47855d157B46940i7650F4031
$$ -129333 51273 50251 334227 24525 188067 98498 -347855 -4157 246940 -97650 64031
19015D2301J60676o3801b51209H9089A8785h7498L0885B1358M599H617R513a98953
$$ 42301 202977 139176 -251209 89089 18785 -87498 -56613 21358 25957 8617 18130 -198953
19002h1584B48026h8069C0383a73936D3536J00100f7328E3480J5003K22291b19608
$$ -81584 248026 -88069 30383 -173936 43536 143636 -67328 53480 68483 290774 -219608
18990C7457J28603c03522A19491B2572g9933E3799K05228c63759B54749j03405
$$ 37457 166060 -303522 119491 22572 -79933 53799 259027 -363759 254749 151344
18980A51344N1006j2112a15498A39419B2784c08328F9792b64063d1202A20915
$$ 151344 202350 190238 -115498 139419 22784 -308328 69792 -264063 -41202 120915
18969C82347K78717l5290r9013C3468a54065A17366C5303J09149n5837e947q1664
$$ 382347 661064 625774 526761 33468 -154065 117366 35303 144452 88615 -5947 -87611
18958h7611k11482M4638I7211a98236F448c34122f2843m35257i6029m7868j75929
$$ -87611 -299093 -254455 97211 -198236 6448 -334122 -62843 -498100 -96029 -143897 -319826
18947c19826J47548j4122j7847a2877H2103b57196A35390J19112B8335J86691
$$ -319826 -172278 -186400 -204247 -12877 82103 -257196 135390 254502 28335 215026
18937B15026p9627a66520e1008j38163G2671a58721k1406D0191h022k28715a8549
$$ 215026 135399 -166520 -51008 -189171 72671 -158721 -180127 40191 -8022 -236737 -18549
18925a41343O4062N444A34061e4889j26825h5317j52826D0430a96528d5106p8590
$$ -141343 -77281 -71837 134061 -54889 -181714 -85317 -238143 40430 -196528 -45106 -123696
18914a23696D2408J11381G1874L9253b5838A96638l6224m5913L58215K78851C42086
$$ -123696 42408 153789 71874 111127 -25838 196638 160414 114501 472716 751567 342086
18902h8790A58281a18967l7268E1303e87475B12108q9649e21442J11955h9991
$$ -88790 158281 -118967 -156235 51303 -587475 212108 122459 -521442 -409487 -89991
18891D375a18319A8696a39456q28d0687k6241a0150p2600l5048A1212J6535P954
$$ 4375 -118319 18696 -139456 -140284 -40687 -66928 -10150 -82750 -117798 11212 27747 35701
18879C5701b42136P5524j04979h3454j54954j14185J44126G6184c6915k3100l4234
$$ 35701 -242136 -166612 -271591 -83454 -238408 -352593 -208467 76184 -36915 -60015 -94249
18868i4249G7986i411k4497j08687E3016O9598a92973o7005e704n7283a5555n1509
$$ -94249 77986 -9411 -33908 -142595 53016 122614 -192973 -259978 -5704 -62987 -15555 -67064
18856f7064E9066a80383f7773A48514A7690a26367B1596O1824a04101A35734j1940
$$ -67064 59066 -180383 -67773 148514 17690 -126367 21596 83420 -104101 135734 123794
18845A23794d9567k77158d9112j35720C6702c0857m57225B48490C2248g2738C3601
$$ 123794 -49567 -326725 -49112 -184832 36702 -30857 -488082 248490 32248 -72738 33601
18833I9504C4586J47073a41398j6598q3988D7999a63018j6590F9120b3766j84023
$$ 99504 34586 181659 -141398 -157996 -241984 47999 -163018 -179608 69120 -23766 -207789
18822b07789P8097b7189l02940J5898D8674a29874I5200l9309J10236l4491a01035
$$ -207789 -129692 -27189 -330129 -314231 48674 -129874 95200 55891 166127 131636 -101035
18810e6569G6069k5706R0581D1524i0740D04156a48163A14824a65472d5694A28053
$$ -56569 76069 50363 140944 41524 -90740 404156 -148163 114824 -165472 -45694 128053
18798d5995A69111H2223a80526A64860c23016A005M3610c40821k31800B997f6105
$$ -45995 169111 82223 -180526 164860 -323016 1005 44615 -340821 -572621 2997 -66105
18786a48933b3270k17520K3495R0874A10623a48069A12069f03509a52906N3672
$$ -148933 -23270 -240790 -217295 -126421 110623 -148069 112069 -603509 -152906 -99234
18776i9234j72655a24210j16262j6762h9219B07799b18897i5170b0915m7328R688
$$ -99234 -271889 -124210 -240472 -257234 -89219 207799 -218897 -95170 -20915 -68243 -58555
18765e8555k8913n5901O4567j87009c9674m28972b06008b7268E2210a10414A101
$$ -58555 -87468 -143369 -78802 -265811 -39674 -468646 -206008 -27268 52210 -110414 1101
18753c97475f6076B030b3519l1489F8521a07642j57456J11585k18830Q9835A94184
$$ -397475 -66076 2030 -23519 -55008 68521 -107642 -265098 -153513 -372343 -282508 194184
18741a07370F7238J1600i2021K6477r4669j5651F9792j307i4203j77125c0014
$$ -107370 67238 78838 -92021 -65544 -160213 -175864 69792 68485 -94203 -271328 -30014
18729b1914I1113K04119a12536J4481A09252a24674A05530c09684D81a81974G3039
$$ -21914 91113 295232 -112536 -98055 109252 -124674 105530 -309684 481 -181974 73039
18717a72914A81480F5304i6434n9994A7046f1550A20677c11390a54215q3663j73901
$$ -172914 181480 65304 -96434 -156428 17046 -61550 120677 -311390 -154215 -237878 -411779
18706d11779e4899C5918a23094m04311a59685G4640R4286b5087F1119f3240l608
$$ -411779 -54899 35918 -123094 -527405 -159685 74640 168926 -25087 61119 -63240 -66848
18695f6848A37061a71149j14980I9649K78305i5643a9033l2908o3140A47244a96857
$$ -66848 137061 -171149 -286129 99649 377954 -95643 -19033 -51941 -115081 147244 -196857
18683a23110j41234a29672N9999j53225o2947D3587c9367p4772b5628i13p4793
$$ -123110 -264344 -129672 -69673 -222898 -285845 43587 -39367 -114139 -25628 -913 -75706
18672g5706j40814b5048j93786F7737J03823i3222r4889L0122A07081c25640J46355
$$ -75706 -216520 -25048 -218834 67737 171560 -93222 -188111 -157989 107081 -325640 -179285
18661a79285j06005g0558b4719k9412k4089H3604l1245a861j61398l2040A35132
$$ -179285 -285290 -70558 -24719 -54131 -78220 83604 52359 -1861 -163259 -195299 135132
18649a42555A77298a38407F8985e9040G6261b10536l9379B99749j06355L1920
$$ -142555 177298 -138407 68985 -59040 76261 -210536 -249915 299749 193394 225314
18639B25314r8560b06470F6186J82539c25001c3816D7086J9752d9759E2609k2424
$$ 225314 126754 -206470 66186 248725 -325001 -33816 47086 66838 -49759 52609 30185
18628C0185a52871c9297D6763a87212A83346K9155N7232b7471j27866A73472a8496
$$ 30185 -152871 -39297 46763 -187212 183346 212501 269733 -27471 -155337 173472 -18496
18616A05907J10335c69411Q2204i5705k45608m7205C036K9340a3892o3443j49662
$$ 105907 216242 -369411 -287207 -95705 -341313 -388518 3036 32376 -13892 -77335 -226997
18605b26997F699J72181C6903b6340j36037B4263h1231j6878j11694i2117D3112
$$ -226997 6699 178880 36903 -26340 -162377 24263 -81231 -98109 -209803 -92117 43112
18593a83324h4078k13704E9925L8887A8827d47456g4715l18387j7137j31885A50464
$$ -183324 -84078 -297782 59925 98812 18827 -447456 -74715 -393102 -410239 -542124 150464
18581b12537M7362A47040a63014H905R1372l998a10525q5777D6363a54692E4540
$$ -212537 -165175 147040 -163014 8905 100277 96279 -110525 -196302 46363 -154692 54540
18569B41304F8208K42596a09333n7863A02653a9473l96154a6449A53252B02J02585
$$ 241304 68208 310804 -109333 -167196 102653 -19473 -415627 -16449 153252 202 102787
18558A02787m7574L13036A20356h5279r821D62923j27625a8109o5425E8809g0812
$$ 102787 55213 368249 120356 -85279 -95100 462923 335298 -18109 -83534 58809 -70812
18546a28084k60764J30465P8594k9982p1040A87436n974a01094A933R5502b53452
$$ -128084 -388848 -258383 -179789 -209771 -280811 187436 181462 -101094 1933 97435 -253452
18534A37621a00998m7240A25458k9321a41027D1038J65446a93792B9890f5596
$$ 137621 -100998 -148238 125458 96137 -141027 41038 206484 -193792 29890 -65596
18523A13962a25503A39749i4419b2141J0226j94641j78714F6035h2905C92164
$$ 113962 -125503 139749 -94419 -22141 -11915 -206556 -385270 66035 -82905 392164
18512b2385H1276B184J94489c15232J16251Q4654G8631f0915q3625o6855A71542
$$ -22385 81276 2184 196673 -315232 -198981 -114327 78631 -60915 -144540 -211395 171542
18500d5053C54919f4091a8186E0642c03138B02841a79637k42971B62340B7731
$$ -45053 354919 -64091 -18186 50642 -303138 202841 -179637 -422608 262340 27731
18489c61200H2345a47999c3314j47833c5950J2152A30077d9531D9751J82876a6024
$$ -361200 82345 -147999 -33314 -181147 -35950 -23798 130077 -49531 49751 232627 -16024
18477d26411a37714G9671a78860o6557l7481A60934C9057P55a13196C2808J56085
$$ -426411 -137714 79671 -178860 -245417 -282898 160934 39057 39812 -113196 32808 188893
18466A88893e1823j61058A24517a03661k16307b7261B89921A02244j2662R136
$$ 188893 -51823 -212881 124517 -103661 -319968 -27261 289921 102244 89582 98718
18456I8718e0850l90903A22285a2584j55870l3303e9131j30746f1354A92079b30216
$$ 98718 -50850 -441753 122285 -12584 -168454 -201757 -59131 -189877 -61354 192079 -230216
18444c02601B238a58299E7684a66075k27004Q0172a37476J5102l18955a48007
$$ -302601 2238 -158299 57684 -166075 -393079 -312907 -137476 -122374 -441329 -148007
18433f3889j57906c1472A34392b21755a1540p8655j30822i7806j12578b438A9771
$$ -63889 -221795 -31472 134392 -221755 -11540 -90195 -221017 -97806 -210384 -2438 19771
18421D463h1277A1128d0065q0064g975k66637a25274k9614j56346g1118B61867
$$ 4463 -81277 11128 -40065 -120129 -7975 -274612 -125274 -154888 -311234 -71118 261867
18409D66005A157b31845N2104C39799c1659G4987J341a43242C73510j49420D9871
$$ 466005 1157 -231845 -179741 339799 -31659 74987 76328 -143242 373510 224090 49871
18397A75457b69599B25747j10915B1267a65798N2847d4340k2796j25675L9080
$$ 175457 -269599 225747 114832 21267 -165798 -112951 -44340 -67136 -192811 -153731
18387a53731h279A31472d21502a40713A70875a03724n4680F6816b67198J15770
$$ -153731 -8279 131472 -421502 -140713 170875 -103724 -158404 66816 -267198 -151428
18377a51428j59174J32750p6096i5630k48666C11440b31088l5474B13583H486
$$ -151428 -310602 -177852 -253948 -95630 -344296 311440 -231088 -266562 213583 8486
18366A82878P3023h0460G4288q467e6352a9187A53835c41719H0005J37954k3138
$$ 182878 255901 -80460 74288 65821 -56352 -19187 153835 -341719 80005 217959 194821
18355A94821f1904B29214a28499B19203a36572a591j95516J6593n4482L0774d3503
$$ 194821 -61904 229214 -128499 219203 -136572 -1591 -197107 -180514 -234996 -204222 -43503
18343C9932c30806A30242a54555L1578e8169A1373K53175b21261d3580A27096
$$ 39932 -330806 130242 -154555 -122977 -58169 11373 264548 -221261 -43580 127096
18332c17791H976Q4911a44525J2821B4677a62539B11947j05602L0520J2830a13552
$$ -317791 8976 93887 -144525 -131704 24677 -162539 211947 106345 136865 149695 -113552
18320A4610c01866A95700a56522e0481I657c9035k4418q0681B38690E7125B7253
$$ 14610 -301866 195700 -156522 -50481 9657 -39035 -63453 -144134 238690 57125 27253
18308A08338d3493l81121E9949c82424g05k01053N4628k0018P1207j53454B70959
$$ 108338 -43493 -424614 59949 -382424 -705 -201758 -147130 -167148 -95941 -249395 270959
18296h9428J3999B93945d0508C9432b83071k922B1795a14049n6057A94751q1240
$$ -89428 -75429 293945 -40508 39432 -283071 -285993 21795 -114049 -170106 194751 113511
18285A13511L34540a22915A40100g6696l7003n7805H4147a59222q3549P2034k07840
$$ 113511 448051 -122915 140100 -76696 -113699 -171504 84147 -159222 -242771 -170737 -378577
18274c78577J81966B03132J4632a5750m7092n31194C58244h2035n6366B16326
$$ -378577 -196611 203132 217764 -15750 -62842 -594036 358244 -82035 -138401 216326
18263a887m2431k8140l745C4616M1531a40413l21290I3433C243a8380I2344M2977
$$ -1887 -44318 -72458 -76203 34616 76147 -140413 -461703 93433 3243 -18380 92344 135321
18251A35321P3636h0780n5386A17940c930q1456q6654b0954D4829Q2851a34406
$$ 135321 208957 -80780 -136166 117940 -3930 -85386 -172040 -20954 44829 127680 -134406
18239a94524h0908n862L3889K2346J4271H475J24963C8945J98500B3869L37971
$$ -194524 -80908 -86770 -52881 -30535 -16264 8475 133438 38945 237445 23869 361840
18228C61840A40627G069K18801a26386I0432a12174H421b01825A03331b0560A09826
$$ 361840 140627 7069 225870 -126386 90432 -112174 8421 -201825 103331 -20560 109826
18216A71002q2406a1947B48135f7832j97871H8320c87090D02180A07154e3156
$$ 171002 88596 -11947 248135 -67832 -265703 88320 -387090 402180 107154 -53156
18205A42527f3110k8134A1009J1241D868a46415j93583M8877i6050F8828g7156
$$ 142527 -63110 -91244 11009 22250 4868 -146415 -339998 -291121 -96050 68828 -77156
18193B5932a98527h3769K4884E533a56556P4231A57795a89712A16048J66447a10634
$$ 25932 -198527 -83769 -58885 5533 -156556 -82325 157795 -189712 116048 282495 -110634
18181A51004L4702P830F7626b66557E9212b94776C66152a35229A15077b83978
$$ 151004 185706 193536 67626 -266557 59212 -294776 366152 -135229 115077 -283978
18170B4319L6747h5848c0744k2244c865j68985J303J0629g1300D6569K30491a90006
$$ 24319 61066 -85848 -30744 -52988 -3865 -172850 -171547 -160918 -71300 46569 277060 -190006
18157A32767a751j1452B43666c8834j12670k15098d5512F3338N6539Q9419b29119
$$ 132767 -1751 -13203 243666 -38834 -151504 -366602 -45512 63338 119877 209296 -229119
18145D9384K1851b2883j59100D0203c29580J42832k88649a84349o6827A2853a36765
$$ 49384 71235 -22883 -181983 40203 -329580 -186748 -475397 -184349 -251176 12853 -136765
18133F9625g6170I432c02530C049b8861j19029G697a41625a7198F9924g4520A00571
$$ 69625 -76170 9432 -302530 3049 -28861 -147890 7697 -141625 -17198 69924 -74520 100571
18120A71734J36281b23954J03980c8150k03617B09671J7198b6372l75539A40893
$$ 171734 308015 -223954 -119974 -38150 -241767 209671 226869 -26372 -401911 140893
18109A77811c8385O246C2731a62958A28489n8441b69868A7072Q2232J50223c203
$$ 177811 -38385 -32139 32731 -162958 128489 70048 -269868 17072 99304 249527 -3203
18097E2959a2033A69535m4289K2713M4819i2149C1485M6062a9087H6517a4617
$$ 52959 -12033 169535 125246 147959 192778 -92149 31485 77547 -19087 86517 -14617
18085a61099r0589i6965A18254m9840m837k6341a60909E6907K9470b7996o9746
$$ -161099 -251688 -96965 118254 68414 63577 37236 -160909 56907 86377 -27996 -97742
18074i7742A70228o8933J23657n9178k0992n2932a62982A84696c6545B30521D4540
$$ -97742 170228 101295 224952 165774 144782 91850 -162982 184696 -36545 230521 44540
18062a42887o2566B73026q9457a02913F2086P7889c65240J81216e3538I5452J28812
$$ -142887 -205453 273026 183569 -102913 62086 139975 -365240 -184024 -53538 95452 224264
18051B24264b47710Q8417p4857g0603j75905C8339b60363R0146g1406b2793F73
$$ 224264 -247710 -159293 -234150 -70603 -246508 38339 -260363 -170217 -71406 -22793 673
18039h2460D8955M1967b45903A10260a95258G4320f0081a7004j56563g2365c3895
$$ -82460 48955 90922 -245903 110260 -195258 74320 -60081 -17004 -173567 -72365 -33895
18027a67573I1430N9726b95706H497c8670A09158k7474C7163c48260D05388j24222
$$ -167573 91430 151156 -295706 8497 -38670 109158 81684 37163 -348260 405388 281166
18016B81166a32667E4170a59412B3408f327m9431k33672f092C6933N8866b98479
$$ 281166 -132667 54170 -159412 23408 -6327 -55758 -289430 -6092 36933 95799 -298479
18004d2571B2827R0349D6106a25130e8973g172E3012b4686m0896A65388F0925
$$ -42571 22827 113176 46106 -125130 -58973 -7172 53012 -24686 -65582 165388 60925
17992A37688b10127C31462c87726D04769j87951b55134a06085I5047R7906G5921
$$ 137688 -210127 331462 -387726 404769 216818 -255134 -106085 95047 192953 75921
17981C7546L79781l3237j47423c04785c1100C2045g4428l3150J3712m5426b7739
$$ 37546 417327 384090 236667 -304785 -31100 32045 -74428 -107578 -93866 -139292 -27739
17969A2219R493b7860F89P6242A7271J97232o0907d3852A27484D3393K20369m3792
$$ 12219 21712 -27860 689 76931 17271 214503 153596 -43852 127484 43393 263762 219970
17957B19970q0607c68372a34900d215j20570D9700R776a37157B4431J78515H8440
$$ 219970 139363 -368372 -134900 -4215 -124785 49700 59476 -137157 24431 202946 88440
17945a59917b7589B76233f3732b4324A79012m7658E3569a06085C54024E2800K1945
$$ -159917 -27589 276233 -63732 -24324 179012 131354 53569 -106085 354024 52800 74745
17934G4745p531C1114a44790A88020a43245E128R2163c4822k0338D33318i4626
$$ 74745 67214 31114 -144790 188020 -143245 5128 97291 -34822 -55160 433318 -94626
17922e0648o7816B42502N6481G1671J63835k5696l0185g8058j67030H0763J95130
$$ -50648 -118464 242502 298983 71671 235506 209810 179625 -78058 -245088 80763 275893
17911B75893a68606N6227c2727n128C8647N2987J28684p4980d9832p2523c2118
$$ 275893 -168606 -112379 -32727 -37855 38647 91634 220318 145338 -49832 -122355 -32118
17899C07853J08966a9224l6134m7643C2243J61511j9754i9749a3254A14176J46035
$$ 307853 416819 -19224 -55358 -103001 32243 193754 174000 -99749 -13254 114176 260211
17888B60211b13762L8983O7619A08731h9524j67887d8574A32333J18434E4073
$$ 260211 -213762 -174779 -107160 108731 -89524 -257411 -48574 132333 250767 54073
17877A55104A3669N3148K59101D5341e9102J3246A28516a02099B30128a53268
$$ 155104 13669 66817 325918 45341 -59102 -45856 128516 -102099 230128 -153268
17866A0130h2316I4293B0940c12019I3863J37368a71960k8870E5126c1437B17474
$$ 10130 -82316 94293 20940 -312019 93863 231231 -171960 -200830 55126 -31437 217474
17854D6690g7899j14675A21394n446b05565B67404r7003K3776r593m1889d30282
$$ 46690 -77899 -192574 121394 115948 -205565 267404 170401 194177 184584 142695 -430282
17842a37668C7715a87982F9986K85230j30000n3926K05202a77800H1172J42651
$$ -137668 37715 -187982 69986 355216 225216 171290 376492 -177800 81172 223823
17832B23823a4863k3368C49078E7448a76554g1483B90097r8807o4520J75885e4839
$$ 223823 -14863 -38231 349078 57448 -176554 -71483 290097 191290 126770 302655 -54839
17820A22943A9305M15900b14533J6989Q6512j36609A21835J07292I9858f2547
$$ 122943 19305 435205 -214533 -197544 -111032 -247641 121835 229127 99858 -62547
17809B24878G4295C6219i5656B66449o7399b55385B87031G6581b47870A09797
$$ 224878 74295 36219 -95656 266449 199050 -255385 287031 76581 -247870 109797
17798F11J21610P694R7704a77946I5900a84153B31310E9466K77537h468F2683
$$ 611 122221 129915 227619 -177946 95900 -184153 231310 59466 337003 -8468 62683
17786a02739I1043J00776k1945m1524e1978l1916R907C5947J25583B6164b3007
$$ -102739 91043 191819 169874 128350 -51978 -83894 -73987 35947 161530 26164 -23007
17774a15421N45A7437R4180M02304i3223A64088f3209i357A32592E8115e2559
$$ -115421 -114876 17437 111617 513921 -93223 164088 -63209 -9357 132592 58115 -52559
17762B73679L7134j53333m2658n3910K19869j01237l0916b38542i3352A21383
$$ 273679 310813 157480 114822 60912 280781 179544 148628 -238542 -93352 121383
17751b11661K8194B56495J21581j74832a88655A56310C5759L37087F4478h66j41081
$$ -211661 -183467 256495 378076 203244 -188655 156310 35759 372846 64478 -866 -141947
17740a41947B396L7378J255L07298G7860J35892b65965C55176A51527m0251k3449
$$ -141947 2396 39774 41029 348327 77860 213752 -265965 355176 151527 111276 87827
17729H7827c594A61340e7489m5513M8818A00485J61557j01378Q3568J38801f1093
$$ 87827 -3594 161340 -57489 -103002 -54184 100485 262042 160664 244232 383033 -61093
17717e6452D6253J33441i7897j38679B6106a7837p3432M1639D4608N3839f4598
$$ -56452 46253 179694 -97897 -236576 26106 -17837 -91269 -49630 44608 98447 -64598
17705A06984b90191A60443a0219E7895K53322a02363B23572G6108L32038F7493
$$ 106984 -290191 160443 -10219 57895 311217 -102363 223572 76108 408146 67493
17694B72007A02036J07705F2506h1080J0126K1416B61810i5845p5568A98334E7270
$$ 272007 102036 209741 62506 -81080 -70954 -49538 261810 -95845 -171413 198334 57270
17682A56017J71641C6076J47359r47j4436l3356h4947B13875a97556A30668c67663
$$ 156017 327658 36076 183435 182488 168052 134696 -84947 213875 -197556 130668 -367663
17670A83184q2671J20578n953J21103p7617j03435e0266C27983j44457F7559K18518
$$ 183184 100513 221091 215138 336241 258624 155189 -50266 327983 183526 67559 286077
17659B86077a38571B60648r4547g5770D1034J33860g9840B51245A15379L66628
$$ 286077 -138571 260648 166101 -75770 41034 174894 -79840 251245 115379 482007
17649D82007g9433A16678E7156a78570B56012N90A26900K43207j30717p8571N9234
$$ 482007 -79433 116678 57156 -178570 256012 256602 126900 370107 239390 160819 220053
17638B20053I0598J16379H9759C6848J13485b19287A7733J92377e9280E7391K54212
$$ 220053 90598 206977 89759 36848 150333 -219287 17733 210110 -59280 57391 311603
17627C11603L2074j66640R8058H5407B1893K56402L7181I3393k8060i9560C94559
$$ 311603 343677 177037 275095 85407 21893 278295 315476 93393 65333 -99560 394559
17615B47591a61294L780n150g982j29761B31296L1491J39481A47908o232K07865
$$ 247591 -161294 -157514 -162664 -7982 -137743 231296 262787 402268 147908 141676 349541
17604C49541a2742D4888b489B98323a12369N0568D7722e4939A13384D4064K08186
$$ 349541 -12742 44888 -2489 298323 -112369 -61801 47722 -54939 113384 44064 252250
17593B52250K07460f0260b0213B20295a4929C60684j76813K11576F6201L70001
$$ 252250 459710 -60260 -20213 220295 -14929 360684 183871 395447 66201 436202
17583D36202H9539K39621j39756N4835b8622E1608e4700J7660C81102I3203c1090
$$ 436202 89539 329160 189404 244239 -28622 51608 -54700 -37040 381102 93203 -31090
17571d3565D91920c9828B71171A35574a59491H392M12245b27711Q8958D2533K62565
$$ -43565 491920 -39828 271171 135574 -159491 8392 420637 -227711 -138753 42533 305098
17560C05098f8510B93542o4183b59056A47828O8096G3489J16954N5158l540G5707
$$ 305098 -68510 293542 229359 -259056 147828 215924 73489 190443 245601 242061 75707
17548A63077O0936n0112K62062j61618Q8699J15436I1940J89100a64222C68234
$$ 163077 224013 173901 435963 274345 363044 478480 91940 281040 -164222 368234
17537C25143k9533l8264J03133j06317J2405j22014P1393K40070r771A90094N90313
$$ 325143 295610 257346 360479 254162 266567 144553 215946 456016 446245 190094 780407
17526G80407n101j1353K38926L2854m5956J48346k50427l2375B24211J46266L9494
$$ 780407 775306 763953 1002879 1035733 989777 1138123 887696 855321 224211 370477 409971
17515D09971n2659J18427j51935M94447o7189O5514N00811n02591J47715l4666
$$ 409971 357312 475739 323804 818251 751062 816576 1317387 814796 962511 927845
17505I27845k04636M2144A92087M2775L22906k74658r6151J07400A01163Q2353
$$ 927845 723209 765353 192087 234862 557768 283110 186959 294359 101163 183516
17495A83516J13858A05098O2013L6261P267J54894M1885A49936o4690M03583a00586
$$ 183516 297374 105098 167111 203372 210639 365533 407418 149936 85246 488829 -100586
17483D6284j5954L97556j2319A54034J28438a4679B70180A13791R8439O4570K8223
$$ 46284 30330 427886 415567 154034 282472 -14679 270180 113791 212230 276800 305023
17472C05023N22R0806j17195J00147A79356G0620a42686A96782K26834m7134A42976
$$ 305023 305545 396351 279156 379303 179356 70620 -142686 196782 423616 376482 142976
17460A44562J65883F4930i2119I5368J83162M1984k9348n9502J10487L1877A62369
$$ 144562 310445 64930 -92119 95368 278530 320514 291166 231664 342151 374028 162369
17448A71820J57078K2889l5383J77558L45160I2945J33724C8919N67332j01416
$$ 171820 328898 351787 316404 493962 839122 92945 226669 38919 606251 504835
17438E04835Q9390j42986j77414J9819N9242q4935A21188L63837B40039L50909
$$ 504835 594225 451239 273825 293644 352886 267951 121188 485025 240039 590948
17428E90948A6379J07281O3563R0764J29282p7189J22493R1157B26121J66837
$$ 590948 16379 123660 187223 277987 407269 330080 452573 543730 226121 392958
17418C92958Q9254m5132K39931A14886N26321k98481K8871N9312E2346K04261
$$ 392958 482212 437080 677011 114886 641207 342726 371597 430909 52346 256607
17408B56607L1246q2372J83158e1677A23022q752b320D61302r2087E4177L80278
$$ 256607 287853 205481 388639 -51677 123022 114270 -2320 461302 369215 54177 434455
17397D34455A82152K14482K09851A84867K5232R8774l451A29394L62676B00480
$$ 434455 182152 396634 606485 184867 210099 308873 305422 129394 492070 200480
17386D29045j00291o4279p1442N5223j19395L40242A09778L40715c9607B40849
$$ 429045 328754 264475 193033 248256 128861 469103 109778 450493 -39607 240849
17375C34161N3141A1751K2603K09665J20931K21403A16588J94590P3577A16884
$$ 334161 387302 11751 34354 244019 364950 586353 116588 311178 384755 116884
17364C5763b1806C05902J31308K24891l10973r1698P7633f6142B50834e3539A00122
$$ 35763 -21806 305902 437210 662101 351128 259430 337063 -66142 250834 -53539 100122
17352E33667A65722K92339j96624d2703E61816c4952A73632J05194G1609R5821
$$ 533667 165722 458061 261437 -42703 561816 -34952 173632 278826 71609 167430
17342A67430o1967J27007J43174l3871O3966A56342J04299M23076B67489O0419
$$ 167430 105463 232470 375644 341773 405739 156342 260641 683717 267489 327908
17332C27908A21068R2972G3138K97232j08095J25213K88873A41626K53073A06926
$$ 327908 121068 214040 73138 370370 262275 387488 676361 141626 394699 106926
17321F23977B10907J08193l1342J8614J17624B2865N38943B20633J36843p8948
$$ 623977 210907 319100 287758 306372 423996 22865 561808 220633 357476 278528
17311B78528J8371L5042A34053k073N5786J09264l2465q4465L3962K51699O5772
$$ 278528 296899 331941 134053 131980 187766 297030 264565 180100 214062 465761 531533
17300E31533q0365B05664D157M80077P1242A89862K33223A5566J63658M53905
$$ 531533 451168 205664 4157 484234 555476 189862 423085 15566 179224 633129
17290F33129B52967j24672K90099J05270B56854K6477J88241A82743J47262A23501
$$ 633129 252967 128295 418394 523664 256854 283331 471572 182743 330005 123501
17279E13490j74780J02078j00797N8978j68640H4512L12660r5422e906B11051
$$ 513490 338710 440788 339991 398969 230329 84512 397172 301750 -5906 211051
17268E10343f814D36257l3394j09208R6111A41023J82062K32286j52058j34459
$$ 510343 -6814 436257 402863 293655 389766 141023 323085 555371 403313 268854
17258B68854K06899A43229N4306K1231I6506L2784N27018B53960K33793a27784
$$ 268854 475753 143229 197535 218766 96506 129290 656308 253960 487753 -127784
17247B73193j4177k162M07393C09579J99247j67931K40982j11906J00886A86075
$$ 273193 259016 256854 664247 309579 508826 340895 581877 469971 570857 186075
17236A72503M2175r0112L40205A23410Q1632P3183j37394L59837P5690J76022
$$ 172503 214678 124566 464771 123410 205042 278225 140831 500668 576358 752380
17226G52380B11464q2074N44922A81580j6208K28856j25746J93989k243l3596
$$ 752380 211464 129390 674312 181580 165372 394228 268482 462471 460228 426632
17216D26632q1703j6562J65190k16292J46405J91555k11231F6899M81782j32822
$$ 426632 344929 328367 493557 277265 423670 615225 403994 66899 548681 415859
17206D15859J04737n9328A65476L08904L5913k48945K44676k13704L94108C11836
$$ 415859 520596 461268 165476 474380 510293 261348 506024 292320 686428 311836
17195F27598j57642O1225B59494K97755n7923L1905k00499J19666J82029A35798
$$ 627598 469956 531181 259494 557249 499326 531231 330732 450398 632427 135798
17184D40468p0989j84342N8137M27875N4566j2266C15138K4747L27191j93918
$$ 440468 369479 185137 243274 671149 725715 713449 315138 339885 667076 473158
17174D73158J30496o1574r1676K76400l42764j76276K24693K87454k90852l5731
$$ 473158 603654 542080 450404 726804 384040 207764 432457 719911 429059 393328
17164C93328J60526J32711k74088K3122q0872M96336j98376j71184K0380k28724
$$ 393328 553854 686565 412477 435599 354727 851063 652687 481503 501883 273159
17154B73159M33696n3723k17968K33277j24591J18753j20552L3305A56163J90490
$$ 273159 706855 653132 435164 668441 543850 662603 542051 575356 156163 346653
17144C46653K16925k32738K95471J2498K4419C25743J41585m0477J94136k34048
$$ 346653 563578 330840 626311 638809 663228 325743 467328 426851 620987 386939
17134C86939J66394r5635J15609N2004k07848L25908k75784R0159J15907j73676
$$ 386939 553333 457698 573307 625311 417463 743371 467587 557746 673653 499977
17124D99977J90127q5375m342J99179j57299p16l13468L48878Q7614j76905k8655
$$ 499977 690104 604729 600387 799566 642267 641551 328083 676961 764575 587670 559015
17113E59015n0749J32618J04332Q12l02448L06989j44594J3214j97753L61597
$$ 559015 508266 640884 745216 746028 443580 750569 605975 619189 421436 783033
17103G83033N2444j89360P7993k61014R8701O3769r1387j15940M7546L68750r7857
$$ 783033 835477 646117 724110 463096 561797 625566 534179 418239 465785 834535 736678
17092G36678j97772K96706o5666k69395k37330M18448R3800K9828k0381J35695
$$ 736678 538906 835612 769946 500551 263221 681669 775469 805297 784916 920611
17082I20611N1794j26552k38663o9622Q0534M63968m49227J62187M6326j15207
$$ 920611 972405 845853 607190 537568 618102 1082070 632843 795030 841356 726149
17072G26149K32295j31743j15142r7822k8K954M21056l31080K0716J84938J1360
$$ 726149 958444 826701 711559 613737 613709 616663 1037719 706639 727355 912293 923653
17061I23653j39155K17801B68724O89163l42391J4684J83186j91192N68613j16886
$$ 923653 784498 1002299 268724 957887 615496 630180 813366 622174 1190787 1073901
17051A073901k42958j04696L17921k48500k47052K95057k16605L90028j58855
$$ 1073901 830943 726247 1044168 795668 548616 843673 627068 1017096 858241
17042H58241L5344m01334N66162r6585P3867o2741k36118M5755M26412l11071
$$ 858241 893585 492251 1058413 961828 1035695 972954 736836 782591 1209003 897932
17032H97932K80385J26895j85401l92484j43568K02579J00597K43512J66119n25843
$$ 897932 1178317 1305212 1119811 727327 583759 786338 886935 1130447 1296566 770723
17022G70723J40831J80743j96537K89482N7932l36626J76637k34575L81993k13458
$$ 770723 911554 1092297 895760 1185242 1243174 906548 1083185 848610 1230603 1017145
17012A017145j96824M57939l77572o3743K93264J83651j02330k09817L17964J98684
$$ 1017145 820321 1278260 900688 836945 1130209 1313860 1211530 1001713 1319677 1518361
17002A518361l47193j61220K17685Q5534O4849k77284J42722J13432R7014k2225
$$ 1518361 1171168 1009948 1227633 1313167 1378016 1100732 1243454 1356886 1453900 1431675
16992A431675J11249j00352J00404k82251K58484l61593K76719l47531M12470
$$ 1431675 1542924 1442572 1542976 1260725 1519209 1157616 1434335 1086804 1499274
16983A499274k67243P2696K59505o1244J4767r4289J61391j5656j20270M4432
$$ 1499274 1232031 1304727 1564232 1502988 1517755 1423466 1584857 1569201 1448931 1493363
16973A493363O3294k40137J80008M71625n62788J5548J30768j05644k16910J3175
$$ 1493363 1556657 1316520 1496528 1968153 1405365 1420913 1551681 1446037 1229127 1242302
16963A242302N81172p29602M29977J210J26141j8961N5080j88091K53341J37377
$$ 1242302 1823474 1093872 1523849 1525059 1651200 1632239 1687319 1499228 1752569 1889946
16953A889946m06779l1126K96940R409l778J56227o9873K50686n92458K09382
$$ 1889946 1483167 1452041 1748981 1758390 1754612 1910839 1840966 2091652 1499194 1708576
16943A708576J22259l7850Q328K025l9230J40638J91459k51863P6370K55957j32086
$$ 1708576 1830835 1792985 1801313 1803338 1764108 1904746 2096205 1844342 1920712 2176669 2044583
16932B044583j39610O1253L99253P3222m14467Q1058L70349J224l6480j20310
$$ 2044583 1904973 1966226 2365479 2438701 2024234 2105292 2475641 2476865 2440385 2320075
16922B320075R9778j49951k73712M70672j78687K1783R3774O516J27430l13668
$$ 2320075 2419853 2269902 1996190 2466862 2288175 2309958 2403732 2410248 2537678 2224010
16912B224010K92427J44416k43067L0270J05863J47454J56851j33771K50197j94736
$$ 2224010 2516437 2660853 2417786 2448056 2553919 2701373 2858224 2724453 2974650 2779914
16902B779914o5785M20753k41599R6278L65522l22178k65203K23180K2474K78480
$$ 2779914 2714129 3134882 2893283 2989561 3355083 3032905 2767702 2990882 3013356 3291836
16892C291836k43499J3179N0413p4144K98255o8579j77938M30409R1986O2584
$$ 3291836 3048337 3061516 3111929 3037785 3336040 3267461 3089523 3519932 3611918 3674502
16882C674502l6614K4304k97187L99234j05079j3720J95649J70419k50803j90966
$$ 3674502 3637888 3662192 3365005 3764239 3659160 3645440 3841089 4011508 3760705 3569739
16872C569739O32526k98333K64503M2404k09131L47606l05621N56352j13888L8759
$$ 3569739 4202265 3903932 4168435 4210839 4001708 4349314 4043693 4600045 4486157 4524916
16862D524916m660J4046L54532o44010N21987J5535K28191j85919J68061j58034
$$ 4524916 4520256 4534302 4888834 4244824 4766811 4782346 5010537 4824618 4992679 4834645
16852D834645P10135m91914J03577J67391K80956k39481M16503N2598k9779q655
$$ 4834645 5544780 5052866 5156443 5323834 5604790 5365309 5781812 5834410 5804631 5795976
16842E795976K70620J41351j02152M02252r8460K2213J88949Q1338J79887L07485
$$ 5795976 6066596 6207947 6105795 6508047 6409587 6431800 6620749 6702087 6881974 7189459
16832G189459j64408K03779J99622k85868K07951Q3676K93317J80177R9695J85117
$$ 7189459 7025051 7228830 7428452 7142584 7350535 7434211 7727528 7907705 8007400 8192517
16822H192517K71575j00895K52190J61524L00242j76779N21679l2643K73288J46326
$$ 8192517 8464092 8363197 8615387 8776911 9077153 8900374 9422053 9389410 9662698 9809024
16812I809024K20719J07340L43578J12309N28167Q8605K43572L43759n4935K58184
$$ 9809024 10029743 10137083 10480661 10592970 11121137 11209742 11453314 11797073 11742138 12000322
16802A2000322L36126N65472n1654O08171J78347M24529L45963J59285M18601
$$ 12000322 12336448 12901920 12850266 13458437 13636784 14061313 14407276 14566561 14985162
16793A4985162j0326O00058M29580L81605J33289Q26032M59653J06096Q92748
$$ 14985162 14974836 15574894 16004474 16386079 16519368 17345400 17805053 17911149 18803897
16784A8803897K19906K67949J059740L19552O36021M27026Q33840N83574M95346
$$ 18803897 19023803 19291752 20351492 20671044 21307065 21734091 22567931 23151505 23646851
16775B3646851R21752O40737R81060L57376J007397Q45835J146164J047892M09979
$$ 23646851 24568603 25209340 26190400 26547776 27555173 28401008 29547172 30595064 31005043
16766C1005043R77707R90576J226221J292275J234579J418932J111475J517909
$$ 31005043 31982750 32973326 34199547 35491822 36726401 38145333 39256808 40774717
16758D0774717J375435J431504J883458J236017J930404J812298J668255J836738
$$ 40774717 42150152 43581656 45465114 46701131 48631535 50443833 52112088 53948826
16750E3948826K061811K035488K148652K278590J938310K825118K515823K458471
$$ 53948826 56010637 58046125 60194777 62473367 64411677 67236795 69752618 72211089
16742G2211089K444523K585102L118261K946608K651460K800802L253013K837620
$$ 72211089 74655612 77240714 80358975 83305583 85957043 88757845 92010858 94848478
16734I4848478K720503L010956K795954K663075K359521K502027K579790K091345
$$ 94848478 97568981 100579937 103375891 106038966 108398487 110900514 113480304 115571649
16726A15571649J623833J918896J184424J196637O51895M29299O5608m43663k21081
$$ 115571649 117195482 119114378 120298802 121495439 122147334 122576633 122642241 122198578 121977497
16717A21977497j131392r85819j857210j616605k311817k143712k297169k566289
$$ 121977497 120846105 119860286 118003076 116386471 114074654 111930942 109633773 107067484
16709A07067484k977278k820114k603395l155209k874816k817019k869820l163498
$$ 107067484 104090206 101270092 98666697 95511488 92636672 89819653 86949833 83786335
16701H3786335k808872k992825l236181k616639k572404k536980k379731k280720
$$ 83786335 80977463 77984638 74748457 72131818 69559414 67022434 64642703 62361983
16693F2361983k527797k161870k105962k099849j737568k153356j406944k480973
$$ 62361983 59834186 57672316 55566354 53466505 51728937 49575581 48168637 45687664
16685D5687664j321805j506716j583467j343013j515040j285500j214586j592271
$$ 45687664 44365859 42859143 41275676 39932663 38417623 37132123 35917537 34325266
16677C4325266p01228j590228m25516j440267r60389r84163p52318r31623p18076
$$ 34325266 33624038 32033810 31608294 30168027 29207638 28223475 27471157 26539534 25821458
16668B5821458p38898p65774p75204p09656n53769p09553o33436p56300l49249
$$ 25821458 25082560 24316786 23541582 22831926 22278157 21568604 20935168 20178868 19829619
16659A9829619p58507m74451o18178n78719l60229o2155p55824j01859o79709
$$ 19829619 19071112 18596661 17978483 17399764 17039535 16977380 16221556 16119697 15439988
16650A5439988m85591j60806l74984o61131j14774m00306l1189p73952q9889j2689
$$ 15439988 14954397 14793591 14418607 13757476 13642702 13242396 13211207 12437255 12347366 12334677
16640A2334677p13581j0239m09766J0351l22318k68343r1343k99935k14697k12000
$$ 12334677 11621096 11610857 11201091 11211442 10889124 10620781 10529438 10229503 10014806 9802806
16630I802806m17586R6616k25601l50174k72857j25725m7511l67717N76851p53322
$$ 9802806 9385220 9481836 9256235 8906061 8633204 8507479 8459968 8092251 8669102 7915780
16620G915780o0585R6541o80195Q3838k55801K8011J4975l03911J321J7505l98051
$$ 7915780 7855195 7951736 7271541 7355379 7099578 7127589 7142564 6838653 6839974 6857479 6459428
16609F459428l6147j86387L1373j76651o7935J07925k72615n8477j4480k32656
$$ 6459428 6423281 6236894 6268267 6091616 6023681 6131606 5858991 5800514 5786034 5553378
16599E553378k66104P2440m4548l8704J91029m53471k82638J77915p0942j00450
$$ 5553378 5287274 5359714 5315166 5276462 5467491 5014020 4731382 4909297 4838355 4737905
16589D737905J22875l64584O3661j09781L49485m83311J21028R794q4704k39741
$$ 4737905 4860780 4496196 4559857 4450076 4799561 4316250 4437278 4447072 4362368 4122627
16579D122627M3461J42254o43015K59873J0573k46219L59759j54056m87512L19091
$$ 4122627 4166088 4308342 3665327 3925200 3935773 3689554 4049313 3895257 3407745 3726836
16569C726836J6154k65111l9761k00879n1937L26897j76035R6257P9473k81385
$$ 3726836 3742990 3477879 3438118 3237239 3185302 3512199 3336164 3432421 3511894 3230509
16559C230509k3251r7666o1089r1663J61372l178k03920k62214J48168j58318
$$ 3230509 3207258 3109592 3048503 2956840 3118212 3115034 2911114 2648900 2797068 2638750
16549B638750K35713j45584L29949p70944N73973n11517N7844J79069J06639k89964
$$ 2638750 2874463 2728879 3058828 2287884 2861857 2350340 2408184 2587253 2693892 2403928
16539B403928K7487J29210k78414K05658l10624J82795K32764j90279l1300m79784
$$ 2403928 2431415 2560625 2282211 2487869 2177245 2360040 2592804 2402525 2371225 1891441
16529A891441L88358j2521l53675L50890n0805j09977j60472J31138k37491o3681
$$ 1891441 2279799 2267278 1913603 2264493 2213688 2103711 1943239 2074377 1836886 1773205
16519A773205N22602n89199P4086J09845J80867l55049L61778o22628L8798K76914
$$ 1773205 2295807 1706608 1780694 1890539 2071406 1716357 2078135 1455507 1494305 1771219
16509A771219k1167j14415k41640M31517J0285m0772j76807N177K8940j0765j15173
$$ 1771219 1750052 1635637 1393997 1825514 1835799 1795027 1618220 1623397 1652337 1641572 1526399
16498A526399K91940m39157K50214o5258J32051l48452J58284J42614Q9197j52939
$$ 1526399 1818339 1379182 1629396 1564138 1696189 1347737 1506021 1648635 1737832 1584893
16488A584893r4397o5605L14318J11068l38567j6878K3164l02833J32804p9677
$$ 1584893 1490496 1424891 1739209 1850277 1511710 1494832 1517996 1215163 1347967 1268290
16478A268290J81850o1198m0052R5633j52627J624Q1513K1765p4553K4604o8060
$$ 1268290 1450140 1388942 1348890 1444523 1291896 1293520 1375033 1396798 1322245 1346849 1278789
16467A278789j87338K97814k24662P4370K21551m5133l90175k5292J80743j73037
$$ 1278789 1091451 1389265 1164603 1238973 1460524 1415391 1025216 999924 1180667 1007630
16457A007630M74135m20534J32270k36568M55917m25586M1917K31504k36764p0804
$$ 1007630 1481765 1061231 1193501 956933 1412850 987264 1029181 1260685 1023921 953117
16447I53117L24586m79991L61439j57664N0292k32079O2202J31328k55096J85257
$$ 953117 1277703 797712 1159151 1001487 1051779 819700 881902 1013230 758134 943391
16437I43391j17379p790J28919j58954K31500l95764M14183j50796k35032M24278
$$ 943391 826012 818222 947141 788187 1019687 623923 1038106 887310 652278 1076556
16427A076556j24119q1400L95039l45245J11634k52446J28960L07729l10601p4763
$$ 1076556 952437 871037 1266076 920831 1032465 780019 908979 1216708 906107 831344
16417H31344K25034k34054P3651J92942k40386L03350l71760O6054j8420Q0761
$$ 831344 1056378 822324 895975 1088917 848531 1151881 780121 846175 827755 908516
16407I08516m8382m2188r5286J15546k33813L25731j507l70233K37050J72173
$$ 908516 860134 817946 722660 838206 604393 930124 928617 558384 795434 967607
16397I67607o5975k90184k459J33514R0478k26906q548L2239M6440j79528J95848
$$ 967607 901632 611448 608989 742503 832981 606075 597527 629766 676206 496678 692526
16386F92526j26379P512r0872K89591k6115J71008r6191j87996J24694j91494
$$ 692526 566147 573659 482787 772378 746263 917271 821080 633084 757778 566284
16376E66284K17411j32954J18416C51455L46259l42153J28158R1990m3137R9493
$$ 566284 783695 650741 769157 351455 697714 355561 483719 575709 532572 632065
16366F32065L7851K50436j48894J3052j72195J01801q1566j11246J22678R435
$$ 632065 669916 920352 771458 784510 612315 714116 632550 521304 643982 653417
16356F53417J55274l74141K27941l8285J09223j99132q0416K68958j91099L78234
$$ 653417 808691 434550 662491 624206 733429 534297 453881 722839 531740 909974
16346I09974n8702D05518L98145k15693L68209D41642Q0528r0971M3937L97331
$$ 909974 851272 405518 803663 587970 956179 441642 522170 431199 475136 872467
16336H72467C90886P6320k3819l8432K1727j14423M54500C74474R6696j88897
$$ 872467 390886 467206 443387 404955 426682 312259 766759 374474 471170 282273
16326B82273J25104L17577B87772K17029j933p1540K85538j62956K19514k70282
$$ 282273 407377 724954 287772 504801 502868 431328 716866 553910 773424 503142
16316E03142R6152m9501k19975J57800M45559k33521o2253k75784L2860k1951
$$ 503142 599294 549793 329818 487618 933177 699656 637403 361619 394479 372528
16306C72528n3321L9499Q75G7474L54690M6253j25688j66435O1402m4657K31557
$$ 372528 319207 358706 359581 77474 432164 478417 352729 186294 247696 203039 434596
16295D34596M6606j64225O7654A05970L56805J6018B5833O55327k3154k39379
$$ 434596 481202 316977 384631 105970 462775 478793 25833 681160 658006 418627
16285D18627N011j26875O1720L2585j86652J32203J4097C3174K61211o3183K22276
$$ 418627 423638 296763 358483 391068 204416 336619 350716 33174 294385 231202 453478
16274D53478A19278K26509M7366J93194D0023L27674J03988N5450A57235N37677
$$ 453478 119278 345787 393153 586347 40023 367697 471685 527135 157235 694912
16264F94912B43991K9868L0243M0081m3664q6842L09282j41204A25233K27734
$$ 694912 243991 273859 304102 344183 300519 213677 522959 381755 125233 352967
16254C52967k8598O4566j7208L5744L84880C28429l3578K9690k4067q9576M09771
$$ 352967 324369 388935 371727 407471 792351 328429 294851 324541 300474 210898 620669
16243F20669B83461J21392A32013l7123k2571J65712J5491R4675j53518K5966
$$ 620669 283461 404853 132013 94890 72319 238031 253522 348197 194679 220645
16233B20645K5756A18147N495K50460l0130J13841q9698A61861q427d3610D86185
$$ 220645 246401 118147 123642 374102 343972 457813 368115 161861 153434 -43610 486185
16221B47507m7964L78731k29826n422j09537J19236n3774M5952K94295B02855
$$ 247507 199543 578274 348448 343026 233489 352725 298951 344903 639198 202855
16210A74945a61128D57180A44979L05655I6290K59298m3303m245J20401j71925
$$ 174945 -161128 457180 144979 450634 96290 355588 312285 308040 428441 256516
16200B56516K07447j47351D4432J04169J05476B9862L26711a15762A84419P97
$$ 256516 463963 316612 44432 148601 254077 29862 356573 -115762 184419 185216
16190A85216N9088r9754Q6254M5946j05103n8107l1163K2517M60079c7074C16757
$$ 185216 244304 144550 230804 276750 171647 113540 82377 104894 564973 -37074 316757
16178B22542C5328L81033j11274A28958Q4736c07843C01766h441p2491A38536
$$ 222542 35328 416361 305087 128958 213694 -307843 301766 -8441 -80932 138536
16167B65122K43131B3163J03527l7937f5440B35714p687l1451C7861J69386c06627
$$ 265122 508253 23163 126690 88753 -65440 235714 228027 196576 37861 207247 -306627
16155A26070J22114L217p769M2560A12833J32563Q9417j63706G7446J46781d0773
$$ 126070 248184 251401 243632 286192 112833 245396 334813 171107 77446 224227 -40773
16143B49499f363B97932i4667A11583R1809A2960b75720B64367M8755j40323N911
$$ 249499 -6363 297932 -94667 111583 203392 12960 -275720 264367 313122 172799 178710
16132A78710E8213K05097C0322K08262J34240a94324E4492L93537A13124J67691
$$ 178710 58213 263310 30322 238584 372824 -194324 54492 448029 113124 280815
16122B80815f3295K5319A83780A2043J67207f1127A40905Q2b60532A45658g3961
$$ 280815 -63295 -37976 183780 12043 179250 -61127 140905 140987 -260532 145658 -73961
16110B85362C3535J75799D9685L88734A82036O4354H2325L0364R8310a20488B79601
$$ 285362 33535 209334 49685 438419 182036 246390 82325 112689 210999 -120488 279601
16098I4360D1624J88003j03993K1202k6625a74905A55877K0778f2508k6543B18031
$$ 94360 41624 229627 125634 146836 120211 -174905 155877 176655 -62508 -89051 218031
16086B17580K6100a47318A75633q2149P2002K1657H1045a8340q6089A95005J31218
$$ 217580 243680 -147318 175633 93484 165486 187143 81045 -18340 -104429 195005 326223
16075C26223C0322K40462r8359l31b29391M5647A45381D3224J47594k4969b23128
$$ 326223 30322 270784 172425 172094 -229391 -183744 145381 43224 190818 165849 -223128
16063A37142J37730a28447A84670D3575b90205A37321A1340J92045a9107C00337
$$ 137142 274872 -128447 184670 43575 -290205 137321 11340 203385 -19107 300337
16052b8421A61695M0461C7430a2813D71448A04501h1323j23468k08003e1537I8138
$$ -28421 161695 202156 37430 -12813 471448 104501 -81323 -204791 -412794 -51537 98138
16040E478b33902A2499b13929C44695A24622J2408J29467a27271H6379N0501o2183
$$ 5478 -233902 12499 -213929 344695 124622 137030 266497 -127271 86379 136880 74697
16029G4697a02411j9841B43495K27757D1906a07493L7806B16236a74539G1017
$$ 74697 -102411 -122252 243495 471252 41906 -107493 -69687 216236 -174539 71017
16018c9803Q707q1075C01213c26436e778G5555j9301a13749N1679A82519O3085
$$ -39803 -31096 -112171 301213 -326436 -5778 75555 56254 -113749 -62070 182519 245604
16007B45604H0343j0400J85941I3680D2016f4094a1072G4244J55179b30071j12966
$$ 245604 80343 69943 255884 93680 42016 -64094 -11072 74244 229423 -230071 -343037
15996c43037a08141I549g438m8125B31436E6594b44114A65167J72605j66936M29639
$$ -343037 -108141 9549 -7438 -55563 231436 56594 -244114 165167 337772 170836 600475
15985F00475L46403J74490J29249l80790k07162l9654k08465m2327f887j70383
$$ 600475 946878 1121368 1250617 869827 662665 623011 414546 372219 -6887 -177270
15975a77270A48712h8694E34830b5642l20006E4953N0649a63756F1977d7592A19970
$$ -177270 148712 -88694 534830 -25642 -345648 54953 105602 -163756 61977 -47592 119970
15963e2164a8089j6246l1346A05905J1827b8072A2646a74508B14855a58399P8863
$$ -52164 -18089 -34335 -65681 105905 117732 -28072 12646 -174508 214855 -158399 -79536
15952g9536f456m5206B94023h7448A21007h5918q4354f3417j92813B06042D9332
$$ -79536 -6456 -51662 294023 -87448 121007 -85918 -170272 -63417 -256230 206042 49332
15940h8328A49201o3165k2433a50942G4094e5435A43866J45719a0718D5149a37027
$$ -88328 149201 86036 63603 -150942 74094 -55435 143866 289585 -10718 45149 -137027
15928B26426a55787f3916k12244a0338A6730a33083A42499E3867g2417k20328
$$ 226426 -155787 -63916 -276160 -10338 16730 -133083 142499 53867 -72417 -292745
15918b92745a23313A19605e1557A62064b59533F528J74396i8146d3180B46483
$$ -292745 -123313 119605 -51557 162064 -259533 6528 180924 -98146 -43180 246483
15907B96227g6693j6127r6415B63084j31142c57130H9822K28590j47341B2519
$$ 296227 -76693 -92820 -189235 263084 131942 -357130 89822 318412 171071 22519
15896d4733C57313n1831a34233G031i0989b2645G0043h4269j738j41651h307k4673
$$ -44733 357313 305482 -134233 7031 -90989 -22645 70043 -84269 -86007 -227658 -8307 -32980
15884c2980B03305i6219p0670C71279a4091q5572m2653A42736a94136h3356j82924
$$ -32980 203305 -96219 -166889 371279 -14091 -99663 -142316 142736 -194136 -83356 -266280
15873b66280F6648K82233b15098r1177D6925A9404J69929e8235A743J40104D6478
$$ -266280 66648 348881 -215098 -306275 46925 19404 189333 -58235 1743 141847 46478
15861a63875d1476j37046j00563C27047b922I8219e2571D8796i6682j69180J24285
$$ -163875 -41476 -178522 -279085 327047 -2922 98219 -52571 48796 -96682 -265862 -141577
15850a41577k87179i9073C41129h2731F2112e2032C8494R0624g0754F39156B4656
$$ -141577 -428756 -99073 341129 -82731 62112 -52032 38494 129118 -70754 639156 24656
15838b86658A54360K7825i3038o559j1509J7765l7640J4738C62660a0837C60417
$$ -286658 154360 182185 -93038 -99597 -111106 -93341 -130981 -116243 362660 -10837 360417
15826a99048Q7233I5397g5474a7420q3431A32216A5686a02160M8082j13592B6177
$$ -199048 -111815 95397 -75474 -17420 -100851 132216 15686 -102160 -54078 -167670 26177
15814e5500A75053a43520f7659j10484b8880E7791K00340E439R352c87559B24307
$$ -55500 175053 -143520 -67659 -178143 -28880 57791 258131 5439 14791 -387559 224307
15802D9985J73327K0824a62811E6974M0527D5077c25978a45814n907j5751C18547
$$ 49985 223312 244136 -162811 56974 97501 45077 -325978 -145814 -151721 -167472 318547
15790b71375A08865L8569J00752g4452k26635A1770a32210J0685O61B588J7265
$$ -271375 108865 147434 248186 -74452 -301087 11770 -132210 -121525 -120864 2588 19853
15779A9853b04231i7508A34624F2073e749a840G6689B1703N8309a2240A50992
$$ 19853 -204231 -97508 134624 62073 -5749 -1840 76689 21703 80012 -12240 150992
15767H2268a55684k3221j81517H2477a48233I3308j475L22819D0163J15565A5804
$$ 82268 -155684 -178905 -360422 82477 -148233 93308 91833 414652 40163 155728 15804
15755B39251E3176b96586G6568k2N7135N3446D5457K45046b3611j92201a07315
$$ 239251 53176 -296586 76568 76546 133681 187127 45457 290503 -23611 -215812 -107315
15743C93508d0658j31483A57368n5353M8299i2151F0323A4335a01722A61155c78842
$$ 393508 -40658 -172141 157368 102015 150314 -92151 60323 14335 -101722 161155 -378842
15731c27125A51185J8411E5612J18341a01356j4725A19214f7852J2674r9120I2101
$$ -327125 151185 169596 55612 173953 -101356 -116081 119214 -67852 -55178 -154298 92101
15719f8311B46645A14103l4789j5931L06387A20078a99854B20203h5033I9484
$$ -68311 246645 114103 79314 63383 369770 120078 -199854 220203 -85033 99484
15708b22638A56199k5512J07572a16675c3608H4182Q973a41169A19945a52167
$$ -222638 156199 130687 238259 -116675 -33608 84182 93155 -141169 119945 -152167
15697h775B09361L5115a46287p064K7434B00946F8146a35201A46663a85134C56188
$$ -8775 209361 244476 -146287 -153351 -125917 200946 68146 -135201 146663 -185134 356188
15685C20874A10151b40306h9399i36m129j30107o45H2342b29420b3014l59181
$$ 320874 110151 -240306 -89399 -936 -5065 -135172 -135817 82342 -229420 -23014 -382195
15674c82195c8055j59711p630A58532Q2229E0877K35980a29356A65613e3281A4356
$$ -382195 -38055 -197766 -205396 158532 240761 50877 286857 -129356 165613 -53281 14356
15662B57522E3080i3420I9114K25202c28792A53335c59592J51215A47582f383
$$ 257522 53080 -93420 99114 324316 -328792 153335 -359592 -208377 147582 -6383
15651b04982O5611j78276A52635h6837d242k09433N3427D21291a87933A40642
$$ -204982 -139371 -317647 152635 -86837 -4242 -213675 -160248 421291 -187933 140642
15640e9583G9730a62090g6656r2269g5182J7019I8311L918a98016h8104B189J35831
$$ -59583 79730 -162090 -76656 -168925 -75182 -58163 98311 102229 -198016 -88104 2189 138020
15628A38020g667k22667j33013H8618a79370B5387P5371b80032E7592B3744r13
$$ 138020 -7667 -230334 -363347 88618 -179370 25387 100758 -280032 57592 23744 22831
15617B2831a94983A24930M5075d76273A20965f5820B887e0035H1248L8546a2086
$$ 22831 -194983 124930 170005 -476273 120965 -65820 2887 -50035 81248 119794 -12086
15605b70232M4767F1537h927k31920R3896j58030E1892i6031c5037l15212C99959
$$ -270232 -225465 61537 -8927 -240847 -146951 -304981 51892 -96031 -35037 -350249 399959
15593E9544b01660C9987a18388A24351N2945b41263P6325g6570L4408j58908E2814
$$ 59544 -201660 39987 -118388 124351 177296 -241263 -164938 -76570 -42162 -201070 52814
15581A53590J14952a42454K1263j19384D2463b0896j95016L0947D3646b43834
$$ 153590 268542 -142454 -121191 -240575 42463 -20896 -215912 -184965 43646 -243834
15570A9056c36230G6064a84371I7822c39804f7593B9760a59854j91239b5537A82363
$$ 19056 -336230 76064 -184371 97822 -339804 -67593 29760 -159854 -351093 -25537 182363
15558A86734b0398j33958f1380l662b3581r4690A38500b14697B01148a79976G9275
$$ 186734 -20398 -154356 -61380 -65042 -23581 -118271 138500 -214697 201148 -179976 79275
15546A41576D8563a27531M5636I8113a12746A38645K2420B4754M60394H8338g4078
$$ 141576 48563 -127531 -81895 98113 -112746 138645 161065 24754 485148 88338 -74078
15534c5898n2851A21765R2966o4156b33120i9144A09872a34194j54586D87096
$$ -35898 -88749 121765 214731 150575 -233120 -99144 109872 -134194 -288780 487096
15523G1317a35438G5473J97663A12091K25846l517H9877K83383A7416c1B49973
$$ 71317 -135438 75473 273136 112091 337937 334420 89877 373260 17416 -31 249973
15511B4538P1823K81723E0599M14056j04162j71364E4895J30758K00104d854B35392
$$ 24538 96361 378084 50599 464655 360493 189129 54895 185653 385757 -4854 235392
15499A60728k316N7891J56432A82533c0067B80222a69323A89807e265G8027b14102
$$ 160728 158412 216303 372735 182533 -30067 280222 -169323 189807 -5265 78027 -214102
15487b14314N1301D80501I2043B381N37292D7917O1231j7605N7137r787Q8088
$$ -214314 -163013 480501 92043 2381 539673 47917 109148 91543 148680 138893 226981
15476B26981J32991j67383Q24022j24893C62368j11898N7297c0441B00234C200
$$ 226981 359972 192589 1016611 891718 362368 250470 307767 -30441 200234 3200
15465B6151g1541A83260a36346C07096C3904j3182a02510D21209b11869m0457
$$ 26151 -71541 183260 -136346 307096 33904 20722 -102510 421209 -211869 -252326
15455b52326c4680j84078b1858C04464J5073b21604J01238g896B44395c3780B17283
$$ -252326 -34680 -218758 -21858 304464 319537 -221604 -120366 -7896 244395 -33780 217283
15443E47531j85420O30732K63286J42091j15866E80010A97219L00401k19548H6410
$$ 547531 362111 992843 1256129 1398220 1282354 580010 197219 497620 278072 86410
15432A84683K83745d37402E6561e5848B673L73571a02007I2915K14202g1798A13513
$$ 184683 468428 -437402 56561 -55848 2673 376244 -102007 92915 307117 -71798 113513
15420B48625e7677B09514A3585a82068B2199P0405J22430E5663a53913n7393O7407
$$ 248625 -57677 209514 13585 -182068 22199 92604 215034 55663 -153913 -211306 -143899
15409a43899B47077b14713A18481f0941A24701a84568F2456J3398J20996H0017
$$ -143899 247077 -214713 118481 -60941 124701 -184568 62456 75854 196850 80017
15398H6998b3737n30308a9857E0475d0561D1464J44067a50762A82482a53801A13246
$$ 86998 -23737 -554045 -19857 50475 -40561 41464 185531 -150762 182482 -153801 113246
15386g3851A19489a76453P3874C19075H6446k8344O0611J02415M442E3171K69079
$$ -73851 119489 -176453 -102579 319075 86446 58102 118713 221128 225570 53171 322250
15375C22250j52261K39578Q2068j03880q6279C9012q51P2287b8416A29068K11205
$$ 322250 169989 409567 491635 387755 301476 39012 38161 110448 -28416 129068 340273
15364C40273C0653K71929j29566N3938r4865J99019r6045k0936K00851j07270
$$ 340273 30653 302582 173016 226954 132089 331108 235063 214127 414978 307708
15354C07708a4142F6788M4133L00428A72983K2783e8782B64309J11551A71345
$$ 307708 -14142 66788 110921 411349 172983 195766 -58782 264309 375860 171345
15343E65071A95006L52794j60871q6519k2592j8904p8048B2996K56936F2097K58975
$$ 565071 195006 547800 386929 300410 277818 258914 180866 22996 279932 62097 321072
15332C21072k0073A19805J87253M6671A52464j024c881o0125B56488j1136c2388
$$ 321072 300999 119805 307058 353729 152464 151440 -3881 -64006 256488 245352 -32388
15320E0799i9172a3589r188p9251B94807a88059I6873a39456B54970K22618a54423
$$ 50799 -99172 -13589 -22777 -102028 294807 -188059 96873 -139456 254970 477588 -154423
15308B47933l4654a59158B38092I0425a6288k7609A74718b2168l62976A46644
$$ 247933 213279 -159158 238092 90425 -16288 -43897 174718 -22168 -385144 146644
15297C05711h6582H0888a14594H5262N8101i6488A39759c83754B17320J3987l4419
$$ 305711 -86582 80888 -114594 85262 143363 -96488 139759 -383754 217320 231307 196888
15286A96888m6220L250c1451A07815A1082L12567c3350k43935G4727L20505E0039
$$ 196888 150668 153918 -31451 107815 11082 323649 -33350 -277285 74727 395232 50039
15274A35248J27336H9964m4573M4952K21744b02509B37940a25891C27880G1288
$$ 135248 262584 89964 45391 90343 312087 -202509 237940 -125891 327880 71288
15263B8216K0022M8100b20012i135j04197j18051C09973a94390I5216D5910i4484
$$ 28216 48238 96338 -220012 -9135 -113332 -231383 309973 -194390 95216 45910 -94484
15251H9608k0474N9102m4296j9365E676L91677j90811j9684J27859O52610R88448
$$ 89608 69134 128236 83940 64575 5676 397353 206542 186858 314717 967327 1955775
15240A955775K84549p04443J119196A292641l36442C28183D9676J23776l9461
$$ 1955775 2240324 1535881 2655077 1292641 956199 328183 49676 173452 133991
15231A33991l5210D2540K10127C3922P331I560b16091E7481b0718c094E3464c61175
$$ 133991 98781 42540 252667 33922 41253 9560 -216091 57481 -20718 -3094 53464 -361175
15218c0528B10237I87K29857r132F7053a4102l9460a9992A48120Q9091A8691L2210
$$ -30528 210237 987 230844 221712 67053 -14102 -53562 -19992 148120 237211 18691 50901
15206E0901J4272J18793f5022j44685B97322a14372D1236K65891a06242c057B00782
$$ 50901 65173 183966 -65022 -209707 297322 -114372 41236 307127 -106242 -3057 200782
15194B61574k8907n9788f181B5936Q5075J23795q9031B9703L4250L24398i3664
$$ 261574 232667 172879 -6181 25936 111011 234806 145775 29703 63953 388351 -93664
15182b07779B20160N162b99864G263L0041O0302c1740r5395A40900Q2492a26087
$$ -207779 220160 225322 -299864 7263 37304 97606 -31740 -127135 140900 223392 -126087
15170C78125A75443P8506e9209o802i202B28523M7897A23538m3890l0973J12270
$$ 378125 175443 253949 -59209 -66011 -9202 228523 276420 123538 79648 48675 160945
15159A60945J05794F3706a85818A53588j0092J25405j33956J31481q3662a47777
$$ 160945 266739 63706 -185818 153588 143496 268901 134945 266426 182764 -147777
15148A267K60277A29953O4259E434J42186F8317J15362o8215J76399b38750A43084
$$ 1267 261544 129953 194212 5434 147620 68317 183679 115464 291863 -238750 143084
15136C30459A11691f2958A73101J98713j21963c6687A02961g91k7574A66785a7593
$$ 330459 111691 -62958 173101 371814 249851 -36687 102961 -791 -28365 166785 -17593
15124C9890b4666j69920H925K19943j8157o7326J53613J52935O3320E6772J75499
$$ 39890 -24666 -194586 8925 228868 210711 143385 296998 449933 513253 56772 232271
15113B32271b8269H3604J95377D3088P9747K83263B8273a18423E1733J4321J65731
$$ 232271 -28269 83604 278981 43088 122835 406098 28273 -118423 51733 66054 231785
15102B31785k7095G3808j6912N9917J18526b60954B88566e8364j92834A62390
$$ 231785 204690 73808 56896 116813 235339 -260954 288566 -58364 -251198 162390
15091a51249A69285B773f3370j29226C65944E0619L34933j07396j2523J93000
$$ -151249 169285 2773 -63370 -192596 365944 50619 385552 278156 265633 458633
15081D58633B13444H5511J82154f924B84670K2822j38926B4393J15596K29365
$$ 458633 213444 85511 267665 -6924 284670 307492 168566 24393 139989 369354
15071C69354B2292M9796B7869K79387j45131J35430n4422q7932K77109H9772K64947
$$ 369354 22292 72088 27869 307256 162125 297555 243133 155201 432310 89772 354719
15060C54719i8891B81100L55396k74051h4001B74110P3396A37576K85568j47177
$$ 354719 -98891 281100 636496 362445 -84001 274110 347506 137576 423144 275967
15050B75967j30886c0872D50955j7845R4011J73711a06427C04995J25030q6468
$$ 275967 145081 -30872 450955 433110 527121 700832 -106427 304995 430025 343557
15040C43557O0489o6702J93621k12842p7142O0390r7360L38934k16978J40903
$$ 343557 404046 337344 530965 318123 240981 301371 204011 542945 325967 466870
15030D66870K75446J37075J36171D26555J77284k52678k0009q9816L45821Q861
$$ 466870 742316 879391 1015562 426555 603839 351161 331152 241336 587157 596018
15020E96018j9085l8873B06098m7502K66507r6397L4809j36089L92845k00476
$$ 596018 576933 538060 206098 158596 425103 328706 363515 227426 620271 419795
15010D19795K30477J495B98491L66404o4836k63908P2875J43478j23919j82786
$$ 419795 650272 651767 298491 664895 600059 336151 409026 552504 428585 245799
15000B45799J62268P8458p994O3637J83172p6945j91245k26982J45501l4076K35887
$$ 245799 408067 486525 478531 542168 725340 648395 457150 230168 375669 341593 577480
14989E77480j82805K44527B10857K06493K11695J7252q2040n4643N33528k34528
$$ 577480 394675 639202 210857 417350 629045 646297 564257 509614 1043142 808614
14979H08614j04267O1340o1381k19060k0230K05329K36154D49533N51439l27228
$$ 808614 704347 765687 704306 485246 465016 670345 906499 449533 1000972 673744
14969F73744j86177n995J0061j07457j29292k0115H6145M87457J05918B1767M21633
$$ 673744 487567 481572 491633 384176 254884 234769 86145 573602 679520 21767 443400
14958D43400R4257r2096N6609r6336A32989K92502j54186J53722K7139k22205
$$ 443400 537657 445561 502170 405834 132989 425491 271305 425027 452166 229961
14948B29961J39193j55895K48895R823n1297K33297j43058K48889k69089A00223
$$ 229961 369154 213259 462154 471977 420680 653977 510919 759808 490719 100223
14937F21888j39291k32068N12755k59493K44349l29704N14022J87791K12956j1370
$$ 621888 482597 250529 763284 503791 748140 418436 932458 1120249 1333205 1321835
14927A321835j23261K86503K9721N52976k7106m49865J97900p2498l4202J84844
$$ 1321835 1198574 1485077 1514798 2067774 2040668 1590803 1788703 1716205 1682003 1866847
14917A866847L12061K90078J12959p83079m87045L7523O0576E68503l2599R1923
$$ 1866847 2178908 2468986 2581945 1798866 1311821 1349344 1409920 568503 535904 627827
14907F27827Q0077j60535J54638Q4188A67004M92609j64879J16261A93278B8866
$$ 627827 707904 547369 702007 786195 167004 659613 494734 610995 193278 28866
14896E98692j46738h7391D10345j39269L05246J8895j81212J81611M4715M0992
$$ 598692 451954 -87391 410345 271076 576322 595217 414005 595616 640331 681323
14886F81323k168J42781K72574k15206j68395K30274k01709p7098J68069k3828
$$ 681323 679155 821936 1094510 879304 710909 941183 739474 662376 830445 806617
14876H06617J41088j3225D44071l5315r9066K98846k28441M19079R6210k57572
$$ 806617 947705 934480 444071 408756 309690 608536 380095 799174 895384 637812
14866F37812j75810L52805p7122l28663K02495Q4392J0922A40029N33410B03733
$$ 637812 462002 814807 737685 409022 611517 695909 706831 140029 673439 203733
14855D49706m7193A88106J68711P0152J37266R0848q4884j06838L76087C89741
$$ 449706 402513 188106 356817 426969 564235 655083 570199 463361 839448 389741
14844G83212M1712K57105p1743J77361P0935J0634m19975K94648j44803j0771
$$ 783212 824924 1082029 1010286 1187647 1258582 1269216 849241 1143889 999086 988315
14834I88315r1166J87036m31557j12108J19183n3543q9228K7153k58656L63915
$$ 988315 897149 1084185 652628 540520 659703 606160 516932 544085 285429 649344
14824F49344C17481K42568M3687M16970l72046J170J42540l3673q0391J40433
$$ 649344 317481 560049 603736 1020706 648660 649830 792370 758697 678306 818739
14814H18739l45379K55964R8563l21804j53549N91718m39170J83503K60801r6419
$$ 818739 473360 729324 827887 506083 352534 944252 505082 688585 949386 852967
14804H52967J73412k57496J25175r9157j39750K7522L92421m66408j12626l129
$$ 852967 1026379 768883 894058 794901 655151 682673 1075094 608686 496060 492931
14794D92931j14967M23941n1028k99951q4018J99651K72769k45184J28053j85057
$$ 492931 377964 801905 750877 450926 366908 566559 839328 594144 722197 537140
14784E37140J12627m3070j03832N53640n06969J18342j85107J04337L11238O9385
$$ 537140 649767 606697 502865 1056505 549536 667878 482771 587108 898346 967731
14774I67731Q1429j75623j74309j23926M71248k42072q7217j55969K12871k39711
$$ 967731 1049160 873537 699228 575302 1046550 804478 717261 561292 774163 534452
14764E34452K01881k70972r3284M42125B58279N04575q9352j46859O7423L5316
$$ 534452 736333 465361 372077 814202 258279 762854 673502 526643 594066 629382
14754F29382M4783j15546K46326j5754J31732m07374K40216K74456D04873N88381
$$ 629382 674165 558619 804945 789191 920923 513549 753765 1028221 404873 993254
14744I93254m14257J94935m983J0931k42817J60301M46039j95094l89586K36130
$$ 993254 578997 773932 768949 779880 537063 697364 1143403 948309 558723 794853
14734G94853J48064j2432j30002M33752k87793K38478M79232Q5443n2289L37900
$$ 794853 942917 930485 800483 1234235 946442 1184920 1664152 1749595 1697306 2035206
14724B035206p8770o44441J91300k85929L9649m31385J13098j30833O6618m3050
$$ 2035206 1956436 1311995 1503295 1217366 1257015 825630 938728 807895 874513 831463
14714H31463q9504K32748L20464n37792J4631J01807K30309l30585K98930J43468
$$ 831463 741959 974707 1295171 757379 772010 873817 1104126 773541 1072471 1215939
14704A215939Q3744J87878J35689r3868L81557L85007q81527J46605l02596n62936
$$ 1215939 1299683 1487561 1623250 1529382 1910939 2295946 1414419 1561024 1258428 695492
14694F95492M75972k04960L7789m0346l37859J91914J94229j51353o8195K21645
$$ 695492 1171464 966504 1004293 963947 626088 818002 1012231 860878 792683 1014328
14684A014328L61692p3839k94983j20311O7834K45322j73770p1744J698M44009
$$ 1014328 1376020 1302181 1007198 886887 954721 1200043 1026273 954529 956227 1400236
14674A400236l04678l73184j27686M47763J2996k20181L89498j98890Q8759j63105
$$ 1400236 1095558 722374 594688 1042451 1055447 835266 1224764 1025874 1114633 951528
14664I51528K78899J26371k47917k223p871K3999j47168J66745L0108q3010R7978
$$ 951528 1230427 1356798 1108881 1106658 1098787 1122786 975618 1142363 1172471 1089461 1187439
14653A187439J00492l6912K10327o8553J60558j87134M474n5042J77142k17778
$$ 1187439 1287931 1251019 1461346 1392793 1553351 1366217 1370691 1315649 1492791 1275013
14643A275013l07373L82112k31419L63324l44927J13144J27993J05536m60701
$$ 1275013 967640 1349752 1118333 1481657 1136730 1249874 1377867 1483403 1022702
14634A022702K79555K05194J6121j34806L7944k16756J63907q1651K87961l3474
$$ 1022702 1302257 1507451 1523572 1388766 1426710 1209954 1373861 1292210 1580171 1546697
14624A546697k27394M70496k22835m7452j35482J4185k89679J56230J62075k8874
$$ 1546697 1319303 1789799 1566964 1519512 1384030 1398215 1108536 1264766 1426841 1397967
14614A397967m3226J52966n0727R6540Q3428J28881l40733k0708J20936p6943
$$ 1397967 1354741 1507707 1456980 1553520 1636948 1765829 1425096 1404388 1525324 1448381
14604A448381K23367m30007L15211L09789k59054k67684K12288J79566k19863
$$ 1448381 1671748 1241741 1556952 1866741 1607687 1340003 1552291 1731857 1511994
14595A511994J31233m8918L75476j48242j3435k7041Q1155j90524j41535l584
$$ 1511994 1643227 1594309 1969785 1821543 1808108 1781067 1862222 1671698 1530163 1526579
14585A526579K73670M4683j04351K19576k39578L06735k77249O97244m08898k53022
$$ 1526579 1800249 1844932 1740581 1960157 1720579 2027314 1750065 2447309 2038411 1785389
14575A785389J795R8416L40174k53024J30959K83240k8408J65555k45622M9118
$$ 1785389 1787184 1885600 2225774 1972750 2103709 2386949 2358541 2524096 2278474 2327592
14565B327592j98195L16033J01493J60710l81455L6029M50628J38469L8391M7239
$$ 2327592 2129397 2445430 2546923 2707633 2326178 2362207 2812835 2951304 2989695 3036934
14555C036934p2418N88177n4815O97823K63840J396957J476283L651788R093152
$$ 3036934 2964516 3552693 3497878 4195701 4459541 5856498 7332781 10984569 20077721
14546B0077721K5294366m637013A7657938G358177k956727r69053p85688k66389
$$ 20077721 45372087 40735074 17657938 7358177 4401450 3432397 2646709 2380320
14538B380320N99268P65093L247665k975902j479514n25275K34552j1743L75334
$$ 2380320 2979588 3744681 6992346 4016444 2536930 2011655 2246207 2234464 2609798
14529B609798k84882o6868L4199j93579J24154K07824k6302j21649l1015J06992
$$ 2609798 2324916 2258048 2292247 2098668 2222822 2430646 2404344 2282695 2251680 2358672
14519B358672L1259K58110j11663J77672j86415K70334n7282K3277j22730k6034
$$ 2358672 2389931 2648041 2536378 2714050 2527635 2797969 2740687 2763964 2641234 2615200
14509B615200J15992J4938K34143J19271j60527O8348K09346l20986N4880J6926
$$ 2615200 2731192 2746130 2980273 3099544 2939017 3007365 3216711 2895725 2950605 2967531
14499B967531K81087j74452M27134n41131L66884J22417O9767p9717K15606o2423
$$ 2967531 3248618 3074166 3501300 2960169 3327053 3449470 3519237 3439520 3655126 3592703
14489C592703k09860L58299m47666L74159M29307J0809l06343J72874p7418m9730
$$ 3592703 3382843 3741142 3293476 3667635 4096942 4107751 3801408 3974282 3896864 3847134
14479C847134j51906K99050k99424L81250k8486K005J5940J62312K9524o7283
$$ 3847134 3695228 3994278 3694854 4076104 4047618 4049623 4065563 4227875 4257399 4190116
14469D190116O5834M38471o09643M91793K6947M28099l60262J42489m9750j0156
$$ 4190116 4255950 4694421 4084778 4576571 4603518 5031617 4671355 4813844 4764094 4753938
14459D753938k39094N12040n5181J80123l6232K60494l35711q747O42L80442j16527
$$ 4753938 4514844 5026884 4971703 5151826 5115594 5376088 5040377 5031630 5032272 5412714 5296187
14448E296187K58240K2847n0422L40683K50617l31985L61071j36049J39371j05792
$$ 5296187 5554427 5577274 5526852 5867535 6118152 5786167 6147238 6011189 6150560 6044768
14438F044768L76375M9481j0197K2772L92818l42923N0828J65597R0256Q9397
$$ 6044768 6421143 6470624 6460427 6483199 6876017 6533094 6583922 6749519 6839775 6929172
14428F929172j94963R30166l06975k32459O44647K2950P1774L31222Q9590N20560
$$ 6929172 6734209 7664375 7357400 7124941 7769588 7792538 7864312 8195534 8285124 8805684
14418H805684l24196M99918j49263j45111K73964k97476J58086M10182J94644
$$ 8805684 8481488 8981406 8832143 8687032 8960996 8663520 8821606 9231788 9426432
14409I426432j61558M50958k39396Q33689k34329Q10323l57047J66098K16457
$$ 9426432 9264874 9715832 9476436 10310125 10075796 10886119 10529072 10695170 10911627
14400A0911627N56J81317k7798n0020P9682L95965J93838K98897J14809P488Q24437
$$ 10911627 10912183 11093500 11065702 11015682 11095364 11491329 11685167 11984064 12098873 12106361 12930798
14389A2930798k5665K6551L91349K68439Q8781K20058L60139L77988L47443O18412
$$ 12930798 12905133 12931684 13323033 13591472 13680253 13900311 14260450 14638438 14985881 15604293
14379A5604293j88197L49685K18252O6299N53421K07038K18267K72716N69070
$$ 15604293 15416096 15765781 15984033 16050332 16603753 16810791 17029058 17301774 17870844
14370A7870844J90876P01990L79885N88135K3041N90486O00288N79879k74651
$$ 17870844 18061720 18763710 19143595 19731730 19754771 20345257 20945545 21525424 21250773
14361B1250773M82938L28447N54858M07815P30781L18084Q29679N52068N43509
$$ 21250773 21733711 22062158 22617016 23024831 23755612 24073696 24903375 25455443 25998952
14352B5998952J91232J026677N34324P96265Q06430J070842M82063P92692N52835
$$ 25998952 26190184 27216861 27751185 28547450 29353880 30424722 30906785 31699477 32252312
14343C2252312J169731Q33411P94772R65305J172745J123841P49284J296470J037485
$$ 32252312 33422043 34255454 35050226 36015531 37188276 38312117 39061401 40357871 41395356
14334D1395356J047417J562504J491492J385773J650231J442499J387413J658477
$$ 41395356 42442773 44005277 45496769 46882542 48532773 49975272 51362685 53021162
14326E3021162J910947J565708J742625K479169J992523K297104K219200K236481
$$ 53021162 54932109 56497817 58240442 60719611 62712134 65009238 67228438 69464919
14318F9464919K886310K509301K384701L317716K777538L517927L319723L802547
$$ 69464919 72351229 74860530 77245231 80562947 83340485 86858412 90178135 93980682
14310I3980682L836026L997402M618412M365409M658027M831805N783984N784739
$$ 93980682 97816708 101814110 106432522 110797931 115455958 120287763 126071747 131856486
14302A31856486O441709O358112O945503P081434P765267P866634Q878639Q968600
$$ 131856486 138298195 144656307 151601810 158683244 166448511 174315145 183193784 192162384
14294A92162384R725164J0065894J0612190J1729754J1530248J2607921J3062324
$$ 192162384 201887548 211953442 222565632 234295386 245825634 258433555 271495879
14287B71495879J3284073J4133582J4136565J4956106J4999660J5070517J4983664
$$ 271495879 284779952 298913534 313050099 328006205 343005865 358076382 373060046
14280C73060046J4989404J4348953J3629673J2894317J1538260J0052425P592928
$$ 373060046 388049450 402398403 416028076 428922393 440460653 450513078 458106006
14273D58106006L908136J631616K69601j791581m247565n471728o003741q411474
$$ 458106006 462014142 463645758 463915359 462123778 457876213 452404485 446400744 437989270
14265D37989270r430904j1269293j2674247j3887486j4645727j5361152j5816413
$$ 437989270 428558366 417289073 404614826 390727340 376081613 360720461 344904048
14258C44904048j5848039j5424917j5161596j4942878j3897511j4014449j2535477
$$ 344904048 329056009 313631092 298469496 283526618 269629107 255614658 243079181
14251B43079181j2684915j1626585j1089706j1022201p976511q757052q599758
$$ 243079181 230394266 218767681 207677975 196655774 188679263 179922211 171322453
14244A71322453q094871q040392p213918o918894o596373o187126m996961n759961
$$ 171322453 163227582 155187190 147973272 141054378 134458005 128270879 123273918 117513957
14236A17513957n044061n113746m345768m314412m152243l329430l695516l370875
$$ 117513957 112469896 107356150 103010382 98695970 94543727 91214297 87518781 84147906
14228H4147906l250063k914262l220562k506971l017883k236371k415663k334221
$$ 84147906 80897843 77983581 74763019 72256048 69238165 67001794 64586131 62251910
14220F2251910j900240k046558k145321j813538j685047j720286j012146j466824
$$ 62251910 60351670 58305112 56159791 54346253 52661206 50940920 49928774 48461950
14212D8461950j552273j407705j506729j665477p45222m84631j263420j504852
$$ 48461950 46909677 45501972 43995243 42329766 41584544 41099913 39836493 38331641
14204C8331641j299249q18091q62739q09515p54658q20592j364421o90167j253463
$$ 38331641 37032392 36214301 35351562 34542047 33787389 32966797 31602376 30912209 29658746
14195B9658746l75170m33907r55637l12663r96590n76036n28332p20884p73481
$$ 29658746 29283576 28849669 27894032 27581369 26584779 26008743 25480411 24759527 23986046
14186B3986046l44457n45549m98671l06449j005234j56696k75880n59534l60747
$$ 23986046 23641589 23096040 22597369 22290920 21285686 21128990 20853110 20293576 19932829
14177A9932829p17175m98510q53n66668j49714n28981m89647j30421r4698o47651
$$ 19932829 19215654 18717144 18716291 18149623 17999909 17470928 16981281 16850860 16756162 16108511
14167A6108511L9616o81590m60773j43589P6357m21391k350m62359k52937m33842
$$ 16108511 16148127 15466537 15005764 14862175 14938532 14517141 14514791 14052432 13799495 13365653
14157A3365653p2213j07013m84000R6510j69260n25937N7435k10893l50173m62418
$$ 13365653 13293440 13186427 12702427 12798937 12629677 12103740 12161175 11950282 11600109 11137691
14147A1137691J54068l60381M47296p94218k89454K27055j51k53854m34256K71672
$$ 11137691 11291759 10931378 11378674 10584456 10295002 10522057 10521906 10268052 9833796 10105468
14137A0105468o79380K33300l31050J59236k64342l78994J57692j75626k25404
$$ 10105468 9426088 9659388 9328338 9487574 9223232 8844238 9001930 8826304 8600900
14128H600900J2191m05939J27105K7981n09999Q450O1792j83314k9475l1970m45923
$$ 8600900 8613091 8207152 8334257 8362238 7852239 7860689 7922481 7739167 7709692 7677722 7231799
14117G231799q9061j2270k10445J28392K75561m62566j08274k1349j56874J83299
$$ 7231799 7142738 7130468 6920023 7048415 7323976 6861410 6753136 6731787 6574913 6758212
14107F758212l98900K4607o0627m1563l6230j7242L861k81335J73570m23855J71409
$$ 6758212 6359312 6383919 6323292 6281729 6245499 6228257 6232118 5950783 6124353 5700498 5871907
14096E871907l96895L52600l75074L57531m43628L0866k30668M8796L2336j26980
$$ 5871907 5475012 5827612 5452538 5810069 5366441 5397307 5166639 5215435 5247771 5120791
14086E120791q3920L5225m88356K86671j64947l6458O5335j20048j29054J05896
$$ 5120791 5036871 5072096 4583740 4870411 4705464 4669006 4734341 4614293 4485239 4591135
14076D591135j08574M1031o5180j10232O8900k92793Q1050p3445q954J74463o24594
$$ 4591135 4482561 4523592 4458412 4348180 4417080 4124287 4205337 4131892 4122938 4297401 3672807
14065C672807L61057j83740M28045J8444k95877M48070n81098L83498k16111J76656
$$ 3672807 4033864 3850124 4278169 4296613 4000736 4448806 3867708 4251206 4035095 4211751
14055D211751k56196m27502K99600j82832q4419J92544j04166n25211L85238p0036
$$ 4211751 3955555 3528053 3827653 3644821 3560402 3752946 3648780 3123569 3508807 3438771
14045C438771J38199l81997L48591m84800L0371L1075L60000l08043p7254j24905
$$ 3438771 3576970 3194973 3543564 3058764 3089135 3120210 3480210 3172167 3094913 2970008
14035B970008P4670r6891M6281L69910l06005j48938J07416j18813K37797J74975
$$ 2970008 3044678 2947787 2994068 3363978 3057973 2909035 3016451 2897638 3135435 3310410
14025C310410j71030m17349N7829K57007r1609j2522k29540k00125j6222K4845
$$ 3310410 3139380 2722031 2779860 3036867 2945258 2932736 2703196 2503071 2486849 2511694
14015B511694k25507L06823k27694K37664K7856p6191j65975j06642M1725L44395
$$ 2511694 2286187 2593010 2365316 2602980 2630836 2554645 2388670 2282028 2323753 2668148
14005B668148l51227n08173J78057J00480J31566j21818j1039J76853o3243j16272
$$ 2668148 2316921 1808748 1986805 2087285 2218851 2097033 2085994 2262847 2199604 2083332
13995B083332o2758Q1955j44951K41704K80484J55804P36437K209668O325442
$$ 2083332 2020574 2102529 1957578 2199282 2479766 2635570 3372007 5581675 11907117
13986A1907117K3213798J1562065k1693529j2069352m637759k416413j027878
$$ 11907117 35120915 46682980 24989451 12920099 8282340 5865927 4838049
13979D838049o07131n32896k01106m21548m83654k23996r334K54602j23229j88176
$$ 4838049 4230918 3698022 3496916 3075368 2591714 2367718 2358384 2612986 2489757 2301581
13969B301581J60104l13218J93644j19419M2265R4318l63527L40528k17342q5924
$$ 2301581 2461685 2148467 2342111 2222692 2264957 2359275 1995748 2336276 2118934 2033010
13959B033010O6149j07975Q8443k40122k83958J83929L79361m23954J64919M4907
$$ 2033010 2099159 1991184 2079627 1839505 1555547 1739476 2118837 1694883 1859802 1904709
13949A904709J74580K45107l97321K92858l0941m57550J78673k80018J81090r8406
$$ 1904709 2079289 2324396 1927075 2219933 2188992 1731442 1910115 1630097 1811187 1712781
13939A712781j04925j69877K72061j06776Q3620l43978K21018Q4979J2696J60939
$$ 1712781 1607856 1437979 1710040 1603264 1686884 1342906 1563924 1648903 1661599 1822538
13929A822538k37334J47323n3787k63316J38569J61706o158l44959K03688R9421
$$ 1822538 1585204 1732527 1678740 1415424 1553993 1715699 1709541 1364582 1568270 1667691
13919A667691j2342k22030k04605j72075M12361j03457o3235R9834O9205j7156
$$ 1667691 1655349 1433319 1228714 1056639 1469000 1365543 1302308 1402142 1471347 1454191
13909A454191M2992l35939J09178K95838j94819p9868J8090M47731m24714l6807
$$ 1454191 1497183 1161244 1270422 1566260 1371441 1291573 1309663 1757394 1332680 1295873
13899A295873k72636L6387k04120O65640n9101m44263M81726j5580k39989J08588
$$ 1295873 1023237 1059624 855504 1521144 1462043 1017780 1499506 1483926 1243937 1352525
13889A352525k11418J87747L3321m346o50524O03331K03003m26399K86702l98110
$$ 1352525 1141107 1328854 1362175 1357829 707305 1310636 1513639 1087240 1373942 975832
13879I75832L76609j9030J4739l56706L05943k35071j43862Q3529Q7659K38204
$$ 975832 1352441 1333411 1348150 991444 1297387 1062316 918454 1001983 1089642 1327846
13869A327846l95486J49644L48372J43850o79478M4708M03398m23039O9108J18523
$$ 1327846 932360 1082004 1430376 1574226 894748 939456 1342854 919815 988923 1107446
13859A107446K3005L5175k30493J6356l8575N25657m12195k5734k8433j53028
$$ 1107446 1130451 1165626 935133 951489 912914 1438571 1026376 1000642 972209 819181
13849H19181J52269k13965M07330j36009n5229l9787L2756M9446l88553J22880
$$ 819181 971450 757485 1164815 1028806 973577 933790 966546 1015992 627439 750319
13839G50319J92431J2315N282j87940L66934j80150k37481J75673K00037m25675
$$ 750319 942750 955065 960347 772407 1139341 959191 721710 897383 1097420 671745
13829F71745k65277L13439J82749k48153L59941m100O4268k0231q7863j8547k20428
$$ 671745 406468 719907 902656 654503 1014444 1010344 1074612 1054381 966518 947971 727543
13818G27543J45732M5910l1536J8477p3337K5308k10830p7005J62881j00034O2161
$$ 727543 873275 919185 887649 906126 832789 858097 647267 570262 733143 633109 695270
13807F95270P0906K47473K03786n69030K77229J44563l77199M40232q2178l05680
$$ 695270 766176 1013649 1217435 648405 925634 1070197 692998 1133230 1051052 745372
13797G45372j2893J06432k26451K70489L2443J3696l32281L64626k2819k46400
$$ 745372 732479 838911 612460 882949 915392 929088 596807 961433 938614 692214
13787F92214n4022j88056K70865r7358L23786m66338L37881q697L33302k96223
$$ 692214 638192 450136 721001 623643 947429 481091 818972 810275 1143577 847354
13777H47354j84603J66602j49747o0053J48819Q0569l28666K71825k24491P6725
$$ 847354 662751 829353 679606 619553 768372 848941 520275 792100 567609 644334
13767F44334o3679K8052o4404J1730R3568r9741n1467L11492j27244j60375k01206
$$ 644334 580655 608707 544303 556033 649601 549860 498393 809885 682641 522266 321060
13756C21060m3119N21170l28328P9402K79318k36270J89395C26604P7180K14979
$$ 321060 277941 799111 470783 550185 829503 593233 782628 326604 403784 618763
13746F18763M0673j40868k57511M17583n1879K30381j38800j49500M75314m22715
$$ 618763 659436 518568 261057 678640 626761 857142 718342 568842 1044156 621441
13736F21441J6995q4599O2044O8335M206p2151O5125J8373k31967N03125m67229
$$ 621441 638436 553837 615881 684216 688422 616271 681396 699769 467802 970927 503698
13725E03698M4105j23516J13119K25293j52586j47263J44910K3636O5074k0970
$$ 503698 547803 424287 537406 762699 610113 462850 607760 631396 696470 675500
13715F75500C03217P3407O5699B09781L58454j63441J40714K71047k08243Q818
$$ 675500 303217 376624 442323 209781 568235 404794 545508 816555 608312 617130
13705F17130m1341K61142k16774o8769m6857J77942j31408A92409P6136j08910
$$ 617130 575789 836931 620157 551388 504531 682473 551065 192409 268545 159635
13695A59635L56046K51641P69k15418k30490j16689L93259j29437n6974A99777
$$ 159635 515681 767322 768091 552673 322183 205494 598753 469316 412342 199777
13684H17228C09664L19864r3118k63090J1194K02689P1621k47077j05677N68370
$$ 817228 309664 629528 536410 273320 284514 487203 558824 311747 206070 774440
13674G74440A14433K71895K54522B97181J35590J04972A59567J92730k0400N744
$$ 774440 114433 386328 640850 297181 432771 537743 159567 352297 331897 337641
13664C37641J9571G721M02327K20113N3216k85575J70569J85615k21649k32187
$$ 337641 357212 7721 410048 630161 683377 397802 568371 753986 532337 300150
13654C00150j029J04733N5977K07646k60483j40745K79832k60102A18250A9712
$$ 300150 299121 403854 459831 667477 406994 266249 546081 285979 118250 19712
13643B96795N15030I8996K06281j42227J01583J63163r1464L24598k49474n5416
$$ 296795 811825 98996 305277 163050 264633 427796 336332 660930 411456 356040
13633C56040l5742L7497j29055K31965P2794B21328J77636j66387R8744J98283
$$ 356040 320298 357795 228740 460705 533499 221328 398964 232577 331321 529604
13623E29604j59296q7421J14892p2832j1718J78175B02756J56158M0373M7930
$$ 529604 370308 282887 397779 324947 313229 491404 202756 358914 399287 447217
13613D47217j53636M03522j0745B83254K11876o9877l5583j09085K52624j43185
$$ 447217 293581 697103 686358 283254 495130 425253 389670 280585 533209 390024
13603C90024P801o7427m1898L99982B58090L8923A2791K26132j5079J0413K03709
$$ 390024 397825 330398 288500 688482 258090 297013 12791 238923 223844 234257 437966
13592D37966j58905M56872B71681L5487Q2134j54297q5979l2960R1732J6343C5754
$$ 437966 279061 735933 271681 307168 389302 235005 149026 116066 207798 224141 35754
13580G76035B81546K1118K72572j18525A56276L6321a69716B3351N9017K53211
$$ 776035 281546 302664 575236 456711 156276 192597 -169716 23351 82368 335579
13570C35579L0778J50071A99442o485E2090K22253l3808r9803n1504K04875P2941
$$ 335579 366357 516428 199442 192957 52090 274343 240535 140732 89228 294103 367044
13559C67044N095J81795j52941l0993J38289j32054j59269Q9116J39205B2077
$$ 367044 372139 553934 400993 370000 508289 376235 216966 306082 445287 22077
13548C65231A13363J49647K77339C0267K68401A20828K89143L0788k03101m6941
$$ 365231 113363 263010 540349 30267 298668 120828 409971 440759 237658 190717
13538A90717J84995E7828K48965L7839M1605H8073L19857A38234J27315j21187
$$ 190717 375712 57828 306793 344632 386237 88073 407930 138234 265549 144362
13528A44362M777J3943M9888K70864j13265j67677I2718Q9436q3531K70555A24523
$$ 144362 149139 163082 212970 483834 370569 202892 92718 182154 98623 369178 124523
13516F91128F3294K26183Q277L7206J33131j48519A35992K70204n5804B3946n339
$$ 691128 63294 289477 297754 334960 468091 319572 135992 406196 350392 23946 18607
13505A8607b55192C28994K6947N4407J6663o5148j41567l7978J909q8406N0815
$$ 18607 -255192 328994 355941 410348 427011 361863 220296 182318 184227 95821 146636
13494A46636O2342M2458I293N18878k15386o6995H2152K99096o3412O3467j50095
$$ 146636 208978 251436 9293 528171 312785 245790 82152 381248 317836 381303 231208
13483B31208K59873B43508M6966J39937k11880e3289B38587O0442j39651K8265
$$ 231208 491081 243508 290474 430411 218531 -53289 238587 299029 159378 187643
13473A87643R9950L6581J64739j97376k0090l1994J94535H5250J60585j0573D3395
$$ 187643 287593 324174 488913 291537 271447 239453 433988 85250 245835 235262 43395
13461B69514q3745K83726j29766j66400P6906K67155j79250N9535A57744K684
$$ 269514 185769 469495 339729 173329 250235 517390 338140 397675 157744 160428
13451A60428E65J48705P0639a21093B33790L23070h2680m8689d4823D48702o3981
$$ 160428 565 149270 219909 -121093 233790 556860 -82680 -131369 -44823 448702 384721
13440C84721j01990B8947L04492j44790J53930A62341K2143q8319a59931d4917
$$ 384721 282731 28947 333439 188649 342579 162341 184484 96165 -159931 -44917
13429C16217A37518b3004C80117A34154k6314O9663j4441p3395a28723B83978
$$ 316217 137518 -23004 380117 134154 107840 177503 163062 89667 -128723 283978
13418A59457K67109C6222p378K31361H1706d8389A39945J09313K223K3356B159
$$ 159457 426566 36222 28844 260205 81706 -48389 139945 249258 251481 274837 2159
13406I8974J91837j34239J01671J69311R5720e589E3294G924J87309q8413D3306
$$ 98974 290811 156572 258243 427554 523274 -5589 53294 7924 195233 106820 43306
13394B68038J64755G7073K3946K09723b15916C2319K38751R1305d16495A698f879
$$ 268038 432793 77073 101019 310742 -215916 32319 271070 362375 -416495 1698 -6879
13382E03577a58142j4216C3811K08879J2121E3684J84693p6005J88543f8281F5790
$$ 503577 -158142 -172358 33811 242690 254811 53684 238377 162372 350915 -68281 65790
13370C0496J36199k5760A6987R6904K1317K42520A23510k4011J79908A16611J95858
$$ 30496 166695 140935 16987 113891 135208 377728 123510 99499 279407 116611 312469
13359C12469R4588A78060j643L9453r5571K34980p5674K08347L436H8672b06255
$$ 312469 407057 178060 176417 215870 120299 355279 279605 487952 491388 88672 -206255
13347G2720K41944k6464l9332r8529M6143L0903l212m1719a2542E34715F6592
$$ 72720 314664 288200 248868 150339 196482 227385 224173 182454 -12542 534715 66592
13335E40540A77924R5014G4085K70172A57762m1643a144B70202j15647l6997j5362
$$ 540540 177924 272938 74085 344257 157762 116119 -1144 270202 154555 117558 102196
13324A02196J56278m1425J57860a71794C92679F2031J59510J39445j32257r4124
$$ 102196 258474 217049 374909 -171794 392679 62031 221541 360986 228729 134605
13314A34605J20359l3694n6426N7026r8201K37980A54176c8700B26866a33975
$$ 134605 254964 221270 164844 221870 123669 361649 154176 -38700 226866 -133975
13303B64259j05295l5813P7414e7470B77970K9245A00490a47401A66780J50304
$$ 264259 158964 123151 200565 -57470 277970 307215 100490 -147401 166780 317084
13293C17084i9321A14135b06203B45637a74935F5038I084K93748j6177J25773
$$ 317084 -99321 114135 -206203 245637 -174935 65038 9084 302832 286655 412428
13283D12428C2474J99633J6134q2142M4042k6549K6581A9577L86844A00172m6369
$$ 412428 32474 232107 248241 166099 210141 183592 210173 19577 406421 100172 53803
13272E3803Q8714a61973G4477P9042i2539j11342B07941b2475B24478b53752G0589
$$ 53803 142517 -161973 74477 153519 -92539 -203881 207941 -22475 224478 -253752 70589
13260a48882C10746a85441D59929a92700e523A94730K02856E4289b26695D14337
$$ -148882 310746 -185441 459929 -192700 -5523 194730 397586 54289 -226695 414337
13249g4806k009C2754A4384b1552k8705A95150J1021r3612J2982m1711M27886
$$ -74806 -76815 32754 14384 -21552 -50257 195150 206171 112559 125541 83830 511716
13238E11716j90755D3255b42872G757b472A27353n2359j9227J38457a01382C93129
$$ 511716 320961 43255 -242872 7757 -2472 127353 74994 55767 194224 -101382 393129
13226H5524a79227A66429a1439C926b0453A33842b79247B05145q9220J63786J11915
$$ 85524 -179227 166429 -11439 3926 -20453 133842 -279247 205145 115925 279711 391626
13215C91626b01358B31957E2137a13438B4233M5663k0398O7692J69669J02847
$$ 391626 -201358 231957 52137 -113438 24233 69896 49498 117190 286859 389706
13205C89706j20663j8412q5092m6829K41365r9253p2168h7968j03796A48128O9435
$$ 389706 269043 250631 165539 118710 360075 260822 188654 -87968 -191764 148128 217563
13194B17563C4168a88258N0675C42357A13599a5194B97421E7695a8682G6396A6041
$$ 217563 34168 -188258 -137583 342357 113599 -15194 297421 57695 -18682 76396 16041
13182a05044A8159b5513B07239J0457b17491A86248p4082K96327A68050j4919
$$ -105044 18159 -25513 207239 217696 -217491 186248 112166 408493 168050 153131
13172A53131A7626d6812H9313o61O2181o5972N5056c8476a6816l5305m5685A68812
$$ 153131 17626 -46812 89313 88652 150833 84861 139917 -38476 -16816 -52121 -97806 168812
13159h6915l2064a8034l2011p8320B2512J53765f8706B50239K3341A0694b87531
$$ -86915 -118979 -18034 -50045 -128365 22512 176277 -68706 250239 273580 10694 -287531
13147C25294E3038J67591a04097B09094N0652c4927C56419L7733b06336B9914
$$ 325294 53038 220629 -104097 209094 259746 -34927 356419 394152 -206336 29914
13136G8588R5702C5964K07994f4473j38761M7150B37708G0943K41265r8824J72702
$$ 78588 174290 35964 243958 -64473 -203234 -156084 237708 70943 312208 213384 386086
13125C86086A75433N4932a37905D3896K83045L7317m4638A52832J17692A09934
$$ 386086 175433 230365 -137905 43896 326941 364258 319620 152832 270524 109934
13114B40479B2244a3113A97969a43736j94229A4924R6492a6883C07954r3894a60499
$$ 240479 22244 -13113 197969 -143736 -337965 14924 111416 -16883 307954 214060 -160499
13102B09890o3610d7230D4638J39088a39910C41238a27048A9983g1501B84753
$$ 209890 146280 -47230 44638 183726 -139910 341238 -127048 19983 -71501 284753
13091A85221a31712e3941A219d1959C88018i4173F4762f326A10437J68762a76818
$$ 185221 -131712 -53941 1219 -41959 388018 -94173 64762 -6326 110437 279199 -176818
13079B48299a79481D52476k08252b9068j49228A55753F5423a51940p7783D5158
$$ 248299 -179481 452476 244224 -29068 -178296 155753 65423 -151940 -229723 45158
13068A26951i0432n4433B4987J18795a75385B61793J20368h1483A47724a79755
$$ 126951 -90432 -144865 24987 143782 -175385 261793 382161 -81483 147724 -179755
13057A44306B781a7411j5108C548J18591K55625A07614a75125A03348a96823h0134
$$ 144306 2781 -17411 -32519 3548 122139 377764 107614 -175125 103348 -196823 -80134
13045a05777E4241K03427I6874a23171C4387J55394D9732d22278A56243A3229
$$ -105777 54241 257668 96874 -123171 34387 189781 49732 -422278 156243 13229
13034A40897K40388l3814g6864o373o8847B0419L63587a73134D2754O9683e4756
$$ 140897 381285 347471 -76864 -83237 -152084 20419 384006 -173134 42754 112437 -54756
13022A20423E1660J46088a6074A17119M9192A5568Q0595L2217e303G562K03250
$$ 120423 51660 197748 -16074 117119 166311 15568 96163 128380 -5303 7562 210812
13011B10812b0558j31725I7297J86762q2063P9402I0365K698R414e5749D9978
$$ 210812 -20558 -152283 97297 284059 201996 281398 90365 93063 102477 -55749 49978
12999A41984c2829a4675C73455h5846B9530c8071k07688d9946q259k07316H2270
$$ 141984 -32829 -14675 373455 -85846 29530 -38071 -245759 -49946 -58205 -265521 82270
12987E6235J0412a45938B24607g9338C38829n8001a13013j54552h0636A33704
$$ 56235 66647 -145938 224607 -79338 338829 280828 -113013 -267565 -80636 133704
12976a83514B4880J87010e627k869A0745a89404A22061i7110j50775a3733j11041
$$ -183514 24880 211890 -5627 -8496 10745 -189404 122061 -97110 -247885 -13733 -124774
12965a24774f1208F1256f9624d478A32886a62551A24522L3567a06104K6655k8682
$$ -124774 -61208 61256 -69624 -4478 132886 -162551 124522 158089 -106104 -79449 -108131
12954a08131A8370a67028d7719F8374N5451E6969R0028a55235I4266e3093B91851
$$ -108131 18370 -167028 -47719 68374 123825 56969 146997 -155235 94266 -53093 291851
12942h8597B17903l3344a08033m4536j21973a3541H5296a1603k52602Q9333b5403
$$ -88597 217903 184559 -108033 -152569 -274542 -13541 85296 -11603 -264205 -174872 -25403
12930A38419j9548J10245d86775d7786k3088j83628I755K64695D7282O2143a56026
$$ 138419 118871 229116 -486775 -47786 -70874 -254502 9755 274450 47282 109425 -156026
12918e3727E5218A4058b57632h2249R127B94989a23503q8902G6365K08089b25574
$$ -53727 55218 14058 -257632 -82249 -73122 294989 -123503 -212405 76365 284454 -225574
12906f5620a4108C44389a46364B80242a91131H3931R7599h0475j95615B28557
$$ -65620 -14108 344389 -146364 280242 -191131 83931 181530 -80475 -276090 228557
12895A59311o0823b85516k08554d5042C30153A43948b07640A25032e3867B8865
$$ 159311 98488 -285516 -494070 -45042 330153 143948 -207640 125032 -53867 28865
12884b63343E5713M5285O9982F1230e898I773K74147a00907J1033D14302B960
$$ -263343 55713 100998 170980 61230 -5898 9773 283920 -100907 -89874 414302 2960
12872A56542E125f7622l8515k0451j21303N9257F0261L15717D8565a02346C90558
$$ 156542 5125 -67622 -106137 -126588 -247891 -188634 60261 375978 48565 -102346 390558
12860f2729K4874C12455a65330H2809B4017J28142b64446H8311l6350a32087G1921
$$ -62729 -37855 312455 -165330 82809 24017 152159 -264446 88311 51961 -132087 71921
12848C91258h9906r1407b8215B25208I1888k245b3258B57647h9577E9653e1483
$$ 391258 -89906 -181313 -28215 225208 91888 89643 -23258 257647 -89577 59653 -51483
12836B18115A7664b87452l7211e2599A77589g9694n08546a09711E3997a34736
$$ 218115 17664 -287452 -324663 -52599 177589 -79694 -588240 -109711 53997 -134736
12825A02344k2828g0994D8472J6166k2578i3418b9825r7910A91745j4249b50762
$$ 102344 79516 -70994 48472 64638 42060 -93418 -29825 -127735 191745 177496 -250762
12813b3931A15478J16332d3184A15864C5751N2540d7587C33831f3412K4263A93050
$$ -23931 115478 231810 -43184 115864 35751 88291 -47587 333831 -63412 -39149 193050
12801a05502a3235j56551G5532Q3291p7293D479R9514a77822I7295b89505e1071
$$ -105502 -13235 -169786 75532 158823 81530 4479 103993 -177822 97295 -289505 -51071
12789H1497h5932A60206h2343B89952j06816a73325A62291G2643l3872c10533
$$ 81497 -85932 160206 -82343 289952 183136 -173325 162291 72643 38771 -310533
12778e459A12434J9313J21266a21064C7749g464q7168q0177o8773f8743A20427
$$ -5459 112434 131747 253013 -121064 37749 -7464 -94632 -174809 -243582 -68743 120427
12766b62512C41694f1496k2947j49599q4069a30916B31902b6347A84123b66854
$$ -262512 341694 -61496 -84443 -234042 -318111 -130916 231902 -26347 184123 -266854
12755i8122A21146D4448e1044l5318a9988k10591J10003A66615E1763e3439k6365
$$ -98122 121146 44448 -51044 -86362 -19988 -230579 -120576 166615 51763 -53439 -79804
12744g9804A70437J71219A07439a73658A32427f7156E5715e9320j6193j35275
$$ -79804 170437 341656 107439 -173658 132427 -67156 55715 -59320 -75513 -210788
12734b10788d801j20730A76359a2769k00576e4729A43031F7448A7849a93293A40574
$$ -210788 -4801 -125531 176359 -12769 -213345 -54729 143031 67448 17849 -193293 140574
12722A80682K3382n6887a7017D3620J33273f0762j34370j68808H1681J64707a54840
$$ 180682 204064 147177 -17017 43620 176893 -60762 -195132 -363940 81681 246388 -154840
12710E8627b61158d8006q5910A34730K02196J2580A35385h8809A15775J79954
$$ 58627 -261158 -48006 -133916 134730 336926 349506 135385 -88809 115775 295729
12700B95729j46188a26560K4816l6780L9518B73147a9896j86927O0031D75a79983
$$ 295729 149541 -126560 -101744 -138524 -99006 273147 -19896 -206823 -146792 475 -179983
12688E959b37915A38004k650j4499M9328l5579F3920l267J65504J49198a96055
$$ 5959 -237915 138004 135354 120855 170183 134604 63920 60653 226157 375355 -196055
12676C5999a51109A62846J31594C1723a22367p115B92929i203n5859k63903i1937
$$ 35999 -151109 162846 294440 31723 -122367 -129482 292929 -9203 -65062 -328965 -91937
12664c08044H8223N3617c25522g1647A65348B1280J0164e6855A01619l8325L7453
$$ -308044 88223 141840 -325522 -71647 165348 21280 31444 -56855 101619 63294 100747
12653A00747m5122a3202A84519J78761i3272B6158L13316j07421j01126c56547
$$ 100747 55625 -13202 184519 363280 -93272 26158 339474 232053 130927 -356547
12642A5853h3024C5750R18M5497J9887m059a57847N1723C0050b64281a28982B21882
$$ 15853 -83024 35750 36668 82165 102052 97993 -157847 -106124 30050 -264281 -128982 221882
12629a27432E49895F6649a36032A62405D7887L672K15270j11423i6312A01386
$$ -127432 549895 66649 -136032 162405 47887 51559 266829 155406 -96312 101386
12618a75780F5918J11838a49267C0506J95012b2279A87594b3357k27465O8419
$$ -175780 65918 177756 -149267 30506 225518 -22279 187594 -23357 -250822 -182403
12608a82403H0664f9877F498b19801A70644E4653Q5950g7862j02782Q221E16911
$$ -182403 80664 -69877 6498 -219801 170644 54653 140603 -77862 -180644 -172423 516911
12596A26276D3376e7016A52411d5976H9768O7327O2412q7016b10516B35768b49414
$$ 126276 43376 -57016 152411 -45976 89768 157095 219507 132491 -210516 235768 -249414
12584A78931D773M9167c86192e0455k12G1529b12567I7966e8032l1617j12103
$$ 178931 4773 53940 -386192 -50455 -50667 71529 -212567 97966 -58032 -89649 -201752
12573b01752k1354E3160a17818j486A06622b08704B534J683a82673O5919B40164
$$ -201752 -223106 53160 -117818 -119304 106622 -208704 2534 4217 -182673 -116754 240164
12561B3074K64161k0840r7550l8044J39066A6038K42428a76756k4870E364f8893
$$ 23074 287235 266395 168845 130801 269867 16038 258466 -176756 -201626 5364 -68893
12549D9498g8913j55352d7350P620D7815b71446j40305D6369a68278k5915Q9763
$$ 49498 -78913 -234265 -47350 -39730 47815 -271446 -411751 46369 -168278 -194193 -104430
12538a04430J4005C727K47839j9448a90358H4736a48270B16320a09538C92330
$$ -104430 -90425 3727 251566 232118 -190358 84736 -148270 216320 -109538 392330
12527a65926A68273K1273G0567J26586a27638A44251F5067b4860A99322a76678
$$ -165926 168273 189546 70567 197153 -127638 144251 65067 -24860 199322 -176678
12516a89883D2221L9351a95131E8627J25559f6636I9580h1826B84668b6804m927
$$ -189883 42221 81572 -195131 58627 184186 -66636 99580 -81826 284668 -26804 -31731
12505c1731L699k3055E3757b47637A9915b2643E8076J91210H458a67391J8220
$$ -31731 -28032 -51087 53757 -247637 19915 -22643 58076 249286 8458 -167391 -149171
12494a49171N4884C9681A3704a19976F20a28981P780A29461k1692e0073C8807
$$ -149171 -94287 39681 13704 -119976 620 -128981 -121201 129461 107769 -50073 38807
12482B31361e3840j17309A4247J74489r2278m7824K728J53701c1075l49373A58411
$$ 231361 -53840 -171149 14247 188736 96458 48634 51362 205063 -31075 -380448 158411
12470b90939J42852j18501A43082n436a61138e0907a127A16224E7262a62529J6854
$$ -290939 -148087 -266588 143082 137646 -161138 -50907 -1127 116224 57262 -162529 -145675
12459a45675D2403K8749B8069P1817J31155b78752B92346q0045l1938b48529h1702
$$ -145675 42403 71152 28069 99886 231041 -278752 292346 212301 180363 -248529 -81702
12447h043q4172n343k3020J0427d4263j4330C591e01208a47025k58147A560a2130
$$ -8043 -92215 -97558 -120578 -110151 -44263 -58593 3591 -501208 -147025 -405172 1560 -12130
12434d29518H4699j3302b93817O8972A76104f9790k2721l5701A5641a86264c5870
$$ -429518 84699 71397 -293817 -224845 176104 -69790 -92511 -128212 15641 -186264 -35870
12422a69031k9960d3006G5794R1169n1408c0336a771k8586E5397A0244a39847
$$ -169031 -198991 -43006 75794 166963 115555 -30336 -1771 -30357 55397 10244 -139847
12410b19363a07829E8743b06738k6320B27725a05296a7068B5358h1864j598j17710
$$ -219363 -107829 58743 -206738 -233058 227725 -105296 -17068 25358 -81864 -83462 -201172
12399b01172D0023a66534H8856h0114B57578I187K41129f0413j78730C409J8215
$$ -201172 40023 -166534 88856 -80114 257578 9187 250316 -60413 -239143 3409 21624
12388B1624K17069c9345C274d946A71369J1578g4674A13405J72562D3609f9682
$$ 21624 238693 -39345 3274 -4946 171369 182947 -74674 113405 285967 43609 -69682
12376E3561k1800a52040l0296I5368d082A82797J4457c979B16839b28416L6586
$$ 53561 31761 -152040 -182336 95368 -4082 182797 197254 -3979 216839 -228416 -191830
12365a91830p9492A09200E3963h5558k20013a21701A50412b07265a7392C232K9118
$$ -191830 -271322 109200 53963 -85558 -305571 -121701 150412 -207265 -17392 3232 32350
12354C2350R0946b10761L923P6096N6544A52573F6029d1393b0096L544D1469a17277
$$ 32350 123296 -210761 -206838 -130742 -74198 152573 66029 -41393 -20096 -16552 41469 -117277
12341C1464J6394k1546R8869a86728A78907c4837j23286G1185Q7286a50458A68411
$$ 31464 47858 26312 125181 -186728 178907 -34837 -158123 71185 158471 -150458 168411
12329A60718a9843I1158a22009D5574a68149c6436H5137K86996A66894E4456a11480
$$ 160718 -19843 91158 -122009 45574 -168149 -36436 85137 372133 166894 54456 -111480
12317B64374e4449k7424C28192O4553a47251A89455j2853a13044B69573D6256
$$ 264374 -54449 -81873 328192 392745 -147251 189455 176602 -113044 269573 46256
12306B86564F0912a6179q2291B31520B6544K63875d6677I8299B576L07376e0955
$$ 286564 60912 -16179 -98470 231520 26544 290419 -46677 98299 2576 309952 -50955
12294A97848e0245n7570A97761D7003K71051c1382C4231e7468A23832a4808C72867
$$ 197848 -50245 -107815 197761 47003 318054 -31382 34231 -57468 123832 -14808 372867
12282B36097A181M1971J43206E360K9814J52813b6060I0517K39601a06260D7230
$$ 236097 1181 43152 186358 5360 35174 187987 -26060 90517 330118 -106260 47230
12270A51566O4686E9723A6995a76523B09530r9013i3234K8113F3250J7042M13281
$$ 151566 216252 59723 16995 -176523 209530 110517 -93234 -65121 63250 80292 493573
12259D93573A32791g7241A08697P9377J061K611K94668g439C31177I7463R7167
$$ 493573 132791 -77241 108697 188074 189135 191746 486414 -7439 331177 97463 194630
12248A94630c66229C67927C5288h8097A79296d7900B62389i5061F6214M4240M22247
$$ 194630 -366229 367927 35288 -88097 179296 -47900 262389 -95061 66214 110454 532701
12237E32701A99484f115J334B88009J4684H4425k0512a21201j116A60307Q0072
$$ 532701 199484 -6115 -4781 288009 302693 84425 63913 -121201 -122317 160307 240379
12226B40379e2013J5387a0280A77373K3958E9142K33665j14081A7651L15675A28147
$$ 240379 -52013 -36626 -10280 177373 201331 59142 292807 178726 17651 333326 128147
12214A39878L2610K43930I0969J1723K46333F1089f039l001M055A269a49783l33547
$$ 139878 172488 416418 90969 102692 349025 61089 -6039 -9040 -4985 1269 -149783 -483330
12202d83330D51894b10249B90899n6516N275K26192A76747l3644a7995C17640
$$ -483330 451894 -210249 290899 234383 239658 465850 176747 143103 -17995 317640
12191A00969N4598L05185f0399B03434q7422a12297A39030J69478A14690d672
$$ 100969 155567 460752 -60399 203434 116012 -112297 139030 308508 114690 -4672
12180a22084D10386a08428B29620i4826A49077P446O21M4228b7581C12387D1404
$$ -122084 410386 -108428 229620 -94826 149077 156523 157144 201372 -27581 312387 41404
12168A47078j6493J22172J86980A30514M49251A85622j0887m8363P4359J8267
$$ 147078 130585 252757 439737 130514 579765 185622 174735 126372 200731 218998
12158B18998K38609c5215q0188A83897J11519a50040m3691C39378j15376a73681
$$ 218998 457607 -35215 -115403 183897 295416 -150040 -193731 339378 224002 -173681
12147A19446J85358D678f1876A67563d1709B47291h5856A30709a59479b02E5783
$$ 119446 304804 4678 -61876 167563 -41709 247291 -85856 130709 -159479 -202 55783
12135D71567A38202R6396J06822B0729J446J07942M01863A98880J51395I5272
$$ 471567 138202 234598 341420 20729 22175 130117 531980 198880 350275 95272
12124H7653H731K05324k492J86860P2373j37768n3122C5494Q7769D4808R4764
$$ 87653 8731 214055 211563 398423 470796 333028 279906 35494 123263 44808 139572
12113A39572n778i1456o7128A89130F1592J1087L0425C8604P6330E5439J74910
$$ 139572 133794 -91456 -158584 189130 61592 72679 103104 38604 114934 55439 230349
12102B30349C1534L39249j83028k8789R1049A18864O4062a37170A92006e7926
$$ 230349 31534 370783 187755 158966 250015 118864 182926 -137170 192006 -57926
12091G5381J16996e4539D0805n42J98191r4826L2352a92623B4902J78934b09010
$$ 75381 192377 -54539 40805 40263 238454 143628 175980 -192623 24902 203836 -209010
12079D3030C91a40198B86602o8505E4615A9141a85105N8524C9120Q5514K05116
$$ 43030 391 -140198 286602 218097 54615 19141 -185105 -126581 39120 124634 329750
12068C29750A7437a11463A28136O6937l9779C2366J0317a86021B28540a6701j12727
$$ 329750 17437 -111463 128136 195073 155294 32366 42683 -186021 228540 -16701 -129428
12057a29428a7557j14661A83087r1301q501a14854B19136h9523B35607b52004
$$ -129428 -17557 -132218 183087 91786 83285 -114854 219136 -89523 235607 -252004
12046B15743a11098B8130d5372F001L48137A55468O4231a30308o3616h0609B47257
$$ 215743 -111098 28130 -45372 6001 354138 155468 219699 -130308 -193924 -80609 247257
12034G1072K18342d5864D8954g8761B70614A27055a22231m91B06758a22985j2301
$$ 71072 289414 -45864 48954 -78761 270614 127055 -122231 -122722 206758 -122985 -135286
12023a35286J9536a000B31960e1248b2982B45462C1808a53449F5401J61457K7054
$$ -135286 -115750 -1000 231960 -51248 -22982 245462 31808 -153449 65401 226858 253912
12012B53912b69453r7286A75757e8637C7630g6263A40283a03380j10168J9695
$$ 253912 -269453 -366739 175757 -58637 37630 -76263 140283 -103380 -213548 -193853
12002a93853M4393K5383M5308H0965J38049h9921Q009C37229j14454a45538D3036
$$ -193853 -149460 -124077 -78769 80965 219014 -89921 -81912 337229 222775 -145538 43036
11990B96381A43894b78535J05023A9710c59522M7945B08944a70012M016j95517
$$ 296381 143894 -278535 -173512 19710 -359522 -311577 208944 -170012 -165996 -361513
11980c61513B01772a42440j95287h9886F3298b38443A59143l5925d1373A68832
$$ -361513 201772 -142440 -337727 -89886 63298 -238443 159143 123218 -41373 168832
11969c89009e5807A88122i2276n8513j53730A3643O8648l5695g5561c4522A78872
$$ -389009 -55807 188122 -92276 -150789 -304519 13643 82291 46596 -75561 -34522 178872
11957C6215K3545c2945A16834a64433D1603K08604m8722b79128e3049m82893B10054
$$ 36215 59760 -32945 116834 -164433 41603 250207 201485 -279128 -53049 -535942 210054
11945B25862E9847J17186a19339n0884K6262C66275a06750A66911b17550g139
$$ 225862 59847 177033 -119339 -170223 -143961 366275 -106750 166911 -217550 -7139
11934A34299b84396A23289k0620e8244A30907a15049A76923e6155B69167d51896
$$ 134299 -284396 123289 102669 -58244 130907 -115049 176923 -56155 269167 -451896
11923A20166J27823a31855k39948e1815q938I249d4350A62641b4757q9033A16548
$$ 120166 247989 -131855 -371803 -51815 -60753 9249 -44350 162641 -24757 -113790 116548
11911c18994G4044a78641E8550b0206l4584k22509J35896j96389C9023e250l4578
$$ -318994 74044 -178641 58550 -20206 -54790 -277299 -141403 -337792 39023 -5250 -39828
11900c9828B50267C4643e1517m0435A0361B770M20777j35608I9088A2564O6329
$$ -39828 250267 34643 -51517 -91952 10361 2770 423547 287939 99088 12564 78893
11889G8893L3591d6414j38649j5303A98899o6941B2637J97237b93821G4575N148
$$ 78893 112484 -46414 -185063 -200366 198899 131958 22637 219874 -293821 74575 79723
11878G9723J1715b79505A48295d5647H7171a10833A29557E4727a02914j13218
$$ 79723 91438 -279505 148295 -45647 87171 -110833 129557 54727 -102914 -216132
11868b16132A15051D5970R430d5627j5432K7456k88163A84549A2191A1a46680
$$ -216132 115051 45970 55400 -45627 -61059 -33603 -321766 184549 12191 11 -146680
11856c27788D334L60667j76749F2070J44016B2665J78217i0314D6272O6225a788
$$ -327788 4334 365001 188252 62070 206086 22665 200882 -90314 46272 112497 -1788
11844I0621b12307B2403c37931B10154m0981a38788I9211a22307N1610I245D99
$$ 90621 -212307 22403 -337931 210154 169173 -138788 99211 -122307 -70697 9245 499
11832b27623B7169i5089j55628B11136d5020A60383m9172n43b34221o811J11909
$$ -227623 27169 -95089 -250717 211136 -45020 160383 111211 110668 -234221 -241032 -129123
11821a29123G4360c8863k61155C22729j54301a61981E8829Q811b02369e0797A02685
$$ -129123 74360 -38863 -300018 322729 168428 -161981 58829 67640 -202369 -50797 102685
11809b74750h9152A11107a17280j64001R8936j03368I6316a504j03667g148j28017
$$ -274750 -89152 111107 -117280 -281281 -182345 -285713 96316 -1504 -105171 -7148 -135165
11798a35165k65091f6769j60297k51965A27200j3630J28994c58029A61835c94662
$$ -135165 -400256 -66769 -227066 -479031 127200 113570 242564 -358029 161835 -394662
11787a55009i961B47994a39253R545A06016K41687e1571j64516D988c9305o3181
$$ -155009 -9961 247994 -139253 -129708 106016 347703 -51571 -216087 4988 -39305 -102486
11776a02486l48428G800J38722d7833A16712A0244c32298B99858g2138B31780
$$ -102486 -450914 7800 146522 -47833 116712 10244 -332298 299858 -72138 231780
11765a95701g6171A96453i5191C5327a26076L0520q7094M6197B9235J20503g9774
$$ -195701 -76171 196453 -95191 35327 -126076 -95556 -182650 -136453 29235 149738 -79774
11753C50989i5797D5899a67206C13921a06092c508A64098o24P0011B580Q4588
$$ 350989 -95797 45899 -167206 313921 -106092 -3508 164098 163474 233485 2580 87168
11742H7168b13521j8996A79946H0575a92345J8004B22413I1106J56635D5993N2854
$$ 87168 -213521 -232517 179946 80575 -192345 -174341 222413 91106 247741 45993 98847
11731I8847b99278D2881c78493A48381J11470a07353k5150a2428m3665K0139A06404
$$ 98847 -299278 42881 -378493 148381 259851 -107353 -132503 -12428 -56093 -35954 106404
11719A79724G1694a74159A05385b94045I2243N288c27085a24201A88029d32396
$$ 179724 71694 -174159 105385 -294045 92243 97531 -327085 -124201 188029 -432396
11708A03028a52243K0504B8218J2963K24249b37386f7293C3503d8820J1465k07276
$$ 103028 -152243 -131739 28218 41181 265430 -237386 -67293 33503 -48820 -37355 -244631
11697b44631G3778A4284L14192E8669k7186c8206J4850B63547c4029B7678O5428
$$ -244631 73778 14284 328476 58669 31483 -38206 -23356 263547 -34029 27678 93106
11686I3106L1222i9925j6196A46741b0435f36A52974b08120A31383a04976E4764
$$ 93106 124328 -99925 -116121 146741 -20435 -636 152974 -208120 131383 -104976 54764
11674B69311a0109j72727A70157N0048K56220e7235B5678J49648H2131C3144a18974
$$ 269311 -10109 -182836 170157 220205 476425 -57235 25678 175326 82131 33144 -118974
11662A36476a00156B48675a48669A62707k431Q9045k3724B6336a73597A12778
$$ 136476 -100156 248675 -148669 162707 160276 249321 225597 26336 -173597 112778
11651G2279H260N1225r512K9172a09743J6154P73C4461J24629B4481L48245a18383
$$ 72279 8260 59485 49973 79145 -109743 -93589 -92816 34461 159090 24481 372726 -118383
11638B88229b27161A57161D8933g7963C0672a79391a7432o1903C18406I8920J04998
$$ 288229 -227161 157161 48933 -77963 30672 -179391 -17432 -79335 318406 98920 203918
11627B03918a22254j66304B04179f0213l3296q9386Q7021E35691g8733r6011J1275
$$ 203918 -122254 -288558 204179 -60213 -93509 -182895 -95874 535691 -78733 -174744 -163469
11616a63469o8482e3744C8686K21474p0791A9193b28527M1621A65158a20073C77124
$$ -163469 -231951 -53744 38686 260160 189369 19193 -228527 -186906 165158 -120073 377124
11604a22624l3198A32126a39579j7373D9811d4962A32468B6642i7004A66980a79197
$$ -122624 -155822 132126 -139579 -156952 49811 -44962 132468 26642 -97004 166980 -179197
11592H717J3093L4458a63230F0950L5608c2983j15605B11480b8155D29850j9970
$$ 8717 21810 56268 -163230 60950 96558 -32983 -148588 211480 -28155 429850 409880
11581D09880A97162D8457a0529r506l05596D9770K2027K6863a27261e2449L953
$$ 409880 197162 48457 -10529 -20035 -325631 49770 71797 98660 -127261 -52449 -48496
11570d8496H0794J88816C565P1049a15415A76060j0438J38719A6781L12561A56345
$$ -48496 80794 269610 3565 74614 -115415 176060 165622 304341 16781 329342 156345
11558D56020g0801B26980q9424A5494J11384J94176F1437K65222P3605d4940H9883
$$ 456020 -70801 226980 137556 15494 126878 321054 61437 326659 400264 -44940 89883
11546i833j33288A18826J5718j8390J1793d8025k24584B9206J18229D5044c24557
$$ -9833 -143121 118826 134544 116154 127947 -48025 -272609 29206 147435 45044 -324557
11534C47259a48056g1904D3030Q0360J6862Q6668f8760j02627B52020b70047B17036
$$ 347259 -148056 -71904 43030 123390 140252 226920 -68760 -171387 252020 -270047 217036
11522d662I8333N2668c7701G2075J40815J0289a8109E00662A09169P1332K71951
$$ -4662 98333 151001 -37701 72075 212890 223179 -18109 500662 109169 180501 452452
11511D52452A26334a31604A63627J54977j05058M6694F451R1048b5921k06773
$$ 452452 126334 -131604 163627 318604 213546 260240 6451 97499 -25921 -232694
11501b32694F8094a03884a275E2444K86257A10273g5338j76084a01613M6102B24378
$$ -232694 68094 -103884 -1275 52444 338701 110273 -75338 -251422 -101613 -55511 224378
11489b9551m811C12964I3856J16006E00a50083B47085b8574j48724A10687l0149
$$ -29551 -34362 312964 93856 209862 500 -150083 247085 -28574 -177298 110687 80538
11478H0538A3079P3025O7045J5849j506O3808a59626B44019K09232A96244J96654
$$ 80538 13079 86104 153149 168998 167492 231300 -159626 244019 453251 196244 392898
11467C92898A36917B7933R5638J26184o3745O3998c86407B88409J4017I1099R3961
$$ 392898 136917 27933 123571 249755 186010 250008 -386407 288409 302426 91099 185060
11456A85060a51619O9025J2655C8409K11439D8044a54408h963A55382c13994B56115
$$ 185060 -151619 -82594 -69939 38409 249848 48044 -154408 -8963 155382 -313994 256115
11444b05515P8213m151B83099d458o5857J4567a4462A19761b1517B4987f983A64134
$$ -205515 -127302 -131453 283099 -4458 -70315 -55748 -14462 119761 -21517 24987 -6983 164134
11431a24127d0785C8256Q3811c15536A32467E3372j0469A0039a62711A41363d8589
$$ -124127 -40785 38256 122067 -315536 132467 53372 42903 10039 -162711 141363 -48589
11419A74707A8523a42691B62037b69041B5215R6587K7963l1693e8112C9493b79027
$$ 174707 18523 -142691 262037 -269041 25215 121802 149765 118072 -58112 39493 -279027
11407g6725C5301L0050H690J50015c81795A91008r1297h5823m9705A67320n8715
$$ -76725 35301 65351 8690 158705 -381795 191008 99711 -85823 -135528 167320 108605
11396A08605J4484n9650i2592o2037A80487h6147j761J9708C20008d7566n5573
$$ 108605 123089 63439 -92592 -154629 180487 -86147 -87908 -68200 320008 -47566 -103139
11385a03139j287I4330J7277O4795a90719C55794b01706k5054H5499J75223b4173
$$ -103139 -104426 94330 111607 176402 -190719 355794 -201706 -226760 85499 260722 -24173
11373H6758l3841L5890J2241b5282p2988A46626o9505J38916j02619J54763E0348
$$ 86758 52917 88807 101048 -25282 -98270 146626 77121 216037 113418 268181 50348
11361g1997C34889a06792P63B46403e1486J3750A6505J7302J89269G4948a57903
$$ -71997 334889 -106792 -106029 246403 -51486 -37736 16505 33807 223076 74948 -157903
11349C6016L9824B2898P3975A5733J90511g039p4493C34157a21425B13999J4066
$$ 36016 75840 22898 96873 15733 206244 -7039 -81532 334157 -121425 213999 228065
11338B28065h5927A2577O9761a61549B8056d3711E0131b38173e7349B59428a98234
$$ 228065 -85927 12577 82338 -161549 28056 -43711 50131 -238173 -57349 259428 -198234
11326a77650C5024c9129Q06j15690A73598H001J10935b75526a09794A19566d46070
$$ -177650 35024 -39129 -38323 -154013 173598 8001 118936 -275526 -109794 119566 -446070
11314G4350l0230i9009B3443b16673i3457A29508K9569M0459I2102N1863I777
$$ 74350 44120 -99009 23443 -216673 -93457 129508 159077 199536 92102 143965 9777
11302B01851a00980A21348f1130o59A08585i9835m7988A89212a65382q0276b3852
$$ 201851 -100980 121348 -61130 -61789 108585 -99835 -147823 189212 -165382 -245658 -23852
11290e7085A10593f5418j50215J04393k45652A40939b02487n6823A00379K3173
$$ -57085 110593 -65418 -215633 -111240 -356892 140939 -202487 -259310 100379 123552
11280A23552a54658c6508H8640H425h8905E1721K3935O5269E3352N002A1464i0370
$$ 123552 -154658 -36508 88640 8425 -88905 51721 75656 140925 53352 58354 11464 -90370
11267d17979e374B1870b7798j27929D63510b479B55379h079k25719H9379c91527
$$ -417979 -5374 21870 -27798 -155727 463510 -2479 255379 -8079 -233798 89379 -391527
11255a31437A90638a41046O8197B31249h6094j09672l75387c0457B08232F9449
$$ -131437 190638 -141046 -72849 231249 -86094 -195766 -571153 -30457 208232 69449
11244A04174F443g4223m1947c8684R212A2584J93181a8769D8672b11239b5880
$$ 104174 6443 -74223 -116170 -38684 -29472 12584 205765 -18769 48672 -211239 -25880
11232G7829a89591c7121k33578e5881j52202h5424r4996N2116e6998j15505O8394
$$ 77829 -189591 -37121 -270699 -55881 -208083 -85424 -180420 -128304 -56998 -172503 -104109
11221a04109k06588a18321A64036F3468B0649a04632j61848B17469e095j15325
$$ -104109 -310697 -118321 164036 63468 20649 -104632 -266480 217469 -5095 -120420
11211a20420C2888d4557j06657j61830A10269b71014J35345D10831C2161b15474
$$ -120420 32888 -44557 -151214 -313044 110269 -271014 -135669 410831 32161 -215474
11200g0972N985G6133C1589g1729G268K65547b79757A78197n7497i0870J8843
$$ -70972 -64987 76133 31589 -71729 7268 272815 -279757 178197 120700 -90870 -72027
11189g2027q6776j52281O1168A4907a6549G7318a91393b4712B15925a77881j1123
$$ -72027 -158803 -311084 -249916 14907 -16549 77318 -191393 -24712 215925 -177881 -189004
11178a89004K5528B23793b63065F9459J16078i1889A32605J8267a83261O606A85699
$$ -189004 -163476 223793 -263065 69459 185537 -91889 132605 150872 -183261 -176655 185699
11166a70318B21819a79167D0037O0860g7586A57114d07806B0903P730a66025A22107
$$ -170318 221819 -179167 40037 100897 -77586 157114 -407806 20903 28633 -166025 122107
11154B1503a80348j1165q7393a30158G1806K63988D7764M2531e6025a8338j81609
$$ 21503 -180348 -191513 -278906 -130158 71806 335794 47764 90295 -56025 -18338 -199947
11143a99947e1363k47303a18946A29631j6629a58561f8859M030A35653P7234b307
$$ -199947 -51363 -298666 -118946 129631 113002 -158561 -68859 -64829 135653 212887 -2307
11131c0806I6832a99038M9642f4478p2303a6846r1429A67860c41064E2200f285
$$ -30806 96832 -199038 -149396 -64478 -136781 -16846 -108275 167860 -341064 52200 -6285
11119a63199A44313j1364g9226L1268o8325j64014d7906A0472c77886J58918E9766
$$ -163199 144313 132949 -79226 -47958 -116283 -280297 -47906 10472 -377886 -218968 59766
11107b99615H6305e8659H7940O0896i5221B49051d045j22169d4270l3681A22123
$$ -299615 86305 -58659 87940 148836 -95221 249051 -4045 -126214 -44270 -77951 122123
11095a5556A23089J00531B7865N7378b5038j3408B03446G6335a20922D7774a18527
$$ -15556 123089 223620 27865 85243 -25038 -38446 203446 76335 -120922 47774 -118527
11083A84589J43343A31673J49725L6536E845L60372m7533R5163f6517A59532L08455
$$ 184589 327932 131673 281398 317934 5845 366217 318684 413847 -66517 159532 467987
11072D67987p6658i7066B08744b45974f2644B25470F3521J25538K48912L42170
$$ 467987 391329 -97066 208744 -245974 -62644 225470 63521 189059 437971 780141
11062G80141A34944J33501K47431J26488j45836j05232K49751B65913K31782n6966
$$ 780141 134944 268445 515876 642364 496528 391296 641047 265913 497695 440729
11052D40729J19459k46893M40017l05107K3855J89739j37810M9116k86126P7502
$$ 440729 560188 313295 753312 448205 472060 661799 523989 573105 286979 364481
11042C64481J5393M44837l84357k10225M59789A23911L16357K34769L52215l45057
$$ 364481 379874 824711 440354 230129 689918 123911 440268 675037 1027252 682195
11032F82195P5971B87552L74471p028k38421J94687Q501J56679r8360j59462J02588
$$ 682195 758166 287552 662023 654995 416574 611261 619762 776441 678081 518619 621207
11021F21207j34057R6094K27935k42040m8236B18820J80101K78830k15969N0101
$$ 621207 487150 583244 811179 569139 520903 218820 398921 677751 461782 511883
11011E11883N3605P2073k1114n4270p0933A08681M81129N1203K80132k41920k64008
$$ 511883 565488 637561 616447 562177 491244 108681 589810 641013 921145 679225 415217
11000D15217K12422k52552N2196j69425L93854k03437j99338N13755k63153L1157
$$ 415217 627639 375087 427283 257858 651712 448275 248937 762692 499539 530696
10990E30696m1666j13250L3601r7732M51270l31022L44200q8171L30369k91757
$$ 530696 489030 375780 409381 311649 762919 431897 776097 687926 1018295 726538
10980G26538p8821K32519q1049J83973N5269J35961O7824J75933L58373K1079
$$ 726538 647717 880236 799187 983160 1038429 1174390 1242214 1418147 1776520 1797599
10970A797599K43160o7159K97939Q3984k28523R1254l9844k251m08199j29344
$$ 1797599 2040759 1973600 2271539 2355523 2127000 2218254 2178410 2176159 1767960 1638616
10960A638616K72899l99464L5493j27158j9253Q0420J51366M49073k86765k5639
$$ 1638616 1911515 1512051 1547544 1420386 1401133 1481553 1632919 2081992 1795227 1769588
10950A769588j99889k21045l54727O9277k16406l50997j70382J22214o6803A72140
$$ 1769588 1569699 1348654 993927 1063204 846798 495801 325419 447633 380830 172140
10939A82192J69761J630o1486a38456f0003K3729H9662J47155a46858L2566B03969
$$ 182192 351953 353583 292097 -138456 -60003 -36274 89662 236817 -146858 -114292 203969
10927b9504A23529J37041N0994F4176O7013c1224A2158c48549h8850l2828q259
$$ -29504 123529 260570 311564 64176 131189 -31224 12158 -348549 -88850 -121678 -129937
10916a29937J3210a6385A11273a20231C25474A02876N4951b02603D0049a04105
$$ -129937 -116727 -16385 111273 -120231 325474 102876 157827 -202603 40049 -104105
10905A04631O2180J68730b74931i8475M6592B14939d1518k57396j04878A47271
$$ 104631 166811 335541 -274931 -98475 -51883 214939 -41518 -298914 -403792 147271
10894a00258B14735a60853B83904A9920b2168q1741H6029J2488l9693a79399D1591
$$ -100258 214735 -160853 283904 19920 -22168 -103909 86029 98517 58824 -179399 41591
10882a73108L1401M7294k74590a17079D8404B3153a33435C91207A37818b27030
$$ -173108 -141707 -94413 -369003 -117079 48404 23153 -133435 391207 137818 -227030
10871i0206A4777K0357a9009C15464e1103a6863B945b87776A30195l9861h766
$$ -90206 14777 35134 -19009 315464 -51103 -16863 2945 -287776 130195 90334 -8766
10859D2005a13896m1810A25283m4309K49367k4389b34493K528P3211B90261A12369
$$ 42005 -113896 -155706 125283 80974 330341 305952 -234493 -231965 -158754 290261 112369
10847a04648H8827L0943E0894a44749C9074a16917A04210J42397A03210a19734
$$ -104648 88827 119770 50894 -144749 39074 -116917 104210 246607 103210 -119734
10836b13527A20856b25568L5144A18609c9224B56390c49368a51706j5428F7458
$$ -213527 120856 -225568 -190424 118609 -39224 256390 -349368 -151706 -167134 67458
10825C8777a68498I7616a19223r5656p9736J19600g3827j96715r988C22919a21853
$$ 38777 -168498 97616 -119223 -214879 -294615 -175015 -73827 -270542 -280530 322919 -121853
10813a92317P0084A05771c91579f1271B5771L8624P1685a22115j8852A56208b65251
$$ -192317 -122233 105771 -391579 -61271 25771 64395 136080 -122115 -140967 156208 -265251
10801a81158j1677p263D6395L03824C3464a15274A00567J28385a10137m9050I8250
$$ -181158 -192835 -200098 46395 350219 33464 -115274 100567 228952 -110137 -159187 98250
10789A0746i0802J5759m92740A9560J90743b61631e3728I692b33255N8099h6745
$$ 10746 -90802 -75043 -567783 19560 210303 -261631 -53728 9692 -233255 -175156 -86745
10777a61375I972a85864A27561a61235q1482D7881a73431Q5772A41163K7675f8490
$$ -161375 9972 -185864 127561 -161235 -242717 47881 -173431 -87659 141163 168838 -68490
10765H0406q757a98730j7601M6796N7602B1076c69168A71084b69028a23805B09459
$$ 80406 71649 -198730 -216331 -169535 -111933 21076 -369168 171084 -269028 -123805 209459
10753d146l66599p3491C2100N5444b53068m6908k34282f4519k12793R5358A52009
$$ -4146 -370745 -444236 32100 87544 -253068 -299976 -534258 -64519 -277312 -181954 152009
10741a22299a0339B1711a04346F1697j0524f814k44971I5665g0568b6148j82502
$$ -122299 -10339 21711 -104346 61697 51173 -6814 -251785 95665 -70568 -26148 -208650
10730b08650q323N0555D6725J20966b01529D6154e3255b139l19483C1915i9114
$$ -208650 -216973 -166418 46725 167691 -201529 46154 -53255 -2139 -321622 31915 -99114
10718B25389f4427p3281F856J21119J83352j1237a62921A20867a84341h4602C28576
$$ 225389 -64427 -137708 6856 127975 311327 300090 -162921 120867 -184341 -84602 328576
10706b65991a19257l5415A19894R2191b9318A96040i0973c562k32349b4231H151
$$ -265991 -119257 -154672 119894 212085 -29318 196040 -90973 -3562 -235911 -24231 8151
10694b5003C8442O5698a17678r9289A32807K326b55593J12868P0005L992d53H7681
$$ -25003 38442 104140 -117678 -216967 132807 135133 -255593 -142725 -72720 -68728 -453 87681
10681G1930f2514A69152b97197A20247B8537J06253D3783a19349M6911k68383
$$ 71930 -62514 169152 -297197 120247 28537 134790 43783 -119349 -72438 -340821
10671c40821N1940D648K06414r929a02155r9973e9675F2153b15768Q0288r2753
$$ -340821 -288881 4648 211062 201133 -102155 -202128 -59675 62153 -215768 -135480 -228233
10660b28233P2603f9510C9464M0088a42098j86769J20441B5439a35842H2624J94840
$$ -228233 -155630 -69510 39464 79552 -142098 -328867 -208426 25439 -135842 82624 277464
10649B77464B9835a39881a8820j64248g3677k03194C27582c29875I378a48092
$$ 277464 29835 -139881 -18820 -183068 -73677 -276871 327582 -329875 9378 -148092
10638b10921j67230D05835a24998J5030j53361a01150l2024r0428Q8253j45057
$$ -210921 -378151 405835 -124998 -109968 -263329 -101150 -133174 -223602 -135349 -280406
10628b80406Q6772R2912F6573c06180g8619J1453A19676l5586b38202i0042j05011
$$ -280406 -193634 -100722 66573 -306180 -78619 -67166 119676 84090 -238202 -90042 -195053
10617a95053B2425K54731A33223b19378F0477a89553Q1988B56676a37766c8895
$$ -195053 22425 277156 133223 -219378 60477 -189553 -107565 256676 -137766 -38895
10606A50295i4320A00642a62829B93661h8361E5432f1488l6189A71901l5459b11348
$$ 150295 -94320 100642 -162829 293661 -88361 55432 -61488 -97677 171901 136442 -211348
10594a63408A85152c44184P7676a22993J6485a2850m30815a66868c5666J6685
$$ -163408 185152 -344184 -266508 -122993 -106508 -12850 -443665 -166868 -35666 -18981
10584a8981k16800a14695H4670a36072E3174b01902F9261O889a84848c8272l8777
$$ -18981 -235781 -114695 84670 -136072 53174 -201902 69261 76150 -184848 -38272 -77049
10573g7049c472H8310C6606a29356j72479i0480I4397o014b08166e9778A89250
$$ -77049 -3472 88310 36606 -129356 -301835 -90480 94397 88383 -208166 -59778 189250
10561a45124A76862L7851L2840a27163n7451i1473C9043g2550b3727q7006I9446
$$ -145124 176862 214713 247553 -127163 -184614 -91473 39043 -72550 -23727 -110733 99446
10549d71107D5475c0345E6398J14097c71086F9130N8728a74021A77716M1829b9590
$$ -471107 45475 -30345 56398 170495 -371086 69130 127858 -174021 177716 219545 -29590
10537I1353Q6070c4230o4868M837G7989J8981c25011A11953c517D8497a32844
$$ 91353 177423 -34230 -99098 -94261 77989 96970 -325011 111953 -3517 48497 -132844
10525g6272A05931b44276j63622I7575a46892J9454j53072M4832R3670p9242P7345
$$ -76272 105931 -244276 -407898 97575 -146892 -127438 -280510 -235678 -142008 -221250 -143905
10514a43905N8424j48635A91930J2411d5474E34767a85833l0947A37782l5487
$$ -143905 -85481 -234116 191930 204341 -45474 534767 -185833 -216780 137782 102295
10504A02295a59495k00504g3195G1995m796c27750a63437j44228a29229c6318
$$ 102295 -159495 -359999 -73195 71995 67199 -327750 -163437 -307665 -129229 -36318
10493A79151F2331b8102e258m1970H123K47205h5029G8938a24382L6153j96742
$$ 179151 62331 -28102 -5258 -47228 8123 255328 -85029 78938 -124382 -88229 -284971
10482b84971a1252k5405I7406C8688J72747g093B75917p8405J69773r1676N5865
$$ -284971 -11252 -36657 97406 38688 211435 -7093 275917 197512 367285 275609 331474
10471C31474j60633O3022d3585B39748f04I1178e608o2287J458k35907J43828
$$ 331474 170841 233863 -43585 239748 -604 91178 -5608 -67895 -66437 -302344 -158516
10460a58516a816j24031I9802F192a15388m7533l01206e4004n8402j43345B2717
$$ -158516 -1816 -125847 99802 6192 -115388 -162921 -464127 -54004 -112406 -255751 22717
10448a49029F6668A0657O893b17726P8868E9466b46655N1021f0206R467C11551
$$ -149029 66668 10657 17550 -217726 -138858 59466 -246655 -195634 -60206 -50739 311551
10436c06630A75681F2568g8329k66986J59802P5328A45209D5561Q9375c8943k68911
$$ -306630 175681 62568 -78329 -345315 -185513 -110185 145209 45561 134936 -38943 -307854
10425c07854A89377a13633p9431b6739B33897a94641L2656A71486A8261g2696
$$ -307854 189377 -113633 -193064 -26739 233897 -194641 -161985 171486 18261 -72696
10414a2469A5875b37048I2342k3017B1457a54805g3256I6947g5917k7563j60461
$$ -12469 15875 -237048 92342 69325 21457 -154805 -73256 96947 -75917 -103480 -263941
10403b63941A62665m8227b59460C57414g0197k46979B27227i5186N856k0898L541
$$ -263941 162665 114438 -259460 357414 -70197 -317176 227227 -95186 -89330 -110228 -106687
10392a06687N929A5122a11805j49059M1782A21049J20004C3743g2134K733H7507
$$ -106687 -100758 15122 -111805 -260864 -219082 121049 241053 33743 -72134 -69401 87507
10380c75000a34517D5643K83702q3372D3207A1754K84621A34921N3106J94979
$$ -375000 -134517 45643 329345 245973 43207 11754 296375 134921 188027 383006
10370C83006j35366K7157c8236C05825F7011R7032L74641B30027J98883I1658
$$ 383006 247640 274797 -38236 305825 67011 164043 538684 230027 428910 91658
10359E71202B58894J14566k5297c22890B41616q523i339A76073K53180A88020
$$ 571202 258894 373460 348163 -322890 241616 233093 -9339 176073 429253 188020
10348C51296R9041K38065k28919A19012P9346P6953j0042L04138j33949I2214
$$ 351296 450337 688402 459483 119012 198358 275311 265269 569407 435458 92214
10337A81946J9472K54424F6061Q9366m1671A8662P5557O2274I149K07939J101
$$ 181946 201418 455842 66061 155427 113756 18662 94219 156493 9149 217088 218189
10326B18189E4936J86027A7563J81505h1202A29347h953j77590H0381P1256n0526
$$ 218189 54936 240963 17563 199068 -81202 129347 -8953 -186543 80381 151637 101111
10315A01111i1110H234g5402A1903J76826B5872e5154g50B98339j49144a17123
$$ 101111 -91110 8234 -75402 11903 188729 25872 -55154 -750 298339 149195 -117123
10303a19510c9633H4114K3420C7778a49043M3750q1769e9850a7434j96931G404
$$ -119510 -39633 84114 107534 37778 -149043 -105293 -187062 -59850 -17434 -214365 7404
10291d689n7487I6737b50768F0276E706P2005K1493a19703B8155L13819a2216
$$ -4689 -62176 96737 -250768 60276 5706 77711 99204 -119703 28155 341974 -12216
10279B08605a19781B7092G685c49048A81372l8020b96938D7900B3676K48955P3264
$$ 208605 -119781 27092 7685 -349048 181372 143352 -296938 47900 23676 272631 345895
10268C45895a0998B6551r10R2629a91094A44740a93812H6656j94d530A71556l3640
$$ 345895 -10998 26551 25641 118270 -191094 144740 -193812 86656 86462 -4530 171556 137916
10256A37916n4932f59C71954J06934G7316k9878g4998D4459K50849P1591B6849
$$ 137916 82984 -659 371954 478888 77316 47438 -74998 44459 295308 366899 26849
10244B6004J54070e32315I0294g8053n3139j72226a8371A38565c34237D4294h9635
$$ 26004 180074 -532315 90294 -78053 -131192 -303418 -18371 138565 -334237 44294 -89635
10232A20002a25539F66006a7202m3227B962c27708g2130H7179J93022e8376J7716
$$ 120002 -125539 666006 -17202 -60429 2962 -327708 -72130 87179 280201 -58376 -40660
10221d0660A0793L7776J02286a22763N8945j29402j22346j33156e1268l0344A84604
$$ -40660 10793 48569 150855 -122763 -63818 -193220 -315566 -448722 -51268 -81612 184604
10209F4080i0341H201J61170a52937b5984k68659J33914D3495L8531l1102h8821
$$ 64080 -90341 8201 169371 -152937 -25984 -294643 -160729 43495 82026 50924 -88821
10197g5463E4050f9701J9426G5556O507h1947A374h8418k26575d0556m8177k0135
$$ -75463 54050 -69701 -50275 75556 82063 -81947 1374 -88418 -314993 -40556 -88733 -108868
10185a08868d3550q8243G1065J46013a49757j50506B8709J32507e8703l6694B62397
$$ -108868 -43550 -131793 71065 217078 -149757 -300263 28709 161216 -58703 -95397 262397
10173i7244M6734A72233a9773r2022n8693I7479c94129a5089p0062l3548K0464
$$ -97244 -50510 172233 -19773 -111795 -170488 97479 -394129 -15089 -85151 -118699 -98235
10162i8235k43899G0827L5899a98672b0520n199j57309I4305R4656e2790A06856
$$ -98235 -342134 70827 106726 -198672 -20520 -25719 -183028 94305 188961 -52790 106856
10150d6187j52921j40049b0508k3327B839M4211Q6568a5432k79981a05597l6992
$$ -46187 -199108 -339157 -20508 -43835 2839 47050 133618 -15432 -295413 -105597 -142589
10139a42589B9738b51774J07060N4388q9971a5751A86475B8118f1758G8067a04145
$$ -142589 29738 -251774 -144714 -90326 -180297 -15751 186475 28118 -61758 78067 -104145
10127A66276b46275R3212j74616r1798A06517a05709b2371j60469d3810I277b16244
$$ 166276 -246275 -153063 -327679 -419477 106517 -105709 -22371 -182840 -43810 9277 -216244
10115h3214A83318a77506j43770e7361B3681c55570B21477b18837G1330c6038
$$ -83214 183318 -177506 -321276 -57361 23681 -355570 221477 -218837 71330 -36038
10104a78362h1619k93968a4911n9837B54483f1441J9043k6784l60392h6240l22794
$$ -178362 -81619 -375587 -14911 -74748 254483 -61441 -42398 -69182 -429574 -86240 -409034
10093d09034a09620I1277a11080p1350L8315e6238k35195b7994m1594j21739h2541
$$ -409034 -109620 91277 -111080 -182430 -144115 -56238 -291433 -27994 -69588 -191327 -82541
10081e6592p4957l35992a79550A12419D2612a68640c2517j28346k4472h6845p4231
$$ -56592 -131549 -467541 -179550 112419 42612 -168640 -32517 -160863 -185335 -86845 -161076
10070a61076A75041d6953k60473h7641J0134j50699P6233l8708l9437i4987M6353
$$ -161076 175041 -46953 -307426 -87641 -77507 -228206 -151973 -190681 -230118 -94987 -48634
10059d8634k80281O408L8357B58916H2187A7810O0740P1903M4602C4591O4151
$$ -48634 -328915 -322507 -284150 258916 82187 17810 78550 150453 195055 34591 98742
10048I8742f1159q5736o6512A0240c37861J06491g3652n5112K9971h245j99322
$$ 98742 -61159 -146895 -213407 10240 -337861 -231370 -73652 -128764 -98793 -8245 -207567
10037b07567A27342J77314i5209a1106A52672i2023A00176l4664n221e656A9857
$$ -207567 127342 304656 -95209 -11106 152672 -92023 100176 65512 60291 -5656 19857
10025D7668e9572l47177A93513d21712G4026b42951j05267a14653I1018L8355
$$ 47668 -59572 -406749 193513 -421712 74026 -242951 -348218 -114653 91018 129373
10015A29373a09296h521A79811G5138G659K31812B4551a25792F4482c5650r0907
$$ 129373 -109296 -8521 179811 75138 7659 239471 24551 -125792 64482 -35650 -126557
10004a26557J0600d6081G4427J66564a80635I0289a7919A00443b67428Q6897o7634
$$ -126557 -115957 -46081 74427 240991 -180635 90289 -17919 100443 -267428 -180531 -248165
9993b48165A72511J07090c32845A6987b44620A6520a75988j79618g2600G4038
$$ -248165 172511 279601 -332845 16987 -244620 16520 -175988 -355606 -72600 74038
9982d86002C60587A05624a8252m0181D9754b45033G4087A1932c7958G4912d68001
$$ -486002 360587 105624 -18252 -58433 49754 -245033 74087 11932 -37958 74912 -468001
9970f2790n0802D5766a55815J0287G5393J95517h6866D837a32658j41101J5188
$$ -62790 -113592 45766 -155815 -145528 75393 270910 -86866 4837 -132658 -273759 -258571
9959b58571j28290d8332B27839H7067c3657k33325F5144a98310d4864m726n7834
$$ -258571 -386861 -48332 227839 87067 -33657 -266982 65144 -198310 -44864 -49590 -107424
9948a07424C41374D4728c12807Q7407M9172B61832b17509P5494I8615D4281M0377
$$ -107424 341374 44728 -312807 -225400 -176228 261832 -217509 -142015 98615 44281 84658
9937H4658k5960d899j31202k2873p3820h6747B0145c61549J44000G748b09354
$$ 84658 58698 -4899 -136101 -158974 -232794 -86747 20145 -361549 -217549 7748 -209354
9925c25303C38850d6700k1228A15665f3808j75823k1195B60334J7293h1586k26071
$$ -325303 338850 -46700 -67928 115665 -63808 -239631 -260826 260334 277627 -81586 -307657
9914c07657C82210r3371d1496r6204H9358C3210c75301a33059D4457b60205a04830
$$ -307657 382210 288839 -41496 -137700 89358 33210 -375301 -133059 44457 -260205 -104830
9902f2513n7420j29608b3077j65713j24209D7425K24284b44388j6493J02386j5788
$$ -62513 -119933 -249541 -23077 -188790 -312999 47425 271709 -244388 -260881 -158495 -174283
9891a74283A07788B9976h163j14161j1611A14820b51816A04785m4110c48910A33007
$$ -174283 107788 29976 -8163 -122324 -133935 114820 -251816 104785 60675 -348910 133007
9879b3608j39871N0644l8744k66467b01069O330j77704E8813b37440A26296m4137
$$ -23608 -163479 -112835 -151579 -418046 -201069 -194739 -372443 58813 -237440 126296 82159
9868H2159P4129a28796c9641A1365c218j89048n1858N2143A87409a07984L7725
$$ 82159 156288 -128796 -39641 11365 -3218 -192266 -244124 -191981 187409 -107984 -70259
9857g0259j57447N2843E8733f7814j47052n6962g1648o6230C8130J80807c75733
$$ -70259 -227706 -174863 58733 -67814 -214866 -271828 -71648 -137878 38130 218937 -375733
9845B02163n5805P1406a91630B1893a8617n1182p2825E0884d228m42799K19704
$$ 202163 146358 217764 -191630 21893 -18617 -69799 -142624 50884 -4228 -447027 -227323
9834b27323a09021a8168P297j59835m5554I1105g2987L2389n3011Q557J9274A93507
$$ -227323 -109021 -18168 -10871 -170706 -216260 91105 -72987 -40598 -93609 -85052 -65778 193507
9821e2988j39127k02490f7596F1906k4164e5403C1718a92721L6201g5604q5926
$$ -52988 -192115 -394605 -67596 61906 37742 -55403 31718 -192721 -156520 -75604 -161530
9810a61530b9247n7866A24946I056a33206k52434a28500B05743b32922g9805A14177
$$ -161530 -29247 -87113 124946 9056 -133206 -385640 -128500 205743 -232922 -79805 114177
9798a5922k9462p85a6962j77236o4355d3142k75648c0023B28761a07783C0883
$$ -15922 -45384 -46169 -16962 -194198 -258553 -43142 -318790 -30023 228761 -107783 30883
9786C7982j6103J24911a11120K5453p9231H8838J7223K09249d61838a36552I7270
$$ 37982 21879 146790 -111120 -85667 -164898 88838 106061 315310 -461838 -136552 97270
9774A52621b09948n2480P7672E6623b09277A08128c86854J12612j23441a42765
$$ 152621 -209948 -262428 -184756 56623 -209277 108128 -386854 -274242 -397683 -142765
9763a17379e0614b0277A23634N9285o181c32222B29d1143k49107i2934m2943M9060
$$ -117379 -50614 -20277 123634 182919 176738 -332222 229 -41143 -290250 -92934 -135877 -86817
9751h6817A5327a14323A41640F3011a34773K637C1780e7016j47801n9225a06232
$$ -86817 15327 -114323 141640 63011 -134773 -132136 31780 -57016 -204817 -264042 -106232
9739B82391a05712K9410k4374o8286n8598O2290E1014N0433d07089a33874E836
$$ 282391 -105712 -76302 -100676 -168962 -227560 -165270 51014 101447 -407089 -133874 5836
9727b29288d36D1333a68274l23092a8146j05493j26748q0972a21907J9458Q953
$$ -229288 -436 41333 -168274 -491366 -18146 -123639 -250387 -331359 -121907 -102449 -93496
9716i3496A46494a60533k5575A23297a72651O8031j94640j0604f5296j65639a05020
$$ -93496 146494 -160533 -186108 123297 -172651 -104620 -299260 -309864 -65296 -230935 -105020
9704i9721j2529l17794J27484a1909k23771d883n4209J9882j60798f8166A09865
$$ -99721 -112250 -430044 -302560 -11909 -235680 -4883 -59092 -39210 -200008 -68166 109865
9692h8751j08227B5671b29150c825k5970B11922a27935j27532F0518a03434E6881
$$ -88751 -196978 25671 -229150 -3825 -29795 211922 -127935 -255467 60518 -103434 56881
9680i8497q5633f3050a1004j2118A85774a33964l49043B16214a07709B18624f030
$$ -98497 -184130 -63050 -11004 -23122 185774 -133964 -483007 216214 -107709 218624 -6030
9668A3176K1439N8615d8180a5108B05473B1900e3176C37830j65460b71824a7628
$$ 13176 34615 93230 -48180 -15108 205473 21900 -53176 337830 172370 -271824 -17628
9656c17279D8712b82050R1308E5845J16590a86591I891a970G2978d6146C0261
$$ -317279 48712 -282050 -190742 55845 172435 -186591 9891 -1970 72978 -46146 30261
9644A83217a61153d2796n0412j98585J02372A35100F6647a02950D4719A8074p292
$$ 183217 -161153 -42796 -93208 -291793 -189421 135100 66647 -102950 44719 18074 10782
9633A0782a43295k39334A804a14513j81666C9339K79699b76705D5933f25471h705
$$ 10782 -143295 -382629 1804 -114513 -296179 39339 319038 -276705 45933 -625471 -8705
9621A12360b31954J00171F5503h8672A77049a617j87699H1176d79224A41600c3005
$$ 112360 -231954 -131783 65503 -88672 177049 -1617 -189316 81176 -479224 141600 -33005
9609B63616c8512j4171B24089F7614P8525a04025m3806I5368B5426a63673j09797
$$ 263616 -38512 -52683 224089 67614 146139 -104025 -147831 95368 25426 -163673 -273470
9598b73470O11c5048R016k42925d7966j65866R3126l0527d1524p8981j27339r7463
$$ -273470 -272859 -35048 -26032 -268957 -47966 -213832 -120706 -151233 -41524 -120505 -247844 -345307
9586c45307B25364i309C10374j45241f6518k98772f1269Q939k91339A49114a50226
$$ -345307 225364 -9309 310374 165133 -66518 -365290 -61269 -52330 -343669 149114 -150226
9574c67801a43209j14678i9582r5464R5727L6693H1015a15602o348F7321J349
$$ -367801 -143209 -257887 -99582 -195046 -99319 -62626 81015 -115602 -121950 67321 68670
9563F8670J1850C5125c19281D5373g2566r8674P8686J1084m5695p7103m9607a04028
$$ 68670 80520 35125 -319281 45373 -72566 -171240 -92554 -81470 -127165 -204268 -253875 -104028
9550a08691n263A7705J81873M8158a1317n3899j85034L0396a6691j19128A40754
$$ -108691 -113954 17705 199578 247736 -11317 -65216 -250250 -219854 -16691 -135819 140754
9538C9801a58824L1250N6085A61373b26627p4970J22096n4122J10208G9637B4133
$$ 39801 -158824 -127574 -71489 161373 -226627 -301597 -179501 -233623 -123415 79637 24133
9526b80335i2757p0241k6807j01219h151B3796J54b16392c7101A18045C8504a73283
$$ -280335 -92757 -162998 -189805 -291024 -8151 23796 23950 -216392 -37101 118045 38504 -173283
9513e1313j22300Q2053k19886J5210p1864E8851c919j38013E9662K30002a44623
$$ -51313 -173613 -91560 -311446 -296236 -368100 58851 -3919 -141932 59662 289664 -144623
9501a10209k5765l10729m6575B58545b68118B2184M658a81B3788a53815M7459
$$ -110209 -135974 -446703 -493278 258545 -268118 22184 26842 -181 23788 -153815 -106356
9490a06356j87519J34970e6771A02069m7785B3180a32989e063m7828C9921b01250
$$ -106356 -293875 -158905 -56771 102069 54284 23180 -132989 -5063 -52891 39921 -201250
9478b8208l54026B37119a63345l12d3610G7903f0270j50410g2355k56435a09447
$$ -28208 -382234 237119 -163345 -163657 -43610 77903 -60270 -210680 -72355 -328790 -109447
9466b64197i1120L2371p1740O2810D481K71614H9925d29711J45724d284D3210
$$ -264197 -91120 -58749 -130489 -67679 4481 276095 89925 -429711 -283987 -4284 43210
9454a82617B4544L3514b09169B0518h6117A73073b3599p9601A98015N8787m7050
$$ -182617 24544 58058 -209169 20518 -86117 173073 -23599 -103200 198015 256802 209752
9443B09752B3434J04375a77758A0546b29002O8181r0718N1781i4515j6698A37792
$$ 209752 23434 127809 -177758 10546 -229002 -160821 -251539 -199758 -94515 -111213 137792
9431G2935e5014C272M5125b57196d4210j32902H1901a99516I3459b19079G3333
$$ 72935 -55014 3272 48397 -257196 -44210 -177112 81901 -199516 93459 -219079 73333
9419E9356J4439C5045L8200P0531c27782R9537D9126P9347c8998k9773A20534
$$ 59356 73795 35045 73245 143776 -327782 -228245 49126 128473 -38998 -68771 120534
9407A7597J00741f7365l5661A64833G4383a31063N9143I2184d6279A73069i6617
$$ 17597 118338 -67365 -103026 164833 74383 -131063 -71920 92184 -46279 173069 -96617
9395a17492A42535b53606b2599B26066a4956c411G9306a68028P5514E5545k0154
$$ -117492 142535 -253606 -22599 226066 -14956 -3411 79306 -168028 -92514 55545 35391
9384C5391L38043A12563b52102A11077a46779H8817b91848B7100a52506k21923
$$ 35391 373434 112563 -252102 111077 -146779 88817 -291848 27100 -152506 -374429
9374c74429a22667j6543j95k85285J87332D6504c8273D5775E07a22443j01571
$$ -374429 -122667 -139210 -139405 -424690 -237358 46504 -38273 45775 507 -122443 -224014
9363b24014d4203n447B38575e6833j86500a05702a0732j723j43735L1623K5938
$$ -224014 -44203 -49650 238575 -56833 -243333 -105702 -10732 -12455 -156190 -124567 -98629
9352i8629F8446A0252b70163B10303b95859d1640A02858i0025k76782g3936k36820
$$ -98629 68446 10252 -270163 210303 -295859 -41640 102858 -90025 -366807 -73936 -310756
9341c10756j5045F9331c114q4353C63423a86559b5244B44554c5511A96486G4364
$$ -310756 -325801 69331 -3114 -87467 363423 -186559 -25244 244554 -35511 196486 74364
9329a77334G5326c1197B1729c01365H4194a22648F0587d49614B4775c17958J34356
$$ -177334 75326 -31197 21729 -301365 84194 -122648 60587 -449614 24775 -317958 -183602
9318a83602K875k22298G1089j4425d5297a0979j05854j79638H80P4459c99762
$$ -183602 -180727 -403025 71089 56664 -45297 -10979 -116833 -296471 880 75339 -399762
9306a88805k4998A92331c21389n9968a8858A41773C8353c81518a13528J3791l47350
$$ -188805 -213803 192331 -321389 -381357 -18858 141773 38353 -381518 -113528 -99737 -447087
9295d47087a52011l8859J3178C6018b24507a3506A06534P4525K5778e05401d6411
$$ -447087 -152011 -190870 -177692 36018 -224507 -13506 106534 181059 206837 -505401 -46411
9283B1109d7810j68477A52015b02455g1600n5682r5378d7577l7181j19238A17780
$$ 21109 -47810 -216287 152015 -202455 -71600 -127282 -222660 -47577 -84758 -203996 117780
9271b08348P6167O2283A30950P3180E9715b24892c439F2111K8913a85471O3158
$$ -208348 -132181 -69898 130950 204130 59715 -224892 -3439 62111 91024 -185471 -122313
9260a22313B9815b0777j4329D453J249b7146p2723p4481q3370J05020j1914G8566
$$ -122313 29815 -20777 -35106 4453 5702 -27146 -99869 -174350 -257720 -152700 -164614 78566
9247G5935a20288q9734A4310h9859J0617C3614g0653l29241a91957o4865g9611
$$ 75935 -120288 -210022 14310 -89859 -79242 33614 -70653 -399894 -191957 -256822 -79611
9235c6686I7523J14690a32552A84832b61057A68368a65889j07520a18589k14519
$$ -36686 97523 212213 -132552 184832 -261057 168368 -165889 -273409 -118589 -333108
9225c33108f1835B83070A099a09052k26555H7951K15868f2899D3098d63843h7379
$$ -333108 -61835 283070 1099 -109052 -335607 87951 303819 -62899 43098 -463843 -87379
9213A76155A0438J18697f9255o2888p7120i4977l370l84069C34345a73740O9893
$$ 176155 10438 129135 -69255 -132143 -209263 -94977 -98347 -482416 334345 -173740 -103847
9202a03847J1739q9863M9412B9764e0221l127o1027b6634A33588d6309p0599C67001
$$ -103847 -92108 -181971 -132559 29764 -50221 -53348 -114375 -26634 133588 -46309 -116908 367001
9189b31856e0724B06517a23712l7894E2582c9539j17386j3737A64339g2065D9834
$$ -231856 -50724 206517 -123712 -161606 52582 -39539 -156925 -170662 164339 -72065 49834
9177g7820F0304R832a19805r7191a00083j04943I2014a25980R373q082B15753
$$ -77820 60304 70136 -119805 -216996 -100083 -205026 92014 -125980 -116607 -124689 215753
9165b8454j07675o0130H0390a13501M9299A3090a01179k4294C01391m5229j9434
$$ -28454 -136129 -196259 80390 -113501 -64202 13090 -101179 -125473 301391 256162 236728
9154B36728h0277E6597J04135a951A95984a58736d0930l0580q6295j81746A94354
$$ 236728 -80277 56597 160732 -1951 195984 -158736 -40930 -71510 -157805 -339551 194354
9142B29930a78869H5098b93279j517a43004d7042r4262L6626n6451k7701A20920
$$ 229930 -178869 85098 -293279 -294796 -143004 -47042 -141304 -104678 -161129 -188830 120920
9130A01223D9704h113B16573n7424o3191c09860c6643l8393n968l39085i9995
$$ 101223 49704 -8113 216573 159149 95958 -309860 -36643 -75036 -81004 -420089 -99995
9118b10914a2700H3636J27002H7661c5247o6187A22256b94525F4912d19223C59320
$$ -210914 -12700 83636 210638 87661 -35247 -101434 122256 -294525 64912 -419223 359320
9106c0264k22194j97345K11001f5519C58915a50009B670c8346E9402K29238a74627
$$ -30264 -252458 -449803 -238802 -65519 358915 -150009 2670 -38346 59402 288640 -174627
9094a12128F5423M9452b74137f1478k82431P5442e2054m8470D7712e2004j7557
$$ -112128 65423 114875 -274137 -61478 -343909 -268467 -52054 -100524 47712 -52004 -69561
9083f9561p6712A00304i7807j269A18442b6598r2389j51345L5837A01634b10939
$$ -69561 -146273 100304 -97807 -99076 118442 -26598 -118987 -270332 -234495 101634 -210939
9071A27209a51306A21041a56799d0237m3352l0935I8453a54383c9562B10017a88796
$$ 127209 -151306 121041 -156799 -40237 -83589 -114524 98453 -154383 -39562 210017 -188796
9059a82490n3437g9242c4275l9380C84410n9044i2282c5718C2322c09621B2173
$$ -182490 -235927 -79242 -34275 -73655 384410 325366 -92282 -35718 32322 -309621 22173
9047a33577B0051b05700A4535K9246a61251l45918a70003d0874j58315A91813
$$ -133577 20051 -205700 14535 43781 -161251 -507169 -170003 -40874 -199189 191813
9036B00417H023J75469i211n9721B497f6353b7107j45241m3286B17644k3882D2961
$$ 200417 8023 183492 -9211 -68932 2497 -66353 -27107 -172348 -215634 217644 193762 42961
9023b72354K5783e2637l5210E9723k2408f679j18874j39591a22615A21635e3606
$$ -272354 -246571 -52637 -87847 59723 37315 -6679 -125553 -265144 -122615 121635 -53606
9011g0023L4358q4636o9138g6233c4444i727a066B813J79179c75956A39725a09286
$$ -70023 -35665 -120301 -189439 -76233 -34444 -9727 -1066 2813 181992 -375956 139725 -109286
8998a9189o0021A29570h9156j49962a7190m16763A50603a31194k29256C36632
$$ -19189 -79210 129570 -89156 -239118 -17190 -433953 150603 -131194 -360450 336632
8987G7113h9634E1906d7457k41187a24737G653J41325d1700k27o1398L2406A16110
$$ 77113 -89634 51906 -47457 -288644 -124737 7653 148978 -41700 -41927 -103325 -70919 116110
8974E0813M344J9792L4286n197a73698L4442e7481k24971c5135p0358A32589K26368
$$ 50813 55157 74949 109235 104038 -173698 -139256 -57481 -282452 -35135 -105493 132589 358957
8962C58957a39033e9380R965q1865e8455D8124D089a1085k04760g3189K6857o1002
$$ 358957 -139033 -59380 -49415 -131280 -58455 48124 4089 -11085 -215845 -73189 -46332 -107334
8950a07334c0944k72996N6902a4936k00879J2759d6287b0195l29818a74302I8852
$$ -107334 -30944 -303940 -247038 -14936 -215815 -203056 -46287 -20195 -350013 -174302 98852
8938f0372J492j42821k8390H8393a49440I0839O2160D675g9735F7108a40851j54720
$$ -60372 -58880 -201701 -230091 88393 -149440 90839 152999 4675 -79735 67108 -140851 -295571
8926b95571D4974b85743b1019B80338L65067J029081M565913R768374D825723
$$ -295571 44974 -285743 -21019 280338 645405 1674486 6240399 16008773 4825723
8916A568982D03375L22486j08124B44435n4964a3633B23824K77538f9467B04544
$$ 1568982 403375 725861 617737 244435 189471 -13633 223824 501362 -69467 204544
8905C58403j67815E7017h0935C2055L5291M8401k6296i5688A19388a56690O9854
$$ 358403 190588 57017 -80935 32055 67346 115747 89451 -95688 119388 -156690 -86836
8894h6836H9176K19205b08339A90932a28490K3382j91678a18512b4546k31484
$$ -86836 89176 308381 -208339 190932 -128490 -105108 -296786 -118512 -24546 -256030
8884b56030F5997b95592f8623B10230i7373k5674b7322R57l86259J82363C28027
$$ -256030 65997 -295592 -68623 210230 -97373 -123047 -27322 -26365 -412624 -230261 328027
8872e1641A5044J88181b52137e4577l38567J92691d6483K2803k08084J15816B2562
$$ -51641 15044 203225 -252137 -54577 -393144 -200453 -46483 -23680 -231764 -115948 22562
8860e6836J2946j66699D7885a08984A05715b75426J11460G9305a00360p9976a1116
$$ -56836 -43890 -210589 47885 -108984 105715 -275426 -163966 79305 -100360 -180336 -11116
8848C51792C1670g2443D4293e15963c8383j8625q5005j10839B6732e344j95615
$$ 351792 31670 -72443 44293 -515963 -38383 -57008 -142013 -252852 26732 -5344 -200959
8837b00959A07433a73396h2788A19604d2285p6047j04204M5553D2436b52096j04143
$$ -200959 107433 -173396 -82788 119604 -42285 -118332 -222536 -176983 42436 -252096 -356239
$$ [...]
##END NTUPLES=NMR SPECTRUM
##END=
