
##TITLE=AC1319_SBAAH12148_6535496_yrQSxQsGen
##JCAMPDX= 6.0         $$ Bruker NMR JCAMP-DX V2.0
##DATA TYPE= NMR SPECTRUM
##DATA CLASS= NTUPLES
##ORIGIN= BRUKER
##OWNER= Administrator
$$ 1.72 TOPSPIN		Version 2.1
$$ 2012-07-17 16:35:03.109 -0500  Administrator@TOPSPIN
$$ Compression mode = diff/dup
##.OBSERVE FREQUENCY= 400.02188249412
##.OBSERVE NUCLEUS= ^1H
##.ACQUISITION MODE= SIMULTANEOUS (DQD)
##.ACQUISITION SCHEME= undefined
##.AVERAGES= 8
##.DIGITISER RES= 22
##SPECTROMETER/DATA SYSTEM= spect
##.PULSE SEQUENCE= zg30
##.SOLVENT NAME= COFFEE_meoh
##.SHIFT REFERENCE= INTERNAL, COFFEE_meoh, 1, 14.98509
##AUDIT TRAIL= $$ (NUMBER, WHEN, WHO, WHERE, PROCESS, VERSION, WHAT)
$$ ##TITLE= Audit trail, TOPSPIN		Version 2.1
$$ ##JCAMPDX= 5.01
$$ ##ORIGIN= Bruker BioSpin GmbH
$$ ##OWNER= Administrator
$$ $$ C:\Bruker\TOPSPIN/data/COFFEE/nmr/AC1319_SBAAH12148_6535496_yrQSxQsGen/10/pdata/1/auditp.txt
$$ ##AUDIT TRAIL=  $$ (NUMBER, WHEN, WHO, WHERE, PROCESS, VERSION, WHAT)
(   1,<2012-07-17 16:34:54.968 -0500>,<Administrator>,<TOPSPIN>,<go>,<TOPSPIN 2.1>,
      <created by zg
	started at 2012-07-17 16:33:48.421 -0500,
	POWCHK enabled, PULCHK disabled,
       configuration hash MD5:
       6B 1B 68 BB D9 2E 58 E2 7F 35 AD 54 07 DF 0E 41
       data hash MD5: 64K
       DD 21 69 96 A4 DE 35 C7 C2 6A CA 9E 74 2B 70 67>)
(   2,<2012-07-17 16:34:58.937 -0500>,<Administrator>,<TOPSPIN>,<proc1d>,<TOPSPIN 2.1>,
      <Start of raw data processing
       efp LB = 0 FT_mod = 6 PKNL = 1 PHC0 = 0 PHC1 = 0 SI = 32K 
       data hash MD5: 32K
       EF B9 C8 5B E3 D4 8F 91 21 39 D9 37 23 45 2B 71>)
(   3,<2012-07-17 16:34:59.234 -0500>,<Administrator>,<TOPSPIN>,<proc1d>,<TOPSPIN 2.1>,
      <pk PHC0 = 176.1163 PHC1 = 0 
       data hash MD5: 32K
       EB F3 BA F3 A0 95 2C 83 6D 3D D3 C5 79 16 5E 7D>)
(   4,<2012-07-17 16:34:59.421 -0500>,<Administrator>,<TOPSPIN>,<proc1d>,<TOPSPIN 2.1>,
      <abs ABSG = 1 
       data hash MD5: 32K
       B7 60 03 44 05 58 7A 05 2A EE 39 8A 89 28 0B 45>)
(   5,<2012-07-17 16:34:59.562 -0500>,<Administrator>,<TOPSPIN>,<proc1d>,<TOPSPIN 2.1>,
      <abs ABSG = 2 
       data hash MD5: 32K
       BE 3B B8 3D 79 31 B6 CC A4 A1 7D E9 36 F9 A1 9D>)
(   6,<2012-07-17 16:34:59.593 -0500>,<Administrator>,<TOPSPIN>,<proc1d>,<TOPSPIN 2.1>,
      <abs ABSG = 3 
       data hash MD5: 32K
       95 00 EA BD D0 FD 4D C5 A1 AA 5E AB 05 CC 91 6B>)
(   7,<2012-07-17 16:34:59.625 -0500>,<Administrator>,<TOPSPIN>,<proc1d>,<TOPSPIN 2.1>,
      <abs ABSG = 4 
       data hash MD5: 32K
       2E BA 7A 5F 75 D2 6A 02 C3 83 C7 8C 61 2C 7F 3E>)
(   8,<2012-07-17 16:34:59.656 -0500>,<Administrator>,<TOPSPIN>,<proc1d>,<TOPSPIN 2.1>,
      <abs ABSG = 5 
       data hash MD5: 32K
       B5 9F ED 28 62 0F 8C D3 C5 C4 6B 93 2B AD 93 86>)
$$ ##END=
$$ 
$$ $$ hash MD5
$$ $$ 15 8B A3 2E 90 77 4D DA 86 37 C4 DA ED AA 2D 98
##$RELAX= 
##$RELAX= 
##$RELAX= 
##$RELAX= 
##$RELAX= 
##$RELAX= 
##$RELAX= 
$$ Bruker specific parameters
$$ --------------------------
$$ [...]
150 150 150 150 150 150 150 150
##$TP07= 0
##$TPNAME0= <>
##$TPNAME1= <>
##$TPNAME2= <>
##$TPNAME3= <>
##$TPNAME4= <>
##$TPNAME5= <>
##$TPNAME6= <>
##$TPNAME7= <>
##$TPOAL= (0..7)
0.5 0.5 0.5 0.5 0.5 0.5 0.5 0.5
##$TPOFFS= (0..7)
0 0 0 0 0 0 0 0
##$TUNHIN= 0
##$TUNHOUT= 0
##$TUNXOUT= 0
##$USERA1= <user>
##$USERA2= <user>
##$USERA3= <user>
##$USERA4= <user>
##$USERA5= <user>
##$V9= 5
##$VALIST= <valist>
##$VCLIST= <CCCCCCCCCCCCCCC>
##$VD= 0
##$VDLIST= <DDDDDDDDDDDDDDD>
##$VPLIST= <PPPPPPPPPPPPPPP>
##$VTLIST= <TTTTTTTTTTTTTTT>
##$WBST= 2048
##$WBSW= 25
##$XGAIN= (0..3)
0 0 0 0
##$XL= 0
##$YL= 0
##$YMAX_a= 502743
##$YMIN_a= -637024
##$ZGOPTNS= <>
##$ZL1= 120
##$ZL2= 120
##$ZL3= 120
##$ZL4= 120
##$ABSF1= 14.98509
##$ABSF2= -5.573092
##$ABSG= 5
##$ABSL= 3
##$ALPHA= 0
##$AQORDER= 0
##$ASSFAC= 0
##$ASSFACI= 0
##$ASSFACX= 0
##$ASSWID= 0
##$AUNMP= <proc_prof1d_extract_pilot.lims>
##$AXLEFT= 0
##$AXNAME= <>
##$AXNUC= <1H>
##$AXRIGHT= 0
##$AXTYPE= 0
##$AXUNIT= <>
##$AZFE= 0.1
##$AZFW= 0.1
##$BCFW= 0
##$BC_mod= 0
##$BYTORDP= 0
##$COROFFS= 0
##$CY= 15
##$DATMOD= 1
##$DC= 0
##$DFILT= <>
##$DTYPP= 0
##$F1P= 0
##$F2P= 0
##$FCOR= 0.5
##$FTSIZE= 32768
##$FT_mod= 6
##$GAMMA= 0
##$GB= 0
##$INTBC= 1
##$INTSCL= 1
##$ISEN= 128
##$LB= 0
##$LEV0= 0
##$LPBIN= 0
##$MAXI= 10000
##$MC2= 0
##$MEAN= 0
##$ME_mod= 0
##$MI= 0
##$NCOEF= 0
##$NC_proc= -8
##$NLEV= 6
##$NOISF1= 0
##$NOISF2= 0
##$NSP= 0
##$NTH_PI= 0
##$NZP= 0
##$OFFSET= 14.98509
##$PC= 1
##$PHC0= 176.1163
##$PHC1= 0
##$PH_mod= 1
##$PKNL= yes
##$PPARMOD= 0
##$PPDIAG= 0
##$PPIPTYP= 0
##$PPMPNUM= 2147483647
##$PPRESOL= 1
##$PSCAL= 4
##$PSIGN= 0
##$PYNMP= <proc.py>
##$REVERSE= no
##$SF= 400.02
##$SI= 32768
##$SIGF1= 0
##$SIGF2= 0
##$SINO= 400
##$SIOLD= 32768
##$SPECTYP= <>
##$SREGLST= <1H.CDCl3>
##$SSB= 0
##$STSI= 32768
##$STSR= 0
##$SW_p= 8223.68421052631
##$SYMM= 0
##$S_DEV= 0
##$TDeff= 65536
##$TDoff= 0
##$TI= <>
##$TILT= no
##$TM1= 0
##$TM2= 0
##$TOPLEV= 0
##$USERP1= <user>
##$USERP2= <user>
##$USERP3= <user>
##$USERP4= <user>
##$USERP5= <user>
##$WDW= 1
##$XDIM= 32768
##$YMAX_p= 477893023
##$YMIN_p= -750161
##$CURPLOT= <Network HP LaserJet P1505>
##$CURPRIN= <$Network HP LaserJet P1505>
##$DFORMAT= <normdp>
##$LAYOUT= <+/1D_H.xwp>
##$LFORMAT= <normlp>
##$PFORMAT= <normpl>
##$SURQMSG= 1
$$ End of Bruker specific parameters
$$ ---------------------------------
##NTUPLES= NMR SPECTRUM
##VAR_NAME=  FREQUENCY,     SPECTRUM/REAL,   SPECTRUM/IMAG
##SYMBOL=    X,             R,               I
##VAR_TYPE=  INDEPENDENT,   DEPENDENT,       DEPENDENT
##VAR_FORM=  AFFN,          ASDF,            ASDF
##VAR_DIM=   32768,         32768,           32768
##UNITS=     HZ,            ARBITRARY UNITS, ARBITRARY UNITS
##FACTOR=    0.250966925370066, 1,           1
##FIRST=     8223.43324360094, -75908,       -156494
##LAST=      0,             -105500,         89685
##MIN=       0,             -750161,         0
##MAX=       8223.43324360094, 477893023,    0
$$ Real data points
##PAGE= N=1
##DATA TABLE= (X++(R..R)), XYDATA
$$ [...]
23881 -344319 -184246 -168057 18338 -85943 1514 -119429 -287591 76105 265272 124647 -81323
23869 -208393 -150464 -218500 8728 -298458 78899 352169 -321413 -64023 344669 -38328 161302
23857 105011 12349 -261237 55397 -94310 -322063 84119 117454 53189 97606 92371 28792
23845 -56909 -246114 -112440 -38274 -149271 322109 -89892 122482 -172099 -173600 -114935 201402
23833 -234444 -22656 -124918 -165766 155591 -112373 -72564 88345 -11258 327190 -126772
23822 265357 -214825 279126 75767 -59279 114026 243782 -103410 -264136 -255755 -258855 -254603
23811 -254603 -137734 -75599 20015 19991 335597 191757 -14299 53669 -144111 232110 -89504
23799 99612 32803 -298986 126663 281359 -67218 -298357 71171 -142337 19295 218867
23789 218867 33819 -108386 -283135 102548 140110 169971 -151276 -200162 182051 254216
23779 254216 -11068 -254056 177409 -65684 -38801 -23087 94079 182614 -104871 -237095 233218
23767 -87938 205898 8605 -65645 -5877 -21751 174245 52703 -14098 -192622 -278322 -363242
23756 -363242 -80557 -167648 31074 -254806 -312101 119003 -87505 -272045 -247256 198407 -100033
23744 -16246 224736 -290525 8319 -74162 10418 88617 -131250 96527 38740 -142184 -159880
23733 -159880 -48184 151202 85718 -251384 -168221 -249787 43850 -38337 18869 26343 -122094
23721 113509 20160 81947 -12212 30340 327565 -213656 28815 52795 -76113 -47126 -364399
23710 -364399 224644 -133730 90887 -172947 -40539 242765 226390 -81235 236830 10179
23699 177161 -27165 180065 -36207 -47581 -295771 -41095 -25644 -8795 101938 207787 198730
23688 198730 -522962 -243361 243356 144844 -17810 237705 -32717 -197549 274839 94819
23677 -129081 -138987 34199 293802 97171 -146065 -54925 -163033 -52081 -356828 -234963 51704
23665 -349673 40456 77924 133826 -177547 89639 -36506 305914 94438 65558 -11534 -24903
23654 -24903 22117 150136 -21683 -93103 106158 -176022 -61926 106193 -176202 -59153 -190120
23643 -190120 76785 -114356 -126941 185372 14631 155972 -40208 -246062 -105073 50756
23632 39206 31494 -353107 -307009 -231602 110377 -165824 -43589 7343 -386695 -134432 160777
23620 35513 102417 -183484 224197 -42345 -1699 -2859 271705 154281 -361868 30724 -28249
23608 -80899 -63229 31615 217462 -326207 32128 5962 -201132 -111959 -84064 55764 -243298
23596 450723 176522 148511 29829 -205823 244579 -29750 -170733 -134188 200585 11602
23585 68662 -18662 123779 28017 22622 84654 -61240 -33614 178039 130028 -240622 293928
23573 -99064 -181886 -119471 -33944 -241710 3216 47211 86168 74858 -8002 -376991 60919 87217
23561 87217 178316 -23375 10743 177140 -132762 -146514 -110558 -71427 245155 -105462 105280
23549 -26207 -156713 188818 -43738 42190 71340 77035 -65203 -364306 359110 -412741 -31334
23537 -89445 256186 -257925 -505762 60957 147963 -128241 -265821 -18003 -170909 178272
23526 -4883 166601 150050 -61974 30181 -84885 -48728 -120562 104017 274443 -129081 231631
23514 -73185 207976 122790 -222384 119304 96794 93103 246999 -70382 -247207 40136 37269
23503 37269 64110 -18328 158920 185095 -47136 417546 243515 121493 -59547 -60526 256070
23491 -168493 189902 -111381 106257 -481030 -104514 88168 -15407 37847 69735 225494
23481 225494 219495 -264153 -349134 187096 -65953 -164933 -435384 -140235 123469 156331 -313260
23469 60091 43169 142947 204089 -179105 62946 145334 24704 -11397 284103 -181910 113912
23457 -224469 -152212 -148686 -227070 -296654 -273042 -179072 192827 82127 -399654 1365 -59034
23445 -42441 -74950 3019 112050 -99765 88117 85525 269854 183735 -311231 -87999 -8581 -83901
23433 -83901 -484940 -62798 84868 -207924 -133615 -171351 56054 168385 -205197 -81293 -146351
23422 -146351 -50670 68702 39465 -29664 -189337 -45117 62069 211223 17274 58667 52909
23411 52909 -25025 128418 -3553 -119136 -168555 -54436 -263525 -114522 -144448 -36056 3729
23399 7329 162781 -83404 -298933 198024 366187 205207 -18324 43790 96646 234423 -76665
23387 168995 9722 262770 89333 345711 -145644 78732 -164492 -156096 82498 -66219 106432
23375 69099 34482 225972 -260804 -140534 30178 136790 -149639 -51934 -147580 145345
23364 -171004 89515 149551 155209 -76822 -217251 192004 103383 278152 40297 51141 52076
23353 52076 -79029 -76013 272111 -81760 18124 208242 -100426 -59258 24326 -107838 -109632
23342 -109632 -62774 -249087 -219995 11032 16748 33411 -59155 237038 303171 -150454 210689
23330 -338605 119682 -181316 -72105 -451 -78236 -334649 -354397 252461 22635 138382 34446
23318 -165415 -195468 157296 95740 -161356 -251175 214537 6163 47470 -267432 197348 -66944
23306 -38387 -60070 -295569 -541333 79979 274960 -73945 -6077 125721 -78921 -4948 42776
23294 41055 10892 -203471 -32168 -264666 -226379 -262244 98453 -163525 55905 -170526 -23935
23282 270408 187314 155702 40474 -382340 -215410 27196 26024 225107 -68729 28800 -91631
23270 177882 49363 -165334 -218711 303003 -130656 -128076 -219152 -491133 -94578 -72315 -201321
23259 -201321 228057 -359129 166144 173317 -269709 -115051 231619 -143534 -96626 131242
23248 139179 -192085 -186246 -115336 287165 146790 244335 -106752 119398 3325 228572 126272
23237 126272 80525 -14012 78096 -216456 95625 55587 -138189 -18721 -160430 -164184 -367244
23226 -367244 33497 52014 -195320 211986 -17339 -161387 205803 83851 -61100 -33821 189247
23214 272399 -324726 176439 64571 -22090 -71336 217403 99810 77988 -150541 -252152
23204 -252152 145867 -75724 -69262 125261 113512 -78562 34646 95018 -99136 -80362 11170
23192 161547 148402 -466942 222559 -246455 260350 -364959 -195543 -72484 -104380 -35728
23181 -70183 20474 189262 -130493 50253 -314303 257465 147733 -141102 203233 56417
23170 146750 151012 -18212 -23327 200528 158189 -166562 -11645 -72538 59398 211665 -57346
23158 80790 232808 163229 -54898 29664 -86401 -123768 4512 -249202 -241791 271965 269286 -172947
23145 188140 124542 -121940 -9129 -78693 113829 271469 -239536 63403 -27926 88415 13296
23133 -164066 -53994 114948 -323746 -30410 254531 -215588 44563 153607 104524 -348079
23122 -65991 -53985 -89024 58836 308958 241430 -43704 -245039 153076 272424 40008 -68079
23110 -184567 -325819 -60096 29157 -26851 297066 98659 136667 -120879 127129 -99008 -55805
23099 -55805 34301 -197623 -88232 164080 -10166 -39201 -127837 -124906 -165660 -187692 -7219 -44911
23087 -44911 1506 146828 115570 -93143 96267 -9987 -90209 140804 -83868 64455 109788 -127216
23074 223327 98367 143767 273946 51148 49654 -196519 -131845 -327730 213645 181940 214558
23063 214558 296994 48823 104768 128958 -153379 -29938 -386664 -78101 8791 -65078 -260442
23052 -260442 80604 -117153 -104115 -156000 143870 268984 137118 -26495 -116063 -169730 -276953
23041 -276953 -136023 -113631 251534 -15266 428040 -78104 47138 216623 -56006 -172433
23031 -172433 135982 164855 -240025 -190739 -131193 -25473 83554 -177385 -46384 117853 -135941
23019 130228 -65454 254113 -315634 -147689 129149 -327479 -171051 -342665 92422 -51433
23008 -149565 -97299 6820 196821 -12616 121281 -268263 292265 -27957 -177053 100576
22997 319218 -135198 138623 138427 -340583 -12534 167753 258419 266281 130197 -114682 93956
22985 24418 -425067 38072 -87245 18582 -98106 -29775 57446 -90193 -120373 -51094 -10081
22973 -174642 -146627 27213 -32525 80633 117769 89769 79168 157232 -165936 -124020 262000
22961 350888 98315 -186752 -189860 -92335 -145366 -190119 -176227 152210 245956 90163 -93417
22949 270562 -57500 253538 1602 102726 81653 30327 113817 73360 -263059 358700 87886
22937 -188924 -82930 -48956 119215 -122611 64957 -40747 -104555 -233497 -263539 -10598 95062
22925 181862 150772 -58733 345406 -361516 73859 -81500 -264513 -387289 -93443 -57097 -85254
22914 -85254 -244935 -240337 -111253 226755 -18112 105889 40932 -315915 139171 -214730
22903 -290258 -210273 -331618 -63832 -221317 130112 205868 -103386 -4382 -92364 249684 1450
22891 -176861 70270 5351 -179377 208391 -173913 212804 196449 161550 -64651 302533 -22966
22879 -327592 18376 -67351 -76325 -128714 -7892 -112354 137322 -80784 -321835 21068 115755
22868 115755 -190307 84951 308561 -169597 -88340 -26716 -338777 -146632 440278 178946
22857 -27774 157861 167286 -142590 -15286 295834 308474 12990 -103751 -130765 -149357 154047
22845 -137362 74610 84907 38363 -298903 73257 -47902 -98446 -36753 -267384 -138039 355627
22833 -160042 -108525 -198774 122819 68830 269043 449940 6308 -203630 -157323 134719 268753
22822 268753 -26052 111759 -86487 -40115 -143768 -11660 25751 -194388 -43802 -23792 119852
22810 47058 101245 8265 -383516 -233169 -162909 224487 132272 69247 -265313 -83740 -124951
22799 -124951 186287 135085 -241014 -90556 259328 236459 -117075 -432306 185042 7401
22788 -217005 151272 -72638 -16253 -28076 -12001 30305 -217589 17145 -86648 -220781 -429612
22777 -429612 69301 58808 401878 87891 -349409 304627 380039 184022 -122869 12439
22766 -133683 -103111 -176890 179554 3598 -198419 -25641 22867 -50576 -3793 -168556 -57197
22754 353557 -12712 -60616 -81345 163466 -25334 20530 232145 -101241 -12929 -15897 -172848
22743 -172848 -37787 -84843 74798 319605 26938 126979 429978 146841 -31315 -100246 208674
22731 -134084 53119 349156 -202790 180980 -11379 43435 115677 -204543 111047 -189637
22720 -220928 -148947 -196153 146861 -274825 116940 -2658 -187334 29173 -237244 -148007 931
22708 -9639 56186 -250094 -17583 82753 56129 33835 79897 -25247 -307452 -25566 -411832
22697 -411832 34374 -32994 -29115 -139681 -76006 383421 -307598 -259824 45214 -42244 -161075
22686 -161075 27167 -57938 170658 176608 -25522 -191984 -34765 100889 -25113 -135493 -106948
22675 -106948 -84364 -321936 17025 194505 70048 100787 -184684 184225 336157 -180254
22664 -509289 53231 -224443 -76158 153959 276515 -155164 175784 337373 16257 -143156
22653 201026 60395 -40583 188106 45636 -251529 -234917 -188669 -272726 -226400 -247871 -90127
22641 64002 -134682 113401 -302271 213210 33959 -249009 227936 24884 -339362 -52200
22630 102222 -41591 -213792 -34798 47136 98236 -147157 76695 -124266 -56070 153115 67208
22618 43370 266673 -162325 77143 -86502 -282611 -294777 -335346 -47055 -141288 17652 -150796
22606 14855 -337795 71416 72610 199920 32160 77024 -210321 -126891 -22607 5925 97170
22595 97170 -418876 174253 189356 320652 189411 -205237 203378 -183996 -112451 142272
22584 -188167 -194148 175258 -33441 28812 22482 -220744 -305057 -6578 -33275 -49351 -313022
22573 -313022 93120 46518 170172 -223993 -255760 -181559 251190 79291 -312358 -109583
22562 -28088 14116 -54332 74815 328345 167520 -408503 93688 137159 -324717 -344117 280981
22550 -203867 88797 -92144 384277 -280970 -181164 358270 -299048 90569 178446 -166446
22539 86820 -189902 23343 19562 -50327 123592 52860 -164888 289305 -89434 22664 -34426
22527 -103589 9725 15676 -221893 -269284 137548 245572 -249398 215106 101573 58911 42578
22516 42578 111896 -105818 -172743 -416497 33333 51385 -5089 -176219 -37509 2806 22160
22505 22160 -7101 -127179 311 37645 -208589 359654 -18691 -82598 -307926 -76973 3963 -323375
22492 -78560 -273119 343358 -176265 127368 -62462 -97623 -54919 92583 130423 167546 -268335
22480 156858 -258909 -42774 -231740 172722 12802 97514 1006 -87077 -154928 -68096 104819
22468 80471 -12013 -55281 -38022 -275462 -47674 -205100 106839 7072 -109005 -95911 -55285
22457 -55285 -42395 -178008 6720 48409 -131510 -107780 38383 116791 169540 -262935 100942
22445 197927 -71551 92433 48899 74682 -134372 -155441 -112045 15740 -75114 187995 -90690
22433 -91965 -327686 -86817 -87470 39566 -130689 59138 215805 -52794 106045 -315634 124446
22421 -217754 -44506 66380 222994 -155564 60677 -79006 178798 -325053 -93945 -40919 -24284
22410 -24284 54719 75326 -120578 40756 283334 -108236 -189712 186230 -237383 34877 148946
22399 148946 -350336 -77347 -225498 -768 36659 -43548 -60689 268104 215763 150597 -69506
22387 125531 207211 107816 96916 -37557 -158457 -87780 -23626 57012 98172 -183453 -296389
22376 -296389 -10631 115915 141911 -179245 -18896 -136967 63299 304281 166385 326768
22366 326768 -28274 152724 140795 -53480 -422893 -212051 -32634 219379 416704 -90711
22355 -186024 -172000 130168 -1474 50909 -44976 144003 -46485 -92989 87009 59636 -31077
22343 -174648 -226906 17840 37614 55681 -116111 -202959 -146566 -65549 -132329 136317 4769
22331 -327371 290174 -57833 -201947 27194 117303 13500 -17871 22912 158328 38486 -62064
22319 -186543 127664 -99587 -79222 -96812 44574 136485 83445 157008 -251615 69651 178131
22308 178131 84661 -275388 108657 -257938 -15497 86126 395528 -22102 44542 129476 -116949
22296 -105884 172227 -32527 -57826 -305865 -100106 -605 7631 -95433 -178537 86116 125503
22285 125503 264207 -178675 -261369 126764 24854 -137806 -235532 -386563 146499 7594
22274 -80581 -125411 -92300 269355 -66172 129690 119798 209270 -32759 100548 120285 190878
22263 190878 124849 -412195 -219404 -213444 -26922 -250044 -66919 -152976 -44704 -6329 177747
22251 -57822 -60630 82461 145283 -81381 -115050 -8259 89026 -129377 -412551 20667 100530 107781
22239 107781 -134330 145084 -111406 127739 291322 -107633 196071 39060 139388 6018
22228 112976 -276306 -13010 -10809 -86239 -196812 314154 -195116 -60297 -305564 102303
22217 -204244 -30590 -143104 -35279 -16641 41624 130909 -518930 80252 -11771 -352703 -107178
22205 -57067 64387 72832 -156923 83957 91060 -96457 103666 -131271 70598 87247 -24602
22193 -188508 50047 -326897 67539 5376 -65653 60600 -111321 255073 -172524 -141351 -143750
22182 -143750 -97739 -107342 -24518 -306125 -73769 -18535 18654 -153936 -325152 106151 141813
22171 141813 342483 -188961 273618 11991 6880 -271297 -32437 -388832 -72086 -82392 -270112
22160 -270112 -107440 -276052 -74129 -34825 -162515 131858 153550 -38728 -27877 110492
22149 -150337 -77321 -102781 107863 -115486 226437 -56824 -91058 -160523 88983 -240590 -30927
22137 -136666 -147603 86238 51009 -72138 107094 298568 216216 -29647 -259875 59074 -283018
22125 80751 12751 -181581 189169 88723 -45521 30084 -84674 45516 -48366 124063 76374
22114 76374 -42674 9672 -50452 -68961 22662 -35312 -119584 265154 -71474 -94667 -234748
22103 -234748 70672 -230156 -125220 -79218 -147276 102972 -80208 17032 -161834 -143291 -56046
22091 -70493 -25427 91059 -100508 -142379 135325 -197765 174822 232484 45836 -310588 158462
22079 268392 -49607 104693 98565 -139367 154239 -18194 -288565 -241534 -234877 22716 -117403
22067 -175331 29998 -215811 -35481 -183400 -119121 -161100 -304912 -298027 -22140 -39193 229549
22055 -53286 96690 -130169 191341 -324345 22771 -26242 -144291 -130855 -10986 234770 38741
22043 -267735 31490 -179395 9168 -304010 -225521 242149 -104422 122978 -108379 216797
22032 120005 155838 -40864 13214 -18097 -66999 -14561 -55397 195998 -41834 -48134 -164104
22021 -164104 -8089 -89825 -119813 229626 41618 3837 2671 -170 -10578 -186046 -20473 19181
22008 -378757 -10985 106643 141698 -26982 -215663 -287348 -139273 -352145 156356 -182463
21997 -232053 -98946 -61745 71150 -94724 186909 44998 -88301 -90823 -196298 -295166 -141238
21985 123606 -199607 -166028 -8023 -298680 30638 -407266 -213178 -102686 -455006 -90027
21974 269435 -32258 20931 -299450 456823 -134819 163098 208773 -52206 544914 -230159
21963 -188682 306669 -145283 48023 -98322 50216 -175201 28318 -76975 -112248 -108015 -28743
21951 230630 -455698 -132978 242401 62413 164214 -261411 54224 344264 -73427 -53788
21941 -53788 -211294 78801 -541667 70248 -239493 156671 -224453 -157061 -50263 -89935 -153425
21930 -153425 -261527 -46998 76220 170203 194835 -274052 -61666 -393347 -320208 34497 -26458
21918 -40654 224600 -67927 255617 207263 -195377 -37619 -163933 142851 -101610 -98132 22625
21906 -296667 390959 177614 -196927 -19865 -243666 192094 -46830 -32609 -98003 -302358
21896 -302358 -288318 -8903 -293021 214468 -129980 -199949 -110028 -30098 58090 -67173 -137086
21885 -137086 293264 -66716 164407 178170 -110344 154948 -67391 183685 -45269 24690
21874 -131012 143326 -28233 -141169 -196252 -12961 177745 -57040 -171627 -75326 146597
21863 38412 -11921 -208340 1495 -27109 -156550 -139378 258220 28337 -112274 -105998 -212083
21852 -212083 227274 -58194 23840 -207156 123925 -388636 75414 -360712 -318284 408 -6919
21840 51605 -252205 53381 -230252 -170909 -171862 -21471 -143473 16089 122219 92811 -70261
21828 -217227 -66326 -42845 -26901 146918 -58094 160308 5555 186292 44653 -111544 -202936
21817 -202936 109910 185968 -255693 393548 202512 -124127 154823 120660 86507 -335829
21806 -253698 -27908 261305 93031 -95003 -18403 163411 12195 114149 -38598 -45464 68567
21794 -125898 -21507 8725 -174482 -85193 18601 -27884 -287227 -198737 -318271 -150248 80350
21782 -446 -41502 -287416 -306539 -55601 -62021 123264 -191201 -17145 2564 -44971 92163 -59566
21769 34965 -229726 337947 52594 -293974 -67867 64723 242517 -211201 -329325 13328
21758 -88520 -102480 180086 357695 19629 -88407 -10648 20742 -240529 111700 -122755 -416392
21747 -416392 11953 -249656 -93349 -364628 -154894 171983 -119480 61235 -205492 51210
21736 -33976 252477 221377 109944 -94454 105410 -67559 -637 18477 -175944 -102118 -152142
21725 -152142 -134604 -117725 57564 -55913 193091 -81261 -89024 11260 30076 -58432 -143379
21714 -143379 40774 -198906 -101738 98069 -30205 15416 83588 164222 -229261 -246921 -98675
21702 -241271 350390 58729 -261971 -134514 -193864 -143187 372623 -228024 -103546 -290627
21692 -290627 -63176 111780 161906 -210257 -464230 -141653 -67338 12706 -14442 114290
21681 200583 241310 188718 174154 -77321 -261186 8961 74948 119196 49870 238854 100295
21669 122473 -75778 -54173 177100 -21146 -132544 -184739 -11598 -137862 178077 -238813
21658 -128326 -216666 -298701 -150532 20498 -189796 -91181 -80625 125575 134821 216750 -7983
21646 -320898 -209985 -31645 -31368 -267141 -34488 -77143 -91220 -157588 53567 109345 7530 -24147
21633 115213 92674 101017 87481 43354 -245681 210826 -209661 112160 134069 57716 -168721
21621 -85191 -168485 251402 -143599 337481 -205149 -5955 -135732 -134317 79230 149523 -265167
21609 90778 157696 -192099 22283 -148041 404437 -104538 -51657 -102881 -224563 -127007 262210
21597 -276463 181201 -84978 -168096 -159978 -155622 -296448 169287 -1669 -35070 -98860 -28651
21585 -49311 -347144 -185303 -31316 -79064 -181981 -290451 245632 260014 32218 127135 4287
21573 -245250 -195046 278532 -151811 257050 -105544 -321146 -374820 -217565 120486 -199301
21562 190833 -92052 86620 128667 -66482 -136293 -76980 342887 205083 52167 100706 221325
21551 221325 -168271 130558 -92192 265478 -304421 -42279 -127592 -5600 38097 152658 -116381
21539 -77142 -79983 271201 26141 111093 -158112 15277 15964 3330 -423378 -125941 -39324 -195033
21527 -195033 -45145 -206921 234906 -103560 249769 46165 -83765 -177518 -74643 -56137 83744
21515 97051 22730 198880 -102212 22422 388794 -94548 47981 -210495 210942 -88831 -105029
21504 -105029 48144 -51263 -145819 207144 161752 -151821 -304932 127715 273560 -150422
21493 116490 68332 86996 142908 -163596 -50835 136619 -134185 -304277 125229 -216079
21482 -202305 204513 -208414 -113280 93534 -11184 209123 8574 204112 -156592 -41031 -352538
21471 -352538 197002 -257832 32381 21777 4103 91642 -151239 -210579 -51029 122202 -28557
21459 42866 -35813 -328399 -15350 -313598 24312 70416 -188692 -122935 329138 41776 315462
21448 315462 94576 -300225 -393930 139823 -92316 -103263 55888 -204314 -77122 184023 -28586
21436 228238 3789 247474 155915 -212355 131845 33030 73097 449397 48135 179702 110335
21425 110335 -19423 319074 7368 -50446 -224896 57184 -171275 251508 -377779 23780 199928
21414 199928 -49411 228309 -142613 -7297 -178613 149543 104851 -116374 112128 -108976
21403 43386 -266256 -83791 -125829 222574 -75724 -135008 79947 -69737 -158982 -217987 -310828
21392 -310828 -185097 -23649 -106254 -178849 -182565 -149673 -100442 229077 -361943 -241245 -9069
21380 283913 -158285 554933 58888 81652 -226838 28638 -237648 -27069 -179074 -284731
21370 -284731 93908 -168937 -305648 -83086 123088 4210 -148678 -79240 291773 -150786
21359 -5343 -151452 95551 -220532 -212025 44153 47671 -60168 474485 83213 6730 -256372 -113403
21346 17658 53561 146535 136902 -319305 -112303 164296 286169 -54435 -89354 234024 -19155
21334 -79011 -264715 -436300 18624 -45085 -568694 130837 31677 -246768 -11293 96620 334871
21323 334871 260263 -83411 -311806 3645 45177 253940 924 -181781 -281638 -116520 -18433
21311 -101391 -134226 -161319 74943 -280573 -14038 98478 148628 -199527 -115676 -77470 234663
21299 46044 37844 -17338 97245 -10509 -178632 -27630 88922 -34155 -275177 -133511 -40150
21287 257089 -213517 -176592 -246624 -109914 -88784 -170652 -14571 -77125 137766 -120898 -98224
21276 -98224 18412 -123334 -131239 -154578 -3834 292261 -272865 -132682 -158742 76876 88816
21265 88816 -67069 -6193 -152602 -147686 199686 -126411 67390 -151988 149932 -28870 30696
21253 136168 -451089 2456 -131943 -157072 -17729 -280728 -61224 -258259 -328945 217482 206162
21242 206162 98765 15524 200914 -405091 22645 143736 -159167 257483 -29846 -10248
21231 214911 -429585 54741 -807 138539 -410991 -258534 -58459 -69409 162104 -181493 129395
21219 -212542 -55356 -99308 -32721 77502 -168077 -83312 -224452 11935 -437842 -116649 -188524
21208 -188524 -342249 -348175 -181410 356089 56361 -202462 -364564 29577 -222038 -4406 75237
21196 64199 -179383 -234364 225348 -339103 99085 -158904 181765 -75034 312341 73270
21185 131312 192046 310216 -108240 146839 -40658 -47319 -198547 -130175 179161 223726 -262091
21173 -13642 40131 -35953 19545 15446 -86862 -180556 -64191 -50040 146281 -282060 113247
21161 -132184 -33244 97940 -162647 -2376 -288086 -99549 -97609 -101686 272466 -212944 294117
21149 63603 -310291 -322740 -237110 -194640 -104397 90688 -101706 235526 -137542 -142286 -229508
21138 -229508 225349 45585 399107 -220114 -151227 15680 5971 175208 -339915 83139 97900
21127 97900 -86982 79839 132561 455076 278445 -37533 -115762 -56540 66881 -225605 130963
21115 67330 -88208 -355354 260389 37581 17583 29904 65519 -254781 68358 -38930 224498
21103 40563 212369 84615 -16582 -159047 -32242 -126868 69266 465423 47167 53112 302632
21092 302632 -32695 228880 -14519 -195776 -35075 72833 333 379466 -228854 -127153 -323071
21081 -323071 -29469 56893 -15851 106388 73379 -238775 -84688 -75591 65145 -73910 -62564
21070 -62564 -30776 66756 92335 94342 -77160 10205 95901 95918 25768 141877 36319 -398673
21057 -109931 -266517 -57822 -224973 139672 -169508 -43832 210619 190877 -261311 -237374
21047 -237374 -9079 263536 16082 -37835 -2915 284647 37959 -437002 78634 -442204 -156084
21035 57633 -12853 212377 29492 -166426 6711 50623 -8584 23689 -16252 -237186 -203570
21024 -203570 -130771 -385640 34656 -276751 -186145 -26388 -199873 205566 79637 -169387
21013 379492 -288112 -361769 42359 102883 49448 -72033 -421910 69717 -211969 -78265 -109154
21002 -109154 -57792 -175840 -134420 -90485 -97162 -323125 -196681 -308214 -52695 -275290 -309895
20991 -309895 -6850 -185285 -213674 42632 -66968 51786 -433418 169966 -72810 -26264 -117638
20980 -117638 -154208 40065 -370183 -83417 -75537 -42597 26694 231468 -101155 -182621 256767
20968 -191469 -242632 64592 -135789 189816 288035 273376 10123 -17684 60454 -40923 -144590
20957 -144590 -70860 -33630 -131063 26585 -156342 -336048 -303559 2747 -345934 220449 -64091
20945 -158997 -75019 -323650 -101568 353347 -21509 212635 -246690 409862 90 -201696 110030
20933 -126689 -267444 -184329 -116285 -180298 -465414 -323955 -32507 -210366 -1568 -274384 -173244
20922 -173244 161220 -221366 24702 -212383 -237706 -200029 -20200 145148 126812 79731 -169600
20910 -120885 45216 278370 -254333 -521744 -13212 -21033 -70285 -109126 -197742 42123 -355918
20898 329327 55047 -12357 -36375 -149424 12200 152443 245852 -30039 -173709 69984 182228
20887 182228 -106463 193726 55782 -131309 -143762 -148966 164539 139711 -35665 62698 -272761
20875 -318604 -249985 218831 -31941 -194056 -22222 -207904 72721 -50925 -155959 -347831
20865 -347831 -163411 -42649 -249806 -127329 -57390 -290333 -159106 -37422 -292765 92016
20854 -64385 -41901 188445 -56307 262132 57738 52385 -183859 319138 -164180 -203158 -74403
20842 -86992 -83967 -135037 -8681 -226849 -98269 -181575 -135734 -216550 71656 -143501 -18632 204667
20829 -92803 -16511 -345496 -256994 -307262 -38186 -117913 129025 -58922 -54905 40185 -14875
20817 49596 2211 -319442 -166039 -91537 -88014 25735 -481100 -128690 115912 211586 -126724
20805 -120133 -191273 152342 202757 93085 -182294 141539 159993 -112824 316656 -257175
20794 291881 48962 -99401 -69432 -64687 109904 196607 29554 -126427 8822 -170284 167318
20782 -32702 -282538 -243276 -179510 211565 104413 -208562 135667 -283689 220714 -35398
20771 -227865 -11122 -35506 45036 -136376 -297462 -310833 -126719 -327476 -129943 -39881
20760 13855 -10994 -97213 -305215 -320867 -70922 26285 32587 -308354 51606 216490 -57125
20748 134898 67081 162296 -95993 83514 -10427 69738 -123390 181223 -140387 42954 -349807
20736 171851 227411 -99356 -301251 164468 73176 42369 -93395 -389910 -24088 7991 -32350
20724 -141126 -32927 -64661 15787 -57734 -132442 22260 -230562 148093 109917 -151121 -180321
20713 -180321 -39684 -524955 -38118 34723 -206007 -251268 55879 -194090 -151653 -96519 -18576
20701 -529730 143574 52869 266888 -300210 -112993 23993 -76532 -83579 10265 -96896 -174593
20690 -174593 -87297 -176585 -37000 -297344 65778 8506 156863 -77580 178108 33701 -127906
20678 -344767 -338871 -122686 284059 -64652 141020 -2220 191398 65301 175527 150446 15612
20666 268233 86946 191359 -14080 39756 102146 -83359 -169318 -151712 -237303 -106990 -137035
20655 -137035 42613 -59261 -108330 30474 -40792 199911 -142234 -107570 -27542 -214242 -182884
20644 -182884 -142298 -275755 -174072 62084 -372334 23399 -20601 108343 314725 -344753
20633 -175476 -77691 67422 279377 -49330 -208617 72397 -19713 232094 -350745 44687 -32505
20621 113969 -301651 -146314 -326700 -85643 -227954 -195433 112758 -53829 -398056 -244674
20611 -244674 -53412 -288273 -84673 -128398 15077 -148743 51907 -182999 -169664 -35877 19135
20599 -371824 -36812 174651 -31242 -289803 355416 -163877 255189 74163 -346276 40986
20588 -103746 -205423 357784 93922 417059 4782 -151306 94598 8042 235484 161501 -85258
20576 79523 26323 93997 -185 314079 -127398 -148949 -460360 -31926 -257085 177496 -164188
20564 -178546 -15125 -217001 -7384 -108766 56909 32492 5984 124075 -25659 180341 -142744
20552 83336 27590 141065 -230026 96391 116101 90649 -55693 146798 -14419 -15303 -7660 139964
20539 -376080 -217666 213932 -62010 -262029 -126129 -279350 249665 32422 40009 -39425
20528 31991 -344575 -264130 -150451 -16405 179993 -167018 82945 4309 -290854 90959 198420
20517 198420 205578 -197372 -13578 12806 2166 -126015 -257391 -157768 -195763 -2615 -123537
20506 -123537 -25452 -36054 -422237 88428 -20169 -25224 -56445 -241993 -11402 -56627 310024
20494 -96088 161043 -207325 -167742 -221439 -135187 73766 -291368 -41506 -242747 128649 -161058
20482 -19211 -136238 91794 187986 -204657 48998 -65591 70380 -57551 -193686 -210869 141451
20470 -90107 63397 79768 -423322 303009 -48938 119611 121470 -91828 255840 -272437 95741
20458 328365 30881 157106 99640 8052 152234 5024 -326193 -43697 127634 -38994 19444
20446 14309 -9728 29840 -138217 -175699 -159056 96495 -53937 -169669 -204877 -56180 -424114
20435 -424114 -406775 -110290 -62086 169414 -219044 182630 455985 64782 -233785 -387254
20425 -387254 289997 -251135 -195269 182100 183473 -127559 -83144 -13181 -182222 -135479 -17886
20413 -161932 -37291 136783 16730 -348304 -133817 73323 -310609 -78379 125019 -24072
20402 98617 49026 -415069 -175749 -135123 118277 60132 -360815 143286 75501 -237147
20391 -598465 -123863 -65644 -76671 -504517 -40659 127348 31059 -227127 138071 -12379
20380 -284006 587 -301379 281989 -211277 218081 -87220 -330789 15895 21423 -179148 150495
20368 -88665 -387424 -38178 178353 -127782 83162 -513947 -28384 110695 -362976 16919
20357 -32310 -68929 76200 -174109 -302311 -59798 261223 -45566 -230109 -202874 5712 227886
20346 227886 96288 -3332 68911 -19181 233524 316941 -31122 -90066 281025 -12194 -93619
20335 -93619 186933 -84550 -76776 -40700 -53089 -307835 -156011 -192640 141304 -169692 -247669
20324 -247669 90692 27354 89969 -92192 -251127 -26196 -100183 -4129 -216302 -3919 -167970
20313 -167970 -134857 -185128 -272710 189569 19358 -286429 -379085 43372 130048 247536 88259
20301 167874 -246323 219756 34616 -238688 166028 -152714 -181156 134357 -82092 329920
20290 -201066 -152589 -294600 -231902 -140739 122271 96998 219807 -316457 -71178 -372346
20280 -372346 -274464 -81004 83615 -234403 -94347 9495 -213387 325963 220858 -77036 83820
20268 95002 -55221 -8485 -137524 -71356 -235982 -52746 -343655 -4237 -196184 80815 -108355
20256 354872 -79083 54052 82703 -58242 -328536 -41615 63337 -338616 74258 -233376 32727
20244 -94068 39333 -248319 -271977 -184068 -313456 256735 30404 -117290 91785 -51574 283498
20232 268678 65093 -127708 -55992 -347650 473926 246914 -126441 -130603 324233 262710
20222 262710 -221587 -25948 85562 -190332 -238834 243865 -163589 -233738 -4286 148713 -141535
20210 97524 62670 -203324 -92905 189414 79414 -55942 -166222 178718 -116551 -202300 332326
20198 -330419 239050 -235928 1033 -118962 89316 -222094 -221404 -236212 -71062 253802 202338
20187 202338 240549 263758 -188790 -43166 -179581 -398563 -114224 -169466 68413 7776 67076
20176 67076 -14108 87455 107965 -113826 222348 -225581 -140164 6477 -73511 -75273 -83546 158905
20163 85899 -439954 -191544 249761 355274 -94500 -8909 29521 -22893 -75275 89223 240212
20152 240212 246749 49367 136004 -32477 -151929 -35985 -200995 48352 45583 -70904 14136
20140 54463 -197191 -121534 3711 34975 -63194 -35570 -3962 12514 -116182 -31644 -24306 76345
20127 -66182 -282766 -11370 56316 -507094 117262 6773 -84993 124051 169573 81168 122644
20116 122644 -324612 -64998 24600 271852 -254812 -84466 -42719 120790 -52092 -79824 -143996
20105 -143996 -114559 -64014 -50104 15537 -224158 -52317 459595 118717 -129547 -15801 -91519
20094 -91519 -32246 94146 -239488 -83271 -173639 -147305 82626 113509 -263275 70654 -130245
20082 -30750 -245335 -134968 205789 -113450 -171853 111928 -23758 136953 -260149 121390
20071 -56505 -148692 -141297 -9735 -74870 -87946 18102 -133815 -311699 51391 -50478 10370 78157
20059 78157 -49456 -128816 -148113 -84711 38792 -20742 -254019 15559 1859 -12308 57696 -407084
20046 -247581 18919 -9864 -339797 -152367 -232730 -147510 -139717 53229 75783 69183 -41273 -412481
20034 -412481 -128988 -25643 -6046 -104590 -70798 -129455 -19686 212107 211665 -71085 -363115
20023 -363115 -317091 54246 -3856 -361825 -223325 486660 -323148 3522 -147585 -70972 -407762
20012 -407762 -3711 282488 -14941 -141528 -137059 -81463 153100 -49162 -173633 -24672 77739
20000 -282941 -20966 -477058 -87651 176220 -129972 -226733 -358496 38432 161420 -253655
19989 177966 -12160 115874 103882 140016 -137084 78648 -80194 112747 -211442 163532
19978 -139520 -90453 -39605 -416296 116007 49517 74466 234448 -10243 -84222 71575 -113812
19966 36894 -234400 15179 -270813 -383686 1342 248479 -67945 254723 -42388 -176720 112832
19954 -53588 -198949 -47253 -311511 -12961 108934 -231464 -52655 -68511 -51273 261738 -77090
19942 -157309 -348323 -65827 -199023 -177961 -189452 113965 -7537 -185267 168110 11038 -126632
19930 -1730 138294 -90933 -399771 -353066 -80916 50730 26868 -68270 51857 -26066 -239751
19919 -239751 -47267 307432 -285498 -302798 -131264 66014 -243531 -281137 -60294 155993
19908 127817 -56643 408477 -24890 -87583 -134185 54015 -340175 148442 290631 95825 217901
19897 217901 -386366 45522 -27457 -95915 155108 134557 -12632 -114371 -306604 -246988 183144
19885 -150520 -53147 158516 -256983 172556 -485157 118301 37880 -265820 254994 -315691
19874 173153 -24816 167339 20997 -117250 -218387 5675 -165868 -284641 -106105 -187264
19864 -187264 -64897 8094 -127478 184976 -135402 -346027 21211 -170185 -321185 -331674
19854 -331674 -456412 196382 -98975 126850 -115649 -33311 -318106 -242811 48424 -128806
19843 -63405 -105416 240729 201854 -191508 -356 -60020 -25224 -47156 932 -287068 -345643 -432197
19831 -432197 -272635 -25543 -107941 -121690 -258494 25816 -48358 -404160 -323487 -324041 -181938
19820 -181938 249146 -27830 271583 18535 -475516 -142008 28926 -229627 49772 -100045
19809 132357 -313599 30991 -140668 -5062 -333017 225596 -285005 -433083 47322 -159117
19798 -119079 -197271 -26476 198627 266749 60501 -303250 -444931 -52333 -404240 14693 131363
19787 131363 -92649 -151349 -568245 164310 181046 -104853 -297380 184526 -241553 315174
19776 -88337 -5966 -5530 -360166 -197404 -8929 75980 -128483 -120433 -216365 74464 -246695 -65186
19763 53360 -57185 -277509 -344068 56048 110333 -7115 -172506 -39233 -103013 -79990 -234785
19752 -234785 505247 -320219 115897 118378 -160321 340601 43916 -77319 75 -216472 -44811
19740 -442033 -19307 17490 -428 238611 -63716 185333 24663 38057 23325 130120 -325963
19728 153185 16068 -150256 21845 480 -92537 -102346 -40558 205800 22396 103144 -195594
19716 -331371 -181544 62714 98697 -75859 20271 -4720 203854 517858 -301960 -289691 -44056
19704 14126 -134984 101639 225111 52576 -74343 79009 -246151 -443140 49018 176787
19694 176787 -143565 -90370 -263314 -81958 -164686 292143 68012 -89863 252155 -47450 -177946
19683 -177946 491093 26158 -234070 181778 46996 6478 30270 -4879 -296543 -124476 143627
19671 -142212 -117582 -176259 85847 52116 -12995 -203143 -113059 242824 308023 -493863 217104
19659 -150729 141939 -215361 -251922 -25548 -134362 201756 144658 -87571 -140908 143919
19648 520020 192093 -60979 239411 -103578 -167755 199839 -62445 -200431 149672 49629
19637 -197908 58655 -127594 26378 -8246 92461 31163 165237 -204702 -294305 -62913 248266
19625 44480 -233292 240605 -235396 144013 -29253 -138216 -110431 70460 65038 -197400 110862
19613 -277693 39689 197051 -488738 -476491 235419 -228917 -104770 63525 -394600 -156472
19602 108715 -121226 -173050 207217 94887 62299 -172195 33560 -257991 -189257 -227601 -129312
19591 -129312 -276518 139497 309010 -296622 -81455 -113785 -555118 -245527 13049 227523
19581 227523 -110165 31847 -337477 -359666 -133938 19883 -106379 -140216 25563 164515
19571 164515 -80934 -164848 -177744 -149112 67772 -48724 -203386 13713 -247339 -405405 151953
19559 80734 -241159 -124378 -89549 8443 -486268 -245208 -123114 -143445 -3175 106815 59768
19548 59768 -78078 -609156 -44277 -76147 122020 -90902 -169039 257064 79589 -279458 60409
19536 -281683 -366105 117436 46386 -22529 -25312 -331966 -126596 186814 -323819 -18909 -365582
19525 -365582 -10309 100945 115434 -186148 194389 -274880 -230766 9790 -134710 -196145 -8103
19513 -289875 -176403 433357 -407398 -43519 -111665 -232246 -230780 -23380 114415 4768 212291
19502 212291 59928 115887 -52635 73975 169810 327119 -140992 -254426 -20565 -526289 -173106
19490 114083 -326316 -383374 -32545 95913 -65583 -257207 -73176 177529 122014 73340 -497814
19478 -118484 -79111 -93246 -4797 -13075 -183469 -125726 236389 124671 10037 -111341 -6894
19466 3211 -171807 -379466 -30192 -142415 177412 -2339 -5257 -192490 109999 -5924 -602179
19455 -602179 -197466 -120463 -145532 -291628 -26545 154207 -239781 -134677 -179637 -119743
19445 -119743 -46758 325137 122155 429133 8442 -91939 -144281 -147900 -406148 90138 64462
19434 64462 -193266 135076 -57274 323418 137772 -79852 -593713 39207 25856 8273 -109085
19422 153726 -323999 -211818 109104 -58523 -155590 -14003 222169 173793 -45093 -26280 258540
19410 -76539 216851 -73530 -78501 -257073 -42223 280954 -86026 120195 -4255 -135289 80172
19398 -108682 -219817 -415746 -167081 225840 -26925 146042 -197844 -51957 70369 251483
19388 251483 40479 -175990 -327061 62246 -42506 -150799 -84760 -201491 -123028 53744 -23742
19376 -24254 -256816 -569018 -152279 -93069 -112701 -49475 -387219 -138742 31557 -194995
19365 189490 -141601 -281501 218873 -297862 230606 136963 30818 -176744 -266130 -32620
19354 -236525 16246 -382046 -362834 -231910 -202400 -219478 197751 -130698 19785 142295
19344 142295 -323550 -186412 -159564 37906 189785 -213520 32463 -71395 -54841 -335701
19334 -335701 -251027 -137637 358008 20079 80749 -158372 957 -858 243496 -214630 -114336
19323 -114336 -344759 -128517 145205 -151309 -141082 -134688 -174199 36184 -157279 -278908
19313 -278908 83843 76090 7933 -83685 -243005 -130281 -85023 -186847 184658 -28465 -301591
19302 -301591 61247 -305416 442770 47732 -102103 -336223 -174470 13984 235823 20749
19291 -138878 -125508 9244 -66051 122078 -26604 44328 -227789 -105374 -246675 130137 -266286
19279 -56452 -111074 -190848 31676 -492 -55774 108701 -73766 45688 20937 -259532 -259334 113114
19266 27550 -265266 -113304 134872 36794 -165645 216608 -107046 -124384 -232556 -108169
19255 -97935 -22128 -236947 -113534 116851 -146305 84687 -114957 -101956 221665 -261742
19244 90635 54940 -305699 -201666 -74629 -177950 -70410 -112601 -20301 98813 82831 101736
19233 101736 -33623 -371516 140793 -255767 -173995 -297854 242497 -349810 -43040 -490126
19223 -490126 -214810 -96169 134894 -111461 -147981 144801 -44742 -462820 27462 130712
19213 130712 115852 108418 73554 -125692 -337174 -61210 -140165 -49228 145205 -96358 20293
19201 -245812 -35687 -186344 87320 -4570 -163180 -137263 12322 54839 -25300 310635 23445
19189 -7740 -106650 -25061 463333 -346790 -284129 -39916 360304 -50502 -32310 -67126 -294750
19178 -294750 265787 -17397 -89588 110464 80492 65551 -178880 88867 -143410 -193024 24631
19166 -86548 -183995 202272 203588 288566 247670 -134465 -310640 40216 -170779 -297679 -43933
19154 -114302 51783 -3689 -168309 -109611 -186927 23503 -490146 14817 25520 26051 -104192
19142 -102073 191578 -89311 -55879 48069 199817 -191345 93179 49223 120477 11717 -1638
19130 -141829 -37224 -87758 -38779 47851 97828 53963 -137462 -104606 -157704 -194312 -145801
19119 -145801 -253944 -307751 -384334 -136635 -56155 113200 -132902 97001 -101368 -121030
19109 -121030 -293235 -146454 -123852 -62104 -25097 -130350 106032 29363 -398396 -103320
19098 -21676 -177353 95034 -87146 55069 99823 -837 90499 165396 49818 -179841 17556 -252297
19085 -282912 -440079 -419370 -159813 -165225 169792 -70185 -366841 -157810 -334951 -150802
19074 -20454 161259 167409 -207850 326578 24062 -142589 -154397 75977 -349190 81475 -37430
19062 -168565 -305218 -435424 188600 -102738 -48348 -47536 -15101 91415 -46411 213284 130642
19051 130642 -59247 -93797 -152399 -233211 41778 43919 -85806 29080 -282474 93421 206121
19040 206121 35681 256273 -334944 267283 -158933 18082 219915 -179300 -48954 146810
19029 -26204 9503 -295485 272552 51571 -134444 138022 103420 -126361 157596 76469 -315568
19017 29981 -365697 45449 224293 17106 -212788 288602 -69137 6033 -38812 -298874 118351
19005 -98306 -12874 -27508 -234190 93441 -101927 -131641 -193504 -127767 -412926 174642 -145920
18993 36608 101001 -311197 -269279 148945 -212540 -302765 -147811 -8650 32690 -126642 -234848
18982 -234848 -161196 -145889 -62332 -16765 -188314 132049 -25331 45376 -46906 128453 -113851
18970 -60495 120490 153103 154325 -65028 43903 -151980 -409111 153197 -85355 169631 -120877
18958 -226452 -173166 -118389 -75917 209006 142816 -62688 -377244 -105403 94109 -121405 106772
18946 -189999 -134825 207502 -217570 -164186 108481 -192299 129979 -53137 -29019 215316
18935 -209191 -18919 -23698 -188169 -254641 -18527 -88637 135559 95058 142284 -277152 74575
18923 207553 -25753 -136435 190681 -206944 -80189 -70059 241410 -50887 17611 41405 222997
18912 222997 144137 112126 -5142 -38677 -108064 38820 144768 94673 -286246 139712 106799
18901 106799 52995 -177559 -104806 -42736 -253357 -193514 -35360 118917 -145170 331897
18890 187778 -102708 58040 -232009 28617 -11354 -44299 71888 64745 142300 -15312 96209
18878 -427185 41947 -144686 -161374 -20175 -219436 6813 -44843 -342951 -235562 -236603 -98758
18866 -300728 -202989 -167684 -242587 -312223 -138613 49687 194655 77081 -94627 98407 -184262
18854 -69680 183680 78299 147550 93201 359041 74499 -211303 -18716 -95797 -30129 189847
18842 63015 16394 134859 243523 -167197 -251907 -72634 501713 -54920 -144133 212833 -125174
18830 94298 -70034 51549 47341 301877 -106689 -144779 -36728 -70691 -198912 -209033 -240978
18819 -240978 274272 219138 90395 151460 -354719 58038 170966 283200 -11761 -57701 177397
18807 83223 -72803 5489 -83799 121004 -231113 -144555 166485 60660 -110736 -88994 7239
18795 -62288 32538 -88377 -10250 -260721 -180412 -282467 60160 97402 -85168 -280235 8480
18783 37555 -149775 -136847 239003 -292429 -335 101756 -251572 -235120 -139707 -92269 171830
18771 193460 -258468 179132 47722 -386179 80325 -24351 277642 -398480 -135194 -273858
18761 -273858 -246065 -21997 389698 -459304 -2687 -216651 -144176 -51064 -84174 -244649 130529
18749 -51875 -20006 287182 -64532 -256475 -41635 3225 -134495 80837 60629 281840 124219
18737 -31123 -302460 -116006 -149285 -103160 -33824 -26423 -191921 -57236 -312568 5240 -56480
18725 -2031 -261493 88008 -244457 -120373 171201 25209 41268 -67435 -271495 -46863 -24120
18714 -24120 -9100 19751 -228048 -69989 -134454 -103397 -131191 123668 -32675 7015 -46706 -268637
18702 -268637 -281527 -122448 -178343 -262008 17883 -268771 57702 -105119 -50665 -70212 -162996
18691 -162996 -85464 -133159 -9214 13894 -359797 71821 -78805 16620 -150315 31073 -100123
18679 -15824 -110887 153070 64069 -278087 -319189 -264971 -164527 62629 -8048 -49330 115834
18667 5587 217851 -280973 87253 -29624 -80579 -96865 382857 -66904 -63460 -121072 -142293
18656 -142293 -110717 -259451 -326334 126292 -33602 6594 111116 -92600 -315721 69103 -25620
18644 -11577 -98717 195453 153199 -212156 -94141 124566 46316 -283020 -290134 166599 -5953
18632 -35235 -124495 -48126 -341815 22023 139745 23100 -239564 -162931 -236849 154013 -273433
18620 -223018 27698 112766 -178338 -47502 -135055 -65317 -552861 -18018 -197865 337826 -8740
18608 -186595 -123046 -371062 -31430 -116867 -183742 59222 -386210 -45994 70956 228451 -346419
18596 -109073 -76225 -25688 -298447 420930 231416 13908 157038 195703 -180710 -65054
18585 -126326 -268671 -361080 -31241 -114524 85468 211398 133993 -108241 86182 -106500 229744
18573 97221 126281 -148572 -71029 153972 -25400 -171835 73361 -366694 109845 -22525 -128840
18562 -128840 -244365 -67392 193978 77226 -42867 -94730 -74076 49809 -201622 210603 -81023
18550 147897 -260541 -63512 52471 84264 -129212 91015 -298766 -57401 152926 36190 99114
18539 99114 -38272 55545 -197055 -160379 314701 56558 274551 -375470 67434 56463 -269733
18527 85088 -181645 -77672 15774 -102492 -23503 46709 -150649 -391986 -208870 66249 59085
18516 59085 -282708 10414 176398 11627 -248546 -345077 37054 -229957 -209069 111556 -53947
18504 -15474 -125576 -159677 -34391 50154 24194 128481 -81417 -288062 -294685 -298825 -139034
18492 82971 25364 68888 202197 -21671 139070 155775 -363349 -143749 177030 -43157 43764
18480 -178590 -78376 -280141 -87684 -69338 -321402 -85243 32584 453 -5223 -267492 -58330
18468 -286202 41871 -6443 162729 323687 -391314 -28140 -31649 -285360 142781 -128147 -96470
18457 -96470 -60972 -48685 4156 -93629 26699 -323843 359115 -73911 790 -209867 230402
18445 -74883 -94136 -194806 -310214 -394577 246986 101063 26248 -142137 17631 -217626
18434 -14336 258738 189440 -11355 2586 199125 -30841 -119341 16501 21389 -98861 -265680
18423 -265680 39144 179903 -259703 -143104 -372703 -26760 92209 -148753 168601 70652
18412 122037 -265543 90003 -96214 -293505 -28001 17267 -49965 -88102 139926 -139994 -245232
18401 -245232 -158099 -14549 -287983 -61996 -225332 -133739 164935 -188602 -87399 92486 48253
18390 48253 39171 -143088 -188841 -187771 -111272 99028 -101711 -132553 -56470 25970 -132239
18378 -228617 165821 141677 -8691 -93604 -339482 -262582 26078 511246 108461 27291 130450
18367 130450 -236443 -74751 -62864 -49454 -97944 -229997 -176224 54563 32548 -66175 -281706
18356 -281706 294614 60735 163156 -378337 -213841 -111805 309332 -214921 -18936 -54287
18346 -54287 81129 -167615 -1158 -162456 151572 -23554 291214 -27668 -6687 -64895 27543
18334 123969 -60074 123909 -21765 -47558 -293936 -155332 30929 -165080 -175711 -129950 -320443
18323 -320443 -251724 116361 477230 -156456 -181247 -266442 -139119 -96121 -9032 239238 -107705
18311 -76963 42952 -71937 -345659 -112050 55751 -134907 -167576 379098 -236503 -90009 128471
18299 -240155 149764 -19666 176186 235879 -236616 -409256 208455 -222216 252501 -322196
18288 -91589 181617 115038 -999 -159570 250576 -109545 84425 -272872 103368 -125366 78155
18276 -257264 73129 179012 -58437 5411 161896 -156804 -47995 74053 -151903 131277 -76497
18264 -4780 -189669 -222192 133266 -36057 31628 -87070 219609 -151630 -94250 83460 -486935
18252 -435701 -17226 -123396 -21167 -75659 9912 283895 219794 -115478 13388 -197430 -96993
18240 122922 119131 6213 185525 233975 -46264 -277500 276227 58057 -168452 -94842 19759
18228 243222 -15570 27626 -43774 157917 -43749 58334 340619 -50863 71926 33115 185630
18217 185630 -144152 34795 -16644 51925 149419 -108702 -135668 -152638 -61731 -43906 124645
18205 -286568 -102191 -70991 -148934 27891 -311880 91927 -2166 108705 -706106 -35827 -31995
18194 -31995 -71520 330011 79525 -286077 -19159 107658 97092 416006 -62743 136396 -101654
18182 -53367 224688 213298 -127825 88105 27821 -573505 -9725 -95070 -215721 -190123 33386
18170 150641 -174107 -162117 -308816 -472173 -76214 83204 21206 57646 -182644 40487 13463
18158 -212639 -64479 -175049 -135025 46038 -145181 78473 -448661 6846 -57902 98786 -169817
18146 -58038 -189023 509332 -110122 212290 -144319 22478 -54205 -94670 321993 90308
18135 -44757 28094 -212692 -188000 -334076 -16252 -108831 183306 -325211 164844 10624 74858
18124 74858 164147 -100285 29277 11019 90089 186865 268431 -159293 244787 -47759 8995
18112 83968 236580 169325 -465471 117743 -78768 -8775 -492748 -242261 -71001 -18618 -220887
18101 -220887 -193739 124359 -161311 -435977 -38892 9854 -105348 45363 -50369 4928 -2050
18089 58652 146526 53593 78622 87171 76085 -74292 -134289 195999 75304 -5110 43606 57834
18077 57834 7605 64527 -37490 -31560 -370273 -109332 208509 81748 28974 167701 -116321
18065 -214199 134739 -46734 -160171 -97987 351398 76797 -151455 105937 -122332 -9404
18054 -55162 -233336 117651 -66281 -97741 78154 110884 -83304 49100 119728 82277 -146334
18042 1750 -41890 162401 116078 90621 -216597 -163022 384655 -56553 282202 -22651 -25977
18031 -25977 -387350 45038 -261412 -227789 112057 -29869 243454 -51486 149274 -96048 -87936
18020 -87936 -100975 23207 -159964 41604 -105200 4728 -177506 224074 268858 -133411 -30949
18008 30416 -180965 -80859 187141 -4384 -333719 973 44195 -100671 -126487 -100009 35114
17996 28098 55535 125742 306048 87039 213680 -118747 -111379 108094 -337338 248970 -151629
17984 117459 -181429 -372133 -207665 -114211 -61975 -2696 -34261 -338189 -100770 75093 57605
17973 57605 -61577 -193700 -61219 -196533 -106934 -140177 187874 172961 110824 -440849 -201313
17961 -21992 -359044 111666 -142573 234537 2121 -35728 70110 359015 -42417 45180 -239372
17949 49250 -23447 121822 36920 62684 -86018 45925 251027 -131171 8518 -342469 -99268
17937 -151912 138440 44681 -109100 -117934 -78884 -117337 -207661 -12136 -151313 -33842 -57761
17926 -57761 98780 21997 107771 37377 -81921 -452114 -41300 -249398 -50528 188870 80699
17914 -47718 79088 -248889 362307 -36434 24608 -139291 71208 -64084 -343000 188962 302973
17903 302973 -37844 -20918 -320061 -154125 8471 -25430 -254298 -104616 83548 7351 21310
17892 21310 -218907 -165764 -174101 -245215 183648 81802 173837 -248394 39630 328781 51113
17880 309785 191441 100852 -46487 105909 -491634 54487 -26697 -52672 -173489 4337 -188057
17868 -140109 -125685 -122922 177536 171693 67950 354945 -233 146273 -140565 -198371 -136921
17857 -136921 -289153 -299443 109332 -11653 45946 -7628 -273796 -271978 44687 164753 -163128
17845 -367163 105288 -104263 -155312 138252 -265733 -200408 216065 212694 -51663 -170321
17835 -170321 114234 78904 -156836 123514 -223637 36188 181517 166979 141996 297924
17825 297924 45628 125458 -107001 -178985 -299945 34403 102584 184770 80622 -179165 -362288
17814 -362288 -135399 166566 -234357 -223580 83209 53296 277680 -89080 95157 295316
17804 295316 130214 -219119 -28424 -138542 -140159 -344882 7695 -137883 -98685 -227604 288147
17792 -4416 -250656 176274 -187656 -100087 210635 -68913 -281535 126783 109160 175115 132138
17781 132138 -440690 140738 -324476 -33165 121680 45657 -8418 -191445 39924 133792 -71318
17769 295545 -30757 -301931 -39603 -121912 375077 323186 217673 -192676 91346 80550 274857
17758 274857 231384 -49740 321412 93010 -84680 138194 440896 -14503 157300 126574 104295
17747 104295 -224035 -145791 311580 56088 322754 -33315 16643 -10627 183751 278393 -40029
17735 179389 -136045 222411 -132794 -123903 254730 48802 -150304 -49815 58142 113097 132443
17724 132443 1381 -89984 -756 187007 -341724 -142262 112881 84256 -40615 190755 -19784
17712 -84173 -47389 11980 -67054 96589 78523 -185133 378228 -87639 -328650 217788 -143545
17700 262489 68755 150084 -166979 -58269 -185723 -193453 57396 -70550 -24820 189510 -168758
17688 145248 362778 -45589 193914 133968 -131895 320185 47907 256319 -102032 -155147
17678 -155147 -242052 -12291 125576 376588 114443 76427 402843 176765 38769 -56670
17667 -97658 -147949 85263 -41487 -106596 99579 284296 114320 190677 38921 94747 7023
17655 -107217 -24522 -188548 -165715 260966 -223596 -77784 104723 -66659 245277 -2477 -14220
17644 -14220 3653 121853 174692 304110 -44614 75187 92397 -27783 -73933 -141199 -204010
17633 -204010 100327 59400 100070 -27385 260070 -204422 -12303 -33629 -20275 127814 -90190
17621 198467 -21997 -40662 -35571 516306 141700 74327 -18743 86327 -96512 41288 -346717
17609 -424474 31946 47787 61720 -85338 39054 141676 357357 -4086 -59170 4612 63843
17598 63843 349936 142702 -280785 156482 -127054 -189440 -191647 241639 -106786 59271
17587 114494 263092 30305 35353 133865 183360 -54239 298895 692 -34891 31220 -69751 131167
17574 -188621 -117066 -208585 84255 23181 39775 317600 165410 279336 153849 58886 -37699
17562 156054 174516 -38157 335691 -39061 -15661 -32855 -86893 116365 135206 304808 29017
17550 298422 50352 90999 -20014 -140933 193679 187401 -35718 340004 366066 255780 121125
17538 79744 38806 111011 206228 -70698 369656 95104 256727 208182 -94011 168810 386903
17527 386903 -41113 410472 11604 146616 -287885 261477 143278 62041 86793 31083
17516 431779 16984 359939 -79973 -191120 347606 -11060 -84221 144254 15144 -102585
17505 178735 303449 283332 -175069 -104788 -160686 86205 531584 -61106 -36823 113346 26598
17493 268993 -197826 -218228 309546 -200497 107261 2947 21721 -104279 76364 28084 -12072
17481 183780 -26280 36137 78723 410429 139889 240766 245439 -94931 -131011 -140219 272285
17469 -31543 48119 220093 83293 136849 102792 -131813 262725 -53593 -170232 202287 22701
17457 220610 64879 292159 -11461 -218466 530195 255480 194341 206029 285008 231735 419964
17446 419964 558075 293727 40033 13450 73672 4183 187691 197911 168404 270320 175325
17435 175325 256230 117575 -73427 281369 440869 78143 58156 388088 273751 28152
17424 160970 -85006 399122 461148 175276 269399 176383 382261 544002 333401 381816
17414 381816 494161 249756 -14330 202665 33251 278909 84112 -42213 297918 209971
17404 209971 243423 96280 54895 -112940 -70991 345295 -72194 91679 105417 212017 -12555
17392 286215 -180087 177384 -13133 -66004 -8085 71655 -163393 48324 238465 51242 358203
17381 358203 81223 -108987 -6732 -190788 259645 402274 68087 345744 231462 251113
17371 251113 193654 16726 204687 126014 47715 37815 -124294 186168 325473 -109598 423532
17359 190639 424445 347920 -52021 288966 137970 10654 272800 111216 -130958 163538
17348 71659 355591 108980 168869 401181 353584 -79935 67297 -12884 95146 37509 174708
17337 174708 227484 534748 250954 78468 145039 171719 119062 220529 121148 240480 185318
17326 185318 -189181 225365 82114 212904 267239 215503 -18103 170794 254738 204559 139429
17315 139429 241363 11252 510348 -24553 128837 69403 217742 -139296 401464 355229
17305 355229 -6375 98191 232266 106816 334633 191414 17278 -53597 194686 536068
17295 536068 159135 195921 254260 -7779 93960 305391 357063 291387 109784 305210 -128688
17283 189782 64204 419603 199487 370424 250326 277771 -114027 87469 343423 -161489
17272 204245 604979 296985 175691 123096 112627 258166 221683 329546 164735 285570
17262 285570 234158 110715 88802 -5538 142035 170743 470312 170234 -98840 445342 306570
17251 306570 278945 193040 102018 303322 195452 171898 370532 343380 355583 216468 149584
17240 149584 65920 -10024 330155 326914 -128068 54564 229117 505858 243018 315408 42097
17228 256175 106230 155523 -17071 263096 141833 199932 142331 342113 360110 -123665
17217 210718 250312 350842 286846 297302 301617 236278 -127593 2088 278216 -36856 435250
17205 71428 -129018 278417 361 419300 -22150 504484 -133989 127737 157834 54535 21911
17193 140205 75702 351017 217032 -16925 91509 301711 191905 285531 27805 105614 -65097
17181 87758 308491 102361 468052 85651 374119 494485 234334 264367 452857 -26663
17170 30433 233665 313960 151848 23403 116888 399191 14575 1669 493814 54467 -32355
17158 482549 210626 258494 381714 507934 267504 370787 342835 379166 418319 275764
17148 275764 530665 36628 254623 209115 39851 77291 362792 376975 150921 234537 522274
17137 522274 284039 25454 555051 92039 548385 141198 -40513 358135 424430 570641
17127 570641 211742 334679 514441 621659 161158 229151 601825 421029 208227 785092
17117 785092 110337 248741 271815 464677 322231 228711 404961 235008 475727 342882
17107 342882 729030 548476 262150 256436 313336 58206 644990 440109 388752 332621 179537
17096 179537 232845 207696 358273 105875 166788 694622 360219 538303 736652 414608
17086 414608 523972 413051 164733 470188 420226 336824 509275 414305 485696 250023
17076 250023 479726 617400 753810 428092 422024 695011 337282 359558 694167 390081
17066 390081 354708 686814 475769 559164 479925 461603 362861 369917 501093 547766 468083
17055 468083 596917 374921 511903 465736 618485 497581 141174 573859 547754 392469
17045 392469 302373 395968 418061 822398 680178 519208 613252 580171 423828 602155
17035 602155 396449 707591 750476 520015 630168 689348 444912 649704 633580 578767
17025 578767 742289 787409 667979 742996 580015 666313 539149 552184 503776 628205
17015 628205 524639 495927 327880 509728 899277 653220 753412 575071 833305 611556
17005 611556 637537 760872 347166 476531 795048 368630 862303 738024 875071 610481
16995 610481 793283 897346 933615 645571 650927 875674 551480 622846 377642 988080
16985 988080 786570 848119 1076214 692548 941945 947504 768476 894748 987730 842256
16975 842256 837352 728101 600669 825633 456526 890395 1001276 824349 862598 967071
16965 967071 563181 903093 786465 826173 818633 1001942 922901 1099143 536986 927098
16955 927098 625764 1139426 1197057 968321 800377 1128672 1172464 1044507 1107327 962455
16945 962455 1138945 1079794 822895 1211565 1201497 1078324 877790 1128083 1110026 1241163
16935 1241163 1037286 1271687 1493802 825499 1070162 722368 1293529 1335211 1269105 1011544
16925 1011544 1634058 1117525 1044096 1225967 1407062 1208111 1317564 1497496 1285462 1726699
16915 1726699 1350639 1399557 1447677 1320261 1376104 1597040 1389944 1282504 1521452 1368176
16905 1368176 1860813 1349167 1908242 1466096 1957520 1862238 1450029 1634344 1625914 1507033
16895 1507033 1339037 1757969 2034750 1665467 1691502 1731651 2062262 2046428 1685342 1976199
16885 1976199 2093858 1836852 2181527 2194071 2140804 2021903 2042270 2006425 2040723 2152834
16875 2152834 2124679 2313287 2308965 2216052 2491130 2437892 2366993 2517033 2446491 2284691 2562728
16864 2562728 2612083 2466578 2522913 2550733 2809740 2646550 2886582 2557471 2651749 2696402
16854 2696402 2773747 2950441 2950820 3072703 3232061 3212488 2846213 2710688 3266137 3460545
16844 3460545 3294458 3625274 3390725 3598300 3608765 3750297 3681914 3752708 4056470 3838898
16834 3838898 4038042 3822760 4148310 4327811 4259406 4425784 4291475 4332413 4673045 4661423
16824 4661423 4579241 4952395 4880578 4961302 5091960 5157409 5095971 5305591 5455782 5692914
16814 5692914 5594432 5923252 6092724 6037310 6348811 6235237 6353125 6602940 6836442 6550111
16804 6550111 7018054 7136850 7499133 7576935 7452524 8041404 7897803 8506320 7916594 8637026
16794 8637026 8672300 8969957 9344479 9481993 9444689 9726834 9757476 10595356 10799757 10604375
16784 10604375 11690951 11444248 12084612 12152424 12552064 12649691 13052996 14014864 14052363 14630897
16774 14630897 14924739 15568731 16051042 16681514 17092062 17702023 18420004 18774765 19512923
16765 19512923 20351889 20784748 21536155 22658253 23255067 24573002 25558250 26497798 27688822
16756 27688822 28602650 29729373 31271625 32327748 34184032 35720985 37084719 39055694
16748 39055694 40946276 42879745 45391033 47269821 49963432 52520173 55707560 59243063
16740 59243063 62358578 65609743 69771522 74030663 78657598 82955235 88664234 94017278
16732 94017278 99939686 106407179 113425951 120812866 128412147 136329801 144803303 153398500
16724 153398500 162083565 171036209 179437945 187978149 195645633 202381305 208027792 212424219
16716 212424219 214851809 216285182 215559657 213021867 209093777 203575114 196956537 189133500
16708 189133500 180654462 171944162 162597473 153420122 144324163 135578425 126897707 118889212
16700 118889212 111148101 104072176 97314417 91360749 85609777 80154837 75062244 70545906
16692 70545906 65921966 61972316 58503754 55250011 51886134 49163107 46649184 44177720
16684 44177720 41510897 39627238 37414016 36013068 34100998 31968015 30694491 29159016
16676 29159016 27820049 26636742 25700695 24457908 23752255 22507928 21398373 20611108
16668 20611108 20167568 19471495 18618928 17710060 17211324 16180484 15905913 15172632 14845135
16659 14845135 13921300 13991957 13233753 12993590 12269608 12206185 11592711 11252820 11203931 10783617
16649 10783617 10125595 10078735 9794457 9448520 8860350 8983598 8350070 8581962 8142955
16640 8142955 8098427 7707012 7299733 7431270 7048963 6866869 7053182 6303959 6419099 6670353
16630 6670353 6003511 5947040 5866118 5405431 5320008 5357733 5180936 4988645 4923009 4848027
16620 4848027 4913539 4940985 4600449 4777444 4279354 4169847 4087099 4041393 4101781 3852989
16610 3852989 4349203 3809935 3970432 3716867 3657130 3256347 3424252 3602941 3607925 3340921
16600 3340921 3572315 3391071 3332352 3185147 3098342 3176332 3165425 2824256 2801652 2879118
16590 2879118 2604513 2694515 2727222 2595743 2466145 2151123 2489585 2318207 2462678 2216115
16580 2216115 2131360 2591813 2263767 1922150 2205770 2061200 2233174 2320743 2059964 2132569
16570 2132569 2044817 1933335 1682524 2220866 2231520 1877318 1753129 1784460 1907840 1926794
16560 1926794 1763868 1929848 1438919 1759816 1587976 2205759 1533126 1462253 1733778 1564244
16550 1564244 1131788 1512901 1260192 1517554 1579773 1611014 1641726 1289366 1128746 1546596
16540 1546596 1398150 1233368 1354009 1353334 973444 1070883 1186070 1036788 1281849 901782
16530 901782 1037388 1304122 1187315 989756 1023004 1327887 987044 958068 992156 1147172
16520 1147172 935783 1383220 991346 1027411 1069820 766580 953153 938890 905522 684487
16510 684487 684272 867033 1087220 861958 791359 991308 933587 737850 581916 828624
16500 828624 1275434 1065188 1161859 774108 868781 624899 895377 676069 489610 993498
16490 993498 613862 799517 684440 684781 770326 758459 616923 394471 207752 291210 529144
16479 529144 745803 553884 759098 652678 737748 564149 783377 424634 688207 377746
16469 377746 483400 736982 606335 634426 369391 451818 875516 498037 558904 559903 530530
16458 530530 548207 549684 570379 489674 651767 323850 378754 482109 335861 509874 655298
16447 655298 384222 514732 473839 375887 609439 421690 474407 653528 594759 279289
16436 288672 357837 172576 615582 202798 352618 384620 274453 304079 -42430 362323
16425 170661 341784 376114 500531 372711 422779 402375 441839 313074 499412 482239
16415 482239 332924 58238 69913 309985 462279 -3785 278359 477581 673821 290105
16404 505857 522111 554067 262868 321549 66840 226453 487058 89784 322253 229459 135545
16393 135545 460634 391875 292601 250096 326649 333391 147937 108550 304536 302162 199601
16382 199601 383236 202076 107378 435422 41888 463118 214087 356873 -580 185218
16371 -180381 52359 286051 311391 125178 541039 138489 85338 97258 372852 147415
16360 406344 134755 262560 145025 403668 208390 208666 130781 354281 274502 263875 189426
16349 189426 63296 393029 27685 -106661 -30098 299803 150393 -19432 202398 12428
16338 281493 385391 163211 128567 311267 148340 22618 -106987 243974 313084 33591
16327 48927 -18768 96806 559847 440205 50865 -73963 168392 122731 245545 237522 532567
16316 532567 -410082 106138 -233253 -52759 114557 184991 -223370 106155 91573 27332
16305 70981 22973 54749 300521 46501 145039 27841 335224 66059 11681 350622 4198
16293 224330 74506 482609 80958 254022 261319 143831 -37980 170182 -17333 104802 -60132
16281 -155979 157364 -104305 61949 136594 -75833 29237 209635 488922 7453 117704 181126
16270 181126 40276 -82938 6042 330779 191824 -24269 -280596 283654 -84216 -213062 211320
16258 192083 -214595 -192482 -68974 -118947 132309 105106 104122 -397586 -40902 362952 205541
16247 205541 28545 61439 -135226 34315 -60404 -256000 261788 6813 391174 -99624 79590
16235 -35450 265594 237969 109233 -139215 133258 127551 -243254 45082 83695 -196158 -267477
16224 -267477 435017 49622 -102346 -63904 -22180 -1780 -180684 96381 83239 139879 -156071
16212 62359 -104459 94155 344026 -36456 95926 246995 -49591 -252718 -44927 -149329 -67249
16200 -325002 229136 320999 243145 -106953 157385 -233165 114615 289250 -119648 46469
16189 945 74246 -73787 152386 253154 65695 -71439 -180423 -276006 3140 -22128 203229
16177 -96593 -158365 129482 178144 -112161 256192 15653 18116 178670 8171 -74905 -163299
16166 -163299 121001 -2717 -220465 33455 45286 95644 109779 51947 -269737 128535 -108182
16154 -139162 188111 173304 -369401 -80750 74193 21765 -164034 -21673 77843 18801 -202199
16142 40535 -82727 -134368 260514 -193996 -66518 -216589 145542 -35524 -433150 -85026 119816
16130 36934 45191 32790 143920 -44694 215528 -327377 53062 57336 -245354 96030 97403
16119 97403 -275959 63750 119696 -181164 -207530 181633 -126395 -40971 -167692 -159899 245843
16107 -38505 -373631 70454 -22631 15699 26387 3303 -172256 255282 -160554 79647 -92599
16095 38352 78663 24192 -429843 169591 -240994 75042 174399 -266261 -4043 257303 -215732
16083 98184 139435 -25351 -200481 -78902 -75308 151449 -51875 -390434 27376 260193 -236860
16071 -259893 -472065 38704 207060 -137035 89993 -111765 230224 19081 116595 -31154
16060 -94197 143349 -202096 151303 -301384 -77790 -128663 -103653 -315401 204078 -5057 -293240
16049 -293240 -30300 -229723 16508 -309979 41129 105489 -296682 -23864 -43454 -81459 380348
16037 279237 -38656 -104065 261018 -240731 -127851 -85879 250293 -532728 -304618 110844
16026 -61951 34936 -50996 -264555 -53698 -248782 186370 -55939 22923 66347 -278529 7785
16014 -163396 -101915 113587 66656 -173598 -282661 335351 99032 186503 -260031 -48997
16003 -14111 -23699 -80716 -240421 -244824 4671 -45825 -175592 87533 63153 -183838 -230435 -216
15990 -158389 320211 245307 74264 -79898 13115 94262 -191503 186936 242717 622054 227031
15978 -91959 69489 -22554 -13900 133284 -207159 73154 173409 -269800 156631 -168688 -327233
15967 -327233 -182585 71721 -35394 -132861 273059 -217160 -174726 -176648 167878 -197602 -168362
15956 -168362 -50963 95106 77030 -122344 -234738 -60473 121583 -58125 -322445 166243
15945 -5343 2212 -68467 -143607 -111076 185588 -49772 129628 75253 -106641 71403 174859
15934 174859 -128203 -130822 65228 -46490 -173384 -112748 -83691 -126006 -198402 -303158 -21813
15922 -156380 382138 108116 27222 -123170 -250314 -51559 -394099 -11137 -57977 190105
15911 40486 112330 58018 30476 268212 -84381 350532 -98506 63749 -281728 -192548 -67042
15899 281020 -178685 -67041 -278646 117455 -156525 142431 4642 -126476 -192311 -72604
15888 -134568 126278 -244002 443390 244915 -122582 206494 78780 -1870 -292212 -112287
15877 -24200 -150862 176974 -6846 -9134 -91851 -111309 -197238 -188976 -102939 8701 143228 -66176
15864 83312 -228945 -112668 25193 92889 97150 166958 -163005 -286472 -94015 -76410 175067
15852 -14520 63561 -323290 -257224 -188874 -95467 -139286 153716 -304655 114221 34698 -82773
15840 -60687 -94792 -396013 -50667 94140 -119509 -167909 -124675 -150470 -120550 -133805 -461684
15829 -461684 115706 -149493 121711 122882 27725 73223 -132956 91680 4947 -11243 -37407
15818 -37407 53948 -144996 37862 -7636 -336271 -64189 -163335 1428 39443 -64403 -19962 -278636
15806 -278636 350280 -266770 -160287 -382879 185233 -125323 -219978 -311522 26435 98271
15796 98271 -305200 95204 -34282 -187795 163420 -62310 -5468 197650 -292269 179752 -105746
15784 -238389 -76486 -49809 46009 -82738 -168419 -173857 -100459 234532 320433 -92026 185627
15772 -248875 275825 -271074 152954 -161508 -155186 -130207 40595 237383 45605 -111822
15761 7027 -168599 -92003 98846 15788 166548 63751 13743 47258 -111859 -229964 132447
15749 -338277 -78598 80169 -32851 89176 -16084 287746 -72186 41801 200102 99887 128889
15738 128889 -6631 -100629 91629 -76009 65752 38512 -67304 -208717 -228193 297578 -247975
15726 -309418 -290167 43727 -342293 -285773 137035 -9397 -140802 -229779 -207562 -159969 -92125
15715 -92125 185671 -121380 -56916 -151409 102015 249535 116460 -99680 -111170 144378
15704 -15888 121579 -252820 -214804 15975 -265116 49866 180814 -177220 -247637 156182
15693 -245142 -149176 -86979 -104445 -97662 58140 -296456 84743 104585 -63614 -47531 97513
15681 -284411 -145885 -44796 -197940 -23039 92246 84305 -6271 -34999 -89977 421480 -87846
15669 81531 166533 6887 -24511 -105326 156718 -325403 -162922 12026 -57498 -146615 124826
15657 -103108 -247795 -147842 53978 -173176 -301526 -31412 -443995 19132 -144006 57018
15646 -24276 -218933 67019 82699 156185 -8886 -53003 102336 68891 -148415 172752 -134791
15634 84498 55908 166217 118321 72598 -44484 -43636 72106 129662 255820 49975 -203239
15622 189308 -210000 78253 -22867 -55791 -262604 -99021 -97327 251709 -75747 -183127 -110633
15611 -110633 -400608 -54966 -88934 -67525 78868 -80494 105091 -10863 295468 66155 52459
15600 52459 220422 -125557 -200600 200805 91700 36218 162857 109762 -128803 71532 -182098
15588 -69741 -169709 174143 4272 240402 -140816 -60467 -2842 207284 4060 -302575 -110448
15576 214384 -202914 -15869 56392 -53924 24912 -241213 228706 81187 -68035 245984 38485
15564 -258767 -198411 -239289 38537 229817 -141910 205383 -35628 -68713 158612 212471 149848
15553 149848 127571 -138319 44545 -224230 360 72321 -71709 -111545 203285 -197336 -259357
15542 -259357 -256376 -2036 91833 413405 -283109 -17282 -145071 -2572 52650 178566 -116291
15530 -189134 140443 508258 -144443 -11452 12197 126776 -165994 -57170 56226 139479
15520 139479 -53139 104501 40359 -210408 -379556 -231566 119630 -231870 101315 18131
15509 27320 -19590 -124556 -9243 -15236 18156 -231334 -315938 -271053 -230607 -125735 167155
15497 -159957 -236228 -148084 -176867 -144078 -48356 -105308 -169025 -180567 -244633 -113418 -95209
15486 -95209 -55621 173396 -224794 6820 89956 -203818 77058 240376 376845 -397813 -25747
15474 -72521 -82962 -81717 363942 81410 79653 35975 73417 39828 47345 123417 -304376 -45231
15461 -106157 -296841 -99169 43652 176956 -359017 126796 293439 -252757 -313050 -59625
15450 -78761 75329 -304341 180702 -346692 -114873 -4615 214741 -199649 159247 -317701
15439 -242332 242866 210895 -153707 -52803 63618 104970 135427 50731 -308474 -46825 193941
15427 222110 87866 -327855 27283 -118125 13706 -22001 21874 39378 -134191 163521 -106799
15415 43862 123331 -36980 -1179 75727 48632 185901 213251 339168 94102 40892 64570
15404 64570 -117433 114633 -9566 302207 10443 -250535 -63318 229845 279032 44586 -51715
15392 -400986 -14714 150087 -88630 -168293 -383502 120050 149945 1027 77899 -286822 -21688
15380 271476 14517 -246803 -15043 -142658 10829 33524 -43641 -227277 108864 -195491
15369 335560 160474 -26712 -25569 231792 37527 216894 -70467 -53044 -416834 144674 -521664
15357 -31295 57243 -72037 257028 -66316 -125659 30698 -106599 -112703 194895 96517 190604
15346 190604 -88228 138778 -320306 125107 -31273 -29191 -165967 22873 68872 148192 -210567
15334 91879 81843 210834 252018 232450 2836 -75125 32323 -37528 185295 -63025 -92441
15323 -92441 34835 -321672 -68759 270954 -14297 -23843 -127039 47371 -42884 -18646 136002
15311 61560 -118630 120868 85975 110917 -6980 214254 -36198 -191687 41831 51401 83528
15300 83528 138446 -161439 -188365 325525 -123601 143645 306920 140387 63407 -110776
15289 -177949 165286 79370 -36114 -48063 236671 -189699 306704 300067 -84819 57471 -191697
15277 96614 -86725 238569 -173954 17466 322315 18143 223751 -49329 -85440 -49357 241348
15265 -82875 -229289 28353 92753 144502 129636 63407 178504 102623 277892 141687 133466
15254 133466 387933 -56515 -27726 314751 487554 828186 1691607 1489283 1042913 1659517
15244 1659517 839759 -3515 -1775 39738 116146 -20026 68293 -95308 48620 302361 99167
15232 -58735 455629 -27288 181518 -128637 139402 88086 33512 60529 48527 85080 58138
15221 58138 253341 -47782 100010 -230926 163112 69328 -46322 284138 155058 -103243
15210 -193599 -101702 35875 140111 276252 332616 3836 117470 82206 -95876 417374 8227
15198 122518 17342 -34758 50275 -62412 46695 -46956 192984 -104145 -6754 62763 564990
15187 564990 146882 -93499 201249 27512 273664 167913 -24108 35040 -25256 -81142 269082
15175 -7157 346480 -32452 -44493 133981 -219569 -216979 308700 -244732 287930 -213425 -66426
15163 152099 62457 -330450 -72473 15948 244756 124085 146495 213911 260291 237246 -17421
15151 133935 -272105 -257316 132631 184749 168787 54415 48926 267650 195556 88946 -175201
15139 -45104 75470 60700 -191583 13351 -28162 210453 -19881 302654 222322 100596 123501
15128 123501 179384 -87918 -283715 325793 219908 46095 203350 250842 -92828 81477 29523
15116 -56107 282784 11560 108147 212680 108110 -2323 398296 98495 -140342 383665 115256
15104 -104752 -24862 -119440 225903 7166 271427 -146649 263765 339177 266782 55508 313953
15093 313953 -63353 -5803 74920 -41891 -28247 208321 214604 388371 250277 42860 280095
15082 280095 10006 156374 183842 35535 40786 239318 203493 164187 133536 215488 328139
15071 328139 332288 32191 167558 377457 -72732 -125158 83027 97175 24419 132052 374485
15060 374485 224307 55966 -101473 434872 331062 243312 -5721 69475 155899 437293 129730
15048 403583 135874 110365 139859 413676 -117765 92014 88561 294097 37950 192514 1121
15036 407138 328271 -88429 299181 406206 155054 218509 124645 270402 193967 218078 141479
15025 141479 80840 403410 36926 560721 63531 73485 361013 390225 103482 387140 202030
15014 202030 234829 286143 332727 289270 18620 503487 129228 498423 526567 482332 129615
15002 37558 126097 827 171422 -49404 7011 453309 209366 48339 59650 358089 279407
14991 279407 -25178 180649 471114 -103146 140933 233841 170516 210285 -39010 229869
14980 219503 387829 114430 345330 517123 265911 331526 257300 141851 98863 144518
14970 144518 238322 260304 -23774 238305 187383 148926 323500 556402 159687 496190
14960 496190 142199 272727 413696 -47677 418417 152495 497960 301015 384229 230242
14950 230242 328201 132637 287891 246558 283474 -64137 195686 54027 604957 357495
14940 357495 229003 -116935 295461 206230 336386 121590 240736 538884 412210 359082
14930 359082 266274 224454 386722 417057 197927 339291 352733 293982 387916 207638 388293
14919 388293 477307 687727 334037 108586 294682 275239 291771 345943 206184 230500
14909 230500 286939 174618 11173 251313 -66874 527009 255509 267122 452009 600290
14899 600290 358192 337519 218230 108714 308808 319186 228016 163556 324526 437119
14889 437119 331919 315776 336813 468891 52408 225342 417664 337382 250654 171001 210389
14878 210389 108791 586228 358068 571629 331664 612116 339273 461815 394881 402533
14868 402533 91919 295103 474628 553565 299148 453157 212209 195037 473659 424045
14858 424045 467976 360171 277510 533529 435902 685719 322233 604864 527951 425690
14848 425690 885835 670724 418021 550887 323904 548192 267252 332625 615694 322863
14838 322863 504281 317839 540523 547209 196615 684636 357332 570056 606690 562758
14828 562758 454103 639632 246174 326127 501490 388568 444840 532966 453623 381033
14818 381033 509349 655478 605657 620064 206685 818050 687676 537873 468521 586083
14808 586083 403898 729368 263493 495774 541877 330164 237987 399901 477625 473818
14798 473818 334615 134058 389011 379738 740071 323898 331883 569596 436936 330156
14788 330156 743750 487293 456626 353412 653076 706616 539380 619447 324782 510602
14778 510602 320991 923963 552111 530995 429189 510381 535678 803206 569844 377674
14768 377674 730407 744781 933548 598307 801993 803691 811836 507522 502174 422316 857696
14757 857696 814853 606938 520097 505124 683847 955430 910756 912890 544549 598845 611904
14746 611904 754809 1202492 630621 673608 925236 513387 940553 586878 877341 731920
14736 731920 956736 803163 729470 641582 581548 961746 849453 858853 911993 817591 460785
14725 460785 742282 531214 646888 817097 901395 554033 769812 980971 762422 639802
14715 639802 1090993 765692 791444 768822 899868 1049612 530903 535489 651571 662967
14705 662967 782991 1132103 930350 848720 682400 1131120 862153 699775 761645 1115318
14695 1115318 954212 895256 1121647 1102558 917393 905304 794386 927939 1036959 609618
14685 609618 995333 1040481 1102828 1069480 787114 1121084 797754 819646 997032 888988
14675 888988 694404 971859 1172221 909453 1216852 1244377 1356876 1116585 1045189 1171362
14665 1171362 970717 981563 1289514 1136662 1253231 992252 1051472 1028571 1112518 1296604
14655 1296604 772774 1175840 1033247 973654 1144653 1247578 1064044 1335129 1172978 1161148
14645 1161148 1302226 1376489 1293172 1169972 976815 1406741 1457518 1458890 1563189 1454760
14635 1454760 1597168 1467559 1623344 1237422 1371404 1590823 1463334 1539524 1400704 1384555
14625 1384555 1392442 1500025 1608275 1654108 1537037 1455295 1473521 1219513 1527894 1593862
14615 1593862 1561890 1363151 1568801 1616869 1622575 1745714 1561179 1615737 1835856 1684610
14605 1684610 1671437 1835241 1612699 1687315 1556144 1601996 1787280 1604693 1903877 1866001
14595 1866001 1815254 1651713 1850963 1871251 1904403 1785991 2075690 1981381 1926098 1846711
14585 1846711 1914457 2172481 1604463 1926130 2191475 1574876 2430859 1989533 2170513 2060565
14575 2060565 2127211 2310936 2334463 2443205 2185760 2303329 2568234 2397820 2274718 2419803
14565 2419803 2463062 2773629 2901605 2635255 2891944 2651675 3191381 2847340 3041657 3309066
14555 3309066 3604355 3437132 4117268 4520656 5001561 6185235 7477546 11371294 21463354
14546 21463354 42604503 45459115 22513888 9762704 4936486 2925914 2669531 2172971
14538 2172971 1934760 2129585 2049486 2227923 1783753 2108984 2161944 2474421 2326840 2345798
14528 2345798 2636446 2635511 2573047 2695187 2999019 2408937 2426500 2394074 2555869 2665820
14518 2665820 2889524 3003111 2775355 2678341 2930812 2665602 2810656 2909067 2911796 2953843
14508 2953843 2707444 3110517 3400560 3022327 3481428 2928903 2813663 3268311 3323382 3209552
14498 3209552 3414672 3296917 3452552 3463143 3516410 3267356 3491546 3671445 3895751 3841823
14488 3841823 4034115 3629969 3978108 3892630 3570529 4051546 3773394 4061254 3954246 4249834
14478 4249834 4127295 4152808 4056746 4055508 4399940 4235871 4465385 4470017 4566590 4547680 4477144
14467 4477144 4869410 4735077 4904444 4883247 4794968 4707097 4763996 4953705 5564319 5141670
14457 5141670 4845077 5030759 5500689 5308151 5548829 5565311 6038994 5680151 5531671 5741770
14447 5741770 6093177 5858049 6021330 5887858 6466862 6173805 6362244 6459607 6385802 6707110
14437 6707110 6530051 6886608 6926493 7068388 6870132 7075255 7382137 7043787 7417143 7488975
14427 7488975 7630487 7756107 8092465 7745074 8175183 8019310 8115496 8313992 7755695 8634786
14417 8634786 8617766 9312196 8653388 8941306 9323325 9345522 9183676 9610336 9664386 10022880
14407 10022880 10150779 10340864 10340329 10630294 10863234 11003677 11106923 11250200 11332802 11636099
14397 11636099 11961622 12146533 12300115 12505616 12500507 13059168 13122162 13155206 13652014 13879026
14387 13879026 13895055 14290913 14705652 14859296 15351558 15332932 15846801 15621014 16000851 16551800
14377 16551800 17116212 17244950 17545353 18060412 18056793 18755376 18768630 19543654 20171871 20250750
14367 20250750 20609738 21201010 21640377 21852428 22339712 22809266 23276278 23963717 24313454
14358 24313454 25064209 25737644 25951309 26512922 27299807 27901716 28490021 29574887 30034467
14349 30034467 31122619 31706560 32544378 33144044 33971212 34603227 35732495 36932625 37921362
14340 37921362 39034272 39994064 40937707 41865016 43621589 44642426 45843204 47387655
14332 47387655 48701864 50235622 51931886 53535662 55044843 56633523 58855790 60613018
14324 60613018 62806915 64865047 66913399 69406664 71828083 74168465 76942612 79947310
14316 79947310 83122681 86250377 89871152 92959816 96844065 100267648 104529576 109102479
14308 109102479 113534319 118322490 123592903 129288031 134340253 140443730 147174315 153978145
14300 153978145 161126116 168708477 176793880 185367933 194412499 203681657 213857428 224462303
14292 224462303 235114738 246255518 258593212 271504669 284148629 298108343 312267017
14285 312267017 326695400 341235142 356631164 371413109 386381378 400718307 415080311
14278 415080311 428866149 440904845 452288223 462007659 469797336 475298641 477893023
14271 477893023 476289217 471660585 468330234 464162641 457814259 450024550 440491102 428421822
14263 428421822 414472462 399773644 383903815 368123035 352091483 336062358 320120446
14256 320120446 304767926 290595004 276911290 262921575 249842638 237338023 225444505
14249 225444505 214566019 204022594 193819137 184331034 175683755 167550926 159739692
14242 159739692 152211722 145539351 138664379 132563787 126857989 121347157 116247521 111220007
14234 111220007 106837761 102150145 98358955 94645061 91027656 87332394 83749205 81156157
14226 81156157 77779143 74950308 72523859 69448328 67109698 64991572 62761758 60928170
14218 60928170 58805430 56888626 54868143 52935419 51785988 50247074 48605817 47099593
14210 47099593 45925713 44533990 43394209 42693460 41390881 39852595 38569531 37679595
14202 37679595 36481078 36061232 34809650 33933368 33054234 31885301 31350632 30519389 30392649
14193 30392649 29201586 28272811 27491052 26867167 26399668 25930009 24816882 24948798 23891886
14184 23891886 23771031 22948302 22658946 21663398 21434791 21066904 20667795 19985069 19942858
14175 19942858 19272180 18996189 18953562 18136406 17834521 17171295 17272673 17170874 16759833
14166 16759833 16282156 15913437 15883888 15638358 15163249 15042078 14684629 14548702 14445417
14157 14445417 13967197 13819772 13242643 13501871 12639976 12920073 12736847 12417582 12581619
14148 12581619 12050615 11902558 11746308 11347842 11217260 11289901 11130127 11134805 10727042 10385490
14138 10385490 10545261 10231428 10158433 9969029 9920399 9964911 9685286 9418593 9381581 8878178
14128 8878178 9247070 9070709 8696970 8444865 8630810 8854347 8448572 8168986 7589634
14119 7589634 8105352 7974255 7859335 7511528 7858354 7511794 7387343 7357698 7415915 6905468
14109 6905468 7075770 7131528 6637876 6794346 6698169 6710504 6810654 6490108 6582731 6276048
14099 6276048 5880962 6267007 5862242 6322199 5798388 5952674 5750016 5678540 5325159 5640453
14089 5640453 5376314 5778939 5359156 5214575 5178428 5460312 5561367 5144240 5180394 4969639
14079 4969639 5229972 4834610 4996423 5037165 4542260 4776141 4611330 4493650 4740292 4678014
14069 4678014 4231498 4046985 4169795 4164602 4425027 4175115 4181194 4545175 4054670 4329658
14059 4329658 4336266 4115758 4084223 4164713 4216839 3818886 4030968 3662989 3861444 3575897
14049 3575897 3614249 3684979 3748882 3609814 3684463 3540940 3686454 3612987 3311985 3522460
14039 3522460 3451964 3154522 2838229 3348720 3388164 3277405 3313767 3161033 3272204 2981189
14029 2981189 2928713 3306473 2904030 3006453 3324866 2896244 3398999 2969356 3235696 2881227
14019 2881227 2764318 2845713 2536796 2954380 2404924 2517302 2626828 2555543 2629605 2676897
14009 2676897 2497870 2688214 2658977 2310909 2483364 2683029 1971817 2124305 2173695 2223134
13999 2223134 2458195 2350818 2368018 2400496 2054832 2253707 2476375 2435365 2598506 2972787
13989 2972787 3783348 5881982 14016627 35374145 46709464 26261296 13769231 8579449
13981 8579449 6068650 4741887 4074618 3888728 3483699 3450274 2663023 2977585 3058941
13972 3058941 2762919 2797385 2674367 2456693 2302306 2210813 2518592 2546634 2356530 2488456
13962 2488456 1942718 1984655 2334321 2201181 2091722 2422905 1845948 1939705 1861893 2135105
13952 2135105 2149393 2022021 1926346 2149098 1715372 2229123 2064193 1851110 1671583 1814727
13942 1814727 1728541 1723162 1792761 2074858 1813831 1664917 1837752 1801746 1508715 1990775
13932 1990775 2002476 1866689 1684503 1712217 1760896 1678984 1620880 1799138 1284291 1787700
13922 1787700 1786248 1635563 1789385 1512809 1539992 1605995 1437469 1431249 1664395 1413875
13912 1413875 1469423 1359745 1415099 1479489 1416285 1555127 1606270 1555067 1437540 905890
13902 905890 1483380 1267467 1267790 1306687 1385874 1406051 1272838 1334858 1359125 1146266 1645443
13891 1645443 1354074 1213874 1151645 1382049 1159411 1022570 1082738 1304537 1232221 1243280
13881 1243280 1438690 1398238 1534208 1266660 1390578 1291376 1260625 1074618 1367251 1191462
13871 1191462 1307319 1025622 1230536 1229320 1203179 985949 1195582 1532642 1255562 1164377
13861 1164377 1116544 1309882 1064565 1213915 1280183 1351214 807682 1215469 1225947 1379026
13851 1379026 1187314 1334531 1352232 1317551 1238961 1065115 967039 908378 1072246 1022388
13841 1022388 795944 1203304 1308389 796251 657787 1308246 777912 850107 1068574 609757
13831 609757 1049837 864523 897025 949717 1143469 779470 916459 864552 806815 919903
13821 919903 1068812 820651 1054642 814212 999371 809297 1089921 955420 924677 986881
13811 986881 510207 1034637 988866 774789 1292248 779649 868094 803294 1092870 684004
13801 684004 1089421 747944 1114361 1054099 695088 856132 878925 765692 876830 625801
13791 625801 712554 667106 365941 777802 621909 910151 872923 756085 824112 1005459
13781 1005459 639703 825826 669326 597848 1043089 1228867 1039162 784321 940094 1026879
13771 1026879 638960 866498 1025919 1048604 667890 876649 738574 814359 769421 639805
13761 639805 729822 598896 612611 559625 776223 676076 562451 502315 788983 413577
13751 413577 514374 528798 794412 856744 669271 921948 496042 754795 309556 737970
13741 737970 573612 327510 595942 813899 635486 714134 328905 629276 291497 323943
13731 323943 748973 171064 618243 663263 519368 281243 623421 564330 598821 1000389
13721 1000389 667948 695802 735828 666232 389581 520512 483560 576545 294178 630641
13711 630641 634747 657340 862194 590154 468438 827117 486204 683315 260706 606338
13701 606338 714445 364847 404838 602691 575821 586502 413354 834591 337541 436980
13691 436980 730286 258883 493722 290926 347234 501086 396692 342136 273917 220126
13681 220126 509595 496061 504570 357124 332460 559815 286673 446967 682175 676584 428149
13670 428149 423415 562616 468277 223308 620321 358315 502177 552858 706817 449420
13660 449420 611769 532945 356385 509942 469342 396017 646820 452154 277075 518997
13650 518997 381387 588658 411529 190556 278007 262365 451332 518413 344367 371063
13640 371063 738760 -30523 288594 575547 129848 210252 465043 248636 258283 387150
13630 387150 426387 629727 429373 339904 644471 186887 439140 385370 510389 309226
13620 309226 503003 479259 139586 531133 24559 369802 351965 201917 614268 499593
13610 499593 404951 493750 137581 663337 449244 262710 470518 417917 301981 509123
13600 509123 564793 452565 396016 621404 403140 105236 562977 373566 508794 424093
13590 424093 40400 72030 125094 669268 480423 526943 452468 685952 196125 150228 292982
13579 292982 488660 433121 344672 233501 230019 190280 281531 417702 406686 168561 320456
13568 320456 367027 177904 207543 104429 611975 527839 531885 190356 372306 498821
13558 498821 506423 595515 372391 206735 320969 292381 553215 354070 567166 591396
13548 591396 364072 260180 193296 498316 145695 267332 309770 398839 409607 338040
13538 338040 336913 268068 160273 269261 477862 -7224 530159 536085 340230 388103 455757
13527 455757 268152 -3836 398580 408506 382477 9212 71215 364761 708863 261143 200717
13516 200717 488988 575379 302634 345352 438400 264100 446425 369127 -63054 394149
13505 343615 378754 423829 130436 594333 319171 168553 200416 98432 422848 473517
13495 473517 25106 568008 65156 232429 422077 377245 333420 169844 158187 407238
13485 407238 95776 234317 205734 175850 264717 249792 314137 -90274 578010 489633 169370
13473 115915 360025 214483 469201 253285 487211 169774 525703 290935 301303 60085
13462 348330 302017 95997 362747 510424 -9208 458 175344 86060 125345 -194978 250176
13450 341278 328138 47949 330846 259510 292457 310820 128227 40198 394928 112145 16512
13438 316604 83831 138592 255251 105084 258283 320078 227380 306486 161841 286997
13428 286997 320496 41166 458526 151404 194236 240966 -40043 416543 26455 338753 209889
13417 209889 418389 152658 224172 225920 -322288 462565 267568 85151 73358 416769
13407 416769 28070 213203 389556 335503 205228 65188 470417 -87593 -135680 -104256 -57030
13396 -57030 98869 -35701 206854 77315 276627 398735 -57876 259808 362079 -217276
13385 178254 -95503 288599 262554 147858 289970 196834 142478 163738 68128 81180 143108
13374 143108 506670 269709 235349 458477 128572 204119 469297 -55015 364546 166512
13363 319657 413673 349124 254713 87942 435839 39768 283764 215190 -49893 423434 199646
13351 35294 189606 215378 296729 22163 212348 162171 165816 434847 33753 74897 90551
13340 90551 489832 744778 5121 258348 186457 -152343 398665 4498 135183 193305 42903
13328 272975 361893 -29304 240833 402105 359569 235102 261500 248284 226358 310833 160591
13317 160591 167361 -205084 1060 7941 164149 374192 360799 -70336 237497 7511 316469
13306 316469 247598 444001 331253 194361 -173922 47200 95420 446777 180069 143521
13296 143521 56957 345339 244610 311446 337264 97933 161601 303669 17418 -172559 13705
13284 109424 16679 62262 190658 238021 202906 -224783 375007 232719 161246 23848 154816
13273 154816 -35924 254076 164322 137926 225985 -206908 7339 212104 396956 255312 48196
13261 245996 301630 435105 87755 244655 470359 -32104 202114 119597 51848 86193 -27103
13249 73313 105526 59802 179108 75842 306731 -21267 183651 117418 175606 -21669 136537
13237 416892 70312 21954 -250328 114486 106645 205009 -233177 123287 428347 -80672 229033
13225 222560 224522 93278 72520 -84089 151612 352459 -107913 265280 268497 -862 83837
13213 -109389 207709 -78311 42143 90078 -39654 134209 76324 413140 50373 249784 194362
13202 194362 300492 229238 5691 181779 -10373 275308 5608 -78977 -102780 161004 -125193
13190 478430 -78521 -33416 400060 -2043 326924 328658 355171 95476 169620 91019 6062 -15931
13177 236800 2 -49118 9890 19331 -69662 347227 423221 -115124 208241 -219467 768 410490
13165 410490 202425 154568 173872 146007 -346598 221728 374391 131980 70809 -137285
13154 116121 25658 102333 233225 56744 279140 -221794 438417 -37959 168081 134490
13144 134490 55167 -368726 -113524 12252 -37837 64228 249189 238532 -1314 270716 13304
13132 -72159 -156153 -11114 195191 26870 221354 -106509 18749 78648 263942 30390 239093
13121 239093 234003 -190184 -202898 -286295 372337 -183911 211113 -211520 -93718 38318 179328
13110 179328 227800 3347 93899 325375 -50444 -102417 282297 408463 232038 329034 -3077
13098 261625 -133284 -332214 81822 320851 398341 232765 257590 76844 128189 247677
13088 247677 282924 -108562 9696 51779 84462 -87442 275462 189523 44035 215665 -215459
13076 55541 83252 104718 118996 -126227 -180042 406996 256847 59979 213749 371248 16364
13064 100352 279044 299626 339334 252564 -62949 338465 245282 -235750 35560 73502 135113
13053 135113 76590 127826 247629 118547 97290 52155 -35246 167807 256162 81812 51229
13042 51229 -154370 -65662 -206570 13996 -50504 311945 62917 98331 388823 -207647 133649
13030 381013 187571 -127163 -21495 -138831 214513 291840 24971 142968 38762 -118845
13019 291577 -111603 200837 309971 166424 416560 -8496 25690 98632 120463 52785 427330
13008 427330 91534 118843 180086 199230 199293 161010 313893 103928 183569 293041 -66443
12996 331526 281435 205623 87532 85234 153300 -108338 -190728 290338 -253608 23315 -895
12984 93681 -55625 -184636 -81224 119633 -269136 -44380 12488 439729 159197 -162926
12973 354898 310542 124255 -18826 126144 -229741 -111320 -41310 125821 -153936 166060
12962 162233 49812 75531 118867 240994 -125567 -187863 89955 -538 63160 266381 166698
12951 166698 -28337 228415 -92942 6473 -14612 -160818 80311 168736 -6442 -5712 -180858 64753
12938 -15566 240552 -193995 78254 251512 57505 -127055 255285 141386 33888 190568
12928 190568 -148452 441338 -277667 -86975 107704 233555 -50909 -16356 -169546 46620
12917 -205219 -222167 -309877 78607 281538 -11211 -37034 -119151 -229730 171022 80599 158337
12906 158337 185501 206459 -101378 8842 129544 33423 -398432 -824 -104082 76748 -12419
12894 66046 -77719 -207463 96369 -32007 231467 19518 -147978 185974 218085 264319 173645
12883 173645 -54815 27497 -206605 49502 120509 147487 -270073 234108 -170266 -51926 21355
12871 -57848 220588 -184800 -107784 198222 -24302 99712 102391 472506 145914 -323983 -213587
12860 -213587 266559 245178 230340 -178601 143327 -44830 97054 499602 73282 -37334 236220
12848 120946 -148564 171147 62379 113550 49757 45764 50520 110580 123354 -40609 215295
12836 -262482 155255 299052 151703 -100683 76591 -130634 154607 -214442 15136 48612
12826 48612 -56738 115237 281439 278843 41338 12810 -105214 65095 -198890 169113 377154
12815 377154 26870 40206 -89895 88568 141356 107384 151845 -257506 54013 213594 -18885
12803 -88180 77052 -140088 82255 -8601 -21736 -24476 -159960 -20251 239430 -14376 -290612
12792 -290612 317518 56230 58635 -308117 -43539 365728 123533 124131 70743 19430 187466
12781 187466 31878 -40402 84410 388358 -53587 -262599 -138274 63341 58512 -68561 -36711
12770 -36711 -155759 -393878 -166718 286604 -32724 41165 -17264 72295 -18647 162229 3326
12758 -230424 172767 142801 12997 15994 -61243 50614 -103356 87607 -173059 -15215 314301
12746 -79875 343577 63796 6017 375798 54578 76060 75320 -163702 -287216 36396 52937
12735 52937 297538 357247 419034 431065 86928 235251 143935 57291 112858 -84924 148687
12723 -17021 93654 -4317 -130859 -53944 210128 352830 -11430 237380 213935 154610 -111415
12711 -89668 -162621 -37730 68197 129264 530866 -87010 -104099 106187 391201 -239349 137688
12699 -207058 111693 42093 45804 102170 62739 88230 -275580 76835 143244 -65651 -214832
12688 -214832 46063 -129311 -262617 124093 296170 421377 22398 100080 174428 263271
12678 263271 302779 353322 -320594 -117863 -74562 104742 -164864 55154 -41909 55982 -130918
12666 135128 206068 39296 -53817 -33726 75459 -16960 149572 -39109 315164 248069 -29634
12654 169481 -6554 162269 238357 10810 159464 -1460 -175814 -133555 333323 389584 160340
12642 -156460 86719 395767 155867 333191 73969 -229497 -77750 432 74200 107953 140377
12631 140377 186837 72551 710211 291148 339672 239187 348865 181650 151981 59588
12620 408514 28125 -580 200443 230074 -208730 239871 14393 -100791 -131521 -65498 10359
12608 37671 -175067 -24535 7079 98100 227226 294847 217370 69037 -28370 371181 -215795
12596 249059 225954 236631 335287 -153542 44540 200329 -258996 321822 119241 120036 22596
12584 -206492 56579 141482 59075 -207510 78098 146685 82559 104235 -400246 -90001 -18500
12572 -200223 -275216 -123237 225442 -63437 770 -30287 -56213 214930 -407904 111193 310193
12561 310193 335967 -295123 -186079 -53354 38995 -141489 85907 1525 289185 -45556 -367972
12550 -367972 -101022 -19328 -104481 -97890 -8374 244865 -59651 173286 -6690 245773 64706
12538 -39511 270837 103178 308375 -90130 171824 322463 -149582 182556 8140 -44920
12527 -50959 19219 242752 -163557 71528 -4868 107860 -114573 124592 200893 -45677 215429
12515 153776 13698 350255 229329 -5134 96179 -155664 -25014 247136 21875 68989 -1246
12503 393607 38125 139237 -148769 -99553 -109963 -391366 -168443 -81804 257090 -40956
12492 -356521 -138614 2786 242984 -9021 -54116 29815 133206 34788 -155234 -101856 -169684
12481 -169684 -120862 398383 136791 69157 101786 34738 -279822 -199751 311233 -256483
12470 -112176 -140538 39311 -210544 -21576 -84827 -85828 -150111 196327 22301 261618 -147576
12458 118093 327065 -179990 -249757 -21394 3035 342826 -97519 -348872 -106980 44023 116391
12447 116391 7091 208834 45600 -217843 20934 70073 34427 446980 108758 -11988 -109969
12436 -109969 60907 -48092 -469296 -82654 -187573 -70799 468918 -20583 7735 11997 -139131
12424 -9775 -337818 34508 23386 -68393 -54082 201997 -216558 -153917 273282 -36165 26309
12412 -150102 -26682 -185361 -13912 164539 -217534 60376 184178 -17453 -115870 -75369 235894
12400 -99259 94165 -109079 -100783 230744 -57867 -264201 -59941 112486 -75910 -198765 -47473
12388 109275 -153897 -177855 118048 153032 -78077 90627 -85901 55952 153925 -195099 52411
12376 149875 129704 -12672 59117 -40785 -353936 42238 120934 -54786 -123366 -267917 56255
12364 126012 -6597 19113 36320 26866 -253385 51567 133988 87444 -189968 -35545 53827
12352 164959 -299051 88021 -46856 63723 354818 -167849 90986 408473 15436 19833 60219
12341 60219 228826 198703 184839 146208 -104219 186778 -500855 138440 13050 158680
12331 158680 52969 -125491 -125244 -23734 209415 29223 143516 -22060 -120208 10336 180133
12320 180133 80211 -131944 110890 15076 -141048 209149 -118556 54869 -57866 425967
12309 231686 20374 -179882 -53693 85358 242456 162383 494837 31305 336452 115339
12298 82520 -318986 -22607 319794 138619 -50396 -240584 -262793 -28104 13291 -79853 -117049
12287 -117049 -370975 -2171 -172436 -211809 -13817 264427 133961 267084 32277 -162485
12276 221378 -180723 226390 41910 43441 343089 194151 80702 214974 -37089 123043
12265 40167 -197060 132538 216156 -20611 342573 158117 17210 260523 3971 322441 84343
12253 -261540 59016 103308 115363 -68490 165342 93106 -199461 -135465 133849 357670 -60918
12241 96413 -150354 -108269 112234 332931 -227379 -299878 493 240928 83252 171658 286361
12230 286361 8337 91530 206159 250538 145279 80394 249847 -108806 185808 -4970 445802
12218 -36782 352478 257879 194068 264213 280631 -8687 -53696 61667 315769 297134 445421
12207 445421 -27591 -49066 345552 -104155 272283 -38600 92096 269504 22612 -42990 311181
12195 17916 69791 389598 274048 324331 43029 539768 -27170 40510 69566 138742 -78396
12183 54442 149150 -172979 322639 -80342 241708 -163983 213526 72406 352250 173877
12172 259373 -259042 -104604 100339 -163128 39058 38500 398762 106453 -22921 -43561 5424
12160 158283 9399 28476 59880 290448 401610 -298206 -22487 189389 -19045 28685 341203
12149 341203 47099 -69695 -287103 -116689 151879 -118332 101621 128966 113188 -46211
12138 -106324 79777 295628 390100 -105090 -47579 232109 -50046 -295449 -215892 100085
12127 324923 127115 353 -98262 151870 -271293 -230275 359131 -35833 164840 67711 322645
12116 322645 -193082 -39678 -96970 -279301 -195047 -129302 -7788 -155168 -1858 -227953 307498
12104 -330620 -79997 -114443 250109 314797 139095 253855 -91938 -297303 -3711 284330 92538
12092 111958 334901 -295439 190484 -27284 -176406 31493 -115762 -142746 -333313 40855
12081 -168341 -13544 -167368 25042 50543 99585 765620 1781175 1697157 720326 284151
12070 63930 -127233 -409938 39028 -77683 -106169 -90400 -67649 262383 68785 145782 142124
12059 142124 -233758 -6696 302519 -101654 -102004 44005 -383488 98852 -79419 -374854 109510
12047 -268453 -462932 -102246 39476 -117793 -9613 -347430 -319349 -207768 198808 -252834
12036 -122297 202483 145531 58059 -137424 -59689 113426 251526 -20293 11663 -191269
12025 51028 70467 30820 -41123 195922 -280587 4094 -277299 -138899 -77726 186199 14163
12013 -29820 62993 103470 -146953 -236600 105787 158987 -273363 -2997 -19671 284201 271815
12002 271815 241324 3017 -200739 184839 -2667 -167019 -133310 -75090 -116759 42887 -15505
11990 -18447 -177724 327985 13304 24722 -192446 -60548 -198848 28462 -28487 -23843 44147
11978 28313 -199117 31008 27445 -80409 -39637 149007 -7259 17010 360567 167142 -148753
11966 245646 -43529 -265830 -440789 80339 -203677 -96077 -38790 -40913 -391688 -45580 73613
11954 286378 130168 -169444 249172 94717 -294521 -113863 -168800 -190707 149524 167017
11944 167017 108963 107649 -219702 73101 -406744 30450 -324170 -193081 -61244 69877 -149251
11932 79137 162692 145229 56847 -218870 15584 -113342 -207416 -161257 119224 -76656 46714
11920 -144195 283914 -110655 -119645 82435 14878 283091 163066 163887 22806 169176 -117391
11908 65909 145098 186620 -42428 -283287 559 317714 180286 -75112 9122 -88117 110447
11896 120718 276073 -71395 -52607 -129068 49086 -250766 65876 81509 -51859 -382157 -165095
11884 238084 23563 14925 -168267 67818 -505 13427 -59879 -67383 -124699 -211075 1615 29402
11872 29402 -181299 -88307 -146682 -94082 116523 154753 -12126 162332 35200 227750 -150163
11860 237107 -242776 -415521 -147399 57387 53719 145750 353900 120197 -156810 -60999
11849 158445 -27123 -253927 -25671 -40229 -26554 169259 -57815 -171136 -96603 78280 -185645
11837 111595 -28841 -100923 -38477 32060 131418 8467 -121000 124432 -6433 -132917 118347
11825 -50196 -20157 -190283 225645 98459 -94203 33361 34718 -328313 39832 130708 -54621
11813 -41614 221358 -100432 -222933 -132090 -160938 -92915 -196554 100242 69059 -66613 -109648
11802 -109648 -113440 -335866 -102753 97271 -101783 -376668 -143384 -262824 186582 343248
11792 343248 -253182 134896 9429 256255 -38986 51902 -114978 -9465 5553 -205652 -231288
11781 -231288 -275712 -74375 -254261 -95237 -202721 244697 42009 -412313 -214006 304481
11770 -400611 -37327 108025 80492 356085 37754 153826 56778 -119924 -88893 241886
11759 -143657 -18219 -56320 -32256 -112087 -11045 -111052 22756 -246916 -149146 -202475 -264197
11748 -264197 37542 -286988 28329 74371 -260660 -291788 15084 116689 84698 24453 -12205
11736 -36228 98594 62487 160465 -266041 -143475 -192282 -190544 53306 38673 -108303 25621
11724 -64061 43792 215713 3117 -8223 -165269 425545 95288 82741 151072 -108885 5693
11712 -28315 180942 8445 -12504 -75110 190741 -311902 234890 110858 246898 -165522
11701 73340 -55936 41885 28272 220793 -66963 -343446 -199841 216069 -129285 412178
11690 167299 -19333 79731 -168521 -121373 -122800 -386771 48023 214203 30999 -11370 286833
11678 -2188 -139625 59414 42579 231519 -193422 7834 -140506 -15798 -42458 -154778 113291
11666 -72792 44491 147695 -39941 186801 81437 -32713 132142 -49614 730 134217 244605
11655 244605 28316 233596 -19564 -313725 289167 112447 -89674 128455 306785 268372
11645 268372 64385 -58746 258771 -85544 120524 -485706 117856 285193 288264 6758 124942
11634 124942 -140354 47963 194083 46847 189390 62516 200438 -175204 -33143 313202
11623 241658 305153 58561 137225 66502 182321 46901 86272 -171550 -309231 -280098 -128170
11611 38896 142438 366533 30042 153057 -39084 253 -138794 -122940 309605 -5904 -93466
11600 -93466 -18975 10591 34770 -212228 14134 285085 -147989 48079 -155706 92456 169760
11589 169760 4074 169611 297555 -152242 307997 23077 178702 -101319 -8920 -222354
11579 -222354 -166836 19071 -377128 107447 86480 -63209 166527 -30552 320928 -120301
11568 31014 -143422 61316 -35715 167593 208050 179242 4571 215324 130226 -249948 -96920
11556 34545 -48336 298336 -150506 62638 277954 90338 102972 141536 119097 -178391 -35660
11544 -51289 -128722 193243 251203 -60088 86159 9798 -311646 144507 433352 439777 29400
11532 172840 338359 194421 -170872 73990 106285 -66777 79060 63661 -160153 323342
11521 158743 208246 113852 -92115 216491 -9944 125292 394454 198825 460246 185298
11510 -107327 285983 1244 136287 -26493 -71148 142797 266683 -75648 -8396 157516 -10247
11498 -107823 248284 52909 67669 3210 130911 172727 -94736 209757 46878 111133 195447
11487 195447 180311 232164 453740 209322 239096 126669 417972 -36699 113097 -89567
11476 394195 -34124 -99590 124587 198386 -23299 250598 -107745 201245 25037 -181541
11465 501642 -140749 234136 -74134 341127 51644 149587 -77272 36146 358878 289742 -14235
11453 132106 -366773 -46427 -67047 -23122 -18907 110605 89021 56117 198960 -165785 -14944
11441 186067 228281 55190 78929 12796 253544 -255102 -62469 55979 -357014 115272 -151601
11429 -54229 266345 100911 -127235 -129841 69392 154187 -11422 69990 30003 32740 -107213
11417 10510 161101 179039 6959 70553 -3538 -106742 -114769 -1772 241580 -123862 -287924
11406 -287924 52968 -80675 -65249 -30117 -15077 -7244 -141697 268086 92924 54630 198099
11395 198099 209796 -74397 192783 -95382 30200 34888 -36727 234556 -57306 19681 115377
11384 115377 165009 -395812 47724 -32 179660 -340089 79797 -83472 -95185 294969 -48536
11372 26608 219987 -73747 293332 31332 403557 226349 -115352 -159762 -112973 -141133 3919
11360 126868 -112365 -95192 123906 31307 67534 -178593 143019 -89342 -289874 -177733
11350 -177733 213023 -206807 -171863 -205804 -348585 -86533 25166 37181 103070 165051 -94611
11338 22664 119947 -115632 75994 -185392 -87680 -199268 119026 23691 247127 -173095
11327 -48338 -67289 61169 379145 79734 139436 208143 3859 57351 -311822 40382 22636
11316 22636 -248527 -38682 75823 -225999 -29724 163123 112308 -53362 28271 -130603 192076
11304 -6957 -9367 -41080 -67101 261441 -58269 161652 -26515 -6577 -306055 -153725 282228
11292 -124233 -179670 -73267 -390364 -18375 -35815 -30717 55941 -30294 134218 -239598 184371
11280 28480 332653 -117838 23649 51446 126058 -195151 -96282 6343 -323982 -90234 97079
11268 -136284 -205683 10528 -133408 -98213 -38755 -364128 -191715 -80549 13645 -219171 -7415
11256 199907 -348822 45584 -317867 115759 27008 -100693 -35208 -74723 -430909 -184695
11245 84226 -148263 56554 -90173 -84560 -175792 -114228 -206614 -37957 88724 -23327 66464 141716
11233 141716 28548 233612 261948 -173345 22757 31634 -48058 -72144 58747 -52664 -35943
11222 -35943 -128586 377115 79550 -79856 160385 -147664 58248 -296039 -257549 166926 -180814
11210 -274904 -185235 -11446 59536 -195998 344344 -4174 -178261 227591 100512 -158789
11199 -153044 -113216 -244004 97960 26719 -171656 -119352 -338020 -175053 -38706 225807
11188 -295374 -56444 -401130 220882 -230675 -16140 143794 -39949 7875 -219528 63145 103142
11177 103142 -23667 -248423 50841 14255 77638 -34770 -121006 -49728 -287993 -74774 -95480
11166 -95480 -58554 181822 -94669 341082 145903 -36419 -83738 217953 -356912 -195038
11156 -195038 256754 54170 313286 96276 -249751 -290617 48040 -201518 -8529 69029 196501
11145 196501 58718 107260 72289 184849 197915 243397 431404 -230429 399269 89177 142858
11134 142858 124867 124923 -206573 167546 -66377 5308 27214 180693 215872 123372 201727 339736
11122 339736 102149 -1443 151490 -86028 104860 281446 141886 53968 214882 -101330
11111 -124365 71876 134061 -193835 233026 -7451 -338634 79264 151836 -64204 60637 315408
11100 315408 75632 98185 517043 307523 326080 146111 393811 356145 502237 -159859
11089 290275 252837 411167 278186 237177 141315 152708 481585 -5185 -176780 -7485 -15582
11078 -15582 -72234 129970 211339 466740 -36866 179384 446222 512355 250863 -13310 209940
11066 167131 350990 352481 414268 508307 561213 379204 455878 496505 433374 417753 775945
11055 775945 550863 712060 601510 823056 698140 672477 757084 756614 1031333 781958
11045 781958 971110 521496 1107121 832760 530805 451408 860453 585107 729866 603049
11035 603049 439245 985067 702018 460574 553645 692005 601989 613171 668900 792448
11025 792448 843432 289583 370776 854879 588905 791937 534242 482050 513798 407870
11015 407870 659396 665981 612415 533789 353465 616370 447562 507987 828065 107473
11004 591381 319794 655629 246731 450814 746602 862303 770264 590438 636195 416697
10994 416697 583573 533584 573992 831428 766222 937307 532603 455758 656402 1125417
10984 1125417 911617 1130522 1310160 1262625 1017655 1382866 1415611 1564558 1926627 1923588
10974 1923588 2495738 2512871 2740489 2976327 2287213 2606554 2014316 1881425 1768058 1786853
10964 1786853 1530492 1268385 1088968 1487109 1570688 1511555 1439498 1417743 1376086 1362600
10954 1362600 1477233 1003020 853723 1006915 882458 403818 716346 482713 333536
10945 333536 741327 84540 -42027 96565 51082 431393 413677 -156881 320161 -1477 303910
10933 1145 -164793 133026 239651 -14604 107313 60443 125939 18654 53907 31678 -12108
10921 31018 -152791 -16328 -4485 -174481 215670 -163186 78387 3984 -105865 253712 250068
10910 250068 32760 -225734 186683 -36243 51376 -227284 -383364 -147835 192964 -54326
10899 -68887 -33688 -283105 62327 -122242 137 -37290 -32972 -16206 82422 -132052 163017
10887 45662 154078 223709 -6275 -235299 -62916 6713 -94673 -38886 65540 -101119 235379
10875 -14301 52943 -144639 -119664 7106 27486 -9376 160493 -98665 -361554 -57561 210519
10863 -60493 -35125 143688 -46936 116330 -203958 -69506 -45222 127840 -37028 -97895 -126457
10852 -126457 -123567 -12302 57894 -105520 -121786 84360 286645 117800 -232709 208390 82931
10840 61391 106843 -70327 144437 188825 62371 -87472 228363 37790 -24712 -220146 -132965
10829 -132965 -34320 188649 -371278 234134 -393117 -320984 334714 162223 -400447 89023
10818 222640 13747 -171969 226325 -309107 360965 -71946 314184 133237 101665 116245
10808 116245 473628 -218832 -19907 -293828 2552 1339 -310909 -33999 26632 -242894 -57804
10796 -54866 204422 231470 112854 -60881 57377 -85403 87865 -162812 245791 -153725 -47032
10784 -27885 130689 -214395 136893 -101803 -109484 -102976 -6032 -9770 -154609 -6498 63049 -106646
10771 -68218 61830 121852 -97514 -21680 -2372 -35416 178573 281553 -424435 187008 107455
10760 107455 182277 -62881 75186 -225587 -259518 64589 -179692 -285756 55275 -143114 64398
10748 140795 -108886 -44737 -2168 -109769 -158432 45175 87249 230064 58010 234991 128239
10737 128239 -150748 -21580 -239384 -96646 125232 -140451 -98646 363160 -118251 -21665
10726 -114141 -467397 149244 -90953 -173627 110944 71686 -254142 -275730 -43050 11840 -114169
10714 -230450 45833 -65577 89047 -160895 279746 -28462 -228255 13203 338050 -106290
10703 196494 223900 -333067 -121312 239073 373989 -24253 -259687 96906 235419 18797
10692 -68735 -178142 -149349 -423707 -193037 -164095 -26683 107011 -92545 -166730 20081 207062
10681 207062 53219 166005 -88585 358291 96699 -239928 -297550 79059 -29304 41251 29302
10670 29302 -34896 -98672 -375114 -171022 -163306 66828 26322 225921 302423 53020 31618
10659 31618 133229 -253673 5272 -114817 13030 93121 252459 191034 306123 -131881 15078
10647 -246086 -103673 33438 -241912 170193 253353 -112663 207648 -280882 -129895 -118272
10637 -118272 35871 -314002 261605 -276755 -337676 -204193 -55264 -425319 -86459 -116967
10627 -116967 168999 -284 -260958 -146052 -52028 -43378 -121295 -233489 39680 -451861 -130396
10615 -221627 134987 485385 73381 -61162 108647 -11837 -208067 -221252 -291231 -51292 127570
10603 -364369 -58236 -202164 224000 32078 -159333 45998 161105 131753 1344 174018 -47512
10591 270804 213545 17571 202102 -303313 184635 -105919 -92539 -73977 -54345 -249273
10581 -249273 274712 -198874 44532 -160894 119880 -112828 5825 -67957 -218975 -189006
10571 -189006 -140714 174757 -511070 -28014 137760 -71829 118863 139553 74726 10057 -7734
10559 236532 110286 98836 -32691 -78609 -90336 -260746 119001 -44502 -87691 -180159 -7297
10547 -295105 82577 36464 -168745 67757 -118284 -141366 104855 -68561 31184 143357 23170
10535 -253937 -60062 189966 68965 -298817 -66727 -214653 14903 -160831 11667 62520 -238582
10523 -215259 128007 22255 -142865 108205 46344 -261304 -21864 138053 177577 267769
10513 267769 41885 90890 67630 -316093 -52697 213011 -49344 106555 -176748 -140232 -48054
10501 184967 -74001 -38361 -88095 -133483 -9614 -63038 -1073 -168510 -220404 252689 328952
10490 328952 -31617 55460 -131001 59308 -260795 192392 -112567 438025 549949 367938
10480 367938 478444 411409 401939 376192 -126680 -1345 60 59271 276227 276281 90560 -236610
10467 -66444 -98341 36423 -311430 264374 261688 -39879 154809 60755 -36658 61083 -65221
10455 124946 -13748 -32828 128312 -255716 -148740 -181979 -79002 -430537 57705 70394 -184994
10443 43025 122240 -143076 100923 -50389 218441 41493 20584 72302 -57606 -1085 -89436
10432 -89436 91354 -86888 67995 107830 15820 -175580 -46172 154560 -201229 171198 199567
10421 199567 -51798 -58984 283355 257965 65782 252235 165193 -80547 -133883 -142744 90813
10409 12991 5487 -147262 -57518 247837 -28005 -229378 176400 159220 -88713 -51139 -36575
10398 -36575 -207294 183153 108036 -113116 -156833 -37124 365926 25726 -51051 459355 160745
10386 50847 -188030 -100956 -3601 179012 227035 -378939 -163103 221077 299361 255237 433940
10375 433940 660028 4291 18012 71556 -7962 141923 309798 559810 471376 64287 220321
10364 220321 260973 335544 172975 487840 250932 157304 -160636 112792 281743 214910
10354 214910 117873 453595 363041 400048 184064 519128 377657 128504 241065 -62253
10343 806737 241769 399190 62129 149323 227362 111741 -28440 -23140 2330 299522 315852
10332 315852 46248 197689 -2732 60849 414944 6901 340579 90057 294504 9384 586000
10321 586000 226845 -202809 -24931 -80113 75995 -65248 -27509 -56338 109995 -353364 -119780
10309 144264 -270602 -97707 21746 -60398 -264669 -212933 -150031 -291052 69031 -360157 -481168
10298 -481168 -124814 -115880 -35290 -51238 -28122 265525 5631 -39317 -256950 -207876 174974
10286 -76596 -167406 -230063 27888 53923 -34622 -296325 174757 -317426 199470 -149330 150761
10274 89003 -55726 -132730 -128039 315304 148083 267124 -164402 166858 218586 -111225 194548
10262 464471 384464 94113 115719 154968 384586 175235 -266355 333339 257053 -13338 55055
10250 -90433 -412234 95076 79978 -358441 -173956 -114627 -160183 -126119 -3017 78560 -22529
10238 -74339 36985 14999 -122621 -13841 181020 64530 55362 -266861 -144248 77994 -85140
10226 -219005 -99924 27349 14980 -268311 8017 307832 23686 -29710 -14980 -91924 -312179
10215 -312179 -16846 297956 100164 99618 143618 -273426 -273707 86101 39831 -396043 121502
10203 -80942 283841 -35456 -220301 -116231 36487 -218705 -227785 78561 142402 -85141 95931
10191 108027 77695 -135079 194722 -234058 -111212 -403555 639 -231737 -105854 -51180
10180 43033 266052 -112737 91427 -187773 -309907 -18184 -113432 -156382 -284407 83051 52405
10169 52405 -255975 216260 -220649 -126126 -116078 149845 232192 110805 -242907 -221130
10159 -221130 -19737 -141795 -268107 132466 -364952 52214 24306 131757 -83371 98048
10148 127656 -145875 -77145 -148894 -58753 71899 -35069 -57457 -112001 -213155 26752 -13944
10136 -134389 232223 -18700 -158943 -38842 63166 63273 -261185 79941 1229 65927 -319012
10124 -89706 -141430 96289 -148915 -98039 -43984 -455849 -102961 -232855 -108729 132433
10113 -70725 -303066 -327674 85163 54662 -426430 99976 -46616 82978 11337 127414 -431082
10101 164792 -10 -302639 11769 -72448 31137 222506 -209832 -276532 -29331 227195 137758
10090 137758 178924 -82880 -262009 267849 -127157 123253 241391 96093 167289 204235
10080 204235 -118576 -83383 -97036 -16325 -186014 -236062 108899 -420158 27736 15691 258973
10069 258973 -216958 -274672 -145568 96907 137909 -214770 110129 167716 -128668 247447
10058 -136184 -283137 -80865 -195913 232684 -160854 -23926 -82707 -237755 -264392 -162228
10048 -162228 -294277 -34221 111785 -21959 -169653 51400 125943 -42331 -19153 -329171 48613
10036 187221 -190060 -200823 161521 92558 -46435 -42308 -399734 -51664 -63120 161410 -176204
10024 -14755 179619 -21860 -66008 -170258 133141 100661 41349 -24797 175251 -335075 -295341
10013 -295341 -248184 184399 241174 -203978 -111623 -148462 -333468 -174329 -270183 -16319 -78963
10002 -78963 -71647 -276570 -176023 -191 -203059 -287978 72162 -281581 113915 -199238 41284
9990 179616 -286725 474107 -128364 -108943 -127212 -10334 -89689 -212897 204979 -162665
9979 -6289 -223495 -130809 -31994 25101 -104339 -214892 -365182 128469 -46038 146201 49291
9967 83454 -12413 -157133 372222 -38455 -21585 88148 -16613 -169288 -152172 185138 -378220
9955 -261278 -139947 -108526 -226299 72239 -134842 191558 -252771 -95292 9259 55765 -89152
9943 -269185 -158509 -275873 -156404 6797 2092 -262116 -350797 260889 123800 -166584 131831
9931 -349532 -231777 -58960 -13655 128545 192345 -138209 86745 -172460 -86487 -228728 -131126
9920 -131126 24083 220647 -408248 -296463 -312017 99694 325442 12747 -169481 -112808 115487
9908 -508672 197535 -235865 -279254 45271 -120322 304349 -40473 -77907 333358 103091
9897 40665 67586 -197160 50759 -11050 156385 92664 54895 60558 75983 104727 -67731 59337
9884 79698 -206537 42425 -201475 -136304 -3345 -179687 50534 131053 -66993 -295406 -13122
9872 -113647 -423020 -191268 49733 93122 99537 -156282 63142 -60959 167110 -151434 210176
9860 172607 -62942 -80249 -135113 -6180 60229 -263531 -110951 -218146 -212070 29630 17892
9849 17892 -265252 58413 180295 -313849 -68865 -111377 -199630 -67060 -104238 -65548 -31073
9837 -195461 -140855 -288609 276008 -87927 72657 -171011 -5288 -365812 163131 282442 53076
9825 -50656 -24718 206210 -750161 21167 -226542 -39234 138766 -38935 -287862 -128094 -509067
9814 -509067 -60148 362953 156302 -105678 -67702 141093 -198989 58814 -470873 94505
9803 260117 -254696 -43395 -142563 -29278 -153717 49080 15181 21815 -161645 -277234 53574
9791 -51767 -62063 -363624 10964 102159 -110606 -188554 465149 10129 58121 163319 107170
9780 107170 -27843 -23878 -110725 -339036 322969 25903 -207144 -228312 -112463 -122640 112538
9768 -26647 154891 -211590 -158793 -52596 -260703 -137390 51613 -69265 -6916 -221683 -35446
9756 -191492 17093 180711 708 -175134 -440324 -100905 157326 50850 91975 -59514 -604037
9745 -604037 -265496 -368098 -249580 -130284 71461 325714 -101279 316391 -74869 -18576
9734 78491 140922 85875 23569 -258662 -328134 -107852 89846 -33985 79122 60835 -288984
9722 19817 150488 -47612 50759 51520 -20946 123999 99210 -154571 -96553 -120575 -115486 -254651
9710 -254651 -266126 18347 233107 -6871 40555 -113256 -45057 141230 -21941 -304136 -111263
9698 -312111 -65058 194563 -181028 -18716 -158693 -163635 -202319 -63111 73789 -193271 73775
9686 -506388 -121303 -340040 37410 -43221 -86840 331562 87910 -376629 -223511 -168489 147174
9674 -215357 73532 47333 -164032 -135693 64546 21489 -88631 -164200 -134609 279612 29822
9662 -186421 -207057 87493 6284 277333 -317379 -152818 -116041 85718 218058 115901 -59166
9650 -177500 228814 -209538 -175270 -34353 -143268 -326837 -203656 276731 -19468 -298460
9640 -298460 -5914 205679 -65037 -3357 47283 -45083 -139408 181484 -40819 -245902 -127355
9629 -127355 -155445 -165385 -167758 -89208 -184426 -188799 -178863 -96359 -266756 47488 43491 68455
9617 68455 195538 -10306 109133 284787 71110 46609 84097 -273058 34 -441287 -83374
9605 -350390 124463 -322718 150011 -93521 -197253 61304 -250061 -137365 163662 -331705
9594 186677 -155551 -280766 -129912 -10253 -16864 86691 54692 -339305 -94474 49136 -236252
9582 40147 -362150 45857 -196672 -88541 -159590 -111029 118706 -273414 -154015 -259013 162151
9570 219465 -205176 -86952 78522 281659 -74700 -48404 69287 -66617 -24497 -245428 -422340
9559 -422340 28 -96563 -153946 -154487 -188051 -184226 -38699 115436 5350 130599 -7446 -90613 -175115
9546 -175115 67756 -138716 178478 -11505 95578 -281608 -77790 -254354 325496 -188687
9535 -122100 -196337 226610 -93 186498 89077 -9873 -427912 -113359 289751 135011 80452
9524 80452 -16810 -95539 -5812 12337 135646 69003 -173791 -243987 7516 -46531 45032 88688
9512 88688 -204047 -20128 97586 -175763 -31024 183647 88557 218544 -44656 -147869 -139614
9501 -139614 57093 331747 -97246 -15647 -341389 -307288 -12359 -214415 -31269 -220270 -5442
9489 139713 -593262 -28417 -16786 229972 -311657 -118139 -3503 -201126 -19198 159620 65736
9477 -360500 -24092 -68740 -150043 -31726 -88671 -321076 -41364 -147627 76169 -1922 43552
9465 -31348 83110 -65749 -249872 -170315 10987 -108543 -49794 -247253 19545 -243812 135172
9453 -38079 -79665 -243697 427613 -124320 19795 -41738 53197 -331696 195678 -48901 59222
9441 120604 -12307 144094 166737 -95829 -217698 14399 -188003 -102542 -68334 279951 50420
9429 -368264 162996 37641 -14082 -106909 -91576 -46877 -137799 265331 -180629 -4834 -437976
9418 -437976 7263 -195317 -166066 -38258 -191778 -12449 45022 -219241 -464775 -230803 -287632
9407 -287632 -287806 -50902 -334203 150101 54753 -502835 55595 -143607 -160742 61006 -106679
9395 -241004 -218930 -354625 -34777 29780 171805 9191 -180974 -298563 -118896 21776 -7626
9383 -489562 99611 -76218 -697281 265558 -277824 -93789 -337442 -58934 -9138 14969 -283322
9371 -147502 56073 -249930 -50744 141397 103426 -145877 -50013 -134860 388384 -193194 -127583
9360 -127583 -119708 -171351 -265056 -150383 -94736 353039 -253212 30505 -141324 -69811 -35530
9349 -35530 -311703 -8014 -265495 -43079 345525 203972 -56814 9022 -20272 85431 -49408
9337 -227170 -38370 70686 -79305 -199767 -136392 -75623 -99603 12559 83625 14526 55289
9326 55289 -502981 -56567 -327591 -235434 48483 -344250 -88013 4860 193478 -3920 108275
9314 -137333 -66453 -342465 -4678 -210435 13972 -519918 -49402 96292 -45719 151133 -136070
9302 -150822 105097 -28530 -67225 357699 -135207 -113667 -469120 -246775 -161413 -186315 31831
9290 -488646 -115512 119432 -130020 -190879 -138550 160129 25242 77515 84780 28950 101444
9279 101444 39438 85097 67933 49512 -101721 117547 -101027 -29785 -140472 92389 -98973
9267 -66567 -392134 144926 -66970 349212 -184135 -43671 -47348 -11344 124247 83283 -160238
9255 53866 14769 237242 -101683 -26566 -337114 -136693 101966 -99059 170841 46987 -75527
9243 -287789 -335075 49287 23923 3216 -76374 70108 -128492 162144 -243137 -140797 155344
9231 -14599 -329427 61469 174233 -150001 36931 81215 -21321 -69842 -269821 -45640 -204442
9220 -204442 -355043 230643 -59987 -149141 -466535 115976 -121142 111279 -240906 -194713
9210 -194713 -74351 -146695 -379224 232450 -250560 -12646 -42547 -13850 -362055 -328177 -247753
9199 -247753 -190941 -82874 96287 83620 -184986 88380 -252745 184160 -58938 -66496 -106406
9188 -106406 -39603 119098 145096 -188284 -347776 51972 -5691 -35007 3641 -127294 234970
9176 -104949 -42860 -216267 -23400 133917 -286709 198475 -47262 -89689 -119763 -26601 -148875
9165 -148875 -174731 59967 -205549 251989 -185454 -273649 -38801 -198281 -370508 -354493 195548
9153 121454 46226 -28900 -57749 43728 15726 -51691 -149528 -48000 9968 -39577 -337585 -6982
9140 39525 -261145 -138655 326620 109688 -245758 177491 148574 224615 -121578 -204229
9130 -204229 -141592 -28737 8995 -107868 253487 -165290 14009 -71153 236540 -47694 -28271
9119 -28271 -6416 -75130 80112 106944 -38072 -63384 112349 -132243 330534 105898 304417
9108 304417 -199872 44989 -47972 -224663 61819 -125724 224930 -138134 -118139 -191282 -253069
9097 -253069 56433 -130446 -162287 -102796 -187433 -254221 89396 40649 213600 -73027 243279
9085 62921 -179514 -314246 -200393 104321 -173715 -216908 149527 130222 -250130 69615
9074 -141749 152452 -13855 24525 219415 -158217 88309 -125218 362116 -60139 10139 -14853
9062 -127690 -62406 70791 162492 -350693 -275523 -214705 -157068 197479 103738 152205 419662
9051 419662 -242643 -321173 -143921 -270446 -435043 -59107 -250324 -78213 66140 11447 -45615
9039 299707 -177638 -476 -56570 -126979 -108200 -89981 -121186 -3161 -83520 13375 -31305 176679
9026 -80835 250889 -48949 154611 -211498 36193 22129 -130678 -138594 26253 -469784 -289620
9015 -289620 -34984 77801 -456293 -174809 -276440 -93869 -105205 155710 -242648 -27854 -105859
9004 -105859 32487 -56257 -176171 161948 36921 22879 6003 -96587 -244955 243169 -38059
8992 201442 -208280 107461 -300584 -225696 -283305 -202657 -165912 -14391 -10662 -219572 -107792
8980 226109 -181062 -101919 -132809 228046 -77057 -88092 -268627 118039 42778 12305 -50575
8968 279601 -149240 -405443 -281185 -124627 21723 -173483 -47925 237956 -105733 175349
8957 -288912 371269 -427916 8769 228433 -285762 160142 9315 33616 -146994 297259 289811
8946 289811 252717 68962 -27598 121889 -356482 -446444 -95393 -85537 299148 290288 -73421
8934 -226390 -116102 -34619 21324 95622 -119522 -135136 -29499 -254510 240648 358102 386140
8923 386140 2113150 7252100 3025710 731494 375641 82709 196254 -172265 206281
8913 105858 -275186 -496541 175776 -176080 225310 17506 -429530 -28934 43420 -147334
8902 19913 137473 -136450 -191966 -21385 -207659 44074 91683 -67355 -92632 -206218 -33343
8890 207967 40670 227911 122528 -11666 -34371 -368723 258534 -177470 -98607 -125990 243703
8878 251300 220817 -273733 -131212 -240170 -262184 -48685 202279 -261526 -178661 -2722 67417
8866 -242003 -246409 77004 -289426 -376462 -77435 -54360 -26364 -178593 -129704 -290968 84901
8854 -89831 241322 84869 -40213 -87358 -6729 -293681 181778 153187 -304906 113378 -269243
8842 -10390 -128763 211379 -99482 -108186 131841 243793 -31261 143572 -301081 -103585 -26417
8830 38243 -168148 -265853 -128882 137096 -150094 -44243 -248145 -203286 265479 -222973
8819 -80921 225284 -176711 -219945 -32673 309573 80505 96603 27183 119621 -207499 -129494
8808 -129494 -68806 148492 254700 257325 -209527 165958 144247 77860 -176202 -271441 -548566
8797 -548566 -71505 75739 -172892 -202453 -86727 -87561 85703 86431 53503 -91540 -120144 -43084
8784 -88937 183548 33561 -15955 214503 203909 -75548 3013 -41760 -216316 111128 16000
8772 -167245 28975 193967 215216 29031 -31476 -103758 3916 -222909 130364 41730 11256
8760 115226 115006 74962 -225389 -124495 -17849 -273371 207269 23183 -196031 -114611 -52289
8748 -31096 -56139 52306 -455633 149819 28135 -80646 82612 -36747 -272366 -189517 216860
8736 10423 -177790 -364045 -48870 -46965 -3435 -205212 -81244 -13890 -34542 17957 70423 -211794
8723 -28757 30274 -175655 -2173 125032 -168758 118990 -133155 -62763 54972 -180491 -172039
8712 -172039 -5831 160239 -56826 148650 82298 -40902 -292402 56505 10770 -19425 -80566
8701 -80566 -16050 88667 -208176 -181815 42588 -289111 -95284 79552 76830 -46002 419357
8689 -64358 161193 -267304 201170 -231444 -62742 -273105 -78362 -220905 -242381 -40875 -174694
8678 -174694 77159 -151732 175872 -214818 -47658 287295 278246 -44094 27761 -182208 -239516
8667 -239516 -277610 -405160 -211975 -80268 274772 -100602 132718 -77393 -16812 -92395 -80367
8656 -80367 38819 -160931 -62372 128845 -171540 172560 270252 -219182 -295553 -2868 77476
8644 -70992 -87198 -162234 317345 -36881 -200557 -75986 55700 -169380 -46129 -29952 -310468
8633 -310468 166366 96195 -121878 -135467 8328 -118229 -207431 -104967 128776 -107928 -13380
8621 -238718 -290544 153399 4136 -4143 29675 -154445 200383 -341745 -214100 15797 -75503
8609 -93722 -141973 -331051 -180606 130032 -141007 -189786 66159 267125 83594 192451 -189828
8597 29537 -107504 32730 -156596 -195490 -166035 111405 140436 -147297 179730 -241042 -58229
8585 -248744 -34076 33711 -5904 100850 -15921 -63813 -30532 224663 -155946 -32509 -223901
8574 -223901 -85919 26672 17799 29300 -136013 192273 -25653 -11554 166242 -210744 126539
8562 -256224 -80791 -45676 -98273 140938 8689 -196650 2776 -355832 -7465 -28653 -40495 -218300
8550 -218300 63698 -8433 -291875 -13292 -184530 -248670 188962 428296 57724 -262024 -18959
8538 -193456 -176801 -341646 71043 75934 229386 174715 -64994 -93530 -295560 16645 107624
8527 107624 -178130 -343808 -195426 15705 -22289 324513 -204597 -257663 -55218 276149
8516 -301539 -35677 119606 -16373 12669 119377 -434064 -429683 99560 135001 -360920 -135489
8504 88259 -275840 -113221 151859 36380 -227253 255281 91447 -390238 198915 180960
8494 180960 -226322 -89775 259557 11151 160572 -121609 -197450 -50911 108980 204178 -183009
8482 -9378 -85461 269593 248969 -182939 -76922 -552043 101333 88117 198135 -208369 180248
8470 11468 -88689 119327 161755 -157168 301379 120588 -457386 -173341 -162433 -454046
8460 -454046 94387 12497 388716 286509 -172468 -120347 -9643 47329 288136 -59308 288800
8448 -47322 -53689 -19729 124239 -99248 -321375 -213264 207146 -213786 -132531 268362 -330876
8436 -123463 -76517 -39667 -149041 -163125 -336541 66721 -416517 22254 213111 -34581 -241081
8425 -241081 -150845 -36369 45701 -210651 65879 -122912 131870 -28503 29548 39559 28855
8414 28855 -115519 -294833 -40933 -186623 -6479 278583 142704 29528 -157985 61749 5908
8402 -134825 293699 40660 -252067 -57721 142090 266847 88774 -128026 -99170 -13930 202777
8390 -300034 23637 -33064 222829 86300 127340 191137 -163008 16577 175193 -173304 -347204
8379 -347204 -29345 -184922 28800 -234171 -9063 60331 119870 -53149 46125 -275422 49811
8367 -402048 -128594 231371 -28263 -376682 62371 -237979 -157165 -3091 -70664 -181265 -22798
8355 -76896 -310493 19036 116660 -248979 61310 -234020 66171 110088 4393 -139001 1166
8343 5446 -46388 -46156 -128550 -184494 129388 -249482 -68111 -178119 85085 -75816 212582 -92695
8330 -156626 -129630 247875 346328 -57733 174531 -234164 -31982 -66283 -155683 -7180 -64114
8319 -64114 -283117 157594 -32489 -379255 -170561 -151949 -153136 -286878 -114078 109694 -21842
8307 131841 -223090 -240269 88728 -641 6019 -3173 -262434 -224506 171614 -278911 -130715
8295 153031 -38909 -23178 -210877 -202689 81379 119271 48205 -24896 -124456 59423 152995 -27985
8282 185350 71035 106367 -160668 8342 -457068 -145205 -238089 91456 28010 -85927 14937
8270 -117403 110557 -342556 -268076 68736 98867 244517 366681 -188674 63238 69357 -196409
8258 13398 -73408 283463 -26884 76227 -173866 -221737 -39447 -111130 -243532 -242230 -251178 -53776
8245 -72099 93857 228899 191118 -308491 -77207 -51121 -233914 -57194 -390205 2524 -82143
8233 -4094 141988 -75772 -107503 -157934 65465 194552 -130661 42813 -406576 -42878 37862
8221 -49437 70718 -154819 70799 -37824 136727 93872 -357834 -32226 35203 -337160 -196758
8210 -196758 -358515 -86381 25675 35287 -12841 -140064 202956 35933 -188402 -415189 -125899
8198 169573 197389 232504 190586 11532 -70425 -200229 404160 -138761 37225 250478 5585
8186 -66070 -368841 62546 52572 5336 221188 107354 -99851 12495 308074 -356185 -12684
8174 -255876 -26680 -359608 96368 31638 -255284 200802 -174242 36948 19557 -94963 -254260
8163 -254260 -349686 145565 -51611 -16114 -129745 -133313 51284 63027 -145526 78863 110966
8152 110966 15382 197760 245528 -171446 -164051 -94436 -190379 -36577 -148232 68759 -143597
8140 67893 122289 -107750 211080 -254955 -349265 38108 -51225 -4532 -300702 -277952 -355758
8129 -355758 -233283 -379343 -55904 106014 -161178 10597 -108454 137215 -24659 -85961
8119 -85961 -123 -61352 -231366 131898 -35482 -57119 -38521 93449 -306098 34341 54345 117034
8107 117034 -117439 -23978 234068 23564 -87720 492835 220342 -219400 -78353 -202668
8097 -202668 211234 -142154 -92596 184235 -56583 -197034 -300148 -112411 -142213 -11964
8086 -23207 76555 -207125 112380 233 196641 406662 122284 -30137 -31224 -212561 -268658
8075 -268658 -394569 57495 -11100 259467 -247468 140390 -167752 -79896 229379 -134851
8064 -114598 -325297 -245447 -219455 186827 40724 -77742 -147890 -3106 85704 -275955 168722
8052 5921 -63409 74668 -235252 57144 -102165 -195316 171027 -144637 -346886 -45593 145707
8040 130995 83436 -38284 -45499 -184132 -103203 27246 -198109 -12908 -133260 -10713 -159195
8029 -159195 -235743 25691 -89179 157566 -100259 -162426 -263010 -18525 57310 -95392 -120699
8018 -120699 72041 -114221 -178926 176758 -27091 -49296 143769 14658 163867 -109199 -79824
8007 -79824 -437318 186646 -19846 -224006 134796 57009 -50578 -52862 361261 63647 251237
7996 251237 -356627 373815 131211 -75153 13832 -150029 -392767 157757 101426 -391414
7985 193641 188558 -315132 65824 46294 200747 257262 -165681 -143001 88233 -74002 -242219
7974 -242219 94630 184989 22408 -60556 -16945 -125965 118945 -132306 -125007 -302464 -276475
7963 -276475 -19012 -271939 185183 110208 46572 -99879 63529 -216856 -78332 -5344 105711
7951 -181754 97372 -381771 42825 208314 310831 -137376 -320076 -36833 53408 41664 -35076
7939 40069 -226595 -114304 -146066 137224 94848 -414568 -60256 -99564 1578 -174914 -128877
7928 -128877 -45349 -103864 55805 -180918 76014 247046 -59521 -243138 82915 112315 -30642
7916 -67873 186704 -245498 372984 21988 199589 -165648 146775 -12788 -121957 -266884
7906 -266884 227805 383532 -51744 -210358 -93051 -229023 167457 61141 -127738 -338322
7896 -338322 -248879 -57500 8292 74586 -5243 -228478 -130440 -227764 143205 207836 -16507 -62655
7884 -62655 35371 10989 3618 -379321 -220928 -86328 39602 -209570 -296774 -254745 -232081
7873 -232081 112944 -81008 -301992 107577 150606 -148728 -154749 262628 -59707 111731 -49238
7861 72308 -21812 -65239 -203712 74403 -95417 -25376 -64369 -107056 -16643 -28863 96709 51558
7849 51558 -109032 61465 22459 269754 -12052 9418 44691 -305960 -92934 -70542 -65020 -351682
7837 -351682 -104551 22736 -79571 226259 -204387 147507 190605 -113743 52332 168484
7827 168484 -235587 48934 -54591 -227297 180610 -455103 -76020 -155666 -168035 33893 -481319
7815 -188115 154680 210530 138285 106397 -84162 4070 -82568 -218313 -50677 75864 -132570
7803 -155402 -139361 -112415 -98082 -199371 -77066 92369 -248535 -28174 -111152 90349 -138728
7791 -161573 18573 -103906 233480 -109387 114872 -219907 52287 -78452 171464 -17950
7780 -34947 13257 168114 -161844 -14784 -161849 -12906 102788 -40745 -62226 -287650 51399
7768 21415 -207407 -20204 -200516 -104485 -124437 -142995 -247424 -41841 -257585 -91103 182959
7756 -224863 -68410 -312617 105153 -64109 -289155 -131628 272336 48670 -300876 120723
7745 -334208 -14734 -8784 -130386 -122954 192646 114615 85450 -113500 63665 22512 60704
7734 60704 532 243460 -31243 -15125 -86857 -40424 -54218 -110810 113849 -323655 -67411 23393
7721 -2201 -96905 201511 291583 -87437 61910 -426067 143388 136907 -21716 -425541 172988
7709 -27306 51868 106417 66877 19606 50037 227590 11370 81656 99925 216280 -194524
7697 15505 -277795 -45809 -32238 95505 124645 -98827 -52771 -83933 6577 -505248 60565 76166
7685 76166 196134 126602 -55150 -137719 -295120 73475 -77979 -181090 -255961 182545 227661
7674 227661 7495 159257 13757 13040 -74832 314333 53391 -147191 -3432 141117 166289 18043
7661 -20504 55432 122134 -86988 -46044 55610 -16473 -280403 -272666 -88621 -242947 -235848 -132117
7649 -132117 3306 98128 73997 52599 -134272 -318289 -91444 10190 38096 -207609 96062
7637 -364571 -34997 19840 13527 112859 -71611 -16761 9402 -177763 -133426 -213225 -3940 133431
7624 27667 -48227 -73142 36777 -60985 -131416 -238154 41841 36085 -82516 -10043 -119759 -143612
7612 -143612 -34227 -37165 -55479 -9421 -82216 46076 117890 -153532 110894 -256447 -38020
7600 68341 -33894 188601 146308 -306128 222592 -441272 -175086 -96517 -66824 332429 -286448
7588 129374 56807 133971 -66628 -179587 -42078 138240 87116 14351 218464 -64258 -116405
7577 -116405 -90318 -92235 -195372 -276647 -126398 42926 -438603 -296097 -257545 193315 -217875
7565 -114833 -67356 -207347 116455 -173251 -343117 285392 55661 -45095 -129272 -103166 23347
7553 112873 -146308 201867 29861 -52576 81943 -21147 1667 -139864 25526 -82592 153602
7541 -258413 -59248 -102688 -74429 -112136 -55011 -198119 220362 -44329 -315435 -199013 25932
7529 69471 -33924 -108966 -142492 176280 -20900 75924 -284501 -39646 -185214 -127681 13258
7517 -90651 -231787 -237789 102375 -208737 134573 -557431 23571 -21046 105259 -199601 96844
7505 -168443 258093 -531377 -130306 66332 -315745 82277 -13124 -243442 -22481 -170431
7495 -170431 52898 -32853 17911 -160935 -81104 225873 -23347 55517 -107686 -131525 11063
7483 76436 55054 43827 93835 164109 249704 52557 -65359 -127544 -48076 78304 20712 296112
7471 296112 -202328 225132 229543 -49999 36303 29720 -20987 -403000 -340830 83382 -424885
7459 260447 105055 -6469 6513 -50298 334267 220046 -79185 239057 121093 -32663 4885
7447 -251684 202128 -25440 -149154 -5746 -53185 -18527 77942 -149806 -58439 -170048 -35659
7435 331794 -80970 1056 -55774 77325 87340 126880 106227 186229 -196509 171915 75599
7423 127657 101367 -126213 -232392 204717 -5678 151763 108479 -39375 3646 -73477 102590
7411 195919 84210 183999 -136647 10891 60449 41970 179587 134460 -340243 -123026 -288864
7400 -288864 -516625 -81465 150734 -129239 -138196 -116826 39443 142007 -79169 137566 131508
7389 131508 -115282 -10458 -42008 35622 -119748 -36859 51865 71320 -151648 30288 -198737
7377 -109401 155245 -274503 -134014 -201779 1629 -147657 -3495 10612 38286 -19868 -1851
7365 73399 188168 -144246 -25982 1160 -6838 7622 -169101 -244854 153632 46100 97782 -92363
7352 90699 -225152 -29491 -193496 -148042 -192037 -132728 -115793 179353 -133936 51300 -210674
7340 164467 133504 7322 -52129 104989 -24455 93021 -226107 175936 257710 -243210 -43984
7328 -153335 56496 536 -195450 11101 -57876 -167625 108590 -69215 -141615 122593 172051
7317 172051 65649 37840 312442 -119628 -17139 259504 -138631 177604 -135306 -25025
7306 139157 112699 -6389 -81149 -108685 -372993 -202860 113563 -88491 -4013 199011 -133111
7294 -194447 -305064 76371 154911 -255312 268583 -142047 71170 127149 -104374 206892
7283 228325 -171060 69701 -24296 -51850 -308326 284205 -361254 -84094 65955 -83871 -451
7271 175536 -118011 -203395 -239165 34740 -37590 -6874 134986 -273119 14269 88036 -141549
7259 84190 152198 101813 64025 -97226 78272 -55554 246230 -211689 96447 -224560 -233803
7248 -233803 -239260 254622 148071 27967 -95427 -171284 -45279 -217342 20123 -16589 37342
7236 1693 75566 -49134 -217702 -18034 90113 304890 -261060 239030 -262821 -167894 -54460
7224 182021 17001 129037 -55693 -315060 -77972 156042 22221 -41409 76239 -8370 -66941
7213 -66941 -182995 -8870 78018 -134268 163005 -327302 -143736 -113041 357928 -116542 -60641
7202 -60641 -362329 -3912 194644 97954 70195 -173 129681 -16868 -102206 70911 -60341 -339958
7190 -339958 53665 -91607 184494 206932 137806 2382 95971 127101 -214352 8097 -38418 -167027
7178 -167027 82171 -170746 157605 -143960 88372 -18711 -176457 -70111 -282305 -132496
7167 -97572 -310013 -5304 -120727 -71406 -109643 -216338 240014 -298836 42458 -3433 73791
7155 246772 87811 246 -264183 -250987 -17191 29694 -101665 -155954 -32731 -212791 370218
7143 75543 142071 46557 -247695 -337073 -205925 -290715 -266152 -11536 184885 -73755 140536
7131 155128 54234 -61733 -172100 70730 38633 -215858 -93458 -309430 -110005 -222953 38788
7119 8467 48760 221533 -308028 -336400 -148341 175340 -247276 79548 421078 142654 270964
7108 270964 -239657 -39854 -263060 -389888 340710 271426 81366 -174965 -2465 247006 -92397
7096 1259 233547 290364 -204172 250137 288430 -134228 15662 314778 198639 -37847 -121677
7085 -121677 319307 -346408 63561 34170 -50921 135302 53646 111009 -182462 -394451 -146458
7073 -67029 23689 -131956 -299374 -115522 -123027 75430 32593 357808 -223809 -26323 -139759
7062 -139759 -83144 -120474 -159134 54902 -231338 -113061 116461 183645 58997 -80114 -123539
7051 -123539 -120798 157454 -248312 36633 -164976 -51761 -271191 8454 124985 -598651 -121668
7039 -135115 -200905 81617 -16726 -212424 -95559 165868 281095 -41800 -203731 -344263 63059
7027 -276542 67357 -113082 -56016 -184527 -418026 41275 142138 257241 -17760 113608
7016 -161826 2288 -42934 276836 -311303 -38764 184069 -200563 -171834 224175 89741 333779
7005 333779 -48436 -278902 -426780 -145195 -125795 -75401 241655 4254 -41487 334198 -185608
6993 135800 -108935 -372233 -455148 434 -2727 -256012 63004 289801 -185746 13581 -153518
6981 828 163366 126738 -77163 -61713 -94845 184320 9361 232132 45290 154406 -41814 246687
6968 -3659 27978 -21322 -330786 66586 -136160 -103513 -71147 -87924 19784 -242411 9260 177601
6956 177601 166676 -529280 132840 25149 -33786 -73094 -106803 -58824 -20810 311592 22997
6944 -113173 -289434 -89257 -166857 -76912 -23627 -23565 227900 119283 26200 104123 -112683
6932 96215 -242317 107076 -74801 -253994 172333 -223606 -191664 -174019 -124386 219474 156609
6921 156609 -376987 128809 -2211 -88630 204211 -281607 -26472 -108882 206709 -90008 -194875
6910 -194875 -164908 -94860 -34581 -110008 261777 181349 -69075 220104 -42411 6490 -46071
6898 -113816 -398393 382377 356418 293560 235218 127962 -60854 194048 -529143 -244725
6887 -133709 65012 -85188 153183 106073 -17495 -160693 -279075 -439291 13274 104492 33643
6875 -63755 -151592 -240010 76696 -109640 -10814 -254473 153321 -24550 70277 -38086 218182
6863 -252856 115980 51697 185568 166479 157730 -160022 -129630 251307 -177729 28973 -16471
6851 -98904 -41261 -248083 -23722 -447678 200040 -76525 -240088 -97855 49940 -49473 218991
6839 -175586 -62191 -48744 131500 331102 -333579 -76189 170282 73974 -197720 98337 70895
6828 70895 127841 83258 -260870 450326 -145165 105243 -62012 162040 -99279 -95449 75578
6816 -32431 -16338 -255239 198134 186010 -72970 47666 -161891 -181508 -90704 169735 127991
6805 127991 -151116 -377957 132857 -200469 33276 -83535 -56867 59428 174442 70696 87525
6794 87525 -4981 -187735 -49643 -69866 -264364 167068 -174095 246032 -174144 -157775 -6603
6782 111579 153098 10020 -91950 49845 -23292 39722 27176 312812 -243754 75643 186570
6771 186570 14731 26263 -128927 -112865 -118682 -99548 -48798 -76044 59753 169570 18029
6759 49681 -181310 -90203 283562 160187 80763 -34674 49122 229674 74029 -339478 -62325
6747 207098 -96713 55858 121337 -78520 602 -93516 -108307 190334 -73774 -180134 120037
6735 -165489 -194988 -90993 -105256 -141476 -41017 243428 -305754 -147254 -44041 -353365 -172870
6723 -54940 15527 -114937 121636 30318 55431 214211 -229251 -49094 281529 89570 275440
6712 275440 -306920 -28345 -221983 131364 -181148 -156338 -200172 148491 -123635 120615
6701 -141431 204621 12790 -106107 -303687 147026 -111309 94699 279198 52743 -263147
6690 123415 -64354 -247746 253313 -379949 -155887 -96846 -105522 207142 -28680 209714 -51268
6678 -376078 -55606 -208067 -27232 -250934 -72899 155887 -210020 -258555 -82479 -104561 -161209
6667 -161209 -49573 323625 -431576 125803 -67292 -267287 -48742 -133378 35120 -112136 -132357
6656 -132357 -10765 190991 43652 -76883 -278951 -44645 -53915 -20811 103100 36180 -36882
6644 19645 -128153 -296606 -169525 124980 258591 -181856 -116519 -77956 326746 -184574
6633 -157355 -381625 27097 6543 106355 80063 -38007 -154427 -19903 -235436 -42009 -171476
6622 -171476 287335 81781 -206307 -18732 166144 -44459 -56522 92128 -47657 83670 -213839
6610 -157721 274187 266493 114262 440164 -21637 139127 -102292 -308667 68519 181737
6600 181737 -118766 -25814 141881 -59211 -124892 160347 -113590 106565 52771 26670 -250944
6588 116812 323157 -264108 -111187 -431 75779 -27429 220572 295929 -29215 -220332 9679
6576 -168234 19715 195432 -140295 -274189 -125956 -352881 -185673 160581 250412 -17062
6565 25616 -86251 61542 86902 -311772 74610 257319 -117901 235363 -39363 78282 -29716
6553 68256 4411 115156 -32679 241766 194331 -3442 -27587 87804 -113822 35588 -74582 -127810
6541 -127810 72304 -68492 -76713 57804 -269095 15919 -231587 -176336 -177683 -176484 -187948 -169564
6529 -169564 174678 121768 295176 -190993 90115 -18323 3206 -99269 -127015 -48131 248054
6517 -31465 -288855 -158694 4096 235713 -97057 -43815 -278612 -155750 -184890 192808 116094
6506 116094 78464 75532 406480 187198 -117175 88242 523097 -66017 -19749 -276973 280566
6494 14295 -48004 -222971 -155643 80992 -136168 104018 28222 -5547 382541 -89953 -325679
6483 -325679 -220034 -270364 -52156 -292158 -200898 5783 49650 128742 -295687 -15957 -166311
6472 -166311 454686 -127269 128045 -76018 -115792 111043 -165282 23457 234838 150237
6462 150237 80374 16768 -100272 31840 178121 -127412 -349392 -48613 -36735 -169548 97619
6450 59938 80645 -123644 70235 -272937 116108 151443 83759 311854 -22794 477811 -266926
6438 257149 -248359 65412 88759 -132596 -186031 -42004 146122 -17794 -87321 -142166 248413
6426 -133877 321646 -91124 -144182 201595 55115 -188254 40320 156693 -40786 -15624 -150337
6415 -150337 -39086 102554 -56983 -96783 200245 -4947 413660 361883 -279924 -72074 26715
6403 -42610 -81458 -109598 -165162 15097 -159525 19646 48024 189301 -281279 -158780 -290522
6392 -290522 -6129 60325 -59197 -14979 -81129 -144306 127356 162670 27998 -217446 58808
6380 108254 250439 -246690 -260396 88106 -9051 129934 233218 146276 174544 91981 -26413
6368 108503 -68932 313868 -103351 -165775 -107219 -78679 35837 114164 -9998 52228 -170299
6356 7325 271795 -202673 -188341 -58899 15371 118440 63312 -202065 -135883 152181 11338
6344 85458 87068 22449 -15927 211819 -171095 -33041 -106794 19621 2567 16119 -144909 -42327
6331 196935 -102582 -178184 96120 -58191 -15089 144233 -28044 -96199 -14896 31889 -332690
6319 132688 13979 59940 253464 214846 -39275 134792 595724 3869 -124280 176781 88305
6307 -6487 -285306 -105084 -199755 19206 70627 179366 -43235 -32153 8445 10354 -17780 121372
6294 73369 -455564 -160514 58645 -45324 -199729 28056 358408 42572 29436 -435556 -46785
6282 -285179 295331 140244 -131947 -61666 -160695 13346 77910 130758 -165457 144359 -189496
6270 -262567 -146618 -375379 -174282 -56856 -191857 52898 -54276 -53210 -142171 695733 -209117
6258 288088 -104518 -7986 62368 154309 -193639 -114252 -15743 -88591 -219825 -167629 -354038
6247 -354038 -8330 -454757 64089 -115023 165731 -119213 63130 -88637 131763 265808 -154930
6235 108872 37569 -202383 -11658 -165135 115717 88537 13655 -369668 143072 -91181 151979
6223 -99124 -29193 77033 99688 208879 -474650 -123159 -151305 88983 16510 -91672 187190
6211 -66798 -59703 -28046 -111349 -13259 -71540 -160433 118995 92279 410014 -248767 -197718
6200 -197718 14463 -62269 243893 -271753 24952 178237 -106053 117396 86963 229329
6190 229329 7633 -30333 -35365 -397061 -179394 -452846 69908 -245629 223397 -91059 109083
6178 24386 -76569 333086 199291 -134397 66223 -268707 -63867 48758 -5421 134107 -391017
6166 101592 29778 -141737 -17371 -157697 187507 -74049 65810 -271009 -323916 1692 -231985
6154 -68775 328459 -289222 21722 356777 -91995 -21939 354050 167101 -34998 -134496 299023
6142 93093 -82804 -256196 -125954 -30396 25912 36664 -61794 119134 -155756 -3672 602251
6130 -228700 -12011 349796 -149867 225757 3714 29623 381717 -275015 -40290 -20299 358105
6118 149633 -88018 -338924 33962 149253 -15583 53344 -83773 230815 -93027 130059 -246450
6106 -115998 -14728 -13853 -227580 -100408 36006 -69659 137826 -39090 156914 35443 23593
6095 23593 -170363 -31226 94283 -177968 202941 -200399 17253 -476570 66894 118595 -4251
6083 74932 -2522 -35445 10544 224597 -201836 -245252 -92695 -382286 -44547 -121468 26551
6071 -240204 2446 -187834 148481 643 -170292 434998 -128193 -165406 115686 -112837 -50281
6059 -20480 -106955 111559 -232956 289479 -482390 117656 -99066 41942 -264235 -253425 -10739
6047 -147125 -49949 38228 439709 -149349 178537 -300500 186728 239311 -137162 -246038
6037 -246038 -106993 21123 13065 21010 281922 116206 -159710 -308848 112283 28837 -44923
6025 -89200 111190 -190257 295659 152538 15897 -161958 26881 -320696 218197 -86327
6014 -92383 -350442 -10851 -155148 22791 258086 -50149 -245680 35409 83956 57505 -259404
6002 671 286463 163715 434515 -82008 61704 146656 82106 -81719 40141 -65820 44270 2415
5989 -159931 -170124 35656 137685 42031 -144497 -44770 -59821 87052 40784 -136342 -126161
5978 -126161 -197601 -129223 284916 79351 -176125 42254 152681 -104035 75276 127472 -29601
5966 -68055 80696 -12226 30603 -20986 59553 -213295 -77968 -180485 25687 141582 467322
5955 467322 110768 -121460 63616 -186981 174041 -212908 249911 423856 181397 -66128
5944 13344 -188517 -105148 20209 230404 409098 -47315 -64305 169206 323402 -80145 58466
5932 -105618 2035 219222 -56698 -193138 91814 -149562 -129172 -49840 173329 -85819 -225602
5921 -225602 50546 23384 10350 79784 -5325 22677 -19409 -65954 38796 -293572 -82172 168956
5908 27628 -142242 111766 182972 149887 163988 -30380 -210645 -102212 -180991 178958 41160
5896 113049 -201794 247372 -323787 59833 -225121 -41478 -209324 -192101 -217427 78996 -227050
5884 310719 82945 -245006 -412733 -103915 -39063 140834 -131108 -87162 370485 331162
5874 331162 -64663 214271 92180 -225584 191428 -177073 59359 -29492 185867 -323311
5863 -132368 56674 50069 -201160 140321 70552 -64561 -54159 -3979 -273458 -262546 40967
5851 212060 -97583 92191 57691 -129594 -231359 -30743 264936 -43672 95706 388268 -6995
5839 -63138 99318 -137876 -147613 -258912 -149658 -156447 -499580 3686 94541 -26621 -335783
5828 -335783 83071 -69994 173730 217957 -90939 278735 -112061 160222 -127362 -104411 34161
5816 -271230 -67666 367735 -245847 41238 110211 -90132 359611 286039 -51715 69310 -231239
5804 9022 313557 198034 25260 -277237 -263677 -305295 -119321 123189 171255 -19849 -134331
5793 -134331 5141 91576 -150724 3039 79640 14044 179007 333443 203469 180534 -148158
5781 220449 185727 -22537 220112 -197636 -18401 94184 -380235 193774 -139744 148309
5770 20325 -190584 59542 110637 -207585 -91008 54512 -254495 -46763 110956 325681 25023
5758 -45319 -186271 367131 231865 45100 -182542 -209027 149667 -105618 105352 -198623
5747 -288538 109091 -303845 -14712 -2912 -315289 351704 -269361 -298205 -362490 44642 106904
5736 106904 63816 289938 198994 -11601 138520 11040 202717 274792 22824 118995 204969
5725 204969 -154792 -23405 128241 -360995 126161 -34856 -38457 -290850 151469 -197433
5714 -280225 273852 21076 322099 -297697 -300851 -220754 -84379 155052 3738 79450 283328
5703 283328 468224 -14279 880 -151673 84840 17399 52343 139178 -127078 253991 128335
5692 128335 123917 68905 -112186 16414 -109435 99878 -111420 -21145 -134916 313040 228686
5681 228686 -91233 -192162 -241409 -33006 -255837 -450464 69630 -193982 29815 -1342 203107
5669 -87989 -786 -16499 -96305 285852 160929 -287270 68716 203131 167047 -133930 186666
5657 -154657 -24624 -394889 129138 62410 81845 27147 -198193 -41652 -140216 86060 82988
5646 82988 -269647 -104304 202939 227788 145847 273511 13556 -304800 246685 -165672
5635 -352908 240336 -58821 117454 73892 35129 50964 59888 -60053 326333 36487 -208313
5623 25506 -70037 -87360 178212 182160 -236702 -19373 77939 -36795 26013 -268919 140548
5611 8215 -263897 259970 184714 -51232 -74849 34872 162306 250311 -400916 -166936 101456
5599 -142975 131438 14919 113009 -375248 4053 -185127 170201 -219904 -114949 88107 -72913
5587 197186 -39307 145885 208938 18195 -93774 -146039 342363 192950 -33406 1730 115882
5576 115882 -13597 127968 132298 -279588 -128083 191049 97001 148021 -5596 234283 46026
5564 -29189 241331 -233196 170974 195972 -27864 -261234 -85130 -187766 127568 368304
5554 368304 277793 -246856 327188 -170086 -329427 118556 -359087 261534 38401 268880
5544 268880 192375 86949 151396 111175 -54519 -52959 -22896 -251322 -254775 -20624 11778 -76588
5531 119244 -185875 318012 4463 -155227 -47955 -51159 -379701 242840 -84573 103612 260739
5520 260739 147363 -238823 -90468 -16480 -165041 -6613 124856 424 -305480 103593 -99408
5508 183685 -84444 -81881 175533 -55799 30411 -201099 -59200 213628 372610 11443 -53329
5496 207896 -228276 112903 -67543 142796 -50285 -432 14730 -42896 -31343 -171604 -313266
5485 -313266 182619 -139612 -34857 -263482 -35251 8567 -134554 185317 347 -158375 -43050
5473 62190 -64411 246217 -186009 -132114 47953 -64661 -180210 19318 58559 313883 -266041
5461 41680 -363527 57916 -189312 -10531 -3230 381347 204822 101602 94267 27264 410686
5450 410686 -318839 261585 37137 58488 43634 -125362 -533602 -274613 -278949 -58138 22694
5438 11694 -232776 -324 238349 150641 -136776 -4353 182974 -20067 183308 -312135 276336
5426 245425 -302544 -109489 85669 13614 -191342 -33629 4208 -270841 13127 154674 -65333
5414 -96297 -318320 -251250 -180659 91753 -80565 -227832 -13604 30168 144109 131447 71266
5403 71266 -177242 133991 14944 371547 -65768 -224084 -31981 -102745 242923 -113566 -80283
5392 -80283 57402 26171 -224290 57225 -6380 -244419 -11480 93720 -41159 -327275 67551
5380 14852 23298 -60091 -163268 4286 138676 -413483 130225 -88816 39725 57175 22424
5368 -86411 -76459 80961 33004 264538 112479 -265397 41515 130328 -37585 179899 508275
5357 508275 422401 -8063 -119025 107261 -221650 -117679 494470 -324978 -89431 -364508
5347 -364508 181188 290350 297336 160001 74333 184636 175451 316473 -427654 -63002 -38344
5336 -38344 240431 -28815 -329879 -133226 -53115 268237 -123179 275177 -2574 6029 -15964
5324 -272760 36567 -56738 -104898 -76302 107595 -347401 69534 -241341 59830 183722 63883
5312 -172740 206291 -138403 -106124 1540 -33720 -117608 170699 252668 225422 48871 110447
5301 110447 65584 76852 -155354 -88331 -105330 295910 -297164 -194768 -48153 260297 6357
5289 -520922 -119886 -200339 -432436 9480 -62019 -54265 21282 231581 -158357 209526 -158370
5277 -98345 86064 -6413 149518 15321 -118417 -135875 335064 520986 -317261 -123125 50296
5265 328038 14892 85748 145690 46943 10827 112508 89094 -222207 -204446 -184836 -159381
5254 -159381 -145972 185284 -102839 -191466 -42044 133680 172046 127457 231731 -41025 -146700
5243 -146700 15762 -107449 73393 105902 254468 -21523 106935 155205 -45642 -44738 71050
5231 154452 151857 -14235 -234536 64559 -81954 124467 -8704 287499 117407 -47251 126994
5219 -154518 348249 -113005 -582655 -227687 -135647 -86442 -262603 41132 -227284 -13840
5208 173958 125849 193409 202775 68547 -6627 69043 -161429 -118113 134060 245345 -86896
5196 -97702 111206 221002 -15926 125748 171740 178268 -154238 -21036 -22439 -123023 -185276
5185 -185276 -34153 -13650 -227954 140224 11074 187365 -24342 88576 16955 41193 -43555
5173 301385 -98724 77393 162760 -14068 -178116 -118233 365106 -143810 -56020 -137177 -190402
5162 -190402 85186 -204710 90757 3505 -232 303338 -4153 -60647 152492 -27949 276915 206561
5150 206561 293525 84710 -282871 188014 -3659 56149 -75742 9055 -71635 -159812 106910
5138 249752 37023 -124408 29268 347044 -68973 262196 -21796 8298 92645 71743 147946
5127 147946 109724 -43930 -243810 99999 -17893 130906 263978 125292 206195 -32271 336963
5115 2713 -96813 495 19443 18431 -13030 41219 169094 -27013 -150884 -36620 68158 76704
5103 76704 778 -207670 142832 -184342 148079 438740 72135 -115895 -87536 -108215 297646
5091 115864 251203 -1854 142556 44077 5144 -125600 -116981 152360 190688 -66914 377570
5079 -113604 -183632 -134121 -42951 -277759 -232462 -294223 49230 -17643 -324101 -278365 47709
5067 106274 361133 -10438 -117668 -83200 109193 200487 -267466 131230 -9428 336009 152901
5055 265814 223141 9697 -119193 -35193 -65216 -17105 -93607 79452 -84238 -441745 324812
5043 -98079 92491 -151081 185399 207117 -81956 4226 -261790 -32065 -154227 -63281 237814
5031 -74976 -361404 21574 14015 -70747 -246505 114568 556 -164706 139648 155261 131822
5020 131822 -114408 -217780 -85233 131115 234141 209001 394281 402491 84191 99269 -89483
5008 268178 -89357 56802 -168335 12382 -375400 -6146 -147311 100621 -27783 -77813 64218
4996 61225 113352 262841 -282394 19011 59124 -6929 406077 -277113 -249292 -51756 389473
4984 435311 163502 -212204 39108 -112292 -242859 121645 68755 -85149 466364 -28303
4973 -222127 134119 -67867 -275073 -92963 7117 -38528 43610 -257759 -293278 184409 -113751
4961 -256095 177419 -1865 -16343 -119713 238222 279759 8637 -163067 -218183 182125 280874
4950 280874 2435 -107855 -216239 -116769 40496 -123496 6211 -8322 -277629 74072 302415
4939 302415 -21309 -316580 25038 176334 286896 -85346 -147205 -49172 252318 67200 19049
4927 125349 -406108 -91134 -133688 -104082 91965 -60152 16339 -89246 -57631 125116 -108473
4915 -78724 -42927 -417430 100665 -186506 -40201 246518 2170 5810 -142733 -140198 265212
4903 81598 367416 339396 -45821 510877 -96966 75075 -35065 217829 -183558 -243957 -46103
4891 20885 -384771 74206 16146 -7805 285157 438314 21442 -152389 469706 -313058 -37574
4879 362772 -146058 235936 -82984 -126876 17126 389899 -76329 -235316 -188798 84370 -203053
4867 242934 -123035 -104236 47247 61038 96107 140227 82834 103598 418463 64078 -66803
4855 -26038 146896 -109215 -111237 262328 -195805 221817 -34776 248710 343905 125953 -238139
4843 264064 -21851 32186 210043 -40787 60851 13439 -107891 93264 53351 -26014 -35249
4832 -35249 14278 -78016 -248897 -249559 170658 110899 157340 227276 -25694 11040 -76701 -123131
4820 -123131 84111 -8453 -67253 24862 273121 324580 89005 92599 57918 -141733 -226764 90630
4807 70630 153626 -75437 50489 16180 -145191 36564 -58589 -33044 -233485 -201828 44363
4795 2116 -112390 31634 152272 -259823 98157 -273820 211060 -98070 138527 100201 356164
4784 356164 -195099 -103228 49687 -75378 -11396 124101 -94878 -85732 200204 -187285 -72447
4772 -321599 35500 135015 158404 515004 37248 9305 331434 -19639 66439 -251369 104979
4760 -128431 142347 -51121 157038 -439644 -225883 -43686 142112 204921 42379 -436986
4749 64857 -159949 -217067 314883 -88618 129602 50752 122742 -7471 224462 -124940 149217
4737 4081 6733 31959 -9467 -153556 137823 131225 -74500 11150 -52 -10142 -115078 28957 114390
4724 114390 360213 -45450 -56971 84877 -100049 92387 -91842 -86127 -32897 152552 -124380
4712 99117 -48184 -318440 -245145 55070 -140427 3953 -336247 70175 -312228 -300885 289008
4700 -44150 -160839 82168 -25669 -361616 -2056 -13735 201362 -79191 -131976 188499 -102697
4688 -218733 -66867 -31083 148301 279759 62686 17920 26210 118714 461072 115190 154119
4677 154119 -41188 239202 235546 -80686 273842 83669 43689 7124 172349 98925 158925
4666 158925 27718 -52104 46030 -168460 156435 -307274 -61797 -157570 125555 24148 24077
4655 24077 321471 -197459 -170196 155664 152964 62281 -64040 -66182 261202 257227 -152661
4643 165392 434164 -131275 -77413 -134449 58959 -395256 253145 39105 -176292 8 -120189
4631 -258650 -77212 309833 131106 -44828 8217 -139209 -111171 415 262562 139574 281444
4620 281444 -166409 -138327 112832 -34797 -224448 -6412 251125 80803 238190 -62876 -306641
4609 -306641 41347 10337 26102 347934 32704 75877 -173078 -86126 69775 82197 -189496
4597 -273365 -227838 -37605 -199189 -89624 248376 34112 101818 -212443 -238027 47478 -58410
4585 48163 -268435 -148115 -163573 -228306 142405 258071 21231 -9189 -244249 -28292 -105621
4574 -105621 70365 28315 224269 -143022 146428 99369 188061 261340 38865 67234 -236475
4562 -288933 -84204 -80397 -57288 89289 60171 -73885 -142677 -228904 104100 -268835 -281927
4551 -281927 -196618 223484 -165905 405314 44435 124058 -73739 -159060 124630 182644 109686
4540 109686 182400 -37978 45258 -158173 10657 23418 -61601 299994 -12464 -23279 31113
4528 20190 211650 -2003 -85538 453 -43470 -118627 103660 254997 269308 -31250 101771 -220785
4515 138896 -242719 34574 112814 190577 -61821 -58365 139302 430039 -223050 71112 68224
4504 68224 -107104 -67711 74886 -51328 -182479 -304581 -9670 -133175 242389 -145588 -265967
$$ [...]
##END NTUPLES=NMR SPECTRUM
##END=
