
##TITLE=AC1320_SSOAH12149_6535388_BeTgGdQVbO
##JCAMPDX= 6.0         $$ Bruker NMR JCAMP-DX V2.0
##DATA TYPE= NMR SPECTRUM
##DATA CLASS= NTUPLES
##ORIGIN= BRUKER
##OWNER= Administrator
$$ 1.72 TOPSPIN		Version 2.1
$$ 2012-07-17 18:37:27.296 -0500  Administrator@TOPSPIN
$$ Compression mode = diff/dup
##.OBSERVE FREQUENCY= 400.02188249412
##.OBSERVE NUCLEUS= ^1H
##.ACQUISITION MODE= SIMULTANEOUS (DQD)
##.ACQUISITION SCHEME= undefined
##.AVERAGES= 64
##.DIGITISER RES= 22
##SPECTROMETER/DATA SYSTEM= spect
##.PULSE SEQUENCE= noesygpps1d.comp
##.SOLVENT NAME= COFFEE_meoh
##.SHIFT REFERENCE= INTERNAL, COFFEE_meoh, 1, 14.96079
##AUDIT TRAIL= $$ (NUMBER, WHEN, WHO, WHERE, PROCESS, VERSION, WHAT)
$$ ##TITLE= Audit trail, TOPSPIN		Version 2.1
$$ ##JCAMPDX= 5.01
$$ ##ORIGIN= Bruker BioSpin GmbH
$$ ##OWNER= Administrator
$$ $$ C:\Bruker\TOPSPIN/data/COFFEE/nmr/AC1320_SSOAH12149_6535388_BeTgGdQVbO/12/pdata/1/auditp.txt
$$ ##AUDIT TRAIL=  $$ (NUMBER, WHEN, WHO, WHERE, PROCESS, VERSION, WHAT)
(   1,<2012-07-17 18:37:22.031 -0500>,<Administrator>,<TOPSPIN>,<go>,<TOPSPIN 2.1>,
      <created by zg
	started at 2012-07-17 18:25:51.765 -0500,
	POWCHK enabled, PULCHK disabled,
       configuration hash MD5:
       6B 1B 68 BB D9 2E 58 E2 7F 35 AD 54 07 DF 0E 41
       data hash MD5: 64K
       77 CF DB 65 8A 71 F3 37 64 23 33 D2 11 33 F5 4B>)
(   2,<2012-07-17 18:37:25.140 -0500>,<Administrator>,<TOPSPIN>,<proc1d>,<TOPSPIN 2.1>,
      <Start of raw data processing
       efp LB = 0.3 FT_mod = 6 PKNL = 1 PHC0 = 0 PHC1 = 0 SI = 128K 
       data hash MD5: 128K
       D0 01 BD 49 B5 D9 A3 C8 D4 BA C0 35 AA D1 E0 73>)
(   3,<2012-07-17 18:37:26.187 -0500>,<Administrator>,<TOPSPIN>,<proc1d>,<TOPSPIN 2.1>,
      <pk PHC0 = 0.2911377 PHC1 = 0 
       data hash MD5: 128K
       BA 99 EC 86 CE DC A5 8B 17 DB E8 36 0E E5 D6 64>)
(   4,<2012-07-17 18:37:26.953 -0500>,<Administrator>,<TOPSPIN>,<proc1d>,<TOPSPIN 2.1>,
      <abs ABSG = 1 
       data hash MD5: 128K
       62 0B 17 FD BA CF FC 1F B1 A0 79 80 C0 8F 82 17>)
(   5,<2012-07-17 18:37:27.031 -0500>,<Administrator>,<TOPSPIN>,<proc1d>,<TOPSPIN 2.1>,
      <abs ABSG = 2 
       data hash MD5: 128K
       EA 7B FF 2B D8 5F F9 D8 05 65 BC 98 A6 CC FF EC>)
(   6,<2012-07-17 18:37:27.078 -0500>,<Administrator>,<TOPSPIN>,<proc1d>,<TOPSPIN 2.1>,
      <abs ABSG = 3 
       data hash MD5: 128K
       E2 A9 4B 7C 4D D8 7E F3 6A 3A 80 24 9F 67 84 47>)
(   7,<2012-07-17 18:37:27.140 -0500>,<Administrator>,<TOPSPIN>,<proc1d>,<TOPSPIN 2.1>,
      <abs ABSG = 4 
       data hash MD5: 128K
       8E 9E 0F 70 EE B4 68 BD A1 26 C2 FA 4D A1 12 1D>)
(   8,<2012-07-17 18:37:27.203 -0500>,<Administrator>,<TOPSPIN>,<proc1d>,<TOPSPIN 2.1>,
      <abs ABSG = 5 
       data hash MD5: 128K
       E8 86 F1 69 3F 79 97 C4 DE 4D 0F 3C 79 1C 08 BD>)
$$ ##END=
$$ 
$$ $$ hash MD5
$$ $$ C4 38 B7 79 85 05 19 37 9C A1 87 69 C0 44 81 98
##$RELAX= 
##$RELAX= 
##$RELAX= 
##$RELAX= 
##$RELAX= 
##$RELAX= 
##$RELAX= 
##$RELAX= 
$$ Bruker specific parameters
$$ [...]
##$TP07= 0
##$TPNAME0= <>
##$TPNAME1= <>
##$TPNAME2= <>
##$TPNAME3= <>
##$TPNAME4= <>
##$TPNAME5= <>
##$TPNAME6= <>
##$TPNAME7= <>
##$TPOAL= (0..7)
0.5 0.5 0.5 0.5 0.5 0.5 0.5 0.5
##$TPOFFS= (0..7)
0 0 0 0 0 0 0 0
##$TUNHIN= 0
##$TUNHOUT= 0
##$TUNXOUT= 0
##$USERA1= <user>
##$USERA2= <user>
##$USERA3= <user>
##$USERA4= <user>
##$USERA5= <user>
##$V9= 5
##$VALIST= <valist>
##$VCLIST= <CCCCCCCCCCCCCCC>
##$VD= 0
##$VDLIST= <DDDDDDDDDDDDDDD>
##$VPLIST= <PPPPPPPPPPPPPPP>
##$VTLIST= <TTTTTTTTTTTTTTT>
##$WBST= 2048
##$WBSW= 25
##$XGAIN= (0..3)
0 0 0 0
##$XL= 0
##$YL= 0
##$YMAX_a= 11370632
##$YMIN_a= -8624373
##$ZGOPTNS= <>
##$ZL1= 120
##$ZL2= 120
##$ZL3= 120
##$ZL4= 120
##$ABSF1= 14.96079
##$ABSF2= -5.597392
##$ABSG= 5
##$ABSL= 3
##$ALPHA= 0
##$AQORDER= 0
##$ASSFAC= 0
##$ASSFACI= 0
##$ASSFACX= 0
##$ASSWID= 0
##$AUNMP= <proc_prof1d_extract.lims>
##$AXLEFT= 0
##$AXNAME= <>
##$AXNUC= <1H>
##$AXRIGHT= 0
##$AXTYPE= 0
##$AXUNIT= <>
##$AZFE= 0.1
##$AZFW= 0.1
##$BCFW= 0
##$BC_mod= 0
##$BYTORDP= 0
##$COROFFS= 0
##$CY= 15
##$DATMOD= 1
##$DC= 0
##$DFILT= <>
##$DTYPP= 0
##$F1P= 0
##$F2P= 0
##$FCOR= 0.5
##$FTSIZE= 131072
##$FT_mod= 6
##$GAMMA= 0
##$GB= 0
##$INTBC= 1
##$INTSCL= 1
##$ISEN= 128
##$LB= 0.3
##$LEV0= 0
##$LPBIN= 0
##$MAXI= 10000
##$MC2= 0
##$MEAN= 0
##$ME_mod= 0
##$MI= 0
##$NCOEF= 0
##$NC_proc= -2
##$NLEV= 6
##$NOISF1= 0
##$NOISF2= 0
##$NSP= 0
##$NTH_PI= 0
##$NZP= 0
##$OFFSET= 14.96079
##$PC= 1
##$PHC0= 0.2911377
##$PHC1= 0
##$PH_mod= 1
##$PKNL= yes
##$PPARMOD= 0
##$PPDIAG= 0
##$PPIPTYP= 0
##$PPMPNUM= 2147483647
##$PPRESOL= 1
##$PSCAL= 4
##$PSIGN= 0
##$PYNMP= <proc.py>
##$REVERSE= no
##$SF= 400.020009720063
##$SI= 131072
##$SIGF1= 0
##$SIGF2= 0
##$SINO= 400
##$SIOLD= 131072
##$SPECTYP= <>
##$SREGLST= <1H.CDCl3>
##$SSB= 0
##$STSI= 131072
##$STSR= 0
##$SW_p= 8223.68421052631
##$SYMM= 0
##$S_DEV= 0
##$TDeff= 65536
##$TDoff= 0
##$TI= <>
##$TILT= no
##$TM1= 0
##$TM2= 0
##$TOPLEV= 0
##$USERP1= <user>
##$USERP2= <user>
##$USERP3= <user>
##$USERP4= <user>
##$USERP5= <user>
##$WDW= 1
##$XDIM= 131072
##$YMAX_p= 430115236
##$YMIN_p= -11697
##$CURPLOT= <Network HP LaserJet P1505>
##$CURPRIN= <$Network HP LaserJet P1505>
##$DFORMAT= <normdp>
##$LAYOUT= <+/1D_H.xwp>
##$LFORMAT= <normlp>
##$PFORMAT= <normpl>
##$SURQMSG= 1
$$ End of Bruker specific parameters
$$ ---------------------------------
##NTUPLES= NMR SPECTRUM
##VAR_NAME=  FREQUENCY,     SPECTRUM/REAL,   SPECTRUM/IMAG
##SYMBOL=    X,             R,               I
##VAR_TYPE=  INDEPENDENT,   DEPENDENT,       DEPENDENT
##VAR_FORM=  AFFN,          ASDF,            ASDF
##VAR_DIM=   131072,        131072,          131072
##UNITS=     HZ,            ARBITRARY UNITS, ARBITRARY UNITS
##FACTOR=    0.0627417313425164, 1,          1
##FIRST=     8223.62146879497, 1600,         -50276
##LAST=      0,             1959,            -50866
##MIN=       0,             -11697,          0
##MAX=       8223.62146879497, 430115236,    0
$$ Real data points
##PAGE= N=1
##DATA TABLE= (X++(R..R)), XYDATA
$$ [...]
61681D15744l443l532l703l660l140k347j835j952k541l167l406k981j975q96
$$ 415744 412301 408769 405066 401406 398266 395919 394084 392132 389591 386424 383018 380037 378062 377166
61667C77166k15K43R98K010K490J930R12M88R66J731K138K206K351K832L621M491
$$ 377166 376951 377194 378192 380202 382692 384622 385534 386022 386988 388719 390857 393063 395414 398246 401867 406358
61651D06358N054M928M169L414L241L362K818J188o75j492r39J85J055J545J838
$$ 406358 411412 416340 420509 423923 427164 430526 433344 434532 433857 432365 431426 431611 432666 434211 436049
61636D36049J830J377P16J95j75n39p09l36N05J289J642J569J035k30k342m830
$$ 436049 437879 439256 439972 440167 439992 439453 438744 438408 438913 440202 441844 443413 444448 444218 441876 437046
61620D37046o814p552o940n629m566m123l732k698j321p43j584l206m534n166
$$ 437046 430232 422680 415740 410111 405545 401422 397690 394992 393671 392928 391344 388138 383604 378438
61606C78438n328n202m786m287m042m019l819l319k924k962l068k650j806j398
$$ 378438 373110 367908 363122 358835 354793 350774 346955 343636 340712 337750 334682 332032 330226 328828
61592C28828j941k815k930k138j461j758k658l151k823k060j224l49L67M82qm47
$$ 328828 326887 324072 321142 319004 317543 315785 313127 309976 307153 305093 303869 303520 303887 304369 304361 303914
61576C03914l85k51p01j611k163j853r57q4L43K63l3n3M10R91J209J150J288J686
$$ 303914 303529 303278 302577 300966 298803 296950 295993 295909 296252 296515 296482 296429 296839 297830 299039 300189 301477 303163
61558C03163J889J696J521J686J893J750J448J406J516J293O93K48L27O70Q14
$$ 303163 305052 306748 308269 309955 311848 313598 315046 316452 317968 319261 319954 320202 320529 321199 322013
61543C22013O22K89O5R3L15M27K30N4M44J359K069K033J483R15M23q8m72n40m40
$$ 322013 322635 322924 322989 323082 323397 323824 324054 324108 324552 325911 327980 330013 331496 332411 332834 332746 332274 331734 331294
61524C31294l71j61L50P72N50k02q58j184j451j707j661j352j278j534j549r07
$$ 331294 330923 330762 331112 331884 332434 332232 331374 330190 328739 327032 325371 324019 322741 321207 319658 318751
61508C18751J3O31Q64R09P67M69L89Q49J640K242K403K210J969K094K763L402
$$ 318751 318764 319395 320259 321168 321935 322404 322793 323642 325282 327524 329927 332137 334106 336200 338963 342365
61492C42365L103J906J055J472K495K851K326J714J395J021M72K60P24J582K446
$$ 342365 345468 347374 348429 349901 352396 355247 357573 359287 360682 361703 362175 362435 363159 364741 367187
61477C67187L200L758L955L863L750L654L376K917K384J526K7j705k761k900k814
$$ 367187 370387 374145 378100 381963 385713 389367 392743 395660 398044 399570 399597 397892 395131 392231 389417
61462C89417l038l263l158l122l683m587n008m431l000j322k03j22o47p47j7Q25
$$ 389417 386379 383116 379958 376836 373153 368566 363558 359127 356127 354805 354602 354480 353833 353086 353069 353894
61446C53894J050Q88R20J020P09J69P8N38R69J092J290J832K400K620K588K545
$$ 353894 354944 355832 356752 357772 358481 358650 358728 359266 360235 361327 362617 364449 366849 369469 372057 374602
61430C74602K477K246J830J227L95m41p34j00J185K389K934K789K421K414K872
$$ 374602 377079 379325 381155 382382 382777 382336 381602 381502 382687 385076 388010 390799 393220 395634 398506
61415C98506L188K596J165p8k12N56J180R66J84m71p30r24j406j955j906j032
$$ 398506 401694 404290 405455 405377 405165 405721 406901 407867 408051 407580 406850 405926 404520 402565 400659 399627
61399C99627j10k96j738l209l426k473j399o56K53J529K352K015J147R05J323
$$ 399627 399517 399221 397483 394274 390848 388375 386976 386320 386573 388102 390454 392469 393616 394521 395844
61384C95844J393Q27P11J934L803M866M648L877L285K970K864L027L295L233K729
$$ 395844 397237 398064 398775 400709 404512 409378 414026 417903 421188 424158 427022 430049 433344 436577 439306
61369D39306K178J828J244j22k020l390l374k197j042j005k070l138l181k254
$$ 439306 441484 443312 444556 444434 442414 439024 435650 433453 432411 431406 429336 426198 423017 420763
61355D20763j207n24J30J154K347L203L540L566L519L557L810M179M216L566K511
$$ 420763 419556 419032 419162 420316 422663 425866 429406 432972 436491 440048 443858 448037 452253 455819 458330
61340D58330J733J486J353R47N30O05J113J460J318J057J188J642J862J469N55
$$ 458330 460063 461549 462902 463849 464379 464984 466097 467557 468875 469932 471120 472762 474624 476093 476648
61325D76648n29j435j863j719j253p75j78R04K378L556L910L702L551L792M445
$$ 476648 476119 474684 472821 471102 469849 469074 468896 469800 472178 475734 479644 483346 486897 490689 495134
61310D95134N495O789P962Q898R998J1565J3200J4286J4784J4963J4546J2883
$$ 495134 500629 507418 515380 524278 534276 545841 559041 573327 588111 603074 617620 630503
61298F30503R938O466L129J05k379l872m391m726n694p383r332j0999j1865j1577
$$ 630503 640441 646907 650036 650141 647762 643890 639499 634773 629079 621696 612364 601365 589500 577923
61284E77923j0373r098q421q232p907o935n258l313j833j234j125p72l8O58J208
$$ 577923 567550 558452 550031 541799 533892 526957 521699 518386 516553 515319 514194 513422 513384 514042 515250
61269E15250J907K562K454J481N49L01L25J59L32J513L343M920O020O854P094
$$ 515250 517157 519719 522173 523654 524203 524504 524829 524988 525320 526833 530176 535096 541116 547970 555064
61254E55064O203M531L070K184J505R99J068J514J447O09j23RN65N91k29j476
$$ 555064 561267 565798 568868 571052 572557 573556 574624 576138 577585 578194 578071 578080 578645 579236 579007 577531
61238E77531k601l146k943k430k382k924l229k601j397l97K58R22J648K279L109
$$ 577531 574930 571784 568841 566411 564029 561105 557876 555275 553878 553481 553739 554661 556309 558588 561697
61223E61697M610O482P664P585O740N882N218M764M854N728O866P411P171O612
$$ 561697 566307 572789 580453 588038 594778 600660 605878 610642 615496 621224 628090 635501 642672 649284
61209F49284O034N255M168L038K049J147M53L35P68J183J369J972L538N565P225
$$ 649284 655318 660573 664741 667779 669828 670975 671428 671763 672531 673714 675083 677055 680593 686158 693383
61194F93383Q601J0318J2199J3282J3168J2370J1196R253O424L472J177l76j309
$$ 693383 701984 712302 724501 737783 750951 763321 774517 783770 790194 793666 794843 794467 793158
61181G93158j508j243j403k440l704m428m787n288n742n721n449n410n450n279
$$ 793158 791650 790407 789004 786564 782860 778432 773645 768357 762615 756894 751445 746035 740585 735306
61167G35306n390o412p794q319p902p708q352r135r382r448r857j0248r920q853
$$ 735306 729916 723504 715710 707391 699489 691781 683429 674294 664912 655464 645607 635359 625439 616586
61153F16586p632o646n822m762l004m53K124L494L192J970P71l57j892l834n612
$$ 616586 608954 602308 596486 591724 588720 588267 590391 593885 597077 599047 599818 599461 597569 593735 588123
61138E88123o813p483p708p284o022m207k509j349m86N84J866K852L323L805M876
$$ 588123 581310 573827 566119 558835 552813 548606 546097 544748 544262 544846 546712 549564 552887 556692 561568
61123E61568O450Q087R697J1439J3238J4933J6648J8439J9826K0379K0518K1040
$$ 561568 568018 576105 585802 597241 610479 625412 642060 660499 680325 700704 721222 742262
61111G42262K2053K3097K4105K5233K5947K5412K3884K2643K2251K1925K0979
$$ 742262 764315 787412 811517 836750 862697 888109 911993 934636 956887 978812 999791
61100I99791J9685J8247J5985J2394Q124M159P02k371m679n888o548p494q740
$$ 999791 1019476 1037723 1053708 1066102 1074226 1078385 1079087 1076716 1072037 1066149 1059601 1052107 1043367
61087A043367r742j0346j0663j0427r281p587o118n022l745j917K23K268M056
$$ 1043367 1033625 1023279 1012616 1002189 992908 985321 979203 974181 970436 968519 968742 971010 975066
61074I75066N756P841J0711J4000J6637J8039J8911K0366K2530K4533K5603K5650
$$ 975066 980822 988663 999374 1013374 1030011 1048050 1066961 1087327 1109857 1134390 1159993 1185643
61062A185643K5071K4454K4177K3891K2698K0270J7323J4553J1713Q326M734J626
$$ 1185643 1210714 1235168 1259345 1283236 1305934 1326204 1343527 1358080 1369793 1378119 1382853 1384479
61050A384479r56l288n092n953o232o650p213p460p415p369o990n752l942k183
$$ 1384479 1383523 1380235 1375143 1369190 1362958 1356308 1349095 1341635 1334220 1326851 1319861 1314109 1310167 1307984
61036A307984k15K624N911Q408R938J1702J4594J8358K2453K6561L0036L2116
$$ 1307984 1307769 1310393 1316304 1324712 1334650 1346352 1360946 1379304 1401757 1428318 1458354 1490470
61024A490470L2969L3470L3862L3966L4723L7927M3939N1284N8893O7153P6096
$$ 1490470 1523439 1556909 1590771 1624737 1659460 1697387 1741326 1792610 1851503 1918656 1994752
61013A994752Q4515R2002J00260J11304J26070J45991J74048K12530K61758L23224
$$ 1994752 2079267 2171269 2271529 2382833 2508903 2654894 2828942 3041472 3303230 3626454
61003C626454M02453N06604O41451Q13883J034079J307194J618666J928254K176348
$$ 3626454 4028907 4535511 5176962 5990845 7024924 8332118 9950784 11879038 14055386
60994A4055386K291877K202016J861037J298659O45567R0118k18536k44692o0978
$$ 14055386 16347263 18549279 20410316 21708975 22354542 22444660 22226124 21981432 21920454
60985B1920454K11265M48372N34332L74171n9478o83924j329510j828167k095852
$$ 21920454 22131719 22580091 23114423 23488594 23429116 22745192 21415682 19587515 17491663
60976A7491663k145685k041670j849541j618471j383054j165079r73266q07806
$$ 17491663 15345978 13304308 11454767 9836296 8453242 7288163 6314897 5507091
60968E507091o67272n50890m56559l80310l18364k68382k28741j97730j73590
$$ 5507091 4839819 4288929 3832370 3452060 3133696 2865314 2636573 2438843 2265253
60959B265253j54552j38841j25078j12505j00592q8894p7590o7481n8965n1561
$$ 2265253 2110701 1971860 1846782 1734277 1633685 1544791 1467201 1399720 1340755 1289194
60949A289194m4952l9742l6573l5060l4228l3490l2514l0794k8168k5346k3123
$$ 1289194 1244242 1204500 1167927 1132867 1098639 1065149 1032635 1001841 973673 948327 925204
60938I25204k1466j9971j8810j8306j8049j7364j6365j5591j4886j3684j2277
$$ 925204 903738 883767 864957 846651 828602 811238 794873 779282 764396 750712 738435
60927G38435j1643j1864j1851j0982j0010r790r893r233p649o154n745o400p185
$$ 738435 726792 714928 703077 692095 682085 672295 662402 653169 645520 639366 633621 627221 620036
60914F20036p124o047m699l916l701l374k565j674j233j272j494j760k050k214
$$ 620036 612912 606865 602166 598250 594549 591175 588610 586936 585703 584431 582937 581177 579127 576913
60900E76913k069j636j183j017j349k212l388m493n203n364n037m564m381m612
$$ 576913 574844 573208 572025 571008 569659 567447 564059 559566 554363 548999 543962 539398 535017 530405
60886E30405m927n098n466o438p715q541q661q497q291p693o455m968l759k936
$$ 530405 525478 520380 514914 508476 500761 492220 483559 475062 466771 459078 452623 447655 443896 440960
60872D40960k401k245k411k359j596l95N03Q32J069J716K723L660M245M588N068
$$ 440960 438559 436314 433903 431544 429948 429553 430056 430888 431957 433673 436396 440056 444301 448889 453957
60857D53957N915O792O880N697L762K217J759K223L126M219N262N705N021L357
$$ 453957 459872 466664 473544 479241 483003 485220 486979 489202 492328 496547 501809 507514 512535 515892
60843E15892J487M2r72j833k621l277l925m758n658o206o148n628m984m538m575
$$ 515892 517379 517421 516449 514616 511995 508718 504793 500035 494377 488171 482023 476395 471411 466873 462298
60828D62298n132n747n735m964m029l528l470l596l860m236m443m317m193m412
$$ 462298 457166 451419 445684 440720 436691 433163 429693 426097 422237 418001 413558 409241 405048 400636
60814D00636m682m488l941l597l523l239k583k041j992k253k491k613k525k037
$$ 400636 395954 391466 387525 383928 380405 377166 374583 372542 370550 368297 365806 363193 360668 358631
60800C58631j234n70k85j82p3m2l4K72Q85J336J376J407J766K152K137J888J799
$$ 358631 357397 356827 356542 356360 356287 356245 356211 356483 357368 358704 360080 361487 363253 365405 367542 369430 371229
60783C71229J858J900K144K767L203K681J363K89L3R3j80p27j185j635k389l227
$$ 371229 373087 374987 377131 379898 383101 385782 387145 387434 387467 387560 387380 386653 385468 383833 381444 378217
60767C78217l365k356p25M54N61j27q86j264j191p55j92j0o40j806k621k523j856
$$ 378217 374852 372496 371771 372225 372786 372659 371773 370509 369318 368563 368371 368361 367721 365915 363294 360771 358915
60750C58915j285r90p16l41K6L64P38J084J251J261J174Q27nj186k243k855l111
$$ 358915 357630 356640 355924 355583 355609 355973 356711 357795 359046 360307 361481 362308 362303 361117 358874 356019 352908
60733C52908l259l374l344l049k493j836j314j049r51q01m44R3N94Q63J004J377
$$ 352908 349649 346275 342931 339882 337389 335553 334239 333190 332239 331438 330994 331087 331681 332544 333548 334925
60717C34925K115K834L076K893K641K445K238K177K359K397J970J696K465L791
$$ 334925 337040 339874 342950 345843 348484 350929 353167 355344 357703 360100 362070 363766 366231 370022
60703C70022L972K337K71o71o76q28j259j301r53q94j237j418j254j218j590k099
$$ 370022 373994 376331 376602 375931 375255 374427 373168 371867 370914 370020 368783 367365 366111 364893 363303 361204
60687C61204k482k724k773k600k406k238j637l32R82J431J204J172J474J518J277
$$ 361204 358722 355998 353225 350625 348219 345981 344344 344012 344994 346425 347629 348801 350275 351793 353070
60672C53070J383J861J929J320P55O88N54k39j437k495l247l545l073j968j004
$$ 353070 354453 356314 358243 359563 360318 361006 361560 361321 359884 357389 354142 350597 347524 345556 344552
60657C44552o51n92n68q80j510j549k44J866L552M223M137L759L467L432L345
$$ 344552 343901 343309 342741 341861 340351 338802 338558 340424 343976 348199 352336 356095 359562 362994 366339
60642C66339K610J205j66j117k083l294m083l932l460l417l339k345p99J7k52
$$ 366339 368949 370154 369988 368871 366788 363494 359411 355479 352019 348602 345263 342918 342119 342136 341884
60627C41884o86o30m48n08m83o6L89N36P04J350K191K472J928J055M38J59m4k35
$$ 341884 341198 340568 340120 339612 339129 339063 339452 339988 340692 342042 344233 346705 348633 349688 350126 350285 350241 350006
60609C50006j54L12P59O53N6l77k22K97Q32J333J654J320K46p36p38qN03N80R66
$$ 350006 349852 350164 350923 351576 351632 351255 351033 351330 352162 353495 355149 356469 356715 355979 355241 355233 355736 356316 357282
60590C57282K046L109L318K806K334K126J642M75q91j452p12P69J933K251K047
$$ 357282 359328 362437 365755 368561 370895 373021 374663 375138 374247 372795 372083 372852 374785 377036 379083
60575C79083J893K017K339K769L294L991N146P017R319J1275J2493J3369J4258
$$ 379083 380976 382993 385332 388101 391395 395386 400532 407549 416868 428143 440636 454005 468263
60562D68263J4633J3651J1302Q374N385K220j147m194o336p457p739p292o231
$$ 468263 482896 496547 507849 516223 521608 523828 522681 518487 512151 504694 496955 489663 483432
60549D83432m859l558k421j164O00K887N204P025Q439J0007J1967J3981J5890
$$ 483432 478573 475015 472594 471430 472030 474917 480121 487146 495585 505592 517559 531540 547430
60536E47430J8161K1147K4298K6631K7605K7029K4544K0076J4514R036L757j962
$$ 547430 565591 586738 611036 637667 665272 692301 716845 736921 751435 760471 764228 762266
60524G62266p837j2307j4353j4750j4890j5080j4740j3773j2749j1894j0718q839
$$ 762266 754429 742122 727769 713019 698129 683049 668309 654536 641787 629893 619175 610336
60512F10336o587m585l067j853o93N42J961L718N975Q810J2144J5811J9741K3948
$$ 610336 603749 599164 596097 594244 593551 594093 596054 599772 605747 614557 626701 642512 662253 686201
60498F86201K8455L3206L8164M3190M7849N1454N3495N3914N2927N0678M7184
$$ 686201 714656 747862 786026 829216 877065 928519 982014 1035928 1088855 1139533 1186717
60487A186717M2483L6595K9461K1149J2009K366p909j9134l0959m2095n1152n7592
$$ 1186717 1229200 1265795 1295256 1316405 1328414 1330780 1322871 1303737 1272778 1230683 1179531 1121939
60475A121939o1620o3387o2750n9812n5222m9805m4232l9066l4695l0923k7047
$$ 1121939 1060319 996932 934182 874370 819148 769343 725111 686045 651350 620427 593380
60464E93380k2749j8631j5485j3362j1731j0287r088q144p402o984o859o574n869
$$ 593380 570631 552000 536515 523153 511422 501135 492047 483903 476501 469517 462658 456084 450215
60451D50215n299n497n977n685m582l684l432l201k710k625l158l305k337j090
$$ 450215 444916 439419 433442 427757 423175 419491 416059 412858 410148 407523 404365 401060 398723 397633
60437C97633o94q92p18k36k76q53j138r17q60j291j709j764j776j998k057j526
$$ 397633 396939 396047 395329 395093 394817 393964 392826 391909 391049 389758 388049 386285 384509 382511 380454 378928
60421C78928n88J83L68J1m08l64J34N31N72P23J330J883J763J275J101J178J045
$$ 378928 378340 378523 378891 378902 378494 378130 378264 378795 379367 380090 381420 383303 385066 386341 387442 388620 389665
60404C89665Q93J244J734J513Q54J052K437L714L767L100K795K980L096L061L282
$$ 389665 390558 391802 393536 395049 395903 396955 399392 403106 406873 409973 412768 415748 418844 421905 425187
60389D25187L821M162L801K734J531R63J286J891K073K044K507L319L416K296
$$ 425187 429008 433170 436971 439705 441236 442199 443485 445376 447449 449493 452000 455319 458735 461031
60375D61031Q02K9J55P43J513K352L053L471L603L278K365J315Q72R61P22k2k69
$$ 461031 461833 461862 462017 462760 464273 466625 469678 473149 476752 480030 482395 483710 484582 485543 486265 486243 485974
60358D85974O18J847K414K612L371M704N807O324O516O473O093N701N713N746
$$ 485974 486592 488439 490853 493465 496836 501540 507347 513671 520187 526660 532753 538454 544167 549913
60344E49913M917L152J391L49l02j208k383l279l522l187k639k244k177k354k595
$$ 549913 554830 557982 559373 559722 559420 558212 555829 552550 549028 545841 543202 540958 538781 536427 533832
60329E33832k786k907l015l226l609m043m369m667n034n168m610l480k391j498
$$ 533832 531046 528139 525124 521898 518289 514246 509877 505210 500176 495008 490398 486918 484527 483029
60315D83029l03J304K633L365M341O306Q477R401R001Q763R845J1954J4101J5593
$$ 483029 482726 484030 486663 490028 494369 500675 509152 518553 527554 536317 546162 558116 572217 587810
60301E87810J6033J5119J2977J0169P091L639l53m759r362j3892j7656j9573j9066
$$ 587810 603843 618962 631939 642108 649199 652838 652485 647726 638364 624472 606816 587243 568177
60288E68177j6707j3742j1078q889o894m878l024j866j673j861j447k31Q84J018
$$ 568177 551470 537728 526650 517761 510867 505989 502965 501099 499426 497565 496118 495887 496771 497789
60274D97789L38m50j201k280l531m155l833l334l481l987l904l033k200k123k575
$$ 497789 498127 497677 496476 494196 490665 486510 482677 479343 475862 471875 467971 464938 462738 460615 458040
60259D58040k879k724k246j765j701k271k951k682j180M18Q08J50k98Q4P47J166
$$ 458040 455161 452437 450191 448426 446725 444454 441503 438821 437641 438059 438867 439017 438719 438803 439550 440716
60243D40716J532K055K387K201J741J315Q10J15l96l54J4J92R8K7O7J9j94l10
$$ 440716 442248 444303 446690 448891 450632 451947 452757 452872 452476 452122 452136 452328 452426 452453 452520 452539 452345 452035
60225D52035NQ36J869K600K871L099L706M478M874M883M968N208N229N090N433
$$ 452035 452040 452876 454745 457345 460216 463315 467021 471499 476373 481256 486224 491432 496661 501751 507184
60210E07184O456P446P750P607P563P684P830Q039Q212P961P312O997P433P964
$$ 507184 513640 521086 528836 536443 544006 551690 559520 567559 575771 583732 591044 598041 605474 613438
60196F13438P701O628N328M182L426L351L740L631K443Q34l19j154k198l215l803
$$ 613438 621139 627767 633095 637277 640703 644054 647794 651425 653868 654702 654383 653229 651031 647816 644013
60181F44013m543o111p656p609o123n121n620o490o379n545m953m651m061l248
$$ 644013 639470 633359 625703 618094 611971 606850 601230 594740 588361 582816 577863 573212 569151 565903
60167E65903k785k709k498k013j817k379l357l837l276k054j053o30l27K31O68
$$ 565903 563118 560409 557911 555898 554081 551702 548345 544508 541232 539178 538125 537495 537168 537399 538067
60152E38067N38K54N20J142J329J056J083J473J258Jj253j270j14J279K402L279
$$ 538067 538605 538859 539379 540521 541850 542906 543989 545462 546720 546721 545468 544198 544084 545363 547765 551044
60136E51044L854M037M180M752N661O458P005P417P451O623N017L466K742K843
$$ 551044 554898 558935 563115 567867 573528 579986 586991 594408 601859 608482 613499 616965 619707 622550
60122F22550L204L340L206L077L212L572L875L930L895M093M588N063N169M879
$$ 622550 625754 629094 632300 635377 638589 642161 646036 649966 653861 657954 662542 667605 672774 677653
60108F77653M494M174L679K749J638R13N77q8j494l031l922m329m901n528n467
$$ 677653 682147 686321 690000 692749 694387 695300 695877 695789 694295 691264 687342 683013 678112 672584 667117
60093F67117m754m369m695m764l746k382k099l023l880l690k825k248k318k684
$$ 667117 662363 657994 653299 648535 644789 642407 640308 637285 633405 629715 626890 624642 622324 619640
60079F19640k914k869k598k109j367m47K67K37p69k353l838m915n801o760p697
$$ 619640 616726 613857 611259 609150 607783 607336 607603 607840 607071 604718 600880 595965 590164 583404 575707
60064E75707q285q316p791o886o010n773o431p332p263n737l665k416k346k630
$$ 575707 567422 559106 551315 544429 538419 532646 526215 518883 511620 505883 502218 499802 497456 494826
60050D94826k373j427j39J098J936K249K434L015L848M307M414N042O517P791
$$ 494826 492453 491026 490887 491985 493921 496170 498604 501619 505467 509774 514188 519230 525747 533538
60036E33538P710O516N366M885M945N369N873N646M127K037O47K4r81k913n009
$$ 533538 541248 547764 553130 558015 562960 568329 574202 579848 583975 586012 586659 586683 585702 582789 577780
60021E77780o561p898r457j0732j0877r869q532p689p603p878p747o830n738n371
$$ 577780 571219 563321 553864 543132 532255 522386 513854 506165 498562 490684 482937 476107 470369 464998
60007D64998n597n332m127k850k385k437k224j704j349j171p53k1O57J021J144
$$ 464998 459401 454069 449942 447092 444707 442270 440046 438342 436993 435822 435069 435048 435705 436726 437870
59992D37870J216J432J892K331K293J868J880K854M222N067N313N506N697N319
$$ 437870 439086 440518 442410 444741 447034 448902 450782 453636 457858 462925 468238 473744 479441 484760
59978D84760M187K849J788Q21m45j916l069l506l279k785k476k511k694k717k433
$$ 484760 488947 491796 493584 494405 493960 492044 488975 485469 482190 479405 476929 474418 471724 469007 466574
59963D66574j820q26M62J656K321K453K441K488K328J681Q25L80N39O97J82q08
$$ 466574 464754 463928 464390 466046 468367 470820 473261 475749 478077 479758 480583 480963 481502 482199 482381 481573
59947D81573j329q10K06P02L30l90q06p23l14J72M73M64L13L43O19Q90R93J183
$$ 481573 480244 479434 479640 480342 480672 480282 479476 478753 478439 478611 479084 479548 479861 480204 480823 481713 482706 483889
59929D83889J936L435N243O556O925O752O779O994O507M744K270N5j646l058l959
$$ 483889 485825 489260 494503 501059 507984 514736 521515 528509 535016 539760 542030 542085 540439 537381 533422
59914E33422l864k932j930j236n82K53J159K099L035L448K759J440P72J206J723
$$ 533422 529558 526626 524696 523460 522878 523131 524290 526389 529424 532872 535631 537071 537843 539049 540772
59899E40772J233j58j657k831l526l409k376j016p8M16J020K042L305M477N321
$$ 540772 542005 541847 540190 537359 533833 530424 528048 527032 526954 527370 528390 530432 533737 538214 543535
59884E43535N718N738N586N398N254N419O099O931P196O770O323O317O353N821
$$ 543535 549253 554991 560577 565975 571229 576648 582747 589678 596874 603644 609967 616284 622637 628458
59870F28458M721L410K039O43n07j171j498j776k018k059j811j247m65J63L08
$$ 628458 633179 636589 638628 639271 638764 637593 636095 634319 632301 630242 628431 627184 626719 626882 627190
59855F27190K48O64J656K604L196L962N391P114Q450R219R549R244P901N403K010
$$ 627190 627438 628102 629758 632362 635558 639520 644911 652025 660475 669694 679243 688487 696388 701791 703801
59840G03801j671m646n966n529m086k317n38O12J64j942m475o317p479q104p524
$$ 703801 702130 697484 691518 685989 681903 679586 679048 679660 679824 677882 673407 667090 659611 651507 643983
59825F43983n322k628j175j384k361l353m199m636m309l472k758k220j383k22
$$ 643983 638661 636033 634858 633474 631113 627760 623561 618925 614616 611144 608386 606166 604783 604561
59811F04561P06J184J607K171K434J899P12m16q19m74j16m91j428k062k096k121
$$ 604561 605267 606451 608058 610229 612663 614562 615274 614858 614039 613565 613449 612958 611530 609468 607372 605251
59795F05251k407k390j956k229l954n912o307n158m052l803l841l769l994m525
$$ 605251 602844 600454 598498 596269 592315 586403 580096 574938 570886 567083 563242 559473 555479 550954
59781E50954m543l650k510j800j392j016r04j228j524j243m53L00N54K40j59J59
$$ 550954 546411 542761 540251 538451 537059 536043 535139 533911 532387 531144 530691 530991 531545 531785 531626 531785
59765E31785J420K754L248L337M174N693O463N784M752M731N689O730P490Q162
$$ 531785 533205 535959 539207 542544 546718 552411 558874 564658 569410 574141 579830 586560 594050 602212
59751F02212Q786R253R718J0317J0798J0946J1031J1230J0976R537P149M884L426
$$ 602212 610998 620251 629969 640286 651084 662030 673061 684291 695267 704804 711953 716837 720263
59738G20263K455J419L35m19q81j545k643l671l931l464l025l091l278l017k404
$$ 720263 722718 724137 724472 724053 723172 721627 718984 715313 711382 707918 704893 701802 698524 695507 693103
59723F93103j966j856j832j815j954k159k105j691j118n30k4J41j29l19J91J184
$$ 693103 691137 689281 687449 685634 683680 681521 679416 677725 676607 676077 676053 676194 676065 675746 675937 677121
59707F77121J831J950K308L429M704N183M791M294M333M893N622O228O561O564
$$ 677121 678952 680902 683210 686639 691343 696526 701317 705611 709944 714837 720459 726687 733248 739812
59693G39812O303N986N797N609M945L484J582qj011j802k589k984k731k321k356
$$ 739812 746115 752101 757898 763507 768452 771936 773518 773510 772499 770697 768108 765124 762393 760072 757716
59678G57716k771l178l610m274n007n598o371p629q846r185q598p638o507n086
$$ 757716 754945 751767 748157 743883 738876 733278 726907 719278 710432 701247 692649 685011 678504 673418
59664F73418l731l043k886k572j985j559j221l90Q36J649J901K442L684M904N474
$$ 673418 669687 666644 663758 661186 659201 657642 656421 656031 656867 658516 660417 662859 666543 671447 676921
59649F76921N825O473O918O282M587K609Q80o59k255m052n978p626q561q943r394
$$ 676921 682746 689219 696137 702419 707006 709615 710495 709836 707581 703529 697551 689925 681364 672421 663027
59634F63027j0047j0215r366p900o609n684m771l729k914k755l244l867m092m006
$$ 663027 652980 642765 633399 625499 618890 613206 608435 604706 601792 599037 595793 591926 587834 583828
59620E83828m251n050n706n554n026m974n296n165m541m293m681m801l931k478
$$ 583828 579577 574527 568821 563267 558241 553267 547971 542806 538265 533972 529291 524490 520559 518081
59606E18081j163j54N28O19K19Q5O57J406J663J525J410J274R03M61K66L75Q48
$$ 518081 516918 516764 517292 517911 518130 518215 518872 520278 521941 523466 524876 526150 527053 527514 527780 528155 529003
59589E29003J915L405M420M096K513N64p65r44k96l9j200l274m602m456l832l839
$$ 529003 530918 534323 538743 542839 545352 545916 545151 544207 543911 543872 542672 539398 534796 530340 526508 522669
59573E22669m188m048l472l112l051k894k625k545k523k088j178k66K06J40k85
$$ 522669 518481 514433 510961 507849 504798 501904 499279 496734 494211 492123 490945 490679 490885 491025 490740
59558D90740o41n14mL29K54J67L87O95Q93J212J728K037J933J890K269K691K793
$$ 490740 490099 489585 489581 489910 490164 490331 490718 491413 492306 493518 495246 497283 499216 501106 503375 506066 508859
59541E08859L045M122N991Q260J1040J4582J8420K1441K2537K0750J5416P207
$$ 508859 511904 516026 522017 530277 541317 555899 574319 595760 618297 639047 654463 661670
59529F61670j385p523j0152j0175q887o931m571k120P4J647K257K004J595J623
$$ 661670 660285 652762 642610 632435 623548 616617 612046 609926 610000 611647 613904 615908 617503 619126
59515F19126J825J499M49r55k376l656m574n015n280n785o503p081p337p305o903
$$ 619126 620951 622450 622899 621944 619568 615912 611338 606323 601043 595258 588755 581674 574337 567032 560129
59500E60129o037m908l946l439l351l380l128k509j950j831j805j230k45L99O27
$$ 560129 554092 549184 545238 541799 538448 535068 531940 529431 527481 525650 523845 522615 522370 522769 523396
59485E23396J137K028K452K154K182L297M666N137M889M805M928M696M137L715
$$ 523396 524533 526561 529013 531167 533349 536646 541312 546449 551338 556143 561071 565767 569904 573619
59471E73619L384K785K065J583J179O03K05L46N57K44l43p81j424k499k876j272
$$ 573619 577003 579788 581853 583436 584615 585218 585423 585769 586326 586570 586227 585446 584022 581523 578647 577375
59455E77375J612L690M176M258N064O325P356Q041Q379Q073P051N704M299K771
$$ 577375 578987 582677 586853 591111 596175 602500 609856 617897 626276 634349 641400 647104 651403 654174
59441F54174J120o52k845n494p643q219p593p169p420p413o492n186m101l058
$$ 654174 655294 654642 651797 646303 638660 630441 622848 615679 608259 600846 594354 589168 585067 582009
59427E82009j829q30m13j25P52K394M379O080O991P360Q404J1196J5275J9176
$$ 582009 580180 579350 578937 578812 579564 581958 586337 592417 599408 606768 615172 626368 641643 660819
59413F60819K2253K5020K7753K9953L1256L1407K9000K1945J0361k152j1281j5391
$$ 660819 683072 708092 735845 765798 797054 828461 857461 879406 889767 887615 876334 860943
59401H60943j5345j2159o389P33P335J2254J5161J5151J0627J472r475j8101k2221
$$ 860943 845598 833439 827050 827783 835118 847372 862533 877684 888311 889783 880308 862207 839986
59388H39986k2620k1179j8797j5508j1761q560o312m471k640j299q53o76N5R70
$$ 839986 817366 796187 777390 761882 750121 741561 735249 730778 728138 726839 725986 725310 725365 726335
59374G26335R82k3r36r67n97o73j275j831j925j631j394j628k225k465j842q08
$$ 726335 727317 727294 726358 725391 724794 724121 722846 721015 719090 717459 716065 714437 712212 709747 707905 707097
59358G07097k18j23K30J256K560L692M730N907P224Q647J0191J1662J2720J3297
$$ 707097 706879 706756 706986 708242 710802 714494 719224 725131 732355 741002 751193 762855 775575 788872
59344G88872J3619J3834J4071J4720J6022J7456J8116J7730J6710J5241J3045
$$ 788872 802491 816325 830396 845116 861138 878594 896710 914440 931150 946391 959436
59333I59436J0127O992L984R45k251n356q101j0388j2137j3327j4192j4925j5329
$$ 959436 969563 976555 980539 981484 979233 973877 965776 955388 943251 929924 915732 900807 885478
59320H85478j5254j5088j5209j5226j4554j3419j2506j1839j1086j0576j0789
$$ 885478 870224 855136 839927 824701 810147 796728 784222 772383 761297 750721 739932
59309G39932j1025j0001p921o497o570p019o457m723k166J234N247R011J1839
$$ 739932 728907 718906 710985 704488 697918 690899 684442 679719 677553 678787 684034 693045 704884
59296G04884J3513J3262R828L330m000r952j4196j7232j8697j8007j5837j3513
$$ 704884 718397 731659 741487 744817 740817 730865 716669 699437 680740 662733 646896 633383
59284F33383j1399r087o785n281m622l894k409l35J789L511M547N040N647O949
$$ 633383 621984 612897 606112 600831 596209 592315 589906 589571 591360 594871 599418 604458 610105 617054
59270F17054Q862J0926J2873J4509J5392J5196J4126J2633J1011R501Q310P116
$$ 617054 625916 636842 649715 664224 679616 694812 708938 721571 732582 742083 750393 757509
59258G57509N125K123j021l353m825n850o440o408n887n064l886k562j791j798
$$ 757509 762634 764757 763736 760383 755558 749708 743268 736860 730973 725909 722023 719461 717670 715872
59244G15872j733p33Q79K189K989L661M266M557M607M546M048K973K085K253L058
$$ 715872 714139 713406 714285 716474 719463 723124 727390 731947 736554 741100 745148 748121 750206 752459 755517
59229G55517L192K186Q55Pm82j148k226l660n306p028q825j0750j2401j2868j1764
$$ 755517 758709 760895 761750 761757 761275 760127 757901 754241 748935 741907 733082 722332 709931 697063 685299
59214F85299j0028q976q730q291p047n419m056l183k844l084l536l442k424r59
$$ 685299 675271 666295 657565 649274 642227 636808 632752 629569 626725 623641 620105 616663 614239 613280
59200F13280R2K42l66j120j331o96M93J765K920L953M733N160N498O189P301Q382
$$ 613280 613372 613614 613248 612128 610797 610101 610594 612359 615279 619232 623965 629125 634623 640812 648113 656495
59184F56495Q881Q571P738P031O861O862O270M967L707L033K544J604L06q00j512
$$ 656495 665376 673947 681685 688716 695577 702439 708709 713676 717383 720416 722960 724564 724870 724070 722558
59169G22558k043k541l040l562l895l575k617j838j934k590l038l059k883k525
$$ 722558 720515 717974 714934 711372 707477 703902 701285 699447 697513 694923 691885 688826 685943 683418
59155F83418k013j964l106n209p210q367q782q834q690q363p859p215o634o344
$$ 683418 681405 679441 676335 671126 663916 655549 646767 637933 629243 620880 613021 605806 599172 592828
59141E92828o138n491m512m150m898n886o056n609n383n269m444k954j824j503
$$ 592828 586690 581199 576687 572537 567639 561753 555697 550088 544705 539436 534992 532038 530214 528711
59127E28711j357q12l7P73J780K861L501L731M352N734P157P864Q093Q516R173
$$ 528711 527354 526542 526505 527278 529058 531919 535420 539151 543503 549237 556394 564258 572351 580867 590040
59112E90040R644R856J0082J0356J0442J0208R649Q672P327O076N400N155M753
$$ 590040 599684 609540 619622 629978 640420 650628 660277 668949 676276 682352 687752 692907 697660
59099F97660L980L272K984K745J853K42j285j969j954j981k316k405j686m60L32
$$ 697660 701640 704912 707896 710641 712494 712736 711451 709482 707528 705547 703231 700826 699140 698680 699012
59084F99012L0j198k585l400l495l431m001n490p432r007r539q841p483o628o984
$$ 699012 699042 697844 695259 691859 688364 684933 680932 675442 668010 659003 649464 640623 633140 626512 619528
59069F19528p798p536n752l722k820k919k960k580k372k785l498l891l706l144
$$ 619528 611730 604194 598442 594720 591900 588981 586021 583441 581069 578284 574786 570895 567189 564045
59055E64045k632k532k792k991k822k393j958j603j305r93n07J48N16J72m09k07
$$ 564045 561413 558881 556089 553098 550276 547883 545925 544322 543017 542024 541517 541665 542181 542353 541944 541737
59039E41737Q84J756J595R46O98Q11P87P05R69J489J979K599L542M405M796N190
$$ 541737 542621 544377 545972 546918 547616 548427 549214 549919 550888 552377 554356 556955 560497 564902 569698 574888
59023E74888O300P940R379J0539J1953J3654J5036J5665J5493J4360J2084R023
$$ 574888 581188 589128 598507 609046 620999 634653 649689 665354 680847 695207 707291 716314
59011G16314N787K532p96l706n434n926n768n258m336l262k505j871o58J271L220
$$ 716314 722101 724633 723837 720131 714697 708771 703003 697745 693409 690147 687642 685771 685113 686384 689604
58996F89604M551N123M913L959K758J920J327L98p90j486j523j691k508l384l479
$$ 689604 694155 699278 704191 708150 710908 712828 714155 714553 713763 712277 710754 709063 706555 703171 699692
58981F99692k835k106j616j135l72P14J991L332M671N984P202Q258R234J0234
$$ 699692 696857 694751 693135 692000 691628 692342 694333 697665 702336 708320 715522 723780 733014 743248
58967G43248J1123J1675J2000J2326J2247J1038R015P652P688P875O496L502J99
$$ 743248 754371 766046 778046 790372 802619 813657 822672 830324 838012 845887 852383 855885 856084
58954H56084k565m773o416p492q682j0773j3433j5477j6331j6289j5603j4356
$$ 856084 853519 848746 842330 834838 826156 815383 801950 786473 770142 753853 738250 723894
58942G23894j3092j2434j2075j1205r811q559p431n772l695k155j457q85o5N07
$$ 723894 710802 698368 686293 675088 665277 656718 649287 643515 639820 637665 636208 635323 635258 635765
58928F35765O69J061J882K294J692O77R3q1l03o31r24j327j924k374k276j626
$$ 635765 636434 637495 639377 641671 643363 644040 644133 644052 643749 643118 642194 640867 638943 636569 634293 632667
58912F32667p23M7K38k22o45j63J213K748M109N592P332R103J0915J2877J4417
$$ 632667 631944 631991 632229 632007 631362 631199 632412 635160 639269 644861 652193 661296 672211 685088 699505
58897F99505J4639J3628J2455J1748J1168J0510J0219J0562J1240J2169J3601
$$ 699505 714144 727772 740227 751975 763143 773653 783872 794434 805674 817843 831444
58886H31444J5215J6127J6241J6518J7308J7546J6223J3793J1393R472P847O368
$$ 831444 846659 862786 879027 895545 912853 930399 946622 960415 971808 981280 989127 995495
58874I95495M786K575m47l764o750r087j0391j0305r345q706q771q693p965p343
$$ 995495 1000281 1002856 1002409 998645 991895 982808 972417 962112 952767 944061 935290 926597 918632 911289
58860I11289p527p932p765p478q078r490j0711j1259j1550j1956j2272j2101j1251
$$ 911289 903762 895830 888065 880587 872509 863019 852308 841049 829499 817543 805271 793170 781919
58847G81919r835q317p293o947o942o959o982o950o681o384o648p562q413q572
$$ 781919 772084 763767 756474 749527 742585 735626 728644 721694 715013 708629 701981 694419 686006 677434
58833F77434q233p931p804p675p391o842o009n122m350l382j902l86L78N82J241
$$ 677434 669201 661270 653466 645791 638400 631558 625549 620427 616077 612695 610793 610407 610785 611367 612608
58818F12608K663M056M841N306N668N500M593L474K627K027J703J897K278K027
$$ 612608 615271 619327 624168 629474 635142 640642 645235 648709 651336 653363 655066 656963 659241 661268
58804F61268J017m4r06k036l264l605k963k641l412m378m612m541m731m677l983
$$ 661268 662285 662241 661335 659299 656035 652430 649467 646826 643414 639036 634424 629883 625152 620475 616492
58789F16492l519m055m675m062k462j063j03J005K267L221M006N041O021O351
$$ 616492 612973 608918 604243 600181 597719 596656 596553 597558 599825 603046 607052 612093 618114 624465
58775F24465O258O354O479N961M678K927P81j521l164l871m766o852r180r964
$$ 624465 630723 637077 643556 649517 654195 657122 657903 656382 653218 649347 644581 637729 628549 618585
58761F18585r141q272q088p701o408m822l742l015k063p42P04J928K510K244J538
$$ 618585 609444 601172 593084 585383 578975 574153 570411 567396 565333 564591 565295 567223 569733 571977 573515
58746E73515J052R48R25Q98J073J472J914K411L114L897M442M563M182L308K411
$$ 573515 574567 575515 576440 577338 578411 579883 581797 584208 587322 591219 595661 600224 604406 607714 610125
58731F10125K341L361M683N436N622N592N190M316L689M057M859M761L506K347
$$ 610125 612466 615827 620510 625946 631568 637160 642350 646666 650355 654412 659271 664032 667538 669885
58717F69885K537M075O009P486Q296Q715R009R057Q658Q004P352O299M157J188
$$ 669885 672422 676497 682506 689992 698288 707003 716012 725069 733727 741731 749083 755382 759539 760727
58703G60727j447l316n210p607r817j1373j3063j5511j7763j8552j8193j7826
$$ 760727 759280 755964 750754 743147 733330 721957 708894 693383 675620 657068 638875 621049
58691F21049j7390j5842j3066j0261q435p628p508p683p503o536n277m659m804
$$ 621049 603659 587817 574751 564490 556055 548427 540919 533236 525733 519197 513920 509261 504457
58678E04457n031m881m435l705k512r89L68J193J454J389J495K235L494M729N916
$$ 504457 499426 494545 490110 486405 483893 482904 483272 484465 485919 487308 488803 491038 494532 499261 505177
58663E05177P607R738J1257J1432J0633R222O782L326J20j810l151n043p131q113
$$ 505177 512784 522522 533779 545211 555844 565066 571848 575174 575294 573484 570333 565290 558159 550046
58649E50046p718o875o300o025n957n902n412m479l817l716l381k342j587k119
$$ 550046 542328 535453 529153 523128 517171 511269 505857 501378 497561 493845 490464 488122 486535 484416
58635D84416l184l272k164o88Q08K331L205K794J822J488J666J352N13m8k23m96
$$ 484416 481232 477960 475796 475108 475916 478247 481452 484246 486068 487556 489222 490574 491087 491039 490816 490320
58619D90320n87K22J605K525K865L370M154M699N133O037P097P362O773O066N368
$$ 490320 489733 489955 491560 494085 496950 500320 504474 509173 514306 520343 527440 534802 541575 547641 553009
58604E53009M242L008K445K330J702N95kN8j87j203k409l322l948m009l117j768
$$ 553009 557251 560259 562704 565034 566736 567331 567329 567387 567200 565997 563588 560266 556318 552309 549192 547424
58588E47424q39j46J248L266M808N576O465P966R462J0364J0712J0505R569Q289
$$ 547424 546585 546439 547687 550953 555761 561337 567802 575768 585230 595594 606306 616811 626380 634669
58574F34669P356O727N870N007M992N991P340Q641R976J1303J2781J5243J9087
$$ 634669 642025 648752 654622 659629 664621 670612 677952 686593 696569 707872 720653 735896 754983
58561G54983K3049K5517K6721K8061K9622L0029K8622K6035K2608J7920J2100
$$ 754983 778032 803549 830270 858331 887953 917982 946604 972639 995247 1013167 1025267
58550A025267O120P26l705o466p216p088p486q039p454o084n711o924q776j0957
$$ 1025267 1031387 1032113 1028408 1021942 1014726 1007638 1000152 992113 984659 978575 972864 965940 957164 946207
58536I46207j4119j7848k0573k1898k2993k4183k4173k2290j9613j7148j4671
$$ 946207 932088 914240 893667 871769 848776 824593 800420 778130 758517 741369 726698
58525G26698j2018r903q656p661o631o071o020n772n192m824m488l419k054j828
$$ 726698 714680 704777 696121 688460 681829 675758 669738 663966 658774 653950 649462 646043 643989 642161
58511F42161k745l000j595L28J343J358P27m78j740k079j457q34n62j11L93J21
$$ 642161 639416 636416 634821 635149 636492 637850 638577 638099 636359 634280 632823 631989 631427 631316 631709 631830
58495F31830p78j080m87P2L19J025K212K873K840L097L886M402M723N985Q255
$$ 631830 631052 629972 629485 629557 629876 630901 633113 635986 638826 641923 645809 650211 654934 660919 669174
58480F69174J0246J1569J3166J5192J6653J7528J8897K0416K0182J7688J4479
$$ 669174 679420 690989 704155 719347 736000 753528 772425 792841 813023 830711 845190
58469H45190J1231O847J259l604o784r512j2226j3150j1352q706p009n450k714
$$ 845190 856421 863268 864527 860923 854139 844627 832401 819251 807899 799193 792184 786734 784020
58456G84020M89K902M912P444J0242J2714J4970J6681J6537J4109J0640O966K461
$$ 784020 784509 787411 792323 799767 810009 822723 837693 854374 870911 885020 895660 902626 905087
58443I05087k977p940j1554j4451j6632j6651j4264j1614j0294r363p678n897
$$ 905087 902110 894170 882616 868165 851533 834882 820618 809004 798710 789347 781669 775772
58431G75772m680l196j021O56J305K339M550O528P290Q086R824J1051J0395Q785
$$ 775772 771092 767896 766875 767531 768836 771175 775725 782253 789543 797629 807453 818504 828899 837684
58417H37684P348N386K351n04k424m708p867r817r225q139q669r473q379o317
$$ 837684 845032 850418 852769 852265 849841 845133 837266 827449 818224 810085 801416 791943 783564 777247
58403G77247n580o022n950n300m925m202k158J95J219J317J880K794L222L549
$$ 777247 771667 765645 759695 754395 749470 745268 743110 743305 744524 745841 747721 750515 753737 757286
58389G57286M392M930M327L430L223L036K196J685K248K755K428K578M038N122
$$ 757286 761678 766608 770935 774365 777588 780624 782820 784505 786753 789508 791936 794514 798552 803674
58375H03674M514L849M825O111N920N402O360P767P754P178P861R129R371R414
$$ 803674 808188 812037 816862 822973 828893 834295 840655 848422 856176 863354 871215 880344 889715 899129
58361H99129J0963J3205J4229J4395J5137J5822J5053J3612J2916J1962R042N211
$$ 899129 910092 923297 937526 951921 967058 982880 997933 1011545 1024461 1036423 1045465 1050676
58349A050676K718J384k61j562r35Q50J803K125L287M909N663O090P473R115R733
$$ 1050676 1053394 1054778 1054517 1052955 1052020 1052870 1054673 1056798 1060085 1064994 1070657 1076747 1084220 1093335 1103068
58334A103068J0148J1659J3333J3879J4478J6509J8382J8026J6659J6478J6483
$$ 1103068 1113216 1124875 1138208 1152087 1166565 1183074 1201456 1219482 1236141 1252619 1269102
58323A269102J4449J1263R284Q047N657K963K250L074L366L326M328N470N205
$$ 1269102 1283551 1294814 1304098 1312145 1317802 1320765 1323015 1326089 1329455 1332781 1337109 1342579 1347784
58310A347784M866O546R052J0023J0302J2020J4183J4620J4483J6122J8280J8200
$$ 1347784 1352650 1359196 1368248 1378271 1388573 1400593 1414776 1429396 1443879 1460001 1478281 1496481
58298A496481J6801J6872J7821J7333J6402J7433J8987J8044J5947J6421J9031
$$ 1496481 1513282 1530154 1547975 1565308 1581710 1599143 1618130 1636174 1652121 1668542 1687573
58287A687573K0413K0692K2671K5810K7124K7184K9062L2137L3087L2363L3432
$$ 1687573 1707986 1728678 1751349 1777159 1804283 1831467 1860529 1892666 1925753 1958116 1991548
58276A991548L6175L7297L6789L7693L9845M0135L8713L8747M0351M0944M1165
$$ 1991548 2027723 2065020 2101809 2139502 2179347 2219482 2258195 2296942 2337293 2378237 2419402
58265B419402M4052M8813N1822N3290N6461O0867O3142O3899O6817P1377P3536
$$ 2419402 2463454 2512267 2564089 2617379 2673840 2734707 2797849 2861748 2928565 2999942 3073478
58254C073478P3094P3368P4275P3043P1024P2209P5744P7610P8746Q3377R0448
$$ 3073478 3146572 3219940 3294215 3367258 3438282 3510491 3586235 3663845 3742591 3825968 3916416
58243C916416R5267R8640J05411J14905J22201J27900J36845J48006J55892J61401
$$ 3916416 4011683 4110323 4215734 4330639 4452840 4580740 4717585 4865591 5021483 5182884
58233E182884J70605J83404J94255K03562K16954K33858K48644K62484K81711
$$ 5182884 5353489 5536893 5731148 5934710 6151664 6385522 6634166 6896650 7178361
58224G178361L05086L25825L45514L72041M04461M34890M64852N03735N51284
$$ 7178361 7483447 7809272 8154786 8526827 8931288 9366178 9831030 10334765 10886049
58215A0886049N98727O47326P07613P79935Q55186R35735J034955J155024J287242
$$ 10886049 11484776 12132102 12839715 13619650 14474836 15410571 16445526 17600550 18887792
58206A8887792J435828J617617J836708K085769K374964K731623L169834L694030
$$ 18887792 20323620 21941237 23777945 25863714 28238678 30970301 34140135 37834165
58198C7834165M337793N165176O231961P590241R340074J1628948J4587888J8311926
$$ 37834165 42171958 47337134 53569095 61159336 70499410 82128358 96716246 115028172
58190A15028172K2881345K8264362L4085732L9498592M3298678M4122734M0649244
$$ 115028172 137909517 166173879 200259611 239758203 283056881 327179615 367828859
58183C67828859L2051041J8762789K915966j2324859k4278806l1884687l5595529
$$ 367828859 399879900 418642689 421558655 409233796 384954990 353070303 317474774
58176C17474774l6453891l5362105l2957527k9752666k6183808k2582943j9185135
$$ 317474774 281020883 245658778 212701251 182948585 156764777 134181834 114996699
58169A14996699j6145521j3528027j1316455r467972p945398o702920n680954
$$ 114996699 98851178 85323151 74006696 64538724 56593326 49890406 44209452
58162D4209452m832823m134655l562078l081232k670063k325669k042717j804018
$$ 44209452 39376629 35241974 31679896 28598664 25928601 23602932 21560215 19756197
58154A9756197j598047j426005j284997j161945j049757r52866q71315p95182
$$ 19756197 18158150 16732145 15447148 14285203 13235446 12282580 11411265 10616083
58146A0616083p19782o51345n92719n37564m83263m35694l96757l60309l24866
$$ 10616083 9896301 9244956 8652237 8114673 7631410 7195716 6798959 6438650 6113784
58137F113784k97456k80294k65917k49923k36650k27667k16521k00066j84192
$$ 6113784 5816328 5536034 5270117 5020194 4783544 4555877 4339356 4139290 3955098
58128C955098j73070j62659j49888j38599j31379j24411j15382j08059j04427
$$ 3955098 3782028 3619369 3469481 3330882 3199503 3075092 2959710 2851651 2747224
58119B747224j00235r2884q6139q2667p9224p3401o8105o5341o2212n6909n2341
$$ 2747224 2646989 2554105 2467966 2385299 2306075 2232674 2164569 2099228 2037016 1980107 1927766
58108A927766n0195m7706m3618m1098m1399m0908l7843l5769l7086l8777l8108
$$ 1927766 1877571 1829865 1786247 1745149 1703750 1662842 1624999 1589230 1552144 1513367 1475259
58097A475259l6908l6981l6570l4546l2952l2491l0537k6375k3248k2611k1529
$$ 1475259 1438351 1401370 1364800 1330254 1297302 1264811 1234274 1207899 1184651 1162040 1140511
58086A140511j8396j5951j5885j5736j3995j3119j4599j5999j5763j6040j7908
$$ 1140511 1122115 1106164 1090279 1074543 1060548 1047429 1032830 1016831 1001068 985028 967120
58075I67120j8788j7533j7064j8942k0117j8359j6181j6040j6152j4495j2666
$$ 967120 948332 930799 913735 894793 874676 856317 840136 824096 807944 793449 780783
58064G80783j2297j1708r531p819q168q470o826n123n511o771p275q148j0382
$$ 780783 768486 756778 747247 739428 731260 722790 715964 710841 705330 698559 691284 683136 672754
58051F72754j2101j1762j0921j0945j0242p652n292n125n722n316m960n790o269
$$ 672754 660653 648891 637970 627025 616783 609131 603839 598714 592992 587676 582716 576926 570657
58038E70657n159m195m848n400m222l075l989n651n998n855o864q249q658q961
$$ 570657 565498 561303 556455 551055 546833 543758 539769 534118 528120 522265 515401 507152 498494 489533
58024D89533j0251j1183j0251q608p958p638o397n032m692m560l666k994l447
$$ 489533 479282 468099 457848 449240 441282 433644 427247 422215 417523 412963 409297 406303 402856
58011D02856l833l175k817l841m605l378j302k58J75J166K068J891J386J387J020
$$ 402856 399023 395848 393031 389190 384585 381207 379905 379647 379822 380988 383056 384947 386333 387720 388740
57996C88740j68n40Q15J770L56j856k252j203q78j726k716l559m241l848k166
$$ 388740 388572 388032 388847 390617 390973 389117 386865 385662 384784 383058 380342 376783 372542 368694 366528
57981C66528r06j243j839j298o26j140j953j906j842k505k341j43K126K057O24
$$ 366528 365622 364379 362540 361242 360616 359476 357523 355617 353775 351270 348929 348786 350912 352969 353593
57966C53593L17J168J546J488K128K973K635J402N38rq93j541j343j408k805m386
$$ 353593 353910 355078 356624 358112 360240 363213 365848 367250 367788 367779 366886 365345 364002 362594 359789 355403
57950C55403m709m607n355n848m435k170j277j516j040K12Q85J190K521M612N862
$$ 355403 350694 346087 340732 334884 330449 328279 327002 325486 324446 324658 325543 326733 329254 333866 339728
57935C39728O110O584P525Q112Q266Q374P845O073M069K975J903n52l584n394
$$ 339728 345838 352422 359947 368059 376325 384699 392544 398617 402686 405661 407564 407012 403428 398034
57921C98034o216p496q914q910p678o993p340p592p279o886o302n095l921l586
$$ 398034 391818 384322 375408 366498 358820 351827 344487 336895 329616 322730 316428 311333 307412 303826
57907C03826l227j554P13J842J787J742J666O57q15j492j606k210k754j863m3
$$ 303826 300599 299045 299758 301600 303387 305129 306795 307452 306637 305145 303539 301329 298575 296712 296669
57892B96669Q06L77RJ70K28M14J504K731K499J112M39J011J706K140K901L565
$$ 296669 297475 297852 297861 298031 298259 298673 300177 302908 305407 306519 306958 307969 309675 311815 314716 318281
57876C18281K978J569R80J378J442J022J342K503L220L257L668M329L706J545
$$ 318281 321259 322828 323808 325186 326628 327650 328992 331495 334715 337972 341640 345969 349675 351220
57862C51220m40j106j063r19m15L25O44Q19J731K924L050K295K103K318J223j192
$$ 351220 350780 349674 348611 347692 347277 347602 348246 349065 350796 353720 356770 359065 361168 363486 364709 363517
57846C63517k607j883p07p01j242j379j732k961m112m029l095k270j587p07J9
$$ 363517 360910 359027 358320 357619 356377 354998 353266 350305 346193 342164 339069 336799 335212 334505 334524
57831C34524J44m3o0J91P76J845K956L340L056K882K959K759K442K871M054M984
$$ 334524 334668 334625 334565 334756 335532 337377 340333 343673 346729 349611 352570 355329 357771 360642 364696 369680
57815C69680N211N208M895L389O64k045l934n472p130q530r344r776r914r640
$$ 369680 374891 380099 384994 388383 389047 387002 383068 377596 370466 361936 352592 342816 332902 323262
57801C23262r265r046q201n930l327k483l531m438l922k768j875j042k60k58r26
$$ 323262 313997 304951 296750 290820 287493 285010 281479 277041 273119 270351 268476 267434 267174 266916 265990
57786B65990r58O7Q96P40N53J250K159K331K042K018K329K967M242N801O398N574
$$ 265990 265032 265099 265995 266735 267288 268538 270697 273028 275070 277088 279417 282384 286626 292427 298825 304399
57770C04399M386L644K677P80j258k270k384k594l346m327n126n371m839l857
$$ 304399 308785 312429 315106 315886 314628 312358 309974 307380 304034 299707 294581 289210 284371 280514
57756B80514l029k367j385j28R26J959L560N327O065N764N735O464O820O080N190
$$ 280514 277485 275118 273733 273605 274531 276490 280050 285377 291442 297206 302941 309405 316225 322305 327495
57741C27495N122N354M948L988L059K223J329N18k09j114j945k055j576j496k138
$$ 327495 332617 337971 342919 346907 349966 352189 353518 354036 353827 352713 350768 348713 347137 345641 343503
57726C43503k784l032l292l558l212k452k411l231l547k584j240m37J11O26M12
$$ 343503 340719 337687 334395 330837 327625 325173 322762 319531 315984 313400 312160 311723 311834 312460 312872
57711C12872o61j340p83P4J25k64k83j43l74p02o89m76j2J240K935L588K771K120
$$ 312872 312211 310871 310088 310162 310287 310023 309740 309597 309223 308521 307832 307356 307344 308584 311519 315107 317878 319998
57693C19998K877L861L387J886Q84M56m50j820k539k193j462r43p68j021j469
$$ 319998 322875 326736 330123 332009 332893 333349 332899 331079 328540 326347 324885 323942 323174 322153 320684
57678C20684j326k41J071K064L494O238R861J3614J8104K4562L2901M1748M9862
$$ 320684 319358 319117 320188 322252 325746 331984 341845 355459 373563 398125 431026 472774 522636
57665E22636N6090N8293N3826M1597K2998J211j9792l6303m6315n0225m9652m5955
$$ 522636 578726 637019 690845 732442 755440 756651 736859 700556 654241 604016 554364 508409
57653E08409m0287l4089k8487k3553j9091j5515j3163j1383r332p194n630m557
$$ 508409 468122 434033 405546 381993 362902 347387 334224 322841 313509 306315 300685 296128
57641B96128l429k283j514j037n38j00K21Q40J850K414J908R85N30K98k96q20
$$ 296128 292699 290416 288902 287865 287327 287227 287448 288288 290138 292552 294460 295445 295975 296273 295977 295157
57625B95157o08k95r96k404l139k857k485k464k195j462j011j360j992k207j940
$$ 295157 294549 294254 293258 290854 287715 284858 282373 279909 277714 276252 275241 273881 271889 269682 267742
57610B67742j489r86n11k26k45o18j346k149k436j952j082k84M01Q36M80p37j865
$$ 267742 266253 265267 264756 264530 264285 263667 262321 260172 257736 255784 254702 254418 254819 255655 256135 255398 253533
57593B53533j948j191m17K9K01l6o33r14m33J79J46j71J71J145J759J409M28m83
$$ 253533 251585 250394 249977 250006 250207 250171 249538 248624 248191 248370 248516 248345 248516 249661 251420 252829 253257 252774
57575B52774p48j66O91O94m69j708j917j349q16l18M82J098Q02j01o91p82p35
$$ 252774 252026 251860 252551 253245 252776 251068 249151 247802 246986 246668 247150 248248 249050 248949 248258 247476 246741
57558B46741l89N85J622J849J451J278J334R97N33R21K053K511J477l06j771k683
$$ 246741 246352 246937 248559 250408 251859 253137 254471 255468 256001 256922 258975 261486 262963 262657 260886 258203
57542B58203l184l125k389j263j37P57J192J081P40N29L28j30o03o76n00m86m57
$$ 258203 255019 251894 249505 248242 248105 248862 250054 251135 251875 252404 252732 252602 251999 251323 250823 250337 249880
57525B49880R1J057J868K351K741K975K830K599K755L038K760J949J306R93N12
$$ 249880 249971 251028 252896 255247 257988 260963 263793 266392 269147 272185 274945 276894 278200 279193 279705
57510B79705j30o5J222K966L838L209J525k69j482k011j996j400k58P15O24l12
$$ 279705 279575 279510 280732 283698 287536 290745 292270 292001 290519 288508 286512 285112 284854 285569 286193 285881
57494B85881q82p00p76j671k291j599m13m6j25O92K365L572L811L827M007L964
$$ 285881 284999 284299 283523 281852 279561 277962 277549 277503 277378 278070 280435 284007 287818 291645 295652 299616
57478B99616L679L649L725L149J920Q53K03n97j633k219k124k010k272k458k141
$$ 299616 303295 306944 310669 313818 315738 316591 316794 316197 314564 312345 310221 308211 305939 303481 301340
57463C01340j461o30K46P90P02M91R34J763J936J241N75N00O40O34O44P24O61
$$ 301340 299879 299249 299495 300285 300987 301478 302412 304175 306111 307352 307927 308427 309067 309701 310345 311069 311730
57446C11730O34J059J663J727J348J396K090K697K765K578K257J649J262J968
$$ 311730 312364 313423 315086 316813 318161 319557 321647 324344 327109 329687 331944 333593 334855 336823
57432C36823L461M273L787K987K748K683K326K189K793L552L638L257L206L625
$$ 336823 340284 344557 348344 351331 354079 356762 359088 361277 364070 367622 371260 374517 377723 381348
57418C81348L904L480K344J103O42J247K013J861J092R77J799K449K286K073K509
$$ 381348 385252 388732 391076 392179 392821 394068 396081 397942 399034 400011 401810 404259 406545 408618 411127
57403D11127K987K627J653Q60M59K38L01Q69J686K330K749L124L484L853M293
$$ 411127 414114 416741 418394 419254 419713 419951 420252 421121 422807 425137 427886 431010 434494 438347 442640
57388D42640M658M679M543M813N606O439O993P418P656P313O414N552M954M184
$$ 442640 447298 451977 456520 461333 466939 473378 480371 487789 495445 502758 509172 514724 519678 523862
57374E23862L081K227K082K367K677K957L046K505J420P00R83J834K462K775L188
$$ 523862 526943 529170 531252 533619 536296 539253 542299 544804 546224 546924 547907 549741 552203 554978 558166
57359E58166L870M550M819M416L587L157L747M941N817O237O774P440P473O610
$$ 558166 562036 566586 571405 575821 579408 582565 586312 591253 597070 603307 610081 617521 624994 631604
57345F31604N567N018M892M926N077N106M695M208M423N198N454M823M251M493
$$ 631604 637171 642189 647081 652007 657084 662190 666885 671093 675516 680714 686168 690991 695242 699735
57331F99735N050N217N261N792O677P259P172O488N641N338N941O686O481N601
$$ 699735 704785 710002 715263 721055 727732 734991 742163 748651 754292 759630 765571 772257 778738 784339
57317G84339N503O625P606P268O162N433N273N394N979P128Q106Q216P879P972
$$ 784339 789842 796467 804073 811341 817503 822936 828209 833603 839582 846710 854816 863032 870911 878883
57303H78883Q510Q797Q517Q017P812Q267R315J0254J0331R831R821J0569J1138
$$ 878883 887393 896190 904707 912724 920536 928803 938118 948372 958703 968534 978355 988924 1000062
57290A000062J0940J0615J0833J1190J1115J0887J0989J1220J1322J1716J2734
$$ 1000062 1011002 1021617 1032450 1043640 1054755 1065642 1076631 1087851 1099173 1110889 1123623
57279A123623J3809J4226J4122J3954J3667J3181J3051J3730J4710J5140J4953
$$ 1123623 1137432 1151658 1165780 1179734 1193401 1206582 1219633 1233363 1248073 1263213 1278166
57268A278166J4669J4557J4640J5005J5454J5372J4504J3479J3003J2999J3046
$$ 1278166 1292835 1307392 1322032 1337037 1352491 1367863 1382367 1395846 1408849 1421848 1434894
57257A434894J3077J3252J3575J4129J5022J5824J5819J5161J4910J5519J6270
$$ 1434894 1447971 1461223 1474798 1488927 1503949 1519773 1535592 1550753 1565663 1581182 1597452
57246A597452J6661J7212J8261J9173J9522J9931K0831K1484K1321K1151K1861
$$ 1597452 1614113 1631325 1649586 1668759 1688281 1708212 1729043 1750527 1771848 1792999 1814860
57235A814860K2835K3022K2773K3217K4310K4936K4653K4130K4050K4491K5237
$$ 1814860 1837695 1860717 1883490 1906707 1931017 1955953 1980606 2004736 2028786 2053277 2078514
57224B078514K5871K5822K5057K4436K4756K5824K6973K7932K8677K9113K9525
$$ 2078514 2104385 2130207 2155264 2179700 2204456 2230280 2257253 2285185 2313862 2342975 2372500
57213B372500L0624L2444L4004L4698L5112L5708L5703L4290L2025K9946K8113
$$ 2372500 2403124 2435568 2469572 2504270 2539382 2575090 2610793 2645083 2677108 2707054 2735167
57202B735167K6127K4272K2949K1726K0072J8388J7319J6779J6691J7774K0346
$$ 2735167 2761294 2785566 2808515 2830241 2850313 2868701 2886020 2902799 2919490 2937264 2957610
57191B957610K3186K4949K5951K7257K8759K9621K9932L0356L0705L0387K9771
$$ 2957610 2980796 3005745 3031696 3058953 3087712 3117333 3147265 3177621 3208326 3238713 3268484
57180C268484K9637K9795K9726L0034L1489L3162L3301L1993L1099L1498L2071
$$ 3268484 3298121 3327916 3357642 3387676 3419165 3452327 3485628 3517621 3548720 3580218 3612289
57169C612289L1608L0299K8944K7996K7653K7920K8313K8337K8225K8394K8441
$$ 3612289 3643897 3674196 3703140 3731136 3758789 3786709 3815022 3843359 3871584 3899978 3928419
57158C928419K7586K5858K3833K1567J8875J6228J4228J2539J0526Q582P553P200
$$ 3928419 3956005 3981863 4005696 4027263 4046138 4062366 4076594 4089133 4099659 4108241 4115794 4122994
57146D122994O569N632N136N124M972M730N005N624N860N863O542Q025R549J0792
$$ 4122994 4129563 4135195 4140331 4145455 4150427 4155157 4160162 4165786 4171646 4177509 4184051 4192076 4201625 4212417
57132D212417J2045J3178J3771J4241J5501J7610J9926K2437K5613K9025L1639
$$ 4212417 4224462 4237640 4251411 4265652 4281153 4298763 4318689 4341126 4366739 4395764 4427403
57121D427403L3519L5910L9482M3645M7780N2038N6946O3177P1614Q2779R6406
$$ 4427403 4460922 4496832 4536314 4579959 4627739 4679777 4736723 4799900 4871514 4954293 5050699
57110E050699J12325J31119J52940J76639K01444K28795K61083K99508L44913
$$ 5050699 5163024 5294143 5447083 5623722 5825166 6053961 6315044 6614552 6959465
57101F959465L99978M68708N54447O60263P90773R51676J148012J384381J665403
$$ 6959465 7359443 7828151 8382598 9042861 9833634 10785310 11933322 13317703 14983106
57092A4983106J993085K363585K767582L191795L617599M020142M372813M652698
$$ 14983106 16976191 19339776 22107358 25299153 28916752 32936894 37309707 41962405
57084D1962405M841601M928067M914962M818437M642671M348096L854710L091942
$$ 41962405 46804006 51732073 56647035 61465472 66108143 70456239 74310949 77402891
57076G7402891K054140Q14565n04969j776761k897857l805297m477291m921182
$$ 77402891 79457031 80271596 79766627 77989866 75092009 71286712 66809421 61888239
57068F1888239n157089n209548n107798m885389m575679m208603l810984l406273
$$ 61888239 56731150 51521602 46413804 41528415 36952736 32744133 28933149 25526876
57060B5526876l012356k641035k300036j994149j724652j489925j287551j115130
$$ 25526876 22514520 19873485 17573449 15579300 13854648 12364723 11077172 9962042
57052I962042r69418q46488p43054o56590n84219n22712m69671m23679l83438
$$ 9962042 8992624 8146136 7403082 6746492 6162273 5639561 5169890 4746211 4362773
57043D362773l47624l15366k86045k58996k34071k11815j92133j73642j55310
$$ 4362773 4015149 3699783 3413738 3154742 2920671 2708856 2516723 2343081 2187771
57034B187771j37811j21972j06865r0940p4097n7013l9164j9434J778K2447M0009
$$ 2187771 2049960 1927988 1821123 1730183 1656086 1599073 1559909 1540475 1542253 1564700 1604709
57023A604709N0504M7851K7528p816m8267q3094j06511j17778j18636j12044j01635
$$ 1604709 1655213 1703064 1730592 1722776 1674509 1591415 1484904 1367126 1248490 1136446 1034811
57012A034811r0217p8822o7716n7651m9494m3209l7970l2979k7970k3239j9476
$$ 1034811 944594 865772 798056 740405 690911 647702 609732 576753 548783 525544 506068
57001E06068j7127j5762j4392j2554j0722r580r271r356r194q313o738m924l195
$$ 506068 488941 473179 458787 446233 435511 425931 416660 407304 398110 389797 383059 378135 374940
56988C74940j391P95L441O491R817J2860J4648J4414J1808O470j656j1133j9162
$$ 374940 373549 374344 377785 384276 394093 406953 421601 436015 447823 454293 452637 441504 422342
56975D22342k3724k5095k4717k3384k1282j8854j6451j3675j0138o504l732j665
$$ 422342 398618 373523 348806 325422 304140 285286 268835 255160 245022 238518 234786 233121
56963B33121O82L812P554J1855J6691K1439K5169K7393K7762K5413J9510J0431
$$ 233121 233803 237615 245169 257024 273715 295154 320323 347716 375478 400891 420401 430832
56951D30832k20j0507j8628k3292k4549k3935k2836k1156j8237j4398j0570o987
$$ 430832 430612 420105 401477 378185 353636 329701 306865 285709 267472 253074 242504 235517
56939B35517l384k7K722N563R631J4908K0361K5526L0624L5017L6757L4024K6368
$$ 235517 232133 232106 234828 240391 250022 264930 285291 310817 341441 376458 413215 447239 473607
56926D73607J4623N74j3252k4416l1656l4947l4822l2290k8896k5858k3134k0111
$$ 473607 488230 488804 475552 451136 419480 384533 349711 317421 288525 262667 239533 219422
56914B19422j6913j4226j2107j0040q062o804o344o002n295m356l362k296j348
$$ 219422 202509 188283 176176 166136 158074 151270 144926 138924 133629 129273 125911 123615 122267
56901A22267p81m10K01J047J792K393L076L896M902O434Q633J1074J3577J6779
$$ 122267 121486 121076 121277 122324 124116 126509 129585 133481 138383 144817 153450 164524 178101 194880
56887A94880K0990K5035K7337K7649K6465K3113J6163N871n084j3706j8692k0307
$$ 194880 215870 240905 268242 295891 322356 345469 361632 367503 362419 348713 330021 309714
56875C09714j9475j7314j4650j1513p610l288O52M121P861J2399J7679K3750L1006
$$ 309714 290239 272925 258275 246762 239152 235864 236516 240637 248498 260897 278576 302326 333332
56862C33332L9532M8799N7944O5709P0064O8608N9651M2918J9995n235k7457m2710
$$ 333332 372864 421663 479607 545316 615380 683988 743639 786557 806552 801317 773860 731150
56850G31150n0497n2628n0639m5310l7898l0007k2146j3829n050L636J2520K2749
$$ 731150 680653 628025 577386 532076 494178 464171 442025 428196 423146 426782 439302 462051
56838D62051L4682M7645O1509P6916R3204J07244J14950J13051R9190P2295L4469
$$ 462051 496733 544378 605887 682803 776007 883251 998201 1111252 1210442 1282737 1317206
56827A317206p974m6772p5632r2360r8318r6501q9692p9660o7681n5283m3746
$$ 1317206 1309232 1262460 1186828 1094468 996150 899649 809957 730297 662616 607333 563587
56816E63587l3147k2731j2267k107Q126J9696L3115M7212O0220P1006P8443Q0285
$$ 563587 530440 507709 495442 493335 501461 521157 554272 601484 661704 732710 811153 891438
56804H91438P3591N6554L0127j598l2544n7108p2481p9040p8855p4114o6584n7602
$$ 891438 965029 1021583 1051710 1050112 1017568 960460 887979 808939 730084 655970 589386 531784
56792E31784m8134l8961l0691k3431j6644r811k931L984J1431J9773K8346L5831
$$ 531784 483650 444689 413998 390567 373923 364112 361181 365165 376596 396369 424715 460546
56780D60546M1031M2705L9291K9973J5879n52j7027l1450m1495m5822m5643m3678
$$ 460546 501577 544282 583573 613546 629425 628873 611846 580396 538901 493079 447436 403758
56768D03758m1406l8415l4300k9723k5379k1247j7349j4229j2252j1156j0502
$$ 403758 362352 323937 289637 259914 234535 213288 195939 181710 169458 158302 147800
56757A47800r861q668o770n030m404m532m272l421k719k346j812j313j598k351
$$ 147800 137939 129271 122501 117471 113067 108535 104263 100842 98123 95777 93965 92652 91054 88703
56743H8703k294j247n78j026j563j133k07K11Q9j2O8K21M97P95P59L95J29M2j94
$$ 88703 86409 85162 84584 83558 81995 80862 80655 80866 80955 80943 81011 81232 81729 82524 83283 83678 83807 83849 83655
56724H3655l89J35J329K213K241J901J607J060J49n19n49l87m76n87l73J01O80
$$ 83655 83266 83401 84730 86943 89184 91085 92692 93752 93901 93382 92833 92446 91970 91383 91010 91111 91791
56707I1791J280J535J134N52N23P72L66n99r58l64J36k53j107j811k290k232j060
$$ 91791 93071 94606 95740 96292 96815 97587 97953 97354 96396 96032 96168 95915 94808 92997 90707 88475 87415
56690H7415Q29K032J979J558J425J132N63O34J641K316J694O71N82J226J547J398
$$ 87415 88244 90276 92255 93813 95238 96370 96933 97567 99208 101524 103218 103889 104471 105697 107244 108642
56674A08642J361J491J311N91n84j975k862k349o49P76R82O25O58Q97P72N37P78
$$ 108642 110003 111494 112805 113396 112812 110837 107975 105626 104977 105753 106735 107360 108018 108915 109687 110224 111002
56657A11002J368J720J577J010K76QP19J680J425j78j519j483q23n14j71Q52J951
$$ 111002 112370 114090 115667 116677 116953 116961 117680 119360 120785 120607 119088 117605 116782 116268 116097 116949 118900
56640A18900K246K003J945J872J252L98k6j18k65k75O2K11l09r74j056q19r27
$$ 118900 121146 123149 125094 126966 128218 128616 128590 128472 128207 127932 127994 128205 127896 126922 125866 125047 124120
56623A24120j268j287r52n77k01P3j91j005j573j446j272j580j732j030J6N91
$$ 124120 122852 121565 120613 120036 119835 119908 119717 118712 117139 115693 114421 112841 111109 110079 110095 110686
56607A10686R47J761K704K834K032J021L02p7j11J00K08J46L06P34Q19L34r6m5
$$ 110686 111633 113394 116098 118932 120964 121985 122287 122210 122099 122199 122407 122553 122859 123593 124412 124746 124650 124605
56589A24605Q2L1K80R26J183P15L63O28O89m8p17m50J33K06L37J323K487K716
$$ 124605 124687 124718 124998 125924 127107 127822 128185 128813 129502 129454 128737 128287 128420 128626 128963 130286 132773 135489
56571A35489K316K234K288J770J111J349K417L534M768O700R065J1141J3083J5328
$$ 135489 137805 140039 142327 144097 145208 146557 148974 152508 157276 163976 173041 184182 197265 212593
56557B12593J7140J7233J5447J2450Q273K748k946o865q429q630q253p291o001
$$ 212593 229733 246966 262413 274863 283136 285884 282938 276073 267644 259014 250761 243470 237469
56544B37469n097m806m773m892n213n236m451l335k704k386j668q15q00j652k346
$$ 237469 232372 227566 222793 217901 212688 207452 203001 199666 196962 194576 192908 192093 191293 189641 187295
56529A87295k338k076j894j490o27M36J248J354M69r33j660j259q35j526k790
$$ 187295 184957 182881 180987 179497 178870 179306 180554 181908 182377 181444 179784 178525 177690 176164 173374
56514A73374l218k537j631j054p33p48j236j746j714j309j000p51n24q92k052
$$ 173374 170156 167619 165988 164934 164201 163453 162217 160471 158757 157448 156448 155697 155173 154281 152229
56499A52229k961k612j564r22n64K32J096J145P01P87J279J195N85M52R47J184
$$ 152229 149268 146656 145092 144170 143606 143838 144934 146079 146780 147567 148846 150041 150626 151078 152025 153209
56483A53209Q98P11O85J02j051j746j389n95j99l06n05l68K01O63K41q02j016
$$ 153209 154107 154818 155503 155605 154554 152808 151419 150824 150625 150319 149814 149446 149647 150310 150551 149749 148733
56466A48733L63K235L202L373L407K854J129p04r73J81J115J123R10R18P90N09
$$ 148733 149096 151331 154533 157906 161313 164167 165296 164592 163619 163800 164915 166038 166948 167866 168656 169165
56450A69165N69R84J320J562J925K158K063K175K727K676J115r71j940j793j713
$$ 169165 169734 170718 172038 173600 175525 177683 179746 181921 184648 187324 188439 187468 185528 183735 182022
56435A82022j882j604j023r25j111p31M5L47K37M12P55O77M96P75R51L45j57N95
$$ 182022 180140 178536 177513 176588 175477 174746 174791 175138 175375 175787 176542 177219 177715 178490 179441 179786 179629 180224
56417A80224J682J327j57q49k44M60Q16J456K140J863Q75L37J06q69k061j839
$$ 180224 181906 183233 183076 182227 181983 182443 183259 184715 186855 188718 189593 189930 190036 189167 187106 185267
56401A85267l77M03J6j42K91l9j377k010j074O6J81j63j06K36P03J477K062J691
$$ 185267 184890 185293 185309 185167 185458 185419 184042 182032 180958 181024 181205 181042 180936 181172 181875 183352 185414 187105
56383A87105J013J483K811L241K532K215K605K230Q65L71J543K704K586K138K193
$$ 187105 188118 189601 192412 195653 198185 200400 203005 205235 206100 206471 208014 210718 213304 215442 217635
56368B17635J799M21m51M02J893K445K239K115J827R28J23K68J006J484J510J242
$$ 217635 219434 219855 219404 219806 221699 224144 226383 228498 230325 231253 231376 231644 232650 234134 235644 236886
56352B36886Q37Q79J953L313L427K232J241J062O31n01j158o01K79O88J110J877
$$ 236886 237723 238602 240555 243868 247295 249527 250768 251830 252461 251960 250802 250201 250480 251168 252278 254155
56336B54155K280J957J639J780J926J997K565L467L876M015M830N802N377L887
$$ 254155 256435 258392 260031 261811 263737 265734 268299 271766 275642 279657 284487 290289 295666 299553
56322B99553L358L942L417J140n52j95M27m98j930k172j581j187p08J20K82n94
$$ 299553 302911 306853 310270 311410 310858 310663 311090 310592 308662 306490 304909 303722 303014 303134 303416 302822
56306C02822r61J66J409J513J646L141M777M684L514L309M327N052M694L800L044
$$ 302822 301861 302027 303436 304949 306595 309736 314513 319197 322711 326020 330347 335399 340093 343893 346937
56291C46937K866L637N036N979O015N882O022N897N406N464O360P131P348P745
$$ 346937 349803 353440 358476 364455 370470 376352 382374 388271 393677 399141 405501 412632 419980 427725
56277D27725Q381Q146P034O769Q148R790J0687J1761J3589J4885J4785J4559J5481
$$ 427725 436106 444252 451286 458055 466203 475993 486680 498441 512030 526915 541700 556259 571740
56264E71740J6906J8017J9471K1818K4207K6185K8803L2565L6345L9764M4405
$$ 571740 588646 606663 626134 647952 672159 698344 727147 759712 796057 835821 880226
56253H80226N1100N8389O5309P3273Q3319R3927J03634J13391J24118J34180J41658
$$ 880226 931326 989715 1055024 1128297 1211616 1305543 1409177 1522568 1646686 1780866 1922524
56242A922524J47046J51326J53348J51512J46122J37728J25116J07334Q5996O3192
$$ 1922524 2069570 2220896 2374244 2525756 2671878 2809606 2934722 3042056 3128052 3191244
56232C191244L8946J3040j2575l5695n6408p5417r1609j03773j12877j20213j25000
$$ 3191244 3230190 3243230 3230655 3194960 3138552 3063135 2971526 2867753 2754876 2634663 2509663
56221B509663j26264j25212j23290j19768j13838j07138j01506r6053q9298q2321
$$ 2509663 2383399 2258187 2134897 2015129 1901291 1794153 1692647 1596594 1507296 1424975
56211A424975p6882p2221o6785o1461n7864n4914n0392m4661l9751l5895l2052
$$ 1424975 1348093 1275872 1209087 1147626 1089762 1034848 984456 939795 900044 864149 832097
56200H32097k8685k6883k5722k3428k0390j8223j6806j4963j3030j2025j1271
$$ 832097 803412 776529 750807 727379 706989 688766 671960 656997 643967 631942 620671
56189F20671r589p862p609q017p134n102l627l028k404j776j639j339k49N64J10
$$ 620671 611082 603220 595611 587594 580460 575358 571731 568703 566299 564523 562884 561545 561296 561860 561970
56174E61970m26L63J566J751J627K389L131K737K451L748N307N262M699N680P405
$$ 561970 561544 561907 563473 565224 566851 569240 572371 575108 577559 581307 586614 591876 596575 602255 609660
56159F09660P721P003P138Q033Q439Q973J0957J3496J4988J6263J9060K2699K5603
$$ 609660 617381 624384 631522 639555 647994 656967 667924 681420 696408 712671 731731 754430 780033
56146G80033K8609L3521L9797M6080N3458O3576P4927Q4608R2297R8883J02719
$$ 780033 808642 842163 881960 928040 981498 1045074 1120001 1204609 1296906 1395789 1498508
56135A498508J01242R5046Q6636P6588O4811N3982M7426M4627M2632M0554L8697
$$ 1498508 1599750 1694796 1781432 1858020 1922831 1976813 2024239 2068866 2111498 2152052 2190749
56124B190749L5009K7012J6271O581j206q520j4970j9540k4654l4093m7638o2053
$$ 2190749 2225758 2252770 2269041 2275622 2274416 2265896 2250926 2231386 2206732 2172639 2125001 2062948
56112B062948p6140q9967j00593j04031j00998r5753q9733q1211p0495o0302n1214
$$ 2062948 1986808 1896841 1796248 1692217 1591219 1495466 1405733 1324522 1254027 1193725 1142511
56101A142511m1765l2738k6548k2644j8270j3426j0386q894o616l875k918l075
$$ 1142511 1100746 1068008 1041460 1018816 1000546 987120 976734 967840 961224 957349 954431 951356
56089I51356j679P54J439Q51K032M849O235N831O091P146O952O121P124R170R312
$$ 951356 949677 950431 951870 952721 954753 959602 965837 971668 977759 984905 991857 997978 1005102 1014272 1023584
56074A023584Q190R011J1410J2228J1805J3301J6172J6758J5220J5386J7650J8539
$$ 1023584 1031774 1040785 1052195 1064423 1076228 1089529 1105701 1122459 1137679 1153065 1170715 1189254
56062A189254J7514J7694J9468J9907J8874J9333K1140K1065J9256J9151K0631
$$ 1189254 1206768 1224462 1243930 1263837 1282711 1302044 1323184 1344249 1363505 1382656 1403287
56051A403287J9985J7101J5842J6894J7086J6279J7758K1268K2813K2061K2808
$$ 1403287 1423272 1440373 1456215 1473109 1490195 1506474 1524232 1545500 1568313 1590374 1613182
56040A613182K5514K6632K5940K7056L0143L1560L1274L2936L6248L7252L6471
$$ 1613182 1638696 1665328 1691268 1718324 1748467 1780027 1811301 1844237 1880485 1917737 1954208
56029A954208L8393M2465M3431M1167M1059M3903M4908M3637M5167N0082N3254
$$ 1954208 1992601 2035066 2078497 2119664 2160723 2204626 2249534 2293171 2338338 2388420 2441674
56018B441674N4019N7446O3782O7052O6105O6761P0905P3927P4959P8739Q5233
$$ 2441674 2495693 2553139 2616921 2683973 2750078 2816839 2887744 2961671 3036630 3115369 3200602
56007C200602Q8490Q8161R0709R7070J00950J01715J06443J16428J24538J29088
$$ 3200602 3289092 3377253 3467962 3565032 3665982 3767697 3874140 3990568 4115106 4244194
55997D244194J37022J49882J60259J66003J74087J86510J96641K03568K15215
$$ 4244194 4381216 4531098 4691357 4857360 5031447 5217957 5414598 5618166 5833381
55988E833381K32947K48502K60558K78136L02982L25706L44454L69384M02940
$$ 5833381 6066328 6314830 6575388 6853524 7156506 7482212 7826666 8196050 8598990
55979H598990M34654M61870M95867N40611N86164O30559O86315P57235Q31916
$$ 8598990 9033644 9495514 9991381 10531992 11118156 11748715 12435030 13192265 14024181
55970A4024181R08931J003901J122163J251202J390752J561899J774874K019348
$$ 14024181 14933112 15937013 17059176 18310378 19701130 21263029 23037903 25057251
55962B5057251K300353K650383L091432L623521M269866N094277O156912P503558
$$ 25057251 27357604 30007987 33099419 36722940 40992806 46087083 52243995 59747553
55954E9747553R226307J1482482J4420782J8139400K2723159K8182165L4206884
$$ 59747553 68973860 80456342 94877124 113016524 135739683 163921848 198128732
55947A98128732L9982848M4285161M5699347M2793639L4491769K0874707L859033
$$ 198128732 238111580 282396741 328096088 370889727 405381496 426256203 430115236
55940D30115236j3201347k7036109l5909531l9882924m0045605l7683302l3917760
$$ 430115236 416913889 389877780 353968249 314085325 274039720 236356418 202438658
55933B02438658k9623831k5371854k1442061j7954002j4969337j2487659j0440024
$$ 202438658 172814827 147442973 126000912 108046910 93077573 80589914 70149890
55926G0149890q748054p364677o244890n324257m552142l911950l388943k949365
$$ 70149890 61401836 54037159 47792269 42468012 37915870 34003920 30614977 27665612
55918B7665612k567975k245577j981908j757398j556589j384142j242850j118781
$$ 27665612 25097637 22852060 20870152 19112754 17556165 16172023 14929173 13810392
55910A3810392j001878q99631q17063p43209o69927o05084n54933n11021m66142
$$ 13810392 12808514 11908883 11091820 10348611 9678684 9073600 8518667 8007646 7541504
55901G541504m26550l97051l69786l38797l10914k91587k73831k51486k30265
$$ 7541504 7114954 6717903 6348117 6009320 5698406 5406819 5132988 4881502 4651237
55892D651237k15712k02597j85883j70347j60110j49804j35222j21940j14658
$$ 4651237 4435525 4232928 4047045 3876698 3716588 3566784 3431562 3309622 3194964
55883C194964j08139r7285q6613q1546p9437p6983p7533q3111q7695q6091q1897
$$ 3194964 3086825 2989540 2902927 2821381 2741944 2664961 2587428 2504317 2416622 2330531 2248634
55872B248634p9756p7444p2256o7511o5935o3899n8550n3621n2175n0568m5671
$$ 2248634 2168878 2091434 2019178 1951667 1885732 1821833 1763283 1709662 1657487 1606919 1561248
55861A561248m1079m0236m0129l7631l5471l6198l6593l3768l0593k9761k8589
$$ 1561248 1520169 1479933 1439804 1402173 1366702 1330504 1293911 1260143 1229550 1199789 1171200
55850A171200k5014k2490k3665k5140k3835k2516k3775k4554k2033j9170j9070
$$ 1171200 1146186 1123696 1100031 1074891 1051056 1028540 1004765 980211 958178 939008 919938
55839I19938j9353j7438j5871j7088j8277j6737j5149j6211j7136j4893j1933
$$ 919938 900585 883147 867276 850188 831911 815174 800025 783814 766678 751785 739852
55828G39852j1412j1420r332p270p887r097q278p496r305j1455j0987r719j0516
$$ 739852 728440 717020 707688 700418 692531 683434 675156 667660 658355 646900 635913 626194 615678
55815F15678j1875j1183r810j0020j0306q605o716o880p251n410l030k556k507
$$ 615678 603803 592620 582810 572790 562484 553879 547163 540283 533032 527622 524592 522036 519529
55802E19529n93J706K184K326M199O073N597M288M448M579K414l70j004n74j678
$$ 519529 518936 520642 522826 525152 529351 535424 541021 545309 549757 554336 556750 556380 555376 554802 553124
55787E53124l666m373m228m567m434l055k857n967j0120j2122j2800j4463j6014
$$ 553124 549458 545085 540857 536290 531856 528801 525944 519977 509857 497735 484935 470472 454458
55774D54458j4898j1684q511n046j15M740P220P879Q068O490J648m346q296j0256
$$ 454458 439560 427876 419365 414319 414204 418944 426164 434043 442111 448601 450249 445903 437607 427351
55760D27351j1779j2098r991p318o574o843n996n080o399r001j0146r804r815
$$ 427351 415572 403474 393483 386165 379591 372748 366752 361672 355273 346272 336126 326322 316507
55747C16507j0052r193p967p887p972o284l544j898j339n16L25K94J75P41N35
$$ 316507 306455 297262 289295 281408 273436 267152 263608 261710 260371 259855 260180 260474 260649 261390 261925
55732B61925j505l238k486j000j609l470m024l774m940o870p071n677m846m632
$$ 261925 260420 257182 254696 253696 252087 248617 244593 240819 235879 229009 221938 216261 211415 206783
55718B06783l417j532o56n00L40J192O28m0J544M478N795N274N216O038N882M245
$$ 206783 203366 201834 201178 200678 201018 202210 202838 202798 204342 208820 214615 219889 225105 231143 237025 241270
55702B41270K416O17j869m135m593m128m955o766p328o479o062o304n693m235
$$ 241270 243686 244303 242434 238299 233706 229578 224623 217857 210529 204050 197988 191684 185991 181756
55688A81756l436l185j990j95L70j53J72J472J954J468J879L593M816M648M000
$$ 181756 178320 175135 173145 172950 173320 173167 173339 174811 176765 178233 180112 183705 188521 193169 197169
55673A97169L189J430q30j884j428r14r75r24p60j165j587q87J93j04j360j445
$$ 197169 200358 201788 200958 199074 197646 196732 195757 194833 194073 192908 191321 190434 190627 190523 189163 187718
55657A87718j17P24M97P01J826K427J878J427J774K014J596J196J064N52k89o04
$$ 187718 187601 188325 188822 189523 191349 193776 195654 197081 198855 200869 202465 203661 204725 205277 204988 204384
55641B04384n20j023k033k556k798l930n688o487o068n764n986n720m717l980
$$ 204384 203864 202841 200808 198252 195454 191524 185836 179349 173281 167517 161531 155811 151094 147114
55627A47114l690k884j514p11o92m54J46J04o72j022o28m57q41r62o01n34j033
$$ 147114 143424 140540 139026 138315 137623 137169 137315 137419 136747 135725 135097 134640 133799 132837 132236 131702 130669
55610A30669j616k347l501m129l029j095m94j402j844r30O7K17K61Q04J182P92
$$ 130669 129053 126706 123205 119076 116047 114952 114458 113056 111212 110282 110349 110566 110827 111631 112813 113605
55594A13605q9j197k452l085k278p49l9k30k00J02l09j259j466q89p65j192r02
$$ 113605 113516 112319 109867 106782 104504 103755 103716 103486 103286 103388 103079 101820 100354 99465 98700 97508 96606
55577I6606K50R03O44P13J792L105M165N343O315N992M514L360L024K435J082
$$ 96606 96856 97759 98403 99116 100908 104013 108178 113521 119836 125828 130342 133702 136726 139161 140243
55562A40243k08r95j783k526k496k018k368l614m509m763n297n965n329l243j388
$$ 140243 140035 139040 137257 134731 132235 130217 127849 124235 119726 114963 109666 103701 98372 95129 93741
55547I3741o71j89N31N80l24r85p62m70m92k2J028J408P22L05R22J551J422J322
$$ 93741 93070 92881 93412 93992 93668 92683 91921 91451 90959 90937 91965 93373 94095 94400 95322 96873 98295 99617
55529I9617J826K007J099j66r55j562k291k579k172j762j708j430p23k00O7P29
$$ 99617 101443 103450 104549 104383 103428 101866 99575 96996 94824 93062 91354 89924 89201 89001 89068 89797
55513H9797J520J259L8n57j6K38n47j121n00L85M96L37N65O97L76K86O47M69n32
$$ 89797 91317 92576 92614 92057 92041 92279 91732 90611 90111 90496 90992 91329 91894 92591 92967 93253 93900 94369 93837
55494I3837r96j91M81l13j687k155j890j797j684r88k66k88n78k56M34P84R72
$$ 93837 92841 92650 93131 92818 91131 88976 87086 85289 83605 82617 82351 82063 81485 81229 81663 82447 83419
55477H3419J467J840J387M36j05QL55N70M19k01q63r34p21j243k508l274k970
$$ 83419 84886 86726 88113 88549 88444 88452 88807 89377 89796 89595 88732 87798 87077 85834 83326 80052 77082
55460G7082k413k032r75J068K688K599J393L25m42j154j267l27Q64J282J134J133
$$ 77082 74669 72637 71662 72730 75418 78017 79410 79735 79293 78139 76872 76545 77409 78691 79825 80958
55444H0958J087L89p36j558j921k053j833j096j97M00N98L20n95j663j808p90
$$ 80958 82045 82434 81698 80140 78219 76166 74333 73237 73040 73440 74038 74358 73763 72100 70292 69502
55428F9502L06N52K93J95K41K61N29J096J337R28M55M76P49Q25O82L18l01o80
$$ 69502 69808 70360 70653 70848 71089 71350 71879 72975 74312 75240 75695 76171 76920 77745 78427 78745 78444 77764
55410G7764j47R10J276O93J20rl86j195j475p81rJ25J09M02O20N90P98J086M65
$$ 77764 77617 78527 79803 80496 80616 80607 80221 79026 77551 76770 76761 76886 76995 77397 78017 78607 79405 80491 80956
55391H0956r81j697j004k35m14o16J48J081J089O29N65N03j86r68j188j354j900
$$ 80956 79975 78278 77274 77039 76625 76009 76157 77238 78327 78956 79521 80024 79838 78870 77682 76328 74428
55374G4428j990j045k04n80j244q03J91L11j59J23R73R37j27p86l80J70J71J74
$$ 74428 72438 71393 71189 70609 69365 68562 68753 69064 68905 69028 70001 70938 70811 70025 69645 69815 69986 70160
55356G0160P66J534J832J682J477J297Q75P2p84j067o13j87n60j274j222l82J41
$$ 70160 70926 72460 74292 75974 77451 78748 79623 79695 78911 77844 77231 77044 76484 75210 73988 73606 73747
55339G3747p8k77o8m6m11m40ol0p11r06j48M15J07M2R89J685Q88m07n70R0J91
$$ 73747 73669 73392 73324 73278 72867 72427 72421 72391 71680 70774 70626 71041 71148 71190 72179 73864 74752 74345 73775 73865 74056
55318G4056l28n26l42m03o03m48j89k38j21N87J130P51J90M55R63N13o28j193
$$ 74056 73728 73202 72860 72457 71854 71406 71217 70979 70858 71445 72575 73326 73516 73971 74934 75447 74819 73626
55300G3626r19n13j86K65N07K01l0M67J119J092P65P96O39m19j516j330k80J97
$$ 73626 72707 72194 72008 72273 72780 72981 72951 73418 74537 75629 76394 77190 77829 77410 75894 74564 74284 74481
55282G4481NJ70P34P88K98R8K58J18k09n9L07J1p06p90j92J35j1P9N63Q62Q67
$$ 74481 74486 74656 75390 76178 76476 76574 76832 76950 76741 76682 76989 77000 76294 75504 75312 75447 75436 75515 76078 76940 77807
55261G7807R16P41o3p70l69N60M69p20j561j473j407j870k028j236k6R04J437
$$ 77807 78723 79464 79401 78631 78262 78822 79291 78571 77010 75537 74130 72260 70232 68996 68970 69874 71311
55244G1311J470Q64J78K88R88J140L91l60m46k60l39o28q78r21n01L57R36O45
$$ 71311 72781 73645 73823 74111 75099 76239 76630 76270 75824 75564 75225 74597 73719 72798 72297 72654 73590 74235
55226G4235l6k97k86n44o76J1R26Q27k09r34q54m83J25J311K336J881K59o33o
$$ 74235 74199 73902 73616 73072 72396 72407 73333 74160 73951 73017 72163 71680 71805 73116 75452 77333 77592 76959 76953
55207G6953Q87R33N83M17Mr27j542j106j62M03N47O24N95L90L27N36O29L43k2
$$ 76953 77840 78773 79356 79773 79777 78850 77308 76202 76040 76443 76990 77614 78209 78599 78926 79462 80091 80434 80412
55188H0412j70j68n2K66N45M02R0K51Q06R01K01o34r27o95k57J54K63ok14kJ51
$$ 80412 80242 80074 80022 80288 80833 81235 81325 81576 82382 83283 83484 82850 81923 81228 80971 81125 81388 81382 81168 81166 81317
55167H1317l96j196j254o33l51o47o36J25R08R68M61p9l32q3N85R15K81o34n10
$$ 81317 80921 79725 78471 77838 77487 76840 76204 76329 77237 78205 78666 78587 78255 78172 78757 79672 79953 79319 78809
55148G8809P28J755J715J030K31p33j665j775p96M61J099J010N09p2k50L02J065
$$ 78809 79537 81292 83007 84037 84268 83535 81870 80095 79299 79760 80859 81869 82378 82306 82056 82358 83423
55131H3423J124M27j65k00j23l58p60j120j415j483j226j017j124j011j43Q47
$$ 83423 84547 84974 84809 84609 84486 84128 83368 82248 80833 79350 78124 77107 75983 74972 74829 75676
55115G5676R91N78N82P98K17r01j099p4Q36Q44O75Q44P62J96K4O16R73M29q5M72
$$ 75676 76667 77245 77827 78625 78842 77941 76842 76768 77604 78448 79123 79967 80729 80925 80949 81565 82538 82967 82882 83354
55095H3354J580K097J923J743J791J752J365N59n11j238r89j56J10m92r45m54
$$ 83354 84934 87031 88954 90697 92488 94240 95605 96164 95653 94415 93426 93270 93380 92888 91943 91489
55079I1489M80R86R39O73L94K71M06M12k23j143j437j005o23n50k67K34K44k43
$$ 91489 91969 92955 93894 94567 94961 95232 95638 96050 95827 94684 93247 92242 91619 91069 90802 91036 91280 91037
55061I1037k92L32O42J63j55M55J323J484J021M80n4n91q38q41j070j383r16L63
$$ 91037 90745 91077 91719 91882 91727 92182 93505 94989 96010 96490 96436 95845 95007 94166 93096 91713 90797 91160
55043I1160J150N66o40j347j488j466j205n90j4K67M90O17J71o48q18p5N42M09
$$ 91160 92310 92876 92236 90889 89401 87935 86730 86140 86126 86393 86883 87500 87671 87023 86205 86130 86672 87081
55025H7081K72P45J153Q75N61Q45J042L96m56n56k34l20n17K1J047J486J019L14
$$ 87081 87353 88098 89251 90126 90687 91532 92574 92970 92514 91958 91724 91404 90887 90908 91955 93441 94460 94774
55007I4774q4j75r1rj41k91K3O51P35J47j1R09J881J634M95k33l5O14J218J479
$$ 94774 94690 94515 94424 94415 94274 93983 94006 94657 95392 95539 95528 96437 98318 99952 100447 100214 100179 100793 102011 103490
54987A03490J153M74K26O07P80J52o82j026j151j389j154l0J001P45m37j177r47
$$ 103490 104643 105117 105343 105950 106730 106882 106200 105174 104023 102634 101480 101450 102451 103196 102759 101582 100635
54970A00635k96K66N48L20l70q48o08oM84R79J475J302K00q52r06l92j50l0M13
$$ 100635 100339 100605 101153 101473 101103 100255 99647 99641 100125 101104 102579 103881 104081 103229 102323 101931 101781 101751 102164
54951A02164P19L41j15J28M20l82j895k633k163j382q52l17K34L71J71K37O59
$$ 102164 102883 103224 103109 103237 103657 103275 101380 98747 96584 95202 94350 94033 94267 94638 94809 95046 95705
54934I5705R68J008R72O43l19j474j872j270k23Q18J746K329K423K427K765L187
$$ 95705 96673 97681 98653 99296 98977 97503 95631 94361 94138 94956 96702 99031 101454 103881 106646 109833
54918A09833L329L522M220M998N214N119N283N322M459K984J818Q45q84l296n068
$$ 109833 113162 116684 120904 125902 131116 136235 141518 146840 151299 154283 156101 156946 156062 152766 147698
54903A47698n490n265n096m651l514k241j753k120k533k283j472p79o10n34P4
$$ 147698 142208 136943 131847 127196 123682 121441 119688 117568 115035 112752 111280 110501 109891 109357 109431
54888A09431R09R71J06n70l11J62j7l97n6Q38J539K125L148M342M961N110N506
$$ 109431 110340 111311 111417 110847 110536 110698 110681 110284 110228 111066 112605 114730 117878 122220 127181 132291 137797
54871A37797O188O571O550O364N574L417K11k703m450n245n585n702n690n412
$$ 137797 143985 150556 157106 163470 169044 172461 172672 169969 165519 160274 154689 148987 143297 137885
54857A37885m525l249k636l135l607k889j691j548k356k579j682p38n79q86j231
$$ 137885 133360 130111 127475 124340 120733 117844 116153 114605 112249 109670 107988 107250 106671 105785 104554
54842A04554j610j724j099j52O0n44r58p50n77p72p43j73L23K70O6J43L45M54
$$ 104554 102944 101220 100121 99969 100029 99485 98527 97777 97200 96428 95685 95512 95835 96105 96171 96314 96659 97113
54824I7113N86P17O16M50O07Q15L95m76q07l30N6k67p38o26m3N12Q70R94P62K73
$$ 97113 97699 98416 99032 99482 100089 100904 101299 100823 100016 99686 99742 99475 98737 98111 98068 98580 99450 100444 101206 101479
54804A01479r3k30k67q0N27J217J404J221J244J356Q04m59j473j506p58K39J058
$$ 101479 101386 101156 100889 100809 101336 102553 103957 105178 106422 107778 108582 108123 106650 105144 104386 104625 105683
54787A05683J264P39J94M03R71R09K93J21N87Q16M75J93J70j88q18o93M65J507
$$ 105683 106947 107686 107880 108283 109254 110163 110456 110577 111164 111980 112455 112648 112818 112630 111812 111119 111584 113091
54769A13091J627J493J912K578L018L638M814N914O207N983N851N631M821L547
$$ 113091 114718 116211 118123 120701 123719 127357 132171 138085 144292 150275 156126 161757 166578 170125
54755A70125K276J054l24j892l700n714p179p004n323l738l280l185k457j636
$$ 170125 172401 173455 173131 171239 167539 161825 154646 147642 142319 138581 135301 132116 129659 128023
54741A28023j762k500k593j821j148j118j262j147j023j158j255q38Q6R44J083
$$ 128023 126261 123761 121168 119347 118199 117081 115819 114672 113649 112491 111236 110398 110484 111428 112511
54726A12511M73OO88K366L762M090M014M559N601O198N989N501N087M396L046
$$ 112511 112984 112990 113678 116044 119806 123896 127910 132469 138070 144268 150257 155758 160845 165241 168287
54711A68287J297k52j373k297l151l689l750l777m382n361n772n157m101l165
$$ 168287 169584 169332 167959 165662 162511 158822 155072 151295 146913 141552 135780 130623 126522 123357
54697A23357k051m68Q32R09Q3m94m15j18K00O08O03l55j631k011j566j436j813
$$ 123357 121306 120838 121670 122579 122662 122168 121753 121635 121835 122443 123046 122691 121060 119049 117483 116047 114234
54680A14234j681q30m13r22j255n85K61K49l37p76j067j258p10O96J677J075m26
$$ 114234 112553 111723 111310 110388 109133 108548 108809 109058 108721 107945 106878 105620 104910 105606 107283 108358 107932
54663A07932j303j245j062j154j203j042q08m60Q4O28J093J777K579K665J583
$$ 107932 106629 105384 104322 103168 101965 100923 100115 99655 99739 100367 101460 103237 105816 108481 110064
54648A10064J64n25n03m38n14n52o78r45q35oR07J119Q29O31L90l99j520k291
$$ 110064 110228 109703 109200 108762 108248 107696 107018 106073 105238 105232 106139 107258 108087 108718 109108 108709 107189 104898
54630A04898k551k501j984q39M16J174J622K096K097J035m08r31m40k4j54j81
$$ 104898 102347 99846 97862 97023 97439 98613 100235 102331 104428 105463 105055 104124 103684 103660 103506 103325
54614A03325L00P55O92L33K3k47m46l51p4l4k25j57K86O00M64K01J35J09m1o3
$$ 103325 103625 104380 105072 105405 105428 105181 104735 104384 104310 104276 104051 103894 104180 104780 105244 105445 105580 105689 105648 105585
54594A05585K97Q23J084R04L71l78j104j475j300p09J3N79P68N23R2j18O6M32
$$ 105585 105882 106705 107789 108693 109064 108686 107582 106107 104807 104098 104111 104690 105458 105981 106073 105955 106021 106453
54576A06453O40O05N30N75O01L68M9J61P61J117O56j03k70Q7J45k08k16K79L96
$$ 106453 107093 107698 108228 108803 109404 109772 109821 109982 110743 111860 112516 112413 112143 112230 112375 112167 111951 112230 112626
54557A12626k90q34k93Q17J262P09j54o85p00k20N50J194J486J579J533J232R30
$$ 112626 112336 111502 111209 112026 113288 113997 113843 113158 112458 112238 112788 113982 115468 117047 118580 119812 120742
54540A20742J173J723J555M57l37L5O23J64q59j005j54M36Q9o09j008j108j006
$$ 120742 121915 123638 125193 125650 125313 125348 125971 126135 125276 124271 124117 124553 124642 124033 123025 121917 120911
54523A20911p13n55q33j106o86J57M74P4k61q9J31m1l59m53l31q9K20L37Kn00
$$ 120911 120198 119643 118810 117704 117018 117175 117649 117723 117462 117373 117504 117463 117104 116651 116320 116231 116451 116788 116790 116290
54503A16290o53m59l34k69L8L56J40l46j66P90J445J052K38k9K42L80J23k40m35
$$ 116290 115637 115178 114844 114575 114613 114969 115109 114763 114597 115387 116832 117884 118122 118093 118335 118715 118838 118598 118163
54484A18163l75RO53J237J426J194P93N36O45R81J005L95l15j72J014K340K835
$$ 118163 117788 117797 118450 119687 121113 122307 123100 123636 124281 125262 126267 126662 126347 126175 127189 129529 132364
54467A32364K364J526R65J049J670K213K003J083J57k61m20q01j465k084k360
$$ 132364 134728 136254 137219 138268 139938 142151 144154 145237 145394 145133 144713 143912 142447 140363 138003
54452A38003k168j565q45m07l12j93K19O18N09p5n27m38r9r0m64p16n96n25r79
$$ 138003 135835 134270 133425 133018 132706 132513 132732 133350 133859 133784 133257 132819 132720 132630 132166 131450 130854 130329 129350
54433A29350j691j948j488o64J59Q20J056N98k51p79p48n33k61M28J486K112J773
$$ 129350 127659 125711 124223 123559 123718 124538 125594 126192 125941 125162 124414 123881 123620 124048 125534 127646 129419
54416A29419R41L47J14J15M67J105J440J159P68P47P34K78k84m58m57n69l25O86
$$ 129419 130360 130707 130821 130936 131403 132508 133948 135107 135875 136622 137356 137634 137350 136892 136435 135866 135541 136227
54398A36227J710J711R62N74P72Q64O97P88J016N79m77r47k10P86Q20ro13l19
$$ 136227 137937 139648 140610 141184 141956 142820 143517 144305 145321 145900 145423 144476 144266 145052 145872 145863 145250 144931
54380A44931M98Q57J07j337k239j861p90JN40J430K450K715K175J869K370L030
$$ 144931 145429 146286 146393 145056 142817 140956 140166 140167 140707 142137 144587 147302 149477 151346 153716 156746
54364A56746L050K523J946J423P42j92j206j848j583n66O5n13j526j614r23q28
$$ 156746 159796 162319 164265 165688 166430 166238 165032 163184 161601 161035 161100 160587 159061 157447 156524 155696
54348A55696j545j637m08P38L17j127k035k083k098k402k453k000j416r44m01
$$ 155696 154151 152514 152106 152844 153161 152034 149999 147916 145818 143416 140963 138963 137547 136603 136202
54333A36202K54P05P40M47lm49o14l65PO5j61k29J14N96P64M39j71o89q78p63
$$ 136202 136456 137161 137901 138348 138345 137896 137282 136917 136924 136989 136828 136599 136713 137309 138073 138512 138341 137652 136774 136011
54313A36011m37J02P39R73K65j206k442k541j588n11j02l48o45n83l36k35j31
$$ 136011 135574 135676 136415 137388 137653 136447 134005 131464 129876 129365 129263 128915 128270 127687 127351 127116 126985
54296A26985L83J150J437R63M07M04O41M89P9K6M22Q47J148J389J252L98o34q10
$$ 126985 127368 128518 129955 130918 131325 131729 132370 132859 132938 132964 133386 134233 135381 136770 138022 138420 137786 136976
54278A36976k9O63N35M3l3L71P82Q93O50J19m98q82q36l38N57J584K207K102J590
$$ 136976 136947 137610 138145 138188 138155 138526 139308 140201 140851 140970 140472 139590 138754 138416 138973 140557 142764 144866 146456
54259A46456J145P59K59o2J71O83R95J256J812K209J690N41k03l18m84p76m24
$$ 146456 147601 148360 148619 148557 148728 149411 150406 151662 153474 155683 157373 157914 157711 157393 156909 156133 155709
54242A55709N60R60J41q72r40m25l84r80j506j541j188o81k75k64n83p45n16k37
$$ 155709 156269 157229 157370 156498 155558 155133 154749 153769 152263 150722 149534 148853 148578 148314 147731 146986 146470 146233
54224A46233k15l77p07j373k008j741m81O14N56j91n51l06OJ20J39o3o71j350
$$ 146233 146018 145641 144934 143561 141553 139812 139331 139945 140501 140310 139759 139453 139459 139579 139718 139655 138984 137634
54206A37634j493j027m05P5M86R11J246J347J076L84m65r16o07K62J146J527J115
$$ 137634 136141 135114 134709 134784 135270 136181 137427 138774 139850 140234 139769 138853 138246 138508 139654 141181 142296
54189A42296P5q92j094o31j54O6L33P37Q95O94N73P81R49P48M46M06M98M10J86
$$ 142296 142371 141479 140385 139754 139600 139666 139999 140736 141631 142325 142898 143679 144628 145376 145822 146228 146726 147136 147322
54170A47322J59N55J264J762J394J88q33q37l87o22j465j815j441j261j563j399
$$ 147322 147481 148036 149300 151062 152456 152644 151811 150974 150587 149965 148500 146685 145244 143983 142420 141021
54154A41021k90P88R19N04K50pm85o02N5P07M90j81l94j69j20k88l83o48j384
$$ 141021 140731 141519 142438 142942 143192 143185 142700 142098 142153 142860 143350 143169 142775 142606 142486 142198 141815 141167 139783
54135A39783k075j952j161m33RL98O71P07R67J876K842K792J613K98k48N7P27
$$ 139783 137708 135756 134595 134162 134171 134569 135240 135947 136914 138790 141632 144424 146037 146335 146087 146144 146871
54118A46871J143R75O21Q94J837K418J909R00L65M40Q67J805L270M477M816M821
$$ 146871 148014 148989 149610 150504 152341 154759 156668 157568 157933 158373 159240 161045 164315 168792 173608 178429
54102A78429N041M702K848K93j120r82n75p64j095j126j255j792k342k603k820
$$ 178429 183470 188172 191020 191313 190193 189211 188636 187872 186777 185651 184396 182604 180262 177659 174839
54087A74839l097l009k316j436q36n29l54k97k67m2M18Q86J148J144R50Q10R52
$$ 174839 171742 168733 166417 164981 164145 163616 163262 162965 162698 162656 163074 163960 165108 166252 167202 168012 168964
54070A68964J143Q88L11K14P76J089N73LJ58L49m07j541j634o07K79L44k4n92
$$ 168964 170107 170995 171306 171520 172296 173385 173958 173961 174119 174468 174061 172520 170886 170279 170558 170902 170878 170286
54052A70286j435j892r49J059K510K564J978J648J676K045K881L655L513K801
$$ 170286 168851 166959 166010 167069 169579 172143 174121 175769 177445 179490 182371 186026 189539 192340
54038A92340K908M078M862M487M187N161O522O656N586M523L825K869J626R04
$$ 192340 195248 199326 204188 208675 212862 218023 224545 231201 236787 241310 245135 248004 249630 250534
54024B50534R72J145R57Q30J221J733J531L78j039j794j648j224j197j522j747
$$ 250534 251506 252651 253608 254438 255659 257392 258923 259301 258262 256468 254820 253596 252399 250877 249130
54009B49130j909k563l807m925n287n057m724m353l695k779j975j592j615j701
$$ 249130 247221 244658 240851 235926 230639 225582 220858 216505 212810 210031 208056 206464 204849 203148
53995B03148j433p80l63q39j941k590k094q97K7K25m3k99l35l41o05j035j089
$$ 203148 201715 200935 200572 199733 197792 195202 193108 192211 192238 192463 192420 192121 191786 191445 190840 189805 188716
53978A88716m49M78J089J357J668K135K693L676N439P502Q782Q764P668N588K407
$$ 188716 188267 188745 189834 191191 192859 194994 197687 201363 206802 214304 223086 231850 239518 245106 247513
53963B47513j257m053n360n922o512o777n953m182k397j294r55j106j245q20J94
$$ 247513 246256 242203 236843 230921 224409 217632 211679 207497 205100 203806 202851 201745 200500 199680 199874
53948A99874J078J107L86l23l85K97J416K468L064L235L377L809M464M969M839
$$ 199874 200952 202059 202445 202122 201737 202034 203450 205918 208982 212217 215594 219403 223867 228836 233675
53933B33675L785K190J064J009J381J149M13K98J362K891L955M290M003L341L035
$$ 233675 237460 239650 240714 241723 243104 244253 244666 244964 246326 249217 253172 257462 261465 264806 267841
53918B67841L957N772O859O238M936M617N509O487O838O867O850O346M888K846
$$ 267841 271798 277570 284429 290667 295603 300220 305729 312216 319054 325921 332771 339117 344005 346851
53904C46851J176M54L06q4j000j849k031j828k013k771l560m072m581n213n648
$$ 346851 348027 348481 348787 348703 347703 345854 343823 341995 339982 337211 333651 329579 324998 319785 314137
53889C14137n789o058o643p043o817o220n693n231m716m417m519m635m245l366
$$ 314137 308348 302290 295647 288604 281787 275567 269874 264643 259927 255510 250991 246356 242111 238745
53875B38745k357j376m99k2j98q46j651k585l664m524m645l874k478j004k26p28
$$ 238745 236388 235012 234513 234491 234293 233447 231796 229211 225547 221023 216378 212504 210026 209022 208796 208068
53859B08068k088k943k447j351j054j774k373j895o62K60K51m95j388j990k115
$$ 208068 205980 203037 200590 199239 198185 196411 194038 192143 191481 191741 191992 191497 190109 188119 186004
53844A86004j651n39R34K042K168J450O01O7k30l51l9P55J515J584Q58j81q69
$$ 186004 184353 183814 184748 186790 188958 190408 191009 191076 190846 190495 190456 191211 192726 194310 195168 194987 194118
53827A94118q36k85J59J61R5L98P18L53n91j173q90k36J71L33M72O13Q51J417
$$ 194118 193282 192997 193156 193317 193412 193810 194528 194881 194290 193117 192227 191991 192162 192495 192967 193580 194431 195848
53809A95848K100K283J921J786K393L308L932M300M604M663M409M273M506M636
$$ 195848 197948 200231 202152 203938 206331 209639 213571 217871 222475 227138 231547 235820 240326 244962
53795B44962M275L895M094M583M581L885K895J954J266J153J695K389K673K503
$$ 244962 249237 253132 257226 261809 266390 270275 273170 275124 276390 277543 279238 281627 284300 286803
53781B86803J981Q81q57k637l847m650n434n952n712m940m280l810l180k568k624
$$ 286803 288784 289665 288808 286171 282324 277674 272240 266288 260576 255636 251356 247546 244366 241798 239174
53766B39174l396m090m055l441k773k313k000j685j324j112j315j777j899j384
$$ 239174 235778 231688 227633 224192 221419 219106 217106 215421 214097 212985 211670 209893 207994 206610
53752B06610o78l51m10n92q58j168j219r19p44r84j063k84J089K160K521K368
$$ 206610 205932 205581 205171 204579 203721 202553 201334 200415 199671 198687 197624 197340 198429 200589 203110 205478
53736B05478J839R68J28k52k60k28j24J53K75K4k5P68J944K529K516K634K821
$$ 205478 207317 208285 208413 208161 207901 207673 207549 207702 207977 208001 207976 208744 210688 213217 215733 218367 221188
53719B21188K196P84l1O59J978K465J910J252J243J762K258K274J732J048Q37
$$ 221188 223384 224168 224137 224796 226774 229239 231149 232401 233644 235406 237664 239938 241670 242718 243555
53704B43555J341K219K961L290L151K691K261K198K515L045L704M348M604M335
$$ 243555 244896 247115 250076 253366 256517 259208 261469 263667 266182 269227 272931 277279 281883 286218
53690B86218M028M126M151L239J479m5p13j024j604k304k638k526k139j511p13
$$ 286218 290246 294372 298523 301762 303241 303196 302483 301459 299855 297551 294913 292387 290248 288737 288024
53675B88024j01J2l30r15j541j885j571p36j33l24j003j417j206n76P9M67M92
$$ 288024 287923 287935 287605 286690 285149 283264 281693 280957 280824 280500 279497 278080 276874 276298 276377 276844 277336
53658B77336L16K69M59O09L86j80p08q31m71J72Q94J738K766L537L225J663O0
$$ 277336 277652 277921 278380 278989 279375 279195 278487 277656 277185 277357 278251 279989 282755 286292 289517 291180 291240
53641B91240m2J496L233L813L286K563K092J616J010P14J182K146K832K874K742
$$ 291240 291198 292694 295927 299740 303026 305589 307681 309297 310307 311021 312203 314349 317181 320055 322797
53626C22797K981L338L162K534K271K588K621J767P83P53J578K356K857L533M296
$$ 322797 325778 329116 332278 334812 337083 339671 342292 344059 344842 345595 347173 349529 352386 355919 360215
53611C60215M427L882L535L822M080L710L143L082L375L307K666J951J654J714
$$ 360215 364642 368524 372059 375881 379961 383671 386814 389896 393271 396578 399244 401195 402849 404563
53597D04563J622R56o8o50l18L38K99n86j524k005k339k795l021k711k267k202
$$ 404563 406185 407141 407073 406423 406105 406443 406742 406156 404632 402627 400288 397493 394472 391761 389494 387292
53581C87292k441k637k762k862k690k114j608j725k306k690k586k267k008j789
$$ 387292 384851 382214 379452 376590 373900 371786 370178 368453 366147 363457 360871 358604 356596 354807
53567C54807j579j477j543j661j649j364p96j50K71L91M78P52J092J226J100Q66
$$ 354807 353228 351751 350208 348547 346898 345534 344738 344588 344859 345250 345728 346480 347572 348798 349898 350764
53551C50764O29M06K58L06O14J091J471J560J547J930K864L778L995L689L720
$$ 350764 351393 351799 352057 352363 352977 354068 355539 357099 358646 360576 363440 367218 371213 374902 378622
53536C78622M470N404N981O405P111P958Q446Q500Q549Q929R603J0396J1144J1634
$$ 378622 383092 388496 394477 400882 407993 415951 424397 432897 441446 450375 459978 470374 481518 493152
53522D93152J1733J1702J2051J2945J3908J4400J4526J4940J6072J7663J9208
$$ 493152 504885 516587 528638 541583 555491 569891 584417 599357 615429 633092 652300
53511F52300K0537K1688K2587K3246K4096K5434K6629K6663K5623K4710K4407
$$ 652300 672837 694525 717112 740358 764454 789888 816517 843180 868803 893513 917920
53500I17920K3698K1813J9787J9040J9176J8614J7113J6092J6278J6615J6013
$$ 917920 941618 963431 983218 1002258 1021434 1040048 1057161 1073253 1089531 1106146 1122159
53489A122159J4969J4599J5029J5570J5867J6116J6452J6717J6643J5997J4869
$$ 1122159 1137128 1151727 1166756 1182326 1198193 1214309 1230761 1247478 1264121 1280118 1294987
53478A294987J3856J3414J2946J1312Q413N454L314J595k84k103l722n896r109
$$ 1294987 1308843 1322257 1335203 1346515 1354928 1360382 1363696 1365291 1365007 1362904 1359182 1353286 1344177
53465A344177j2267j3787j3688j3443j3970j4769j5077j4967j5083j5969j7682
$$ 1344177 1331910 1318123 1304435 1290992 1277022 1262253 1247176 1232209 1217126 1201157 1183475
53454A183475j9636k0848k0838k0188j9797j9799j9796j9718j9666j9168j7594
$$ 1183475 1163839 1142991 1122153 1101965 1082168 1062369 1042573 1022855 1003189 984021 966427
53443I66427j5296j3347j2003j0384p978n539l974l097k180j116l28K30J141K626
$$ 966427 951131 937784 925781 915397 907419 901880 897906 894809 892629 891513 891185 891415 892556 895182
53429H95182M122M967N218N549O464P772Q926R804J0873J2490J4332J5850J7092
$$ 895182 899304 904271 909489 915038 921502 929274 938200 948004 958877 971367 985699 1001549 1018641
53416A018641J8587K0477K2338K3860K5182K6325K7007K7377K8368L0649L3555
$$ 1018641 1037228 1057705 1080043 1103903 1129085 1155410 1182417 1209794 1238162 1268811 1302366
53405A302366L5752L6856L7715L9061M0627M1883M3041M4732M7039M9401N1328
$$ 1302366 1338118 1374974 1412689 1451750 1492377 1534260 1577301 1622033 1669072 1718473 1769801
53394A769801N2716N3452N3339N2618N2097N2347N2927N2786N1360M9042M6650
$$ 1769801 1822517 1875969 1929308 1981926 2034023 2086370 2139297 2192083 2243443 2292485 2339135
53383B339135M4687M3045M1159L8414L4664L0381K6168K2187J8185J4034R864
$$ 2339135 2383822 2426867 2468026 2506440 2541104 2571485 2597653 2619840 2638025 2652059 2661923
53372B661923N654J055m249j0171j6371k2612k8822l4904m0601m5492m9131n1311
$$ 2661923 2667577 2668632 2664383 2654212 2637841 2615229 2586407 2551503 2510902 2465410 2416279 2364968
53360B364968n2243n2420n2357n2400n2565n2361n1099m8674m5928m3778m2203
$$ 2364968 2312725 2260305 2207948 2155548 2102983 2050622 1999523 1950849 1904921 1861143 1818940
53349A818940m0601l9047l8403l9000l9866l9738l8361l6376l4339l2354l0426
$$ 1818940 1778339 1739292 1700889 1661889 1622023 1582285 1543924 1507548 1473209 1440855 1410429
53338A410429k8558k6580k4312k1953j9904j8177j6303j4025j1833j0571j0539
$$ 1410429 1381871 1355291 1330979 1309026 1289122 1270945 1254642 1240617 1228784 1218213 1207674
53327A207674j1201j1815j2269j2959j3883j4253j3391j1691j0236r525r106q460
$$ 1207674 1196473 1184658 1172389 1159430 1145547 1131294 1117903 1106212 1095976 1086451 1077345 1068885
53315A068885p658o927o094m837l168j397J29J073J287J229J838L598N944P951
$$ 1068885 1061227 1054300 1048206 1043369 1040201 1038804 1038933 1040006 1041293 1042522 1044360 1047958 1053902 1061853
53301A061853R407J0869J2829J5191J7470J9208K0302K1120K2273K4003K5893
$$ 1061853 1071260 1082129 1094958 1110149 1127619 1146827 1167129 1188249 1210522 1234525 1260418
53290A260418K7276K7787K7452K6450K5033K3431K1638J9494J7128J4941J2963
$$ 1260418 1287694 1315481 1342933 1369383 1394416 1417847 1439485 1458979 1476107 1491048 1504011
53279A504011J0609P432L765K03l185o575r636j1759j3063j4441j6443j8588k0130
$$ 1504011 1514620 1522052 1525817 1526020 1522835 1516260 1506624 1494865 1481802 1467361 1450918 1432330 1412200
53266A412200k1089k2147k3696k5328k6278k6265k5860k5985k6943k8016k8180
$$ 1412200 1391111 1368964 1345268 1319940 1293662 1267397 1241537 1215552 1188609 1160593 1132413
53255A132413k7293k6288k6115k6629k6818k6042k4744k3785k3314k2757k1866
$$ 1132413 1105120 1078832 1052717 1026088 999270 973228 948484 924699 901385 878628 856762
53244H56762k1273k1600k2435k2687k1854k0373j8759j7048j5268j3821j2936
$$ 856762 835489 813889 791454 768767 746913 726540 707781 690733 675465 661644 648708
53233F48708j2135j0765q896p276o441o238o258o420o937p832q676q944q649q467
$$ 648708 636573 625808 616912 609636 603195 596957 590699 584279 577342 569510 560834 551890 543241 534774
53219E34774r069j0423j1897j2947j3424j3380j2938j2249j1338j0001q276o799
$$ 534774 525705 515282 503385 490438 477014 463634 450696 438447 427109 417108 408832 402033
53207D02033o229o377o481o266o164o382o530o317o002n913o123o727p761q593
$$ 402033 395804 389427 382946 376680 370516 364134 357604 351287 345285 339372 333249 326522 318761 310168
53193C10168q240o693n153m471m169l530k813k610k708k595k481k790l146k860
$$ 310168 301928 295235 290082 285611 281442 277912 275099 272489 269781 267186 264705 261915 258769 255909
53179B55909k236k214k863l254k855k084j388o89j5J78k61p64p27k09K67K53l82
$$ 255909 253673 251459 248596 245342 242487 240403 239015 238326 238311 238489 238228 237464 236737 236528 236795 237048 236666
53162B36666j323j831j388l64L65M58K39j49r51j985k412j786p95m11o66q20m54
$$ 236666 235343 233512 232124 231760 232125 232583 232822 232673 231722 229737 227325 225539 224744 224333 223667 222847 222393
53145B22393R6L43J69k74q44j353j477r69JQ60J126R01O82P88J070J265J305J266
$$ 222393 222489 222832 223001 222727 221883 220530 219053 218084 218085 218945 220071 220972 221654 222442 223512 224777 226082 227348
53127B27348J192J096R24N39L7J5R41K180K478J682J175J995L330L724L054K274
$$ 227348 228540 229636 230560 231099 231136 231151 232092 234272 236750 238432 239607 241602 244932 248656 251710 253984
53111B53984J685P79l83r56o96l90n98r18r24r06j188j534j755k177k926l334
$$ 253984 255669 256448 256065 255109 254413 254023 253425 252507 251583 250677 249489 247955 246200 244023 241097 237763
53095B37763k817j797j093p98m75j79m56j350k137k227j812j445j326j229r42
$$ 237763 234946 233149 232056 231258 230783 230604 230148 228798 226661 224434 222622 221177 219851 218622 217680
53080B17680n17j75l9J9K35N83O79J56q78j849k188j783j013m38l76o37p47l99
$$ 217680 217163 216988 216949 216968 217203 217786 218465 218621 217743 215894 213706 211923 210910 210472 210096 209459 208712 208313
53062B08313K20O25N01k1m92m83J05R69J559J495R67O09P59R37M78l49m32O33
$$ 208313 208533 209158 209659 209638 209146 208663 208768 209737 211296 212791 213758 214367 215126 216063 216541 216192 215760 216393
53044B16393J725J596N66l7J47K55j68n37m85n51r72r26J44J316J344M12k85k16
$$ 216393 218118 219714 220280 220243 220390 220645 220477 219940 219455 218904 217932 217006 217150 218466 219810 220222 219937 219721
53026B19721J86N43Q13Q09L73n0J15O73R92J070J311J501R34l04j145q37K29J049
$$ 219721 219907 220450 221263 222072 222445 222395 222510 223183 224175 225245 226556 228057 228991 228687 227542 226705 226934 227983
53008B27983Q83l14j703j983p54Q03J254O58N3k29n75p11P7J356J705Q40Q2K47
$$ 227983 228866 228552 226849 224866 224112 224915 226169 226827 226880 226651 226076 225365 225442 226798 228503 229343 229425 229672
52990B29672N22J52k33J12O40O28O19J543K968L558K918J928J483J733K374K918
$$ 229672 230194 230346 230113 230225 230865 231493 232112 233655 236623 240181 243099 245027 246510 248243 250617 253535
52974B53535K809J954R48K41n04j639k530k241r54J34L44J91M23J045J532J588
$$ 253535 256344 258298 259246 259487 258983 257344 254814 252573 251619 251753 252097 252288 252711 253756 255288 256876
52958B56876J367J097O89j55j347k130j820p78j18l57j005j574k192k785k646
$$ 256876 258243 259340 260029 259874 258527 256397 254577 253799 253681 253324 252319 250745 248553 245768 243122
52943B43122j543n00m87r16n51M89Q20r6j147j208n83k65m22l77K11P81N68m89
$$ 243122 241579 241079 240592 239676 239125 239614 240434 240338 239191 237983 237400 237135 236713 236336 236547 237328 237896 237407
52925B37407j629j995j436n35P7K97M16O31R45J351J826K078J635L87j054j761
$$ 237407 235778 233783 232347 231812 231889 232186 232602 233233 234178 235529 237355 239433 241068 241455 240401 238640
52909B38640j404o74n55j162j610j214l61J89M25Q86J628K109K084J849J553J031
$$ 238640 237236 236562 236007 234845 233235 232021 231660 231849 232274 233160 234788 236897 238981 240830 242383 243414
52893B43414L97O9L2k12p49j080j037j074j338j316p87k44L4M13R09P93m9l96
$$ 243414 243811 243880 243912 243700 242951 241871 240834 239760 238422 237106 236319 236075 236109 236522 237431 238224 238175 237779
52875B37779O67K243K893K650K525K580J986P21j80j26M99J324K347L165L035
$$ 237779 238446 240689 243582 246232 248757 251337 253323 254044 253864 253738 254237 255561 257908 261073 264108
52860B64108K038J149Q34M62m80j548k193k636l227l686l633l353l328l418l212
$$ 264108 266146 267295 268129 268591 268111 266563 264370 261734 258507 254821 251188 247835 244507 241089 237877
52845B37877k903l051l553l593k775j773j507j955k223j740r45o30q77j028o21
$$ 237877 234974 231923 228370 224777 222002 220229 218722 216767 214544 212804 211859 211229 210352 209324 208703
52830B08703Q3O21R70J399J989K540K782K470J527L41l83l99k65n74j112j232
$$ 208703 208786 209407 210377 211776 213765 216305 219087 221557 223084 223425 223042 222643 222378 221804 220692 219460
52814B19460q51n14n47o55m42M7M31M40K36L61J159K152K296J141n04j485j607
$$ 219460 218609 218095 217548 216893 216451 216498 216929 217369 217605 217966 219125 221277 223573 224714 224210 222725 221118
52797B21118j618k054k639k763k152j033nL04k51j148j701j679j263o70r6J72
$$ 221118 219500 217446 214807 212044 209892 208859 208854 209158 208907 207759 206058 204379 203116 202446 202350 202522
52781B02522J3k71k32K98J238K338L025K601J110l49p51l26l2j84k58P9N07O50
$$ 202522 202535 202264 202032 202330 203568 205906 208931 211532 212642 212293 211542 211216 211184 211000 210742 210821 211328 211978
52763B11978N07J77l27q53j159j192j052p22k12J42Mm11m89L2R31J899K713L123
$$ 211978 212485 212662 212335 211482 210323 209131 208079 207357 207145 207287 207291 206880 206391 206423 207354 209253 211966 215089
52745B15089L047K826K794K745K225J246K31n25q80n29O25J954K579K340J724
$$ 215089 218136 220962 223756 226501 228726 229972 230203 229678 228798 228269 228894 230848 233427 235767 237491
52730B37491J009J62n52o55k27J67L68O98J140J158N37l37j196k157l080l327
$$ 237491 238500 238662 238110 237455 237228 237395 237763 238461 239601 240759 241296 240959 239763 237606 234526 231199
52714B31199k618j548q80q02j032j227j061m01L34M47j62q02q36l17L09P34Q79
$$ 231199 228581 227033 226153 225351 224319 223092 222031 221630 221964 222411 222249 221447 220611 220294 220603 221337 222216
52697B22216R13J143J520J357K19j090j274k95N26L65j51j80J33K96M23Q22J209
$$ 222216 223129 224272 225792 227149 227368 226278 225004 224709 225235 225600 225449 225269 225402 225698 226121 226943 228152
52680B28152J145P49M34K81J83J83J75k66j250k093k047j211k34M59P74O60L03
$$ 228152 229297 230046 230480 230761 230944 231127 231302 231036 229786 227693 225646 224435 224201 224660 225434 226094 226397
52663B26397K74R16J827K332K206J615P57Nj4R52K322L358L945M280M169L317
$$ 226397 226671 227587 229414 231746 233952 235567 236324 236329 236315 237267 239589 242947 246892 251172 255341 258658
52647B58658K014Q26k49j642l286m397m289l013j248J36N21J8n67n92l25m11q74
$$ 258658 260672 261498 261249 259607 256321 251924 247635 244622 243374 243510 244031 244049 243482 242890 242565 242154 241280
52630B41280j084o12L26J297K005K319K298K198K090J616M77r42j893k130j947
$$ 241280 240196 239584 239910 241207 243212 245531 247829 250027 252117 253733 254210 253268 251375 249245 247298
52615B47298j468n32O28J225P46l98j372j769j727j455j016m58J09N64P64N58
$$ 247298 245830 245298 245926 247151 247897 247499 246127 244358 242631 241176 240160 239702 239811 240375 241139 241697
52599B41697J3m07j25Q77J796J722O21n83j106j088j082j044m50O64J496J475
$$ 241697 241710 241303 241178 242055 243851 245573 246194 245611 244505 243417 242335 241291 240841 241505 243001 244476
52583B44476R63O21N65N33N18P38J204J668J899J723J031N8n79n07j20j05n83
$$ 244476 245439 246060 246625 247158 247676 248414 249618 251286 253185 254908 255939 255997 255418 254911 254791 254686 254103
52566B54103j097j290j204r57n74j95r3l78q75j358j713j864j702j166l87K98
$$ 254103 253006 251716 250512 249555 248981 248786 248693 248315 247440 246082 244369 242505 240803 239637 239250 239548
52550B39548N22K47j33k62k58l89m11J52J071J459J077P69J140J493R65N5n3O70
$$ 239548 240070 240317 240184 239922 239664 239275 238864 239016 240087 241546 242623 243392 244532 246025 246990 247045 246992 247662
52532B47662J094P16L50O33R46M58m84p99j66O20P20J79k66o4N49P23Kr30p79
$$ 247662 248756 249472 249822 250455 251401 251859 251375 250576 250410 251030 251750 251929 251663 251599 252148 252871 252873 251943 251164
52513B51164Q00K598L153K398J612J802K696L364L384L056K717K255J343k4j434
$$ 251164 251964 254562 257715 260113 261725 263527 266223 269587 272971 276027 278744 280999 282342 282318 280884
52498B80884k425k863k933k890k894l036l293l413l010k064j132q89j292j547
$$ 280884 278459 275596 272663 269773 266879 263843 260550 257137 254127 252063 250931 250042 248750 247203
52484B47203r84J62J058J174O76R7j30J19N23N25Pl04L56J604K178J605Q81J051
$$ 247203 246219 246381 247439 248613 249289 249386 249256 249375 249898 250423 250430 250126 250482 252086 254264 255869 256750 257801
52466B57801J810K136J799J467J630K228L090L952M194L404K109J189N41o74k487
$$ 257801 259611 261747 263546 265013 266643 268871 271961 275913 280107 283511 285620 286809 287350 286676 284189
52451B84189l857m179m059m119m021l274k215j444r51m45j30l49q32j007p70m92
$$ 284189 280332 276153 272094 267975 263954 260680 258465 257021 256070 255625 255495 255146 254314 253307 252537 252045
52435B52045m25n71q58j054q84n73p52j413j542m12J271K268K364K249K251K093
$$ 252045 251620 251049 250191 249137 248253 247680 246928 245515 243973 243561 244832 247100 249464 251713 253964 256057
52419B56057J724J420J141N65j71n15l61j29L5M59J254K100K967M352O469Q646
$$ 256057 257781 259201 260342 260907 260736 260221 259860 259731 259766 260225 261479 263579 266546 270898 277367 286013
52403B86013R919R903Q879P258N163K512n94l477n166n337m729m289m171m024
$$ 286013 295932 305835 314714 321972 327135 329647 329053 325576 320410 315073 310344 306055 301884 297860
52389B97860l846l850l705k815j389m39m36p21m80K82J108J815K411K661K258
$$ 297860 294014 290164 286459 283644 282255 281816 281380 280659 280179 280461 281569 283384 285795 288456 290714
52374B90714J350O04P51K017L846N215N579N409N483N796N658M769L548K340J003
$$ 290714 292064 292668 293419 295436 299282 304497 310076 315485 320968 326764 332422 337191 340739 343079 344082
52359C44082m69j573j910j709j405j172j130j490k034j969q16P65J632J446Q98
$$ 344082 343613 342040 340130 338421 337016 335844 334714 333224 331190 329221 328405 329170 330802 332248 333146
52344C33146P95J344K284L230L858M021L848L656L742M242N082N967O659P325
$$ 333146 333941 335285 337569 340799 344657 348678 352526 356182 359924 364166 369248 375215 381874 389199
52330C89199Q448J0150J1828J2676J2555J2213J2593J4044J6150J8219J9869K1065
$$ 389199 397647 407797 419625 432301 444856 457069 469662 483706 499856 518075 537944 559009
52318E59009K1721K1617K0870K0139J9946J9972J9484J8336J7111J6319J5964
$$ 559009 580730 602347 623217 643356 663302 683274 702758 721094 738205 754524 770488
52307G70488J5891J5969J5841J5088J3844J2779J2242J1949J1656J1512J1420
$$ 770488 786379 802348 818189 833277 847121 859900 872142 884091 895747 907259 918679
52296I18679J0764R260P414N559L040q00n201q496r949j0270j0382j0453j0254
$$ 918679 929443 938703 946117 951676 954716 953916 948715 940219 930270 920000 909618 899165 888911
52283H88911r732q912p817o671n754m866l453j458M89J994L429N248P239Q928
$$ 888911 879179 870267 862450 855779 850025 845159 841706 840248 840737 842731 846160 851408 858647 867575
52269H67575J0285J1494J2359J2580J2395J2360J2583J2735J2763J2975J3280
$$ 867575 877860 889354 901713 914293 926688 939048 951631 964366 977129 990104 1003384
52258A003384J3079J2129J1067J0680J1039J1624J1994J1947J1375J0356R143
$$ 1003384 1016463 1028592 1039659 1050339 1061378 1073002 1084996 1096943 1108318 1118674 1127817
52247A127817P662N319J779k267n654p976r713j1295j2647j3726j4728j5518j5546
$$ 1127817 1135479 1140798 1142577 1140310 1134656 1126680 1116967 1105672 1093025 1079299 1064571 1049053 1033507
52234A033507j4781j4165j4570j5611j6105j5431j3939j2176j0399q888q036p844
$$ 1033507 1018726 1004561 989991 974380 958275 942844 928905 916729 906330 897442 889406 881562
52222H81562p665o837n360l787k606j907j523j199o64K21J265K116K695L349M348
$$ 881562 873897 867060 861700 857913 855307 853400 851877 850678 850014 850235 851500 853616 856311 859660 864008
52207H64008N428O020N897N275M323L047J775J198J547K184K496K761L507M436
$$ 864008 869436 875456 881353 886628 890951 893998 895773 896971 898518 900702 903198 905959 909466 913902
52193I13902M769M495M356M635M853M781M819N054M904M101L211K588J639k70
$$ 913902 918671 923166 927522 932157 937010 941791 946610 951664 956568 960669 963880 966468 968107 967837
52179I67837k736m846o204o887o988o853p216q276r133q863p683o370n047l531
$$ 967837 965101 960255 954051 947164 940176 933323 926107 917831 908698 899835 892152 885782 880735 877204
52165H77204k319k067k326j907m65J235K597L740M748N293N214M714L885K778
$$ 877204 874885 872818 870492 868585 868120 869355 871952 875692 880440 885733 890947 895661 899546 902324
52151I02324J872J663J741J233K05l00J46P85R95J240K074L096L579L554L494
$$ 902324 904196 905859 907600 908833 909038 908738 908884 909669 910664 911904 913978 917074 920653 924207 927701
52136I27701L363K688J570R44J692L664N749P079Q170J0437J4294J8251K0590
$$ 927701 931064 933752 935322 936266 937958 941622 947371 954450 962620 973057 987351 1005602 1026192
52123A026192K1575K3017K5801K8873L0817L1366L1067L0427K9843K9617K9461
$$ 1026192 1047767 1070784 1096585 1125458 1156275 1187641 1218708 1249135 1278978 1308595 1338056
52112A338056K8566K6578K3924K0969J7498J3472R524O205L389Q61j101k255k955
$$ 1338056 1366622 1393200 1417124 1438093 1455591 1469063 1478587 1484792 1488181 1489042 1487941 1485686 1482731
52099A482731l634m229m518m560m490m400m801o377q896j1174j2724j4551j7542
$$ 1482731 1479097 1474868 1470350 1465790 1461300 1456900 1452099 1445722 1436826 1425652 1412928 1398377 1380835
52086A380835k0770k2460k2101k0572j8640j6419j4116j2139j0294p836m581j378
$$ 1380835 1360065 1337605 1315504 1294932 1276292 1259873 1245757 1233618 1223324 1215488 1210907 1209529
52074A209529P93J817K429L513N513Q153J0724J2738J4223J5287J5809J5779J5516
$$ 1209529 1210322 1212139 1214568 1218081 1223594 1231747 1242471 1255209 1269432 1284719 1300528 1316307 1331823
52061A331823J5182J4438J3052J1500J0453R920R415Q630P581O270M809L501K404
$$ 1331823 1347005 1361443 1374495 1385995 1396448 1406368 1415783 1424413 1431994 1438264 1443073 1446574 1448978
52048A448978J045r65l392n879q589j1769j5044j7838k0107k2057k3425k3834
$$ 1448978 1450023 1449058 1445666 1439787 1431198 1419429 1404385 1386547 1366440 1344383 1320958 1297124
52036A297124k3534k3052k2338k1047j9407j7895j6315j4146j1824j0446j0080
$$ 1297124 1273590 1250538 1228200 1207153 1187746 1169851 1153536 1139390 1127566 1117120 1107040
52025A107040r416p579n399m285m529n358o147o917p815q617q783p882o117m473
$$ 1107040 1097624 1090045 1084646 1080361 1075832 1070474 1064327 1057410 1049595 1040978 1032195 1024313 1018196 1013723
52011A013723m025m913o305p433q380r682j1486j3395j4929j5949j6713j7597
$$ 1013723 1009698 1004785 998480 991047 982667 972985 961499 948104 933175 917226 900513 882916
51999H82916j8615j9334j9406j9035j8644j8196j7266j5772j4165j2795j1489
$$ 882916 864301 844967 825561 806526 787882 769686 752420 736648 722483 709688 698199
51988F98199r985q463p362o908o965p292p804q548r484j0318j0765j0982j1490
$$ 698199 688214 679751 672389 665481 658516 651224 643420 634872 625388 615070 604305 593323 581833
51975E81833j2450j3268j3212j2260j1009r882q781p413n708l879k227q22P66
$$ 581833 569383 556115 542903 530643 519634 509752 500971 493558 487850 483971 481744 480922 481688
51962D81688L038N741P838Q677Q788R063R484R243P865N577K792j28k679m365
$$ 481688 484726 490467 498305 506982 515770 524833 534317 543560 551425 557002 559794 559666 556987 552622
51948E52622n170n379n009l890k121R9L012P027J1875J6667K0832K4454K7632
$$ 552622 547452 542073 537064 533174 531053 531152 534164 541191 553066 569733 590565 615019 642651
51935F42651L0057L1227L0591K7505K1734J4113O118j347q185j4171j8646k1431
$$ 642651 672708 703935 734526 762031 783765 797878 803996 802649 794464 780293 761647 740216
51923G40216k3251k4810k5929k6097k5388k4328k3183k1859k0294j8633j7005
$$ 740216 716965 692155 666226 640129 614741 590413 567230 545371 525077 506444 489439
51912D89439j5374j3585j1552r484p789o516n130l188j045O56J965L452N110O262
$$ 489439 474065 460480 448928 439444 431655 425139 420009 416821 415776 416432 418397 421849 426959 433221
51898D33221O608O616O696O633O076M904K957J16l095n720p477q867r951r924
$$ 433221 439829 446445 453141 459774 465850 470754 473711 473827 470732 465012 457535 448668 438717 428793
51884D28793q462o611n439m571k953o13J383K506L338M584O254P892Q985R153
$$ 428793 420331 413720 408281 403710 400757 400144 401527 404033 407371 411955 418209 426101 435086 444239
51870D44239Q396P252O276N429M318K884J470J99j147k657m087n242o105o530
$$ 444239 452635 459887 466163 471592 475910 478794 480264 480463 479316 476659 472572 467330 461225 454695
51856D54695o060m376j792P85K470L102L279L568L741L104J540k10j524k668m229
$$ 454695 448635 444259 442467 443252 445722 448824 452103 455671 459412 462516 464056 463846 462322 459654 455425
51841D55425o147p754q488q290p483o613o128n880n206l839k390j512r42k8J143
$$ 455425 449278 441524 433036 424746 417263 410650 404522 398642 393436 389597 387207 385695 384753 384725 385868
51826C85868J840J816J613J606J418N88o97j860k651l223l650l648k913j585k98
$$ 385868 387708 389524 391137 392743 394161 394749 394052 392192 389541 386318 382668 379020 376107 374522 374224
51811C74224M38P95J334K164K746K764K646K853K990K225M81j350k336k244j393
$$ 374224 374662 375457 376791 378955 381701 384465 387111 389964 392954 395179 395660 394310 391974 389730 388337
51796C88337l35L30K77k18n87p07r93j708k576l101l027k360j345m48k7P9L09
$$ 388337 388002 388332 388609 388391 387804 387097 386104 384396 381820 378719 375692 373332 371987 371539 371512 371591 371900
51779C71900O97Q24N52L14M48P13P45O08N48N40N43Q63J827L272M806O427Q323
$$ 371900 372597 373421 373973 374287 374735 375448 376193 376801 377349 377889 378432 379295 381122 384394 389200 395627 403950
51762D03950J0219J1447J1740J1355J0322Q171M739P70k792n700q126r867j0484
$$ 403950 414169 425616 437356 448711 459033 467204 471943 472713 469921 464221 456095 446228 435744
51749D35744j0132r593r295q894p988o768n695m886m219l606k869j585M76K938
$$ 435744 425612 416019 406724 397830 389842 383074 377379 372493 368274 364668 361799 360214 360690 363628
51735C63628N278P440R620J1552J2523J2086J0375P824N038K893K125K743M164
$$ 363628 368906 376346 385966 397518 410041 422127 432502 440326 445364 448257 450382 453125 457289
51722D57289N854P299P438N153O92m067p320q786r086q420o682m443k871k637
$$ 457289 463143 470442 477880 483033 483725 479658 472338 463552 454466 446046 439364 434921 432050 429413
51708D29413l497m889o308p091o593m851k617o10R33J930K211J810J078K42p04
$$ 429413 425916 421027 414719 407628 401035 396184 393567 392957 393890 395820 398031 399841 400919 401161 400457
51693D00457j522j637r13m2K96K97M79N72k46k012l669m355m349m331m273l637
$$ 400457 398935 397298 396385 396343 396639 396936 397415 397987 397741 395729 392060 387705 383356 379025 374752 371115
51677C71115k342q09P51K408L882M651M897N553O987Q297Q608Q557R641J2227
$$ 371115 368773 367964 368715 371123 375005 379656 384553 390106 397093 405390 413998 422555 432196 444423
51663D44423J5009J6512J6299J4529J1048N595j295q163j3428j6229j6602j5054
$$ 444423 459432 475944 492243 506772 517820 523415 522120 513957 500529 484300 467698 452644
51651D52644j2058q053l799l91J469J985J744Q47r24l232n115n953n936n475m713
$$ 452644 440586 432533 428734 428343 429812 431797 433541 434388 433464 430232 425117 419164 413228 407753 403040
51636D03040l809l129k772k405j876j546j724k253k932l803m614m636l626k500
$$ 403040 399231 396102 393330 390925 389049 387503 385779 383526 380594 376791 372177 367541 363915 361415
51622C61415k348l095l799l994l902l598k818j721j060j267j926k353k342k129
$$ 361415 359067 355972 352173 348179 344277 340679 337861 336140 335080 333813 331887 329534 327192 325063
51608C25063j905j568q37L94J655K124J559P83Q05J595K330K699L323M815P019
$$ 325063 323158 321590 320753 321147 322802 324926 326485 327268 328073 329668 331998 334697 338020 342835 349854
51593C49854R299J1034J1659J0783Q515N376J783j879m772n939n467m574m102
$$ 349854 359153 370187 381846 392629 401144 406520 408303 406424 401652 395713 390246 385672 381570
51580C81570l543k117k05J157J836K761M582O944R175J1018J2424J3230J3468
$$ 381570 378027 375910 375705 376862 378698 381459 386041 392985 402160 413178 425602 438832 452300
51567D52300J3564J3854J4122J3845J2785J1206R734R268J0702J4301J9320K4517
$$ 452300 465864 479718 493840 507685 520470 531676 541410 550678 561380 575681 595001 619518
51555F19518K9038L2593L4879L5181L2752K7455K0009J1718L908k708q316j3540
$$ 619518 648556 681149 716028 751209 783961 811416 831425 843143 847051 844343 836027 822487
51543H22487j8578k2899k5855k7235k7174k5843k3546k0870j8308j5900j3563
$$ 822487 803909 781010 755155 727920 700746 674903 651357 630487 612179 596279 582716
51532E82716j1639j0676j0760j1542j2757j4210j5229j4936j3406j1805j1015
$$ 582716 571077 560401 549641 538099 525342 511132 495903 480967 467561 455756 444741
51521D44741j0596r663q245p118o538n989n124m268l791l552l175k595k055j798
$$ 444741 434145 424482 416237 409119 402581 396592 391468 387200 383409 379857 376682 374087 372032 370234
51507C70234j856k005j910j462r72q23r53r02m01L41R51J294J488J686J904J948
$$ 370234 368378 366373 364463 363001 362029 361206 360253 359351 358950 359291 360242 361536 363024 364710 366614 368562
51491C68562J587R09M20N11R44J146J003R43J180J273P26k86j107j451j676k242
$$ 368562 370149 371058 371478 371989 372933 374079 375082 376025 377205 378478 379204 378918 377811 376360 374684 372442
51475C72442l098l845m344m848n476n793n270m083l039k663k685k660k634k829
$$ 372442 369344 365499 361155 356307 350831 345038 339768 335685 332646 329983 327298 324638 322004 319175
51461C19175k933k341j094p1n6q75j645j651q66K31J105J538J671J812K177K823
$$ 319175 316242 313901 312807 312736 312680 311805 310160 308509 307643 307874 308979 310517 312188 314000 316177 319000
51445C19000L683M695N966P797J0366J3296J5740J6997J6844J5265J2334Q622
$$ 319000 322683 327378 333344 341141 351507 364803 380543 397540 414384 429649 441983 450605
51433D50605N244K889J115r02l104m670n410o243p986j0120j1212j0468q568o992
$$ 450605 455849 458738 459853 458951 455847 451177 445767 439524 431538 421418 410206 399738 391170 384178
51419C84178o595o878o665n463l956l031k669k146j091J47J105J656J839J670
$$ 384178 377583 370705 364040 358577 354621 351590 348921 346775 345684 345831 346936 348592 350431 352101
51405C52101J314J108J251J679K261K797K891K244J147L21J72N31J204K300L870
$$ 352101 353415 354523 355774 357453 359714 362511 365402 367646 368793 369114 369286 369817 371021 373321 377191
51390C77191N590P024P991Q525Q762Q943R331J0051J1292J3547J7235K2032K7125
$$ 377191 382781 389805 397796 406321 415083 424026 433357 443408 454700 468247 485482 507514 534639
51377E34639L2162L7419M2796M7363N0242N1280N0328M6497L9059K8818J7829
$$ 534639 566801 604220 647016 694379 744621 795901 846229 892726 931785 960603 978432
51366I78432P665j493j0180j8663k6784l4065l9775m3224m4388m3995m2796m0931
$$ 978432 986097 984604 974424 955761 928977 894912 855137 811913 767525 723530 680734 639803
51354F39803l8257l5019l1827k8938k5939k2346j8330j4640j1795r681q008o769
$$ 639803 601546 566527 534700 505762 479823 457477 439147 424507 412712 403031 395023 388254
51342C88254o035n483m662l608k794k399k043j428q39p64j288k041k582k668k387
$$ 388254 382219 376736 372074 368466 365672 363273 361230 359802 358963 358199 356911 354870 352288 349620 347233
51327C47233k142k293k689k879k831k986l459l691l205k278j398n42M37J131J024
$$ 347233 345091 342798 340109 337230 334399 331413 327954 324263 321058 318780 317382 316840 317277 318408 319432
51312C19432M31K17O07R96J015J018J273J360Q29k3n42n49m03l54k52J64Q78J510
$$ 319432 319863 320080 320687 321683 322698 323716 324989 326349 327178 327155 326613 326064 325661 325307 325055 325219 326097 327607
51294C27607J525P08n34j530j985k045j703p51N44J368J438J605K684M125M780
$$ 327607 329132 329840 329306 327776 325791 323746 322043 321292 321836 323204 324642 326247 328931 333056 337836
51279C37836M684M986O019O653O027M811L953L075J304q94k063j829j349j419
$$ 337836 342520 347506 353525 360178 366205 371016 374969 378044 379348 378454 376391 374562 373213 371794
51265C71794j395m54R91J934K126J965J565P58k80j131j829k704l649m082l725
$$ 371794 370399 369945 370936 372870 374996 376961 378526 379284 379004 377873 376044 373340 369691 365609 361884
51250C61884k911k125j638j589j964k511k928l107k924k100p58K27J19n98q05
$$ 361884 358973 356848 355210 353621 351657 349146 346218 343111 340187 338087 337329 337556 337675 337077 336272
51235C36272k88J59J38J22L06J01p61j592j782j668j640j314m43J26m01j229q88
$$ 336272 335984 336143 336281 336403 336709 336810 336049 334457 332675 331007 329367 328053 327610 327736 327335 326106 325218
51218C25218N85J672J609J245J392J654J470J281J696K261K051J145O37J208K387
$$ 325218 325803 327475 329084 330329 331721 333375 334845 336126 337822 340083 342134 343279 343916 345124 347511
51203C47511L272L541L512L615L879L890L232K111J236R43O78k25j572k584k999
$$ 347511 350783 354324 357836 361451 365330 369220 372452 374563 375799 376742 377420 377195 375623 373039 370040
51188C70040l189l263k749j474q9P16J022J195J184Q56O95J255K071K079J173
$$ 370040 366851 363588 360839 359365 359276 359992 361014 362209 363393 364249 364944 366199 368270 370349 371522
51173C71522M45N08N18m86k007k775k499j959j613j107l01L17N61J045K141L119
$$ 371522 371967 372475 372993 372507 370500 367725 365226 363267 361654 360547 360246 360563 361124 362169 364310 367429
51157C67429K991J866P91M63O39P02L18m62j242j476r83l41l05q44j167q06k05
$$ 367429 370420 372286 373077 373540 374179 374881 375199 374737 373495 372019 371036 370695 370390 369546 368379 367573 367368
51140C67368j4j54q3K86M50N0o17j040j130j126j131j013p53n39m07q3O69J681
$$ 367368 367354 367200 367117 367403 367853 367903 367286 366246 365116 363990 362859 361846 361093 360554 360147 360064 360733 362414
51122C62414K544L008L040K657J985J412J408K038K826L109K531J265j8m86K38
$$ 362414 364958 367966 371006 373663 375648 377060 378468 380506 383332 386441 388972 390237 390219 389733 389971
51107C89971J653K759K945K437J903J799K085K386K315J817J253J049J253J565
$$ 389971 391624 394383 397328 399765 401668 403467 405552 407938 410253 412070 413323 414372 415625 417190
51093D17190J743J757J621J300Q82N27K10k35p37r46p24l80k40k45k30l55q54
$$ 417190 418933 420690 422311 423611 424493 425020 425230 424995 424258 423312 422588 422208 421968 421723 421493 421138 420284
51076D20284j459j498p28K57P01O30P92J647K792L628M216M996N908O564P253
$$ 420284 418825 417327 416599 416856 417557 418187 418979 420626 423418 427046 431262 436258 442166 448730 455983
51061D55983Q976J2051J5492J8311K0599K2447K2646J9918J5129J0830Q465P417
$$ 455983 464959 477010 492502 510813 531412 553859 576505 596423 611552 622382 630847 638264
51049F38264O953P505R181J0487R797P384M757K559J80k877o368r776j2481j3530
$$ 638264 645217 652722 661903 672390 682187 689571 694328 696887 697067 694190 687822 678046 665565 652035
51035F52035j2307r527o876n625o127q340j1830j5278j7059j6754j5385j3875
$$ 652035 639728 630201 623325 617700 611573 603233 591403 576125 559066 542312 526927 513052
51023E13052j2067r556o704m148j846O90L452N843P471Q560R534J0548J1518J2280
$$ 513052 500985 491429 484725 480577 478731 479421 482873 488716 496187 504747 514281 524829 536347 548627
51009E48627J2583J2122J0850R267Q107P556O922N440L319J500L80o26k002l262
$$ 548627 561210 573332 584182 593449 601556 609112 616034 621474 624793 626293 626673 626047 624045 620783
50995F20783l724l597l588l737l510k803k037j246J9J774L471N033P182J0216
$$ 620783 617059 613462 609874 606137 602627 599824 597787 596541 596560 598334 601805 606838 614020 624236
50981F24236J3239J5193J6160J6975J7891J8303J7721J6432J5268J5016J6020
$$ 624236 637475 652668 668828 685803 703694 721997 739718 756150 771418 786434 802454
50970H02454J8003K0343K2827K5987L0422L5898M1501M6592N1299N5922O0251
$$ 802454 820457 840800 863627 889614 920036 955934 997435 1044027 1095326 1151248 1211499
50959A211499O3688O5952O7405O8529O9158O8426O5613O0880N5034M8602M1504
$$ 1211499 1275187 1341139 1408544 1477073 1546231 1614657 1680270 1741150 1796184 1844786 1886290
50948A886290L3612K5274J7154R798L536j373m739o516o923o644o767q110j0428
$$ 1886290 1919902 1945176 1962330 1972128 1975664 1974291 1969552 1963036 1956113 1949469 1942702 1934592 1924164
50935A924164j2644j4023j4817j5586j6382j6995j7716j9206k1784k5125k8730
$$ 1924164 1911520 1897497 1882680 1867094 1850712 1833717 1816001 1796795 1775011 1749886 1721156
50924A721156l2265l5568l8611m1570m4571m7398m9614n0931n1217n0283m8069
$$ 1721156 1688891 1653323 1614712 1573142 1528571 1481173 1431559 1380628 1329411 1279128 1231059
50913A231059m4972m1647l8430l5302l2351k9757k7308k4476k1266j8481j6762
$$ 1231059 1186087 1144440 1106010 1070708 1038357 1008600 981292 956816 935550 917069 900307
50902I00307j5783j4862j3979j3547j3421j2874j1621j0171q966p724o045m157
$$ 900307 884524 869662 855683 842136 828715 815841 804220 794049 785083 777359 771314 767157
50890G67157k697j940j680j648j663j532j170p18k86L11J177J956K343K828M203
$$ 767157 764460 762520 760840 759192 757529 755997 754827 754109 753823 754134 755311 757267 759610 762438 766641
50875G66641O269P789Q064P905Q472R720J0799J1597J2893J4882J6654J7550J8315
$$ 766641 772910 780699 788763 796668 805140 814860 825659 837256 850149 865031 881685 899235 917550
50862I17550K0116K2878K5472K7347K9176L1745L5024L8753M3246M9007N5880
$$ 917550 937666 960544 986016 1013363 1042539 1074284 1109308 1148061 1191307 1240314 1296194
50851A296194O3266P0982P9341Q8461R8126J08181J18438J28149J36394J43204
$$ 1296194 1359460 1430442 1509783 1598244 1696370 1804551 1922989 2051138 2187532 2330736
50841B330736J49499J55537J60073J61480J59021J52447J41224J25144J05318
$$ 2330736 2480235 2635772 2795845 2957325 3116346 3268793 3410017 3535161 3640479
50832C640479Q3566O1029L8191J5890m727k3115l9122n1882o0024o3157o2186
$$ 3640479 3724045 3785074 3823265 3839155 3834428 3811313 3772191 3720309 3660285 3597128 3534942
50821C534942n7959n0666m0955l0555k1213j3770q801p254r744j5889k4967l6547
$$ 3534942 3476983 3426317 3385362 3354807 3333594 3319824 3311023 3303769 3294025 3278136 3253169 3216622
50809C216622m9897o3617p6660q9112j01163j11885j19892j24703j26652j25893
$$ 3216622 3166725 3103108 3026448 2937336 2836173 2724288 2604396 2479693 2353041 2227148
50799B227148j22433j16755j09554j01142r1802q2294p3213o4238n4977m6081
$$ 2227148 2104715 1987960 1878406 1777264 1685462 1603168 1529955 1465717 1410740 1364659
50789A364659l8518l2124k5991k0066j5123j1310p996n188l689l576l654l002
$$ 1364659 1326141 1294017 1268026 1247960 1232837 1221527 1213531 1208343 1204654 1201078 1197424 1194422
50777A194422k086j833k409l411m592n801o810p648q665r954j1164j2123j3103
$$ 1194422 1192336 1190503 1188094 1184683 1180091 1174290 1167480 1159832 1151167 1141213 1130049 1117926 1104823
50764A104823j4241j5277j6041j6632j6938j6591j5641j4620j3681j2394j0606
$$ 1104823 1090582 1075305 1059264 1042632 1025694 1009103 993462 978842 965161 952767 942161
50753I42161q773p086n067k441L23K798N257Q009J0805J3466J6388J9764K2981
$$ 942161 933388 926302 921235 918794 919117 921915 927172 935181 945986 959452 975840 995604 1018585
50740A018585K5588K8239L1786L5940L9748M3151M7018N1721N6617O1035O4996
$$ 1018585 1044173 1072412 1104198 1140138 1179886 1223037 1270055 1321776 1378393 1439428 1504424
50729A504424O8710P1997P4586P6552P8145P9285P9538P8551P6461P3654P0012
$$ 1504424 1573134 1645131 1719717 1796269 1874414 1953699 2033237 2111788 2188249 2261903 2331915
50718B331915O4565N6241M4903L1276J5976o32j7507l2699m4574n2735n7308n8081
$$ 2331915 2396480 2452721 2497624 2528900 2544876 2544244 2526737 2494038 2449464 2396729 2339421 2281340
50706B281340n5061m9264m2091l4145k5475j6649q789k646J552L447K553j046
$$ 2281340 2226279 2177015 2134924 2100779 2075304 2058655 2049866 2047220 2048772 2052219 2054772 2053726
50694B053726o771j4382k3921l4717m5201n4115o1290o6886p0437p1266o9419
$$ 2053726 2046955 2032573 2008652 1973935 1928734 1874619 1813329 1746443 1676006 1604740 1535321
50683A535321o5672o0768n5080m8862m2374l5699k8772k1688j4786q314k223L571
$$ 1535321 1469649 1408881 1353801 1304939 1262565 1226866 1198094 1176406 1161620 1153306 1151083 1154654
50671A154654Q854J3273J6803J9794K2382K4133K4482K3495K1882K0263J8738
$$ 1154654 1163508 1176781 1193584 1213378 1235760 1259893 1284375 1307870 1329752 1350015 1368753
50660A368753J7183J5715J4677J4362J4810J5713J6576J7235J8173J9873K1973
$$ 1368753 1385936 1401651 1416328 1430690 1445500 1461213 1477789 1495024 1513197 1533070 1555043
50649A555043K3599K4660K6153K8754L1703L3738L4831L6269L9059M2790M6197
$$ 1555043 1578642 1603302 1629455 1658209 1689912 1723650 1758481 1794750 1833809 1876599 1922796
50638A922796M8421M9553N0093N0192M9465M7540M4553M0986L7219L3602L0714
$$ 1922796 1971217 2020770 2070863 2121055 2170520 2218060 2262613 2303599 2340818 2374420 2405134
50627B405134K8990K8065K7014K5133K1785J5561M910r702k5024l7153m3989m5334
$$ 2405134 2434124 2462189 2489203 2514336 2536121 2551682 2556592 2546890 2521866 2484713 2440724 2395390
50615B395390m1723l4296k5080j5965p466O51P800J2792J5331J5954J4379R348
$$ 2395390 2353667 2319371 2294291 2278326 2270860 2271511 2279311 2292103 2307434 2323388 2337767 2347115
50603B347115N66j0355k1562l2619m3761n4313o2925o9010p3010p5416p6240p5470
$$ 2347115 2347681 2337326 2315764 2283145 2239384 2185071 2122146 2053136 1980126 1904710 1828470 1753000
50591A753000p3476p0743o7612o4269o0728n6806n2361m7575m2757l7962l3075
$$ 1753000 1679524 1608781 1541169 1476900 1416172 1359366 1307005 1259430 1216673 1178711 1145636
50580A145636k8321k4333k1490j9362j7073j4200j1069q098n176j993J171L548
$$ 1145636 1117315 1092982 1071492 1052130 1035057 1020857 1009788 1001690 996514 994521 995692 999240
50568I99240M872N802P064Q623J0121J1787J4130J6901J9122K0377K1395K2986
$$ 999240 1004112 1009914 1016978 1025601 1035722 1047509 1061639 1078540 1097662 1118039 1139434 1162420
50556A162420K4891K6234K6726K6896K7217K7603K7796K7758K7496K6874K5940
$$ 1162420 1187311 1213545 1240271 1267167 1294384 1321987 1349783 1377541 1405037 1431911 1457851
50545A457851K5199K5228K6077K7427K9228L1828L5328L9299M3407M7992N3602
$$ 1457851 1483050 1508278 1534355 1561782 1591010 1622838 1658166 1697465 1740872 1788864 1842466
50534A842466O0121O6838P3327P9813Q6632R3723J00763J07362J13097J17795
$$ 1842466 1902587 1969425 2042752 2122565 2209197 2302920 2403683 2511045 2624142 2741937
50524B741937J21922J26161J30350J33289J33803J31647J27015J19681J09140
$$ 2741937 2863859 2990020 3120370 3253659 3387462 3519109 3646124 3765805 3874945
50515C874945R5395P9092O0926M1253K0122k400k5800m8823o9917q8141j03243
$$ 3874945 3970340 4049432 4110358 4151611 4171733 4169333 4143533 4094710 4024793 3936652 3833409
50504C833409j14793j21799j23609j20618j13554j02511q7352o8636m7571k5339
$$ 3833409 3718616 3596817 3473208 3352590 3239036 3136525 3049173 2980537 2932966 2907627
50494B907627l161J7339L4701M8409N8364O3596O2296N3296L6958J4754j1309
$$ 2907627 2904466 2921805 2956506 3004915 3063279 3126875 3189171 3242467 3279425 3294179 3282870
50483C282870l8762o4984q8021j06869j20977j29921j33707j33012j28987j23028
$$ 3282870 3244108 3179124 3091103 2984234 2863257 2733336 2599629 2466617 2337630 2214602
50473B214602j16431j09791j02857r5455q8250q1924p5938o9104o1387n4071m7996
$$ 2214602 2098171 1988380 1885523 1790068 1701818 1619894 1543956 1474852 1413465 1359394 1311398
50462A311398m2761l7900l3733l0345k6775k2112j6769j1837p688m032q12J897
$$ 1311398 1268637 1230737 1197004 1166659 1139884 1117772 1101003 1089166 1081478 1077446 1076634 1078531
50450A078531M516P524J0534J2800J4613J7244K1259K5701K9297L1775L3492L4216
$$ 1078531 1083047 1090571 1101105 1113905 1128518 1145762 1167021 1192722 1222019 1253794 1287286 1321502
50438A321502L2901K8662K1607J2929M376k476o906r124r686q874o881m285j879
$$ 1321502 1354403 1383065 1404672 1417601 1421977 1419501 1412595 1403471 1393785 1384911 1378030 1373745 1371866
50425A371866O4K017M386O896R086J1174J3878J7411K1321K5422L0270L6255M2696
$$ 1371866 1371930 1373947 1378333 1385229 1394315 1405489 1419367 1436778 1458099 1483521 1513791 1550046 1592742
50412A592742M8492N3393N7993O2548O6424O8881O9837O9613O8330O5942O2586
$$ 1592742 1641234 1694627 1752620 1815168 1881592 1950473 2020310 2089923 2158253 2224195 2286781
50401B286781N8571N3975M8521M1824L3666K3989J2745j25j4413k9356m3815n6783
$$ 2286781 2345352 2399327 2447848 2489672 2523338 2547327 2560072 2559947 2545534 2516178 2472363 2415580
50389B415580o7674p6061q1475q3590q2427p8223p1305o2277n2008m1181l0023
$$ 2415580 2347906 2271845 2190370 2106780 2024353 1946130 1874825 1812548 1760540 1719359 1689336
50378A689336j8742p869K082J0974J8596K4127K6623K5882K2349J6279P632l254
$$ 1689336 1670594 1662725 1664807 1675781 1694377 1718504 1745127 1771009 1793358 1809637 1817269 1814015
50366A814015j5379k7518l8516m7258n2929n5579n5943n4609n1680m7323m2144
$$ 1814015 1798636 1771118 1732602 1685344 1632415 1576836 1520893 1466284 1414604 1367281 1325137
50355A325137l6830l1773k7324k4201k3329k5197k9305l4133l7898l9583l9191
$$ 1325137 1288307 1256534 1229210 1205009 1181680 1156483 1127178 1093045 1055147 1015564 976373
50344I76373l7030l3144k7839k2166j7276j3405j0056o963m225j702R17L479N408
$$ 976373 939343 906199 878360 856194 838918 825513 815457 808494 804269 802567 803484 806963 812371
50331H12371O422O672O286N503N041N399N920N492M325L947N096O660P267O954
$$ 812371 818793 825465 831751 837254 842295 847694 853614 859106 863431 867378 872474 879134 886401 893355
50317H93355O561O224N391L979K637J943J864J950J785J395J319K091L539M997
$$ 893355 899916 906140 911531 915510 918147 920090 921954 923904 925689 927084 928403 930494 934033 939030
50303I39030O226P560R098J0424J1439J2784J5106J8417K2499K7299L2666L8493
$$ 939030 945256 952816 961914 972338 983777 996561 1011667 1030084 1052583 1079882 1112548 1151041
50291A151041M5454N4707O6083P7232Q4929Q6393P8815N9418K8263r052m3307
$$ 1151041 1196495 1251202 1317285 1394517 1479446 1565839 1644654 1704072 1732335 1723283 1679976
50280A679976o7178p8686p9912p4097o4407n3805m4339l6446k9649k3799j9216
$$ 1679976 1612798 1534112 1454200 1380103 1315696 1261891 1217552 1181106 1151457 1127658 1108442
50269A108442j5785j2617q903m751r58J893L811N121O188P431R144J0974J2050
$$ 1108442 1092657 1080040 1071137 1066386 1065428 1067321 1071132 1076253 1082441 1089872 1099016 1109990 1122040
50256A122040J2014J1683J2097J3194J4064J4365J4628J5130J5295J4494J2584
$$ 1122040 1134054 1145737 1157834 1171028 1185092 1199457 1214085 1229215 1244510 1259004 1271588
50245A271588R446M744j228p187j1925j5287j7588j8672j8172j6223j3262r546
$$ 1271588 1281034 1285778 1284550 1277363 1265438 1250151 1232563 1213891 1195719 1179496 1166234 1156688
50233A156688n559k537j819l791p963j3708k0276k6340l0468l2185l2095l0946
$$ 1156688 1151129 1148592 1146773 1142982 1135019 1121311 1101035 1074695 1044227 1012042 979947 949001
50221I49001k9114k6922k4766k2803k0854j8834j6897j5096j3208j1047q812p011
$$ 949001 919887 892965 868199 845396 824542 805708 788811 773715 760507 749460 740648 733637
50209G33637o054n811n532m432k496n18P07J019O47k09j323k286k785k792k415
$$ 733637 727583 721772 716240 711808 709312 708794 709501 710520 711167 710958 709635 707349 704564 701772 699357
50194F99357j792j288j383k116k989l581l917m166m378m641n023n241n011m726
$$ 699357 697565 696277 694894 692778 689789 686208 682291 678125 673747 669106 664083 658842 653831 649105
50180F49105m984n387m789l095j692j535j907j817j540j737j969j380j73P24J047
$$ 649105 644121 638734 633945 630850 629158 627623 625716 623899 622359 620622 618653 617273 617100 617824 618871
50165F18871J168J174J104J584K992M414M689M233M562O152Q015R406J0727J2689
$$ 618871 620039 621213 622317 623901 626893 631307 635996 640229 644791 650943 658958 668364 679091 691780
50151F91780J5583J9339K3375K6534K8278K9744L2328L5462L7187L6899L5890
$$ 691780 707363 726702 750077 776611 804889 834633 866961 902423 939610 976509 1012399
50140A012399L5036L3695L1489K9555K9116K9967L1221L2469L3405L3240L1287
$$ 1012399 1047435 1081130 1112619 1142174 1171290 1201257 1232478 1264947 1298352 1331592 1362879
50129A362879K7363K1157J2241J413r111j7827k5354l2680l9010m2614m3170m1933
$$ 1362879 1390242 1411399 1423640 1425053 1415942 1398115 1372761 1340081 1301071 1258457 1215287 1173354
50117A173354l9914l7175l3763l0189k6780k3501k0491j8136j6508j5284j4252
$$ 1173354 1133440 1096265 1062502 1032313 1005533 982032 961541 943405 926897 911613 897361
50106H97361j3417j2635j1652j0499r408q384p294o257n503m916m205l477l185
$$ 897361 883944 871309 859657 849158 839750 831366 824072 817815 812312 807396 803191 799714 796529
50093G96529l441l817l917l796l572k973j484R45L493N016N147M705M741N352
$$ 796529 793088 789271 785354 781558 777986 775013 773529 774474 777967 782983 788130 792835 797576 802928
50079H02928N805N735N511N369M899L763K264Q05o78k201l189l150k612k621l432
$$ 802928 808733 814468 819979 825348 830247 834010 836274 837079 836401 834200 831011 827861 825249 822628 819196
50064H19196m281m439m019l673l925m809n798o115n371l969k654j772j230r49
$$ 819196 814915 810476 806457 802784 798859 794050 788252 782137 776766 772797 770143 768371 767141 766192
50050G66192r01p26J39J805L680N111O051O968Q222R731J1134J2137J2623J2533
$$ 766192 765291 764565 764704 766509 770189 775300 781351 788319 796541 806272 817406 829543 842166 854699
50036H54699J1892J1028J0577J1007J2042J2934J3347J3776J4926J6840J8934
$$ 854699 866591 877619 888196 899203 911245 924179 937526 951302 966228 983068 1002002
50025A002002K0674K2025K3163K3982K4019K2927K0912J8629J6684J5382J4821
$$ 1002002 1022676 1044701 1067864 1091846 1115865 1138792 1159704 1178333 1195017 1210399 1225220
50014A225220J4870J4862J3795J1038O682R70o056j3977k1702k8408l4331l9796
$$ 1225220 1240090 1254952 1268747 1279785 1286467 1287437 1281381 1267404 1245702 1217294 1182963 1143167
50002A143167m3878m5128m3467m0225l6273l1323k5354j9454j4587j0557o892
$$ 1143167 1099289 1054161 1010694 970469 934196 902873 877519 858065 843478 832921 826029
49991H26029l957k361j941k078k522l225l926m632n894p899r869j1174j2381j4140
$$ 826029 822072 819711 817770 815692 813170 809945 806019 801387 795493 787594 777725 766551 754170 740030
49977G40030j5655j5544j3968j2515j1997j1624j0681r624q986q261o788n022
$$ 740030 724375 708831 694863 682348 670351 658727 648046 638422 629436 621175 614387 609365
49965F09365m040m108m524m676m561m344l971l385k729k137j535p58K57J462K778
$$ 609365 605325 601217 596693 592017 587456 583112 579141 575756 573027 570890 569355 568597 568854 570316 573094
49950E73094M117N389O604P972R748J1805J3351J3386J1623Q919O614N412M948
$$ 573094 577211 582600 589204 597176 606924 618729 632080 645466 657089 666008 672622 678034 682982
49937F82982M388L294J883N58p04k411m960q115j1171j3523j4843j4936j3851
$$ 682982 687370 690664 692547 693105 692401 689990 685030 676915 665744 652221 637378 622442 608591
49924F08591j2210j0848r918q732o751m402k488j151N0J242J979J987J586J210
$$ 608591 596381 585533 575615 566883 560132 555730 553242 552091 552141 553383 555362 557349 558935 560145
49910E60145Q83N39N50J415K953M255M703M762N341O531P534P934Q398R709J1539
$$ 560145 561028 561567 562117 563532 566485 570740 575443 580205 585546 592077 599611 607545 615943 625652 637191
49895F37191J2748J2635J1359R382P148N163L692K286L40j932l720m890o174p903
$$ 637191 649939 662574 673933 683315 690463 695626 699318 701604 701944 700012 696292 691402 685228 677325
49881F77325r429j0150j0352j0512j0567j0431j0552j1139j1440j0577q780o994
$$ 677325 667896 657746 647394 636882 626315 615884 605332 594193 582753 572176 563396 556402
49869E56402n610m277k752j227R6J146J838K335L180M631O069O780P027P637Q698
$$ 556402 550792 546515 543763 542536 542632 543778 545616 547951 551131 555762 561831 568611 575638 583275 591973
49854E91973R502R732R832J0123J0332J0220R956R595Q808P421N766M168K620
$$ 591973 601475 611207 621039 631162 641494 651714 661670 671265 680073 687494 693260 697428 700048
$$ [...]
##END NTUPLES=NMR SPECTRUM
##END=
