
##TITLE=AC1320_SSOAH12149_6608770_IfrrvIvZNJ
##JCAMPDX= 6.0         $$ Bruker NMR JCAMP-DX V2.0
##DATA TYPE= NMR SPECTRUM
##DATA CLASS= NTUPLES
##ORIGIN= BRUKER
##OWNER= Administrator
$$ 1.72 TOPSPIN		Version 2.1
$$ 2012-08-02 15:35:07.531 -0500  Administrator@TOPSPIN
$$ Compression mode = diff/dup
##.OBSERVE FREQUENCY= 400.02188249412
##.OBSERVE NUCLEUS= ^1H
##.ACQUISITION MODE= SIMULTANEOUS (DQD)
##.ACQUISITION SCHEME= undefined
##.AVERAGES= 64
##.DIGITISER RES= 22
##SPECTROMETER/DATA SYSTEM= spect
##.PULSE SEQUENCE= noesygpps1d.comp
##.SOLVENT NAME= COFFEE_meoh
##.SHIFT REFERENCE= INTERNAL, COFFEE_meoh, 1, 14.9626
##AUDIT TRAIL= $$ (NUMBER, WHEN, WHO, WHERE, PROCESS, VERSION, WHAT)
$$ ##TITLE= Audit trail, TOPSPIN		Version 2.1
$$ ##JCAMPDX= 5.01
$$ ##ORIGIN= Bruker BioSpin GmbH
$$ ##OWNER= Administrator
$$ $$ C:\Bruker\TOPSPIN/data/COFFEE/nmr/AC1320_SSOAH12149_6608770_IfrrvIvZNJ/12/pdata/1/auditp.txt
$$ ##AUDIT TRAIL=  $$ (NUMBER, WHEN, WHO, WHERE, PROCESS, VERSION, WHAT)
(   1,<2012-08-01 17:08:20.312 -0500>,<Administrator>,<TOPSPIN>,<go>,<TOPSPIN 2.1>,
      <created by zg
	started at 2012-08-01 16:56:49.718 -0500,
	POWCHK enabled, PULCHK disabled,
       configuration hash MD5:
       6B 1B 68 BB D9 2E 58 E2 7F 35 AD 54 07 DF 0E 41
       data hash MD5: 64K
       24 B2 83 6A CE B1 78 53 D7 8D 43 14 DA 48 13 FB>)
(   2,<2012-08-01 17:08:24.234 -0500>,<Administrator>,<TOPSPIN>,<proc1d>,<TOPSPIN 2.1>,
      <Start of raw data processing
       efp LB = 0.3 FT_mod = 6 PKNL = 1 PHC0 = 0 PHC1 = 0 SI = 128K 
       data hash MD5: 128K
       DD 01 5D 9C 63 A5 AE 84 03 DA 4C 5E B6 F6 B3 55>)
(   3,<2012-08-01 17:08:26.296 -0500>,<Administrator>,<TOPSPIN>,<proc1d>,<TOPSPIN 2.1>,
      <pk PHC0 = 0.2636719 PHC1 = 0 
       data hash MD5: 128K
       37 CB 00 28 21 7C D6 2D 12 17 40 3E 0D CA 6D B1>)
(   4,<2012-08-01 17:08:28.859 -0500>,<Administrator>,<TOPSPIN>,<proc1d>,<TOPSPIN 2.1>,
      <abs ABSG = 1 
       data hash MD5: 128K
       48 41 BC 2F BE EC AF 6F 11 94 1F C8 0D CC A8 EC>)
(   5,<2012-08-01 17:08:29.406 -0500>,<Administrator>,<TOPSPIN>,<proc1d>,<TOPSPIN 2.1>,
      <abs ABSG = 2 
       data hash MD5: 128K
       2D 35 71 85 99 CB 5B B3 1E 7C 94 73 C9 05 7D 25>)
(   6,<2012-08-01 17:08:29.859 -0500>,<Administrator>,<TOPSPIN>,<proc1d>,<TOPSPIN 2.1>,
      <abs ABSG = 3 
       data hash MD5: 128K
       B1 08 B0 16 92 A7 EF E9 64 E1 72 E2 B5 B5 BA 5F>)
(   7,<2012-08-01 17:08:30.515 -0500>,<Administrator>,<TOPSPIN>,<proc1d>,<TOPSPIN 2.1>,
      <abs ABSG = 4 
       data hash MD5: 128K
       7C D9 46 66 60 5E 39 25 F9 A5 E3 BF 5F A6 D6 72>)
(   8,<2012-08-01 17:08:30.937 -0500>,<Administrator>,<TOPSPIN>,<proc1d>,<TOPSPIN 2.1>,
      <abs ABSG = 5 
       data hash MD5: 128K
       97 14 51 7B 1B C5 36 AD D9 B6 0D 05 4B F2 21 4D>)
(   9,<2012-08-01 17:09:28.187 -0500>,<Administrator>,<TOPSPIN>,<audit>,<TOPSPIN 2.1>,
      <user comment:
       ICON-NMR User ID: COFFEE
       data hash MD5: 128K
$$ [...]
150 150 150 150 150 150 150 150
##$TP07= 0
##$TPNAME0= <>
##$TPNAME1= <>
##$TPNAME2= <>
##$TPNAME3= <>
##$TPNAME4= <>
##$TPNAME5= <>
##$TPNAME6= <>
##$TPNAME7= <>
##$TPOAL= (0..7)
0.5 0.5 0.5 0.5 0.5 0.5 0.5 0.5
##$TPOFFS= (0..7)
0 0 0 0 0 0 0 0
##$TUNHIN= 0
##$TUNHOUT= 0
##$TUNXOUT= 0
##$USERA1= <user>
##$USERA2= <user>
##$USERA3= <user>
##$USERA4= <user>
##$USERA5= <user>
##$V9= 5
##$VALIST= <valist>
##$VCLIST= <CCCCCCCCCCCCCCC>
##$VD= 0
##$VDLIST= <DDDDDDDDDDDDDDD>
##$VPLIST= <PPPPPPPPPPPPPPP>
##$VTLIST= <TTTTTTTTTTTTTTT>
##$WBST= 1024
##$WBSW= 4
##$XGAIN= (0..3)
0 0 0 0
##$XL= 0
##$YL= 0
##$YMAX_a= 16666826
##$YMIN_a= -9547183
##$ZGOPTNS= <>
##$ZL1= 120
##$ZL2= 120
##$ZL3= 120
##$ZL4= 120
##$ABSF1= 14.9626
##$ABSF2= -5.595582
##$ABSG= 5
##$ABSL= 3
##$ALPHA= 0
##$AQORDER= 0
##$ASSFAC= 0
##$ASSFACI= 0
##$ASSFACX= 0
##$ASSWID= 0
##$AUNMP= <proc_prof1d_extract.lims>
##$AXLEFT= 0
##$AXNAME= <>
##$AXNUC= <1H>
##$AXRIGHT= 0
##$AXTYPE= 0
##$AXUNIT= <>
##$AZFE= 0.1
##$AZFW= 0.1
##$BCFW= 0
##$BC_mod= 0
##$BYTORDP= 0
##$COROFFS= 0
##$CY= 15
##$DATMOD= 1
##$DC= 0
##$DFILT= <>
##$DTYPP= 0
##$F1P= 0
##$F2P= 0
##$FCOR= 0.5
##$FTSIZE= 131072
##$FT_mod= 6
##$GAMMA= 0
##$GB= 0
##$INTBC= 1
##$INTSCL= 1
##$ISEN= 128
##$LB= 0.3
##$LEV0= 0
##$LPBIN= 0
##$MAXI= 10000
##$MC2= 0
##$MEAN= 0
##$ME_mod= 0
##$MI= 0
##$NCOEF= 0
##$NC_proc= -2
##$NLEV= 6
##$NOISF1= 0
##$NOISF2= 0
##$NSP= 0
##$NTH_PI= 0
##$NZP= 0
##$OFFSET= 14.9626
##$PC= 1
##$PHC0= 0.2636719
##$PHC1= 0
##$PH_mod= 1
##$PKNL= yes
##$PPARMOD= 0
##$PPDIAG= 0
##$PPIPTYP= 0
##$PPMPNUM= 2147483647
##$PPRESOL= 1
##$PSCAL= 4
##$PSIGN= 0
##$PYNMP= <proc.py>
##$REVERSE= no
##$SF= 400.020008997062
##$SI= 131072
##$SIGF1= 0
##$SIGF2= 0
##$SINO= 400
##$SIOLD= 131072
##$SPECTYP= <>
##$SREGLST= <1H.CDCl3>
##$SSB= 0
##$STSI= 131072
##$STSR= 0
##$SW_p= 8223.68421052631
##$SYMM= 0
##$S_DEV= 0
##$TDeff= 65536
##$TDoff= 0
##$TI= <>
##$TILT= no
##$TM1= 0
##$TM2= 0
##$TOPLEV= 0
##$USERP1= <user>
##$USERP2= <user>
##$USERP3= <user>
##$USERP4= <user>
##$USERP5= <user>
##$WDW= 1
##$XDIM= 131072
##$YMAX_p= 451779353
##$YMIN_p= -11824
##$CURPLOT= <Network HP LaserJet P1505>
##$CURPRIN= <$Network HP LaserJet P1505>
##$DFORMAT= <normdp>
##$LAYOUT= <+/1D_H.xwp>
##$LFORMAT= <normlp>
##$PFORMAT= <normpl>
##$SURQMSG= 1
$$ End of Bruker specific parameters
$$ ---------------------------------
##NTUPLES= NMR SPECTRUM
##VAR_NAME=  FREQUENCY,     SPECTRUM/REAL,   SPECTRUM/IMAG
##SYMBOL=    X,             R,               I
##VAR_TYPE=  INDEPENDENT,   DEPENDENT,       DEPENDENT
##VAR_FORM=  AFFN,          ASDF,            ASDF
##VAR_DIM=   131072,        131072,          131072
##UNITS=     HZ,            ARBITRARY UNITS, ARBITRARY UNITS
##FACTOR=    0.0627417313425164, 1,          1
##FIRST=     8223.62146879497, 178,          -60007
##LAST=      0,             1923,            -60029
##MIN=       0,             -11824,          0
##MAX=       8223.62146879497, 451779353,    0
$$ Real data points
##PAGE= N=1
##DATA TABLE= (X++(R..R)), XYDATA
$$ [...]
60941B2808567l050488k701669k326526j978598j674109j406500j173983r81555
60933G515139q25288o93026n79533m88328m19349l65628l21919k87430k60000
60924C274638k35380k12580j93355j76620j59144j41131j25398j11755r7786q4534
60914A736955p5845p2355p0985o9959o9495o8210o3798n7120n1245m6649m1487
60903A049807l5978l2148k9710k6495k2746k0724k0206j8499j5006j1855r926
60892H06514p924n518l808k561l47K413L808L810M194N194N276M170L062J963
60878H20246j12k594l968m708o553r214j0797j1216j1944j2738j1981j0193r734
60865G14494j0850j1304j0224r101q653p800o260n132m417k774l63R59Q79J328
$$ y = [22808567, 19758079, 17056410, 14729884, 12751286, 11077177, 9670677, 8496694, 7515139, 6689851, 5996825, 5417292, 4928964, 4509615, 4143987, 3822068, 3534638, 3274638, 3039258, 2826678, 2633323, 2456703, 2297559, 2156428, 2031030, 1919275, 1821489, 1736955, 1661110, 1588755, 1517770, 1447811, 1378316, 1310106, 1246308, 1189188, 1137943, 1091294, 1049807, 1013829, 981681, 951971, 925476, 902730, 882006, 861800, 843301, 828295, 816440, 806514, 798590, 793072, 789264, 786703, 786356, 788769, 792577, 796387, 800581, 805775, 811051, 815221, 818283, 820246, 820134, 817540, 813572, 808864, 802311, 793097, 782300, 771084, 759140, 746402, 734421, 724228, 714494, 703644, 692340, 682116, 673015, 664362, 656562, 650302, 645170, 640753, 637979, 637616, 638575, 639454, 640782]
60851F40782L244N219O170O899Q188R563J0758J2412J4611J6478J7691J8640J9042
60838G89697J8245J6910J6391J6423J5638J4197J3567J3628J2575R969P378N584
60826I50202L644J307m1L39J419K282L049L308J790j520m793o739p956r291j0582
60811I26418j1688j3148j4993j6345j6814j6977j7021j6298j4741j3320j2587
60800G62486j2005j1073r950q765p493o520o147n575l834j552k80j31L09J716
60786F91186L380M834O430Q093R091R429R965J0905J1576J1817J2223J2896J3248
60773H15073J3198J3201J3135J2468J1500J1037J0986J0578R845R358Q800P413
60761I46592N652M783M938N078M795M532M204L290K120J501J200L89o95j204j364
$$ y = [640782, 644026, 649245, 655415, 662314, 670502, 680065, 690823, 703235, 717846, 734324, 752015, 770655, 789697, 807942, 824852, 841243, 857666, 873304, 887501, 901068, 914696, 927271, 937240, 944618, 950202, 953846, 955153, 955112, 955451, 956870, 959152, 962201, 965509, 967299, 965779, 960986, 954247, 946291, 937000, 926418, 914730, 901582, 886589, 870244, 853430, 836453, 819432, 803134, 788393, 775073, 762486, 750481, 739408, 729458, 720693, 713200, 706680, 700533, 694958, 691124, 689572, 689292, 689161, 689470, 691186, 694566, 699400, 705830, 713923, 723014, 732443, 742408, 753313, 764889, 776706, 788929, 801825, 815073, 828271, 841472, 854607, 867075, 878575, 889612, 900598, 911176, 921021, 930379, 939179, 946592, 952244, 957027, 961965, 967043, 971838, 976370, 980574, 983864, 985984, 987485, 988685, 989074, 988379, 987175, 985811]
60746I85811j924k300j379J92O00l87j463k351m014o317p815q247q903j0204j1023
60731I20276j0909j0827j1183j1111j0244r309q488p050n047l538k685j525L0
60718H28390Q87Q61R89J362P45j040k505k946l476m702n416m651l326k727k806
60703G99639k923k854k315q65J014K053J949J697J715J276J52q43j499k694m622
60688G90880o324p531r245j1684j3493j3809j3480j3373j3105j2358j1791j1620
60676F53067j0865r057p348o807o945o743n965m613k398L41K436L378L894M441
60662F06816M443L698L041K814K181Q73J42Q70K034K199J479R47J049J624K601
60647F36811L773M639N127N748O457O422N411M356L935L798L734M378N953P431
$$ y = [985811, 983887, 981587, 980208, 980400, 981000, 980613, 979150, 976799, 972785, 966468, 958653, 950406, 941503, 931299, 920276, 909367, 898540, 887357, 876246, 866002, 856693, 848205, 841155, 836108, 832570, 829885, 828360, 828390, 829277, 830138, 831127, 832489, 833234, 832194, 829689, 826743, 823267, 818565, 813149, 808498, 805172, 802445, 799639, 796716, 793862, 791547, 790682, 791696, 793749, 795698, 797395, 799110, 800386, 800538, 799695, 798196, 795502, 790880, 784556, 777025, 767780, 756096, 742603, 728794, 715314, 701941, 688836, 676478, 664687, 653067, 642202, 633145, 625797, 618990, 612045, 605302, 599337, 594724, 592326, 592667, 595103, 598481, 602375, 606816, 611259, 614957, 617998, 620812, 622993, 623866, 624008, 624878, 626912, 629111, 630590, 631537, 632586, 634210, 636811, 640584, 645223, 650350, 656098, 662555, 668977, 674388, 678744, 682679, 686477, 690211, 694589, 700542, 707973]
60633G07973P874P714P939Q851J0268J2068J3902J5143J5688J6096J6577J6664
60621H56757J6162J5487J4748J3391J1111Q257N197K149m32k323m258o904r358
60608I19984j0193r830j0067j1118j1151r160o386m190k389n48Q17J289J404J508
60594H49970R85n22k293l594m489n054m957m234l340k174l80J286J486M51k03
60579H22938q0m75j794k608k128j577k033k737k650k019j303j44J423K355K270
60564H09438K255K954L296K303P58j75o24j219j841k299l009m030m575m385m230
60549G94617m256l307q64J868L880N836Q462J0904J2070J2429J3203J4862J7422
60536H87126K1187K6066L1249L6491M2511M9352N5545N9716O1531O0228N3988
$$ y = [707973, 715847, 723561, 731500, 740351, 750619, 762687, 776589, 791732, 807420, 823516, 840093, 856757, 872919, 888406, 903154, 916545, 927656, 935913, 941110, 943259, 942827, 940504, 936246, 929342, 919984, 909791, 899961, 889894, 878776, 867625, 858465, 852079, 847889, 845500, 844952, 845769, 847058, 848462, 849970, 850955, 850433, 848140, 844546, 840057, 835003, 830046, 825812, 822472, 820298, 819918, 821204, 822690, 823141, 822938, 822858, 822383, 820589, 817981, 815853, 814276, 812243, 809506, 806856, 804837, 803534, 803390, 804813, 807168, 809438, 811693, 814647, 817943, 820246, 821004, 820829, 820205, 818986, 817145, 814846, 811837, 807807, 803232, 798847, 794617, 790361, 787054, 786190, 788058, 791938, 797774, 806236, 817140, 829210, 841639, 854842, 869704, 887126, 908313, 934379, 965628, 1002119, 1044630, 1093982, 1149527, 1209243, 1270774, 1331002, 1384990]
60525A384990M2048K6148Q760q645k4656l7014m4246m7046m6719m3512l7602l0315
60513A142191k2972j5689q463k163K688O694J0060J1736J1363J0478J0491J0924
60501A167338J1055J1612J3411J5915J8815K3378L0460L8679M6542N4933O5475
60490A497613P7758R0364J03461J17994J33166J47059J59315J71323J84311J99144
60480B881508K17466K41176K70950L06180L44781L80601M01943L95863L55222
60471E795690K81118J79725N9269o9808j94507l01286l79444m24042m37220m26578
60461D082917m00884l66641l28235k89535k53597k21394j92395j66381j43799
60452A720056j24819j09031r5843q4462p4055o4575n6685n0342m4448l8549l3689
$$ y = [1384990, 1427038, 1453186, 1461946, 1453301, 1428645, 1391631, 1347385, 1300339, 1253620, 1210108, 1172506, 1142191, 1119219, 1103530, 1095067, 1092904, 1095592, 1102286, 1112346, 1124082, 1135445, 1145923, 1156414, 1167338, 1178393, 1190005, 1203416, 1219331, 1238146, 1261524, 1291984, 1330663, 1377205, 1432138, 1497613, 1575371, 1665735, 1769196, 1887190, 2020356, 2167415, 2326730, 2498053, 2682364, 2881508, 3098974, 3340150, 3611100, 3917280, 4262061, 4642662, 5044605, 5440468, 5795690, 6076808, 6256533, 6315802, 6245994, 6051487, 5750201, 5370757, 4946715, 4509495, 4082917, 3682033, 3315392, 2987157, 2697622, 2444025, 2222631, 2030236, 1863855, 1720056, 1595237, 1486206, 1390363, 1305901, 1231846, 1167271, 1110586, 1060244, 1015796, 977247, 943558]
60441I43558l0587k8190k5255k2190k0171j9320j9006j8811j8235j6569j4196
60430G11028j2683j2419j1594q931n873m412m221l833l239l202l137k014n02k2
60416F34946l53k06L78L45k21k96J00J47N0P00J735J918J299J217K110L048L444
60399F50361L708M160M663N299O199O897O952O875P231P413O493M852L593K880
60385G27576K157J442J024M75o16j522j488j245j930l104l491l057k738k657k308
60370G08518j981k203k298j295J17L89l59m89O12J824K175J875J502J492K287
60355G12166L776M890M917M726N387O360O560O375O847P562P425O980P727R447
60341H01145J0424J0305J0548J1799J2846J2667J1707J0663R513Q184O933N777
$$ y = [943558, 912971, 884781, 859526, 837336, 817165, 797845, 778839, 760028, 741793, 725224, 711028, 698345, 685926, 674332, 665401, 659528, 655116, 650895, 647062, 643823, 640621, 637484, 635470, 634968, 634946, 634593, 634387, 634765, 635110, 634889, 634593, 634693, 634840, 634890, 635590, 637325, 639243, 640542, 641759, 643869, 646917, 650361, 654069, 658229, 662892, 668191, 674390, 681287, 688239, 695114, 702345, 709758, 716251, 721103, 724696, 727576, 729733, 731175, 732199, 732674, 732058, 730536, 729048, 727803, 725873, 722769, 719278, 716221, 713483, 710826, 708518, 706537, 704334, 702036, 700741, 700858, 701247, 700888, 700399, 701011, 702835, 705010, 706885, 708387, 709879, 712166, 715942, 720832, 725749, 730475, 735862, 742222, 748782, 755157, 762004, 769566, 776991, 783971, 791698, 801145, 811569, 821874, 832422, 844221, 857067, 869734, 881441, 892104, 901617, 909801, 916734, 922511]
60329I22511M637M064M708O139P494R064J1905J5910J9661K2025K2661K1198J7373
60316A089350J1917N962k94p096j3671j8676k1757k3341k3312k1518j9101j7587
60304I40876j6796j5318j2974j1014j0079r511q793q032p015n275l181j545k26
60291H31117J582L668M820M446L049J337Qq1J137K295K256J792K212L110L250
60276H65998K877L190M069M497M751N975P878R027R352J0149J1669J2823J3370
60263I65625J4363J6221J8295K0437K3151K6172K8747L1284L4858L9177M3039
60252A261369M6669N1474N7474O3262O8566P4661Q1953Q9445R6860J05038J13822
60241B110593J21708J28117J33900J39091J42167J42161J39560J34566J26413
$$ y = [922511, 927148, 931212, 935920, 942059, 949553, 958617, 970522, 986432, 1006093, 1028118, 1050779, 1071977, 1089350, 1101267, 1107229, 1106935, 1099839, 1086168, 1067492, 1045735, 1022394, 999082, 977564, 958463, 940876, 924080, 908762, 895788, 884774, 874695, 865184, 856391, 848359, 841344, 836069, 832888, 831343, 831117, 832699, 836367, 841187, 845633, 848682, 850019, 850027, 849946, 851083, 853378, 855634, 857426, 859638, 862748, 865998, 868875, 872065, 876134, 880631, 885382, 891357, 899235, 908262, 917614, 927763, 939432, 952255, 965625, 979988, 996209, 1014504, 1034941, 1058092, 1084264, 1113011, 1144295, 1179153, 1218330, 1261369, 1308038, 1359512, 1416986, 1480248, 1548814, 1623475, 1705428, 1794873, 1891733, 1996771, 2110593, 2232301, 2360418, 2494318, 2633409, 2775576, 2917737, 3057297, 3191863, 3318276]
60232C318276J15042J01624Q6894P0687N3473L6484J9852K575j5123l1276m4509
60221C713999n5048o2954o7285o7632o4743n9055n0408l9571k8196j6701m056
60210C198350R925K4057L7952N2670O8496Q4131R8712J12654J25774J36519J43846
60199D093086J47947J48497J44188J34822J21878J06250Q7393O5645M3170K1451
60189E114327k36k2671m4719o4756q2435r7766j09856j17725j21269j20537j15274
60178D217083j05903r3681p9385o3127m5732k8620j1917N515K3698M0968N6226
60167C915125O9756Q1322Q9607R4108R5470R3230Q5719P3153N8506M4133K9714
60156D729843J4648Qj3355k6258l8906m9026n4172n4336n0660m3314l2247j8505
$$ y = [3318276, 3433318, 3534942, 3621836, 3692523, 3745996, 3782480, 3802332, 3804907, 3789784, 3758508, 3713999, 3658951, 3595997, 3528712, 3461080, 3396337, 3337282, 3286874, 3247303, 3219107, 3202406, 3198350, 3208275, 3232332, 3270284, 3322954, 3391450, 3475581, 3574293, 3686947, 3812721, 3949240, 4093086, 4241033, 4389530, 4533718, 4668540, 4790418, 4896668, 4984061, 5049706, 5092876, 5114327, 5114091, 5091420, 5046701, 4981945, 4899510, 4801744, 4691888, 4574163, 4452894, 4332357, 4217083, 4111180, 4017499, 3938114, 3874987, 3829255, 3800635, 3788718, 3794233, 3817931, 3858899, 3915125, 3984881, 4066203, 4155810, 4249918, 4345388, 4438618, 4524337, 4597490, 4655996, 4700129, 4729843, 4744491, 4744499, 4731144, 4704886, 4665980, 4616954, 4562782, 4508446, 4457786, 4414472, 4382225, 4363720]
60144D363720k938J5040L5756N7680P9113J00389J22942J47271J73107K00400
60134E292480K28884K57746K86831L16941L47847L77417M03699M26359M44934
60125H383138M57380M61876M58471M47357M27089L96327L56214L09221K56534
60116A1953607J98165J34857O8341K58o8012j35056j99724k60834l15832l60954
60106A1014816l93597m13522m21257m16890m01348l77191l46817l11259k71643
60097G661292k30209j88620j46794j04629o3372k4076J3715N0225Q3871J12775
60087G164178J36395J54197J64309J65142J57164J41595J18839Q9638N6439K1871
60077H369767j2878m6834p7964j04905j28613j50380j69470j84483j95874k05061
$$ y = [4363720, 4360782, 4375822, 4411578, 4469258, 4548371, 4648760, 4771702, 4918973, 5092080, 5292480, 5521364, 5779110, 6065941, 6382882, 6730729, 7108146, 7511845, 7938204, 8383138, 8840518, 9302394, 9760865, 10208222, 10635311, 11031638, 11387852, 11697073, 11953607, 12151772, 12286629, 12354970, 12355228, 12287216, 12152160, 11952436, 11691602, 11375770, 11014816, 10621219, 10207697, 9786440, 9369550, 8968202, 8591011, 8244194, 7932935, 7661292, 7431083, 7242463, 7095669, 6991040, 6927668, 6903592, 6917307, 6967532, 7051403, 7164178, 7300573, 7454770, 7619079, 7784221, 7941385, 8082980, 8201819, 8291457, 8347896, 8369767, 8356889, 8310055, 8232091, 8127186, 7998573, 7848193, 7678723, 7494240, 7298366, 7093305]
60067G093305k11899k14999k13829k08870k00440j88960j75664j61525j46094
60058E371025j28721j10038r0977p1327n0664k9670r005J2095L4502N7382P9238
60047E063840R9826J19430J37028J50794J59789J63748J61939J53695J39537J20618
60037F470244R7717P1676M3809J4808j5631m7025p7131j03961j27434j47767j63648
60026F015657j73611j77952j77725j73073j64130j52296j38921j23816j06659
60017D627474q8655p1061n3298l4297j4533N031K4884M6005O8113R0597J13915
60006D714175J38141J61296J81278J98187K12621K22694K25248K19344K06299
59997F479283J87046J61747J31580R8626O4128K8508p307m2332p6508j09456j38940
$$ y = [7093305, 6881406, 6666407, 6452578, 6243708, 6043268, 5854308, 5678644, 5517119, 5371025, 5242304, 5132266, 5041289, 4969962, 4919298, 4889628, 4880623, 4892718, 4927220, 4984602, 5063840, 5163666, 5283096, 5420124, 5570918, 5730707, 5894455, 6056394, 6210089, 6349626, 6470244, 6567961, 6639637, 6683446, 6698254, 6682623, 6635598, 6558467, 6454506, 6327072, 6179305, 6015657, 5842046, 5664094, 5486369, 5313296, 5149166, 4996870, 4857949, 4734133, 4627474, 4538819, 4467758, 4414460, 4380163, 4365630, 4370661, 4395545, 4441550, 4509663, 4600260, 4714175, 4852316, 5013612, 5194890, 5393077, 5605698, 5828392, 6053640, 6272984, 6479283, 6666329, 6828076, 6959656, 7058282, 7122410, 7150918, 7143611, 7101279, 7024771, 6915315, 6776375]
59986F776375j62411j79269j89893j93516j89317j78746j64395j47154j26783
59977E244891j04564q2741o1628l9856j7401M064K3932M3372O2908Q1392R7705
59966E252074J11683J22984J30777J34874J35787J33529J27735J18880J07954
59957F376277R5078P9894O3207M6701L1247J6969M760l878q427r288o255J585
59945F687870J4571L2451N5344Q3346J15472J50381J87943K28674K71986L16317
59935H144355L60504M03716M44369M80378N09764N29626N35290N22110M87696
59926A2417808M31329L52714K53560J39660J9172j00778k14224l14496l95385
59917A2589360m54364m92621n12095n14445n02457m79848m49223m12089l70732
$$ y = [6776375, 6613964, 6434695, 6244802, 6051286, 5861969, 5683223, 5518828, 5371674, 5244891, 5140327, 5057586, 4995958, 4956102, 4938701, 4942765, 4966697, 5010069, 5072977, 5154369, 5252074, 5363757, 5486741, 5617518, 5752392, 5888179, 6021708, 6149443, 6268323, 6376277, 6471355, 6551249, 6614456, 6661157, 6692404, 6709373, 6714133, 6710255, 6701828, 6692540, 6686285, 6687870, 6702441, 6734892, 6790236, 6873582, 6989054, 7139435, 7327378, 7556052, 7828038, 8144355, 8504859, 8908575, 9352944, 9833322, 10343086, 10872712, 11408002, 11930112, 12417808, 12849137, 13201851, 13455411, 13595071, 13614243, 13513465, 13299241, 12984745, 12589360, 12134996, 11642375, 11130280, 10615835, 10113378, 9633530, 9184307, 8772218, 8401486]
59908H401486l27964k84968k41342j97423j54616j13399p2968l3118N389M2414
59898G023491P8650J13919J46973J77018K03711K25494K39576K43818K37186K18551
59888H908387J86772J42210Q6843K3091m5963j15674j81111k39251k88494l26744
59878H150066l52174l65580l69662l65869l54115l35566l13278k89543k64763
59869E139516k39353k14700j91452j68791j46149j24272j04080q5855o9953n7003
59859C737908m7079l9867l5656l4792l6307l8599m1223m4299m6497m5688m1651
59848C286250l6169l0302k3529j5778q218j781L203N527L296l757j3774k4958
59836C140010l6511m7264n5327n9918o1848o1681n8958n3713m7180m0322l3138
$$ y = [8401486, 8073522, 7788554, 7547212, 7349789, 7195173, 7081774, 7008806, 6975688, 6981077, 7023491, 7102141, 7216060, 7363033, 7540051, 7743762, 7969256, 8208832, 8452650, 8689836, 8908387, 9095159, 9237369, 9324212, 9347303, 9301340, 9185666, 9004555, 8765304, 8476810, 8150066, 7797892, 7432312, 7062650, 6696781, 6342666, 6007100, 5693822, 5404279, 5139516, 4900163, 4685463, 4494011, 4325220, 4179071, 4054799, 3950719, 3864864, 3794911, 3737908, 3690829, 3650962, 3615306, 3580514, 3544207, 3505608, 3464385, 3420086, 3373589, 3327901, 3286250, 3250081, 3219779, 3196250, 3180472, 3172254, 3170473, 3173676, 3179203, 3182499, 3178742, 3164968, 3140010, 3103499, 3056235, 3000908, 2940990, 2879142, 2817461, 2758503, 2704790, 2657610, 2617288, 2584150]
59825B584150k5772j8879j2434n586J899R411J6857K4798L3072M0869M8467N7174
59813B754026O7188P6972Q5099R1114R4246R3021Q6955P7428O6363N5022M4190
59802C591624L4335K5226J6381P907O3p481j4626j9592k0255j6446r455J51J2485
59789C600317K6785M2070N8907P8371R9670J21181J43610J69542J99794K32835
59779D773082K68007L06730L49807L95681M41473M82788N11224N14402M80458
59770H523652M03100K84300J35684k2380j67021k81705l60180m03501m16220m05301
59760G290428l78965l43987l04620k64147k25388j89294j55169j23011r3917o8099
59750E143831m4569k3025l782J4355L3463N3350P1673Q7934J04587J23299J42951
$$ y = [2584150, 2558378, 2539499, 2527065, 2521479, 2523378, 2532789, 2549646, 2574444, 2607516, 2648385, 2696852, 2754026, 2821214, 2898186, 2983285, 3074399, 3168645, 3261666, 3348621, 3426049, 3492412, 3547434, 3591624, 3625959, 3651185, 3667566, 3675473, 3675536, 3668055, 3653429, 3633837, 3613582, 3597136, 3587681, 3587832, 3600317, 3627102, 3669172, 3728079, 3806450, 3906120, 4027301, 4170911, 4340453, 4540247, 4773082, 5041089, 5347819, 5697626, 6093307, 6534780, 7017568, 7528792, 8043194, 8523652, 8926752, 9211052, 9346736, 9324356, 9157335, 8875630, 8515450, 8111949, 7695729, 7290428, 6911463, 6567476, 6262856, 5998709, 5773321, 5584027, 5428858, 5305847, 5211930, 5143831, 5099262, 5076237, 5072455, 5086810, 5120273, 5173623, 5245296, 5333230, 5437817, 5561116, 5704067]
59739E704067J62460J82951K05620K29875K55179K82559L12760L44903L78521
59730H058895M15055M55740M99597N44880N90889O37029O81495P21947P55951
59721A3361478P79895P89260P81318P56441P16571O64607O06199N49747N02804
59712A9508320M69596M52482M53469M72735N07353N52883O04841O57817P05039
59703B4384535P40049P57567P52202P18651O54541N61855M45155L10549J66933
59694B9492037K5410j04414k16271l05232l66715l98894m03723l84098l42045
59685B6996055k80833k05911j21607k8715P2943J81724K95698M14803N39210O67137
59675B8530504P95931R23359J045521J154707J240993J294372J303821J256560
$$ y = [5704067, 5866527, 6049478, 6255098, 6484973, 6740152, 7022711, 7335471, 7680374, 8058895, 8473950, 8929690, 9429287, 9974167, 10565056, 11202085, 11883580, 12605527, 13361478, 14141373, 14930633, 15711951, 16468392, 17184963, 17849570, 18455769, 19005516, 19508320, 19977916, 20430398, 20883867, 21356602, 21863955, 22416838, 23021679, 23679496, 24384535, 25124584, 25882151, 26634353, 27353004, 28007545, 28569400, 29014555, 29325104, 29492037, 29517447, 29413033, 29196762, 28891530, 28524815, 28125921, 27722198, 27338100, 26996055, 26715222, 26509311, 26387704, 26358989, 26431932, 26613656, 26909354, 27324157, 27863367, 28530504, 29326435, 30249794, 31295315, 32450022, 33691015, 34985387, 36289208, 37545768]
59667C7545768J141539R54122O97568L82777K9061l36738o85604r92594j239561
59658C7496338j415776j519025j555145j534170j466841j364714j240854j108032
59650B6291781r77427q60784p72175p24797p25261p70392q47107r34527j009833
59641A8669478j056843j070619j054379j014007r56252q88731q17865p46827o76981
59632A0386974o10286n48720m92601m41356l95112l54113l17563k84476k54767
59623F687980k28288k03893j80615j58644j38256j19171j01832q7589p6550o7038
59613E326104n8357n2184m9985n1083n4710o1583p1628q2284r1178r8721j06019
59602D548372j12076j15225j15676j14462j11351j05922r9181r2127q4104p4529
$$ y = [37545768, 38687307, 39641429, 40338997, 40721774, 40750835, 40414097, 39728493, 38735899, 37496338, 36080562, 34561537, 33006392, 31472222, 30005381, 28640667, 27399813, 26291781, 25314354, 24453570, 23681395, 22956598, 22231337, 21460945, 20613838, 19679311, 18669478, 17612635, 16542016, 15487637, 14473630, 13517378, 12628647, 11810782, 11063955, 10386974, 9776688, 9227968, 8735367, 8294011, 7898899, 7544786, 7227223, 6942747, 6687980, 6459692, 6255799, 6075184, 5916540, 5778284, 5659113, 5557281, 5469692, 5393142, 5326104, 5267747, 5215563, 5165578, 5114495, 5059785, 4998202, 4926574, 4844290, 4753112, 4654391, 4548372, 4436296, 4321071, 4205395, 4090933, 3979582, 3873660, 3774479, 3682352, 3598248, 3523719]
59592C523719o4640n5623m6682l7039k8027k0893j4223o089K679R900J5403K0452
59580C298937K4986K7965K9599L0849L1521L0892K9440K8125K7016K6367K7709
59569C613406L1843L7116M1726M6463N3183O2007P2018Q3192R5404J07243J18163
59558D361764J30311J45726J63276J80856J98906K18936K40148K60656K80655
59549F181234L01224L21039L37429L49832L59147L64574L64255L58300L48177
59540I285211L33826L14520K91976K69347K47810K27174K09070J95461J84029
59531A1558424J69153J48725J27202J11037J03545J04719J13110J26187J40433
59522A2702535J52098J57301J51846J32706R9640N4035l148p0568j44546k20192
$$ y = [3523719, 3459079, 3403456, 3356774, 3319735, 3291708, 3270815, 3256592, 3250503, 3253182, 3263082, 3278485, 3298937, 3323923, 3351888, 3381487, 3412336, 3443857, 3474749, 3504189, 3532314, 3559330, 3585697, 3613406, 3645249, 3682365, 3724091, 3770554, 3823737, 3885744, 3957762, 4040954, 4136358, 4243601, 4361764, 4492075, 4637801, 4801077, 4981933, 5180839, 5399775, 5639923, 5900579, 6181234, 6482458, 6803497, 7140926, 7490758, 7849905, 8214479, 8578734, 8937034, 9285211, 9619037, 9933557, 10225533, 10494880, 10742690, 10969864, 11178934, 11374395, 11558424, 11727577, 11876302, 12003504, 12114541, 12218086, 12322805, 12435915, 12562102, 12702535, 12854633, 13011934, 13163780, 13296486, 13396126, 13450161, 13447013, 13376445, 13231899, 13011707]
59512A3011707k93924l62929m23047m70111n03116n23693n32740n30059n17010
59503H855078m96712m71396m41872m09579l76665l43894l10760k77829k46810
59494E479561k18219j91161j65586j42557j22133j03023q4625o7439n1327l5270
59484D298221j8947k783J3539L0831M8749O6216Q3345J01259J20262J39945J60605
59473E041242J82685K05256K27076K48499K70156K90321L06000L16046L20634
59464G407915L18043L04886K79598K43164J96408J39411P4023M465o5168j32019
59454H770726j93099k45253k87026l18625l39870l50284l51284l45889l35933
59445F003463l21532l03484k83910k64151k44032k23619k03808j84960j66876
$$ y = [13011707, 12717783, 12354854, 11931807, 11461696, 10958580, 10434887, 9902147, 9372088, 8855078, 8358366, 7886970, 7445098, 7035519, 6658854, 6314960, 6004200, 5726371, 5479561, 5261342, 5070181, 4904595, 4762038, 4639905, 4536882, 4452257, 4384818, 4333491, 4298221, 4279274, 4276491, 4290030, 4320861, 4369610, 4435826, 4519171, 4620430, 4740692, 4880637, 5041242, 5223927, 5429183, 5656259, 5904758, 6174914, 6465235, 6771235, 7087281, 7407915, 7725958, 8030844, 8310442, 8553606, 8750014, 8889425, 8963448, 8967913, 8902745, 8770726, 8577627, 8332374, 8045348, 7726723, 7386853, 7036569, 6685285, 6339396, 6003463, 5681931, 5378447, 5094537, 4830386, 4586354, 4362735, 4158927, 3973967, 3807091]
59436C807091j50120j35531j22333j08862r5232q3212p3361o4386n5430m6837
59426B871787l8576l0099k1973j5428j0118m444J709O777J0270J3408J6726J9397
59414B819436K1396K4079K7923L1982L6313M2733N1776O0397O4027O0466N1708
59403C292236M3004L9933M4846N5662O8905Q3559J01078J22406J46387J70259
59393D168275J90443K04338K13723K25386K45884K76063L12597L53416L98687
59384F588812M47538M97518N47256N96309O41945O78898P02764P11378P03168
59375A2115586O77216O35516N82604N22513M58220L93650L33230K78923K30165
59366A6227623J86638J48431J13381P7203L6851q529n9810j17961j81458k46179
$$ y = [3807091, 3656971, 3521440, 3399107, 3290245, 3195013, 3111801, 3038440, 2974054, 2918624, 2871787, 2833211, 2803112, 2781139, 2765711, 2755593, 2751149, 2752858, 2759635, 2769905, 2783313, 2800039, 2819436, 2840832, 2864911, 2892834, 2924816, 2961129, 3003862, 3055638, 3116035, 3180062, 3240528, 3292236, 3335240, 3375173, 3420019, 3475681, 3544586, 3628145, 3729223, 3851629, 3998016, 4168275, 4358718, 4563056, 4776779, 5002165, 5248049, 5524112, 5836709, 6190125, 6588812, 7036350, 7533868, 8081124, 8677433, 9319378, 9998276, 10701040, 11412418, 12115586, 12792802, 13428318, 14010922, 14533435, 14991655, 15385305, 15718535, 15997458, 16227623, 16414261, 16562692, 16676073, 16753276, 16790127, 16781598, 16721788, 16603827, 16422369, 16176190]
59356A6176190l08078l63592m07718m35306m45105m40027m23437l98180l69185
59347A2585562l43136l24291l13286l10439l16851l31391l49900l68685l86199
59338I541384m00516m08420m08362m01694l89863l72912l51641l28324l04194
59329F175458k78732k52337k26997k03420j80352j57667j37194j19441j02405
59320D516913q4940o8499n4299m1463k9221j8142p949L190J5799K8093L8967M9410
59308D347859N9805O8707P5488Q1344Q6295Q8132Q5843Q1251P5715O8010N7231
59297E175680M4945L2663J9868O461n422j3996j9898k3864k4797k1917j6504r511
59285E143708K78J3786K9475M5513O2040P9643R7551J15002J32260J48647J61705
$$ y = [16176190, 15868112, 15504520, 15096802, 14661496, 14216391, 13776364, 13352927, 12954747, 12585562, 12242426, 11918135, 11604849, 11294410, 10977559, 10646168, 10296268, 9927583, 9541384, 9140868, 8732448, 8324086, 7922392, 7532529, 7159617, 6807976, 6479652, 6175458, 5896726, 5644389, 5417392, 5213972, 5033620, 4875953, 4738759, 4619318, 4516913, 4431973, 4363474, 4309175, 4267712, 4238491, 4220349, 4212400, 4215590, 4231389, 4259482, 4298449, 4347859, 4407664, 4476371, 4551859, 4633203, 4719498, 4807630, 4893473, 4974724, 5050439, 5118449, 5175680, 5220625, 5253288, 5273156, 5279617, 5274195, 5260199, 5240301, 5216437, 5191640, 5169723, 5153219, 5143708, 5143986, 5157772, 5187247, 5232760, 5294800, 5374443, 5471994, 5586996, 5719256, 5867903, 6029608]
59274F029608J69975J74446J75598J71302J59493J40870J17201Q9088N7327K4558
59264G309466o377l4045n6988p2688p9951q0929p9428p8425p9590q2817q5143
59253F573085q2670p4990o5577n7056m8875m0720l4754l2486l2279l2013l1610
59242F040055l0876k7678k0555j0736O96J5286L4672N7921Q3648J12546J45581
59231F400560J81892K20570K62195L06424L50197L90509M26419M56026M73958
59222I468750M74617M55987M18048L59977K81991J87971Q3362k7938j42077k52599
59212A1308089l52273m36391n02237n47330n70992n76127n66766n45126n13190
59203F697657m75312m36289l98035l60464l24343k90851k59773k30600k04336
$$ y = [6029608, 6199583, 6374029, 6549627, 6720929, 6880422, 7021292, 7138493, 7227581, 7284908, 7309466, 7303089, 7269044, 7212056, 7139368, 7059417, 6978488, 6899060, 6820635, 6741045, 6658228, 6573085, 6490415, 6415425, 6349848, 6292792, 6243917, 6203197, 6168443, 6135957, 6103678, 6071665, 6040055, 6009179, 5981501, 5960946, 5950210, 5950906, 5966192, 6000864, 6058785, 6142433, 6254979, 6400560, 6582452, 6803022, 7065217, 7371641, 7721838, 8112347, 8538766, 8994792, 9468750, 9943367, 10399354, 10817402, 11177379, 11459370, 11647341, 11730703, 11702765, 11560688, 11308089, 10955816, 10519425, 10017188, 9469858, 8898866, 8322739, 7755973, 7210847, 6697657, 6222345, 5786056, 5388021, 5027557, 4703214, 4412363, 4152590, 3921990, 3717654]
59194C717654j81952j62373j44111j27654j14090j02717r2097q2273p3905o6529
59184B569953n9496n3285m8097m2739l6692l1481k8123k5044k0527j5318j0724
59173B198427o131p07M374P920J1141J5606K0524K4422K7865L2054L6384L9935
59161B411814M3703M8848N4309N8664O2800O8224P4247P9369Q3957Q9019R3851
59150C168805R7409J00495J03960J06314J05675J02588R8211R1398Q0529O6893
59140D122277N3149L9533K4516Q440o306j8254k7566l4419l8772m1025m1145l8039
59128D002389l1395k2872j3804l305R653K4174L9326N6049P4951R4239J12277
59117D341682J30223J49706J69876J89267K08581K28787K48405K65458K80220
$$ y = [3717654, 3535702, 3373329, 3229218, 3101564, 2987474, 2884757, 2792660, 2710387, 2636482, 2569953, 2510457, 2457172, 2409075, 2366336, 2329644, 2298163, 2270040, 2244996, 2224469, 2209151, 2198427, 2192296, 2191589, 2195963, 2203883, 2215024, 2230630, 2251154, 2275576, 2303441, 2335495, 2371879, 2411814, 2455517, 2504365, 2558674, 2617338, 2680138, 2748362, 2822609, 2901978, 2985935, 3074954, 3168805, 3266214, 3366709, 3470669, 3576983, 3682658, 3785246, 3883457, 3974855, 4055384, 4122277, 4175426, 4214959, 4239475, 4247915, 4241609, 4223355, 4195789, 4161370, 4122598, 4081573, 4040428, 4002389, 3970994, 3948122, 3934318, 3931013, 3940666, 3964840, 4004166, 4060215, 4135166, 4229405, 4341682, 4471905, 4621611, 4791487, 4980754, 5189335, 5418122, 5666527, 5931985, 6212205]
59108F212205K92999L01027L00513K90112K69583K37069J91350J35344P4318J1947
59098H316467m8957j03809j48116j81125k04707k19927k27572k30411k31499k31392
59088F488952k29877k28855k30234k32452k32475k30012k26645k22347k16228
59079D439827k09264k02712j95208j84923j73380j63451j54888j45456j35316
59070B875229j26448j18771j10568j01956r4312q7127p9108p1454o6262o2505
59060A956718n7353n0789m5202m1110l7067l3227l1087l0101k8306k6051k5496
59049A550929k6633k7373k7232k7540k8189k7644k5992k4687k3536k1129j7903
59038A273071j5531j3797j1179q046n951m370j510K195M754O255Q373J0865J2029
$$ y = [6212205, 6505204, 6806231, 7106744, 7396856, 7666439, 7903508, 8094858, 8230202, 8304520, 8316467, 8267510, 8163701, 8015585, 7834460, 7629753, 7409826, 7182254, 6951843, 6720344, 6488952, 6259075, 6030220, 5799986, 5567534, 5335059, 5105047, 4878402, 4656055, 4439827, 4230563, 4027851, 3832643, 3647720, 3474340, 3310889, 3156001, 3010545, 2875229, 2748781, 2630010, 2519442, 2417486, 2323174, 2236047, 2156939, 2085485, 2019223, 1956718, 1899365, 1848576, 1803374, 1762264, 1725197, 1691970, 1660883, 1630782, 1602476, 1576425, 1550929, 1524296, 1496923, 1469691, 1442151, 1413962, 1386318, 1360326, 1335639, 1312103, 1290974, 1273071, 1257540, 1243743, 1232564, 1224518, 1218567, 1214197, 1212687, 1214882, 1219636, 1225891, 1234264, 1245129, 1257158]
59025A257158J2088J2658J3411J2683J0756R126P279L919N22l28N13m1k023k482
59011A335239n62J644L164N041P110P940Q056R387J1396J1581R811Q381P740O098
58997A432026L399J764J632J263M33Q68K762M384N391P011Q890R424R212J0457
58983A498916J2921J4207J4122J4824J6624J7612J7635J8681K0978K2633K3287
58972A692440K4401K5800K5977K5926K8410L3073L6458L7390L8140L9788M0710
58961B048513M0311M0176M0620M0105L8827L8973M0732M1921M2161M3612M6957
58950B502908N0675N4748O1019O9178P6553Q2611Q9632R8286J06660J14357J23406
58939C430033J34348J45538J56980J70603J86134K01164K16011K33904K55526
$$ y = [1257158, 1269246, 1281904, 1295315, 1307998, 1318754, 1327880, 1335159, 1339078, 1339600, 1339272, 1339785, 1339744, 1337721, 1335239, 1334677, 1336321, 1339485, 1344526, 1351636, 1359576, 1367632, 1377019, 1388415, 1399996, 1409807, 1418188, 1425928, 1432026, 1435425, 1437189, 1438821, 1440084, 1440517, 1441385, 1444147, 1448531, 1453922, 1460933, 1469823, 1479247, 1488459, 1498916, 1511837, 1526044, 1540166, 1554990, 1571614, 1589226, 1606861, 1625542, 1646520, 1669153, 1692440, 1716841, 1742641, 1768618, 1794544, 1822954, 1856027, 1892485, 1929875, 1968015, 2007803, 2048513, 2088824, 2129000, 2169620, 2209725, 2248552, 2287525, 2328257, 2370178, 2412339, 2455951, 2502908, 2553583, 2608331, 2669350, 2738528, 2815081, 2897692, 2987324, 3085610, 3192270, 3306627, 3430033, 3564381, 3709919, 3866899, 4037502, 4223636, 4424800, 4640811, 4874715, 5130241]
58930E130241K78136L01066L27162L57440L89342M21998M58346N00008N44526
58921H708265N89887O37485O88372P40425P91217Q39908Q84198R19028R39983
58912A5738768R44485R28116Q83885Q07309O99066N61717L98025K14306K1453
58903B1197130j69554l50316n12709o48697p54485q31306q80715r03053r01682
58894A5244613q83916q55477q17799p72396p23409o73808o23286n72196n23655
58885H798671m79577m38434l99089l63126l31528l02937k77050k55801k39233
58876E711896k24178k08951j95236j83539j71209j57099j43840j33073j22674
58867D172097j11139j00497r2331q4961p7128p0415o5546o0278n3534m7605m3696
$$ y = [5130241, 5408377, 5709443, 6036605, 6394045, 6783387, 7205385, 7663731, 8163739, 8708265, 9298152, 9935637, 10624009, 11364434, 12155651, 12995559, 13879757, 14798785, 15738768, 16683253, 17611369, 18495254, 19302563, 20001629, 20563346, 20961371, 21175677, 21197130, 21027576, 20677260, 20164551, 19515854, 18761369, 17930063, 17049348, 16146295, 15244613, 14360697, 13505220, 12687421, 11915025, 11191616, 10517808, 9894522, 9322326, 8798671, 8319094, 7880660, 7481571, 7118445, 6786917, 6483980, 6206930, 5951129, 5711896, 5487718, 5278767, 5083531, 4899992, 4728783, 4571684, 4427844, 4294771, 4172097, 4060958, 3960461, 3868130, 3783169, 3706041, 3635626, 3570080, 3509802, 3456268, 3408663, 3364967]
58856C364967l9395l3155k7143k2882j8161j1224m048J639P675J5831K4434L1666
58844C290204L8646M6516N4046O0802O9044P9723R0235R8795J07355J17669J28456
58833D181491J39089J51870J67764J84027J99049K15447K35293K56634K77988
58824F008652L01959L30716L61982L93405M27026M65642N08299N53024O00440
58815I951145O50975P01987P51125P98820Q43839Q80054R01220R05139Q89442
58806A7273746Q47430P72812O65521N29217L66883J83532j0071k01174l80473
58797B0047423n40810o74379p76046q46961q91052r10365r07168q87108q56034
58788A2757500q16300p69671p20626o72932o26008n78617n32992m91572m52909
$$ y = [3364967, 3325572, 3292417, 3265274, 3242392, 3224231, 3213007, 3208959, 3210598, 3218273, 3234104, 3258538, 3290204, 3328850, 3375366, 3429412, 3490214, 3559258, 3638981, 3729216, 3828011, 3935366, 4053035, 4181491, 4320580, 4472450, 4640214, 4824241, 5023290, 5238737, 5474030, 5730664, 6008652, 6310611, 6641327, 7003309, 7396714, 7823740, 8289382, 8797681, 9350705, 9951145, 10602120, 11304107, 12055232, 12854052, 13697891, 14577945, 15479165, 16384304, 17273746, 18121176, 18893988, 19559509, 20088726, 20455609, 20639141, 20629070, 20427896, 20047423, 19506613, 18832234, 18056188, 17209227, 16318175, 15407810, 14500642, 13613534, 12757500, 11941200, 11171529, 10450903, 9777971, 9151963, 8573346, 8040354, 7548782, 7095873]
58779G095873m14983l79387l48195l19864k92424k67520k47103k29282k11856
58770D385259j96745j86196j77579j66803j54358j43338j33907j24288j14905
58761B987140j07028r9430r0509q1697p4840o8610o1342n4757n0890m7997m3600
58750B206440l8923l6123l3899l0184k6519k5309k5191k3573k1278k0372j9757
58739A905312j7408j4669j4087j5019j5473j5903j7423j8649j8233j7877j9096
58728A721475j9993j9078j8997k2143k5986k7271k7589k9899l2794l3350l2644
58717A431731l3188l3642l1454k8151k6698k6032k3401j9819j8025j7262j5224
58706A158835j2992j2912j3729j2808j1063j0860j1252j0142q791r329j0249r216
$$ y = [7095873, 6680890, 6301503, 5953308, 5633444, 5341020, 5073500, 4826397, 4597115, 4385259, 4188514, 4002318, 3824739, 3657936, 3503578, 3360240, 3226333, 3102045, 2987140, 2880112, 2780682, 2690173, 2608476, 2533636, 2465026, 2403684, 2348927, 2298037, 2250040, 2206440, 2167517, 2131394, 2097495, 2067311, 2040792, 2015483, 1990292, 1966719, 1945441, 1925069, 1905312, 1887904, 1873235, 1859148, 1844129, 1828656, 1812753, 1795330, 1776681, 1758448, 1740571, 1721475, 1701482, 1682404, 1663407, 1641264, 1615278, 1588007, 1560418, 1530519, 1497725, 1464375, 1431731, 1398543, 1364901, 1333447, 1305296, 1278598, 1252566, 1229165, 1209346, 1191321, 1174059, 1158835, 1145843, 1132931, 1119202, 1106394, 1095331, 1084471, 1073219, 1063077, 1054286, 1044957, 1034708, 1025492]
58694A025492p796q400r192p269m240l470m356m595n379q826j2906j4489j4839
58681I19735j6598j8044j6211j2886j1592j1186q548n032l888l773j357J871K000
58668H14491j09n95L84j00j281m2K885M315M620O083P194M979J263R4O93m02k113
58651H42359n69L502O102P306J0256J4218J5696J5376J6998K0217K1466K1035
58639I93962K2432K5564K7396K8606L2634L8789M3118M5544M9560N5476O0571
58628A423652O5286P2568Q1851R0200R8683J10960J26465J41700J57282J76681
58618B545328J98943K19705K38592K58376K77586K91168K97724K98652K90841
58609D916915K67856K28390J76541J14661M3597l0588r8328j55269k02289k37759
$$ y = [1025492, 1017696, 1009296, 1000104, 992835, 988595, 985125, 980769, 976174, 970795, 961969, 949063, 934574, 919735, 903137, 885093, 868882, 855996, 844404, 833218, 824670, 819638, 815750, 811977, 810620, 812491, 814491, 814382, 813787, 814171, 814071, 812790, 812748, 815633, 819948, 824568, 830651, 837845, 842824, 844087, 844181, 844874, 844472, 842359, 841790, 845292, 851394, 858700, 868956, 883174, 898870, 914246, 931244, 951461, 972927, 993962, 1016394, 1041958, 1069354, 1097960, 1130594, 1169383, 1212501, 1258045, 1307605, 1363081, 1423652, 1488938, 1561506, 1643357, 1733557, 1832240, 1943200, 2069665, 2211365, 2368647, 2545328, 2744271, 2963976, 3202568, 3460944, 3738530, 4029698, 4327422, 4626074, 4916915, 5184771, 5413161, 5589702, 5704363, 5747960, 5717372, 5619044, 5463775, 5261486, 5023727]
58599E023727k57856k64362k63865k58809k47023k29955k13090j97833j80972
58590B909962j62800j47703j36078j23665j09658r7681q8047p7006o4476n4651
58580A848197m8037m0738l2402k6949k4618k1432j7490j7566k2299k6890k9664
58569A540112l3728l8882m0387l7429l4691l3833l1416k6866k4295k4637k4037
58558A189911k1788k1809k4401k4814k1938k0210k0870j9591j5052j1639j1187
58547I76612j0040o892n490p037p674o033n654p516p936o241o641j0058j1905
58534H77495j0519r916j1756j2457j0764j0292j1993j1972r433q738j1102j2145
58522G46408j0252r287j0511j0051o983n655p221p209m253k841m533m935k335
$$ y = [5023727, 4765871, 4501509, 4237644, 3978835, 3731812, 3501857, 3288767, 3090934, 2909962, 2747162, 2599459, 2463381, 2339716, 2230058, 2132377, 2044330, 1967324, 1902848, 1848197, 1800160, 1759422, 1727020, 1700071, 1675453, 1654021, 1636531, 1618965, 1596666, 1569776, 1540112, 1506384, 1467502, 1427115, 1389686, 1354995, 1321162, 1289746, 1262880, 1238585, 1213948, 1189911, 1168123, 1146314, 1121913, 1097099, 1075161, 1054951, 1034081, 1014490, 999438, 987799, 976612, 966572, 959680, 954190, 947153, 939479, 933446, 927792, 920276, 912340, 906099, 899458, 889400, 877495, 866976, 857060, 845304, 832847, 822083, 811791, 799798, 787826, 778393, 769655, 758553, 746408, 736156, 726869, 716358, 706307, 699324, 693669, 686448, 679239, 674986, 672145, 667612, 662677, 660342]
58509F60342q67k113k055N84J570k92o04J704J964p33q65L156N397L018J148L033
58493F74387M598L130K410M575N643L612K574M417M957K519J667M276N769M182
58479G28716L969O673P256L961K238M308M626M92k692j911k210o442r284p423
58465G32277n914q359j0182p890n713o753o878l649k077n126p663o116m952p250
58451F43755q309n131k802m711n853k699k10k042l329l95J901j97j791J116L935
58436F13238K859K364N728P634M236J059K768M543J922l12K397N375L930K386
58422F60127N161P891O246M561O870Q394M905J466K831M280J181j583Q45L610
58408G16785J562p87J520L866J268j468J084M422K871J60J186K122j160l707q87
$$ y = [660342, 659475, 657362, 655307, 655891, 657461, 657169, 656565, 658269, 660233, 659500, 658635, 661791, 667188, 670206, 671354, 674387, 678985, 682115, 684525, 689100, 694743, 698355, 700929, 705346, 710303, 712822, 714489, 718765, 724534, 728716, 732685, 739358, 746614, 750575, 752813, 757121, 761747, 762239, 759547, 757636, 755426, 748984, 739700, 732277, 726363, 718004, 707822, 699932, 694219, 687466, 680588, 676939, 674862, 669736, 662073, 655957, 651005, 643755, 635446, 630315, 627513, 622802, 616949, 614250, 614040, 611998, 608669, 608274, 610175, 609978, 608187, 609303, 613238, 616097, 618461, 624189, 631823, 636059, 637118, 639886, 644429, 646351, 646039, 648436, 653811, 657741, 660127, 665288, 673179, 679425, 683986, 690856, 699250, 704155, 705621, 708452, 712732, 713913, 712330, 713175, 716785, 718347, 717560, 719080, 722946, 724214, 722746, 723830, 728252, 731123, 731283, 732469, 734591, 733431, 729724, 728837]
58393G28837J823j057m208j395K838K276O60L249N745K979k13J888M649K263p42
58378G49592J445M384K435K53L476P167N432L273O700J0430Q021M788P631J1423
58364H26450Q796M295N290P844N325K117M854Q812O966L779O111R265O239J922
58350I08065L691O937M434R30L622P320M317k12J942O144M450J620N467J0650
58336I69377Q564M260O730J1539J0020O626R742J4427J1962P462J0109J4938J2564
58323A098320P865J0349J5105J2382P053R136J4000J1742P272J0784J7223J5742
58311A236973J0845J3203J8342J5761J0382J3180J9137J6752J0796J3084J9185
58300A397640J7324J1821J4308K0288J8254J3379J7715K5564K3700J7331K0181
$$ y = [728837, 730660, 729603, 725395, 724000, 726838, 729114, 729774, 733023, 738768, 741747, 741534, 743422, 748071, 750334, 749592, 751037, 755421, 757856, 758109, 761585, 768752, 774184, 777457, 784157, 794587, 802608, 807396, 815027, 826450, 835246, 839541, 844831, 852675, 858000, 860117, 864971, 873783, 880749, 884528, 890639, 899904, 906143, 908065, 911756, 918693, 923127, 924057, 927679, 934999, 939316, 939104, 941046, 947190, 951640, 953260, 958727, 969377, 977941, 982201, 988931, 1000470, 1010490, 1017116, 1026858, 1041285, 1053247, 1060709, 1070818, 1085756, 1098320, 1106185, 1116534, 1131639, 1144021, 1151074, 1160210, 1174210, 1185952, 1193224, 1204008, 1221231, 1236973, 1247818, 1261021, 1279363, 1295124, 1305506, 1318686, 1337823, 1354575, 1365371, 1378455, 1397640, 1414964, 1426785, 1441093, 1461381, 1479635, 1493014, 1510729, 1536293, 1559993, 1577324, 1597505]
58289A597505K7434K5087J7690J9635K7021K5904K0400K4259L2519L0549K3487
58278A871490K6985L6348L5246K7663K9999L8712L7719L0992L5099M5925M6068
58267B262246L8909M1652N0954N0027M3249M8152N9452N7720M7635M9974O1680
58256B811650O2608N5960O1780P5835P6394O7012P0206Q3301Q4083P5852Q1873
58245C606554R9101J03523R7822J06133J25082J29225J21915J29840J50005J54928
58235D824128J47772J57488J81410J89827J85709K00395K31122K45020K44494
58226F607365K63816L00761L19663L23165L49574L97178M26222M38736M77416
58217I903896N41382N86509O14614O74060P65368Q40040R01013J004190J150774
$$ y = [1597505, 1624939, 1650026, 1667716, 1687351, 1714372, 1740276, 1760676, 1784935, 1817454, 1848003, 1871490, 1898475, 1934823, 1970069, 1997732, 2027731, 2066443, 2104162, 2135154, 2170253, 2216178, 2262246, 2301155, 2342807, 2393761, 2443788, 2487037, 2535189, 2594641, 2652361, 2699996, 2749970, 2811650, 2874258, 2930218, 2991998, 3067833, 3144227, 3211239, 3281445, 3364746, 3448829, 3524681, 3606554, 3705655, 3809178, 3907000, 4013133, 4138215, 4267440, 4389355, 4519195, 4669200, 4824128, 4971900, 5129388, 5310798, 5500625, 5686334, 5886729, 6117851, 6362871, 6607365, 6871181, 7171942, 7491605, 7814770, 8164344, 8561522, 8987744, 9426480, 9903896, 10445278, 11031787, 11646401, 12320461, 13085829, 13925869, 14826882, 15831072, 16981846]
58208A6981846J285880J415995J612146J882734K169537K486678K923818L487903
58200C4246537M092672M733266N507153O435694P458887Q646529J0195697J2172331
58192I3488766J4514356J7349183K0991981K5562839L1019714L7571935M5097730
58185B85596504N1367608N1614904M1562392K1637945k346121k3174942l6756387
58178C89501903m3067147m4034742m1590417l7283606l2384664k7665847k3343650
58171A40131830j9464605j6161189j3483502j1281231r409319p871827o669142
58164E5791015n683781m820208m106415l561865l097861k639211k224506j896503
58156B7760665j600656j280601r74600p24022m73698j59259J85274N09822Q68643
$$ y = [16981846, 18267726, 19683721, 21295867, 23178601, 25348138, 27834816, 30758634, 34246537, 38339209, 43072475, 48579628, 55015322, 62474209, 71120738, 81316435, 93488766, 108003122, 125352305, 146344286, 171907125, 202926839, 240498774, 285596504, 336964112, 388579016, 430141408, 451779353, 449433232, 426258290, 389501903, 346434756, 302400014, 260809597, 223525991, 191141327, 163475480, 140131830, 120667225, 104506036, 91022534, 79741303, 70331984, 62460157, 55791015, 50107234, 45287026, 41180611, 37618746, 34520885, 31881674, 29657168, 27760665, 26160009, 24879408, 23904808, 23180786, 22707088, 22547829, 22733103, 23242925, 24111568]
58147B4111568J345946J923992K564373L369837M443612N495910N766173M572610
58139E3594021J997579j057170l539245m943550n402447n280237m837361m224631
58131B6306959l581573l012204k526313k091333j715731j428003j210782j020309
58123I720711q50852p23577o28922n35824m46536l88626l59226l27612k88901
58114E170635k66650k63381k54975k35322k22664k18870k04130j76213j55436
58105C172994j45834j28919j01168q1717p7303p3969o8551p4469r0434r6662q8615
58094B145353q3234q5863q2158o8771o0930o2720n9771m8441m2996m6814m5338
58083A458317l5019l0738l6721l8102k9593k5158l0491l2579k5735k2033k6493
$$ y = [24111568, 25457514, 27381506, 29945879, 33315716, 37759328, 43255238, 49021411, 53594021, 55591600, 54534430, 50995185, 46051635, 40649188, 35368951, 30531590, 26306959, 22725386, 19713182, 17186869, 15095536, 13379805, 11951802, 10741020, 9720711, 8869859, 8146282, 7517360, 6981536, 6535000, 6146374, 5787148, 5459536, 5170635, 4903985, 4640604, 4385629, 4150307, 3927643, 3708773, 3504643, 3328430, 3172994, 3027160, 2898241, 2797073, 2715356, 2638053, 2564084, 2495533, 2421064, 2330630, 2233968, 2145353, 2062119, 1976256, 1894098, 1825327, 1764397, 1701677, 1641906, 1593465, 1550469, 1503655, 1458317, 1423298, 1392560, 1355839, 1317737, 1288144, 1262986, 1232495, 1199916, 1174181, 1152148, 1125655]
58072A125655k7050j8854j4103j8065j9070j1929q077j2766j4881r210o496j1478
58060I53676j3004o005j936o932j0535o480m371j0099j4431j1658j0382j5322
58048H42521j7206j1217p098j0516j2389p072l360o908r156m318m84l268m855
58035G44674J35M040J629L23M798P102K308j455J327L122j330m521j163J349k203
58020G60135m430k34K564j762n529k297J061j999n443l175q24l938o924m774l499
58005G18932q023j1658q502m572n958p438l664j98k523n040j857K022Q01j287
57991F61035M51J206l294p091m648j230k485l791j70L235J127j374J377M612K706
57976F51666K81L015O428M636J582K910M905K213j527j143k14l554p197n985l644
$$ y = [1125655, 1098605, 1079751, 1065648, 1047583, 1028513, 1016584, 1008507, 995741, 980860, 971650, 965154, 953676, 940672, 934667, 932731, 925799, 915264, 908784, 904413, 894314, 879883, 868225, 857843, 842521, 825315, 814098, 807000, 796484, 784095, 777023, 773663, 766755, 757599, 753281, 752797, 749529, 744674, 744809, 748849, 750478, 750801, 755599, 762701, 765009, 763554, 764881, 768003, 766673, 762152, 760989, 762338, 760135, 755705, 755471, 758035, 756273, 750744, 748447, 749508, 747509, 742066, 738891, 738067, 734129, 727205, 722431, 718932, 710909, 699251, 690749, 686177, 680219, 672781, 669117, 668919, 666396, 661356, 659499, 661521, 662322, 661035, 661486, 662692, 659398, 652307, 647659, 646429, 643944, 640153, 639983, 643218, 644345, 642971, 644348, 648960, 651666, 651947, 654962, 661390, 666026, 667608, 670518, 675423, 677636, 676109, 674966, 674752, 671198, 664001, 658016, 654372]
57961F54372n185o934m086p47k289n024l605j546m201q173p893o100p747r860
57947E80982p464l477k937l415n84K707K291J476M755Q776Q734P560R558J1301
57933F20263Q255M197M363N332J525m162o075o409j0095j4511j4332j1664j1553
57920E65134j2221r403n545n152n651k454J607J411n05J311M912N034L193M207
57906E45878O647O158M425N471O984M571Q86J211L659L033P96J780M582M497K763
57891F03341L599N311L539K41J55J441q83n166o073m580n688q657q789o783p198
57876E63810r566r756q223q441r174o775k982k082k547N6M198N018L584M753P923
57861E29796Q671P689R233J2365J2589J0645J0869J2304J0265N630L692M639L753
$$ y = [654372, 649187, 642253, 638167, 637420, 635131, 630107, 626502, 624956, 620755, 612582, 604689, 598589, 590842, 580982, 573518, 570041, 567104, 563689, 563105, 565812, 568103, 569579, 574334, 583110, 591844, 599404, 608962, 620263, 628518, 632715, 637078, 642410, 643935, 639773, 633698, 627289, 617194, 602683, 588351, 576687, 565134, 552913, 543510, 537965, 532813, 527162, 524708, 526315, 527726, 527221, 528532, 533444, 538478, 541671, 545878, 552525, 558683, 563108, 568579, 575563, 580134, 581020, 582231, 585890, 588923, 589719, 591499, 596081, 600578, 603341, 606940, 612251, 615790, 616031, 616186, 617627, 616744, 611578, 605505, 600925, 595237, 586580, 577791, 571008, 563810, 554244, 544488, 536265, 527824, 518650, 511875, 508893, 506811, 504264, 504320, 508518, 513536, 517120, 521873, 529796, 538467, 546156, 555389, 567754, 580343, 590988, 601857, 614161, 624426, 630056, 633748, 638387, 642140]
57848F42140M07j540j661l115n440n300l774n040q308q919o839o299p585p056
57834E71671m792m439n778n170k911k641l917l046p24j155l850m207k060j878
57820E25103m417n850n407o324q811r469q078p925r119q474o174n562o371n169
57806D27953k488k305m371m377j923j051k485k679j006o48j736q09K228L652L092
57791D11047M148P212Q798Q747J0899J5456J7827J6300J4119J2766R925N552L152
57778E45948L502L377J866J706L054K365j139l986m737n733p431p227n123m473
57764E21969n818n976m282l694m665m178j918j020j614j57L553N364M242M125
57750E05931O685Q723Q643Q973J0413R850O539M095M064L500J185J88J857L178
$$ y = [642140, 642547, 641007, 639346, 636231, 630791, 625491, 621717, 616677, 608369, 599450, 592611, 586312, 578727, 571671, 566879, 562440, 556662, 551492, 548581, 545940, 542023, 538977, 538253, 537098, 533248, 529041, 526981, 525103, 520686, 514836, 509429, 503105, 494294, 484825, 476747, 468822, 459703, 451229, 445055, 439493, 433122, 427953, 425465, 423160, 418789, 414412, 412489, 411438, 408953, 406274, 405268, 404620, 402884, 402075, 404303, 407955, 411047, 415195, 422407, 431205, 439952, 450851, 466307, 484134, 500434, 514553, 527319, 537244, 542796, 545948, 549450, 552827, 554693, 556399, 559453, 561818, 560679, 556693, 551956, 546223, 538792, 531565, 526442, 521969, 516151, 510175, 505893, 502199, 497534, 493356, 491438, 490418, 488804, 488647, 492200, 497564, 501806, 505931, 512616, 521339, 529982, 538955, 549368, 559218, 565757, 569852, 573916, 577416, 578601, 578789, 580646, 583824]
57736E83824K587K641M507N480M466M366O442P751O715N963P250Q669R181J0641
57722F70483J3173J3859J2231J1801J3908J5509J5189J5694J8211J9877J9563
57711H39498K0377K3672K6238K6342K6963K9955L2611L3294L5001L9874M5381
57700A179206M9583N4933O3204P1682P8341Q5979R7184J09711J20955J32835J48092
57689B191705J65567J83165K01818K22711K43863K63036K80589K95854L03953
57680D352261K99665K81548K49569K02535J41632P3532O548n3964j04170j39543
57670E309613j57673j60479j50605j28275r5134n9512l5321l5864o7295j23330
57660D296125j85166k31734k53502k54726k42947k21740j94338j66828j43254
$$ y = [583824, 586411, 589052, 593559, 599039, 603505, 607871, 614313, 622064, 628779, 634742, 641992, 650661, 659842, 670483, 683656, 697515, 709746, 721547, 735455, 750964, 766153, 781847, 800058, 819935, 839498, 859875, 883547, 909785, 936127, 963090, 993045, 1025656, 1058950, 1093951, 1133825, 1179206, 1228789, 1283722, 1346926, 1418608, 1496949, 1582928, 1680112, 1789823, 1910778, 2043613, 2191705, 2357272, 2540437, 2742255, 2964966, 3208829, 3471865, 3752454, 4048308, 4352261, 4651926, 4933474, 5183043, 5385578, 5527210, 5600742, 5607290, 5553326, 5449156, 5309613, 5151940, 4991461, 4840856, 4712581, 4617447, 4557935, 4522614, 4486750, 4419455, 4296125, 4110959, 3879225, 3625723, 3370997, 3128050, 2906310, 2711972, 2545144, 2401890]
57651B401890j22140j01438q2840o7967n4832m1683l0337k2183j4800o032K386
57640A860024Q825J5487K4608L4545M3305N2374O3509P5260Q6245R8446J13653
57629B476281J29974J45473J61797J80574J99530K15941K30523K43956K52663
57620D236712K51929K40354K17599J81185J30038O8743M301n9008j18264j68640
57610D984949k06045k31020k46232k52219k48999k39414k27050k12681j96078
57601B925211j79138j63875j49498j34745j20940j09674r9763q9592q0106p2553
57591A725327o5781n8810n3233m9956m6465m0793l5205l2376l0732k7513k3667
57580A260796k1672k0876j9164j7044j6040j5096j2506r534q286p866o309m369
$$ y = [2401890, 2279750, 2178312, 2095472, 2027505, 1972673, 1930990, 1900653, 1878470, 1863670, 1857638, 1860024, 1868849, 1884336, 1908944, 1943489, 1986794, 2039168, 2102677, 2177937, 2264182, 2362628, 2476281, 2606255, 2751728, 2913525, 3094099, 3293629, 3509570, 3740093, 3984049, 4236712, 4488641, 4728995, 4946594, 5127779, 5257817, 5326560, 5330861, 5271853, 5153589, 4984949, 4778904, 4547884, 4301652, 4049433, 3800434, 3561020, 3333970, 3121289, 2925211, 2746073, 2582198, 2432700, 2297955, 2177015, 2067341, 1967578, 1877986, 1797880, 1725327, 1659546, 1600736, 1547503, 1497547, 1451082, 1410289, 1375084, 1342708, 1311976, 1284463, 1260796, 1239124, 1218248, 1199084, 1182040, 1166000, 1150904, 1138398, 1128864, 1120578, 1112712, 1106403, 1102034]
57568A102034l735l446j728M68J406K059M120O475P313P765R791J2378J3534J4157
57554A172591J6203J8830K0121K0840K2842K5557K7619L0102L4487L9421M3110
57543A471723M6927N2846N9539O4966P0661P9138Q9108R7786J06060J16776J29476
57532B385006J41573J53312J66816J81195J93199K01627K06567K05162J92897
57523D027354J68774J35135R3243M3511j0311o1654j06065j42212j68772j84392
57513C794611j90478j90235j85039j75033j62363j50043j38103j24719j10560
57504B368038r8287q8184p8222o8047n9173n1546m3696l6011l0234k5895k0810
57493A767933j4844r711n470p45L983O980Q913J2249J7220K1849K5806L0854L7550
$$ y = [1102034, 1098299, 1094853, 1093125, 1093593, 1094999, 1097058, 1101178, 1107653, 1114966, 1122731, 1132522, 1144900, 1158434, 1172591, 1188794, 1207624, 1227745, 1248585, 1271427, 1296984, 1324603, 1354705, 1389192, 1428613, 1471723, 1518650, 1571496, 1631035, 1696001, 1766662, 1845800, 1934908, 2032694, 2138754, 2255530, 2385006, 2526579, 2679891, 2846707, 3027902, 3221101, 3422728, 3629295, 3834457, 4027354, 4196128, 4331263, 4424506, 4468017, 4457706, 4396052, 4289987, 4147775, 3979003, 3794611, 3604133, 3413898, 3228859, 3053826, 2891463, 2741420, 2603317, 2478598, 2368038, 2269751, 2181567, 2103345, 2035298, 1976125, 1924579, 1880883, 1844872, 1814638, 1788743, 1767933, 1753089, 1743378, 1737908, 1737163, 1741146, 1748126, 1757039, 1769288, 1786508, 1808357, 1834163, 1865017, 1902567]
57480A902567M4740N2182O0501O9057P6906Q5354R6346J09085J21552J34256J48874
57469B901420J64075J76765J86529J94633J99119J95303J81011J57193J23723
57460D479771P9429K6734k7908p8936j23606j59308j83430j96573k02068k01526
57450C412579j94412j82087j68327j55129j41612j27581j14688j03455r2725q2519
57440B050044p4108o6959n9155n1043m4884m0668l6103l0968k7464k5811k3540
57429A569341j9910j7000j5599j3890j1194r189q344o920m591l459m255n047m758
57416A445185m573m795l843j471M49J313K600M340M509K968K320L624M839M814
57402A462279N170O739P840P617P651Q615Q809P616P052Q117R001Q641Q721J0178
$$ y = [1902567, 1947307, 1999489, 2059990, 2129047, 2205953, 2291307, 2387653, 2496738, 2618290, 2752546, 2901420, 3065495, 3242260, 3428789, 3623422, 3822541, 4017844, 4198855, 4356048, 4479771, 4559200, 4585934, 4558026, 4479090, 4355484, 4196176, 4012746, 3816173, 3614105, 3412579, 3218167, 3036080, 2867753, 2712624, 2571012, 2443431, 2328743, 2225288, 2132563, 2050044, 1975936, 1908977, 1849822, 1798779, 1753895, 1713227, 1677124, 1646156, 1618692, 1592881, 1569341, 1549431, 1532431, 1516832, 1502942, 1491748, 1482559, 1474215, 1467295, 1462704, 1459245, 1454990, 1449943, 1445185, 1440612, 1435817, 1431974, 1430503, 1430952, 1432265, 1434865, 1439205, 1443714, 1446682, 1449002, 1452626, 1457465, 1462279, 1467449, 1474188, 1482028, 1489645, 1497296, 1505911, 1514720, 1522336, 1529388, 1537505, 1546506, 1555147, 1563868, 1574046]
57388A574046J1112J0230R276R822J0525R799Q545Q085P885P335P353Q350Q915
57375A691278Q358Q134R186J0143R923R622J0270J1007J1053J1141J1521J1065
57363A812701R786R654J1377J2910J2727J2053J2271J2694J2522J2473J2855J2560
57351A956583J1568J1727J3466J4528J3719J3159J4729J6967J7619J6922J6263
57340B117250J5819J5479J5980J7262J7792J7067J6609J7075J6979J5758J5257
57329B298327J6465J7594J7387J7330J8540J9392J8600J7798J8481J9134J8217
57318B497265J7373J8697K1025K1917K1427K1045K0842K0402K0811K2892K4990
57307B728686K5231K4442K4481K5171K5421K5735K7053K8509K8836K8674K9255
$$ y = [1574046, 1585158, 1595388, 1604664, 1614486, 1625011, 1634810, 1643355, 1651440, 1659325, 1666660, 1674013, 1682363, 1691278, 1699636, 1707770, 1716956, 1727099, 1737022, 1746644, 1756914, 1767921, 1778974, 1790115, 1801636, 1812701, 1822487, 1832141, 1843518, 1856428, 1869155, 1881208, 1893479, 1906173, 1918695, 1931168, 1944023, 1956583, 1968151, 1979878, 1993344, 2007872, 2021591, 2034750, 2049479, 2066446, 2084065, 2100987, 2117250, 2133069, 2148548, 2164528, 2181790, 2199582, 2216649, 2233258, 2250333, 2267312, 2283070, 2298327, 2314792, 2332386, 2349773, 2367103, 2385643, 2405035, 2423635, 2441433, 2459914, 2479048, 2497265, 2514638, 2533335, 2554360, 2576277, 2597704, 2618749, 2639591, 2659993, 2680804, 2703696, 2728686, 2753917, 2778359, 2802840, 2828011, 2853432, 2879167, 2906220, 2934729, 2963565, 2992239, 3021494]
57296C021494L0146L0532L1207L3028L4957L5908L6969L9440M2243M3690M4409
57285C424023M5966M7963M9031M9479N0476N1582N1519N0398M9025M6982M3383
57274C959827L8532L2944K5983J7397Q886K051l879j0227j6121j9683k0738k0281
57262C994691j8568j5763j3180j1708j0182p308l915j362Q50L725O503P948Q655
57249C940386R790J0909J1149J1308J2458J3768J3956J3655J4191J5154J5419
57238D082143J5329J5772J6343J6451J6899J8201J8910J7853J6527J6889J8241
57227D269558J8793J8832J9681K0988K1657K2250K3737K5106K4944K4209K4759
57216D514514K6240K7036K7102K7202K6649K4640K2693K2725K3804K3678K2448
$$ y = [3021494, 3051640, 3082172, 3113379, 3146407, 3181364, 3217272, 3254241, 3293681, 3335924, 3379614, 3424023, 3469989, 3517952, 3566983, 3616462, 3666938, 3718520, 3770039, 3820437, 3869462, 3916444, 3959827, 3998359, 4031303, 4057286, 4074683, 4083569, 4085620, 4081741, 4071514, 4055393, 4035710, 4014972, 3994691, 3976123, 3960360, 3947180, 3935472, 3925290, 3917982, 3914067, 3912705, 3913555, 3917280, 3923783, 3931731, 3940386, 3950176, 3961085, 3972234, 3983542, 3996000, 4009768, 4023724, 4037379, 4051570, 4066724, 4082143, 4097472, 4113244, 4129587, 4146038, 4162937, 4181138, 4200048, 4217901, 4234428, 4251317, 4269558, 4288351, 4307183, 4326864, 4347852, 4369509, 4391759, 4415496, 4440602, 4465546, 4489755, 4514514, 4540754, 4567790, 4594892, 4622094, 4648743, 4673383, 4696076, 4718801, 4742605, 4766283, 4788731]
57205D788731K1668K0926J8595J5219J2883J1790J0561R325R349J0118R956R233
57193D948354R838J1723J3033J3448J4375J5952J6774J6620J6645J6834J6012
57182E109608J4346J3240J2732J1567R804Q736Q334P320N796N242N869O370O265
57169E225229O207O107N255M073L506L006J413o87j846k391l598n018n461n945
57155E229850q529j2553j5157j5377j4734j3987j2447j0444r252q453o402l447
57143E099068j693j471j065r8p4j355k668l888o324r873j2900j5307j8589k2629
57129E001134k5521k7034k9002l1789l3521l3492l3252l3568l3334l2130l0814
57118D657677k8956k4835j8777j3417r859o626l030k68J770N438J1965K0356L0697
$$ y = [4788731, 4810399, 4831325, 4849920, 4865139, 4878022, 4889812, 4900373, 4909698, 4919047, 4929165, 4939121, 4948354, 4958192, 4969915, 4982948, 4996396, 5010771, 5026723, 5043497, 5060117, 5076762, 5093596, 5109608, 5123954, 5137194, 5149926, 5161493, 5171297, 5180033, 5188367, 5195687, 5201483, 5206725, 5212594, 5218964, 5225229, 5231436, 5237543, 5242798, 5246871, 5250377, 5253383, 5254796, 5254109, 5252263, 5249872, 5246274, 5241256, 5235795, 5229850, 5221321, 5208768, 5193611, 5178234, 5163500, 5149513, 5137066, 5126622, 5117370, 5108917, 5102515, 5099068, 5097375, 5095904, 5094839, 5094741, 5094667, 5093312, 5090644, 5086756, 5080432, 5070559, 5057659, 5042352, 5023763, 5001134, 4975613, 4948579, 4919577, 4887788, 4854267, 4820775, 4787523, 4753955, 4720621, 4688491, 4657677, 4628721, 4603886, 4585109, 4571692, 4561833, 4555207, 4552177, 4551909, 4553679, 4559117, 4571082, 4591438, 4622135]
57105D622135M5361O5734R0912J20883J57786K02763K54695L13188L79321M51875
57095F704653N26591O01196O78133P60326Q47094R35579J022489J102245J166568
57086A4344874J207841J220110J196858J134846J044266R48405Q64468P85079
57078B2746747O83609N37086L40597J03348j59887m30781o88200r14204j100203
57069B1118112j245526j350400j411671j425179j391311j317706j216758j100923
57061A0658638r80243q62581p53588o55886n69742m95082m31753l78141l31755
57052E199867k91788k59228k33973k13983j97920j86266j78808j73236j67616
57043C297049j62147j57181j51643j44879j38114j32462j27254j21795j16960
$$ y = [4622135, 4667496, 4733230, 4824142, 4945025, 5102811, 5305574, 5560269, 5873457, 6252778, 6704653, 7231244, 7832440, 8510573, 9270899, 10117993, 11053572, 12076061, 13178306, 14344874, 15552715, 16772825, 17969683, 19104529, 20148795, 21097200, 21961668, 22746747, 23430356, 23967442, 24308039, 24411387, 24251500, 23820719, 23132519, 22218315, 21118112, 19872586, 18522186, 17110515, 15685336, 14294025, 12976319, 11759561, 10658638, 9678395, 8815814, 8062226, 7406340, 6836598, 6341516, 5909763, 5531622, 5199867, 4908079, 4648851, 4414878, 4200895, 4002975, 3816709, 3637901, 3464665, 3297049, 3134902, 2977721, 2826078, 2681199, 2543085, 2410623, 2283369, 2161574, 2044614]
57034B044614j13388j09914j05448j00789r7036r3716q9963q5942q1783p6694
57024A089941p0607o4815n9736n3962m6964m0605l6252l2624k8317k4303k1755
57013F10001j9577j6441j3363j1735j0639q623o560o068o496o075m664k959l78
57000D96423L635P773J1090J5524K3330L3650M4917N8892P8338J02693J31281
56989A007546J68886K19022K67893K82690K35447J30229L324j04084j72161k04930
56979A833862k15003k11041j97192j77300j55405j33664j12698r3610p7630o4070
56969C96249n0976l8118k7309j9372j2869o565j063L055O734J0751J4315J6865
56957B91697J9624K3523K6632K5468J8422O938n812j6514k3090k5805k6451k5924
$$ y = [2044614, 1931226, 1821312, 1715864, 1615075, 1518039, 1424323, 1334360, 1248418, 1166635, 1089941, 1019334, 954519, 894783, 840821, 793857, 753252, 717000, 684376, 656059, 631756, 610001, 590424, 573983, 560620, 548885, 538246, 529623, 523063, 516995, 510499, 504424, 499760, 496801, 496423, 500058, 507831, 518921, 534445, 557775, 591425, 636342, 695234, 773572, 876265, 1007546, 1176432, 1395454, 1663347, 1946037, 2181484, 2311713, 2315037, 2210953, 2038792, 1833862, 1618859, 1407818, 1210626, 1033326, 877921, 744257, 631559, 537949, 460319, 396249, 345273, 307155, 279846, 260474, 247605, 241040, 239977, 243032, 249766, 260517, 274832, 291697, 311321, 334844, 361476, 386944, 405366, 412304, 406492, 389978, 366888, 341083, 314632, 288708]
56945B88708k3629j9647j5666j2867j0410p217l686n22K621O175R704J3049J7091
56932B43704K2418K8611L5222M1280M3156L5982J9284r46j7760k8931l5597l8164
56920C48259l6488l2225k7775k3728j9594j5917j3474j1503r013o817o092o083
56908A39550n266l838k935k523j956j539j519q99P90K012J657J374L027N414O223
56893A39572N918O720Q901J1075J3317J6918K1547K5547K8592L1160L1694K7238
56881C68199J7313M944o251j4222j8215j8664j7259j5355j2506q079l313J22K710
56868B79424N994R876J3344J7058K2562K9454L6070M2720N1660O3334P4283P8681
56856G24460P1097M9434J7752j4486l8524n1804n6612n5237m8905l9822l0702
$$ y = [288708, 265079, 245432, 229766, 216899, 206489, 199272, 195586, 195064, 197685, 203860, 213564, 226613, 243704, 266122, 294733, 329955, 371235, 414391, 450373, 469657, 468711, 450951, 422020, 386423, 348259, 311771, 279546, 251771, 228043, 208449, 192532, 179058, 167555, 158542, 151725, 145633, 139550, 134284, 130446, 127511, 124988, 123032, 121493, 119974, 119075, 119865, 121877, 123534, 124908, 127935, 133349, 139572, 145490, 152210, 161111, 172186, 185503, 202421, 223968, 249515, 278107, 309267, 340961, 368199, 385512, 390456, 384205, 369983, 351768, 333104, 315845, 300490, 287984, 279905, 276592, 276714, 279424, 285418, 295294, 308638, 325696, 348258, 377712, 413782, 456502, 508162, 571496, 645779, 724460, 795557, 844991, 862743, 848257, 809733, 757929, 701317, 646080, 597175, 557353, 526651]
56845E26651k2519j4938q249k542L836J2313K1666L0299L9602N2004O7118Q3264
56833G88505J00872J19256J30374J21617Q7352L5208j9752o4532r2504j03399
56823A102997j01924r4325q4296p2630o0120m8332l7637k7234j7430r331k111
56812E47627O647J7457K8375L8507M9689O3722P9157R0612R0052P0680L3326j1120
56800A104731m8707p2390q3515q5532q0528p1294o1678n3209m4599l5409k7217
56789D40653k0587j4161p536j864L058R148J6786K4403L1791M0122M7514M8243
56777F17570L8338J9570k970k4441m0690m8900m9863m7307m3689l8818l2962k8118
56765C17720k4988k1904j8057j4921j3282j1754r561p931p342o355m459l270l409
$$ y = [526651, 504132, 489194, 480945, 478403, 482239, 494552, 516218, 546517, 586119, 638123, 705241, 788505, 889377, 1008633, 1139007, 1260624, 1347976, 1383184, 1363432, 1298900, 1206396, 1102997, 1001073, 906748, 822452, 749822, 689702, 641370, 603733, 576499, 559069, 549738, 547627, 554274, 571731, 600106, 638613, 688302, 752024, 831181, 921793, 1011845, 1082525, 1115851, 1104731, 1056024, 983634, 900119, 814587, 734059, 662765, 601087, 547878, 503279, 467870, 440653, 420066, 405905, 398369, 396505, 399563, 408711, 425497, 449900, 481691, 521813, 569327, 617570, 655908, 675478, 672508, 648067, 607377, 558477, 508614, 461307, 417618, 378800, 345838, 317720, 292732, 270828, 252771, 237850, 224568, 212814, 203253, 195322, 187980, 181625, 177166, 173896, 170487]
56752A70487l133j537k71m69p84j31L93q8m84j23k12j378k262k167k465l809m580
56735A46987l765k779k834l029k629k507k786j874M00J580L82j110r91m34r51
56720A23660j635j387j247k059k363j019M11L25k04K27N52o23k195k458k005k243
56704A05737k712k259j339r38o84K0M46J0l40J56O35M41N21J388J794R84K82P03
56686A04845J239J084J258K276K617J430L49P08J355J238J463K658L045J519J08
56671A27192O62J654R59n01q01m97j103k030j892j159q96n52M68Q53m07j718j337
56654A18895k86l41r49p30j13NM02J730K511J564M69R63J876J406L90M49Q79L90
56636A29510J2J095K263J529j19m67J41j13j075j407j432k199k891k162q62o43
$$ y = [170487, 167354, 165817, 165546, 165077, 164293, 164162, 164555, 164467, 163983, 163860, 163648, 162270, 160008, 157841, 155376, 151567, 146987, 143222, 140443, 137609, 134580, 131951, 129444, 126658, 124784, 125184, 126764, 127146, 126036, 125045, 124611, 123660, 122025, 120638, 119391, 117332, 114969, 113950, 114361, 114686, 114482, 114709, 115261, 114638, 112443, 109985, 107980, 105737, 103025, 100766, 99427, 98489, 97805, 97825, 98271, 98281, 97941, 98097, 98732, 99173, 99694, 101082, 102876, 103860, 104142, 104845, 106084, 107168, 108426, 110702, 113319, 114749, 115098, 115806, 117161, 118399, 119862, 122520, 125565, 127084, 127192, 127854, 129508, 130467, 129966, 129165, 128668, 127565, 125535, 123643, 122484, 121588, 121036, 121504, 122357, 121950, 120232, 118895, 118609, 118268, 117319, 116589, 116476, 116481, 116883, 118613, 121124, 122688, 123157, 124120, 125996, 127402, 127792, 128241, 129120, 129510, 129522, 130617, 132880, 134409, 134290, 133823, 133964, 133851, 132776, 131369, 129937, 127738, 124847, 122685, 121823, 121180]
56620A21180j128j100j136k256l427l175k285k158k044p14P49P14lK18P58K98
56604A04491k67M69J487J188N46J191K053J243k42j86R63J213P16R29J371P00
56588A17865k35K16J280J145L88O66J396J029L54J063K330K246J401J571K207
56573A34922J794J246K265L619K883Q07J11R62J447J455K266L268L004K489L680
56558A66218N582N697M422M129M773M451L423L542M412M117L096L315M295L936
56544B25408K533K032K077Q15j149j746j554k669m299l924k141j838l066l259
56530B07220k153j901k613k366j441k010l664l784k349j879k697k689j793k116
56516A73765l544l717k539k290l105k890j764j990l400l503k312k303l358k704
$$ y = [121180, 120052, 118952, 117816, 115560, 112133, 108958, 106673, 104515, 102471, 101757, 102506, 103220, 103217, 103435, 104193, 104491, 104224, 104693, 106180, 107368, 107914, 109105, 111158, 112401, 112159, 111973, 112936, 114149, 114865, 115794, 117165, 117865, 117630, 117846, 119126, 120271, 120659, 121325, 122721, 123750, 124104, 125167, 127497, 129743, 131144, 132715, 134922, 136716, 137962, 140227, 143846, 146729, 147536, 147647, 148609, 150056, 151511, 153777, 157045, 160049, 162538, 166218, 171800, 177497, 181919, 186048, 190821, 195272, 198695, 202237, 206649, 210766, 213862, 217177, 221472, 225408, 227941, 229973, 232050, 232865, 231716, 229970, 228416, 225747, 221448, 217524, 215383, 213545, 210479, 207220, 205067, 203166, 200553, 198187, 196746, 194736, 191072, 187288, 184939, 183060, 180363, 177674, 175881, 173765, 170221, 166504, 163965, 161675, 158570, 155680, 153916, 151926, 148526, 145023, 142711, 140408, 137050, 134346]
56502A34346k96O97n43j292m17N6o32o56L64N40j71M78K538L348K331J810K327
56485A44828J827K55K27K103L142K551K626L843L693J740R16K301L300K580K215
56470A78147L257L730K694J991K381K213J348J953L964M350K406J162J963K301
56456B13860Q50q7R02J827J428J420K583K853J385L82R78J321N61N56J825K116
56440B34760Q33N22K085K912J769J033K044K563J212K5L08J20j730l240l062k809
56424B39345l506l679k893l140m769n267l974l550m862n046k835j099j660k269
56410A90796j231n11j529k259j259l96q77p90Q93J995J339J022K085K204K13j407
56394A90288j018n37j253j335M7O11o40j420p98j097k941l396j486k13o09P54
$$ y = [134346, 134050, 134747, 134204, 132912, 132495, 132551, 131919, 131263, 131627, 132167, 131996, 132474, 135012, 138360, 140691, 142501, 144828, 146655, 146910, 147137, 149240, 152382, 154933, 157559, 161402, 165095, 166835, 167751, 170052, 173352, 175932, 178147, 181404, 185134, 187828, 189819, 192200, 194413, 195761, 197714, 201678, 206028, 208434, 209596, 211559, 213860, 214710, 214623, 215525, 217352, 218780, 220200, 222783, 225636, 227021, 227403, 228381, 229702, 230263, 230819, 232644, 234760, 235593, 236115, 238200, 241112, 242881, 243914, 245958, 248521, 249733, 249758, 250066, 250186, 248456, 245216, 242154, 239345, 235839, 232160, 229267, 226127, 221358, 216091, 212117, 208567, 203705, 198659, 195824, 194725, 193065, 190796, 189565, 189054, 187525, 185266, 184007, 183611, 182734, 181944, 182837, 184832, 186171, 187193, 189278, 191482, 191695, 190288, 189270, 188733, 187480, 186145, 186192, 186803, 186163, 184743, 183945, 182848, 179907, 176511, 175025, 174812, 174203, 174957]
56378A74957N314R192R580Q931R391Q720N531L046L444L742J506m93L13J362L3
56363B44569j294qJ589P21p18j88O10l73r78J026L262K915J753K352L259K373
56347B60870J392K232K918J468J48J402L221K985K180L014M073L680L610N352
56333B98545O490N060L531M251N172M247L754N719P463O358M715N300O251N248
56319C72104M288N557O780N600M225M935N341L131R40J455K248N72j302q53n72
56304D14449k954n016l559j230j536k419p70J276O91l46J107K724J603M27K517
56289D06964N190M674L205M495O513N745M331N977Q764R166R116J1903J5093J4840
56275E15976J3388J4954J7986J8821J9174K2424K6389K7501K8310L2978L9044
$$ y = [174957, 180271, 189463, 199043, 207974, 217365, 226085, 231616, 234662, 238106, 241848, 243354, 242861, 243174, 244536, 244569, 243275, 243267, 244856, 245577, 244859, 244671, 245281, 244908, 243930, 244956, 248218, 251133, 252886, 255238, 258497, 260870, 262262, 264494, 267412, 268880, 269028, 270430, 273651, 276636, 278816, 281830, 285903, 289583, 293193, 298545, 305035, 310095, 313626, 317877, 323049, 327296, 331050, 336769, 344232, 350590, 355305, 360605, 366856, 372104, 376392, 381949, 388729, 394329, 398554, 403489, 408830, 411961, 412901, 414356, 416604, 417176, 415874, 415021, 414449, 411495, 406479, 402920, 401690, 400154, 397735, 396965, 398241, 398932, 398586, 399693, 402417, 404020, 404447, 406964, 412154, 416828, 420033, 424528, 431041, 436786, 441117, 447094, 455858, 465024, 474140, 486043, 501136, 515976, 529364, 544318, 562304, 581125, 600299, 622723, 649112, 676613, 704923, 737901, 776945]
56264G76945M1842M3464M8991N7146O3240O8285P6620Q7152R5521J02597J12433
56253A574236J24041J33243J40493J48967J57144J61078J61736J62286J60603
56244B923827J52191J38116J22366J04182Q0819N5058L1880J0583j1790l2349
56234C574883m6131n4899o3588p1060p3165p1930p2496p3656p0880o6088o5089
56223B845901o7587o9114p0440p5453q2071q5034q5708q9409r4953r6745r5255
56212A934132r5485r6761r4155q8484q4895q2915p7868p0645o6062o3003n6400
56201A057459m7573m2370m0327l6063l0102k7732k8167k5580k0116j7319j7355
56190G24755j5307j1441j0658j2324j1160p552o459p076m216Q46J997j41O50M307
$$ y = [776945, 818787, 862251, 911242, 968388, 1031628, 1099913, 1176533, 1263685, 1359206, 1461803, 1574236, 1698277, 1831520, 1972013, 2120980, 2278124, 2439202, 2600938, 2763224, 2923827, 3076018, 3214134, 3336500, 3440682, 3521501, 3576559, 3608439, 3619022, 3607232, 3574883, 3528752, 3473853, 3410265, 3339205, 3266040, 3194110, 3121614, 3047958, 2977078, 2910990, 2845901, 2778314, 2709200, 2638760, 2563307, 2481236, 2396202, 2310494, 2221085, 2126132, 2029387, 1934132, 1838647, 1741886, 1647731, 1559247, 1474352, 1391437, 1313569, 1242924, 1176862, 1113859, 1057459, 1009886, 967516, 927189, 891126, 861024, 833292, 805125, 779545, 759429, 742110, 724755, 709448, 698007, 687349, 675025, 663865, 656313, 649854, 642778, 638562, 639408, 641405, 641264, 641914, 646221]
56176F46221N057L136M326Q197Q534N328M758P259P209M495M616P205O259J975
56162G24575O13K345J210k683k977N31J449q18l79L074L665J351K261O495P857
56147G48569O170P441J1584J2533J0844J3226J9346K2304K2290K6213L3741L7931
56135I72192L9964M8420O3239P5545Q4415R8403J18749J36789J49932J64333J79007
56124B130988J83221J73248J56918J38837J16415R3122P9476P6651P3878O5327
56114C288081N4841M1987K0222p461k7608l5263l8639m2235m2195m1547n1933
56103C118250p5029r8924j17377j35591j53032j59117j51704j42029j35333j24116
56093A825998j06218r1370q3372p3662n9152m8711m5389m0121k9763k3286k3467
$$ y = [646221, 651278, 654414, 658740, 666937, 675471, 680799, 685557, 692816, 700025, 704520, 709136, 716341, 722600, 724575, 725188, 727533, 728743, 726060, 723083, 723614, 725063, 724245, 723866, 726940, 730605, 731956, 734217, 740712, 748569, 754739, 762180, 773764, 786297, 797141, 810367, 829713, 852017, 874307, 900520, 934261, 972192, 1012156, 1060576, 1123815, 1199360, 1283775, 1382178, 1500927, 1637716, 1787648, 1951981, 2130988, 2314209, 2487457, 2644375, 2783212, 2899627, 2992749, 3072225, 3148876, 3222754, 3288081, 3342922, 3384909, 3405131, 3397670, 3370062, 3334799, 3296160, 3253925, 3211730, 3170183, 3118250, 3043221, 2944297, 2826920, 2691329, 2538297, 2379180, 2227476, 2085447, 1950114, 1825998, 1719780, 1628410, 1545038, 1471376, 1412224, 1363513, 1318124, 1278003, 1248240, 1224954, 1201487]
56082A201487k0778j2264p859j0917j1396n569l143p351p658k19M225J128P30
56069A120416P521J1299P600O573J2429J4679R118O691J1978J4112Q782P494J4807
56056A253499J8504J3082J0571J6914K0365J4921J2248J8329K1587J6469J5189
56045A431678K3351K7915K2528K0277K7832L1912K5498K2021K8884L2752K6336
56034A720984K3370L1310L6040L0023K8085L8273M5090L9523L7085M7420N5027
56023B132230M9642M6258N4861O0151N2313M7477N6012O1595N3926N0356O1738
56012B726559O9715O2176N7740O9625P9531P3966P1460Q5840R8225R4415R3544
56001C582796J09655J22499J17616J16658J35282J51097J47544J47945J69999
$$ y = [1201487, 1180709, 1168445, 1160586, 1149669, 1138273, 1132704, 1129561, 1122210, 1114552, 1114333, 1118558, 1119686, 1120416, 1127937, 1139236, 1146836, 1153409, 1165838, 1180517, 1189635, 1196326, 1208304, 1222416, 1231198, 1238692, 1253499, 1272003, 1285085, 1295656, 1312570, 1332935, 1347856, 1360104, 1378433, 1400020, 1416489, 1431678, 1455029, 1482944, 1505472, 1525749, 1553581, 1585493, 1610991, 1633012, 1661896, 1694648, 1720984, 1744354, 1775664, 1811704, 1841727, 1869812, 1908085, 1953175, 1992698, 2029783, 2077203, 2132230, 2181872, 2228130, 2282991, 2343142, 2395455, 2442932, 2498944, 2560539, 2614465, 2664821, 2726559, 2796274, 2858450, 2916190, 2985815, 3065346, 3139312, 3210772, 3296612, 3394837, 3489252, 3582796, 3692451, 3814950, 3932566, 4049224, 4184506, 4335603, 4483147, 4631092, 4801091]
55992D801091J89513J87527J89011K14415K38398K39296K42455K69773K95005
55983F866484K96566L03972L41767L79868L92519M11592M65295N21665N52721
55974A0532449N93980O76282P62628Q21521Q95296J021763J160639J278265J428169
55965A9170992J660042J932408K212000K568663L062719L634686M226593M908239
55957D3376342N753691O717079P786055R121012J0863724J2969994J5446656J8559737
55949A30594290K2549254K7403738L3233699M0274300M7441895N0938526M5796092
55942C98231794L0109065P615841j4579642l0872193l9742406m2573409m1361893
55935B66827157l7765896l3156342k8506112k4202155k0301214j6901173j4105112
$$ y = [4801091, 4990604, 5178131, 5367142, 5581557, 5819955, 6059251, 6301706, 6571479, 6866484, 7163050, 7467022, 7808789, 8188657, 8581176, 8992768, 9458063, 9979728, 10532449, 11126429, 11802711, 12565339, 13386860, 14282156, 15303919, 16464558, 17742823, 19170992, 20831034, 22763442, 24975442, 27544105, 30606824, 34241510, 38468103, 43376342, 49130033, 55847112, 63633167, 72754179, 83617903, 96587897, 112034553, 130594290, 153143544, 180547282, 213780981, 254055281, 301497176, 352435702, 398231794, 428340859, 435956700, 421377058, 390504865, 350762459, 308189050, 266827157, 229061261, 195904919, 167398807, 143196652, 122895438, 105994265, 91889153]
55928I1889153j1830729r914592q316880p056341o049559n178433m433937l852650
55920C5256032l385419k954036k569092k275687k042960j812239j597735j441187
55912A7177677j318163j180732j045279r52241q82769p95800p06412o50931o12705
55903I032645n55171m92622m58900m39482m00746l55103l33784l24602k97510
55894E374725k63888k51880k49241k27311j97063j86763j87076j71093j47006
55885C493404j39956j41980j29247j09791j06631j11691j02247q5887q4644r1164
55875B390166q3757o9063o7775p3288o5575n1591n1746n9913n5825m4124m3145
55864A724364m7664m0133k7001k7313l6243l5230k7521k9100l5077k9301j7400
$$ y = [91889153, 80058424, 70143832, 61826952, 54770611, 48721052, 43542619, 39108682, 35256032, 31870613, 28916577, 26347485, 24071798, 22028838, 20216599, 18618864, 17177677, 15859514, 14678782, 13633503, 12681262, 11798493, 11002693, 10296281, 9645350, 9032645, 8477474, 7984852, 7525952, 7086470, 6685724, 6330621, 5996837, 5672235, 5374725, 5110837, 4858957, 4609716, 4382405, 4185342, 3998579, 3811503, 3640410, 3493404, 3353448, 3211468, 3082221, 2972430, 2865799, 2754108, 2651861, 2565974, 2481330, 2390166, 2306409, 2237346, 2169571, 2096283, 2030708, 1979117, 1927371, 1867458, 1811633, 1767509, 1724364, 1676700, 1636567, 1609566, 1582253, 1546010, 1510780, 1483259, 1454159, 1419082, 1389781, 1372381]
55853A372381j6716k2782j8473p323n596j0012m949O437R126N985J0093J5411
55841A333582N714j4094k5294k7383l4014m3610m3116l5427l4753l9520l6888
55830A005197k9096k8722l2929k8808j9395j8236k2983k0251j2190j2354j9256
55819G60977j9480j3497j3365j8110j6016q449p343j1601r536k139p79m525k484
55806F33653L959L815j335l36N171L754l055l464J438k45p958r966o381q602j6625
55791E93823j8919j4494j3771j7602j6485j0615r959j4187j2894o106m435q500
55779D45856q171k695j731n582m213K858N064L93k331j800n867j3650j4975r512
55765C83644p894j1930j2019o263l699o105m816J469L502p60k480P25P03m586
$$ y = [1372381, 1355665, 1332883, 1314410, 1307087, 1301491, 1291479, 1286530, 1292967, 1302093, 1308078, 1318171, 1333582, 1339296, 1325202, 1299908, 1272525, 1238511, 1194901, 1151785, 1116358, 1081605, 1042085, 1005197, 976101, 947379, 914450, 885642, 866247, 848011, 825028, 804777, 792587, 780233, 760977, 741497, 728000, 714635, 696525, 680509, 672060, 664717, 653116, 643580, 641441, 640662, 636137, 633653, 637612, 641427, 640092, 639756, 644927, 648681, 645626, 642162, 643600, 643355, 635397, 625431, 619050, 610448, 593823, 574904, 560410, 546639, 529037, 512552, 501937, 491978, 477791, 464897, 458791, 454356, 445856, 437685, 434990, 433259, 427677, 423464, 426322, 431386, 431779, 429448, 427648, 421781, 408131, 393156, 383644, 375750, 363820, 351801, 345538, 341839, 335734, 330918, 332387, 335889, 335129, 332649, 333374, 334077, 329491]
55751C29491o964m105l653p703q897n513m991q904r560n149l353o427p290l830
55737B43152k645n229m809k55J160j998k426J468K447j123k062J136R37m453p142
55722B18158m286k895n873o935l620k047m373m517o14J039j451j726K091L499
55708A86450N12j74L916O417M663M502Q216R763O590M425N889N921K698J540L803
55693B55131L520p86k607J63J122k270l998j616j123n002p065m208k024l622l996
55678B21619n56J642J86M0K993L246j351m345k105J76j002j444J060J574k029
55663B19704m019j282R72p52k207n38K98j602j552K183L980J214o57J498K679
55648B19919l13k898k115k372o130q410o338m904p385r166o903m800n925o268
$$ y = [329491, 322527, 318422, 314769, 307066, 298169, 292656, 287665, 278761, 269201, 264052, 260699, 254272, 246982, 243152, 240507, 235278, 230469, 230214, 231374, 229376, 226950, 228418, 230865, 229742, 227680, 228816, 229753, 225300, 218158, 213872, 210977, 205104, 198169, 194549, 192502, 188129, 183612, 182998, 184037, 182586, 180860, 182951, 186450, 186962, 186788, 190704, 197121, 201784, 206286, 214502, 224265, 230855, 235280, 241169, 247090, 249788, 251328, 255131, 258651, 257865, 255258, 255421, 256543, 254273, 250275, 248659, 247536, 242534, 235469, 231261, 229237, 225615, 221619, 221063, 222705, 222891, 222931, 225924, 229170, 227819, 223474, 221369, 221545, 220543, 219099, 220159, 221733, 219704, 215685, 214403, 215375, 214623, 212416, 211878, 212176, 210574, 209022, 211205, 215185, 216399, 215742, 217240, 219919, 219606, 216708, 214593, 212221, 206091, 197681, 191343, 186439, 179054, 169888, 162985, 158185, 152260, 145992]
55634A45992l343j673l869n051k267n03l216n566l477r34j873l050j395l52k597
55619A06826m230k398r15k391k810J41J589j524m113k051M33q77k463m73J750
55604H6494M96j247k88L16k101l832j959m11k384l898j509Q43n82k121o1J944
55588F9700Q2j942J39L026K158L7P66K196Q89p18O55K357J040o09Q30K769J849
55571H5224N88K200M060K941J517L054M886L688K123L624N624M461K056J434O86
55556A28166k340m568l245j774l687o018n077l430m509n645l412p71j832m272
55542G7586l895k168k366k801p48J397N77o74R34K940J967M86K015M088K832K50
55526H2420J44J060n5j458n55J58k152m396k873l85j144l034k061j29r33k340
$$ y = [145992, 142649, 140976, 137107, 132056, 129789, 129286, 126070, 120504, 117027, 116093, 114220, 111170, 109775, 109423, 106826, 102596, 100198, 99283, 96892, 94082, 94223, 95812, 94288, 90175, 88124, 88557, 87680, 85217, 84744, 86494, 86990, 85743, 85455, 85771, 83670, 79838, 77879, 77468, 75084, 71186, 69677, 70520, 69938, 67817, 67756, 69700, 69782, 67840, 67979, 71005, 73163, 73200, 73966, 76162, 77051, 76333, 76988, 79345, 80385, 79776, 80606, 83375, 85224, 85812, 88012, 92072, 95013, 96530, 99584, 104470, 108158, 110281, 113905, 119529, 123990, 126046, 127480, 128166, 125826, 121258, 118013, 116239, 112552, 106534, 101457, 98027, 93518, 87873, 84461, 83690, 81858, 77586, 73691, 71523, 69157, 66356, 65608, 67005, 67582, 66908, 67842, 70782, 72749, 73235, 75250, 79338, 82170, 82420, 82564, 83624, 83569, 82111, 81556, 81714, 79562, 75166, 72293, 71908, 70764, 67730, 65669, 65540, 64607, 62267]
55510F2267m53K667K879J793L121M861K930p82j667o56j684l899l849k596l333
55495F1599m637l349j308j996l339j314K020J700j366k337r62p52j615p02J105
55480D2747O61r95m54J472J372k19l04M72m68j905j143Q5j478l989l398p61o9
55463C1626q77P8J908J227r14o95J377J660K59J47R62N4j680j379o4o67j961q05
55445C0256J416J087p25l21J479J106o15q7J793J117j470j820J17O88l24J40J800
55428C5637J412p51j315k26m06j677j275L24K86p39J45J962J392o60n69J034N27
55411C5101j471j111J224J601R2M96K785L037R77M09J910K001Q5n85N31M17j217
55394D6282j254M81N94j403k236j184j121k520k548r13o05j971j966j67L78q69
$$ y = [62267, 61814, 64481, 67360, 69153, 72274, 77135, 80065, 79283, 77616, 76960, 75276, 71377, 67528, 64932, 61599, 56962, 53613, 52305, 50309, 46970, 45656, 47676, 49376, 48010, 45673, 44711, 43959, 42344, 41642, 42747, 43408, 42413, 41959, 43431, 44803, 44584, 44280, 44752, 44284, 42379, 41236, 41321, 39843, 35854, 32456, 31695, 31626, 30749, 30827, 32735, 33962, 33048, 32353, 33730, 35390, 35649, 35796, 36758, 36812, 35132, 33753, 33689, 33022, 31061, 30256, 31672, 32759, 32034, 31713, 33192, 34298, 33683, 33596, 35389, 36506, 35036, 33216, 33333, 34021, 33697, 33837, 35637, 37049, 36298, 34983, 34757, 34351, 32674, 31399, 31723, 32009, 31270, 31415, 33377, 34769, 34109, 33540, 34574, 35101, 33630, 32519, 33743, 35344, 35436, 35932, 38717, 41754, 42731, 43140, 45050, 47051, 47136, 46551, 47082, 47499, 46282, 45028, 45509, 46103, 44700, 42464, 41280, 40159, 37639, 35091, 34178, 33573, 31602, 29636, 29469, 29847, 28978]
55378B8978r42O81R59q62j849q85j91m83P3J353R80p61j036P7l40k121j857P43
55360B2517K147J343J107K111J670n34j245M72J529L82q12q42j180k042j623k09
55344B4791j25j027k49J714J480r41j827l29L89n96n39J065J174q48j763m94J17
55327B1992q54n61J794K938J356j70R9J45j139j623l53N18N5J86J356J286l02
55310B6723n92J101J907P19l1N53J39j711j987J94J625O89n7Q27R30j046k461
55293B7522j553m73r63j302j44Q16L69O2P39Q27m9K14J962K467P98l48M28Q09
55275C2181o73j984j662j323j953j874m42K60n60p96K81M43r72j321M70J774J082
55258B2931N51J531J984P17j32P03J169J5p74m4J79j172j849n07P10K09m30j15
$$ y = [28978, 28036, 28717, 29676, 28814, 26965, 26080, 25889, 25406, 25479, 26832, 27812, 27051, 26015, 26092, 25752, 23631, 21774, 22517, 24664, 26007, 27114, 29225, 30895, 30361, 29116, 29588, 31117, 31499, 30687, 29845, 28665, 26623, 25000, 24791, 24666, 23639, 23390, 25104, 26584, 25643, 23816, 23487, 23876, 23280, 22741, 23806, 24980, 24132, 22369, 21875, 21992, 21138, 20577, 22371, 25309, 26665, 26495, 26594, 26739, 25600, 23977, 23624, 24142, 24197, 24383, 25739, 27025, 26723, 26131, 27232, 29139, 29858, 29827, 30380, 30519, 28808, 26821, 27015, 28640, 29329, 29272, 30099, 31029, 29983, 27522, 25969, 25496, 24533, 23231, 23087, 23903, 24272, 24334, 25073, 25900, 25851, 26065, 28027, 30494, 31292, 30944, 31372, 32181, 31508, 29524, 27862, 26539, 24586, 22712, 22270, 22530, 21970, 21174, 21455, 21898, 20926, 19605, 20075, 21849, 22931, 23482, 25013, 26997, 27714, 27582, 28285, 29454, 29469, 28695, 28651, 28830, 27658, 25809, 25302, 26012, 26221, 25791, 25676]
55240B5676l81j625j447P78J981N53q23q6P33k60j357r58o34j527j627K94J891
55223B1181J340N34J260J899R34Q0Q31J450L90o73j26O40L45M28J732K161M60
55206C4866j100o48J52l65p20L74J108M8r49k71M13l97r88P8Q82k52j388m79R69
55187C1333R14M11J016J603Q01j79j68m65j901k560j318m07j493k475j331J47
55171B3928k43j143m94N69J48p78m59L54L25J94P41P26m60q64N75J689Q35j14
55153B5529O15J434O51k58K14N25o56j385j6J404P69k48M84J534Q60k31K02R68
55135C2395L56l57L66Q84n35k055j399P7K07O3J380K686K046J033J829K921J877
55118D3774J4J7J112Q18m76p71m91j172j934j124K15J59n04o2O29K0p49j5Q46
$$ y = [25676, 25295, 23670, 22223, 23001, 24982, 25535, 24712, 24626, 25359, 25099, 23742, 22784, 22150, 20623, 18996, 19290, 21181, 22521, 23055, 24315, 26214, 27148, 27228, 28059, 29509, 29899, 29226, 29100, 29740, 30085, 30513, 32245, 34406, 34866, 33766, 33118, 33270, 32905, 32185, 32559, 33667, 33715, 32766, 32495, 32908, 32511, 31523, 31601, 32483, 32231, 30843, 30364, 31333, 32247, 32658, 33674, 35277, 36078, 35899, 35731, 35266, 33365, 30805, 29487, 29080, 27587, 25112, 23781, 23928, 23685, 22542, 22048, 22617, 22765, 21987, 21528, 21882, 22207, 22401, 23142, 23868, 23408, 22544, 23119, 24808, 25643, 25529, 26144, 27578, 28229, 27971, 28185, 28710, 28054, 26669, 26653, 28057, 28826, 28578, 29062, 30596, 31456, 31225, 31427, 32395, 32751, 32394, 32760, 33644, 33109, 31054, 29655, 29732, 29939, 30002, 31382, 34068, 36114, 37147, 38976, 41897, 43774, 43788, 43805, 44917, 45735, 45259, 44488, 43997, 42825, 40891, 39767, 39982, 40141, 39637, 39575, 40204, 40224, 39475, 39460, 40306]
55099D0306k38k006j935n09K04M30J451K341J624M38N69J066L09n69J25J076L02
55082D4984r36l78J038J021J14K40Q95O06L02J465K726K135Q93J018J403J17j447
55065E6196r40M59J87r60o17M99K19n73L00J714J105n93o68J47q79k955k852p11
55047D9078K79n14p02J89J20j130j434l20N06O50J333K318K201J442J560J824
55031E7400L82j866k341j185p10j043k56J514K101J325J124J796J768R58Q80J508
55015F3355J453R03J094J343J21j548j345K24O82o5l2O96Q9j779k696k243k039
54998E8213k246j520l30n87j981k281j203n60o62j12R52R25j5r0P38R38O24J236
54980E2039K318K130J124J287K337K200R01L99P74L40p19n27Q00J360J122J728
$$ y = [40306, 40068, 38062, 36127, 35618, 35822, 36252, 37703, 40044, 41668, 42106, 42675, 43741, 44050, 43481, 43606, 44682, 44984, 44048, 43670, 44708, 45729, 45843, 46083, 46978, 47584, 47886, 49351, 52077, 54212, 55105, 56123, 57526, 57643, 56196, 55256, 55715, 55902, 54942, 54325, 54824, 55043, 54470, 54770, 56484, 57589, 56996, 56328, 56475, 55596, 52641, 49789, 49078, 49357, 48843, 48141, 48330, 48450, 47320, 45886, 45566, 46072, 46722, 48055, 50373, 52574, 54016, 55576, 57400, 57782, 55916, 53575, 52390, 51680, 50637, 50381, 51895, 53996, 55321, 56445, 58241, 60009, 60967, 61847, 63355, 64808, 65711, 66805, 68148, 68269, 66721, 65376, 65600, 66282, 66217, 66185, 66881, 66970, 65191, 62495, 60252, 58213, 55967, 54447, 54117, 53530, 51549, 49268, 48065, 47505, 46843, 46731, 47683, 48608, 48593, 48503, 49241, 50179, 50803, 52039, 54357, 56487, 57611, 58898, 61235, 63435, 64336, 64735, 65509, 65849, 65130, 64603, 65403, 66763, 67885, 69613]
54964F9613K878K725J660J855L215L625L113L661N059N116M113M752P357R294
54950A28036R682J0547J2642J4098J4074J3936J3971J2482R008N125J451k840
54938B42212p194r847j1150j3184j5694j6111j4019j1972j1207j0238q308o670
54926A06618n723m317k572k055k643k501j556j526k314j993n96n6j66J397M550
54911H4547O491O465O717P914Q063O983P489J0579J3497J4193J3894J3616J1869
54898B12317P723K882j171n070r187j2203j3438j3865j3767j2256r904q786r068
54885A14207q668p001n802n568m758l186k594l054k553j029q54k284k537o97N74
54870F4196k23j020l33J81o65j173j44P50J46o86o49q54j867k084q17R9m28q85
$$ y = [69613, 72491, 75216, 76876, 78731, 81946, 85571, 88684, 92345, 97404, 102520, 106633, 111385, 118742, 128036, 137718, 148265, 160907, 175005, 189079, 203015, 216986, 229468, 238476, 243601, 245052, 242212, 235018, 225171, 214021, 200837, 185143, 169032, 155013, 143041, 131834, 121596, 113288, 106618, 100895, 96578, 94006, 91951, 89308, 86807, 85251, 83725, 81411, 79418, 78822, 78766, 78600, 79997, 84547, 91038, 97503, 104220, 112134, 120197, 127180, 134669, 145248, 158745, 172938, 186832, 200448, 212317, 220040, 222922, 221751, 216681, 207494, 195291, 181853, 167988, 154221, 141965, 132061, 123275, 114207, 105539, 98538, 92736, 87168, 82410, 79224, 76630, 73576, 71023, 69994, 69140, 66856, 64319, 63622, 64196, 63973, 62953, 62620, 62801, 62136, 60963, 60819, 61569, 61715, 61029, 60380, 59526, 57659, 55575, 54758, 54857, 54429, 53544]
54852E3544m02n47k051k867j650j07J64J79Q75R59l66j365o85L46M02M51J342
54835D8222J730N55q54j128r66j095o10Q59J793J319P77J149J426R81R99J970
54819E7127K448J753J244J449R22o58j223R6J305J138J183K500L395K630J870
54804G7179K624L697L808L953N012N829N830O681R195J1383J1840J2155J3732
54791A72918J5110J4738J3535J2360R900N513J249j481m312q416j1575j1664j0227
54778A97648r632r327p971o646o748p058n997m674m586m565k967q96j26J71J568
54763A28194L215L550L377M209N233N003M532N705Q019R723J0877J2632J4807
54750B19076J6727J9044K2217K4560K4213K1684J8211J3355O510r33p359j3148
$$ y = [53544, 53142, 52595, 50544, 47677, 46027, 45920, 46084, 46263, 47138, 48097, 47731, 46366, 45681, 46027, 46429, 46880, 48222, 49952, 50507, 49653, 48525, 47559, 46464, 45854, 46713, 48506, 49825, 50602, 51751, 53177, 54158, 55157, 57127, 59575, 61328, 62572, 64021, 64943, 64285, 63062, 63158, 64463, 65601, 66784, 69284, 72679, 75309, 77179, 79803, 83500, 87308, 91261, 96273, 102102, 107932, 114613, 123808, 135191, 147031, 159186, 172918, 188028, 202766, 216301, 228661, 238561, 244074, 245323, 243842, 239530, 231114, 219539, 207875, 197648, 188016, 178689, 170718, 164072, 157324, 150266, 144269, 139595, 135009, 130444, 127477, 126581, 126455, 126626, 128194, 131409, 134959, 138336, 142545, 147778, 152781, 157313, 163018, 171037, 180760, 191637, 204269, 219076, 235803, 254847, 277064, 301624, 325837, 347521, 365732, 379087, 385597, 384664, 377305, 364157]
54738C64157j8804k2727k3465k2403k1572k0506j7961j5032j3604j3118j1736
54727A63229r533p875o861n818n132n220m999l663k572l060l879l206j609o58
54713I9144j71O05P78n81k000j546O5Q34O17N03L86k83o33K63J306R93j02o39
54695I9539q07j127o37J255K782K223P95N80J199J093N50P08J017M79l2O67J548
54678A11832J147L75Q05J665J425R30J958L894M842M903N423O155O063N876O924
54663A64217Q479Q947Q664Q730Q345O263L716K861L339L199K290J830J753J380
54649B34013J600L392N381N849N963P807J0447J1482J1417J2806J5818J8254J9440
54636C63669K0397K0536J7882J2583O835J263n331j2600j8234k1269k2902k3785
$$ y = [364157, 345353, 322626, 299161, 276758, 255186, 234680, 216719, 201687, 188083, 174965, 163229, 153696, 145821, 138960, 133142, 128010, 122790, 117791, 114128, 111556, 108496, 104617, 101411, 99802, 99144, 98973, 99578, 100356, 99775, 97775, 96229, 96294, 97128, 97745, 98248, 98634, 98351, 97718, 97981, 99287, 100280, 100178, 99539, 98732, 97605, 96968, 98223, 101005, 103228, 104023, 104603, 105802, 106895, 107445, 108153, 109170, 109649, 109617, 110284, 111832, 112979, 113354, 114159, 115824, 117249, 118179, 120137, 124031, 128873, 133776, 139199, 145354, 151417, 157293, 164217, 172696, 181643, 190307, 199037, 207382, 213645, 217361, 220222, 223561, 226760, 229050, 230880, 232633, 234013, 235613, 239005, 244386, 250235, 256198, 264005, 274452, 285934, 297351, 310157, 325975, 344229, 363669, 384066, 404602, 422484, 435067, 441902, 443165, 437834, 425234, 407000, 385731, 362829, 339044]
54624C39044k3255k1471j9658j8002j5647j2881j0904r596p801n707m520m064
54612A85538l064j565o41n2J302K944L300K407J720J512Q11l96j274k023l315
54597A87204m358m009l194l733n254n917n580n608o049n770n059n173n756n366
54583A16378m267l940m208l655k482k201k715k539j648j313j487j087m82q52j488
54568H2014p91N14K89j192j591n31O2m39o83l86o98j309n01J442K147J026J60
54551G9533O93J270Q28J38j51l88k97J007K862L436K694K508L512M410M624M933
54535A11612N341N015M646N938Q504J0142J0504J1377J2939J2926J0340O862L801
54522B19947N91k767m894n751p292j0116j2172j2041j0996j0490r998q681p072
$$ y = [339044, 315789, 294318, 274660, 256658, 241011, 228130, 217226, 207630, 199829, 194122, 189602, 185538, 182474, 180909, 180268, 180216, 181518, 184462, 187762, 190169, 191889, 193401, 194212, 193816, 192542, 190519, 187204, 182846, 178837, 175643, 171910, 166656, 160739, 155159, 149551, 143502, 137732, 132673, 127500, 121744, 116378, 112111, 108171, 103963, 100308, 97826, 95625, 92910, 90371, 88723, 87410, 85923, 84836, 84354, 83502, 82014, 81223, 81737, 82026, 80834, 79243, 78712, 78774, 78335, 77652, 77266, 76568, 75259, 74758, 76200, 78347, 79373, 79533, 80226, 81496, 82324, 82462, 82311, 81923, 81626, 82633, 85495, 88931, 91625, 94133, 97645, 102055, 106679, 111612, 116953, 121968, 126614, 132552, 141056, 151198, 161702, 173079, 186018, 198944, 209284, 216146, 219947, 220538, 217771, 212877, 207126, 199834, 189718, 177546, 165505, 154509, 144019, 134021, 125340, 118268]
54509A18268n807m592l441l094l409l293k780l090m111m108k570j066n92m10j34
54494G5771n24j435j429k84M38J36N8O87P33k34o82K08J067P63J44J31J52k97
54476G5403m53J22N96M81N47J207J691J648J758K079J612K54o77n82l88o39p00
54459H3959m32o51j307j214k74M5q39j650j420p03j32L63M54m88j758j876j033
54442G1044q11j276r16L28O72l12r08m26k49q91q97K16P81L5l95N23J354R30M33
54423F9235J076J897J647Q59M77K46o4K91J422J995J334O61R99J644J754J787
54407H7260K160K342K240K753L977M701M532M597N372N872N852O600Q455R764
54393A56477R448Q536Q119P717O774N710M557K542o1j809k539l642n206n520m300
$$ y = [118268, 112461, 107869, 104428, 101334, 97925, 94632, 91852, 88762, 84651, 80543, 77973, 76907, 76315, 75905, 75771, 75247, 73812, 72383, 72099, 72537, 72673, 72731, 73418, 74151, 73917, 73235, 73443, 74510, 75273, 75417, 75548, 75700, 75403, 74950, 75072, 75668, 76149, 76696, 77903, 79594, 81242, 83000, 85079, 86691, 86945, 86268, 85686, 85298, 84659, 83959, 83527, 82876, 81569, 80355, 80081, 80126, 79287, 77637, 76217, 75514, 75382, 75745, 76199, 75711, 73953, 72077, 71044, 70233, 68957, 68041, 68369, 69041, 68729, 67821, 67395, 67146, 66255, 65358, 65574, 66355, 66390, 65995, 66518, 67872, 68802, 69235, 70311, 72208, 73855, 74714, 75191, 75437, 75373, 75664, 77086, 79081, 80415, 81076, 82075, 83719, 85473, 87260, 89420, 91762, 94002, 96755, 100732, 105433, 109965, 114562, 119934, 125806, 131658, 138258, 146713, 156477, 165925, 174461, 182580, 190297, 197071, 202781, 207338, 209880, 209819, 208010, 205471, 201829, 196623, 191103, 186803]
54378A86803l592m321m805m065l711m847n881n305m168l846l741l086k764l374
54364A29297l718l014k534l126l378k120o17l39n78k67n9o07p81L51J633J873
54348A12016J942K861L719L504L198L972N040N310N429O267P088P181P444Q476
54334A83447Q814P142M545K603J000j037k776l477m099n458o461o257o199p470
54320A64317q611p843o198n736o198n958n004m443m214l619l090l287l466k811
54306I3839k186k630l358l218k794k984k973j773m57n68j526j815j556j708j894
54291F2399j320o11o71q32k87j3j058k186j682k13M42M18R31J580J100l7l52J8
54273E7626j39n99k50M91K73o35q16k99l59j008r58L4Q68J093J325J707J609Q63
$$ y = [186803, 183211, 178890, 174085, 170020, 166309, 161462, 155581, 150276, 146108, 142262, 138521, 135435, 132671, 129297, 125579, 122565, 120031, 116905, 113527, 111407, 110790, 110451, 109873, 109606, 109547, 108940, 108159, 108510, 110143, 112016, 113958, 116819, 120538, 124042, 127240, 131212, 136252, 141562, 146991, 153258, 160346, 167527, 174971, 183447, 192261, 199403, 203948, 206551, 207551, 206514, 203738, 200261, 196162, 190704, 184243, 177986, 171787, 164317, 155706, 147863, 141665, 135929, 129731, 123773, 118769, 114326, 110112, 106493, 103403, 100116, 96650, 93839, 91653, 89023, 85665, 82447, 79653, 76669, 73696, 71923, 71466, 70898, 69372, 67557, 66001, 64293, 62399, 61079, 60468, 59797, 58965, 58678, 58665, 57607, 55421, 53739, 53526, 53968, 54386, 55317, 56897, 57997, 57960, 57608, 57626, 57487, 56888, 56638, 57129, 57402, 56767, 55951, 55652, 55293, 54285, 53327, 53361, 54229, 55322, 56647, 58354, 59963, 60826]
54255F0826o9r13j450j198l15j2q07j437q07K01M01L76J034J472M49j081j185
54238E5485J00J128J230R97N87j67o42k42K94P2k39L05Q74J28j370j974j586j372
54220E3608j533j337q35o64n56J41J009J204R96J063J044K76p26j111j110j133
54204E0336n80Q43J819J277L31M43Q68M3j571k260j752r90j80Q86J457Q84J71
54187E2025M82J086Q24L88R62J759J373M46M83R77L77r98j556j235j047p22N81
54170E6205J934J772P01M68P92J11j135r97M82J253O17j56n58j334k228j967p53
54153E5207j90m85j79J044J705J065J25l00m30k73N30J379J176J90k52J41N60
54136F1013Q21J281J459P23m7L88J318J065j62q15q10j342k174j840m20M00J27
$$ y = [60826, 60757, 59844, 58394, 57196, 56881, 56869, 56062, 54625, 53818, 54019, 54420, 54796, 55830, 57302, 57751, 56670, 55485, 55585, 56713, 57943, 58940, 59527, 59360, 58718, 58476, 58770, 58842, 58603, 58908, 59782, 59910, 58540, 56566, 54980, 53608, 52075, 50738, 49903, 49239, 48683, 48824, 49833, 51037, 52033, 53096, 54140, 54416, 53690, 52579, 51469, 50336, 49756, 50599, 52418, 53695, 54026, 54469, 55337, 55380, 53809, 51549, 49797, 48807, 48627, 49513, 50970, 51854, 52025, 52507, 53593, 54417, 54805, 55767, 57526, 58899, 59345, 59828, 60805, 61182, 60184, 58628, 57393, 56346, 55624, 56205, 58139, 59911, 60612, 61080, 61872, 61983, 60848, 59851, 60333, 61586, 62203, 62047, 61489, 60155, 57927, 55960, 55207, 55017, 54532, 54353, 55397, 57102, 58167, 58292, 57992, 57562, 57289, 57819, 59198, 60374, 60564, 60312, 60453, 61013, 61834, 63115, 64574, 65297, 65250, 65638, 66956, 68021, 67859, 67044, 66234, 64892, 62718, 60878, 60458, 60858, 60985]
54119F0985r8J87K73J15L43N34k56j367j295l90k79r58r50k14j49p04l56R60J614
54100E7995J160P61N68m83j973j950j63J357J426R65O60Q6m43J56J306J018p34
54083F1712j623p04K47K5j41P77J597J099Ko04q93j171q29L47J336J333P10q5
54065F3135j049j671j161qM13O6K43J081J302O37L43P81P64p5n47j86j7l66j35
54046F3550R70J658J356J104J336J011r6l83J015K678L113K769K714K954L151
54031H8900L500L945L892L436L541M420N204N559N991O313N657M374L970M653
54017A53355M932M098L155K794K536K393L135M333M293K715J328J122J121N93
54003A91903K40L64m9j358k446k782l306m429n121m857m492m404l783k576k117
$$ y = [60985, 60887, 61074, 61347, 61462, 61805, 62339, 62083, 60716, 59421, 59031, 58752, 57794, 56844, 56630, 56481, 55777, 55421, 56381, 57995, 59155, 59916, 60484, 60001, 58028, 56078, 55915, 57272, 58698, 59663, 60323, 60409, 59966, 60122, 61428, 62446, 61712, 60089, 59385, 59632, 59657, 59516, 60293, 61890, 62989, 62991, 62387, 61494, 60323, 59494, 59841, 61177, 62510, 63220, 63135, 62086, 60415, 59254, 59246, 59659, 59725, 59968, 61049, 62351, 62988, 63331, 64112, 64876, 64801, 64254, 64068, 64051, 63685, 63550, 64520, 66178, 67534, 68638, 69974, 70985, 70889, 70506, 71521, 74199, 77312, 80081, 82795, 85749, 88900, 92400, 96345, 100237, 103673, 107214, 111634, 116838, 122397, 128388, 134701, 140358, 144732, 148702, 153355, 158287, 162385, 165540, 168334, 170870, 173263, 176398, 180731, 185024, 187739, 189067, 190189, 191310, 191903, 192143, 192507, 192458, 191100, 188654, 185872, 182566, 178137, 173016, 168159, 163667, 159263, 155480, 152904, 150787]
53988A50787k866l571l425l121l048k554j696j555k073j866q56o52j542j715m87
53973A19760M49Q1k24N20J121O80K86P10Q19j19q13l18K77Q9Q3Q74J278P29P29
53954A27011K023K803J797O88J216K116J555M44O74J771K025J517J386J387O95
53939A49108R0Q44K310K895K706L044M003M466M049L263K286J096J66k11o02j334
53923A78179j687j287j030j447j472k53J201J668J690K361L416M066M547N262
53909A95214N586N049M608N122N777N568N178N691O532O363N216M102L404K934
53895B66344K723K492J347p52k316k360j910k218k819k743k312k280k419k456
53881B48321l129m802o293o592o520p093p587o854n429m526m142l708l575m129
$$ y = [150787, 147921, 144350, 140925, 137804, 134756, 132202, 130506, 128951, 126878, 125012, 124156, 123504, 121962, 120247, 119760, 120209, 120290, 120066, 120586, 121707, 122387, 122673, 123383, 124202, 124083, 123270, 122952, 123229, 123318, 123401, 124275, 125553, 126282, 127011, 129034, 131837, 133634, 134322, 135538, 137654, 139209, 139653, 140327, 142098, 144123, 145640, 147026, 148413, 149108, 149198, 150042, 152352, 155247, 157953, 160997, 165000, 169466, 173515, 176778, 179064, 180160, 180326, 180115, 179513, 178179, 176492, 175205, 174175, 172728, 171256, 171003, 172204, 173872, 175562, 177923, 181339, 185405, 189952, 195214, 200800, 205849, 210457, 215579, 221356, 226924, 232102, 237793, 244325, 250688, 255904, 260006, 263410, 266344, 269067, 271559, 272906, 272154, 269838, 267478, 265568, 263350, 260531, 257788, 255476, 253196, 250777, 248321, 245192, 240390, 234097, 227505, 220985, 213892, 206305, 199451, 194022, 189496, 185354, 181646, 178071, 173942]
53867A73942m540m029l403l691m272m020l283l067l177k851k358k400k722k773
53853A27356k876l359l444k451j170o63p16o98r29j771k524k514k234k158j690
53838I8159n53J57k67p28j88M58N6p20p01l02m69p70l97Q7k27q91j047r56j054
53819H9647p38L07R44M31k9O47J375Q84P8L38R55N50k58o6P13Q68Q70J817K977
53800A02310K922K262K638L667L557K294J725K633L999M938N492N661N424N365
53786A54887N735N551M171K837K905L564L202K021J264Q11j92j208j112m20m86
53771A83530j149j349j257j687k083j515q42j531k935l160k161j513j546j190
53757A59612l25L7k76n61q75j638k074j236j06m00j694k041j047o8K67M51L30
$$ y = [173942, 169402, 165373, 161970, 158279, 154007, 149987, 146704, 143637, 140460, 137609, 135251, 132851, 130129, 127356, 124480, 121121, 117677, 115226, 114056, 113393, 112677, 111979, 111050, 109279, 106755, 104241, 102007, 99849, 98159, 97606, 97763, 97496, 96768, 96580, 97038, 97094, 96374, 95673, 95371, 94902, 94132, 93735, 93822, 93595, 92704, 91657, 90701, 89647, 88909, 89216, 90160, 90591, 90562, 91209, 92584, 93468, 93546, 93884, 94839, 95389, 95131, 95065, 95778, 96646, 97516, 99333, 102310, 105232, 107494, 110132, 113799, 117356, 119650, 121375, 124008, 128007, 132945, 138437, 144098, 149522, 154887, 160622, 166173, 170344, 173181, 176086, 179650, 182852, 184873, 186137, 186948, 186756, 185548, 184436, 184016, 183530, 182381, 181032, 179775, 178088, 176005, 174490, 173648, 172117, 169182, 166022, 163861, 162348, 160802, 159612, 159287, 159324, 159048, 158487, 157612, 155974, 153900, 152664, 152558, 152158, 150464, 148423, 147376, 147308, 147575, 148026, 148356]
53740A48356o61j772j684q24o91j247j223o06n14q00l06P85J157Q43J034J639
53724A43486J403M02K1M18M12j91m88n41j178j837j204K7k67k088l049k042n66
53707A32718R4N19J258J651J397J274J554J500R58Q13J294J623J604J904K534
53692A52695K756K637K896L219K603J357Q16J076J078Q88J632L159L969L716L548
53677A88045L794L497K569K152K472K476J826J318J044L47l95j59N08L9j271j537
53661B06725o16m44j597k367j922j604k128k212j190m51j039j944k098j978k061
53646A83074j715p99m27r83j244n71j42q19j587j378p45n31m54p2K14J93M72J193
53628A73679J553J327J419K099K286J404N04O28J449K249K903L258K914K196J978
$$ y = [148356, 147695, 145923, 144239, 143415, 142724, 141477, 140254, 139648, 139134, 138334, 138028, 138813, 139970, 140813, 141847, 143486, 144889, 145291, 145312, 145730, 146142, 145951, 145463, 144922, 143744, 141907, 140703, 140730, 140463, 138375, 135326, 133284, 132718, 132812, 133331, 134589, 136240, 137637, 138911, 140465, 141965, 142923, 143736, 145030, 146653, 148257, 150161, 152695, 155451, 158088, 160984, 164203, 166806, 168163, 168979, 170055, 171133, 172021, 173653, 176812, 180781, 184497, 188045, 191839, 195336, 197905, 200057, 202529, 205005, 206831, 208149, 209193, 209540, 209145, 208986, 209494, 209533, 208262, 206725, 206109, 205665, 204068, 201701, 199779, 198175, 196047, 193835, 192645, 192194, 191155, 189211, 187113, 185135, 183074, 181359, 180560, 180133, 179150, 177906, 177335, 177193, 176374, 174787, 173409, 172664, 172133, 171679, 171607, 171821, 172014, 172486, 173679, 175232, 176559, 177978, 180077, 182363, 183767, 184271, 184899, 186348, 188597, 191500, 194758, 197672, 199868, 201846]
53613B01846K188J936J385J712K923L567L098K580K626K631K568L357M761N085
53599B42263L875K804K982L478L518L907N028N548M569L379L473M415M991N083
53585B99313N046M589L523K526K153K074J979K053K054J309J25l04J50L81J52
53570C27123M30J151Q59o63j622j039j06K62R14K223K689J450J21L68J380J547
53554C37087J017Q29R02O42L92O66J014J003J239K196L114L258L087L166L102
53539C62714K589K226K319K234J846K113L212L685K704J565J733K843L853M692
53525D00328N485N639N103N080O209P384P629P658Q274Q779Q541Q575J0015J2172
53511E06871J3668J4405J4963J5241J5039J4928J5210J5162J4509J4422J5818
$$ y = [201846, 204034, 205970, 207355, 209067, 211990, 215557, 218655, 221235, 223861, 226492, 229060, 232417, 237178, 242263, 246138, 248942, 251924, 255402, 258920, 262827, 267855, 273403, 277972, 281351, 284824, 289239, 294230, 299313, 304359, 308948, 312471, 314997, 317150, 319224, 321203, 323256, 325310, 326619, 326744, 326440, 326590, 326971, 327123, 327553, 328704, 329563, 328900, 327278, 326239, 326133, 326395, 327309, 329532, 332221, 333671, 333792, 334160, 335540, 337087, 338104, 338933, 339835, 340477, 340869, 341535, 342549, 343552, 344791, 346987, 350101, 353359, 356446, 359612, 362714, 365303, 367529, 369848, 372082, 373928, 376041, 379253, 382938, 385642, 387207, 388940, 391783, 395636, 400328, 405813, 411452, 416555, 421635, 427844, 435228, 442857, 450515, 458789, 467568, 476109, 484684, 494699, 506871, 520539, 534944, 549907, 565148, 580187, 595115, 610325, 625487, 639996, 654418, 670236]
53500F70236J7855J9378K0516K1629K2148K1882K2063K3510K5000K5015K3958
53489I13190K3119K2643K2042K1663K1951K2229K1678K0722K0163J9799J9132
53478A148331J8465J8147J7774J7279J7521J8685J9289J8192J6327J5105J4482
53467A339597J3843J3457J3544J3217J1964J0881J0776J0376Q152M849K338R22
53455A453916l84j831k978m152o039q370j0361j2011j3655j4942j5468j5735j6347
53442A331643j7015j7368j7868j8895j9899k0466k1118k2031k2342k1761k1456
53431A111424k2064k2308k1030j9115j7830j6708j4855j2914j1839j0947r074
53420I32740o716n167m446l817l401l484l222j744K13J448K227L521N182O486
$$ y = [670236, 688091, 707469, 727985, 749614, 771762, 793644, 815707, 839217, 864217, 889232, 913190, 936309, 958952, 980994, 1002657, 1024608, 1046837, 1068515, 1089237, 1109400, 1129199, 1148331, 1166796, 1184943, 1202717, 1219996, 1237517, 1256202, 1275491, 1293683, 1310010, 1325115, 1339597, 1353440, 1366897, 1380441, 1393658, 1405622, 1416503, 1427279, 1437655, 1445807, 1450656, 1452994, 1453916, 1453532, 1451701, 1448723, 1444571, 1438532, 1430162, 1419801, 1407790, 1394135, 1379193, 1363725, 1347990, 1331643, 1314628, 1297260, 1279392, 1260497, 1240598, 1220132, 1199014, 1176983, 1154641, 1132880, 1111424, 1089360, 1067052, 1046022, 1026907, 1009077, 992369, 977514, 964600, 952761, 941814, 932740, 926024, 920857, 916411, 912594, 909193, 905709, 902487, 900743, 900956, 902404, 904631, 908152, 913334, 919820]
53406I19820P575Q874R968J0511J1327J3083J5033J6443J8057K0594K3089K4410
53394A098784K5075K5980K6742K7101K8351L1261L4137L5255L5803L7865M0808
53383A447162M2481M2917M3938M5734M6792M6858M7267M8382M9240M9620N0152
53372A960543N0385M9070M6367M3769M1820L9854L7865L6552L5558L3541L0064
53361B405388K5737K0729J4941R407N594L215M81l519q238j3125j8077k2585k6074
53348B393874k8864l1442l3310l3969l4447l6077l8488m0440m1914m3450m4304
53337A987169m3472m1919m1432m1703m0871l8687l6763l5833l5099l4280l4003
53326A563107l3970l2930l0745k8667k7307k6107k4820k3754k2576k0647j8416
$$ y = [919820, 927395, 936269, 946237, 956748, 968075, 981158, 996191, 1012634, 1030691, 1051285, 1074374, 1098784, 1123859, 1149839, 1176581, 1203682, 1232033, 1263294, 1297431, 1332686, 1368489, 1406354, 1447162, 1489643, 1532560, 1576498, 1622232, 1669024, 1715882, 1763149, 1811531, 1860771, 1910391, 1960543, 2010928, 2059998, 2106365, 2150134, 2191954, 2231808, 2269673, 2306225, 2341783, 2375324, 2405388, 2431125, 2451854, 2466795, 2476202, 2481796, 2485011, 2485492, 2481973, 2473735, 2460610, 2442533, 2419948, 2393874, 2365010, 2333568, 2300258, 2266289, 2231842, 2195765, 2157277, 2116837, 2074923, 2031473, 1987169, 1943697, 1901778, 1860346, 1818643, 1777772, 1739085, 1702322, 1666489, 1631390, 1597110, 1563107, 1529137, 1496207, 1465462, 1436795, 1409488, 1383381, 1358561, 1334807, 1312231, 1291584, 1273168]
53315A273168j6798j5347j2975j0197q650q623r041r659j1012j2367j2135j0510
53303A135854r328r095q355o449m646l889l461k537j292J34K117M479O309P279
53289A107120P867Q209Q199Q614J0400J2865J4388J4944J6051J8188K0168K1284
53277A268297K2123K2932K3138K2802K2752K2892K2199K0614J9254J8414J7168
53266A502585J5205J3268J1488R134O301M026K404M25j964l520l866m179n279
53253A546028o773q421j0560j2744j3915j4292j5280j7015j8065j8028j8366j9846
53241A372723k1197k1247k0683k0587k0850k0967k0981k0814j9957j8551j7531
53230A149358j7073j6356j5303j4975j5638j5971j5039j3664j3012j3102j3418
$$ y = [1273168, 1256370, 1241023, 1228048, 1217851, 1209201, 1200578, 1191537, 1181878, 1170866, 1158499, 1146364, 1135854, 1126526, 1117431, 1109076, 1102627, 1097981, 1094092, 1090631, 1088094, 1086802, 1086936, 1089053, 1093532, 1099841, 1107120, 1114987, 1123196, 1131395, 1140009, 1150409, 1163274, 1177662, 1192606, 1208657, 1226845, 1247013, 1268297, 1290420, 1313352, 1336490, 1359292, 1382044, 1404936, 1427135, 1447749, 1467003, 1485417, 1502585, 1517790, 1531058, 1542546, 1551680, 1557981, 1562007, 1564411, 1564836, 1562872, 1559352, 1555486, 1551307, 1546028, 1539255, 1530834, 1520274, 1507530, 1493615, 1479323, 1464043, 1447028, 1428963, 1410935, 1392569, 1372723, 1351526, 1330279, 1309596, 1289009, 1268159, 1247192, 1226211, 1205397, 1185440, 1166889, 1149358, 1132285, 1115929, 1100626, 1085651, 1070013, 1054042, 1039003, 1025339, 1012327, 999225, 985807]
53219I85807j3745j3795j3154j2134j1556j1320j0511r204q627r125r547r223
53207H53866r065r886j1121j1929j2442j3074j3721j4234j4798j5330j5442j5231
53195F97593j5116j4878j3939j2650j1997j2012j1910j1658j1916j2451j2352
53184E56714j1896j2327j3630j4329j3866j3333j3507j3835j3851j3834j3615
53173D08691j2505j0807r751r536r108q214p824q137q068p179o295n759m982m103
53159B96423m140m978n262m814m957n900o015m555k920k266k013j689k086l369
53145B41459m131l526k526j995j356l44Qo69j020k05O88P34P84J642K482K602
53129B34627K943M215N247M913M184M517N579O257O661P410Q012P562O172M369
$$ y = [985807, 972062, 958267, 945113, 932979, 921423, 910103, 899592, 890388, 881761, 872636, 863089, 853866, 844801, 834915, 823794, 811865, 799423, 786349, 772628, 758394, 743596, 728266, 712824, 697593, 682477, 667599, 653660, 641010, 629013, 617001, 605091, 593433, 581517, 569066, 556714, 544818, 532491, 518861, 504532, 490666, 477333, 463826, 449991, 436140, 422306, 408691, 396186, 385379, 375628, 366092, 356984, 348770, 340946, 332809, 324741, 317562, 311267, 305508, 300526, 296423, 292283, 287305, 282043, 277229, 272272, 266372, 260357, 255802, 252882, 250616, 248603, 246914, 244828, 241459, 237328, 233802, 231276, 229281, 227925, 227581, 227589, 226920, 225900, 225695, 226383, 227117, 227901, 229543, 232025, 234627, 237570, 241785, 247032, 251945, 256129, 260646, 266225, 272482, 279143, 286553, 294565, 302127, 308299, 312668]
53115C12668K058o27k582l129l233m089n490o601p310p728p469o551n915o053
53101B47949o253o039o084o742p080o416n508n080m698m050l866m394m519l623
53087A73597k736k611k315j223n78j439k592k457j607j463j750j362p22j118k314
53072A47310k795k054r63k66o6m22j242j879j845j475j136o39n9q6o82o39M69
53055A31531J268O41m89p84n74p98j120p40m8J39P9L91O49K39k39Q0P50P31O6
53036A31772n21r43j461j790j680j552j542r11M94J378P96k73m92j65j97l39l5
53019A22539O8p55j615j222J1P22P55R62J449J642J515J369Q99j44r91q64k01
53002A26139K06N45J186J555J165Q08J297J982J933J570J640J693J141Q13J643
$$ y = [312668, 314726, 314099, 311517, 308388, 305155, 301066, 295576, 288975, 281665, 273937, 266468, 259917, 254002, 247949, 241696, 235657, 229573, 222831, 215751, 209335, 203827, 198747, 194049, 189999, 186133, 181739, 177220, 173597, 170861, 168250, 165935, 164712, 164134, 162695, 160103, 157646, 156039, 154576, 152826, 151464, 150742, 149624, 147310, 144515, 142461, 141498, 141232, 141166, 140744, 139502, 137623, 135778, 134303, 133167, 132528, 132469, 132383, 131701, 131062, 131531, 132799, 133440, 132951, 132167, 131593, 130795, 129675, 128935, 128887, 129026, 129105, 129496, 130145, 130384, 130145, 130225, 130975, 131706, 131772, 131251, 130308, 128847, 127057, 125377, 123825, 122283, 121372, 121866, 123244, 124040, 123767, 123275, 123110, 122913, 122574, 122539, 122607, 121852, 120237, 119015, 119026, 119748, 120503, 121465, 122914, 124556, 126071, 127440, 128339, 128195, 127204, 126340, 126139, 126345, 126890, 128076, 129631, 130796, 131604, 132901, 134883, 136816, 138386, 140026, 141719, 142860, 143673, 145316]
52987A45316K790K919K394K414K834K857L018M389O441P760Q379R299J0200R824
52973B20834Q390P450P311O653M828K748J163k84j957l539m670n247n080m267
52959B34333l690m014m540m214l377l223l917m560m676m463l893k915k269k776
52945A81806l967m626m373l716k860j764r26q78j196j069n48j95L4M86R48J116
52929A58272J338J781J659M51q20q59RN20L19j18o58j287j403p35j72m00n53L31
52911A57675J451J477P50N20Q25Q38O44Q00Q23Pq64n27N04O48k15p87o12m15l69
52892A63173J22J031J632J755J717J376O24K59Q82J588J287O41R42J838K037J571
52876A82475J474J700J435R11R56J211Q59N19J300K485K464J570J558K623L289
$$ y = [145316, 148106, 151025, 153419, 155833, 158667, 161524, 164542, 168931, 175372, 183132, 191511, 200810, 211010, 220834, 229224, 236674, 243985, 250638, 255466, 258214, 259377, 259093, 257136, 253597, 248927, 243680, 238600, 234333, 230643, 226629, 222089, 217875, 214498, 211275, 207358, 202798, 198122, 193659, 189766, 186851, 184582, 181806, 177839, 173213, 168840, 165124, 162264, 160500, 159574, 158696, 157500, 156431, 155883, 155688, 155722, 156208, 157156, 158272, 159610, 161391, 163050, 163501, 162681, 161822, 161831, 162351, 162670, 162552, 161894, 160607, 159204, 158469, 158297, 157897, 157344, 157675, 159126, 160603, 161353, 161873, 162698, 163536, 164180, 164980, 165803, 165810, 164946, 164419, 164923, 165571, 165356, 164569, 163957, 163542, 163173, 163295, 164326, 165958, 167713, 169430, 170806, 171430, 171689, 172571, 174159, 175446, 176087, 177029, 178867, 180904, 182475, 183949, 185649, 187084, 187995, 188951, 190162, 191021, 191540, 192840, 195325, 197789, 199359, 200917, 203540, 206829]
52861B06829L214L534M380M538L865L737M655N514N693N884O471O876O885O888
52847B78963O620N340L388J874Q17n88k059k543k303k576l227k949j867j650k792
52832B74448m063m860n873o954o876n662m963n343n419m431l521l566l723l152
52818B06042k402k137k089k026k315k823k753k107j827k078j991j393j083j092
52804A77926n52L67L46p06j263p00j83m45o49l86o13j686k373j940j494k044k872
52787A60733k898k238j448n70J12j71j351k181k021j606j441r73rN61K76j31j64
52770A44480l75j020j412j257j180j333j013k07R9k52k28L27J89r57j723j372
52754A32766j011j420j729j408j534k686l439k609j314j077j420j089l79l74r15
$$ y = [206829, 210043, 213577, 217957, 222495, 226360, 230097, 234752, 240266, 245959, 251843, 258314, 265190, 272075, 278963, 285583, 290923, 294311, 296185, 297002, 296414, 294355, 291812, 289509, 286933, 283706, 280757, 278890, 277240, 274448, 270385, 265525, 259652, 252698, 245822, 240160, 235197, 229854, 224435, 220004, 216483, 212917, 209194, 206042, 203640, 201503, 199414, 197388, 195073, 192250, 189497, 187390, 185563, 183485, 181494, 180101, 179018, 177926, 177374, 177741, 178087, 177381, 176118, 175418, 175235, 174790, 174141, 173755, 173142, 171456, 169083, 167143, 165649, 163605, 160733, 157835, 155597, 154149, 153579, 153691, 153520, 152169, 149988, 147967, 146361, 144920, 143947, 143938, 144499, 144775, 144644, 144480, 144105, 143085, 141673, 140416, 139236, 137903, 136890, 136683, 136782, 136530, 136302, 136629, 136818, 135861, 134138, 132766, 131755, 130335, 128606, 127198, 125664, 122978, 119539, 116930, 115616, 114539, 113119, 112030, 111651, 111277, 110362]
52739A10362j080r50j234j737j654r72l82j60j13j82l52l51n9K91O11J014J222
52722A04274Q39L36N48J104Q26o5P5J650K957K816K309K821L981M712M938N026
52706A39147M763M085L741M188M771M828M500L814K246lj718k430l066m010m148
52691A60708k957j906k452l972n024n401n583n324m185k698j769j644k273l653
52677A11867n048n096l646k270k068k200j594p28n19p46q13r17j286j364q94o64
52661H2014j105j395r79o98j197j626j196o65q64j010j16J120J409R04N82M51
52645G5629j09q75j120q17m32o5K61K48Q7N67J621J936Q99l42p01n70l86N50K296
52626G8677L058J507r96k256k160j968j879j314o23n51o86k82J69j30n68j30N94
$$ y = [110362, 109282, 108332, 107098, 105361, 103707, 102735, 102353, 102193, 102080, 101898, 101546, 101195, 101136, 101427, 102038, 103052, 104274, 105113, 105449, 105997, 107101, 107927, 107862, 107937, 109587, 112544, 115360, 117669, 120490, 124471, 129183, 134121, 139147, 143910, 147995, 151736, 155924, 160695, 165523, 170023, 173837, 176083, 176080, 174362, 171932, 168866, 164856, 160708, 157751, 155845, 153393, 149421, 144397, 138996, 133413, 128089, 123904, 121206, 119437, 117793, 115520, 111867, 106819, 101723, 98077, 95807, 93739, 91539, 89945, 89217, 88698, 87952, 87139, 86222, 84936, 83572, 82678, 82014, 80909, 79514, 78535, 77837, 76640, 75014, 73818, 73153, 72289, 71279, 71163, 72283, 73692, 74596, 75178, 75629, 75520, 74645, 73525, 72708, 72276, 72211, 72472, 72720, 72807, 73374, 74995, 76931, 77830, 77488, 76787, 76217, 75831, 76381, 78677, 81735, 83242, 82246, 79990, 77830, 75862, 73983, 72669, 72046, 71495, 70809, 70527, 70696, 70566, 69998, 69868, 70462]
52609G0462L72l90k19R08J616J405J112J144R21J84n70r30q46j68J052K059K197
52592H0309J749J190K60j101j792q60Q44J680J359Q34N74L53K99P68J406J520
52576H9392J122O94L15m2mN78J147J400J860K557K332P24o30o5J661K592K381
52559A08014K111K024J460O08M65J103J561J418J109P54j1j092j857j923j269
52544A14475K1J374J814J303J120J874K241R40j066j898j393p60m00J36O37M98
52528A20916J24L62Q94P84K52L10Q87R28K04m26m75k37O3L10R1o39r36j36Q19
52509A24095P22M9J13Q03Q44j24j272k067k451j983m21J143J324M38%L96O32J67
52491A22408m08n52k83L40J147J532J218Q89J017Q29k60j135m83R61J471R65P48
$$ y = [70462, 70834, 70444, 70225, 71133, 72749, 74154, 75266, 76410, 77331, 77515, 76945, 76015, 75169, 75001, 76053, 78112, 80309, 82058, 83248, 83508, 82407, 80615, 79755, 80599, 82279, 83638, 84472, 85046, 85399, 85698, 86466, 87872, 89392, 90514, 91208, 91523, 91481, 91477, 92055, 93202, 94602, 96462, 99019, 101351, 102075, 101445, 101380, 103041, 105633, 108014, 110125, 112149, 113609, 114217, 114682, 115785, 117346, 118764, 119873, 120627, 120616, 119524, 117667, 115744, 114475, 114496, 115870, 117684, 118987, 120107, 121981, 124222, 125162, 124096, 122198, 120805, 120045, 119645, 119781, 120418, 120916, 121040, 121402, 122296, 123080, 123332, 123642, 124529, 125457, 125661, 125235, 124760, 124523, 124586, 124896, 124987, 124348, 123412, 123276, 124095, 124817, 124866, 124979, 125782, 126626, 126502, 125230, 123163, 120712, 118729, 118308, 119451, 120775, 121213, 121213, 121609, 122241, 122408, 122000, 121448, 121165, 121505, 122652, 124184, 125402, 126291, 127308, 128137, 127877, 126742, 126259, 127220, 128691, 129656, 130404]
52474A30404J111J149O61L80M28L04K27Q15J630J698J232J198J511J277N83K66
52458A44874K81J2j26P46K072K450J862J503J638J521J231J462J823J358O68J239
52442A64614K729L242K394J727J820J469K61m25O4L79o29k176l082l412l591l391
52426A61993k739k301k415k517k229j894j656j162n53n65j215j663j567j463j511
52411A36543j196m84PK04O15J088Q94J90l1L72N12J00j94k09n38j098r98j01O99
52392A36375R86J178J333J084Q34J332K063J772O81K61O93O59r5j89Q32J584J237
52375A52620P87J050J360J212J344K041K187J134J9jO37J076J419J856J823J140
52359A71704P81J354K005J872J477J654K180K447K618L045L434L426L298L304
$$ y = [130404, 131515, 132664, 133325, 133705, 134133, 134437, 134664, 135479, 137109, 138807, 140039, 141237, 142748, 144025, 144608, 144874, 145155, 145167, 145041, 145787, 147859, 150309, 152171, 153674, 155312, 156833, 158064, 159526, 161349, 162707, 163375, 164614, 167343, 170585, 172979, 174706, 176526, 177995, 178256, 177831, 177895, 178274, 177645, 175469, 172387, 168975, 165384, 161993, 159254, 156953, 154538, 152021, 149792, 147898, 146242, 145080, 144527, 143962, 142747, 141084, 139517, 138054, 136543, 135347, 134863, 134870, 135074, 135689, 136777, 137671, 137861, 137830, 138202, 138714, 138814, 138620, 138411, 137873, 136775, 135777, 135676, 136375, 137361, 138539, 139872, 140956, 141790, 143122, 145185, 146957, 147638, 147899, 148592, 149251, 149156, 148967, 149799, 151383, 152620, 153407, 154457, 155817, 157029, 158373, 160414, 162601, 163735, 163754, 163753, 164390, 165466, 166885, 168741, 170564, 171704, 172485, 173839, 175844, 177716, 179193, 180847, 183027, 185474, 188092, 191137, 194571, 197997, 201295, 204599]
52345B04599L142K628K136J840J445J039J247K068K621K438J976J527Q20P7J14
52330B29717R68J679J891K341L241L590K805J711J206J153J260J820K843L581
52316B59806L587L258K927K452K019K125K433K064J360J752L454M860M983M808
52302C01888N483O663P546Q139Q623Q763Q771R521J1145J2586J3228J3628J4170
52289D30154J4389J4184J4223J4522J4284J3728J4282J6172J7736J7962J7897
52278E99533J8426J8614J7614J6364J5876J5471J4316J3223J3197J3571J3187
52267G69392J2286J1649J0973R691Q417P967P880P276O343N632M815L458K118
52254H67897J354N65q80k286k799k891l395l941l820l448l493l428k451j190q11
$$ y = [204599, 207741, 210369, 212505, 214345, 215790, 216829, 218076, 220144, 222765, 225203, 227179, 228706, 229526, 229603, 229717, 230685, 232364, 234255, 236596, 239837, 243427, 246232, 247943, 249149, 250302, 251562, 253382, 256225, 259806, 263393, 266651, 269578, 272030, 274049, 276174, 278607, 280671, 282031, 283783, 287237, 292097, 297080, 301888, 307371, 314034, 321580, 329719, 338342, 347105, 355876, 365397, 376542, 389128, 402356, 415984, 430154, 444543, 458727, 472950, 487472, 501756, 515484, 529766, 545938, 563674, 581636, 599533, 617959, 636573, 654187, 670551, 686427, 701898, 716214, 729437, 742634, 756205, 769392, 781678, 793327, 804300, 813991, 822408, 830375, 838255, 845531, 851874, 857506, 862321, 865779, 867897, 869251, 869816, 868936, 866650, 863851, 860960, 857565, 853624, 849804, 846356, 842863, 839435, 836984, 835794, 834983]
52239H34983j046o35P14K199L424M614N664O180O389O974Q113R417J0568J1405
52225I08963J1788J1982J2612J3742J4574J4510J3742J2406J0375Q301P503P969
52213A048467P859N975L461J904J059j75j691k666l226m139n481o837q226r775
52199A026509j1077j1857j2517j3270j3599j3438j3635j4333j4232j2658j0971
52188H84922j0553j0647r850q517p869p722o981n670m662m027l358l076l723m430
52174G93837l912k565j928k326k693k488k195k030j740j587k156l181l747l680
52160G57609l564l535l184k555k228k433k993l891m984n468m618k936j682j461
52146G12077j910k431k617k369k194k843m130m883m585m128m249m358l836l227
$$ y = [834983, 833937, 833302, 834016, 836215, 839639, 844253, 849917, 856097, 862486, 869460, 877573, 886990, 897558, 908963, 920751, 932733, 945345, 959087, 973661, 988171, 1001913, 1014319, 1024694, 1032995, 1040498, 1048467, 1056326, 1062301, 1065762, 1067666, 1068725, 1068550, 1066859, 1064193, 1060967, 1056828, 1051347, 1044510, 1036284, 1026509, 1015432, 1003575, 991058, 977788, 964189, 950751, 937116, 922783, 908551, 895893, 884922, 874369, 863722, 853872, 845355, 837486, 829764, 822783, 817113, 812451, 808424, 805066, 801990, 798267, 793837, 789925, 787360, 785432, 783106, 780413, 777925, 775730, 773700, 771960, 770373, 768217, 765036, 761289, 757609, 754045, 750510, 747326, 744771, 742543, 740110, 737117, 733226, 728242, 722774, 718156, 715220, 713538, 712077, 710167, 707736, 705119, 702750, 700556, 697713, 693583, 688700, 684115, 679987, 675738, 671380, 667544, 664317]
52132F64317l151l109k653k515l262l954l651l135l509m112l661k539k093k306
52118F20667k186j847k208k959k866j960j528j902k013j294m30N9N09J173J736
52103F02951K100K538L075L545M252N584P137Q179Q783R602J0773J1975J3178
52090F93672J4486J5610J6391J7339J8759J9944K0306K0481K1207K1855K1491
52079I01541K0676K0717K1602K2181K1962K1314K0310J8771J7177J6082J5025
52068A117358J3260J1147R465P895N658L186J548O09p28k646m368n702p108q448
52054A141126r110r258r553r850r523q871q803r356r806r943r982r621q526p360
52040A011564o840o275m521k032l20K29M77R03J412K316L848N034M904M357N017
$$ y = [664317, 661166, 658057, 655404, 652889, 649627, 645673, 642022, 638887, 635378, 631266, 627605, 625066, 622973, 620667, 618481, 616634, 614426, 611467, 608601, 606641, 605113, 603211, 601198, 599904, 599474, 599533, 600042, 601215, 602951, 605051, 607589, 610664, 614209, 618461, 624045, 631182, 639361, 648144, 657746, 668519, 680494, 693672, 708158, 723768, 740159, 757498, 776257, 796201, 816507, 836988, 858195, 880050, 901541, 922217, 942934, 964536, 986717, 1008679, 1029993, 1050303, 1069074, 1086251, 1102333, 1117358, 1130618, 1141765, 1151230, 1159125, 1164783, 1167969, 1169517, 1170126, 1169398, 1166752, 1162384, 1156682, 1149574, 1141126, 1132016, 1122758, 1113205, 1103355, 1093832, 1084961, 1076158, 1066802, 1056996, 1047053, 1037071, 1027450, 1018924, 1011564, 1004724, 998449, 993928, 991896, 991576, 991805, 992282, 993185, 994597, 996913, 1000761, 1005795, 1010699, 1015056, 1020073]
52025A020073O614P527P614Q263R692J0384R586Q301P455O824O135N567M820L327
52011A122182J637R42J039M09j413l289m590o085q285j0490j2121j3632j5480
51998A050824j7442j9219k0759k1835k2375k3079k4494k5824k6050k5769k6208
51987G97770k6897k6350k4777k3855k3883k3529k2535k2215k2787k2700k1318
51976E36924j9957j9435j8777j7370j6255j6070j5638j3974j1973j0858j0418
51965C66199r971r638r427q507o639n119n083n900o343o264o076n632m751l953
51951B72896l661l410k740k098k147k794l550m089m014k991j557q56j193j719
51937B36077j819j744j560q94n1o6j061j872j890j916k515k903k360j490j159
$$ y = [1020073, 1026687, 1034214, 1041828, 1050091, 1059783, 1070167, 1079753, 1088054, 1095509, 1102333, 1108468, 1114035, 1118855, 1122182, 1123819, 1124761, 1125800, 1126209, 1124796, 1121507, 1116917, 1110832, 1102547, 1092057, 1079936, 1066304, 1050824, 1033382, 1014163, 993404, 971569, 949194, 926115, 901621, 875797, 849747, 823978, 797770, 770873, 744523, 719746, 695891, 672008, 648479, 625944, 603729, 580942, 558242, 536924, 516967, 497532, 478755, 461385, 445130, 429060, 413422, 399448, 387475, 376617, 366199, 356228, 346590, 337163, 328656, 322017, 316898, 311815, 305915, 299572, 293308, 287232, 281600, 276849, 272896, 269235, 265825, 263085, 260987, 258840, 256046, 252496, 248407, 244393, 241402, 239845, 238989, 237796, 236077, 234258, 232514, 230954, 230060, 230009, 229943, 228882, 227010, 225120, 223204, 220689, 217786, 215426, 213936, 212777]
51922B12777j241j258j306j580j794j799j867j993j745j280j352j975k257j928
51908A89402j686j648r96K60P44j89j266j234o13m20m71j12L80L89J40J50K35
51891A83065J7k32j17J07K5k71n04o68o64k73J79L5o13r56q21q26r88n40N17J091
51871A77563P08J28k82j111k216k333j263p11j632k472j510N04J708J863J987
51856A70931K232J889J036M79M04L47K97O17J190J570J727J865J888J670J445
51841A89587J323J026O22P39J403J561N62p09j030m89l3n3k68m62n50m01j59k06
51823A92463l91l4Q41J209N72j81j00N50J068J390J678J715J578J904K698K809
51807B09769J565j2n75k28J5j57k99k06k9J17m0q24j766j642j23J413J526M61
$$ y = [212777, 211536, 210278, 208972, 207392, 205598, 203799, 201932, 199939, 198194, 196914, 195562, 193587, 191330, 189402, 187716, 186068, 185072, 185332, 186076, 185887, 184621, 183387, 182774, 182354, 181883, 181771, 182151, 182540, 182680, 182830, 183065, 183082, 182850, 182733, 182840, 182865, 182594, 182090, 181422, 180758, 180485, 180664, 180699, 180086, 179130, 178309, 177483, 176495, 175955, 176472, 177563, 178271, 178399, 178117, 177006, 174790, 172457, 171194, 170483, 168851, 166379, 164869, 165373, 167081, 168944, 170931, 173163, 175052, 176088, 176567, 176971, 177318, 177615, 178232, 179422, 180992, 182719, 184584, 186472, 188142, 189587, 190910, 191936, 192558, 193297, 194700, 196261, 196823, 196114, 195084, 194595, 194562, 194509, 194241, 193779, 193229, 192828, 192669, 192463, 192072, 192038, 192879, 194088, 194660, 194479, 194379, 194929, 195997, 197387, 199065, 200780, 202358, 204262, 206960, 209769, 211334, 211322, 210747, 210519, 210534, 210377, 210078, 209872, 209843, 209960, 209920, 209096, 207330, 205688, 205565, 206978, 208504, 208965]
51789B08965n43r06q02l24N08J329J812K132K528K808K709K245J492O48K93P42
51773B25636J163N45m82k83J213K276K136J962K439K392J106k8L12J192J128N88
51757B43295R09J896K389K374K687L192L077K484K386K998L644M008M362M799
51743B84500N175N605O253O922P425P805P765O749N037L700K869J324j370l622
51729C46137l908k836j896j376q17n13r57j603j571r90n22k41q9n09j538k143
51713C24628j698j102j292j664j383j115j921l289l902l647l317l033k462j931
51699B92872j888j811j101l73m95j016j015q00j265k172k531k138j436m99N39
51684B74871Q39K8p73m77M12J079K073L861M907L482O10j121j187j320k317l027
$$ y = [208965, 208422, 207516, 206714, 206390, 206898, 208227, 210039, 212171, 214699, 217507, 220216, 222461, 223953, 224601, 224894, 225636, 226799, 227344, 226862, 226579, 227792, 230068, 232204, 234166, 236605, 238997, 240103, 240075, 240387, 241579, 242707, 243295, 244204, 246100, 248489, 250863, 253550, 256742, 259819, 262303, 264689, 267687, 271331, 275339, 279701, 284500, 289675, 295280, 301533, 308455, 315880, 323685, 331450, 338199, 343236, 346936, 349805, 351129, 349759, 346137, 342229, 339393, 337497, 336121, 335304, 334791, 333834, 332231, 330660, 329670, 329148, 328907, 328818, 328309, 326771, 324628, 322930, 321828, 320536, 318872, 317489, 316374, 314453, 311164, 307262, 303615, 300298, 297265, 294803, 292872, 290984, 289173, 288072, 287699, 287204, 286188, 285173, 284373, 283108, 280936, 278405, 276267, 274831, 274332, 274871, 275710, 275738, 274965, 274488, 274900, 275979, 278052, 281913, 286820, 290302, 290912, 289791, 288604, 287284, 284967, 281940]
51668B81940k548j315J26J610K471J943O76J80O57Q88L64j46k38m34r36j306j592
51651B82340k391l517m040l805l635l878m022l902l999m375m465m124l752l412
51637B29023k884k571l082m013m247l506k449j401j96Q17R33K75l12n73r71j579
51621B03264j950j986j931j678j038m68m28m82r2J72m75j422j422n43N1K3m4j48
51603A89403p93j569j426m46J33j64n52m36j17R7K52K37n6j34N10J455K079K686
51585A91159L761M700M697M299M491M869M503L982M586N810N876M531L261K693
51571B53218J920N86m78r95j680k590k837k407k451l328l935l406k078n67O96
51556B29668J019R2q88m40R32J499J135J272K168K592K459L222N083O277N930
$$ y = [281940, 279392, 278077, 278203, 279813, 282284, 284227, 284903, 285083, 285740, 286628, 286992, 286846, 286608, 286174, 285238, 283932, 282340, 279949, 276432, 272392, 268587, 264952, 261074, 257052, 253150, 249151, 244776, 240311, 236187, 232435, 229023, 226139, 223568, 220486, 216473, 212226, 208720, 206271, 204870, 204674, 205491, 206424, 206699, 206387, 205814, 204843, 203264, 201314, 199328, 197397, 195719, 194681, 194213, 193785, 193303, 193211, 193383, 192908, 191486, 190064, 189521, 189572, 189595, 189551, 189403, 188610, 187041, 185615, 185169, 185302, 185138, 184586, 184150, 184033, 184130, 184382, 184619, 184563, 184429, 184939, 186394, 188473, 191159, 194920, 199620, 204317, 208616, 213107, 217976, 222479, 226461, 231047, 236857, 242733, 247264, 250525, 253218, 255138, 255724, 255246, 254251, 252571, 249981, 247144, 244737, 242286, 238958, 235023, 231617, 229539, 228972, 229668, 230687, 230779, 229891, 229451, 230383, 231882, 233017, 234289, 236457, 239049, 241508, 244730, 249813, 256090, 262020]
51541B62020N301N218M642K886J198O89N99r3r40j222j241j231m70J248K677K906
51525B84187K669K788K690J811J034J319K036K080J622J451J460J023J88o24j414
51510C04320k238k751k922l374m250m620l897k911k723l191l547l540l193k304
51496B58859j010j47k20o95r11r82j189j275j015p01n14j92K80M63L90O62J233
51479B53036J259O34M57J309K242K321J992K068K396K490K580L019L487L602L718
51464B86610M236M825N004M955N052N177N082M868M682M449M193M009L560K383
51450C49085Q31j57l56l59l75r5K50j03j060j660j583j381j043L3J422J790J008
51433C46247M21M56j15j769l150l352l484m588n785n903n487n574n840n453m767
$$ y = [262020, 267321, 272539, 277181, 280067, 281265, 281954, 282553, 282460, 281520, 280298, 279057, 277826, 277356, 278604, 281281, 284187, 286856, 289644, 292334, 294145, 295179, 296498, 298534, 300614, 302236, 303687, 305147, 306170, 306358, 305734, 304320, 302082, 299331, 296409, 293035, 288785, 284165, 280268, 277357, 274634, 271443, 267896, 264356, 261163, 258859, 257849, 257702, 257482, 256787, 255876, 254894, 253705, 252430, 251415, 250714, 250200, 250008, 250288, 250751, 251141, 251803, 253036, 254295, 254929, 255386, 256695, 258937, 261258, 263250, 265318, 267714, 270204, 272784, 275803, 279290, 282892, 286610, 290846, 295671, 300675, 305630, 310682, 315859, 320941, 325809, 330491, 334940, 339133, 343142, 346702, 349085, 349916, 349759, 349403, 349044, 348669, 348574, 348824, 348721, 347661, 346001, 344418, 343037, 341994, 342027, 343449, 345239, 346247, 346668, 347124, 347009, 345240, 342090, 338738, 335254, 330666, 324881, 318978, 313491, 307917, 302077, 296624, 291857]
51418B91857m609m789m666m379m260l901k965k104j913j817j134l48k31m93m71
51403B53777k85k21J88J265K154J921J085Q94J621K533K986K712J641K91m36n22
51387B71604j165l004n015o024o340o903p649p811p180o133n014m215m138m485
51373A96528m387l760l518l943m126l663l461l970m139l202k066j744j736j285
51359A51528r04j250j736j689j681k245k481j521k89j31p38r91r78j350j667j112
51343A30765j82J20O1N10J110Q64om26k57j47r7L32P61N53J17K51O30M73J20M61
51323A36013J287J757J981K584L155K795J875J614K199K906L671M885N911N605
51309A78238M169K885K109J133m4n77n00r24k251l537l950l665l148k711k813
$$ y = [291857, 287248, 282459, 277793, 273414, 269154, 265253, 262288, 260184, 258271, 256454, 255320, 254972, 254741, 254248, 253777, 253492, 253271, 253459, 254724, 256878, 258799, 259884, 260778, 262399, 264932, 267918, 270630, 272271, 272562, 272126, 271604, 270439, 267435, 262420, 256396, 250056, 243153, 235504, 227693, 220513, 214380, 209366, 205151, 201013, 196528, 192141, 188381, 184863, 180920, 176794, 173131, 169670, 165700, 161561, 158359, 156293, 154549, 152813, 151528, 150624, 149374, 147638, 145949, 144268, 142023, 139542, 138021, 137732, 137601, 136863, 135872, 134894, 133544, 131877, 130765, 130583, 130703, 130764, 131274, 132384, 133248, 133242, 132816, 132559, 132412, 132315, 132647, 133408, 133961, 134078, 134329, 134959, 135432, 135552, 136013, 137300, 139057, 141038, 143622, 146777, 149572, 151447, 153061, 155260, 158166, 161837, 166722, 172633, 178238, 182407, 185292, 187401, 188534, 188490, 187913, 187413, 186489, 184238, 180701, 176751, 173086, 169938, 167227, 164414]
51294A64414l688m597m528l648l034l057l122k874k486j903r58j79k88r58j221
51279A27873r83r82j309j282p39l52n00q33j038j102r06m14r0k63m27q5J86l78
51261A16376j265j392q79p21r71p44J16P86R04Q80Q60O24N32J166K033J893N70
51244A20768p69j220r09k01O91J314J271R56R75R71K13q49j017k24L68J78k61
51227A22255n87r87j189n45O22J114O20J07J09ko29j102q30k32J14K61L84L12
51209A19795K7m4K88O96R46J158J274R74K96k19j67L91J140J611J330N42K80J024
51191A31342J751J288L1p80r23j041j058l47P46J119O79L56L63j7p81r66m01j28
51173A31233o50j126q45k12K73P44J111O76o33j649j379k54O46R18P93M07k56
$$ y = [164414, 160726, 156129, 151601, 147953, 144919, 141862, 138740, 135866, 133380, 131477, 130519, 130340, 130052, 129094, 127873, 126890, 125908, 124599, 123317, 122578, 122226, 121726, 120893, 119855, 118753, 117847, 117433, 117343, 117080, 116653, 116568, 116754, 116376, 115111, 113719, 112840, 112119, 111148, 110404, 110520, 111306, 112210, 113090, 113950, 114574, 115106, 116272, 118305, 120198, 120768, 119999, 118779, 117870, 117669, 118360, 119674, 120945, 121901, 122876, 123847, 124060, 123211, 122194, 121970, 122338, 122516, 122255, 121668, 120681, 119492, 118947, 119569, 120683, 121303, 121410, 121519, 121517, 120888, 119786, 118956, 118724, 118838, 119099, 119483, 119795, 119822, 119778, 120066, 120762, 121708, 122866, 124140, 125114, 125410, 125191, 125024, 125415, 126555, 128166, 129496, 130038, 130318, 131342, 133093, 134381, 134412, 133632, 132709, 131668, 130610, 130263, 131009, 132128, 132807, 133163, 133526, 133509, 132728, 131762, 131361, 131233, 130583, 129457, 128612, 128400, 128673, 129417, 130528, 131204, 130571, 128922, 127543, 127289, 127935, 128853, 129646, 130053, 129797]
51156A29797j040j662j864j461o42m4j27n80q32q56r01r09q73j207j903j955q26
51139A12115K56j66j434j608l01J053J584J880K376K644K599K793L119K752J698
51124A31360R78R16P42K39K21Q03Q33k48j419j707j436j165o73P9K76m82j266
51107A28051j163o71q12j588k167k051j337k52Q92J699K006J921J515R57Q24J482
51091A29306K292K348J892J886K307K179J377Q87J049R95K86l24l23l15p76j167
51075A43899j024p53o61k96M53O72j70j087p91N71J747J923J244K76m49p04p47
51058A44103r07r96n94R7M88N67Q00J143J147J001J309J852J831J392J528K266
51042A57027K408J413K02l68m54k75M16J339J562R44M89P21R75P45M47K75k32
$$ y = [129797, 128757, 127095, 125231, 123770, 123128, 123084, 122957, 122377, 121545, 120689, 119788, 118879, 118006, 116799, 114896, 112941, 112115, 112371, 112205, 110771, 109163, 108862, 109915, 111499, 113379, 115755, 118399, 120998, 123791, 126910, 129662, 131360, 132338, 133254, 133996, 134235, 134456, 135259, 136092, 135844, 134425, 132718, 131282, 130117, 129444, 129523, 129799, 129317, 128051, 126888, 126217, 125405, 123817, 121650, 119599, 118262, 118010, 118902, 120601, 122607, 124528, 126043, 127000, 127824, 129306, 131598, 133946, 135838, 137724, 140031, 142210, 143587, 144474, 145523, 146518, 146804, 146480, 146157, 145842, 145066, 143899, 142875, 142122, 141461, 141165, 141618, 142290, 142120, 141033, 140242, 140813, 142560, 144483, 145727, 146003, 145554, 144850, 144103, 143196, 142200, 141606, 141703, 142191, 142758, 143558, 144701, 145848, 146849, 148158, 150010, 151841, 153233, 154761, 157027, 159435, 160848, 161050, 160682, 160228, 159953, 160369, 161708, 163270, 164214, 164703, 165424, 166399, 167144, 167591, 167866, 167634]
51025A67634r38q37K03R07N72K13Q47J924K444K329J858R16j85m12N02J393J408
51008A80778J178J371J377O58R1P35K128L151L626L920L817L001K012J622J852
50993B11317K418L404M652N412N468N718O788P989Q540Q800R305R691R650R914
50979C09066J1124J2649J3705J4728J6440J8489K0254K2155K4796K7677L0073
50968E21156L2510L5995M0312M4448M8164N1894N5557N8708O1510O4418O7224
50957A081896O9369P0696P0981O9415O5514N9961N3577M6193L7624K8866K1053
50946A675145J3911O538q73p426j2977j7875k1816k4331k5853k6913k6750k4359
50934A506421k0583j7656j6749j7276j8420j9939k1631k3333k5514k8615l1980
$$ y = [167634, 166696, 165859, 166062, 166969, 167541, 167754, 168601, 170525, 172969, 175298, 177156, 178072, 177887, 177475, 177977, 179370, 180778, 181956, 183327, 184704, 185362, 185453, 186188, 188316, 191467, 195093, 199013, 202830, 205831, 207843, 209465, 211317, 213735, 217139, 221791, 227203, 232671, 238389, 245177, 253166, 261706, 270506, 279811, 289502, 299152, 309066, 320190, 332839, 346544, 361272, 377712, 396201, 416455, 438610, 463406, 491083, 521156, 553666, 589661, 629973, 674421, 722585, 774479, 830036, 888744, 950254, 1014672, 1081896, 1151265, 1221961, 1292942, 1362357, 1427871, 1487832, 1541409, 1587602, 1625226, 1654092, 1675145, 1689056, 1695594, 1694721, 1687295, 1674318, 1656443, 1634627, 1610296, 1584443, 1557530, 1530780, 1506421, 1485838, 1468182, 1451433, 1434157, 1415737, 1395798, 1374167, 1350834, 1325320, 1296705, 1264725]
50923A264725l4665l7042m0219m3926m6578m7510m7719m7966m7661m6093m3596
50912G81750m0775l7609l3981l0367k7354k4923k2686k0420j8080j5709j3543
50901D96303j1835j0452q998p410o027m958l877k564j309n55l21j20N79J780K891
50886D43127L372L322L117K698J909J325J834L285M544N153N795O740P120O543
50872D99884O245P467R556J0870J0988J0878J1322J2305J3702J5573J7829K0325
50860F46944K3139K6306K9571L2890L6636M1002M5809N1322N8268O6477P4665
50849A133029Q2352R0809J00991J11660J20991J28996J36863J44549J50867J55388
50839B356495J58520J59757J57528J50888J40135J25681J07601Q6405O3156L8750
$$ y = [1264725, 1230060, 1193018, 1152799, 1108873, 1062295, 1014785, 967066, 919100, 871439, 825346, 781750, 740975, 703366, 669385, 639018, 611664, 586741, 564055, 543635, 525555, 509846, 496303, 484468, 474016, 465018, 457608, 451581, 446623, 442746, 440182, 438873, 438318, 437997, 437877, 438456, 440236, 443127, 446499, 449821, 452938, 455636, 457545, 458870, 460704, 463989, 468533, 473686, 479481, 486221, 493341, 499884, 506129, 513596, 523152, 534022, 545010, 555888, 567210, 579515, 593217, 608790, 626619, 646944, 670083, 696389, 725960, 758850, 795486, 836488, 882297, 933619, 991887, 1058364, 1133029, 1215381, 1306190, 1407181, 1518841, 1639832, 1768828, 1905691, 2050240, 2201107, 2356495, 2515015, 2674772, 2832300, 2983188, 3123323, 3249004, 3356605, 3443010, 3506166, 3544916]
50829C544916J4059r265k9274m5155n7310o6054p1102p2318p0028o4676n6896
50818C016897m7862l8795l0346k3319j9479k0501k6068l4182m3233n2953o3397
50807B616762p4143q4590r4152j02102j07933j11823j14025j14131j11731j07425
50797A594707j02138r5705q7461p8111o9674o3229n7884n2205m5799l9122l2748
50786H70631k7201k2834j9403j6252j3096j0253q042o415n155m013k789j640j109
50773G32429j417k003k283k374k584k701k519k548l263m161m440m215m130m190
50759F89601l935l331k533j180R18K829L540L616M574O814R449J1979J4696J7505
50745G54542J9816K1707K3836K6022K7324K7771K8647L0545L2515L3744L4996
$$ y = [3544916, 3558975, 3549710, 3520436, 3475281, 3417971, 3351917, 3280815, 3208497, 3138469, 3073793, 3016897, 2969035, 2930240, 2899894, 2876575, 2857096, 2836595, 2810527, 2776345, 2733112, 2680159, 2616762, 2542619, 2458029, 2363877, 2261775, 2153842, 2042019, 1927994, 1813863, 1702132, 1594707, 1492569, 1396864, 1309403, 1231292, 1161618, 1098389, 1040505, 988300, 942501, 903379, 870631, 843430, 820596, 801193, 784941, 771845, 761592, 753550, 747135, 741980, 737967, 735178, 733538, 732429, 731012, 729009, 726726, 724352, 721768, 719067, 716548, 714000, 710737, 706576, 702136, 697921, 693791, 689601, 685666, 682335, 679802, 678622, 679540, 682369, 685909, 689525, 694099, 700913, 710362, 722341, 737037, 754542, 774358, 796065, 819901, 845923, 873247, 901018, 929665, 960210, 992725, 1026469, 1061465]
50734A061465L7532M1515M6215N1215N6705O2971O9974P7166Q3535Q8303R1546
50723A768142R3649R4225R2389Q7987Q1673P3614O3075M9628L3982J7188j63j7502
50711B437887l3606m7041n6978o3257o5937o5149o1312n5219m7866m0150l2620
50700A868752k5598j9580j5185j2683j2000j3375j7449k4257l2724m1575n0191
50689A604135n8161o4601o8662p0233o9637o7197o3564n9693n5788n1049m5187
50678I30363l9351l4613l0438k5770k0916j7000j4137j1427q372n093j567K102
50666G23781N104O842Q088R984J2301J3941J4761J5487J6136J6077J5505J5370
50654H73377J5933J6717J7835J9908K2635K4842K6171K7528K9675L2490L5646
$$ y = [1061465, 1098997, 1140512, 1186727, 1237942, 1294647, 1357618, 1427592, 1504758, 1588293, 1676596, 1768142, 1861791, 1956016, 2048405, 2136392, 2218065, 2291679, 2354754, 2404382, 2438364, 2455552, 2455389, 2437887, 2404281, 2357240, 2300262, 2237005, 2171068, 2105919, 2044607, 1989388, 1941522, 1901372, 1868752, 1843154, 1823574, 1808389, 1795706, 1783706, 1770331, 1752882, 1728625, 1695901, 1654326, 1604135, 1545974, 1481373, 1412711, 1342478, 1272841, 1205644, 1142080, 1082387, 1026599, 975550, 930363, 891012, 856399, 825961, 800191, 779275, 762275, 748138, 736711, 728339, 723246, 721679, 723781, 728885, 735727, 743815, 753799, 766100, 780041, 794802, 810289, 826425, 842502, 858007, 873377, 889310, 906027, 923862, 943770, 966405, 991247, 1017418, 1044946, 1074621, 1107111, 1142757]
50643A142757L8959M2070M4720M7347N0411N3319N5051N5611N5743N5586N4841
50632A696415N3769N2655N0693M6921M2008L7368L2885K7235K0341J3589P567
50621B081446J512m837j0661j5581j9911k3116k3922k2377k0005j7365j3310p373
50609A904500j085L945P674J0575J2455J3198J3323J2906J1189P936L883q77p483
50596A992139j6478k6589l6239m5038n3027n9683o4595o8017o9987o9907o7817
50585A414762o4963o2320n9592n6342n2949m9702m6112m1979l8100l4972l1873
50574H75858k8074k4088k0785j8143j5701j3354j0944p955m426j442J80J027K241
50561G34394M227O668R086J0913J1833J2514J4062J6362J8072J8740J9661K1916
$$ y = [1142757, 1181716, 1223786, 1268506, 1315853, 1366264, 1419583, 1474634, 1530245, 1585988, 1641574, 1696415, 1750184, 1802839, 1853532, 1900453, 1942461, 1979829, 2012714, 2039949, 2060290, 2073879, 2081446, 2082958, 2078121, 2067460, 2051879, 2031968, 2008852, 1984930, 1962553, 1942548, 1925183, 1911873, 1904500, 1903415, 1907360, 1915034, 1925609, 1938064, 1951262, 1964585, 1977491, 1988680, 1996616, 2000499, 1999622, 1992139, 1975661, 1949072, 1912833, 1867795, 1814768, 1755085, 1690490, 1622473, 1552486, 1482579, 1414762, 1349799, 1287479, 1227887, 1171545, 1118596, 1068894, 1022782, 980803, 942703, 907731, 875858, 847784, 823696, 802911, 784768, 769067, 755713, 744769, 736814, 732388, 730946, 731126, 732153, 734394, 738621, 745289, 754375, 765288, 777121, 789635, 803697, 820059, 838131, 856871, 876532, 898448]
50549H98448K4826K7196K9000L0737L2204L3005L3542L4460L5618L6494L7057
50538A252587L7567L8059L8690L9981M2160M4873M7988N1886N6548O1164O5221
50527A776724O9139P3313P7386Q1004Q4488Q8118R1620R4788R7787J00421J01943
50516B736731J02048J01102R9046R5076Q8732Q0153O9033N4731L7951K0778M309
50505C489690j2290k9591m6445o1639p5440q8086r8142j03878j05249j03171r7745
50494B668014q8729p6904o3497m8774l2525j5540N84J4732K6522L5684M1957M5025
50482B506549M3862L6957K4043O889j2354l2628n3099p1963q7392r8838j06350
50471B155676j09557j08634j05370j01743r7938r3042q7137q1232p5557o9316
$$ y = [898448, 923274, 950470, 979470, 1010207, 1042411, 1075416, 1108958, 1143418, 1179036, 1215530, 1252587, 1290154, 1328213, 1366903, 1406884, 1449044, 1493917, 1541905, 1593791, 1650339, 1711503, 1776724, 1845863, 1919176, 1996562, 2077566, 2162054, 2250172, 2341792, 2436580, 2534367, 2634788, 2736731, 2838779, 2939881, 3038927, 3134003, 3222735, 3302888, 3371921, 3426652, 3464603, 3485381, 3489690, 3477400, 3447809, 3401364, 3339725, 3264285, 3176199, 3078057, 2974179, 2868930, 2765759, 2668014, 2579285, 2502381, 2438884, 2390110, 2357585, 2342045, 2342629, 2357361, 2383883, 2419567, 2461524, 2506549, 2550411, 2587368, 2611411, 2618300, 2605946, 2573318, 2520219, 2448256, 2360864, 2262026, 2155676, 2046119, 1937485, 1832115, 1730372, 1632434, 1539392, 1452255, 1371023, 1295466, 1226150]
50461A226150o2230n5047m8543m2864l7859l3287k8770k4146j9797j6147j3120
50450H44340j0442q067n882l523r28J470L472N480P767J0100J2427J5038J7650
50437H88902J9337J9835K0058K0710K1544K2447K3985K6179K7943K8630K8888
50426A148458K9192K8878K7644K6650K6827K7266K6623K5081K3633K2412K1174
50415A433838K0437K0688K1325K1798K2976K5933L0069L3874L6920L9744M2387
50404A749989M4524M6402M8271M9380M8891M7247M5254M2441L7753L1381K4463
50393B215996J7319R385N26q925j9198l0792m3209n5064o5266p3279p8652q1241
50381A787600q1482p9640p5393o8879o1260n3302m4436l4351k4336j5659p688
$$ y = [1226150, 1163920, 1108873, 1060330, 1017466, 979607, 946320, 917550, 893404, 873607, 857460, 844340, 833898, 825831, 819949, 816426, 815498, 816968, 820440, 825920, 833687, 843787, 856214, 871252, 888902, 908239, 928074, 948132, 968842, 990386, 1012833, 1036818, 1062997, 1090940, 1119570, 1148458, 1177650, 1206528, 1234172, 1260822, 1287649, 1314915, 1341538, 1366619, 1390252, 1412664, 1433838, 1454275, 1474963, 1496288, 1518086, 1541062, 1566995, 1597064, 1630938, 1667858, 1707602, 1749989, 1794513, 1840915, 1889186, 1938566, 1987457, 2034704, 2079958, 2122399, 2160152, 2191533, 2215996, 2233315, 2242700, 2243226, 2234301, 2215103, 2184311, 2141102, 2086038, 2020772, 1947493, 1868841, 1787600, 1706118, 1626478, 1551085, 1482206, 1420946, 1367644, 1323208, 1288857, 1264521, 1248862, 1241174]
50370A241174P22Q903J5213J9374K2059K2829K0472J5074P886n13j0119j9855
50358A343219k7951l3955l8667m2252m4064m4277m3892m3111m1339l8784l6441
50347I08486l4425l2040k9499k7837k6906k5210k2144j8861j6417j4521j2601
50336F48025j0773r140p339n349l745k694j545J44K031L632M896N941O911Q146
50322F39141R777J1285J2109J2494J2962J3376J3462J3742J4769J5930J6322J6457
50310H01826J7608J9690K1317K1847K1838K1473K0153J7854J5454J3328J1005
50299A003393Q502O625N524M164J805j047l581n635p237q146q303q146q078q202
50285I71638q696r779j1284j2793j4184j5512j6540j7047j7231j7224j6667j5490
$$ y = [1241174, 1241896, 1250799, 1266012, 1285386, 1307445, 1330274, 1350746, 1365820, 1373706, 1373193, 1363074, 1343219, 1315268, 1281313, 1242646, 1200394, 1156330, 1112053, 1068161, 1025050, 983711, 944927, 908486, 874061, 842021, 812522, 784685, 757779, 732569, 710425, 691564, 675147, 660626, 648025, 637252, 628112, 620773, 615424, 611679, 608985, 607440, 607584, 609615, 613247, 618143, 624084, 630995, 639141, 648918, 660203, 672312, 684806, 697768, 711144, 724606, 738348, 753117, 769047, 785369, 801826, 819434, 839124, 860441, 882288, 904126, 925599, 945752, 963606, 979060, 992388, 1003393, 1011895, 1018520, 1024044, 1028208, 1030013, 1028966, 1025385, 1019750, 1012513, 1004367, 996064, 987918, 979840, 971638, 962942, 953163, 941879, 929086, 914902, 899390, 882850, 865803, 848572, 831348, 814681, 799191]
50273G99191j4512j4363j4403j3851j3217j3389j3887j3590j2673j2247j2356
50262F50703j2001j1007j0253r952r290p893o271m695k922j139R5Q98J929L177
50248E81379M016M314M371M103L492L485M811O360O348M900L723L442L114K366
50234F40224J911J767Q88r52k635l499m071m654m841m805n369o407o754o148n647
50219E89008n700n459m520l688l424l071k248j530j184o43K51R14J375K351L623
50204E66055L987L430L454M562N215M352L175L231M095M295L417K178J252R39
50190F13637J220J456R27L6q9N00M33p36j782j911k014k979m320n490p053r328
50174E82507j1143j1251j0033q636p331n805m274l174k360j474n38M00J505K565
$$ y = [799191, 784679, 770316, 755913, 742062, 728845, 715456, 701569, 687979, 675306, 663059, 650703, 638702, 627695, 617442, 607490, 598200, 590307, 584036, 579341, 576419, 575280, 575375, 576273, 578202, 581379, 585395, 589709, 594080, 598183, 601675, 605160, 609971, 616331, 622679, 627579, 631302, 634744, 637858, 640224, 642135, 643902, 644790, 643838, 641203, 637704, 633633, 628979, 624138, 619333, 613964, 607557, 600803, 594655, 589008, 583308, 577849, 573329, 569641, 566217, 563146, 560898, 559368, 558184, 557541, 557792, 558706, 560081, 562432, 566055, 570042, 573472, 576926, 581488, 586703, 591055, 594230, 597461, 601556, 605851, 609268, 611446, 612698, 613637, 614857, 616313, 617240, 617276, 617187, 617687, 618120, 617384, 615602, 613691, 611677, 608698, 604378, 598888, 591835, 582507, 571364, 560113, 550080, 541444, 534113, 528308, 524034, 520860, 518500, 517026, 516488, 516888, 518393, 520958]
50160E20958K925K404J404j06k558n423p312p827p947q042p162n120l488l458
50146D69248m084l987l459l537m060m150l766l464l206k623j928j571j451j197
50132D26765p96l55J60N50M90L45R82K387L525L925M252M814M928M337L888M061
50116D64258M218M013M153M861N114M356L523L293K790J350L7J0O19O63L24L67
50100E03949M10l05j308j601j305j135r07L1J372K226K466K610K828L123L901
50085E16355N333O718P411P759Q223Q480Q338Q613R870J1203J1607J1779J3039
50072F34728J5049J6219J6039J5611J5857J6470J6721J6421J5838J5211J4390
50061H08554J2887J0627Q541P633P465O716N332M646M952M776L331J951J833K017
$$ y = [520958, 523883, 526287, 527691, 527585, 525027, 519604, 512292, 504465, 496518, 488476, 481314, 476194, 472706, 469248, 465164, 461177, 457718, 454181, 450121, 445971, 442205, 438741, 435535, 432912, 430984, 429413, 427962, 426765, 425969, 425614, 425774, 426324, 426814, 427159, 428141, 430528, 434053, 437978, 442230, 447044, 451972, 456309, 460197, 464258, 468476, 472489, 476642, 481503, 486617, 490973, 494496, 497789, 500579, 501929, 501966, 501976, 502595, 503258, 503582, 503949, 504359, 504054, 502746, 501145, 499840, 498705, 497798, 497829, 499201, 501427, 503893, 506503, 509331, 512454, 516355, 521688, 528406, 535817, 543576, 551799, 560279, 568617, 577230, 587100, 598303, 609910, 621689, 634728, 649777, 665996, 682035, 697646, 713503, 729973, 746694, 763115, 778953, 794164, 808554, 821441, 832068, 840609, 848242, 855707, 862423, 867755, 872401, 877353, 882129, 885460, 887411, 889244, 891261]
50047H91261J086n42j640k192k792l074k510j839k052k691k774k586k970l611
50033H61074l640l249l183l219k784k351k655l119k697j680j063o67L95J973L366
50018H36501N008P806J1178J3626J5055J6630J8459J9301J8677J7453J6110J4121
50006A009925J1425R005P479O403N444N153O006P615R226J0337J0637R833P646
49993A116134L657k455r983j7199k2981k7860l2600l6553l8546l8661l7884l6545
49981H18524l4429l1883k9501k7101k4343k1789k0080j8573j6348j4061j3147
49970E67269j3467j3365j1964r857p712n663m095l482l438l224l056l611m417
49957D79918m248l093k218k253k642k957l308l460l019k576l146m355m740l987
$$ y = [891261, 892347, 891805, 890165, 887973, 885181, 882107, 879597, 877758, 875706, 873015, 870241, 867655, 864685, 861074, 857434, 854185, 851002, 847783, 844999, 842648, 839993, 836874, 834177, 832497, 831434, 830767, 831162, 833135, 836501, 841509, 849315, 860493, 874119, 889174, 905804, 924263, 943564, 962241, 979694, 995804, 1009925, 1021350, 1030355, 1037834, 1044237, 1049681, 1054834, 1060840, 1068455, 1077681, 1088018, 1098655, 1108488, 1116134, 1119791, 1117336, 1107353, 1090154, 1067173, 1039313, 1006713, 970160, 931614, 892953, 855069, 818524, 784095, 752212, 722711, 695610, 671267, 649478, 629398, 610825, 594477, 580416, 567269, 553802, 540437, 528473, 518616, 510904, 505241, 501146, 497664, 494226, 491002, 487946, 484335, 479918, 475670, 472577, 470359, 468106, 465464, 462507, 459199, 455739, 452720, 450144, 446998, 442643, 437903, 433916]
49943D33916l367l587l799l174k111j303q09o15r89j822k441k429j844n63J524
49928D06587L628M565M353M138M379M393L889L707M460N598O310O496O385O117
49914D75005N986O268O553O142N358N443O877Q715R940J0587J1250J2356J4256
49901E84736J7184K0733K4074K6942K9755L2584L4735L5600L5171L3572L0815
49890I05901K7253K3693K0818J8953J8254J8606J9480K0464K1634K2794K2792
49879A140642K0507J6166J0648L976m245j3213k1096k6930l1093l3990l5547l6134
49867I89691l6617l7173l7130l6226l4952l3485l1384k8687k6314k4955k4324
49856F38444k3689k2459k0237j7149j4242j2607j2071j1502j0389r179q164p058
$$ y = [433916, 430549, 426962, 423163, 419989, 417878, 416575, 415766, 415151, 414162, 412340, 409899, 407470, 405626, 405063, 406587, 410215, 414780, 419133, 423271, 427650, 432043, 435932, 439639, 444099, 449697, 456007, 462503, 468888, 475005, 480991, 487259, 493812, 499954, 505312, 510755, 517632, 526347, 536287, 546874, 558124, 570480, 584736, 601920, 622653, 646727, 673669, 703424, 736008, 770743, 806343, 841514, 875086, 905901, 933154, 956847, 977665, 996618, 1014872, 1033478, 1052958, 1073422, 1095056, 1117850, 1140642, 1161149, 1177315, 1187963, 1191939, 1187694, 1174481, 1153385, 1126455, 1095362, 1061372, 1025825, 989691, 953074, 915901, 878771, 842545, 807593, 774108, 742724, 714037, 687723, 662768, 638444, 614755, 592296, 572059, 554910, 540668, 528061, 515990, 504488, 494099, 484920, 476756, 469698]
49844D69698n756m587l688l007k843l509m496m932m782m732n027n343n587n833
49830D05576n716m946m179m196m531m109l004k204j865j245l05J77L0j09r0l29
49814C68955o24k63O60J374J787K312K598K036J395K006L412L730K613J771K143
49799C95905K666K414K056K236K359K005J932K697L575L827L809M003M156M182
49785D37822M694N885P013P722Q766J0690J2942J4951J6957J9171K1241K3128
49773E90982K5320K7546K8493K7433K4984K1782J7748J3265R609P473O270N602
49761H06507O033P762R879J1728J3492J4661J3455Q902K160n176j2740k0326k6676
49748H29661l0681l2675l3305l2330k9693k6606k4172k1921j9047j6061j3843
$$ y = [469698, 463942, 459355, 455667, 452660, 449817, 446308, 441812, 436880, 432098, 427366, 422339, 416996, 411409, 405576, 399860, 394914, 390735, 386539, 382008, 377899, 374895, 372691, 370826, 369581, 369276, 369453, 369483, 369374, 369284, 368955, 368331, 368068, 368728, 370102, 371889, 374201, 376799, 378835, 380230, 382236, 385648, 389378, 391991, 393762, 395905, 398571, 400985, 403041, 405277, 407636, 409641, 411573, 414270, 417845, 421672, 425481, 429484, 433640, 437822, 442516, 448401, 455414, 463136, 471902, 482592, 495534, 510485, 527442, 546613, 567854, 590982, 616302, 643848, 672341, 699774, 724758, 746540, 764288, 777553, 787162, 794635, 800905, 806507, 812540, 820302, 830181, 841909, 855401, 870062, 883517, 892419, 894579, 889403, 876663, 856337, 829661, 798980, 766305, 733000, 700670, 670977, 644371, 620199, 598278, 579231, 563170, 549327]
49737E49327j1997r710p447o311o139n694m422k839j406j94N15L58m23j065j096
49722D91457o56k62m80j242j539n33R25J033m70j881k039j731j862j837r23J62
49706D78122M20K64O36J320J491J201J045R98P95Q57J670K732L258L345L473L420
49690E05047K762J923J669J956K187K147J850J101J16j18Q72J984J847O51k94
49675E25700l73l1K17R3o43j789k388j786o78k41n99r65q99o07k80P5L19L42K78
49656E15745J81j22m73l71J51L88R8j30j00n24j613k294j798r56q48j095p41J0
$$ y = [549327, 537330, 527620, 520173, 513862, 507723, 502029, 497607, 494768, 493362, 493168, 493683, 494041, 493618, 492553, 491457, 490801, 490539, 490059, 488817, 487278, 486745, 487670, 488703, 488233, 486352, 484313, 482582, 480720, 478883, 477960, 478122, 478542, 478806, 479442, 480762, 482253, 483454, 484499, 485497, 486292, 487149, 488819, 491551, 494809, 498154, 501627, 505047, 507809, 509732, 511401, 513357, 515544, 517691, 519541, 520642, 520758, 520640, 521512, 523496, 525343, 525994, 525700, 525327, 525296, 525513, 525606, 524963, 523174, 520786, 519000, 518322, 518081, 517482, 516517, 515618, 515011, 514731, 514806, 515125, 515467, 515745, 515926, 515804, 515331, 514960, 515111, 515499, 515597, 515467, 515367, 514843, 513230, 510936, 509138, 508182, 507334, 506239, 505498, 505508]
$$ [...]
##END NTUPLES=NMR SPECTRUM
##END=
