
##TITLE=AC1321_SOiAH12150_6535441_4qZrv8xbqo
##JCAMPDX= 6.0         $$ Bruker NMR JCAMP-DX V2.0
##DATA TYPE= NMR SPECTRUM
##DATA CLASS= NTUPLES
##ORIGIN= BRUKER
##OWNER= Administrator
$$ 1.72 TOPSPIN		Version 2.1
$$ 2012-07-17 17:11:16.171 -0500  Administrator@TOPSPIN
$$ Compression mode = diff/dup
##.OBSERVE FREQUENCY= 400.02188249412
##.OBSERVE NUCLEUS= ^1H
##.ACQUISITION MODE= SIMULTANEOUS (DQD)
##.ACQUISITION SCHEME= undefined
##.AVERAGES= 8
##.DIGITISER RES= 22
##SPECTROMETER/DATA SYSTEM= spect
##.PULSE SEQUENCE= zg30
##.SOLVENT NAME= COFFEE_meoh
##.SHIFT REFERENCE= INTERNAL, COFFEE_meoh, 1, 14.98509
##AUDIT TRAIL= $$ (NUMBER, WHEN, WHO, WHERE, PROCESS, VERSION, WHAT)
$$ ##TITLE= Audit trail, TOPSPIN		Version 2.1
$$ ##JCAMPDX= 5.01
$$ ##ORIGIN= Bruker BioSpin GmbH
$$ ##OWNER= Administrator
$$ $$ C:\Bruker\TOPSPIN/data/COFFEE/nmr/AC1321_SOiAH12150_6535441_4qZrv8xbqo/10/pdata/1/auditp.txt
$$ ##AUDIT TRAIL=  $$ (NUMBER, WHEN, WHO, WHERE, PROCESS, VERSION, WHAT)
(   1,<2012-07-17 17:11:08.078 -0500>,<Administrator>,<TOPSPIN>,<go>,<TOPSPIN 2.1>,
      <created by zg
	started at 2012-07-17 17:10:01.468 -0500,
	POWCHK enabled, PULCHK disabled,
       configuration hash MD5:
       6B 1B 68 BB D9 2E 58 E2 7F 35 AD 54 07 DF 0E 41
       data hash MD5: 64K
       C7 41 26 B1 8D B1 60 3A 01 49 4E 9E 3F 76 1C 9E>)
(   2,<2012-07-17 17:11:12.015 -0500>,<Administrator>,<TOPSPIN>,<proc1d>,<TOPSPIN 2.1>,
      <Start of raw data processing
       efp LB = 0 FT_mod = 6 PKNL = 1 PHC0 = 0 PHC1 = 0 SI = 32K 
       data hash MD5: 32K
       7D 3D D4 2D B9 8A 14 86 29 14 B2 64 40 4D 58 CF>)
(   3,<2012-07-17 17:11:12.296 -0500>,<Administrator>,<TOPSPIN>,<proc1d>,<TOPSPIN 2.1>,
      <pk PHC0 = 177.1655 PHC1 = 0 
       data hash MD5: 32K
       C4 50 49 CC 44 34 A4 5A AC 47 17 73 28 DC 66 73>)
(   4,<2012-07-17 17:11:12.375 -0500>,<Administrator>,<TOPSPIN>,<proc1d>,<TOPSPIN 2.1>,
      <abs ABSG = 1 
       data hash MD5: 32K
       9E 4F 96 40 BD 1A 75 7C 06 27 CA 62 62 21 E5 58>)
(   5,<2012-07-17 17:11:12.406 -0500>,<Administrator>,<TOPSPIN>,<proc1d>,<TOPSPIN 2.1>,
      <abs ABSG = 2 
       data hash MD5: 32K
       06 8F 9E E9 FF D4 FF 1A 22 F9 62 42 BE DF 78 2C>)
(   6,<2012-07-17 17:11:12.421 -0500>,<Administrator>,<TOPSPIN>,<proc1d>,<TOPSPIN 2.1>,
      <abs ABSG = 3 
       data hash MD5: 32K
       C7 D6 7A 16 28 8D 0C CF 4A 48 A0 08 56 9B C5 3A>)
(   7,<2012-07-17 17:11:12.453 -0500>,<Administrator>,<TOPSPIN>,<proc1d>,<TOPSPIN 2.1>,
      <abs ABSG = 4 
       data hash MD5: 32K
       26 0F 5F 9D 5A 3C 80 69 82 25 A3 0A 7C 42 91 62>)
(   8,<2012-07-17 17:11:12.484 -0500>,<Administrator>,<TOPSPIN>,<proc1d>,<TOPSPIN 2.1>,
      <abs ABSG = 5 
       data hash MD5: 32K
       1E 9D E4 B6 79 55 50 64 92 29 3B 0C 29 7B C8 3D>)
$$ ##END=
$$ 
$$ $$ hash MD5
$$ $$ 4C 27 EC 92 44 76 2E 95 09 02 72 39 DC 13 CF 2C
##$RELAX= 
##$RELAX= 
##$RELAX= 
##$RELAX= 
##$RELAX= 
##$RELAX= 
##$RELAX= 
$$ Bruker specific parameters
$$ --------------------------
$$ [...]
150 150 150 150 150 150 150 150
##$TP07= 0
##$TPNAME0= <>
##$TPNAME1= <>
##$TPNAME2= <>
##$TPNAME3= <>
##$TPNAME4= <>
##$TPNAME5= <>
##$TPNAME6= <>
##$TPNAME7= <>
##$TPOAL= (0..7)
0.5 0.5 0.5 0.5 0.5 0.5 0.5 0.5
##$TPOFFS= (0..7)
0 0 0 0 0 0 0 0
##$TUNHIN= 0
##$TUNHOUT= 0
##$TUNXOUT= 0
##$USERA1= <user>
##$USERA2= <user>
##$USERA3= <user>
##$USERA4= <user>
##$USERA5= <user>
##$V9= 5
##$VALIST= <valist>
##$VCLIST= <CCCCCCCCCCCCCCC>
##$VD= 0
##$VDLIST= <DDDDDDDDDDDDDDD>
##$VPLIST= <PPPPPPPPPPPPPPP>
##$VTLIST= <TTTTTTTTTTTTTTT>
##$WBST= 2048
##$WBSW= 25
##$XGAIN= (0..3)
0 0 0 0
##$XL= 0
##$YL= 0
##$YMAX_a= 504185
##$YMIN_a= -644205
##$ZGOPTNS= <>
##$ZL1= 120
##$ZL2= 120
##$ZL3= 120
##$ZL4= 120
##$ABSF1= 14.98509
##$ABSF2= -5.573092
##$ABSG= 5
##$ABSL= 3
##$ALPHA= 0
##$AQORDER= 0
##$ASSFAC= 0
##$ASSFACI= 0
##$ASSFACX= 0
##$ASSWID= 0
##$AUNMP= <proc_prof1d_extract_pilot.lims>
##$AXLEFT= 0
##$AXNAME= <>
##$AXNUC= <1H>
##$AXRIGHT= 0
##$AXTYPE= 0
##$AXUNIT= <>
##$AZFE= 0.1
##$AZFW= 0.1
##$BCFW= 0
##$BC_mod= 0
##$BYTORDP= 0
##$COROFFS= 0
##$CY= 15
##$DATMOD= 1
##$DC= 0
##$DFILT= <>
##$DTYPP= 0
##$F1P= 0
##$F2P= 0
##$FCOR= 0.5
##$FTSIZE= 32768
##$FT_mod= 6
##$GAMMA= 0
##$GB= 0
##$INTBC= 1
##$INTSCL= 1
##$ISEN= 128
##$LB= 0
##$LEV0= 0
##$LPBIN= 0
##$MAXI= 10000
##$MC2= 0
##$MEAN= 0
##$ME_mod= 0
##$MI= 0
##$NCOEF= 0
##$NC_proc= -8
##$NLEV= 6
##$NOISF1= 0
##$NOISF2= 0
##$NSP= 0
##$NTH_PI= 0
##$NZP= 0
##$OFFSET= 14.98509
##$PC= 1
##$PHC0= 177.1655
##$PHC1= 0
##$PH_mod= 1
##$PKNL= yes
##$PPARMOD= 0
##$PPDIAG= 0
##$PPIPTYP= 0
##$PPMPNUM= 2147483647
##$PPRESOL= 1
##$PSCAL= 4
##$PSIGN= 0
##$PYNMP= <proc.py>
##$REVERSE= no
##$SF= 400.02
##$SI= 32768
##$SIGF1= 0
##$SIGF2= 0
##$SINO= 400
##$SIOLD= 32768
##$SPECTYP= <>
##$SREGLST= <1H.CDCl3>
##$SSB= 0
##$STSI= 32768
##$STSR= 0
##$SW_p= 8223.68421052631
##$SYMM= 0
##$S_DEV= 0
##$TDeff= 65536
##$TDoff= 0
##$TI= <>
##$TILT= no
##$TM1= 0
##$TM2= 0
##$TOPLEV= 0
##$USERP1= <user>
##$USERP2= <user>
##$USERP3= <user>
##$USERP4= <user>
##$USERP5= <user>
##$WDW= 1
##$XDIM= 32768
##$YMAX_p= 477487776
##$YMIN_p= -753318
##$CURPLOT= <Network HP LaserJet P1505>
##$CURPRIN= <$Network HP LaserJet P1505>
##$DFORMAT= <normdp>
##$LAYOUT= <+/1D_H.xwp>
##$LFORMAT= <normlp>
##$PFORMAT= <normpl>
##$SURQMSG= 1
$$ End of Bruker specific parameters
$$ ---------------------------------
##NTUPLES= NMR SPECTRUM
##VAR_NAME=  FREQUENCY,     SPECTRUM/REAL,   SPECTRUM/IMAG
##SYMBOL=    X,             R,               I
##VAR_TYPE=  INDEPENDENT,   DEPENDENT,       DEPENDENT
##VAR_FORM=  AFFN,          ASDF,            ASDF
##VAR_DIM=   32768,         32768,           32768
##UNITS=     HZ,            ARBITRARY UNITS, ARBITRARY UNITS
##FACTOR=    0.250966925370066, 1,           1
##FIRST=     8223.43324360094, -50033,       68928
##LAST=      0,             49511,           -131119
##MIN=       0,             -753318,         0
##MAX=       8223.43324360094, 477487776,    0
$$ Real data points
##PAGE= N=1
##DATA TABLE= (X++(R..R)), XYDATA
$$ [...]
$$ plain form
19566 -494381 29273 -138698 -123532 -188335 -212362 -52309 -51648 112354 126251 -159197 -149075
19555 -149075 -365177 -168979 -142947 -423180 153326 13815 -151040 -165872 -179853 -219849
19545 -219849 -54418 -80691 67126 -163459 -74756 -68174 -76869 -35558 -180416 355036 -158592
19533 -87121 -419514 289163 167929 -41853 -221878 -154145 73791 -18550 142924 162255 8294
19521 -467514 -33500 96830 11536 45589 3021 -58981 -99417 -117404 -337750 -29972 -4938 82566
19508 39089 -19089 99670 -84572 -53921 -98235 39099 -326256 -108844 -144626 -115894 -226905
19497 -226905 80067 332378 -214361 265911 143397 -76298 -268049 -59497 115841 -50191
19486 -94915 -190561 198136 -13726 -124855 -67613 25452 -147348 -95217 48928 144348 -118537
$$ packed form
19566d94381B9273a38698J5166o4803k4027e2309O61A12354J3897a59197J0122
19555a49075k16102a68979K6032k80233A53326A3815a51040j4832j3981l9996
19545b19849e4418k6273F7126a63459g4756O582q695c5558j44858C55036a58592
19533h7121l32393B89163j21234d1853j80025O7733G3791a8550A42924J9331H294
19521d67514c3500I6830A1536L4053C021e8981m0436j7987k20346b9972d938H2566
19508C9089a9089I9670h4572L0651m4314C9099c26256a08844l5782K8732j11011
19497b26905H0067K52311b14361B65911j22514g6298j91751e9497A15841e0191
19486i4915r5646A98136a3726j11129N7242B5452a47348N2131D8928R5420a18537
$$ plain form
19474 -182111 122484 -168523 115563 -20431 190874 246058 243875 -321390 127391 -244037
19463 61306 -40879 -394185 38192 13557 25915 93486 -66322 252974 -19649 112551 -126947
19451 67291 172570 -379638 278530 -99223 -164098 125385 6611 53743 127182 -10351 7826
19439 -24232 -11017 173820 123443 -85511 -436623 75126 -241950 -156774 28638 -49480 -335738
19428 -335738 -184494 -145243 32671 -284253 179727 -179776 -49368 -205455 53635 -111994
19417 -23566 -411025 179476 -124980 1840 137658 -8633 -70122 -45164 -212676 -186324 -355013
19406 -355013 -118929 -189860 -329440 99324 -57501 -66769 -178166 76596 -31986 -126695 269607
19394 -196477 -200261 84324 -48854 -161652 310518 -129011 -169124 134391 -76311 63520 127718
$$ packed form
19474a82111A22484a68523A15563b0431A90874N5184k183c21390A27391b44037
19463F1306d0879l53306C8192A3557J2358O7571f6322B52974a9649A12551a26947
19451F7291J05279c79638B78530i9223o4875A25385F611M7132P3439a0351G826
19439b4232a1017A73820n0377h5511l51112G5126b41950Q5176B8638d9480k86258
19428c35738J51244L9251C2671b84253A79727a79776d9368j56087E3635a11994
19417b3566l87459A79476a24980A840J35818h633o1489K4958j67512K6352j68689
19406c55013a18929p0931j39580I9324e7501r268j11397G6596c1986r4709B69607
19394a96477l784H4324d8854j12798C10518a29011m0113A34391g6311F3520O4198
$$ plain form
19383 127718 -31569 -41062 15878 26406 -32486 222526 -375026 -9656 -83363 155789 -36181
19371 -298607 -435747 36030 306819 -87013 -143680 292616 -294144 -298329 -271612 -30674 -249591
19360 -249591 -125781 -207855 -253418 -160124 116002 86351 -353237 171146 148784 -238866
19349 289360 -172777 -105095 16884 9107 -322466 173590 -154498 -223824 -110277 -107027 -225609
19338 -225609 -29731 82094 110913 -42050 -292933 -188927 -323041 -12360 -67047 -181305 -107152
19327 -107152 60006 -306411 31856 -123789 -133196 -108999 5533 -200848 -246005 -221573 -171981
19316 -171981 -220844 -156918 127378 -451769 -4686 46802 -161351 -461782 46244 60716 -7111
19304 23995 -82449 -239007 -13193 -43185 -11222 182236 -394776 77217 84684 -278960 -80846
$$ packed form
19383A27718c1569r493A5878J0528c2486B22526c75026i656p3707A55789c6181
19371b98607j37140C6030K70789h7013n6667B92616b94144m185K6717c0674k18917
19360b49591J23810q2074m5563R3294A16002k9651c53237A71146k2362b38866
19349B89360a72777O7682A6884p777c22466A73590a54498o9326a10277L250j18582
19338b25609b9731H2094K8819d2050k50883J04006j34114a2360n4687j14258P4153
19327a07152F0006c06411C1856a23789r407K4197E533b00848m5157K4432M9592
19316a71981m8863O3926A27378d51769d686D6802a61351l00431D6244J4472g111
19304B3995h2449j56558a3193k9992a1222A82236c94776G7217P467b78960h0846
$$ plain form
19292 155881 -8170 146804 -261569 -32127 9419 -184219 -156712 203170 61905 -237372 -125921
19281 -125921 -38523 211125 321251 -165719 113002 -338866 140732 -427986 205380 -320481
19270 -35881 -12083 9346 119080 171599 53820 -379975 -80857 -388526 -294159 -185386 -67350
19258 140597 180392 -99248 127452 12620 8787 -116593 -101742 -136068 -248802 39019 118730
19247 118730 -136577 -226593 123533 62382 -249492 -7358 -24316 -134050 -76906 49475 -204450
19235 44394 -169769 -36520 27309 -142539 280050 269012 95629 -73860 -107921 -238550 -91961
19223 9045 94682 -90151 -93702 106080 -2385 -289865 -257349 67114 -194290 46946 -109131
19211 -124501 -42461 -396081 45750 -39339 151520 -22661 -123700 -97312 -73707 50845 -26348
$$ packed form
19292A55881h170A46804b61569c2127I419a84219K7507B03170F1905b37372J11451
19281a25921c8523B11125J10126a65719A13002c38866A40732d27986B05380c20481
19270c5881a2083I346J09734N2519E3820c79975h0857l07669R4367J08773f7350
19258A40597L9795i9248A27452A2620l833a16593J4851l4326j12734C9019P9711
19247A18730a36577r0016A23533o1151b49492g358j6958j09734N7144D9475b04450
19235D4394a69769c6520B7309a42539B80050j1038I5629g3860l4061j30629i1961
19223I045Q5637i0151l551A06080b385k87480L2516F7114a94290D6946a09131
19211a24501d2461l53620D5750c9339A51520b2661j01039K6388K3605E0845b6348
$$ plain form
19199 -166413 269779 -159189 106279 124415 273935 -145117 386846 185349 80659 -45925
19188 -109369 106558 79118 -170011 -96227 -89354 -188021 -122142 -194829 136364 -85480 -259828
19177 -259828 -230915 -10008 -433168 -414604 46091 153035 -168574 -18026 -71799 -193042 241856
19165 51575 -40258 154265 -90278 -60283 5254 -132610 -292244 265992 -100339 32246 356518
19154 356518 -26549 -82519 231306 -85052 -87343 -405059 -157232 -210312 -68697 -292656 231057
19142 -41504 -154049 -346510 -281781 82665 -80549 -109854 -430854 -151595 -354513 22986 -8511
19130 -105011 68713 -325645 323593 -66794 -276887 -177285 -490843 43975 -58186 -47044 85660
19118 1680 -204119 57422 -318509 -152364 21914 -228764 -139390 -195218 29784 70611 -200930
$$ packed form
19199a66413B69779a59189A06279J8136J49520a45117C86846A85349H0659d5925
19188a09369A06558k7440a70011P3784O873r8667O5879p2687A36364h5480j74348
19177b59828K8913a0008m23160J8564D6091J06944a68574a8026n3773j21243B41856
19165E1575d0258A54265i0278K9995E254a32610j59634B65992a00339C2246L24272
19154C56518b6549n5970B31306h5052k291l17716a57232n3080f8697k23959B31057
19142d1504j12545j92461O4729H2665h0549k9305l21000a51595k02918B2986h511
19130a05011F8713c25645C23593f6794k10093R9602l13558D3975e8186J1142H5660
19118A680b04119E7422c18509a52364B1914b28764Q9374n5828B9784M0827b00930
$$ plain form
19106 -163197 58896 138399 -264187 109138 -33738 93291 412521 27520 -250411 -240943 14177
19094 -222738 -33269 94982 -48812 -115373 -71758 75580 33733 -83906 241611 -244988 -171229
19083 -171229 -207876 231242 19332 32977 -28807 -269488 107670 -205458 -39931 -245471
19073 -245471 32309 67773 -246735 70408 3048 31415 189675 -188672 -197733 147169 111448
19062 111448 -188550 30673 27997 86177 -147902 -62903 238772 24725 219198 -301235 26618
19050 -200102 198986 -260558 -104841 -134587 -235456 17812 -245240 96502 -98669 -374384
19040 -374384 6141 58551 17719 293538 -149975 -82486 -49698 319750 17814 -236018 -130288
19029 -130288 89699 106936 135262 382979 96370 -241390 95330 281516 56456 132756 -31387
$$ packed form
19106a63197E8896P9503b64187A09138c3738I3291L19230B7520b50411R468A4177
19094b22738c3269I4982d8812o6561M3615G5580C3733h3906B41611b44988P3759
19083a71229l6647B31242A9332J3645b8807k40681A07670b05458c9931k05540
19073b45471C2309L5464b46735G0408C048K8367J58260a88672r061A47169l5721
19062A11448a88550C0673k676N8180a47902f2903B38772B4725J94473c01235B6618
19050b00102A98986b60558a04841k9746j00869A7812b45240I6502i8669k75715
19040c74384F141N2410A7719K75819a49975O7489L2788C19750A7814b36018J05730
19029a30288H9699J7237K8326K47717I6370b41390I5330J86186E6456P6300c1387
$$ plain form
19017 -187626 -162935 227899 66076 -190242 435333 202624 -10027 23065 -275145 -78999
19006 -349930 -243383 -29822 -64170 54442 52796 -32586 100171 -419404 -207104 -65257 214523
18994 9978 44418 228095 -195986 -329767 14854 -2561 -28677 -98779 160694 -360968 311467
18982 -90500 23339 -160924 -142631 -25390 -147723 6591 -181502 49754 28124 -97265 343369
18970 -152986 173804 -10664 -219375 -26138 -334624 -189175 -4197 -70854 -153256 -343477 -150986
18958 79669 -198257 -80121 87124 -170367 63417 2062 207771 -218744 -535244 -254697 100748
18946 -145901 6909 347342 90746 175277 67161 65344 101840 67522 -18677 43856 401028
18935 401028 -38526 -25519 -45067 71245 331372 -306168 36849 13356 -351217 -174271 13129
$$ packed form
19017a87626K4691B27899F6076a90242D35333B02624a0027B3065b75145g8999
19006c49930J06547b9822l4348E4442j646c2586A00171d19404b07104f5257B14523
18994I978L4440J83677a95986j33781A4854b561k6116p0102A60694c60968C11467
18982i0500B3339a60924J8293b5390j22333F591a81502D9754k1630i7265C43369
18970a52986A73804a0664k08711b6138l08486J45449d197o6657q2402j90221a50986
18958G9669a98257h0121H7124a70367F3417B062K05709b18744l16500b54697A00748
18946a45901F909L40433I0746Q4531F7161j817L6496l4318a8677D3856L57172
18935D01028c8526J3007j9548G1245K60127c06168C6849A3356c51217a74271A3129
$$ plain form
18923 -101663 23491 -81332 263588 29837 -171528 86703 -171374 52788 -17617 227604 -178288
18911 -113359 76789 38940 -257782 128967 33651 16029 148961 35965 -38283 50365 311863
18900 311863 122987 172871 275676 198556 11977 269879 -120638 182359 80051 -120990
18889 5835 -239530 147778 -268880 -21958 103724 6632 4274 -430 -90398 -21939 -65483 -169068
18877 -169068 -273623 102526 -147587 -38816 -137692 56776 77767 81074 -133315 -159432 -75754
18865 -117993 -377890 -92209 18282 -58039 -143143 -149410 -231166 -75168 -346982 -881 196010
18853 -33129 -102798 -167009 -78044 133038 -85938 -78026 224409 58008 278372 -10774 145741
18841 -240368 -274638 -103437 158401 -310868 -97043 256615 219598 -299242 151853 -168141
$$ packed form
18923a01663B3491h1332B63588B9837a71528H6703a71374E2788a7617B27604a78288
18911a13359G6789l7849b57782A28967C3651A6029J32932C5965c8283E0365K61498
18900C11863A22987M9884J02805p7120A1977K57902a20638A82359H0051a20990
18889E835b39530A47778b68880b1958A03724F632k358d30q9968b1939m3544j03585
18877a69068j04555A02526a47587c8816r8876E6776K0991L307a33315k6117g5754
18865a17993k59897i2209A8282e8039q5104o267q1756g5168k71814h81A96010
18853c3129o9669o4211g8044A33038h5938P912B24409E8008K20364a0774A45741
18841b40368l4270a03437A58401c10868i7043B56615l7017b99242A51853a68141
$$ plain form
18830 -255988 80538 -210219 -29699 57659 -105783 -229955 295402 -345469 254549 324211
18820 324211 145695 -65874 291160 126607 -67065 -118071 196267 421522 -57456 165378
18809 91190 214638 234582 206302 125018 -184325 386705 -50811 46735 -10664 -39966 -8031
18797 -291140 -27247 -336112 -185255 -290982 -129093 -79185 -43009 224081 -145414 20289
18786 -100218 139192 31370 -183178 -28387 -164572 -317072 292168 56632 -41560 -116052
18776 -116052 77042 -1465 13077 224716 24018 230595 -89129 -46623 -28006 -196427 -111186
18765 -111186 87645 -123591 19968 -258871 -288225 -98032 -295390 -90251 -48434 -68238 -164788
18754 -164788 -89120 -107169 -4001 138841 -131625 -256149 -283438 -139312 -46902 -35349 -180379
$$ packed form
18830b55988H0538b10219b9699E7659a05783j24172B95402c45469B54549O9662
18820C24211A45695f5874B91160A26607f7065n1006A96267K25255e7456A65378
18809I1190J23448J9944k8280q1284a84325C86705e0811D6735a0664k9302h031
18797b91140b7247l08865J50857j05727a29093M9908L6176B24081a45414B0289
18786a00218A39192C1370a83178b8387j36185j52500B92168E6632d1560p4492
18776a16052G7042a465A3077K11639B4018K06577h9129M2506J8617j68421Q5241
18765a11186H7645a23591A9968b58871k9354i8032j97358i0251M1817j9804r6550
18754a64788P5668j8049d001A38841a31625j24524k7289a39312d6902J1553j45030
$$ plain form
18743 -180379 8222 13860 -313922 -48470 -244941 221079 65154 -102606 -348423 -283821 -318809
18732 -318809 74505 53372 -145930 133214 -176693 199800 149068 -96333 -137766 -142071 -111869
18721 -111869 -109464 210952 -148647 -230751 -416905 305679 -53267 107538 -244831 -277649
18711 -277649 -228226 -123395 -88836 23226 327558 210833 -165645 17765 -194165 -2299 145861
18699 326259 -67667 -171015 -175887 127328 -122177 -225745 191773 -1404 24253 -184902 57468
18687 106410 -59970 -84035 272891 -23230 98465 -213648 59372 -123910 -108115 -210053 -155298
18676 -155298 -137408 -163365 -40063 -246701 -62835 -259459 -314016 198634 218562 4471 63557
18665 63557 -415512 59641 93258 -184983 -267179 -185126 105859 -86565 -264115 -140198 -35820
$$ packed form
18743a80379H222N638c13922d8470j96471B21079F5154a02606k45817O4602l4988
18732c18809G4505k1133a45930A33214a76693A99800n0732i6333m1433m305L0202
18721a11869K405B10952a48647q2104j86154C05679e3267A07538b44831l2818
18711b77649M9423J04831L4559B3226L04332j16725a65645A7765a94165b299A45861
18699C26259f7667j03348m872A27328a22177j03568A91773a404B4253a84902E7468
18687A06410e9970k4065B72891b3230I8465b13648E9372a23910J5795j01938N4755
18676a55298J7890k5957d0063k06638f2835j96624n4557A98634J9928D471N9086
18665F3557d15512E9641L3617a84983q2196Q2053A05859h6565j77550J23917c5820
$$ plain form
18653 -224783 8917 -58937 -323749 45101 59300 -240093 109243 116856 -59313 -337983 47956
18641 -97100 -138962 -230950 158609 -34980 579 -359857 72663 -75848 -173441 -145474 271413
18629 279986 288679 111477 -310920 -22042 221217 -26351 -76210 39957 -153834 174329 -223564
18617 -52502 377746 -168777 -230454 -22107 -91979 -58595 -143692 46745 -89689 40883 190154
18606 190154 -205490 -86135 -30405 114586 168589 -26789 -207030 -535442 45298 54169 69820
18595 69820 -295671 -299987 -66840 -247910 228002 161702 -30627 -147678 -137568 -271067 -12010
18583 -6221 -125063 11513 -9947 -10755 -67637 167853 -271185 -36732 -120412 136982 25813 -200382
18570 -9212 -145886 -337062 -120396 -391183 -46528 121919 14005 189812 57118 -115416
$$ packed form
18653b24783H917e8937k64812D5101J4199b40093A09243P613e9313k78670D7956
18641i7100m1862r1988A58609c4980E79c59857G2663g5848r7593K7967B71413
18629B79986Q693A11477c10920b2042B21217b6351m9859C9957a53834A74329b23564
18617e2502C77746a68777o1677b2107o9872L3384q5097D6745h9689D0883J49271
18606A90154b05490h6135c0405A14586N4003b6789j80241l28412D5298Q871J5651
18595F9820b95671m316f6840j81070B28002o6300c0627j17051J0110j33499a2010
18583f221j18842A1513i947q08n6882A67853b71185c6732q3680A36982B5813b00382
18570i212j36674j91176a20396k70787d6528A21919A4005J75807E7118a15416
$$ plain form
18559 37036 -66513 145991 66920 -43551 -65003 -9211 62822 -208025 -178825 202284 -13007
18547 184134 30138 -37542 -351245 157757 -256116 16450 168965 -84784 -46905 32030 -14365
18535 43470 -183898 -16813 -447489 -206405 266966 87579 -4388 -199850 -6634 -252105 171238
18523 -92740 -87063 63345 -133064 -54240 10984 -32723 -67841 256588 51046 -99109 -161569
18512 -161569 150884 -170345 88729 41257 -144999 190876 -156447 -78054 -191835 -69040
18501 -351602 72326 65945 76407 331659 -346937 141731 -151108 -2917 -49062 85677 -62494
18489 87080 178816 84511 85978 -299602 -3326 212017 -277885 -286699 168993 192770 -261917
18477 56058 -189883 33923 144319 202933 -380942 -181940 59358 79663 168444 169271 68365
$$ packed form
18559C7036f6513A45991F6920d3551k1452i211F2822b08025K9200B02284a3007
18547A84134C0138c7542l13703A57757b56116A6450J52515h4784L7879C2030a4365
18535D3470a83898a6813m30676b06405B66966H7579d388j95462f634k45471A71238
18523i2740N677F3345a33064e4240A0984c2723l5118B56588E1046i9109o2460
18512a61569A50884a70345H8729D1257a44999A90876a56447g8054j13781f9040
18501c51602G2326o381J0462K55252c46937A41731a51108b917m6145H5677f2494
18489H7080R1736H4511J467b99602c326B12017b77885q814A68993K3777b61917
18477E6058a89883C3923J10396N8614c80942a81940E9358K0305Q8781Q27F8365
$$ plain form
18465 196145 41838 -273038 -117145 167049 -108687 -342655 340475 160360 162 -99042
18454 52715 76646 -2787 354853 -157220 85936 -249126 83508 142615 -115806 -4189 -398683
18443 -398683 -101604 -140653 -199483 -279921 -4866 -61311 -112199 -31766 5521 -77966 -56010 314445
18430 140513 32550 -47828 -167589 -176844 -80193 -47779 39046 -278772 -383603 275268 226581
18419 226581 -269064 15909 -173189 82146 -181841 -381507 48205 -158470 166352 -39535
18408 142740 221005 311 75010 142435 -104022 17727 84750 -44287 165208 137798 91064
18397 91064 151070 65769 -281411 59540 69294 -45587 -6675 123811 -55661 -10588 71941 -57586
18384 152838 -22162 129703 -161657 -2592 -289979 1357 194216 -270477 -207963 216929 -278563
$$ packed form
18465A96145D1838b73038a17145A67049a08687k33968C40475A60360A62i9042
18454E2715K3931b787C54853a57220H5936b49126H3508N9107a15806d189l94494
18443c98683a01604l9049n8830q0438d866n6445n0888c1766E521g7966K1956C14445
18430A40513C2550d7828j19761r255h0193L2414C9046b78772j04831B75268m8687
18419B26581b69064A5909a73189H2146a81841j99666D8205a58470A66352c9535
18408A42740P8265C11P4699O7425a04022A7727O7023d4287A65208k7410m6734
18397I1064O0006F5769b81411E9540R754d5587f675A23811e5661a0588G1941e7586
18384A52838b2162A29703a61657b592k87387A357J92859b70477O2514B16929b78563
$$ plain form
18372 -39990 171432 139953 -34789 -3487 -97506 -198603 -454763 294198 94617 302413 212035
18361 212035 -100265 -42886 -252715 -30735 -133337 -232381 -96083 -25460 -81523 80678 -19099
18349 31594 -311785 -109326 -115084 -515570 -73889 -126036 -70522 315155 31007 -29271 -215584
18338 -215584 7166 -325467 191878 -126582 -149750 -143926 -35432 92707 -180400 -670 -50974
18327 -50974 -106161 417484 102193 45581 17739 57173 412365 -147289 114809 72976 -169928
18315 26669 -301614 -165391 118326 -75461 131029 -50892 -522781 -196412 -227829 57495
18304 72700 -211276 -146208 -328567 103611 -246397 75479 262977 314564 -409977 -55000
18293 31830 165471 98207 12338 -192223 -40313 131905 -360546 120857 -177367 62453
$$ packed form
18372c9990A71432l1479c4789c487r4019j01097k56160B94198I4617K07796r0378
18361B12035a00265d2886k09829c0735j02602r9044i6083b5460n6063H0678a9099
18349C1594c11785a09326n758m00486g3889n2147N5514C15155C1007b9271j86313
18338b15584G166c25467A91878a26582k3168N824c5432I2707a80400f70n0304
18327e0974n5187D17484A02193D5581A7739L9434L55192a47289A14809m1833a69928
18315B6669c01614J36223A18326g5461A31029e0892m71889a96412l1417E7495
18304G2700b11276O5068j82359A03611b46397G5479J87498N1587d09977e5000
18293C1830J33641o7264A2338a92223d0313A31905c60546A20857a77367F2453
$$ plain form
18282 -166735 -244191 -176888 191064 15666 155093 21322 -122261 -367530 192615 -116294
18271 -234639 -94321 42091 -16710 6100 151283 269692 137463 -349918 -219556 261443
18260 -84951 -254379 26057 38182 -141683 -96525 47641 96607 98026 305584 -211909 112864
18248 10398 -2765 -186514 -431959 -59603 72283 -305894 309784 -326920 -79783 -286104 -89901
18236 -114402 48441 -21231 -46094 65905 -15055 -130080 -50778 77456 41683 -225051 134952
18224 100473 -93123 -179705 -426351 -264210 48128 -409602 -186700 -71519 -226649 -88001
18213 -59773 61838 -93465 -88508 -27463 -288497 79514 144282 124822 -96597 -297756 -110654
18201 -55801 -14681 -99142 -86865 -167872 21512 67647 -211173 -168735 -214775 23695 78448
$$ packed form
18282a66735p7456O7303A91064A5666J39427B1322a22261k45269A92615a16294
18271b34639i4321D2091a6710F100J45183J18409j32229c49918J30362B61443
18260h4951j69428B6057J2125a41683M5158D7641M8966J419K07558b11909A12864
18248A0398b765j83749k45445e9603G2283c05894C09784c26920g9783k06321h9901
18236a14402D8441b1231k4863F5905a5055j15025e0778G7456l5773b25051A34952
18224A00473i3123q6582k46646J62141D8128d09602a86700g1519j55130h8001
18213e9773F1838i3465M957b7463k61034G9514O4768j9460i6597k01159a10654
18201e5801a4681q4461J2277q1007B1512M6135b11173M2438m6040B3695N4753
$$ plain form
18190 78448 -104657 -108876 -261033 84599 18996 -207731 -45031 -38848 -49426 -74354 -93371
18179 -93371 335092 -211385 -7062 110931 -315275 -483624 38748 51378 81456 29541 238181
18168 238181 -148764 273065 39390 -133251 -364951 64201 60485 79562 -139746 -151570 -79248
18157 -79248 -34074 -78587 -75193 -32514 -19029 -33809 -434631 -74616 236007 39176 -49818
18145 -289339 -184499 11939 2295 -2271 -22679 -168495 35523 -152801 -18673 -12444 72232
18133 302260 103982 156028 210301 -234585 45823 -112415 -20235 203276 242127 183840 90291
18121 -423925 -136096 -164736 120542 -298139 -110602 212882 -121214 39988 28509 -485 18977
18109 79266 130557 118990 -414690 213781 -413182 76059 -55342 68798 313423 -190915 174120
$$ packed form
18190G8448a04657m219j52157H4599A8996b07731d5031O183j0578k4928j9017
18179i3371C35092b11385g062A10931c15275j68349C8748J2630L0078B9541K08640
18168B38181a48764B73065C9390a33251k31700F4201l716J9077a39746j1824P2322
18157g9248c4074m4513L394c2514J3485j4780m00822g4616B36007C9176d9818
18145b89339J04840A1939B295b271k0408j45816C5523a52801a8673O229G2232
18133C02260A03982N2046N4273b34585D5823a12415b0235B03276L8851n8287I0291
18121d23925a36096k8640A20542b98139a10602B12882a21214C9988j1479d85A8977
18109G9266N1291j1567d14690B13781d13182G6059e5342F8798K44625a90915A74120
$$ plain form
18097 54011 -283044 -173544 17768 -8211 -245732 65081 -1713 29870 -16559 5433 -9476 -73746
18085 -73746 126008 -99657 167311 -53359 -964 -157910 -317358 -237274 513691 192375 -183854
18073 -239495 321599 -142924 -113825 38294 128801 54891 164256 -92740 -180860 263444 135928
18062 135928 -182080 43531 134656 -504 72525 174429 137170 41763 67904 -216952 -246891
18051 -246891 -279623 -50420 140546 -154164 -112814 -92037 -910 181662 54913 90633 101325
18040 101325 -41319 141313 -66645 -52803 52443 -143961 -144244 -210477 -166729 148594 -75162
18028 -187880 119169 -11494 -92209 109887 -516903 -121195 -102284 -360918 257268 -224908
18017 -85347 83822 -117227 139772 32817 129092 95206 -69683 -146905 -65750 -144475 -236001
$$ packed form
18097E4011b83044J09500A7768h211k37521F5081a713B9870a6559E433i476o4270
18085g3746A26008i9657A67311e3359i64j56946j59448Q0084E13691A92375a83854
18073b39495C21599a42924K9099C8294R0507E4891J09365i2740q8120B63444j27516
18062A35928a82080D3531R1125e04G2525J01904l7259D1763K6141b16952k9939
18051b46891l2732e0420A40546a54164M1350K0777i10A81662E4913L5720J0692
18040A01325d1319A41313f6645J3842E2443a43961k83o6233M3748A48594g5162
18028a87880A19169a1494q0715A09887e16903a21195J8911k58634B57268b24908
18017h5347H3822a17227A39772C2817R6275l3886f9683p7222f5750p8725r1526
$$ plain form
18006 -236001 -285200 -137009 47006 123161 -70842 203226 -1487 -35930 27080 -148244 -36056
17994 65452 -30641 71976 348155 -257656 -43175 -5111 -202549 124452 150601 85360 -120254
17982 310838 59973 12095 109815 221386 -65947 -20283 -107570 173624 -390926 43833 -16772
17970 -69825 -175557 309737 -59463 171316 -192899 275356 284555 -218850 78699 -8804 -203085
17959 -203085 129685 -92449 207374 -43099 -333961 -219677 -221302 127636 87242 147502 -398569
17947 105301 136167 -30832 -138809 -199044 -132208 229368 34234 -243670 -192384 -414299 -51701
17935 -12720 63807 -96255 40404 -307878 -258832 185852 215013 -132609 -133229 -48354 -353791
17924 -353791 -64595 -21317 77560 -71069 69226 31604 71051 156905 -267967 -10175 40263
$$ packed form
18006b36001m9199a37009D7006P6155g0842B03226a487l4443B7080a48244c6056
17994F5452c0641G1976K76179b57656d3175e111j97438A24452K6149o5241a20254
17982C10838E9973A2095R7720J11571f5947b0283q7287A73624c90926D3833a6772
17970f9825j05732C09737e9463A71316a92899B75356R199b18850G8699h804j94281
17959b03085A29685i2449B07374d3099k90862J14284j625A27636m0394O0260c98569
17947A05301L0866c0832j07977o0235O6836B29368C4234b43670N1286k21915e1701
17935a2720F3807i6255D0404c07878M9046A85852K9161a32609o20d8354l05437
17924c53791f4595b1317G7560g1069F9226C1604L9447Q5854b67967a0175D0263
$$ plain form
17912 82684 -163013 173330 -231281 167597 202666 -99979 -18571 52872 -43842 20994 -142564
17900 13884 -169410 -170809 115289 157999 -55658 -230213 -159854 99018 -144809 -1103 -387503
17889 -387503 -327700 141636 -20071 -344184 166481 -296700 347161 -20795 -277072 -154044
17879 -154044 161190 136525 -19224 -106099 166490 -32613 195733 15364 389768 142341
17868 -116783 -30141 -60866 -103416 -52739 -14197 147426 -129802 399689 -109812 -32027 44896
17856 -4238 -43163 70897 230456 -53736 -68558 -77398 -140780 101097 -194638 159634 -79873
17844 317130 -233358 -67887 -212953 318824 -32879 -132296 49892 -20774 -145798 113050
17833 -30976 63140 -45175 -212795 -21325 93238 -270056 136111 77097 -74417 225111 -364072
$$ packed form
17912H2684a63013A73330b31281A67597L5069i9979a8571E2872d3842B0994a42564
17900A3884a69410j399A15289M2710e5658j74555P0359I9018a44809a103l86400
17889c87503N9803A41636b0071l24113A66481b96700C47161b0795k56277J23028
17879a54044A61190k4665a9224q6875A66490c2613A95733A5364L74404A42341
17868a16783c0141l0725m2550N0677a4197A47426a29802C99689a09812c2027D4896
17856d238l8925G0897J59559e3736j4822q840o3382A01097a94638A59634g9873
17844C17130b33358f7887j45066C18824c2879r9417D9892b0774j25024A13050
17833c0976F3140d5175j67620b1325I3238b70056A36111n9014g4417B25111c64072
$$ plain form
17821 -205114 142016 -139965 64642 38113 -65127 -166960 -134885 -90711 -193060 -112652 84288
17809 -186652 252386 153762 -83351 -132875 -81075 25994 -333528 283883 -144926 -49970 -67043
17798 -67043 -5485 133432 190199 71709 -343752 147730 83559 82067 183760 66699 -234750
17786 144940 246803 -147580 -318705 135190 -67256 168601 -406342 458870 35570 31793
17776 31793 100988 389089 54466 74845 242216 -315059 -196830 97818 -11773 45841 17406
17764 101552 1815 105621 -104330 -14558 -45269 -123085 42460 -209373 -356298 -73562 -32775
17752 51884 -306304 11796 -50832 -135567 -10058 241554 3393 96730 257954 55925 381858
17741 381858 42212 72145 249297 -161968 144651 35297 -388729 2171 68438 -16217 279331
$$ packed form
17821b05114A42016a39965F4642k6529f5127j01833L2075M4174j02349Q0408H4288
17809a86652B52386r8624h3351m9524N1800B5994c33528B83883a44926d9970j7073
17798f7043e485A33432N6767G1709c43752A47730o4171j492J01693F6699b34750
17786A44940J01863a47580j71125A35190f7256A68601d06342D58870C5570l777
17776C1793O9195K88101E4466K0379J67371c15059J18229I7818a1773D5841A7406
17764A01552A815J03806a04330a4558l0711p7816D2460b09373j46925g3562c2775
17752E1884c06304A1796e0832q4735a0058B41554C393R3337J61224E5925L25933
17741C81858D2212K9933J77152a61968A44651C5297c88729B171O6267a6217B79331
$$ plain form
17729 -255037 -63965 241978 197554 45094 -30237 387987 -19516 -46333 -67068 -9667 99733
17717 172743 80503 125724 -76479 41858 302426 189418 -357205 -150527 203330 25681
17706 131495 152823 24126 93098 223084 106457 -73062 -214014 -19380 -76804 145670 3732
17694 87449 -83450 -68414 78548 -159050 -183578 40102 -12829 -92164 -62136 164381 14978
17682 181389 -244807 -61791 -14625 71403 54698 299959 -153196 -90291 208511 -27812 -43631
17671 -43631 69967 -301831 516513 -37786 87029 -121588 -265594 146050 -211554 179466
17660 -70910 140571 -214719 16600 152827 -16943 -79803 -295982 -79240 47576 57583 -181535
17648 140247 -220840 -53716 -279949 220177 2715 211736 195313 160721 -94975 -133436 449361
$$ packed form
17729b55037f3965B41978m4424D5094c0237C87987a9516k6817k0735i667I9733
17717A72743H0503M5221g6479D1858K60568j13008c57205a50527B03330B5681
17706A31495K1328B4126O8972J29986A06457g3062j40952a9380n7424A45670C732
17694H7449h3450J5036G8548a59050k4528D0102a2829p9335L0028A64381A4978
17682A81389b44807f1791a4625G1403j6705K45261a53196O2905B08511b7812j5819
17671d3631F9967c01831E16513c7786H7029a21588j44006A46050b11554A79466
17660g0910A40571b14719A6600J36227a6943o2860k16179g9240D7576J0007a81535
17648A40247b20840e3716k26233B20177B715K09021j6423l4592i4975l8461D49361
$$ plain form
17636 -12369 -117503 -137880 80284 17484 49724 80375 197314 219706 -174334 410569 -47765
17624 -155077 113202 257258 24044 18077 -87645 -52270 -33652 85962 -85944 8550 -285606
17612 -246953 -98286 7850 19740 248732 115817 -168672 -53779 -223732 140750 -31827 -76324
17601 -76324 -68448 -233933 -144680 74940 270049 -114992 395476 -155226 184675 161714 374213
17590 374213 -164787 51818 -195505 -63581 234461 -165164 32832 384212 -122223 286702
17579 209961 324566 -243863 -140976 -33496 -11155 320131 -86096 219041 -215751 104895
17568 -203993 54954 -45008 -72770 215499 -118403 -82188 153401 236819 43460 92851 -225306
17556 311596 469304 49911 -46344 60956 218026 30521 -26559 5676 181583 -125503 -314293
$$ packed form
17636a2369j05134k0377H0284A7484L2240L0651J16939K2392a74334D10569d7765
17624a55077A13202J44056B4044n967h7645L5375J8618H5962h5944H550b85606
17612b46953i8286G850J1890K28992A15817a68672e3779j69953A40750c1827m4497
17601g6324P876j65485Q9253G4940J95109a14992C95476a55226A84675k2961K12499
17590C74213a64787E1818a95505f3581B34461a65164C2832L51380a22223B86702
17579B09961J14605b43863J02887c3496a1155C20131h6096B19041b15751A04895
17568b03993E4954d5008k7762B15499a18403L6215A53401Q3418D3460M9391b25306
17556C11596J57708D9911d6344F0956J57070C0521b6559E676J75907a25503j88790
$$ plain form
17545 -314293 89876 19049 -26564 -146005 -307598 263395 264234 134792 145522 -30978 -93791
17534 -93791 15039 -67671 88516 97448 104291 247206 156243 54590 349135 75375 144353 -46585
17521 248319 -95545 -64144 195238 128164 148464 27921 191010 -131253 -37251 -19554 208759
17509 61826 -21101 -170433 1987 382151 329071 206319 97366 -39937 200770 -17698 -10937
17498 -10937 -203073 144090 -217173 -10434 96020 -132334 -19563 74426 19896 194035 203501
17487 203501 152301 430258 -2253 -265589 -63623 -37304 31685 -29338 -43791 367688 38817
17475 193007 182614 191816 285006 104814 27347 317396 231362 348280 103535 259326 135756
17464 135756 547855 467266 215201 307836 15108 182052 -163881 193489 187510 263771 658011
$$ packed form
17545c14293H9876A9049b6564j19441j61593B63395Q39j29442J0730c0978o2813
17534i3791A5039f7671H8516Q932O843J42915r0963E4590K94545G5375O8978d6585
17521B48319i5545L1401A95238o7074K0300B7921J63089a31253c7251J7697B08759
17509F1826b1101j49332A987L80164n3080j22752I7366c9937B00770a7698O761
17498a0937j92136A44090b17173a0434I6020a32334a9563G4426A9896J74139R466
17487B03501n1200K77957b253k63336f3623K6319C1685b9338j4453C67688C8817
17475A93007j0393R202R3190A04814B7347K90049q6034J16918A03535J55791j23570
17464A35756M12099q0589B15201R2635A5108J66944a63881A93489n979P6261L94240
$$ plain form
17453 658011 277571 309894 49974 622714 289927 139498 323683 184836 115081 312134
17443 312134 240225 180525 85670 89689 337794 346881 306042 22096 207764 -218069 348206
17431 442810 234901 -161493 93669 449175 227082 482767 211617 161930 61230 562086
17421 562086 403558 192909 332673 225521 322772 84708 144214 61910 370272 394209
17411 394209 216908 281751 340708 205863 377110 -80451 -163848 -28494 281016 199496 356220
17400 356220 366100 91265 461835 301104 87691 284717 85801 -99256 143453 239843 238232
17389 238232 346549 584978 143193 -193318 129208 148433 325932 -23080 215417 125770
17379 125770 166819 264663 189240 420572 105890 268089 192261 302999 35927 -126192
$$ packed form
17453F58011B77571L2323D9974N72740B89927A39498J84185j38847o9755J97053
17443C12134p1909n9700H5670M019K48105R087m0839B2096J85668b18069C48206
17431D42810k07909a61493I3669L55506k22093K55685B11617m9687F1230N00856
17421E62086j58528A92909J39764j07152R7251H4708N9506F1910L08362K3937
17411C94209j77301O4843N8957j34845J71247h0451q3397b8494B81016q1520J56724
17400C56220R880I1265L70570j60731H7691J97026H5801i9256A43453R6390j611
17389B38232J08317K38429A43193a93318A29208J9225J77499b3080B15417q9647
17379A25770M1049R7844p5423K31332A05890J62199p5828J10738C5927a26192
$$ plain form
17368 166523 288206 105645 491287 356732 -33709 212746 39725 9496 108743 144256 -228185
17356 160049 205982 356507 -298977 75936 226457 274703 5124 -21549 253415 112321 -237375
17344 478999 -4205 86218 31428 154685 290308 161965 460450 193474 71653 75252 430813
17333 430813 277980 148420 433131 260413 293841 151467 238435 196597 524098 269077
17323 269077 398958 -355097 79021 157140 191967 168600 197651 -82353 419086 541536 -105356
17311 -37372 91051 124672 52849 278384 174351 417869 279781 -192709 309522 238424
17301 238424 401638 39648 14883 -44913 -113235 265988 132318 136603 502833 325676 6916
17289 -121661 -41294 99150 34104 289699 155782 209290 -22981 179113 121278 310858 161402
$$ packed form
17368A66523J21683A05645L85642j34555c3709B12746C9725I496R9247L5513b28185
17356A60049M5933J50525b98977G5936J50521M8246E124b1549B53415A12321b37375
17344D78999d205H6218C1428J23257J35623j28343K98485A93474G1653L599L55561
17333D30813j52833j29560K84711j72718L3428j42374Q6968m1838L27501k55021
17323B69077J29881c55097G9021P8119L4827k3367K9051h2353D19086J22450a05356
17311c7372I1051L3621E2849K25535j04033K43518j38088a92709C09522p1098
17301B38424J63214C9648A4883d4913o8322B65988A32318M285L66230j77157F916
17289a21661d1294I9150C4104K55595j33917N3508b2981A79113n7835J89580j49456
$$ plain form
17278 161402 101532 164845 73113 246197 320615 300574 210331 60136 549748 536134 43945
17266 99285 247949 -7952 179810 148620 23656 301029 181162 387891 158109 236736 209800
17255 209800 -120742 -13845 349061 410933 213769 150011 165825 128244 152498 117463 196131
17244 196131 178852 364735 177243 378290 355227 305577 136045 142506 24091 484031 121855
17232 442529 94892 204905 473029 285299 312799 496917 22293 -19007 233661 253799
17222 253799 370202 56400 391197 405623 494610 118705 178079 127726 138138 122312 464236
17211 464236 144638 192194 190921 141882 -1286 380060 434604 181319 184899 -43046 -35341 479695
17198 493007 212699 332083 400162 89144 281175 366265 229279 128245 156609 387206
$$ packed form
17278A61402n9870O3313G3113J73084P4418k0041r0243F0136M89612j3614D3945
17266I9285J48664g952A79810l1190B3656K77373j19867K06729A58109P8627k6936
17255B09800a20742a3845C49061O1872j97164o3758J5814l7581K4254l5035P8668
17244A96131j7279J85883A77243K01047k3063m9650A36045O461B4091M59940A21855
17232D42529I4892J10013K68124j87730K7500J84118B2293a9007B33661K0138
17222B53799J16403E6400L34797J4426Q8987A18705N9374n0353J0412j5826L41924
17211D64236A44638M7556j273m9039a286C80060N4544A81319L580d3046P705D79695
17198D93007B12699J19384O8079H9144J92031Q5090j36986j01034K8364K30597
$$ plain form
17188 387206 353494 81714 37571 186759 164458 456075 195486 176137 473388 324040
17178 324040 27888 296173 334596 501953 -19555 454100 12020 119178 137110 161601 221817
17167 221817 327241 214967 311633 368919 117183 595129 467200 385615 283074 684100
17157 684100 309958 100748 533071 422926 247947 443801 544008 214882 406961 146069
17146 236987 488885 256519 202576 -70914 53038 303648 126784 303659 308833 106123
17135 312404 276125 385602 441009 373858 456955 117392 473198 246429 469669 308604
17125 308604 342956 392233 140178 401385 121425 181323 552449 178112 261048 402377
17115 402377 413536 531466 158799 369937 781678 222001 705693 134713 547791 -105421
$$ packed form
17188C87206l3712H1714C7571J49188k2301K91617A95486j9349K97251j49348
17178C24040B7888K68285L8423J67357a9555D54100A2020J07158J7932K4491O0216
17167B21817J05424j12274R6666N7286A17183M77946j27929q1585j02541M01026
17157F84100C09958A00748M32323j10145j74979J95854J00207B14882J92079A46069
17146B36987K51898k32366n3943g0914E3038K50610A26784J76875N174A06123
17135C12404l6279J09477N5407o7151Q3097A17392L55806k26769K23240j61065
17125C08604L4352M9277A40178K61207A21425N9898L71126A78112Q2936J41329
17115D02377J1159J17930A58799K11138M11741B22001M83692A34713M13078a05421
$$ plain form
17104 464939 258277 378867 649854 234035 343323 104000 597154 484339 263437 576517
17094 576517 734904 417557 419885 560182 541343 330644 676617 180132 524333 366691
17084 366691 406819 465310 332677 775168 655737 417772 450176 459478 553856 238167 446093
17073 446093 406508 484627 352986 394506 566004 378083 371559 530861 760072 766496 237825
17061 137680 302668 616906 694173 557900 440113 367418 185411 456514 779130 413726
17051 413726 269981 828764 684435 842040 412522 352706 556132 649980 610184 569622
17041 569622 485286 508925 666393 205754 712007 393867 530929 824777 280178 305220
17031 305220 531553 398475 883371 550703 754569 633542 567030 684428 728039 469983
$$ packed form
17104D64939k06662J20590K70987B34035J09288A04000M93154j12815k20902L13080
17094E76517J58387l17347K328J40297j8839k10699L45973A80132L44201j57642
17084C66691M0128N8491j32633M42491j19431k37965L2404R302R4378B38167K07926
17073D46093l9585P8119j31641M1520J71498j87921o524J59302K29211O424B37825
17061A37680J64988L14238P7267j36273j17787p2695j82007K71103L22616l65404
17051D13726j43745N58783j44329J57605D12522n9816K03426R3848l9796m0562
17041E69622q4336K3639J57468B05754N06253l18140J37062K93848B80178K5042
17031C05220K26333j33078M84896l32668K03866j21027o6512J17398M3611k58056
$$ plain form
17021 469983 807141 999240 641752 676710 901070 727754 663549 463752 435827 740104
17011 740104 609414 863557 758152 716730 940301 783567 721323 1046347 835133 655738
17001 655738 747116 1011123 1056372 669564 712655 729185 866498 975992 546986 779001
16991 779001 936731 752010 875412 611186 597265 884067 720929 1137376 1051629 522479
16980 826700 635040 554108 984495 922383 1191953 716454 897255 1327601 566478 1097501
16970 1097501 832789 887165 860642 1086611 926694 1130288 1227362 1043121 932238 1046660
16960 1046660 801751 722415 917596 1329777 921758 1264122 1237808 1116696 818831 1011645
16950 1011645 1013917 942744 748428 1039059 1037428 1398902 1169947 1223589 1170450 1426693 921843
$$ packed form
17021D69983L37158J92099l57488L4958K24360j73316o4205j99797k7925L04277
17011G40104j30690K54143j05405m1422K23571j56734o2244L25024k11214j79395
17001F55738R1378K64007M5249l86808M3091J6530J37313J09494m29006K32015
16991G79001J57730j84721J23402k64226j3921K86802j63138M16447q5747E22479
16980H26700j91660q0932M30387o2112K69570m75499J80801M30346E66478N31023
16970A097501k64712N4376k6523K25969j59917K03594R7074j84241j10883J14422
16960A046660k44909p9336J95181M12181m08019L42364k6314j21112k97865J92814
16950A011645K272p1173j94316K90631j631L61474k28955N3642n3139K56243n04850
$$ plain form
16939 921843 962737 1032937 1175035 1270647 1097265 1649719 1141666 1570281 1253023 1515705
16929 1515705 1257998 1249577 1515570 1298363 1484913 1091471 1213744 1136536 1278120 1285808
16919 1285808 1353384 1247301 1183106 1489490 1579572 1418413 1315909 1525427 1606653 1447982
16909 1447982 1612082 1494978 1586056 1573784 1802248 1268658 1890482 1689047 2097241 1785868
16899 1785868 1788983 1485594 1779844 1733007 1948425 1546054 1537418 2010046 1777708 1720271
16889 1720271 1851345 1720985 1675444 2126402 1984621 2117612 1906325 2218916 2136958 2203292
16879 2203292 2614609 2472469 2407165 2252261 2187356 2406028 2247331 2225474 2067651 2447935
16869 2447935 2339395 2524331 2525403 2711140 2353443 3008663 2786325 2924714 2564811 2851573
$$ packed form
16939I21843M0894P0200J42098R5612j73382N52454n08053M28615l17258K62682
16929A515705k57707q421K65993k17207J86550l93442J22273p7208J41584P688
16919A285808O7576j06083o4195L06384R0082j61159j02504K09518Q1226j58671
16909A447982J64100j17104R1078j2272K28464n33590O21824k01435M08194l11373
16899A785868L115l03389K94250m6837K15418m02371q636M72628k32338n7437
16889A720271J31074j30360m5541M50958j41781J32991k11287L12591q1958O6334
16879B203292M11317j42140o5304j54904o4905K18672j58697k1857j57823L80284
16869B447935j08540J84936J072J85737l57697O55220k22338J38389l59903K86762
$$ plain form
16859 2851573 2832376 2839195 2647116 2804456 3120462 3319160 3112668 2760654 3222520 3157795
16849 3157795 3329012 3309723 3275590 3477527 3595539 3379606 3638776 3762145 3716597 3580260
16839 3580260 3461673 3557919 3876273 3845197 3892094 3876135 3988864 4014039 4312994 4109916
16829 4109916 4347701 4454424 4394075 4747132 4628870 4675393 5165324 5096812 5027169 4831501
16819 4831501 5173615 5411034 5461550 5616615 5530296 6065800 5595693 6168459 6151403 6252277
16809 6252277 6483309 6645894 6543479 6753943 6993493 7044138 7067486 7333506 7433247 7689558
16799 7689558 7698926 8034149 8028923 8092052 8365734 8626615 8954008 9268920 9574056 9557152
16789 9557152 9971996 10030595 10434779 10809232 10907499 11409874 11681143 12042819 12439237 12668024
$$ packed form
16859B851573j9197O819j92079J57340L16006J98698k06492l52014M61866o4725
16849C157795J71217j9289l4133K01937J18012k15933K59170J23369m5548j36337
16839C580260j18587R6246L18354l1076M6897j5959J12729K5175K98955k03078
16829D109916K37785J06723o0349L53057j18262M6523M89931o8512o9643j95668
16819D831501L42114K37419N0516J55065q6319N35504m70107N72766j7056J00874
16809F252277K31032J62585j02415K10464K39550N0645K3348K66020R9741K56311
16799G689558R368L35223n226O3129K73682K60881L27393L14912L05136j6904
16789I557152M14844N8599M04184L74453R8267N02375K71269L61676L96418K28787
$$ plain form
16779 12668024 13230811 13527354 13826624 14305106 14524119 15169795 15659422 15968378 16291187
16770 16291187 17060786 17576620 18075856 18941268 19259623 20438116 20712904 21609290 22875785
16761 22875785 23441319 24190382 25489257 26437901 27342020 28753001 29757560 30663546 32419820
16752 32419820 34212015 35311124 37284657 39167102 40820847 42786634 45189066 47396935
16744 47396935 49810107 52434666 55366691 58319669 61896503 65377208 69176622 73495192
16736 73495192 77983352 82814544 87800521 93476643 99205733 105513007 112528129 119457599
16728 119457599 126943670 134705912 142916164 151489179 159934830 168210473 176325773 184758413
16720 184758413 192031915 198260224 204004213 208217005 210663511 212027367 211623373 209878903
$$ packed form
16779A2668024N62787K96543K99270M78482K19013O45676M89627L08956L22809
16770A6291187P69599N15834M99236Q65412L18355J178493K74788Q96386J266495
16761B2875785N65534P49063J298875R48644R04119J410981J004559R05986J756274
16752C2419820J792195J099109J973533J882445J653745J965787K402432K207869
16744D7396935K413172K624559K932025K952978L576834L480705L799414M318570
16736G3495192M488160M831192M985977N676122N729090O307274P015122O929470
16728A19457599P486071P762242Q210252Q573015Q445651Q275643Q115300Q432640
16720A84758413P273502O228309N743989M212792K446506J363856m03994j744470
$$ plain form
16712 209878903 206373691 201536179 195351272 188545895 180777839 172400267 163622892 155506462
16704 155506462 146614388 138195522 129832857 121902703 114460803 107156119 100494522 94225369
16696 94225369 88521514 83025298 78031303 73359172 68796741 64853242 61138146 57337836
16688 57337836 54513522 51393552 48825799 46097365 43919451 41481753 39496403 37392283
16680 37392283 35626407 34210600 32189879 30550752 29150270 27861046 27010894 25737370
16672 25737370 24506737 23271680 22521916 21794500 20843935 19655356 19495007 18482884 17778225
16663 17778225 16879709 16468224 15763933 15435635 14862056 14496904 13759934 13373101 12788056
16654 12788056 12391032 12340752 11827004 11750882 11394200 10782406 10496735 10001801 9628941 9483815
$$ packed form
16712B09878903l505212m837512o184907o805377p768056q377572q777375q116430
16704A55506462q892074q418866q362665p930154p441900p304684o661597o269153
16696I4225369n703855n496216m993995m672131m562431l943499l715096l800310
16688E7337836k824314l119970k567753k728434k177914k437698j985350k104120
16680C7392283j765876j415807k020721j639127j400482j289224q50152j273524
16672B5737370j230633j235057p49764p27416r50565j188579j60349j012123p04659
16663A7778225q98516m11485p04291l28298n73579l65152p36970l86833n85045
16654A2788056l97024n0280n13748p6122l56682o11794k85671m94934l72860j45126
$$ plain form
16644 9483815 9325570 9155322 8529446 8467062 8023017 8309164 7824799 7557822 7324302 7511608
16634 7511608 7374757 6764651 6835329 6539844 6315792 6161570 6175988 6135345 5758839 5453586
16624 5453586 5515681 5637701 5045686 5325185 4960559 4982445 5166551 4996262 5110755 4342788
16614 4342788 4786212 4520507 4170156 3870887 4102840 4124675 4204051 4062396 4057003 3614577
16604 3614577 3778108 3499804 3623682 3527743 3667944 3373758 2975650 3192446 3204801 3214029
16594 3214029 3139104 3246343 2961976 3312040 2736375 2530512 2596366 3054035 2421147 2552653
16584 2552653 2588703 2371339 2609990 2406920 2373359 2271685 2216560 2328286 2304066 2030653
16574 2030653 2273421 2140026 1651971 2143679 1950150 1845075 2117597 2062458 2042491 1795611
$$ packed form
16644I483815j58245j70248o25876o2384m44045K86147m84365k66977k33520J87306
16634G511608j36851o10106P0678k95485k24052j54222J4418m0643l76506l05253
16624E453586O2095J22020n92015K79499l64626K1886J84106j70289J14493p67967
16614D342788M43424k65705l50351k99269K31953K1835P9376j41655n393m42426
16604C614577J63531k78304J23878r5939J40201k94186l98108K16796J2355R228
16594C214029p4925J07239k84367L50064n75665k05863O5854M57669o32888J31506
16584B552653L6050k17364K38651k03070l3561j01674n5125J11726k4220k73413
16574B030653K42768j33395m88055M91708j93529j05075K72522n5139j9967k46880
$$ plain form
16564 1795611 1768109 1658093 1803791 1762617 2008902 1478372 1514958 1807696 1566869 1600987
16554 1600987 1561379 1450701 1740209 1720018 1341266 1383092 1541084 1373680 1594625 1247203
16544 1247203 1518330 1176801 1530621 1351774 1174320 1568297 1251322 1026125 1142516
16535 1142516 1372997 1192806 1295702 1474711 1142337 1018169 990929 1231250 822134 1125137
16525 1125137 1197889 1006457 899238 1517476 830455 778501 1039455 803882 1026895 1083085
16515 1083085 791009 923329 1193097 1267500 1043367 1046631 1098337 906834 978203 431869
16504 934275 968183 934872 778980 832371 808890 703006 900735 514072 760337 572717
16494 572717 587478 974239 713480 670050 729836 820516 370543 855179 1042486 713168
$$ packed form
16564A795611k7502j10016J45698m1174K46285n30530L6586K92738k40827L4118
16554A600987l9608j10678K89508k0191l78752M1826J57992j67404K20945l47422
16544A247203K71127l41529L53820j78847j77454L93977l16975k25197J16391
16535A142516K30481j80191J02896J79009l32374j24168k7240K40321m09116L03003
16525A125137P2752j91432j07219O18238o87021n1954K60954k35573K23013N6190
16515A083085k92076J32320K69768P4403k24133L264N1706j91503P1369D31869
16504I34275L3908l3311j55892N3391k3481j05884J97729l86663K46265j87620
16494E72717J4761L86761k60759m3430N9786R0680C70543M84636J87307l29318
$$ plain form
16484 713168 744655 574400 711229 927444 501984 643445 662729 669781 523575 693060
16474 693060 659912 768890 987419 405919 766016 327167 594920 669200 619025 531583
16464 531583 644402 733879 576713 515840 690158 510234 430165 477706 475963 106796 383103
16453 383103 605661 653045 307155 350926 614643 134612 577534 617491 632289 437095
16443 437095 611228 323086 243410 238029 543316 410615 241943 700011 559657 309568
16433 309568 329058 243044 982841 275565 144372 604360 592988 442170 368220 264894
16423 264894 578489 366478 322945 497000 375389 416850 384620 455178 241044 335460
16413 335460 566531 529516 119500 179901 238242 301462 324592 366973 177108 447304 185691
$$ packed form
16484G13168L1487j70255J36829K16215m25460J41461J9284P052j46206J69485
16474F93060l3148J08978K18529D05919L60097C27167K67753P4280n0175q7442
16464E31583J12819Q9477j57166o0873J74318j79924q0069M7541j743A06796K76307
16453C83103K22558M7384C07155M3771K63717A34612M42922L9957J4798j95194
16443D37095J74133k88142p9676n381L05287j32701j68672M58068j40354k50089
16433C09568J9490q6014P39797B75565j31193M59988j1372j50818p3950j03326
16423B64894L13595k12011m3533J74055j21611M1461l2230P0558k14134R4416
16413C35460K31071l7015A19500O0401N8341O3220K3130M2381A77108K70196A85691
$$ plain form
16401 26460 147342 351380 391666 509675 9381 830480 343672 302684 249871 473611 -33586
16389 443838 461068 160732 328166 261661 198627 529750 414839 263089 199666 393036
16379 393036 174315 297291 -39745 207659 149380 218522 105883 148222 -19097 109363
16368 202429 212311 105335 140594 355487 192444 257928 468390 17220 316320 93350 -21584
16356 192104 318145 317936 -58658 477690 258774 213223 81215 206302 141534 159636 -51778
16344 258140 56065 257208 17961 -76573 171993 168201 87077 361437 316089 37580 79886
16333 79886 190161 -67887 -33314 163453 399778 96397 451539 82581 400104 97176 -3190
16321 25108 244635 297553 -87616 250655 41971 82342 222136 260305 -9503 167370 62836
$$ packed form
16401B6460J20882K04038M0286J18009I381Q21099C43672m0988n2813K23740c3586
16389D43838J7230A60732J67434o6505o3034L31123j14911j51750o3423J93370
16379C93036A74315J22976c9745B07659n8279O9142A05883M2339a9097A09363
16368B02429R882A05335L5259K14893j63043O5484K10462A7220K99100I3350b1584
16356A92104J26041k09e8658D77690k18916m5551H1215J25087o4768J8102e1778
16344B58140E6065K01143A7961g6573A71993l792q1124K74360m5348C7580M2306
16333G9886J10275f7887c3314A63453K36325I6397L55142H2581L17523I7176c190
16321B5108K19527N2918h7616B50655D1971M0371J39794L8169i503A67370F2836
$$ plain form
16309 46088 232004 -93691 -161816 -24141 280322 248967 297196 146107 -37512 287601 -41142
16297 168692 112794 -5117 -79744 425609 209670 -201577 10716 247456 267665 -20276 -71975
16286 -71975 242012 165484 -48416 -61278 45697 48010 340796 45528 206973 -369343 62218
16274 166027 -90794 131371 -112057 -84723 54126 -69452 393997 173053 275268 -19583
16263 -7691 -200998 -99688 -114994 -141631 37044 152498 105059 177564 -323350 -111943 110929
16251 -83550 333989 8553 -171183 -141935 -303586 -125850 6294 432809 -130400 -16051 315635
16239 -85373 23594 84470 -30142 -228740 62927 -241226 26288 49925 237551 -9238 48885
16227 6942 213346 -128650 -16306 141797 -40369 203773 -71727 384791 277812 -77393 254956
$$ packed form
16309D6088J85916i3691o8125b4141B80322l1355M8229A46107c7512B87601d1142
16297A68692n5898e117p4627D25609B09670b01577A0716K36740K0209b0276n1699
16286g1975B42012p6528d8416j2862D5697K313K92786D5528J61445c69343F2218
16274A66027i0794A31371a12057K7334E4126f9452C93997A73053J02215a9583
16263g691j93307i9688j5306k6637C7044J15454m7439P2505c23350a11943A10929
16251h3550C33989H553a71183K9248j61651a25850F294M26515a30400a6051C15635
16239h5373B3594O0876c0142j98598F2927b41226B6288K3637J87626i238D8885
16227F942K06404a28650a6306A41797d0369B03773g1727C84791j06979g7393B54956
$$ plain form
16215 -214393 -25753 367151 -140704 277487 -7523 -145378 -125044 178602 -52865 86613 58285
16204 58285 310312 -342452 284223 45183 -123948 -127692 240783 200575 -233882 220972
16193 362107 -73410 3730 263158 89673 111259 -192305 89493 -22036 348154 7818 -111180
16181 -209338 82737 137674 320032 34491 -59454 326968 -46893 -17449 32631 148238 365192
16170 365192 -146747 11392 -197199 273006 -151444 239243 240035 272251 -366762 -174772
16159 157887 295715 -69595 98587 82449 318554 82519 4631 -32225 -121009 -95305 -335488
16148 -335488 102550 67943 -303732 -18401 116586 -15436 -12187 -133067 70176 -277415 -42441
16136 292561 195862 111296 -190892 272210 -180487 -114016 99983 -61712 53328 181622 -61161
$$ packed form
16215b14393b5753C67151a40704B77487g523j37855K0334A78602e2865H6613k8328
16204E8285K52027c42452B84223D5183a23948l744B40783m0208b33882B20972
16193C62107g3410C730K59428H9673K1586a92305H9493b2036C48154G818a11180
16181b09338H2737N4937J82358C4491e9454C26968d6893a7449C2631J15607K16954
16170C65192a46747A1392a97199B73006a51444B39243P92L2216c66762a74772
16159A57887J37828f9595I8587j6138K36105H2519D631c2225q8784K5704k40183
16148c35488A02550l4607c03732a8401A16586a5436L249j20880G0176b77415d2441
16136B92561r6699q4566a90892B72210a80487O6471I9983f1712E3328J28294f1161
$$ plain form
16124 22043 -195803 -158613 -107940 -104328 -265886 199429 356974 -99498 -28257 130702 298956
16113 298956 24805 -61683 -250825 -160443 -247681 -201610 -66453 -259935 -69552 -52920 -33191
16102 -33191 69970 86421 188419 83741 295957 -279676 325659 -60480 -72444 -227536 -110191
16090 -40042 -224514 -197117 77710 35727 472453 -222960 154998 -178321 -147812 -183937 -96262
16079 -96262 -130388 -128287 -85418 -20864 -288273 -31321 7795 18386 -21078 164069 -97073 -35726
16066 -101865 -26494 190967 -167366 -95762 -262484 -188604 -112273 -45494 12245 236005 -40779
16054 -331136 -172364 54021 94227 125270 -196815 186628 -284817 151840 -57370 -279774
16044 -279774 25046 346665 -86423 291516 88853 -5474 -25781 107428 28157 -191018 67900
$$ packed form
16124B2043a95803L7190N0673L612j61558A99429J57545i9498b8257A30702J68254
16113B98956B4805f1683j89142R0382q7238M6071f6453j93482f9552J6632J9729
16102c3191F9970J6451J01998H3741K12216b79676C25659f0480j1964j55092a10191
16090d0042j84472K7397G7710C5727M36726b22960A54998a78321L0509l6125Q7675
16079i6262l4126K101M2869b0864k67409c1321G795J0591b1078A64069i7073c5726
16066a01865b6494A90967a67366P1604j66722P3880P6331d5494A2245K23760d0779
16054c31136J58772E4021M0206L1043a96815A86628b84817A51840e7370k22404
16044b79774B5046L21619h6423B91516H8853e474k0307A07428B8157a91018F7900
$$ plain form
16032 41979 -364568 64492 208834 54922 -32495 -195282 91613 170379 -18938 -45783 -26034
16021 -26034 -164947 -285161 -134691 -52724 47916 305312 -19364 -242693 -217465 -109319
16011 -109319 280269 -101282 -159610 -31439 -171582 -262415 -117128 -10971 -267315 210023
16000 -65475 -285855 34204 202339 -386394 178744 332040 -6178 -127349 -308197 -164780
15990 -164780 -9252 -57004 254606 -173878 -92319 -84061 77665 250165 339987 295091 405090
15979 405090 233512 79014 112242 -166927 -265676 32604 -19207 304758 -241133 -242760 151323
15967 112073 101541 -245363 -314626 86683 -80930 114595 -152719 -296068 -139398 100351
15956 141805 93983 -9997 -202506 -276797 -254453 168518 198913 121227 -127478 -202078 -269334
$$ packed form
16032D1979c64568F4492J44342E4922c2495j62787I1613P8766a8938k6845J9749
16021b6034j38913j20214a34691e2724D7916K57396a9364k23329K5228J08146
16011a09319B80269a01282n8328c1439j40143r0833a17128a0971k56344B10023
16000f5475k20380C4204J68135c86394A78744J53296f178j21171j80848J43417
15990a64780i252m7752B54606a73878Q1559Q258G7665J72500Q9822m4896J09999
15979D05090j71578G9014L3228a66927r8749C2604a9207C04758b41133j627A51323
15967A12073j0532b45363o9263H6683h0930A14595a52719j43349a39398A00351
15956A41805m7822i997j92509p4291K2344A68518L0395p7686a27478p4600o7256
$$ plain form
15945 -269334 250924 -58980 -37357 -428993 -90119 125349 -193187 111341 22524 -50981
15934 23563 -198103 -72344 -180167 202851 218658 -105866 -92749 -116118 -79948 4755 -96708
15922 213310 -174807 -43255 -67377 157894 -19480 -242885 32202 -236958 -288983 21372 9156
15910 -194325 92954 -58173 -218058 -8421 212836 -17450 -232302 -69848 -55097 -88628 -177897
15899 -177897 8247 69097 -105932 102712 3050 152123 -110110 -58147 -90399 -54087 259102
15887 -108175 48831 -293027 -95606 139192 73663 -311745 -421529 51806 36569 -238322
15876 -15326 -242433 -171912 -196172 -404002 -350673 -99676 162700 62597 192943 -70388 33178
15864 148424 -62018 -12006 148244 -64601 60997 159193 34693 -254685 357757 85087 71379
$$ packed form
15945b69334B50924e8980K1623l91636i0119A25349a93187A11341B2524e0981
15934B3563a98103g2344j07823B02851J5807a05866J3117k3369L6170D755i6708
15922B13310a74807d3255k4122A57894a9480k23405C2202b36958n2025B1372I156
15910a94325I2954e8173j59885h421B12836a7450k14852f9848J4751l3531q9269
15899a77897H247O0850a05932A02712C050J49073a10110N1963l2252L6312B59102
15887a08175D8831b93027i5606A39192o5529c11745j09784E1806j5237b38322
15876a5326k27107P0521k4260k07830N3329i9676A62700F2597J30346g0388C3178
15864A48424f2018a2006A48244f4601F0997R8196C4693b54685C57757H5087j3708
$$ plain form
15853 71379 24110 99042 364855 18351 138766 -246161 -18012 -165961 73264 -189094 34464
15841 -8161 -177966 127356 -313605 -109285 -187973 196486 170860 3478 -109551 79195 -322418
15829 94303 -181821 -124131 -86672 -120237 230052 190621 361832 -222745 -146579 40422 -395779
15817 98285 -41235 193092 -53332 105348 56339 -245876 -175214 108945 37103 -66214 127996
15805 179814 111877 -273512 -117430 152734 115770 38646 -158063 -101504 -49860 -92224 70774
15793 109147 -265691 -51285 -169391 181589 133195 -229829 -10200 16256 53886 -228982
15782 147537 24512 -85331 -497118 -186948 -204845 -327694 60503 -477004 -241939 -343091
15772 -343091 60765 230535 -234948 109641 -169163 6900 -97424 43094 77768 22574 -136078
$$ packed form
15853G1379B4110P4932K65813A8351J20415b46161a8012j47949G3264a89094C4464
15841h161j69805A27356c13605a09285p8688A96486k5626C478a09551G9195c22418
15829I4303a81821N7690L7459l3565B30052l9431J71211b22745P6166D0422c95779
15817I8285d1235A93092e3332A05348m9009b45876P0662A08945C7103f6214A27996
15805A79814o7937b73512a17430A52734l6964C8646a58063N6559d9860m2364G0774
15793A09147b65691e1285j18106A81589m8394b29829a0200A6256L7630b28982
15782A47537B4512h5331m11787a86948j7897j22849F0503d77004K35065j01152
15772c43091F0765J69770b34948A09641a69163F900i7424D3094L4674B2574a36078
$$ plain form
15760 -48783 44670 -250110 -67648 -128208 129858 179442 172430 -164317 -41186 12463 130157
15749 130157 47880 -221849 -196620 207729 -152629 121316 235933 -55539 112646 194548
15739 194548 68388 24206 1574 196591 -277454 -224118 -86299 -8038 -127375 -24869 -145297
15728 -145297 7695 318457 166431 120105 -457701 -169653 305982 107171 -103159 -61806
15718 -61806 -173128 -215220 120934 -172296 95009 -12368 -183598 165249 -280317 134422
15707 -361878 -91534 -247918 117904 -47057 125574 -234221 -163181 225766 -32852 -375479
15697 -375479 209214 -159048 -42534 316084 104963 -50170 303501 275253 88838 36800
15686 201165 485178 189271 -105151 320662 1883 112140 -120994 -114257 326819 550754
$$ packed form
15760d8783D4670b50110f7648o0560A29858M9584p012a64317d1186A2463J17694
15749A30157D7880b21849K5229B07729a52629A21316J14617e5539A12646Q1902
15739A94548F8388B4206A574J95017b77454N3336h6299h038j19337b4869j20428
15728a45297G695L10762j52026m6326d57701a69653C05982A07171a03159M1353
15718f1806j11322m2092A20934a72296I5009a2368j71230A65249b80317A34422
15707c61878i1534j56384A17904d7057A25574b34221P1040B25766c2852l42627
15697c75479B09214a59048d2534C16084A04963e0170C03501k8248H8838C6800
15686B01165K84013A89271a05151C20662A883J10257a20994O737C26819K23935
$$ plain form
15676 550754 -399936 -226868 124389 -282833 53757 -364390 372320 147813 55794 26502
15665 135941 14506 59436 -118975 -60538 -243702 -73333 -208436 173684 109668 145875 160409
15654 160409 -297655 -274307 18211 -209467 -222370 18381 -170454 42551 18053 -60031 154618
15642 36000 -151042 220380 174388 18577 139904 46629 -88600 -64788 -281123 -23559 -217711
15631 -217711 -146571 -191634 3877 160891 -171273 234962 109544 -52154 11725 -103908 170895
15619 -758 -53580 -100065 182971 -375575 -251916 37560 50492 -95004 -23500 -194111 31383
15607 100518 112099 5211 108789 196138 -70243 120356 -243642 11965 -159424 -93048 27206
15595 -12754 -50281 103211 337511 87021 -404245 121341 8627 -234791 115713 -49393 94368
$$ packed form
15676E50754c99936J73068A24389b82833E3757c64390C72320A47813E5794B6502
15665A35941A4506M4930a18975N8437j83164g3333j35103A73684o4016L6207J4534
15654A60409b97655K3348A8211b09467j2903A8381a70454D2551A8053f0031A54618
15642C6000a51042B20380m5992A8577J21327D6629h8600K3812k16335b3559j94152
15631b17711P1140m5063C877J57014a71273B34962A09544e2154A1725a03908A70895
15619g58n2822m6485A82971c75575J23659C7560J2932i5004b3500j70611C1383
15607A00518J1581E211J03578Q7349g0243A20356b43642A1965a59424O6376B7206
15595a2754l7527A03211K34300H7021d04245A21341H627b34791A15713d9393I4368
$$ plain form
15583 -300556 -47635 -55370 -95448 -30360 -72449 140131 -102066 120096 -328512 41140 -128932
15571 -29826 176877 -35108 -221993 -61814 43127 44847 -26613 12925 -97139 56605 57232 -159140
15558 -121363 64792 -178053 84834 68442 78830 407786 89934 44684 -171923 484455 -233020
15546 127920 -142761 43677 -14358 19698 174043 -86642 35702 -79630 265158 58438 312206
15535 312206 79293 -132801 -155610 -62880 64075 148506 76167 -13922 -180298 143416 -36874
15523 -55238 162729 -171659 23614 -108021 -138216 351501 166205 -11218 -245241 -129657
15513 -129657 37003 -34880 73133 81099 22059 -105321 -155884 84381 25930 -157421 118248
15501 -112013 51734 31965 -93519 144279 587 73358 165642 -208381 33812 -267280 120670
$$ packed form
15583c00556d7635p735m0078c0360m2089A40131a02066A20096c28512D1140a28932
15571b9826A76877c5108j86885f1814D3127J720b6613A2925i7139E6605O27a59140
15558a21363F4792a78053H4834j6392J0388L28956H9934D4684a71923D84455b33020
15546A27920a42761D3677a4358A9698J54345h6642C5702g9630B65158E8438K53768
15535C12206G9293a32801k2809f2880F4075Q4431p2339a3922j66376A43416c6874
15523e5238A62729a71659B3614a08021l0195C51501A66205a1218k34023J15584
15513a29657C7003c4880G3133P966B2059a05321n0563H4381B5930a57421A18248
15501a12013E1734j9769i3519A44279E87P2771R2284b08381C3812b67280A20670
$$ plain form
15489 129938 -266949 44803 -216854 179480 138517 -380807 -199446 -34837 246618 34004
15478 127312 -7964 197270 -17842 225510 167655 -70433 304888 -187354 73497 -166348 151296
15466 221549 -169318 67774 -7570 -338010 -143409 -1521 61818 70160 195605 -63627 157910
15454 -104989 -132447 70583 139589 -221372 36980 -28561 23084 208887 63255 -6273 -107241
15443 -107241 -80474 35181 -25629 -150127 -200604 -2532 249022 -31259 -136854 -17638 18382
15431 -9868 91634 113150 -210838 -69421 -234883 -1160 72151 1164 -66449 159730 160035 -49833
15418 -78040 -47180 120983 -71415 391068 55716 -186152 67079 36789 -377783 -642931 926
15406 -148267 -254705 -161113 -265230 -38582 -157807 138409 80922 -35603 293420 -43684
$$ packed form
15489A29938b66949D4803b16854A79480m0963c80807J81361c4837B46618C4004
15478A27312g964A97270a7842B25510n7855g0433C04888a87354G3497a66348A51296
15466B21549a69318F7774g570l30440a43409a521F1818Q342J25445f3627A57910
15454a04989k7458G0583O9006b21372C6980b8561B3084J85803F3255f273j00968
15443a07241K6767C5181b5629j24498n0477b532B49022c1259j05595a7638A8382
15431i868I1634K1516b10838f9421j65462a160G2151A164f6449A59730L05d9833
15418g8040L0860A20983g1415C91068E5716a86152F7079l0290c77783k65148I26
15406a48267j06438R3592j04117c8582j19225A38409n7487c5603B93420d3684
$$ plain form
15395 -110972 185478 -45196 -113390 -2533 107458 106412 138587 83358 -23337 30607 46655
15384 46655 -18000 318928 -192039 -122590 -102031 -312312 -67439 -68965 275951 56299 -46741
15372 116625 -223144 208048 -181641 68722 -99835 -100746 -248383 160412 -27213 -133107 346528
15360 27320 78578 263125 -2048 292648 -6054 514680 -111170 254652 -138257 -11617 313581
15348 -60861 -54404 -79511 -43192 333100 198090 -85378 163927 81021 -69597 47644 264318
15337 264318 213190 200714 285844 575184 144042 147091 -29774 -4189 -255187 177696 -274021
15325 -396923 -213485 281842 145463 88409 116191 -135623 -163700 -7496 -185670 -236022 -332147
15314 -332147 46440 -325004 312056 -262004 449045 68788 195097 -68676 186148 216249
$$ packed form
15395a10972A85478d5196o8194b533A07458j046L2175n5229b3337C0607J6048
15384D6655a8000C18928a92039O9449K0559k10281f7439j526B75951E6299d6741
15372A16625b23144B08048a81641F8722i9835r11j47637A60412b7213j05894C46528
15360B7320N1258J84547b048B92648f054E14680a11170B54652a38257a1617C13581
15348f0861O457k5107L6319C33100j35010h5378A63927H1021f9597D7644K16674
15337B64318n1128j2476Q5130K89340A44042L049b9774d189k50998A77696b74021
15325c96923J83438B81842j36379n7054K7782a35623k8077g496j78174n0352r6125
15314c32147D6440c25004C12056b62004D49045F8788J26309f8676A86148L0101
$$ plain form
15304 216249 192731 3507 391046 43787 -105976 126940 98709 13947 121375 -25657 113791
15292 122338 274213 -8286 5342 17974 389645 156819 -47054 308784 321819 -81843 84089
15280 22019 -53403 -132698 -37759 196921 80502 -195757 -176885 122271 135358 -11941 64496
15268 -236439 75597 -104183 15972 105041 -116193 -91863 238316 143969 141182 211729 70941
15256 -305214 466954 42950 91849 -25033 227494 -98921 525570 267566 977667 1565169
15246 1565169 1183791 1574197 1662561 862921 537369 486719 269276 -49140 55864 275181
15236 275181 40061 110365 77302 257676 -78020 45810 300137 303598 -84804 -29192 -7064
15224 55505 123579 -146921 -168059 252479 198809 318164 36065 83801 66639 -295139 181661
$$ packed form
15304B16249k3518C507L87539D3787a05976A26940k8231A3947J07428b5657A13791
15292A22338J51875h286E342J2632L71671A56819d7054C08784J3035h1843H4089
15280B2019e3403p9295c7759A96921H0502a95757J8872A22271J3087a1941F4496
15268b36439G5597a04183A5972Q9069a16193K4330B38316r4347k787P0547G0941
15256c05214D66954D2950M8899b5033B27494i8921E25570k58004P10101N87502
15246A565169l81378L90406Q8364p99640l25552n0650k17443d9140E5864K19317
15236B75181D0061P0304l3063J80374g8020D5810K54327L461h4804b9192g064
15224E5505O8074a46921k1138B52479n3670J19355C6065M7736j7162b95139A81661
$$ plain form
15212 173243 359077 279893 122315 115992 309243 65754 55974 215228 121809 64740 211626
15201 211626 145242 17940 286592 -77750 -111050 16719 -310556 34054 130422 144132 -9826
15189 80760 227304 -929 172200 245007 -257184 67938 306768 16784 -18050 262393 149106
15178 149106 93070 63364 131413 11349 89425 209195 151240 178880 -146519 -72683 22589
15166 26441 148788 -173851 -331821 256482 322871 -236086 120631 199815 334036 320462
15156 320462 38982 130993 106229 99698 -892 240155 198453 53867 107072 -84414 31846 206711
15144 206711 -31567 62432 121277 127353 351936 451274 -7669 419561 -83633 90525 175184
15133 175184 180496 210016 -24520 -53554 -125929 -6633 269317 209869 106665 -112316 82058
$$ packed form
15212A73243J85834p9184A22315o323J93251F5754r780J59254r3419n7069J46886
15201B11626o6384A7940K68652g7750l3300A6719c10556C4054R6368J3710i826
15189H0760J46544i29A72200P2807b57184F7938K38830A6784a8050B62393j13287
15178A49106n6036k9706O8049A1349P8076J19770n7955K7640a46519g2683B2589
15166B6441J22347a73851j57970B56482O6389b36086A20631P9184J34221j3574
15156C20462C8982R2011k4764o531h92B40155m1702E3867N3205h4414C1846J74865
15144B06711c1567F2432N8845O076K24583R9338g669D19561h3633I0525Q4659
15133A75184N312K9520b4520k9034p2375f633B69317n9448j03204a12316H2058
$$ plain form
15121 273650 236047 376894 -11195 66247 264153 -97176 -71153 342043 205764 36295 -73694
15109 220466 219989 21368 485745 207268 150743 493605 -303788 179394 490488 135551
15098 451897 -171804 -110818 -69837 -76421 -41896 104346 9393 617701 88646 344973 310219
15087 310219 -130192 55325 -17144 -23704 284460 219509 383580 172931 25913 -36674 437306
15075 -44359 93043 185813 -43108 334585 -45982 109948 310291 247993 488646 238460 396781
15064 396781 -6939 -228598 420140 378761 223802 352380 208119 287153 120162 270284
15054 270284 365440 127743 -26356 262292 314300 24440 -116115 45167 348441 300490 226304
15043 226304 329600 -14325 402036 10999 355866 375619 -65249 341930 111825 370846
$$ packed form
15121B73650l7603J40847a1195F6247J97906i7176K6023C42043j36279C6295g3694
15109B20466m77B1368M64377B07268n6525L42862c03788A79394L11094A35551
15098D51897a71804O0986M0981o584L4525A04346I393O08308H8646K56327l4754
15087C10219a30192E5325a7144o560B84460o4951J64071A72931B5913c6674D37306
15075d4359I3043R2770d3108C34585d5982A09948K00343o2298K40653B38460J58321
15064C96781f939k21659D20140m1379j54959J28578j44261P9034A20162J50122
15054B70284R5156A27743b6356B62292N2008B4440a16115D5167L03274m7951p4186
15043B26304J03296a4325D02036A0999L44867J9753f5249C41930A11825K59021
$$ plain form
15033 370846 347185 -598 398650 125050 251812 148460 386757 292977 135007 -7921 268883
15021 38612 367917 255295 104924 123845 232176 422796 161100 136098 495450 219607
15010 81518 -34980 380868 177164 69840 -87040 72691 246994 -61824 110390 311822 246729
14999 246729 174066 189408 152022 -80098 128319 209103 302641 -99090 -5770 149273 34730
14987 217795 456957 65736 -77779 519066 80120 146057 -64629 447331 220843 332703
14977 332703 299314 43308 452942 319686 343952 170716 235372 290096 370385 30290 131013
14966 131013 281611 346557 13411 235084 388714 601164 340862 486354 349166 232975
14956 232975 -183966 237573 283454 557969 259633 27613 475444 404314 241218 230056
$$ packed form
15033C70846k3661e98C98650A25050J26762j03352K38297r3780A35007g921B68883
15021C8612L29305j12622A04924J8921J08331J90620A61100k5002L59352B19607
15010H1518c4980C80868A77164F9840h7040G2691J74303f1824A10390K01432o5093
14999B46729p2663J5342l7386h0098A28319Q0784R3538i9090e770A49273C4730
14987B17795K39162F5736g7779E19066H0120O5937f4629D47331B20843J11860
14977C32703l3389D3308M09634j33256K4266A70716O4656N4724Q0289C0290J00723
14966A31013J50598O4946A3411K21673J53630K12450k60302J45492j37188j16191
14956B32975a83966B37573M5881K74515B59633B7613M47831p1130j63096j1162
$$ plain form
14946 230056 432169 456069 172017 332897 46788 170724 457721 317647 201225 308930
14936 308930 273797 25375 -74702 545018 434117 367050 137903 99038 248029 196546 -184948
14924 -182159 322422 214631 12384 633969 349413 77584 633844 440197 241257 507555
14914 507555 651345 -30008 252483 208316 403077 208113 588222 325775 283645 561928
14904 561928 314521 270658 346951 427233 48589 700628 174027 246835 195774 528852 482366
14893 482366 415644 177445 392468 495839 223880 688427 368740 289357 392981 552644
14883 552644 674471 360201 598903 379878 387956 471133 383467 175174 209370 164464 603492
14872 603492 584993 78779 183096 480070 558817 377306 197954 472928 610444 342068
$$ packed form
14946B30056K02113K3900A72017J60880D6788J23936K86997j40074j16422J07705
14936C08930l5133B5375g4702E45018j10901o7067A37903l8865J48991n1483a84948
14924a82159C22422j07791A2384O21585k84556G7584N56260j93647j98940K66298
14914E07555J43790c0008B52483m4167J94761j94964L80109k62447m2130K78283
14904E61928k47407m3863P6293Q0282D8589O52039A74027P2808n1061L33078m6486
14893D82366o6722A77445K15023J03371B23880M64547l19687p9383J03624J59663
14883E52644J21827l14270K38702k19025Q078Q3177q7666A75174L4196m4906M39028
14872F03492j8499G8779J04317K96974P8747j81511j79352K74974J37516k68376
$$ plain form
14862 342068 157781 349562 272368 434679 285835 323942 238159 451718 342354 358106
14852 358106 314199 545872 217789 548329 627350 520753 316853 294900 337644 478309
14842 478309 447660 481185 304665 471632 668875 448008 491286 434798 729069 327657
14831 112517 312059 528339 138760 724054 621010 687673 372240 349248 485318 516475
14821 516475 733375 501302 482499 557219 630835 527073 415633 701083 709997 210650
14810 408904 494209 463013 448634 717636 714993 784881 270062 213179 618973 617150 605306
14799 605306 470893 435972 548160 609714 733669 445402 329336 406483 859410 557918
14789 557918 646596 830694 360108 793499 669937 474481 378453 629800 825788 781726
$$ packed form
14862C42068A57781J91781p7194J62311j48844L8107q5783K13559j09364J5752
14852C58106m3907K31673B17789L30540P9021j06597k03900k1953M2744J40665
14842D78309l0649L3525j76520J66967J97243k20867M3278n6488K94271C27657
14831A12517J99542K16280A38760N85294j03044O6663l15433k2992J36070L1157
14821E16475K16900k32073j8803P4720P3616j03762j11440K85450Q914B10650
14810D08904Q5305l1196j4379K69002k643O9888B70062n6883M05794j823j1844
14799F05306j34413l4921J12188O1554J23955k88267j16066P7147M52927l01492
14789E57918Q8678J84098C60108M33391j23562j95456r6028K51347J95988m4062
$$ plain form
14779 781726 407217 155184 510481 666145 711619 398510 676192 788687 593515 731212
14769 731212 661343 834826 545617 713262 695385 848006 670951 759318 720788 530738
14759 530738 836410 686784 644654 484116 911046 752780 657125 562824 366450 819191
14749 819191 886741 549189 475386 751272 264367 726694 494974 699964 1031671 853912
14739 853912 885562 858196 750895 726979 829011 855989 955155 723837 1152472 1202201 668592
14728 668592 317197 571353 760903 914368 1217866 767278 868945 799050 798289 961498
14718 961498 435637 963672 595977 1011388 897389 579654 1267024 851365 951708 937283
14708 937283 988441 727374 1242658 944274 581891 975239 863401 1051343 819932 1265167
$$ packed form
14779G81726l74509A55184L55297J55664M5474l13109K77682J12495j95172J37697
14769G31212o9869J73483k89209J67645j7877J52621j77055Q8367l8530j90050
14759E30738L05672j49626m2130j60538M26930j58266r5655r4301j96374M52741
14749H19191O7550l37552p3803K75886B64367M62327k31720K04990L31707j77759
14739H53912L1650k7366j07301k3916J02032K6978R9166k31318M28635M9729n33609
14728F68592C17197K54156J89550J53465L03498m50588J01667o9895p61J63209
14718I61498D35637N28035l67695M15411j13999l17735O87370m15659J00343j4425
14708I37283N1158k61067N15284k98384l62383L93348j11838J87942k31411M45235
$$ plain form
14698 1265167 934512 923229 663799 1145671 805703 1156594 733960 1029481 636577 963833
14688 963833 1238691 838803 1274488 1145613 866328 1040552 957859 751953 1071777 1117187
14678 1117187 1092191 1153023 1143130 941224 1299132 1127158 985080 1049626 995938 1329916
14668 1329916 1049567 1111626 976293 1054327 1290156 1228485 1151491 1145683 1096313 839389 1017708
14657 1017708 1158509 1066826 1101746 1443244 1255936 1285846 1437945 1107601 1465441 1390607
14647 1390607 1221433 1285795 1336641 1031177 1013778 1384045 1322537 1263204 950204 1300619
14637 1300619 1289932 1210688 1381922 1555619 1169350 1240568 1565928 1646700 1598551 1530494
14627 1530494 1455866 1486770 1179723 1392200 1284521 1480183 1261109 1373574 1464385 1631964
$$ packed form
14698A265167l30655j1283k59430M81872l39968L50891m22634K95521l92904L27256
14688I63833K74858l99888M35685j28875k79285J74224q2693k05906L19824M5410
14678A117187k4996O0832r893k01906L57908j71974j42078O4546n3688L33978
14668A329916k80349O2059j35333P8034K35829o1671p6994n808m9370k56924J78319
14657A017708J40801r1683L4920L41498j87308K9910J52099l30344L57840p4834
14647A390607j69174O4362N0846l05464j7399L70267o1508n9333l13000L50415
14637A300619j0687p9244J71234J73697l86269P1218L25360Q0772m8149o8057
14627A530494p4628L0904l07047K12477j07679J95662k19074J12465R0811J67579
$$ plain form
14617 1631964 1516228 1642131 1420398 1275829 1707780 1515739 1689848 1673981 1908491 1603723
14607 1603723 1905222 1725816 1818549 1712777 1922241 1661951 1525763 1624997 1895124 1573242
14597 1573242 1824503 2083926 1609036 1691847 1766674 2092782 1901819 1688200 1783733 1943419
14587 1943419 1970078 1897641 1784727 1818751 2171811 1939004 1931894 2112125 1868564 2048112
14577 2048112 1746372 2017622 2050237 2163746 2162261 2120244 2004173 2518619 2215915 2517480
14567 2517480 2406953 2511450 2401174 2388644 2164011 2658451 2732913 2857669 2956931 3104237
14557 3104237 3337959 3352353 3565790 3555800 3638755 4404633 4857328 6053542 7196563 11067022
14547 11067022 21172109 40540007 47018938 23692214 12666358 5897080 3561371
$$ packed form
14617A631964j15736J25903k21733j44569M31951j92041J74109j5867K34510l04768
14607A603723L01499j79406R2733j05772K09464k60290j36188R9234K70127l21882
14597A573242K51261K59423m74890Q2811P4827L26108j90963k13619R5533J59686
14587A943419K6659p2437j12914L4024L53060k32807p110J80231k43561J79548
14577B048112l01740K71250L2615J13509j485m2017j16071N14446l02704L01565
14567B517480j10527J04497j10276j2530k24633M94440P4462J24756R9262J47306
14557C104237K33722J4394K13437r990Q2955P65878M52695J196214J143021L870459
14547A1067022J0105087J9367898O478931k3326724j1025856E897080k335709
$$ plain form
14540 3561371 3249706 2182467 2303246 1983098 2170403 2065041 1846194 2386615 2072923
14531 2072923 2003506 2466597 1950327 2592378 2055185 2519764 2422223 2383266 2670059 2600626
14521 2600626 2580779 2715102 3104499 2722796 2534987 2513408 2634307 2931268 2850884 2884806
14511 2884806 2993514 2686285 3117302 2811444 2996673 3013590 3036049 3230304 3405784 3305610
14501 3305610 3354195 3049250 3232112 3649233 3425947 3458196 3502961 3456035 3173035 3472039
14491 3472039 3641128 3495234 3560964 3527622 3752263 3554155 3976412 4011277 3897915 3930706
14481 3930706 4052866 4323178 3932629 4052752 3800665 4158157 4304287 4429112 4169887
14472 4169887 4534301 4060605 4423715 4686629 4337123 4830147 5017903 4738817 4820936 4643653
$$ packed form
14540C561371l11665j067239J20779l20148J87305j05362k18847N40421l13692
14531B072923o9417M63091n16270O42051n37193M64579r7541l8957K86793o9433
14521B600626j9847J34323L89397l81703j87809k1579J20899K96961q0384L3922
14511B884806J08708l07229M31017l05858J85229J6917K2459J94255J75480j00174
14501C305610M8585l04945J82862M17121k23286L2249M4765m6926k83000K99004
14491C472039J69089j45894O5730l3342K24641j98108M22257L4865j13362L2791
14481C930706J22160K70312l90549J20123k52087L57492J46130J24825k59225
14472D169887L64414m73696L63110K62914l49506M93024J87756k79086Q2119j77283
$$ plain form
14462 4643653 4894001 4981480 5047229 5307109 4958062 5061629 5034165 5582748 5321931 5849264
14452 5849264 5548189 5320712 5810720 5952597 5682739 5890672 6051627 6238037 6064205
14443 6064205 6035451 6096111 6134972 6626462 6312064 6337577 6489279 6635268 6750873 6738192
14433 6738192 7081411 7049800 6963974 7084904 7559965 7186037 7430522 7576422 7864131 8325195
14423 8325195 7864443 7948696 8266533 8176194 8278981 8231851 9019256 8619282 8763251 8897018
14413 8897018 9044679 9390557 9235578 9214872 9735561 9756133 10074416 10058821 10496119 10428010
14403 10428010 10475836 10642371 10979890 11077451 11538965 11461959 11695368 12173419 12096410 12103530
14393 12103530 12426593 12516131 12808967 12716631 13172001 13548363 13857488 13985632 14392106 14404342
$$ packed form
14462D643653K50348Q7479O5749K59880l49047J03567k7464N48583k60817N27333
14452E849264l01075k27477M90008J41877k69858K07933J60955J86410j73832
14443F064205k8754O0660L8861M91490l14398K5513J51702J45989J15605j2681
14433F738192L43219l1611q5826J20930M75061l73928K44485J45900K87709M61064
14423H325195m60752Q4253L17837r0339J02787m7130P87405l99974J43969J33767
14413H897018J47661L45878j54979k0706N20689K0572L18283j5595M37298o8109
14403A0428010M7826J66535L37519R7561M61514p7006K33409M78051p7009P120
14393A2103530L23063Q9538K92836r2336M55370L76362L09125J28144M06474J2236
$$ plain form
14383 14404342 14848763 14804490 15530317 15682088 15843426 16078635 16532296 17077692 17262923
14374 17262923 17496116 17967832 18180918 18692022 18823387 19129283 19632223 20052167 20713631
14365 20713631 20826186 21216213 21880939 22252524 22791971 23247717 23822257 24526169 24950409
14356 24950409 25181503 26095033 26790547 27124930 27951827 28481236 29215858 30232763 30797206
14347 30797206 31285258 32341458 32939866 34190660 35282239 35607887 36741339 37630466 38725858
14338 38725858 39688300 40846953 42189903 43714205 44582236 46051223 47647111 49259161
14330 49259161 50495496 51914900 53994768 55351788 57371198 58860285 60882427 62919192
14322 62919192 65415821 67510435 69844009 72383507 75145384 77989044 80837309 83787704
$$ packed form
14383A4404342M44421m4273P25827J51771J61338K35209M53661N45396J85231
14374A7262923K33193M71716K13086N11104J31365L05896N02940M19944O61464
14365B0713631J12555L90027O64726L71585N39447M55746N74540P03912M24240
14356B4950409K31094R13530O95514L34383Q26897N29409P34622J016905N64443
14347C0797206M88052J056200N98408J250794J091579L25648J133452Q89127J095392
14338C8725858R62442J158653J342950J524302Q68031J468987J595888J612050
14330D9259161J236335J419404K079868J357020K019410J489087K022142K036765
14322F2919192K496629K094614K333574K539498K761877K843660K848265K950395
$$ plain form
14314 83787704 87292841 90853795 94077968 98325694 101792865 106122157 110801437 115692094
14306 115692094 120663437 126120875 131756622 137512061 144103655 151011168 158060859 165546488
14298 165546488 173721849 182363866 191057529 200488620 210527068 221390788 232675937
14291 232675937 244275376 256566889 269605579 282984514 296943709 311487112 326205408
14284 326205408 341542265 356509351 372217076 387183996 401831110 416373037 429865287
14277 429865287 442216582 453362864 462952456 470509559 475620142 477487776 475808738 471184700
14269 471184700 468632659 462236854 458213774 450039322 440559140 429254076 417087637 403633887
14261 403633887 389242831 374011835 358431968 342667452 326897149 311579855 296443441
$$ packed form
14314H3787704L505137L560954L224173M247726L467171M329292M679280M890657
14306A15692094M971343N457438N635747N755439O591594O907513P049691P485629
14298A65546488Q175361Q642017Q693663R431091J0038448J0863720J1285149
14291B32675937J1599439J2291513J3038690J3378935J3959195J4543403J4718296
14284C26205408J5336857J4967086J5707725J4966920J4647114J4541927J3492250
14277D29865287J2351295J1146282R589592P557103N110583J867634j679038m624038
14269D71184700k552041o395805m023080q174452r480182j1305064j2166439j3453750
14261D03633887j4391056j5230996j5579867j5764516j5770303j5317294j5136414
$$ plain form
14254 296443441 282680575 269355326 256246954 243572911 231382922 219972600 209058452
14247 209058452 198809925 189334396 180424537 172209860 164097746 156354190 149041532 142505229
14239 142505229 136390392 130589583 125076105 119500312 114170881 109628173 105151265 100823938
14231 100823938 97105048 93428577 89836417 86173895 82905720 80002815 76788897 73971881
14223 73971881 71396026 69078376 66654549 64569411 62191484 59772016 58125553 56351097
14215 56351097 54409989 53165920 51650887 50025584 48226726 46728413 45273444 44324075
14207 44324075 43619553 42432623 41070027 40036854 38390085 37786341 36818549 36032704 35263182
14198 35263182 33845614 32834361 32039472 31338626 31158273 29877393 28953134 28576566 27735669
$$ packed form
14254B96443441j3762866j3325249j3108372j2674043j2189989j1410322j0914148
14247B09058452j0248527r475529q909859q214677q112114p743556p312658o536303
14239A42505229o114837n800809n513478n575793n329431m542708m476908m327327
14231A00823938l718890l676471l592160l662522l268175k902905l213918k817016
14223G3971881k575855k317650k423827k085138k377927k419468j646463j774456
14215E6351097j941108j244069j515033j625303j798858j498313j454969r49369
14207D4324075p04522j186930j362596j033173j646769o03744r67792p85845p69522
14198C5263182j417568j011253p94889p00846j80353j280880r24259l76568q40897
$$ plain form
14189 27735669 27163016 26415492 25834605 25197315 24697798 24205003 23635403 23086894 22451115
14180 22451115 21955915 21576046 21469581 20868320 20199211 19914742 19708994 19532624 18671668
14171 18671668 18642249 17814701 17849277 17275264 16843831 16820554 16910551 16323660 15976778 15640221
14161 15640221 15292563 14990914 14720555 14447751 14460128 14105582 13975549 13575757 13278972
14152 13278972 13301723 12697084 12420919 12253650 12229402 12396125 12087350 11594176 11566242 11464617
14142 11464617 11237005 11076813 11341565 10875917 10820979 10445305 10400886 10328944 10062191 9505922
14132 9505922 10149184 9701670 9416728 9380253 9140158 9063624 8802314 8919440 8317724 8183269
14122 8183269 8456451 8275342 8320289 8110320 7792605 8112905 7758872 7629805 7780485 7380608
$$ packed form
14189B7735669n72653p47524n80887o37290m99517m92795n69600n48509o35779
14180B2451115m95200l79869j06465o01261o69109k84469k05748j76370q60956
14171A8671668k9419q27548L4576n74013m31433k3277Q9997n86891l46882l36557
14161A5640221l47658l01649k70359k72804J2377l54546j30033l99792k96785
14152A3278972K2751o04639k76165j67269k4248J66723l08775m93174k7934j01625
14142A1464617k27612j60192K64752m65648n4938l75674m4419p1942k66753n56269
14132I505922O43262m47514k84942l6475k40095p6534k61310J17126o01716j34455
14122H183269K73182j81109M4947k09969l17715L20300l54033j29067J50680l99877
$$ plain form
14112 7380608 7741267 7322837 7324210 6884713 7009133 7141161 6732729 6740321 6758561 6976194
14102 6976194 6731820 6561996 6668072 6548465 6234334 6152857 6267837 5960323 6233831 6160020
14092 6160020 5674513 5909651 5872144 5626605 5488425 5487848 5451667 5130776 5111067 5319294
14082 5319294 5136705 5269401 5375403 5127019 4996527 4896962 4778445 4720002 4644019 4840709
14072 4840709 4792746 4923986 4565800 4718639 4563148 4316335 4504843 4317559 4458935 4406512
14062 4406512 4431830 4270515 4235134 4423660 4458408 4324980 4185344 4031222 4268535 4050429
14052 4050429 3965835 3869104 3856033 3938203 3823059 3991825 3694733 3808156 3397966 3569823
14042 3569823 3584250 3631688 3337226 3774599 3161167 3402886 3239852 3248080 3565802 3669507
$$ packed form
14112G380608L60659m18430J373m39497J24420J32028m08432P592J8240K17633
14102F976194k44374j69824J06076j19607l14131q1477J14980l07514K73508p3811
14092F160020m85507K35138l7507k45539j38180n77l6181l20891j9709K08227
14082E319294j82589J32696J06002k48384j30492r9565j18517n8443p5983J96690
14072D840709m7963J31240l58186J52839j55491k46813J88508j87284J41376n2423
14062D406512K5318j61315l5381J88526L4748j33428j39636j54122K37313k18106
14052D050429q4594r6731j3071Q2170j15144J68766k97092J13423m10190J71857
14042C569823J4427M7438k94462M37373o13432K41719j63034Q228L17722J03705
$$ plain form
14032 3669507 3550425 3462313 3208196 3472192 3191362 3077838 3083592 2977439 3049691 2873187
14022 2873187 3124963 2616125 2679140 3000466 2499231 2694025 2820700 2698341 2842935 2792864
14012 2792864 2482442 2620942 2390520 2322775 2511752 2549078 2367187 2595266 2630706 2436875
14002 2436875 1953848 2314588 2183951 2403428 2421080 2081863 2252245 2055031 2027113 1965122
13992 1965122 2270458 2538763 2932490 3581683 5685561 13056269 33312450 47410622
13984 47410622 28015949 14613654 9027279 6466926 5448866 4425521 3818222 3117354
13976 3117354 3676582 3203081 3084536 2793172 2639229 2843238 2277979 2507059 2642706
13967 2642706 2677275 2662621 2390259 2398073 2083024 2115724 2451543 2105383 2418267 2257361
$$ packed form
14032C669507j19082q8112k54117K63996k80830j13524N754j06153P2252j76504
14022B873187K51776n08838O3015L21326n01235J94794J26675j22359J44594n0071
14012B792864l10422J38500k30422o7745J88977L7326j81891K28079L5440j93831
14002B436875m83027L60740j30637K19477J7652l39217J70382j97214k7918o1991
13992A965122L05336K68305L93727O49193K103878P370708K0256181J4098172
13984D7410622j9394673j3402295n586375k560353j018060j023345o07299p00868
13976C117354N59228m73501j18545k91364j53943K04009n65259K29080J35647
13967B642706L4569j4654k72362P814l15049L2700L35819l46160L12884j60906
$$ plain form
13957 2257361 1776677 2054993 2508988 2071033 2142542 2062652 2049620 1877039 2216800 1898402
13947 1898402 1874250 1894822 1984527 2131631 1754171 1973833 1882545 1950249 1933351 2133807
13937 2133807 2025202 1652225 1735158 1897547 1676833 1892904 1739805 1781227 1752941 1776373
13927 1776373 1511469 1909462 1867439 1641064 1784133 1651515 1728962 1666316 1654629 1572766
13917 1572766 1425370 1755923 1334591 1652859 1658525 1462793 1440810 1607113 1772694 1514533
13907 1514533 1164231 1480171 1664677 1835514 1529300 1568867 1203561 1358693 1616328 1477400
13897 1477400 1272995 1309782 1337088 1263332 1176569 1344710 1175083 983440 1359118 1255493
13887 1255493 1558516 1116147 1399945 1238358 1261284 1253995 1381660 1297099 1219337 1050164
$$ packed form
13957B257361m80684K78316M53995m37955P1509p9890j3032j72581L39761l18398
13947A898402k4152K0572Q9705J47104l77460K19662r1288O7704j6898K00456
13937B133807j08605l72977Q2933J62389k20714K16071j53099M1422k8286K3432
13927A776373k64904L97993m2023k26375J43069j32618P7447o2646j1687q1863
13917A572766j47396L30553m21332L18268N666j95732k1983J66303J65581k58161
13907A514533l50302L15940J84506J70837l06214L9567l65306J55132K57635j38928
13897A477400k04405L6787K7306p3756q6763J68141j69627j91643L75678j03625
13887A255493L03023m42369K83798j61587K2926p289J27665q4561p7762j69173
$$ plain form
13877 1050164 1194617 1259336 1144152 1115584 1407759 933896 1329077 1444479 1221409 1478581
13867 1478581 934268 1166831 1367805 848232 1266344 1023674 1018594 1427029 924905 1231998
13857 1231998 1176909 921977 805970 1065007 1203357 1198637 1248166 1298108 1069861 1157365
13847 1157365 1134731 976054 1185536 915981 952536 830359 996709 979723 1178820 888138
13837 888138 767415 1028289 776040 936667 1125268 872638 1073044 1142015 1042273 924850
13827 924850 705231 1122767 1010074 1110362 676234 919715 846814 705196 644935 872836
13817 872836 1074537 947782 964129 837349 915752 879501 784567 788180 756178 1299576 927344
13806 927344 730173 923697 884833 850327 747338 1058456 801186 960194 742339 1014039
$$ packed form
13877A050164J44453O4719j15184k8568K92175m73863L95181J15402k23070K57172
13867A478581n44313K32563K00974n19573M18112k42670n080M08435n02124L07093
13857A231998n5089k54932j16007K59037J38350m720M9529M9942k28247Q7504
13847A157365k2634j58677K09482k69555L6555j22177J66350j6986J99097k90682
13837H88138j20723K60874k52249J60627J88601k52630K00406O8971r9742j17423
13827I24850k19619M17536j12693J00288m34128K43481p2901j41618o0261K27901
13817H72836K01701j26755J6347j26780P8403l6251r4934L613l2002N43398l72232
13806I27344j97171J93524l8864l4506j02989L11118k57270J59008k17855K71700
$$ plain form
13796 1014039 655475 782821 725277 845506 805366 807705 520046 946604 579222 891667
13786 891667 1010200 799582 856671 751604 589755 627272 736470 470910 919034 670583
13776 670583 812115 493996 991976 600474 382127 632588 610266 744266 770903 693562
13766 693562 1007012 979213 520840 870245 876131 595298 755622 876106 859955 627433
13756 627433 673524 632339 629346 843343 571706 780992 783999 440594 755753 594209 654260
13745 654260 522137 397905 1070554 564154 439548 874494 668413 534913 576082 969446
13735 969446 520783 364105 522221 271973 606148 657297 728108 507549 643815 427248
13725 427248 604246 498914 286731 839757 337989 763250 760116 254778 485439 385943
$$ packed form
13796A014039l58564J27346n7544J20229m0140K339k87659M26558l67382L12445
13786H91667J18533k10618N7089j05067j61849L7517J09198k65560M48124k48451
13776F70583J41532l18119M97980l91502k18347K50461k2322J34000K6637p7341
13766F93562L13450k7799m58373L49405N886k80833J60324J20484j6151k32522
13756F27433M6091m1185k993K13997k71637K09286L007l43405L15159j61544O0051
13745F54260j32123j24232O72649n06400j24606M34946k06081j33500M1169L93364
13735I69446m48663j56678J58116k50248L34175N1149P0811k20559J36266k16567
13725D27248J76998j05332k12183N53026C37989M25261l134B54778K30661r9496
$$ plain form
13715 385943 735657 629271 613214 702305 416919 825388 566385 583592 483815 786342
13705 786342 606142 531767 843351 544600 548660 690696 529139 474715 579981 597202
13695 597202 709921 367875 665419 831247 858575 417794 714081 570384 243418 716722
13685 716722 370657 357684 658765 549941 358926 540167 324053 -6931 411460 623744
13675 623744 555615 578196 732342 592979 404523 581984 551136 544226 425231 748313
13665 748313 431470 289064 652238 103367 462356 365068 215802 630173 502579 600118
13655 600118 130698 233018 136620 820205 377177 617628 371923 508898 613874 651270
13645 651270 462584 485100 331513 550235 598815 419116 183746 483646 440459 409786
$$ packed form
13715C85943L49714j06386j6057Q9091k85386M08469k59003J7207r9777L02527
13705G86342j80200p4375L11584k98751M060J42036j61557n4424J05266J7221
13695E97202J12719l42046K97544J65828K7328D17794K96287j43697B43418M73304
13685G16722l46065j2973L01081j08824j91015J81241k16114f931D11460K12284
13675F23744o8129K2581J54146j39363j88456J77461l0848o910j18995L23082
13665G48313l16843j42406L63174A03367L58989r7288j49266M14371j27594R7539
13655F00118A30698J02320r6398O83585C77177K40451k45705J36975J04976L7396
13645F51270j88686K2516j53587K18722M8580j79699A83746K99900m3187l0673
$$ plain form
13635 409786 671062 294578 609002 306740 429374 605634 806703 297686 354918 507207
13625 507207 429872 375988 262170 564132 302746 524929 578745 485498 415306 146889
13614 472969 383906 520091 401986 403570 384199 536224 166211 480726 454334 239401
13604 239401 283853 398531 505057 472567 645470 518665 685165 189900 394802 679414
13594 679414 585821 35825 358326 269280 458000 216396 268609 356016 446588 286451 238491
13583 238491 399346 150024 513594 135779 299497 411837 730773 370576 -36765 591979
13572 -119207 150135 331946 500559 472519 -66369 459253 60518 395450 267278 496938
13562 496938 469683 301666 349918 397405 408560 -104662 329380 291876 62803 505573 57004
$$ packed form
13635D09786K61276B94578L14424l02262J22634J76260K01069B97686N7232J52289
13625E07207p7335n3884j13818L01962k61386K22183N3816r3247p0192A46889
13614D72969q9063J36185j18105J584j9371J52025A66211L14515k6392k14933
13604B39401M4452J14678J06526l2490J72903j26805J66500A89900K04902K84612
13594F79414r3593C5825L22501q9046J88720B16396N2213Q7407R0572j60137m7960
13583B38491J60855A50024L63570A35779J63718J12340L18936l60197c6765E91979
13572a19207A50135J81811J68613k8040f6369D59253F0518L34932j28172K29660
13562D96938k7255j68017M8252M7487J1155a04662C29380l7504F2803M42770E7004
$$ plain form
13550 370841 294411 353088 174589 326141 140227 265810 248162 338328 513857 654453
13540 654453 407221 333434 331859 210666 550037 59499 118636 521744 78793 134432 97503
13529 97503 453884 25450 416385 329990 101040 264205 288099 494661 155709 377094
13519 377094 240284 218343 276058 333573 258246 38570 355498 217953 123073 84416 191560
13508 191560 234133 368528 532687 47082 223844 604637 54011 255588 268427 83281
13497 508219 140898 168256 124469 273702 320146 362689 326078 492803 119931 288355
13487 288355 331503 298956 317856 262825 352122 299702 328624 398544 431609 23276 365386
13476 365386 281622 135712 233563 118634 250570 612085 527340 467 200515 503334 129295
$$ packed form
13550C70841p6430N8677A74589J51552A40227J25583j7648R0166J75529J40596
13540F54453k47232p3787j575j21193L39371E9499N9137M03108G8793N5639l6929
13529I7503L56381B5450L90935q6395A01040J63165K3894K06562A55709K21385
13519C77094j36810k1941N7715N7515p5327C8570L16928j37545r4880l8657J07144
13508A91560M2573J34395J64159D7082J76762L80793E4011K01577J2839H3281
13497E08219A40898K7358m3787J49233M6444M2543l6611J66725A19931J68424
13487B88355M3148l2547J8900n5031Q9297n2420K8922O9920L3065B3276L42110
13476C65386q3764A35712R7851j14929J31936L61515q4745D67K00048L02819A29295
$$ plain form
13464 -165218 310684 252655 118995 334905 210233 291830 503350 242643 207482 24103
13453 -169868 487480 307736 542289 293780 412249 -126068 50193 477384 285832 162846
13443 162846 376802 705736 410213 553740 241693 241407 291594 109711 268745 199934
13433 199934 142066 118804 560904 157581 232820 417837 227661 188811 492904 200215
13422 450007 137460 633457 -34922 192984 409547 203307 367277 -58167 -45534 -49404
13412 -49404 156581 359191 76901 217038 118600 360845 460067 307371 138501 553207
13402 553207 49779 70100 277345 122200 115941 -174146 -157004 309748 117729 441672
13392 441672 108989 469407 190273 312432 10955 109388 268030 192075 203670 -55359
$$ packed form
13464a65218C10684n8029A18995K15910j24672Q1597K11520B42643l5161B4103
13453a69868D87480j79744K34553k48509J18469a26068E0193M27191j91552j22986
13443A62846K13956L28934k95523J43527B41693k86N0187A09711J59034o8811
13433A99934n7868k3262M42100A57581P5239J85017j90176l8850L04093B00215
13422D50007A37460M95997c4922A92984K16563B03307J63970e8167J2633l870
13412d9404A56581K02610G6901J40137r8438K42245R9222j52696A38501M14706
13402E53207D9779K0321K07245A22200o259a74146J7142C09748A17729L23943
13392D41672A08989L60418A90273J22159A0955R8433J58642p5955J1595e5359
$$ plain form
13381 423743 185283 542344 399875 361486 277637 86838 -138747 46124 131333 464554
13371 464554 181547 29293 668217 369145 365531 166155 -178181 178208 80595 -84535
13360 1963 -32888 275591 112425 114666 129897 43860 387191 327542 421704 -41827 424377
13348 121218 41521 568025 108304 364545 51681 130024 58489 391368 395628 371291 -38960
13336 7373 499309 176851 437052 397676 -76709 417532 322370 75349 -128764 45972 -282822
13324 209369 117573 220863 -32035 297065 267871 154778 -57663 207725 332081 357658
13314 357658 209734 468870 -227187 170861 34103 -146523 373877 370165 14735 279812
13304 279812 -113440 332496 87142 328109 238193 -19402 271941 52706 462638 153403
$$ packed form
13381D23743A85283L57061j42469l8389q3849H6838a38747D6124Q5209L33221
13371D64554A81547B9293O38924k99072l614A66155a78181A78208H0595h4535
13360A963c2888B75591A12425K241J5231D3860L43331n9649R4162d1827D24377
13348A21218D1521N26504A08304K56241E1681P8343E8489L32879M260k4337c8960
13336G373M91936A76851K60201l9376g6709D17532r5162G5349a28764D5972b82822
13324B09369r1796J03290c2035B97065k9194j13093e7663B07725J24356K5577
13314C57658j47924K59136b27187A70861C4103a46523C73877l712A4735K65077
13304B79812a13440C32496H7142K40967q9916a9402B71941E2706M09932A53403
$$ plain form
13293 279583 265185 427648 -21460 269079 256227 16264 107574 591718 -46341 -2126 -90139
13282 -90139 -112595 44629 298586 10633 210224 -246974 315719 36728 9973 244328 -12431
13270 -23752 41618 -282615 -160240 94661 24206 20983 391203 190076 127083 38663 518055
13259 518055 87377 -73518 21250 342826 -21499 343436 236881 -66282 318439 28004 176714
13248 176714 146734 121476 268387 238640 247480 -53192 194859 -36717 472135 306803 232173
13237 232173 102107 22727 -57468 341608 115368 186540 -72418 148874 88713 85511 450347
13226 450347 52462 225584 337748 -252313 10405 445954 267069 -110509 280308 -81822
13215 335074 92482 -251268 31472 8015 -20317 121394 183737 -153934 -301711 312215 -200914
$$ packed form
13293B79583j4398J62463b1460B69079j2852A6264R1310M84144d6341b126q8013
13282i0139k2456D4629K53957A0633J99591b46974C15719C6728I973K34355a2431
13270b3752D1618b82615J22375I4661B4206l223L70220A90076o2993C8663M79392
13259E18055H7377g3518B1250L21576b1499C43436j06555f6282C18439B8004J48710
13248A76714k9980k5258J46911k9747Q840e3192A94859c6717D72135j65332p4630
13237B32173A02107B2727e7468C41608A15368P1172g2418A48874o0161l202L64836
13226D50347E2462J73122J12164b52313A0405M35549j78885a10509B80308h1822
13215C35074I2482b51268C1472H015b0317A21394O2343a53934j47777C12215b00914
$$ plain form
13203 175416 474571 148460 158924 223167 -105597 142881 -205242 -35390 196385 32256
13192 546182 107980 161630 378077 221806 41257 130946 -160076 209888 177605 284457
13182 284457 208780 47423 -27198 127313 -52297 -370905 51747 2836 59588 85547 -148719
13170 235865 9144 328444 256814 -44841 133528 -182118 267795 4207 244210 177654 166654
13159 166654 5454 -55366 312843 -46094 11667 509208 255431 -112708 -90935 -101551 187670
13147 -186484 143854 -200618 -193331 -64763 151811 -247082 -3242 74267 216745 -325384 117140
13135 76743 -121206 -255438 1971 34416 -39483 67446 381504 234588 246666 -142624 222450
13123 170903 45473 40409 444810 292596 66643 242264 215057 81515 368393 -75999 -35754
$$ packed form
13203A75416K99155A48460J0464O4243a05597A42881b05242c5390A96385C2256
13192E46182A07980N3650K16447j56271D1257Q9689a60076B09888l2283J06852
13182B84457p5677D7423b7198A27313e2297l18608E1747B836N6752K5959a48719
13170B35865I144L19300p1630d4841A33528a82118B67795D207K40003o6556j1000
13159A66654E454e5366C12843d6094A1667M97541k53777a12708K1773j0616A87670
13147a86484A43854b00618P287f4763A51811b47082c242G4267J42478c25384A17140
13135G6743a21206j34232A971L2445c9483F7446L14058j46916J2078a42624B22450
13123A70903D5473n064M04401j52214F6643J75621k7207H1515K86878g5999c5754
$$ plain form
13111 171137 27519 121419 263266 -88843 -151646 5235 151583 -127600 106927 167622 287401
13100 287401 -151277 -30646 -8232 -170254 242208 9462 78649 64537 69601 399156 -190717
13088 362260 188134 424854 152619 364486 216472 -18655 421877 115125 -151906 12446
13077 -256427 6159 -96985 187415 -268485 -81415 234070 -111163 85267 613186 488795
13067 488795 337658 71860 217182 -137038 72590 146975 -88446 -19539 230584 263448 -175139
13055 45959 218304 -168663 1079 15218 358325 239336 105959 72393 41208 168695 179849
13044 179849 133410 -60705 -54245 -220444 -181392 281246 3861 78248 -151734 348033 89329
13032 -167343 215336 -106101 537942 -41983 340796 -198943 185459 240748 270270 162235
$$ packed form
13111A71137B7519R3900J41847h8843o2803E235J46348a27600A06927O0695J19779
13100B87401a51277c0646h232j62022B42208I462O9187j4112N064L29555a90717
13088C62260j74126K36720A52619K11867j48014a8655D21877A15125a51906A2446
13077b56427F159i6985A87415b68485h1415B34070a11163H5267N27919j24391
13067D88795j51137G1860J45322a37038G2590P4385h8446a9539B30584L2864a75139
13055D5959J72345a68663A079J4139L43107j18989A05959l3566l1185J27487J1154
13044A79849m6439f0705O460j66199L9052B81246C861P4387a51734C48033H9329
13032a67343B15336a06101E37942d1983C40796a98943A85459N5289K9522j08035
$$ plain form
13022 162235 68483 46810 -19645 84926 231197 386313 -55020 82222 80054 -102039 66519
13010 -77652 -1942 116015 275876 207924 -23878 -121196 -127654 396317 278814 121100 -91474
12998 142816 -116039 -59024 -16271 -247231 403299 181053 -279729 49052 -183342 179829
12987 18916 263351 122245 80619 267179 -159385 109040 289210 106936 -125345 -66479
12977 -66479 143283 -34240 9004 127812 -19981 63641 234968 -104450 -34176 199720 -217097
12965 266288 135374 162378 192386 248130 -122329 -352755 49357 195166 -127470 120898
12954 222733 180912 211917 -27478 103930 -255 -218917 76826 18191 164317 197354 -108198
12942 -29877 205573 -84865 77279 122986 -144968 158309 -6592 -2312 -194024 46918 -57734
$$ packed form
13022A62235F8483k1673a9645H4926J46271J55116e5020H2222k168a02039F6519
13010g7652a942A16015J59861o7952b3878r7318o458C96317j17503A21100i1474
12998A42816a16039N7015a6271k30960D03299A81053b79729D9052a83342A79829
12987A8916K44435A22245m1626J86560a59385A09040J80170A06936a25345N8866
12977f6479A43283c4240I004J18808a9981F3641J71327a04450c4176A99720b17097
12965B66288j30914K7004L0008N5744a22329k30426D9357J45809a27470A20898
12954B22733m1821L1005b7478A03930b55k18662G6826A8191J46126L3037a08198
12942b9877B05573h4865G7279M5707a44968A58309f592b312j91712D6918e7734
$$ plain form
12930 -205633 -98946 207320 -13390 459774 62932 -18794 -8682 41558 -85529 134011 -330437
12918 -9246 227899 281560 204262 44426 112117 117054 239302 61160 -38772 -141784 -30804
12906 -102117 281664 140677 46813 42635 -37559 203921 -302039 105268 55323 82568 153968
12895 153968 17246 -222449 57382 -175440 213908 21290 -46351 -253289 38119 -129352
12884 -74660 77770 -22908 417324 -117238 92740 258077 -2733 21497 331413 -43792 -340806
12873 -340806 -128429 51624 -114878 18967 23800 -232617 109347 241684 -161009 -28356
12862 -39277 1266 -159418 -104348 51877 46936 -151284 -111563 297465 -204267 30424 202728
12851 202728 101475 359266 245816 58486 346839 34208 61373 494965 13210 83189
$$ packed form
12930b05633i8946B07320a3390D59774F2932a8794h682D1558h5529A34011c30437
12918i246B27899N3661p7298D4426O7691M937J22248F1160c8772j03012c0804
12906a02117B81664A40677D6813m178c7559B03921c02039A05268m9945K7245P1400
12895A53968A7246b22449E7382a75440B13908B1290d6351k06938C8119a29352
12884g4660G7770b2908D17324a17238I2740J65337b733B1497L09916d3792k97014
12873c40806a28429E1624a14878A8967M833b32617A09347J32337a61009b8356
12862c9277A266a59418N5070E1877m941a51284L9721B97465b04267C0424J72304
12851B02728j01253K57791j13450E8486K88353C4208K7165M33592A3210O9979
$$ plain form
12841 83189 157305 55319 -40161 156796 -74383 182462 -34962 -115602 204951 158574 -1841
12829 -70210 353315 -57533 -207982 218867 232865 -63388 167848 -160658 162610 -169299
12818 -105788 -67488 124272 48934 -214204 273523 -21493 68842 -70352 -105670 516176 6479
12806 -13760 58861 219371 38131 22462 94485 450800 107928 -162835 300375 -62770 -124796
12795 -124796 46411 233737 107547 -244282 71178 72019 -325003 -514009 112783 68174 221084
12784 221084 -10369 223514 -105891 -46040 -25566 615 -328357 -213036 76437 207023 203966
12773 203966 4438 -14649 212196 42958 -294454 -207793 158300 129427 -182657 58086 -275447
12761 -284764 25361 -93023 101134 -92331 -234104 -60355 -178547 179652 -174729 86749
$$ packed form
12841H3189P4116E5319d0161A56796g4383A82462c4962q0640B04951m6377a841
12829g0210C53315e7533j50449B18867J3998f3388A67848a60658A62610a69299
12818a05788L8300A24272D8934b14204B73523b1493F8842g0352l5318E16176F479
12806a3760E8861J60510C8131j5669P2023L56315A07928a62835C00375f2770o2026
12795a24796D6411J87326A07547b44282G1178Q41c25003j89006A12783m4609J52910
12784B21084a0369B23514a05891d6040K0474F15c28357J15321G6437J30586l057
12773B03966D438a4649B12196D2958b94454Q6661A58300k8873a82657E8086b75447
12761b84764B5361i3023A01134i2331j41773f0355j18192A79652a74729H6749
$$ plain form
12750 -95010 96020 281820 -113550 -129807 34708 133055 -102163 -105153 308325 -52982 190416
12738 806 47739 424803 -75129 -213835 310553 119986 346813 161764 -76373 236036 125271
12727 125271 349 43525 261545 -140048 100867 90524 -50178 86824 462461 124838 406082
12716 406082 -248615 26069 43740 175243 66837 111662 25324 154111 317089 15691 68321
12705 68321 -89283 174458 33007 243059 -43170 156987 154984 61347 67704 -45006 -80117
12694 -80117 -196534 417134 -57722 15116 192189 141212 -108762 87455 82912 -146573 -141275
12683 -141275 -66058 83728 216158 84035 158698 14526 279481 17031 -32942 -170585 281171
12671 289885 148885 -74183 -108757 136647 -86798 173138 61805 51398 35827 -329165 -25947
$$ packed form
12750i5010I6020J85800a13550j6257C4708R8347a02163k990C08325e2982A90416
12738H06M6933L77064g5129j38706C10553A19986K26827A61764g6373B36036j10765
12727A25271C49M3176K18020a40048A00867j0343e0178H6824L75637A24838K81244
12716D06082b48615B6069J7671J31503F6837M4825B5324J28787J62978A5691N2630
12705F8321h9283A74458C3007K10052d3170A56987k003F1347O357d5006l5111
12694h0117j16417D17134e7722A5116J77073n0977a08762H7455m543a46573N298
12683a41275f6058H3728J32430H4035P4663A4526K64955A7031c2942j37643B81171
12671B89885j41000g4183l4574A36647h6798A73138F1805j0407j5571c29165b5947
$$ plain form
12659 26166 -146901 254956 127751 184694 120225 322902 46333 222381 40900 -107696
12648 190392 14477 124708 168596 45417 260887 -77831 49296 -13734 119020 36623 -107570
12636 43640 24180 -5895 -388380 136637 486232 124588 -129398 289645 71233 541247
12626 541247 341719 139714 165319 178032 -10462 186603 307401 387274 -104271 -228057
12616 -228057 -166047 783 66263 144767 321708 -46376 133719 219000 91196 31616 145580
12605 145580 323772 155443 399901 -43922 294247 73030 275057 294711 305889 242216
12595 242216 76478 255414 76844 -130579 141270 110294 242309 57171 186858 -155169
12584 -100509 -64471 -317853 334714 451806 -63429 -45117 281967 146353 235410 -67 35221
$$ packed form
12659B6166a46901B54956j27205N6943o4469K02677D6333J76048D0900a07696
12648A90392A4477J10231M3888D5417K15470g7831D9296a3734A19020C6623a07570
12636D3640j9460e895l82485A36637L49595A24588a29398B89645G1233M70014
12626E41247j99528A39714K5605J2713a0462A86603J20798P9873a04271j23786
12616b28057O2010G83O5480P8504J76941d6376A33719Q5281I1196C1616J13964
12605A45580J78192A55443K44458d3922B94247G3030K02027J9654J1178o3673
12595B42216G6478J78936G6844a30579A41270l0976J32015E7171J29687a55169
12584a00509L6038k53382C34714J17092f3429J8312B81967j35614Q9057f7C5221
$$ plain form
12572 81181 31812 164198 -18683 1042 330004 -186072 -11622 -112515 184249 -49411 217621
12560 34450 -45223 -55017 30254 -216947 77092 -146001 -228300 -77044 -13124 208128 -19121
12548 24417 -252488 -50017 -78751 3712 367406 122874 -345908 -39326 -68114 -68271 -152194
12537 -152194 37462 -133346 156325 99149 252890 159021 329407 42917 473695 199656
12526 -171693 -39862 -149561 -137950 61535 -13242 -349517 31989 -152121 60281 11551 50195
12515 50195 -59418 -56739 -57514 298170 120254 154079 45958 126303 271517 207501 -105167
12503 382467 3099 250500 112969 -38009 -7794 -117384 -248578 68380 -67681 -127351 -18170
12491 164042 -138530 -171786 3757 192372 978 202253 -23399 -67986 -191952 -157597 49175
$$ packed form
12572H1181C1812J32386a8683A042L28962a86072a1622j00893A84249d9411B17621
12560C4450d5223r794C0254b16947G7092a46001q2299g7044a3124B08128a9121
12548B4417b52488e0017k8734C712L63694A22874c45908c9326k8788j57q3923
12537a52194C7462a33346A56325n7176J53741r3869J70386D2917M30778A99656
12526a71693c9862j09699J1611F1535a3242l36275C1989a52121F0281A1551L8644
12515E0195e9418K679p75B98170A20254L3825D5958Q0345J45214o4016a05167
12503C82467C099K47401A12969c8009g794j09590j31194F8380f7681n9670a8170
12491A64042a38530l3256C757J88615I78K01275b3399m4587j23966L4355D9175
$$ plain form
12479 -135231 -58426 -97742 -26165 318573 6862 59734 -453556 119152 -81087 -65344 280256
12467 -22027 -123523 -239305 -164709 135518 54219 -80168 241416 -33254 -46380 -179505 64597
12455 -290393 5127 237960 133067 159402 42181 80247 -288517 -77922 -104285 -12608 -110360
12444 -110360 20128 53474 -210308 -121684 158373 -166975 -138621 165639 206139 -762 -154436
12433 -154436 325219 -172502 126156 -171089 57966 -124687 110212 123531 117301 84591
12423 84591 -216942 -108032 -81629 69949 29353 168704 -18723 37429 -5687 83410 31972
12411 257882 26114 128292 158838 -156400 97313 -336825 -437777 55913 -92453 128042
12400 -206246 -33636 47910 431281 -108754 179589 87673 66947 -42533 -67072 213724 380403
$$ packed form
12479a35231e8426l9316b6165C18573F862N2872d53556A19152h1087J5743B80256
12467b2027j01496j15782P4596A35518E4219h0168B41416c3254j3126j33125F4597
12455b90393E127K32833j04893K6335D2181L8066b88517g7922k6363a2608r7752
12444a10360B0128L3346b10308Q8624A58373a66975K8354A65639M0500g62j53674
12433a54436C25219a72502A26156a71089E7966a24687A10212J3319o230l2710
12423H4591b16942a08032K6403F9949B9353J39351a8723C7429e687H3410C1972
12411B57882B6114J02178L0546a56400I7313c36825j00952E5913i2453A28042
12400b06246c3636D7910L83371a08754A79589H7673k0726d2533k4539B13724J66679
$$ plain form
12389 380403 86575 -54176 -11912 8627 191725 -34339 -144410 -142000 -115490 -106301 180207
12377 -121624 -124880 -21134 -1029 -116029 127558 -99058 -249662 -30827 189541 168926 173937
12366 173937 115677 -269405 -2854 25082 392210 128601 32593 199999 -119218 169358
12355 -231544 16876 -167752 155117 32083 -35088 -110156 124358 -72442 122246 92306 12692
12343 160472 213586 217365 -206868 -58579 -136172 24948 34302 56617 -251870 471739 24493
12331 212961 224469 138044 198013 -295109 81997 62627 257375 -26505 280811 93147 247186
12320 247186 -213217 247274 -392410 -186113 -406614 123193 342682 -76282 -129161 85407
12309 -104802 -65255 21112 99562 22954 -247900 187274 -17434 23026 189714 -82426 -203049
$$ packed form
12389C80403H6575e4176a1912H627J83098c4339j10071K410K6510R189A80207
12377a21624l256b1134a029j15000A27558i9058j50604c0827A89541k0615N011
12366A73937n8260b69405b854B5082L67128A28601C2593J67406a19218A69358
12355b31544A6876a67752A55117C2083c5088p5068A24358g2442A22246k9940A2692
12343A60472N3114L779b06868e8579p7593B4948R354K2315b51870D71739B4493
12331B12961J1508q6425N9969b95109H1997j9370J94748b6505B80811I3147J54039
12320B47186b13217B47274c92410a86113k20501A23193K19489g6282n2879H5407
12309a04802L9547B1112P8450B2954b47900A87274a7434B3026J66688h2426j20623
$$ plain form
12298 -203049 -168541 -48847 280402 60286 -103631 35543 -39588 -44767 74319 391358 231165
12287 231165 -266717 25478 122122 229683 -45086 -19851 235675 15503 7706 64173 -151370
12275 249072 148404 116303 641650 209234 -253417 194070 -26172 -236606 -75997 -36064
12264 105384 31563 -75028 -170346 -140438 14211 -33879 -70989 233687 -136061 -55482 205306
12252 53828 378017 413726 655176 1235 -33035 63482 209961 80646 -22728 157363 155886
12241 155886 -39402 55348 412935 139723 194178 -82967 -56087 68370 -39784 -152488 37327
12229 161999 87734 13366 -8228 48184 76862 378375 219943 57439 256032 129414 21169
12217 77751 234185 97709 463379 68287 10331 5225 102320 303406 50922 386390 -265673
$$ packed form
12298b03049L4508d8847B80402F0286a03631C5543c9588n179G4319L17039j60193
12287B31165b66717B5478R6644J07561d5086a9851B35675A5503G706N6467a51370
12275B49072j00668l2101N25347B09234b53417A94070b6172k10434g5997c6064
12264A05384C1563g5028r5318K9908A4211c3879l7110B33687a36061e5482B05306
12252E3828L24189L5709K41450A235c3035F3482J46479H0646b2728A57363j477
12241A55886c9402E5348L57587A39723N4455h2967K6880F8370c9784j12704C7327
12229A61999p4265A3366h228D8184K8678L01513j58432E7439J98593j26618B1169
12217G7751J56434I7709L65670F8287A0331n106R7095K01086E0922L35468b65673
$$ plain form
12205 391710 189879 154817 228281 539332 230174 -230307 228847 273007 210036 419130
12195 419130 333982 72208 431487 194424 216052 -110861 -56709 226501 194036 66238 9068
12183 146615 346513 -83956 269359 132875 40213 71221 37619 -62508 162024 232128 165644
12172 165644 441386 292045 -19487 106912 251972 318621 235122 429971 308865 -47323
12161 183586 293267 -78068 15635 -64182 223205 212363 191299 -345999 151077 19737 322439
12150 322439 233359 147712 -255533 81802 115150 -62395 146155 -36707 -208275 127857 -175643
12138 -104637 -209002 -415718 232524 -148581 161717 -9826 -117083 26256 -49608 -169047
12128 -169047 185910 32819 -96148 -53836 -171185 -290520 -107029 207074 381792 182565
$$ packed form
12205C91710A89879l5062P3464L11051B30174b30307B28847M4160o2971K09094
12195D19130q5148G2208L59279A94424K1628a10861N4152B26501l2465F6238I068
12183A46615J99898h3956B69359A32875D0213L1008l3602f2508A62024P0104o6484
12172A65644K75742j49341a9487A06912J45060O6649q3499J94849j21106d7323
12161A83586J09681g8068A5635f4182B23205j0842k1064c45999A51077A9737L02702
12150C22439q9080q5647b55533H1802L3348f2395A46155c6707j71568A27857a75643
12138a04637j04365k06716B32524a48581A61717i826j07257B6256d9608j19439
12128a69047A85910C2819i6148M2312j17349j19335a07029B07074J74718A82565
$$ plain form
12117 -50118 147766 15361 -100943 12919 -164046 42845 -105170 178047 -213220 145594
12106 121722 57132 125536 48259 211580 37320 -149438 395375 280218 -107843 14976
12095 106243 -110297 -33555 104476 -109340 -437311 129467 12333 -216662 -48390 -103831
12085 -103831 130969 -12069 -279245 157623 -29491 206798 751713 1571020 2299678 1199645
12075 1199645 223136 -69484 86195 163272 240838 306771 -21395 -68520 -123496 242561 -69061
12063 182708 76430 420261 159284 62628 171055 -144443 240328 83217 218298 -72493
12052 272635 21776 88548 -31139 -73585 -201049 346724 -194196 -67645 72646 290382 -373292
12040 23398 -266132 -317387 64210 36519 233887 -31331 -173789 -182111 8536 -29859 -29277 -2943
$$ packed form
12117e0118A47766A5361a00943A2919a64046D2845a05170A78047b13220A45594
12106A21722E7132O8404D8259J63321C7320a49438C95375j15157a07843A4976
12095A06243a10297c3555A04476a09340l27971A29467A2333b16662d8390n5441
12085a03831A30969a2069k67176A57623b9491B06798N44915Q19307P28658j100033
12075A199645B23136f9484H6195P7077P7566O5933b1395m7125n4976B42561f9061
12063A82708G6430L43831A59284F2628J08427a44443B40328H3217J35081g2493
12052B72635B1776O6772c1139m2446j27464C46724a94196f7645G2646K17736c73292
12040B3398b66132n1255F4210k7691J97368c1331j42458q322H536b9859N82b943
$$ plain form
12027 -117150 -201369 -2362 -189213 -398729 222317 8910 319142 -435120 202763 190420 6526
12015 -91993 292211 -134710 112001 330966 74464 85616 -33528 -128298 48419 -40424 -194403
12004 -194403 -445596 -21521 18175 63828 -193952 92787 60838 84680 123547 -283389 -308529
11993 -308529 -175693 318698 -82547 -226280 -334562 58703 -410870 192001 -67430 38152
11982 122563 -127891 -77019 -206881 173104 8173 -383522 68934 -297351 -41845 29171 -162452
11970 52574 -28541 89504 276583 319403 -50261 -90071 -110807 57920 97286 -128775 -261193
11959 -261193 -132794 251904 25741 -170247 -121397 -179152 214283 -21257 -393105 -84821
11948 13089 163363 -32184 -76667 20985 -166034 -203559 -354380 225001 -300858 577610
$$ packed form
12027a17150q4219b362j86851k09516B22317H910L10232d35120B02763j2343F526
12015i1993B92211a34710A12001K18965G4464J1152c3528r4770D8419d0424j53979
12004a94403k51193b1521A8175M5653a93952I2787l1949K3842L8867b83389k5140
11993c08529J32836C18698h2547j43733j08282E8703d10870A92001f7430C8152
11982A22563a27891N0872j29862A73104H173c83522F8934b97351d1845B9171a62452
11970E2574b8541H9504J87079M2820e0261l9810k0736E7920L9366a28775j32418
11959b61193J28399B51904B5741a70247M8850n7755B14283b1257l71848h4821
11948A3089J50274c2184m4483B0985a66034l7525j50821B25001c00858E77610
$$ plain form
11937 94352 113192 -9364 -238732 -308735 165954 70444 17634 -333065 83496 83302 -149078
11925 207715 67464 -372297 334410 163911 47853 -49000 61190 -202488 27118 143007
11915 143007 67915 -289459 -215212 -123095 -49320 -170792 191649 -24391 311496 -111237
11904 190871 274265 467711 -100044 -120383 80041 194316 205926 -136231 -5945 -117692 -77595
11893 -77595 -292522 -120399 107638 203148 102432 15666 -434867 -71699 -247563 -142994
11883 -142994 199212 -93826 -214071 -68408 -227071 -157499 -206886 -199860 -52847 49020 -115678
11871 74123 296436 168162 161187 -70591 55392 -193890 -42826 -106361 56297 51259 -93181
11859 -185850 -400228 5830 20570 6783 -282098 -389139 -342141 324743 -142163 -28349 -17360
$$ packed form
11937I4352J8840i364k29368p0003A65954G0444A7634c33065H3496j94a49078
11925B07715F7464c72297C34410A63911D7853d9000F1190b02488B7118J15889
11915A43007F7915b89459P4247R2117d9320j21472A91649b4391C11496a11237
11904A90871Q3394J93446a00044k0339H0041J14275J1610a36231e945j11747M0097
11893g7595k14927a20399A07638R5510j00716A5666d34867g1699j75864J04569
11883a42994A99212i3826j20245f8408j58663O9572m9387P026e2847D9020a15678
11871G4123K22313j28274o975g0591E5392a93890d2826o3535E6297n038i3181
11859a85850k14378E830J4740F783b82098j07041M6998C24743a42163b8349J0989
$$ plain form
11848 -17360 -139945 24231 -123849 -28075 49448 -288142 -70776 -70570 47417 1450 24613 44531
11836 44531 -291923 -94243 -61350 164098 -272456 -146505 42512 21481 61813 -98743 64849
11824 -100716 46461 -213749 117798 11681 -208047 5660 -83397 -70411 -40058 54758 -238950
11812 -11084 369444 -197420 -108671 30833 250650 19536 -145408 34717 -211471 40431 255756
11801 255756 -139800 -121622 50656 212830 140773 -285178 -65916 -70302 -235194 -125375 40097
11789 193699 400305 -97375 -172734 432751 -153166 -122531 -102017 -48732 -142823 47495 66536
11778 66536 -5904 445027 73041 -153830 -213066 -96369 283298 202520 -378115 172697 -22300
11766 -113324 29146 128833 -312261 11037 137023 -182593 -238339 83379 77104 140662 -2252
$$ packed form
11848a7360j22585B4231a23849b8075D9448b88142g0776K06D7417A450K3163J9918
11836D4531b91923i4243L2893A64098b72456J25951D2512k1031M0332i8743F4849
11824a00716D6461b13749A17798A1681b08047E660h3397J2986L0353E4758b38950
11812a1084C69444a97420Q8749C0833K19817A9536a45408C4717b11471D0431K15325
11801B55756a39800J8178E0656J62174p2057b85178f5916m386j64892J09819D0097
11789A93699K06606i7375p5359D32751a53166L0635K0514d8732r4091D7495J9041
11778F6536e904D45027G3041a53830n9236i6369B83298q0778c78115A72697b2300
11766a13324B9146R9687c12261A1037J25986a82593n5746H3379o275O3558b252
$$ plain form
11754 136530 -94610 117279 285608 53997 182759 222140 221924 120832 353927 107879 -178308
11742 151301 -75492 -116561 182998 -111346 -75538 170898 100799 34684 -8173 237963 -381761
11730 208890 -236558 -95246 -274742 -26605 -395256 429689 97097 3719 84158 -350877 44442
11718 -22289 197416 -27037 -92298 -227506 -40478 61741 -223706 -86897 313462 179728 -190842
11706 -259922 305507 189920 -114389 -31937 -104870 55198 -176473 -203228 171129 30440
11695 137796 407654 -89165 10101 -53333 59329 42351 -146244 -301126 232651 263339 167290
11684 167290 135021 185861 60934 118530 116959 164053 -103797 184706 -26377 329883 -40260
11672 207195 151428 -222228 -24219 -64156 93034 232102 -385 83707 113107 198605 -6493 315942
$$ packed form
11754A36530i4610A17279J68329E3997J28762L9381k16j01092K33095A07879a78308
11742A51301g5492m1069A82998a11346L5808A70898p0099C4684h173B37963c81761
11730B08890b36558i5246j79496b6605l68651D29689I7097C719Q0439c50877D4442
11718b2289A97416b7037o5261j35208d0478F1741b23706h6897C13462j33734a90842
11706b59922C05507j15587a14389c1937p2933E5198a76473k6755A71129C0440
11695A37796K69858h9165A0101e3333E9329j6978a46244j54882B32651L0688r6049
11684A67290l2269N0840F0934N7596j571M7094a03797A84706b6377C29883d0260
11672B07195n5767b22228b4219l9937I3034J39068c85H3707K9400Q5498f493C15942
$$ plain form
11659 3593 18870 139340 232561 117975 200520 101425 272105 48283 224085 358482 187836
11648 187836 104703 -112754 344910 87900 58625 -190443 83024 -172695 42498 -106763
11637 283146 -74430 -156013 -230118 138673 -375771 -106711 -185941 37805 1271 546555 28243
11625 237931 -202520 146820 413408 144203 380969 148395 49607 108550 -42814 125000
11614 222514 250113 124718 262460 151002 134435 141828 -52301 -131408 -83974 -129465 155434
11602 -21786 95708 236446 48775 268083 50283 -160527 -75815 89812 370643 -77218 -165857
11591 -165857 127291 -21957 -46609 393800 11151 191941 6359 72521 205120 -29935 46437
11579 135406 151980 84782 60034 159785 -132497 -109990 85702 332440 249550 178948 165484
$$ packed form
11659C593J5277J20470R3221j14586Q2545r9095J70680D8283J75802J34397j70646
11648A87836q3133a12754C44910H7900k9275a90443H3024a72695D2498a06763
11637B83146g4430q1583p4105A38673c75771a06711p9230C7805A271N45284B8243
11625B37931b02520A46820K66588A44203K36766A48395D9607N8943d2814A25000
11614B22514K7599A24718J37742j11458j6567P393e2301p9107M7434m5491A55434
11602b1786I5708J40738D8775K19308E0283a60527g5815H9812K80831g7218q8639
11591a65857A27291b1957k4652C93800A1151J80790F359O6162J32599b9935D6437
11579A35406J6574o7198k4748R9751a32497K2507H5702K46738q2890p0602j3464
$$ plain form
11568 165484 96864 16098 177357 119690 187182 -108475 58109 -261192 90015 257463 95849
11556 163608 290101 109378 59957 194930 -50439 -433993 -39431 -27448 -43937 66958 111586
11545 111586 90037 78443 503744 94993 -45293 33891 118023 290612 81086 174157 22841
11533 -337619 -142055 244445 129449 -51549 -225915 151379 137540 211309 103152 1337
11522 -144008 213210 -274380 -165637 140387 -6936 171748 5866 -101745 443781 197099
11511 -77287 -26554 115459 107732 280110 376477 364017 82108 248395 187170 238458 400104
11500 400104 271682 229908 272792 -10124 152670 224910 74285 211972 275580 10347 -256713
11488 116481 280735 126482 247849 93137 -148792 -14098 -133848 149137 92863 323947
$$ packed form
11568A65484o8620A6098J61259n7667O7492a08475E8109b61192I0015J67448I5849
11556A63608J26493A09378m9421J34973e0439l83554c9431J1983j6489F6958M4628
11545A11586k1549j1594M25301I4993d5293C3891Q4132J72589H1086R3071B2841
11533c37619a42055B44445j14996e1549j74366A51379j3839P3769A03152A337
11522a44008B13210b74380J08743A40387f936A71748E866a01745D43781A97099
11511g7287b6554A15459p727J72378R6367j2460H2108J66287o1225N1288J61646
11500D00104j28422m1774M2884a0124A52670P2240G4285J37687O3608A0347b56713
11488A16481J64254A26482J21367I3137a48792a4098j19750A49137n6274K31084
$$ plain form
11478 323947 425710 282327 175386 7919 75871 534071 -20421 240866 180389 500605
11468 500605 276524 -178459 50684 159281 268754 130992 -273043 235813 259081 -43794
11457 55421 69387 -75501 291072 141102 304760 -77029 453067 131390 64020 5677 325777
11446 325777 250056 263522 14480 326335 -57124 121285 56096 -244341 -5402 190602 344052
11435 344052 101727 126835 84540 -23462 376124 85263 147318 -129236 333740 -148881
11424 164370 105120 -88384 -194878 -74164 -268838 70832 -251385 37366 273878 -258051
11413 100874 -88032 -133827 61478 -15496 284400 -209667 -162050 26874 -21454 -351891 235847
11401 -125029 39155 117323 65546 118901 -77261 -156725 166626 318053 -105455 -63483 -233047
$$ packed form
11478C23947J01763j43383j06941G919O7952M58200b0421B40866o0477L20216
11468E00605k24081a78459E0684J08597J09473A30992b73043B35813K3268d3794
11457E5421J3966g5501B91072A41102J63658g7029D53067A31390F4020E677L20100
11446C25777p5721J3466A4480L11855e7124A21285E6096b44341e402A90602J53450
11435C44052A01727K5108m2295b3462C76124H5263O2055a29236C33740a48881
11424A64370n9250h8384j06494g4164j94674G0832b51385C7366K36512b58051
11413A00874h8032m5795F1478a5496B84400b09667M7617B6874b1454l30437B35847
11401a25029C9155P8168n1777N3355g7261p9464A66626J51427a05455M1972j69564
$$ plain form
11390 -233047 40562 -120678 277075 -153238 50175 -390320 35579 -97826 -378225 26179
11379 54286 74027 186236 -235162 162807 484609 206247 51130 -116264 -156231 136117
11368 314437 268476 92307 216232 13638 -39971 -101859 -244565 286317 -203118 15968 177144
11357 177144 21036 -88107 79686 -229353 -317186 -163177 100071 -49429 340531 4986 7031
11346 7031 -23414 4428 -121233 78233 177739 71518 14954 -359968 148848 -106847 -72594
11335 -72594 296865 -208735 151852 25019 -216760 -112089 84064 14076 132929 142930
11325 142930 -175601 90426 65352 -259562 -257351 -133399 81726 59062 -67134 90539 45657
11314 45657 127860 -130379 108675 116223 -93215 -297451 300546 -121504 229920 147393 230967
$$ packed form
11390b33047D0562a20678B77075a53238E0175c90320C5579i7826k80399B6179
11379E4286J9741J12209b35162A62807L21802B06247E1130a16264l9967A36117
11368C14437m5961I2307J23925A3638c9971o1888j42706B86317b03118A5968J61176
11357A77144B1036h8107G9686b29353q7833J54009A00071d9429C40531D986K045
11346G031b3414D428a21233G8233R9506G1518A4954c59968A48848a06847L4253
11335g2594B96865b08735A51852B5019b16760J04671H4064A4076J18853J0001
11325A42930a75601I0426k5074b59562K211J23952H1726k2664f7134I0539m4882
11314D5657Q2203a30379A08675P548i3215k04236C00546a21504B29920q2527Q3574
$$ plain form
11303 230967 152424 -205862 -206216 -116295 -428487 214695 244788 118701 2349 -75196 -264631
11292 -264631 -69891 -259078 -19840 -6432 53247 -71043 -37314 -324477 -38970 -135324 -396862
11281 -396862 -57744 -96037 -209492 -34970 210417 215168 -228888 -148707 32121 52781 -45137
11269 -500369 -184810 79261 -54136 111913 -17917 65971 112864 -341922 -144964 159702
11258 -3183 -144113 -11523 -101217 -108155 -161289 -192238 -85744 -51010 348230 -217036 126918
11246 -5232 33410 -129904 57876 9296 67756 54287 29918 354645 -51754 54969 207636
11235 207636 -230396 -98130 -2560 144413 -287156 -218826 155679 247272 -311383 -45134 167143
11223 -158339 -139899 -229967 184617 -275015 -30504 28882 -402485 388 -51400 -74844 -53320
$$ packed form
11303B30967p8543b05862l54Q9921l12192B14695L0093A18701B349g5196j89435
11292b64631f9891j89187a9840f432E3247g1043L3729k87163c8970r6354k61538
11281c96862e7744l8293j13455c4970B10417M751b28888Q0181C2121K0660d5137
11269e00369a84810G9261e4136A11913a7917F5971M6893c41922a44964A59702
11258c183j40930a1523q9694o938n3134l0949h5744L4734C48230b17036A26918
11246e232C3410a29904E7876I296N8460j3469k4369L24727e1754E4969J52667
11235B07636b30396i8130b560A44413b87156O8330A55679R1593c11383d5134A67143
11223a58339J8440r0068A84617b75015c0504B8882d02485C88e1400k3444K1524
$$ plain form
11212 -53320 78638 -1352 35102 -205859 175738 -2572 -131758 258463 -206335 -226363 417150
11200 173683 -176991 45146 21892 -49547 -183303 293514 51939 -206839 -382800 -306753
11190 -306753 -266375 216644 148537 16994 -58742 130691 138288 -436841 20196 320395 -70156
11178 -155507 -110433 -44476 -303064 -278526 -17921 -233747 -100252 -309847 -137875 -86691
11168 -86691 -43701 -70634 311553 -192871 349140 274146 -12117 -191884 -47083 -16834 36272
11156 120208 136906 -171607 -92158 -68340 -208926 -69251 -78212 -9094 79103 -65260 -29799
11144 -40486 141694 92128 -330266 -24720 23977 -67546 50051 258537 445773 209942 -26430
11132 -87342 224060 -634 204562 285623 -110559 278833 -291319 -132687 114986 -22921 12801
$$ packed form
11212e3320G8638a352C5102b05859A75738b572j29186B58463b06335k0028D17150
11200A73683a76991D5146B1892d9547j33756B93514E1939b06839j75961P6047
11190c06753M0378B16644o8107A6994e8742A30691P597d36841B0196L00199g0156
11178a55507M5074d4476k58588K4538a7921k15826a00252k09595a37875N1184
11168h6691M2990k6933C11553a92871C49140p4994a2117j79767d7083a6834C6272
11156A20208J6698a71607P9449K3818j40586f9251q961i094G9103f5260b9799
11144d0486A41694m9566c30266b4720B3977f7546E0051K08486J87236B09942b6430
11132h7342B24060f34B04562Q1061a10559B78833b91319a32687A14986b2921A2801
$$ plain form
11120 -26376 -255614 14134 -155272 -58999 -109582 14106 -153852 167551 -223074 143974
11109 331204 -22901 184773 131177 179572 267205 -1856 -56347 158242 288267 305078 207396
11098 207396 156686 461911 -53105 331345 357686 505184 16306 -109086 282909 424709
11088 424709 248913 -251750 -221379 363797 190854 121 341124 -142523 360981 339633
11078 339633 196241 111890 75504 392841 142231 356809 236561 234913 249971 91130 514266
11067 514266 412564 342208 625034 363758 464622 611521 883932 560136 710691 700994
11057 700994 551770 610966 537391 764624 757567 234551 770414 754953 498308 733026
11047 733026 660496 534308 532004 652749 818456 641339 839812 554277 481616 789323
$$ packed form
11120b6376k29238A4134a55272e8999n0583A4106a53852A67551b23074A43974
11109C31204b2901A84773n3596M8395Q7633a856n4491A58242J30025J6811r7682
11098B07396n0710L05225e3105C31345K6341J47498A6306a09086B82909J41800
11088D24709j75796b51750L0371C63797j72943A21L41003a42523C60981k1348
11078C39633j43392q4351l6386L17337A42231K14578j20248j648J5058I1130M23136
11067E14266j01702p0356K82826k61276J00864J46899K72411l23796J50555r697
11057G00994j49224N9196p3575K27233p057B34551N35863j5461k56645K34718
11047G33026p2530j26188k304J20745J65707j77117J98473k85535p2661L07707
$$ plain form
11037 789323 772841 505649 686267 875381 570010 721408 864313 583627 696899 798560
11027 798560 819648 579739 794759 607631 931537 586821 807659 543128 370499 781160
11017 781160 728918 974770 601890 895774 200402 764864 744933 623278 890772 697618
11007 697618 545782 421145 829021 1114490 887652 636783 780256 688942 773584 344654
10996 540846 484379 603548 546063 962681 822871 544403 757847 813761 988101 831760
10986 831760 674543 768852 1114420 962125 1131421 1155301 1391286 1494377 1622558 1672871
10976 1672871 1815531 2017164 2656979 2672361 2693549 2738943 3018331 2423666 2333799 1949718
10966 1949718 1945209 1707311 1785854 1758585 1764245 1558187 1662570 1751582 1735821 2090811 2070450
$$ packed form
11037G89323j6482k67192J80618J89114l05371J51398J42905k80686J13272J01661
11027G98560K1088k39909K15020j87128L23906l44716K20838k64531j72629M10661
11017G81160n2242K45852l72880K93884B00402N64462j9931j21655K67494j93154
11007F97618j51836j24637M07876K85469k26838k50869J43473r1314Q4642C44654
10996E40846n6467J19169n7485M16618j39810k78468K13444N5914J74340j56341
10986H31760j57217R4309L45568j52295J69296K3880K35985J03091J28181N0313
10976A672871J42660K01633O39815J5382K1188M5394K79388n94665q9867l84081
10966A949718m509k37898P8543k7269N660k06058J04383Q9012j5761L54990k0361
$$ plain form
10955 2070450 1879331 1931032 1936607 1563476 1375215 929056 369840 593991 365434 724193
10945 724193 587202 442016 80572 475683 521581 255681 123734 239169 98544 5572
10934 -72110 130824 -83412 198556 139666 81337 213945 315364 173214 81958 259370
10924 259370 449163 55332 66549 -114162 4801 144544 -156304 -255157 -65573 231124 105004
10912 -130129 362677 223427 62344 141212 -413739 24095 -146107 31656 -328500 -259813
10902 -259813 246325 -197541 -85183 -198785 87872 43420 -109110 39274 -184288 71377
10891 -318764 -343792 -27715 -207669 -98194 -28695 155598 443284 -141108 -34442 67649 -69127
10879 145118 -110567 -176505 42084 73159 99985 223641 -326268 293540 315227 20046 65624
$$ packed form
10955B070450j91119N1701N575l73131j88261m46159C69840K24151k28557L58759
10945G24193j36991j45186H0572L95111M5898B55681A23734J15435I8544E572
10934g2110A30824h3412A98556n8890n8329J32608J01419j42150H1958J77412
10924B59370J89793E5332J1217a14162D801J39743a56304r8853f5573B31124A05004
10912a30129C62677j39250F2344P8868d13739B4095a46107C1656c28500O8687
10902b59813B46325a97541h5183j13602H7872D3420a09110C9274a84288G1377
10891c18764k5028b7715j79954i8194b8695A55598K87686a41108c4442F7649f9127
10879A45118a10567o5938D2084L1075K6826J23656c26268B93540K1687B0046M5578
$$ plain form
10868 65624 -94342 -112490 -58687 -170849 18624 -359981 -98329 105360 43810 144622 -199239
10856 -338892 308198 -163256 -137906 141339 53727 91745 -139374 54911 140293 62607 95329
10845 95329 -149202 55026 -28896 140536 136986 87817 -212778 56322 39862 -154835 -29110
10833 -120136 -102946 -135803 -56814 -35741 -166280 -71448 -69900 -7186 -93984 27541 -31246 -65894
10821 -65894 234081 291524 -155214 124515 18792 -112228 -51844 -243386 268576 67057
10810 -169710 -8869 -13427 -26747 -231720 37453 -78285 220542 -297207 -259072 -78589 115245
10798 161431 47607 35943 22063 -60460 -7302 -9262 -16049 -170571 -71287 -106210 -228520 -65397
10785 75680 88129 280813 -337443 -203994 -241729 67620 -96296 -267991 19432 256430 31571
$$ packed form
10868F5624i4342j8148N3803j12162A8624c59981i8329A05360D3810J00812a99239
10856c38892C08198a63256K5350A41339E3727L8018a39374E4911Q5382F2607L2722
10845I5329a49202E5026b8896A40536l550m9169b12778E6322j6460a54835b9110
10833a20136J7190l2857e6814K1073j30539g1448J548g186q6798B7541c1246l4648
10821f5894B34081N7443a55214A24515A8792a12228e1844j91542B68576F7057
10810a69710h869m558j3320k04973C7453g8285B20542b97207L8135g8589A15245
10798A61431D7607j1664j3880f0460g302j960o787j54522g1287l4923j22310f5397
10785G5680J2449J92684c37443J33449l7735F7620i6296j71695A9432K36998C1571
$$ plain form
10773 -32245 -441733 -49030 36366 50198 81302 -250413 -84940 -358461 7336 73284 51379
10762 51379 -20229 372564 185635 -120806 -163485 100764 -290225 -193657 161549 -387525
10751 -69848 -234380 144202 -252847 247439 -278876 -2593 118697 100354 14289 357032
10741 357032 48966 -142450 92181 -160601 -223214 -83765 126342 12400 376383 -15415 -259012
10730 -259012 365826 93362 19166 34745 -143624 -339021 89667 -5170 302922 75939 -189358
10718 63021 -229890 192103 76121 -334219 18924 123913 -152639 -207191 165536 131732
10708 131732 -335540 -58735 -63735 58324 -101492 -91812 126544 -286933 -133576 -383380 -273081
10697 -273081 -20787 -139501 -106726 17360 -179229 -80449 -117508 -178525 -57417 -92211 -274673
$$ packed form
10773c2245m09488d9030C6366J3832L1104b50413h4940k73521G336O5948k1905
10762E1379b0229C72564A85635a20806m2679A00764b90225R6568A61549c87525
10751f9848j64532A44202b52847B47439b78876b593A18697j8343A4289L42743
10741C57032D8966a42450I2181a60601o2613h3765A26342A2400L63983a5415k43597
10730b59012C65826I3362A9166J5579a43624j95397H9667e170C02922G5939a89358
10718F3021b29890A92103G6121c34219A8924J04989a52639n4552A65536l3804
10708A31732c35540e8735n000E8324a01492R680A26544b86933a33576k49804J10299
10697b73081b0787j18714L2775A7360a79229h0449l7059o1017e7417l4794j82462
$$ plain form
10686 -274673 178652 -133771 -178486 -119942 56891 -71897 152711 -37986 51876 8916 -123084
10674 -187452 -84759 -291644 31299 -126870 -157024 -129986 -133982 38008 -227700 -3356 -269140
10663 -269140 120526 56285 103304 176321 -141114 48677 -257717 242575 -131693 46313
10652 157910 3326 -315896 -388914 -17405 -267484 -156937 -440721 -390441 -124689 76853 91013
10641 91013 -342902 171564 -279124 38880 68295 -13686 127332 86054 123710 -159178 267192
10629 313683 -139336 131310 -205802 57213 -159290 -383222 102507 31278 -261937 -87479
10618 -137872 -62245 -239206 214042 -196082 58696 143067 102916 372837 144297 -20697
10607 -274873 -279344 -16255 120125 -493189 -112294 22440 268573 -208157 -327291 -1628 119946
$$ packed form
10686b74673A78652a33771m4715N8544E6891g1897A52711c7986E1876H916a23084
10674a87452h4759k06885C1299a26870l0154K7038l996C8008b27700c356k65784
10663b69140A20526E6285M7019P3017a41114D8677b57717B42575a31693D6313
10652A57910C326c15896p3018a7405k50079J10547k83784N0280a24689G6853J4160
10641I1013c42902A71564b79124C8880K9415a3686A27332m1278L7656a59178B67192
10629C13683a39336A31310b05802E7213a59290k23932A02507C1278b61937h7479
10618a37872f2245j76961B14042a96082E8696Q4371m0151K69921A44297b0697
10607b74873m471a6255A20125d93189a12294B2440K46133b08157j19134a628A19946
$$ plain form
10595 -197459 257445 -25353 -30852 -296678 -3023 -179862 -203767 19166 -81966 28676 102787
10584 102787 -80959 -73603 171151 -169079 -54361 -63872 10120 162661 224697 -296620 -350426
10573 -350426 -302868 222708 -14795 74210 139567 354734 -94256 -147116 98798 134174 153910
10562 153910 -125951 -158328 -29419 -232065 125388 -173102 -55866 79258 42420 179120
10552 179120 -3514 -53741 -170048 21947 -10537 52515 87197 315927 -175573 -19578 -236542
10541 -236542 105074 265044 -24520 -77980 142842 196010 -121497 39899 -259875 98496
10530 264570 -112768 -308452 23063 118912 -17186 -28039 -240138 138204 -262492 143350
10519 390710 -272345 20095 72659 -229686 209875 -62906 -76343 118944 -214268 -188692
$$ packed form
10595a97459B57445b5353n499k65826c023j76839k3905A9166h1966B8676P4111
10584A02787h0959P356A71151a69079e4361r511A0120J52541O2036b96620n3806
10573c50426M7558B22708a4795G4210O5357K15167i4256n2860I8798L5376J9736
10562A53910a25951l2377b9419k02646A25388a73102e5866G9258l6838J36700
10552A79120c514n0227j16307B1947a0537E2515L4682K28730a75573a9578k16964
10541b36542A05074J59970b4520n3460A42842N3168a21497C9899b59875I8496
10530B64570a12768j95684B3063R5849a7186j0853k12099A38204b62492A43350
10519C90710b72345B0095N2564b29686B09875f2906j3437A18944b14268K5576
$$ plain form
10509 -188692 -219344 -136193 -60146 74330 -339729 154869 -6101 12756 61962 144212 -2153
10497 -156176 43363 -190084 -225826 -112077 -199938 55402 -78748 -232212 374276 35935 -174080
10485 156241 118911 -239083 45636 263910 308507 1247153 402178 89852 447227 167495
10474 125106 101236 65897 214498 112360 93688 17344 133191 68351 -335802 138300
10463 -65912 -322094 -5928 90900 21638 -193385 -194728 -6033 60583 -109738 183302 -88195
10451 -156080 -127369 129332 -255155 245993 249751 -351934 -11993 -97799 160861 -383527
10440 -180907 -358064 385761 8818 120377 -82661 -125380 -41169 404740 -92026 -281372 -77556
10428 -29074 -214761 -111488 -284360 -16415 117477 -225890 -352884 94511 38803 -106702
$$ packed form
10509a88692l0652Q3151f0146G4330c39729A54869f101A2756M9206Q2250b153
10497a56176D3363a90084l5742a12077q7861E5402g8748j53464C74276C5935a74080
10485A56241l7330b39083D5636K18274M4597R38646D02178H9852L57375A67495
10474A25106k3870l5339J48601j02138j8672A7344J15847o4840c35802A38300
10463f5912k56182e928I0900B1638a93385j343f033F0583a09738A83302h8195
10451a56080K8711A29332b55155B45993L758c51934a1993q5806A60861c83527
10440a80907j77157C85761H818J11559h2661m2719d1169D04740i2026j89346g7556
10428b9074j85687J03273j72872a6415A17477b25890j26994I4511C8803a06702
$$ plain form
10417 205476 -136421 -74120 194582 -169944 -12301 -278812 -149112 423825 -102717 -321606
10407 -321606 77343 37329 -136168 -55081 -171191 113246 -34693 11146 85389 -130001 155712
10395 -86212 -14886 -258433 391962 -204195 4808 123342 200371 80624 -54675 175863 207657
10384 207657 106849 37583 339691 139982 330981 -230393 248525 311797 382981 535489
10374 535489 55298 266412 198534 -131058 -12298 141398 287436 498904 223767 213444
10364 213444 144673 207578 415529 392946 -8791 127588 -85593 43097 50025 261623 284712
10353 284712 202764 428959 732869 474802 367006 426644 118056 465629 71520 263216
10343 263216 422631 409457 86051 362294 223826 299418 237492 117573 202776 -136313
$$ packed form
10417B05476a36421O2301A94582a69944a2301k66511J29700D23825a02717k18889
10407c21606G7343C7329a36168e5081j16110A13246c4693A1146P4243a30001A55712
10395h6212a4886k43547C91962b04195D808J18534P7029H0624e4675A75863L1794
10384B07657j00808C7583L02108A39982J90999b30393B48525O3272P1184J52508
10374E35489E5298K11114o7878a31058a2298A41398J46038K11468B23767j0323
10364B13444o8771O2905K07951k2583h791A27588h5593D3097O928K11598K3089
10353B84712q1948K26195L03910k58067j07796N9638A18056L47573G1520J91696
10343B63216J59415j3174H6051K76243j38468P5592o1926A17573Q5203a36313
$$ plain form
10332 104171 195107 127460 274983 102909 -7748 168237 289738 -70038 124819 259522
10322 259522 401550 65424 265239 -12728 33314 269898 132443 -140388 137872 208510
10312 208510 207650 -113782 219342 -140174 57128 111530 -287312 -22326 208448 31348 27852
10301 27852 34483 201732 -256608 -204554 -13281 -11641 106210 -144103 -129599 -109301 100638
10289 195141 62296 -31046 154036 97180 -138612 123244 297264 -116858 46463 -18084
10278 -15777 -106395 55779 -12342 -310755 -88633 10078 107781 -230632 270891 137981 -355278
10266 24705 105877 -180828 2987 102506 96915 117363 38726 -49428 384614 351509 462065
10255 462065 249705 -19027 425817 166180 411519 126859 -214019 16263 -78292 215781
$$ packed form
10332A04171R0936o7647J47523A02909g748A68237J21501g0038A24819J34703
10322B59522J42028F5424J99815a2728C3314K36584A32443a40388A37872P0638
10312B08510q60a13782B19342a40174E7128N4402b87312b2326B08448C1348l496
10301B7852O631J67249b56608N2054a3281J640A06210a44103J4504K0298A00638
10289A95141F2296c1046A54036n6856a38612A23244J74020a16858D6463a8084
10278a5777r0618E5779a2342k98413h8633A0078R7703b30632B70891j32910c55278
10266B4705Q1172a80828B987R9519n591K0448C8726d9428C84614l3105J10556
10255D62065k12360a9027D25817A66180K45339A26859b14019A6263g8292B15781
$$ plain form
10244 -107832 164199 -227396 -213262 -210639 -48572 -109143 -164151 46974 -137081 12760 177
10232 -181144 387365 -72141 -200301 59852 -26600 -181279 125240 -54005 -129412 131150
10221 -441976 98251 -140798 7182 -112485 -315836 -163792 -6118 -235163 13674 220915 -89851
10209 63907 47340 -123161 -113443 353474 -563322 -252321 -137071 -99765 -126881 -146101 -202615
10198 -202615 -145848 -110811 -115660 -71412 -168281 116192 110590 301151 -321528 -173884 74888
10186 -317915 28020 -376049 -263404 -115124 4028 171432 8163 -319748 -158644 -151634 250605
10174 -361179 111477 -2727 5607 30942 136779 133391 -68290 -140839 130493 -94720 -189951
10163 -189951 -98771 -346028 -109469 -345882 -247139 74396 -89914 -92127 -289355 195140 271046
$$ packed form
10244a07832A64199b27396J4134K623d8572o0571n5008D6974a37081A2760A77
10232a81144C87365g2141j28160E9852b6600j54679A25240e4005p5407A31150
10221d41976I8251a40798G182a12485k03351J52044f118k29045A3674K07241h9851
10209F3907j6567a23161R718C53474e63322b52321J15250L7306k7116j9220n6514
10198b02615N6767L5037m849M4248r6869A16192n602J90561c21528J47644G4888
10186c17915B8020c76049J12645a15124D028J67404H163c19748a58644P010B50605
10174c61179A11477b727E607K5335J05837l388f8290p2549A30493i4720r5231
10163a89951R1180k47257a09469k36413R8743G4396h9914k213j97228A95140P5906
$$ plain form
10152 271046 147682 23034 -219208 -210972 -49359 -210789 -177838 -252349 -65262 -60188 -329523
10141 -329523 61576 -451973 -88866 -231110 -170366 -14375 -205897 -67849 -562901 -71329 -4595
10129 -27791 -57647 30350 201452 -142735 -66970 159816 107462 -316473 297026 74791 -331830
10117 -218388 -52464 -163686 -187961 -26216 97179 -65693 -213559 -316236 -306194 -8223 -302791
10106 -302791 141706 -205610 -9759 -21818 -64060 -334231 70650 196129 27475 -30868 54579
10094 158101 50196 -189543 100452 107734 22043 91401 -91222 -18235 -263759 150729 -322927
10082 -243836 -270898 -238005 -405516 -163881 4752 -22207 -621 -154714 -226761 297633 -85209
10070 -243303 67942 -151957 -99011 -388213 196283 -210723 388093 104447 347903 -29491
$$ packed form
10152B71046j23364B3034b19208Q236d9359j61430L2951p4511f5262N074k69335
10141c29523F1576d51973h8866j42244O0744a4375j91522f7849m95052g1329d595
10129b7791k9856C0350J71102a42735f6970A59816n2354c16473B97026G4791c31830
10117b18388e2464j11222k4275b6216I7179f5693j47866j02677J0042h223k94568
10106c02791A41706b05610i759j2059m2242k70171G0650J25479B7475c0868E4579
10094A58101E0196a89543A00452P282B2043O9358i1222a8235k45524A50729c22927
10082b43836k7062L2893j67511a63881D752b2207f21j54093p2047B97633h5209
10070b43303F7942a51957N2946k89202A96283b10723C88093A04447K43456b9491
$$ plain form
10059 438626 415526 104045 209390 -234810 139625 -47494 -92641 -227920 319433 40401
10048 253386 -163706 86609 -15099 45609 158945 238397 -131965 -191156 56477 129198 116841
10037 116841 95167 46981 100680 192439 -142919 -206890 -1162 139909 -124020 -319050 -246402
10026 -246402 291394 178632 20275 -83565 -23358 -46843 -327826 -116520 60389 -173689
10015 52079 -109534 -206009 -102630 -276114 -204132 -222101 197429 -168500 297606 289685 -229036
10003 9775 -71372 -237494 -269413 -130388 -180508 -173675 -279231 -103779 -97757 14499 295249
9992 295249 94 -51154 -6397 -43561 -59365 58253 -65452 -281361 -175291 146048 -269749 -153619
9980 -153619 -278422 -118694 -198729 -185644 -156519 153753 78305 27292 -23328 128183 443144
$$ packed form
10059D38626k3100A04045J05345b34810A39625d7494m5147j35279C19433D0401
10048B53386a63706H6609a5099D5609J13336P9452a31965n9191E6477P2721j2357
10037A16841k1674D6981N3699R1759a42919o3971a162A39909a24020j95030P2648
10026b46402B91394j12762B0275h3565b3358k3485k80983a16520F0389a73689
10015E2079a09534r6475a02630j73484P1982j7969A97429a68500B97606p921b29036
10003I775g1372j66122l1919a30388n0120O833j05556a03779O022A4499K80750
9992B95249I4e1154f397l7164j5804E8253f5452k15909J06070A46048b69749J16130
9980a53619j24803a18694q0035J3085K9125A53753p5448B7292b3328A28183L14961
$$ plain form
9969 443144 -212928 303484 -218670 -54982 -71731 127973 43957 -366727 -47951 -247917
9959 -247917 -105068 -15382 -430925 60120 -319177 -250490 180708 -25691 -49633 -43453 64277
9947 374803 -130072 170705 -267459 -78562 -55091 -85918 -83829 -3908 39361 287150 -26899
9935 23710 -99128 149415 42809 -126945 -287092 -21404 -166116 180846 156224 204320 -247570
9923 -17043 -194826 -221149 -181734 -219521 -25696 -252027 86063 80847 40075 83321 -52987 51160
9910 59296 -141069 5367 -260448 -31886 -70191 -79034 236091 346136 -86945 -183314 -380853
9899 -380853 39476 -165904 -449023 -49181 -84641 -65261 -42290 -109584 14523 214077 -61511
9887 -173371 -217457 258316 -21732 -235710 25331 -369122 -266035 72361 -48276 101276 -144571
$$ packed form
9969D43144b12928C03484b18670e4982j6749A27973D3957c66727d7951j99966
9959b47917a05068a5382m15543F0120c19177O8687A80708b5691k3942O180F4277
9947C74803a30072A70705b67459g8562K3471l0827K089c908C9361K47789b6899
9935B3710i9128A49415D2809a26945j60147b1404j44712A80846k4622M8096b47570
9923a7043j77783k6323L9415l7787b5696k26331H6063n216D0075M3246e2987E1160
9910E9296a41069E367b60448c1886l8305q843B36091J10045h6945r6369j97539
9899c80853C9476a65904k83119d9181l5460J9380K2971o7294A4523J99554f1511
9887a73371m4086B58316b1732k13978B5331c69122J03087G2361d8276A01276a44571
$$ plain form
9875 -87722 -192101 144137 235494 -321455 -157127 -149943 266990 -484667 -28580 -11933 -239286
9864 -239286 120234 25337 -84051 67336 -58492 -85618 -107676 5059 58458 -87534 -58291 20573
9851 -116217 151118 -192541 -321170 -50596 -400016 14112 -20889 -127647 281581 -43074
9840 -376735 2724 -4176 -288856 -183927 -311530 95241 -305358 2242 -145704 -146480 -146035 -243898
9828 -243898 -278864 -265002 -280438 -93301 -471041 -74449 -403643 67238 -230892 16166 -139331
9816 87027 31941 178054 -139654 -85081 -116554 25384 125335 87006 -19015 192061 -220838
9804 284276 39101 -36570 -20137 -314740 223489 -304668 -180428 -100818 -436373 -96877 191185
9792 259159 296307 -71174 -192549 -104619 -93595 -235448 158615 -160067 112341 229418
$$ packed form
9875h7722j04379A44137R1357c21455a57127P184B66990d84667b8580a1933k27353
9864b39286A20234B5337h4051F7336e8492k7126k2058E059N3399h7534K9243B0573
9851a16217A51118a92541j28629e0596l49420A4112b0889j06758B81581d3074
9840c76735B724d176k84680J04929j27603I5241c05358B242a45704p76M45r7863
9828b43898l4966J3862j5436i3301l77740g4449l29194F7238b30892A6166a39331
9816H7027C1941J46113a39654N4573l1473B5384R9951l8329a9015A92061b20838
9804B84276C9101c6570J6433k94603B23489c04668J24240P9610l35555i6877A91185
9792B59159L7148g1174j21375Q7930J1024j41853A58615a60067A12341J17077
$$ plain form
9782 229418 -10178 -183948 -149125 -117904 -27661 -116635 83915 71524 216250 -29919 -51137
9771 -51137 -212576 258047 -85989 186161 -46005 -269571 160171 -196039 -294255 -138184
9760 -101924 -21468 -47877 26640 -73525 -3299 -304913 -4906 94564 263549 -335901 -122700
9748 210176 -71351 31281 29545 -357538 -127887 -55483 -55378 -9440 -12781 -203444 -59807 142940
9735 -120804 -169411 -127996 -17977 40736 -75648 28804 -167536 -211508 10763 -93736 64805
9723 -295615 73681 68475 -219709 123234 128250 -165465 -179626 83260 -105493 -51450 25609
9711 87019 312961 14649 -531918 -219024 -193842 45781 -236033 -26717 5607 33830 -98393
9699 213898 -186524 -192229 -58856 71420 -318573 -289769 -113116 -191620 114463 -148490 -382969
$$ packed form
9782B29418a0178j73770L4823L1221b7661q8974H3915j2391J44726b9919k1218
9771e1137j61439B58047h5989A86161d6005k23566A60171a96039r8216a38184
9760a01924b1468k6409B6640g3525c299l01614d906I4564J68985c35901a22700
9748B10176g1351C1281j736c57538a27887e5483J05i440l341j90663e9807A42940
9735a20804m8607M1415a7977D0736g5648B8804a67536m3972A0763i3736F4805
9723b95615G3681n206b19709A23234N016a65465j4161H3260a05493e1450B5609
9711H7019K25942A4649e31918b19024K5182D5781b36033b6717E607K8223i8393
9699B13898a86524n705e8856G1420c18573K8804a13116p8504A14463a48490k34479
$$ plain form
9688 -382969 204390 -59212 123096 -25631 15126 -298832 -83684 -269090 207758 -240751
9677 -381662 37690 18908 -147549 103975 20432 -212045 21259 -52295 124468 -86271 6907
9665 -153751 -123628 58736 89454 -211912 193658 -313180 87800 -105872 -17034 -100368 -44213
9653 202666 -76910 -303497 -289379 76237 -233405 -293704 11311 -216029 -111429 120371 -120468
9641 -336567 -66897 -151782 3822 265683 210158 143964 297974 137577 -8539 88352 -161129
9629 99773 -331244 -318768 -436219 -43018 -177598 -96785 89779 -147957 -54259 -8500 227878
9617 -315195 86111 160794 -194019 119710 375745 -73740 -170443 64406 -199418 -176166 -58681
9605 20823 -297573 -22412 216648 -117439 -108362 -169137 -119448 3618 68512 115492 -435093
$$ packed form
9688c82969B04390e9212A23096b5631A5126b98832h3684j85406B07758b40751
9677c81662C7690j8782a47549A03975B0432b12045B1259e2295A24468h6271F907
9665a53751L0123E8736L0718b11912A93658c13180H7800a05872a7034q3334d4213
9653B02666g6910k26587J4118G6237b33405o0299A1311b16029J04600A20371a20468
9641c36567f6897q4885C822K61861n5525o6194J54010A37577h539H8352a61129
9629I9773c31244J2476j17451d3018j34580Q0813H9779a47957e4259h500B27878
9617c15195H6111P4683a94019A19710K56035g3740r6703F4406a99418K3252e8681
9605B0823b97573b2412B16648a17439R077o0775M9689C618O4894M6980d35093
$$ plain form
9593 65275 -225777 -116577 -39027 15427 337216 -87932 -37382 83650 -73848 -299730 -223949
9582 -223949 -77500 -96294 -16284 254052 205046 -55313 298006 -35644 -82466 77090 -264655
9570 19247 -236642 -294660 -17400 -69144 -55788 86484 110417 -260018 97981 11739 -267682
9558 4474 -34011 -240675 -20654 -370102 -25665 148828 7931 80239 -6905 -112369 327565
9546 307371 -209928 152236 44121 5701 -173300 -80020 -256649 1128 -166030 68113 -220423
9534 -85571 200235 111770 -345400 480454 268209 -170416 -169007 -16080 -286263 -156077 -93313
9523 -93313 -80229 91878 -455575 -214499 -243422 -22094 -237190 -63159 115095 -13503 -91116
9512 -91116 -50292 121967 125996 -211028 -257831 -262708 96048 -153989 72417 -250148 -21145
$$ packed form
9593F5275b25777J09200c9027A5427L21789h7932c7382H3650g3848k25882P5781
9582b23949g7500j8794a6284B54052m9006e5313B98006c5644m6822G7090b64655
9570A9247b36642n8018a7400n1744J3356H6484K3933b60018I7981A1739b67682
9558D474c4011k06664b0654l49448b5665A48828G931P2308f905j05464C27565
9546C07371b09928A52236D4121E701a73300h0020j76629A128a66030F8113b20423
9534h5571B00235q8465c45400D80454k12245a70416J409a6080k70183J30186O2764
9523i3313J3084I1878d55575b14499k8923b2094k15096f3159A15095a3503p7613
9512i1116M0824A21967M029b11028m6803m877I6048a53989G2417b50148b1145
$$ plain form
9500 -390891 -72426 62708 237560 12874 64479 16430 115871 -39018 374442 -194467 256133
9488 116732 -330784 -159616 69761 29652 -361346 -117391 157374 -129379 264887 99448
9477 -360304 -141783 -273383 -32707 -169880 49825 -39818 75889 -88373 -34740 -358962 146783
9465 143523 -147334 -3951 83818 152354 -114647 -10610 127318 93587 74129 -109231 -203338
9454 -203338 -91360 -202133 -442617 -65876 -116750 -123601 -140355 -27846 20420 170614 303827
9443 303827 18886 -10747 -35763 -225181 12120 170413 35217 85328 -186103 -215189 -89049
9431 -283429 -274136 -9842 -122812 223137 151745 -188715 -53251 -41113 112431 -43779 203996
9419 -158697 -30780 144535 68174 -234931 -138782 -45671 -171027 -447149 24459 -28849 65737
$$ packed form
9500c90891g2426F2708J74852A2874N1605A6430R9441c9018C74442a94467B56133
9488A16732c30784a59616F9761B9652c61346a17391A57374a29379B64887I9448
9477c60304a41783j31600c2707j37173D9825c9818G5889h8373c4740l24222A46783
9465A43523a47334c951H3818O8536a14647a0610A27318l3731j9458a09231r4107
9454b03338i1360j10773k40484f5876n0874o851j6754b7846B0420J50194J33213
9443C03827A8886a0747k5016j89418A2120J58293C5217N0111a86103k9086h9049
9431b83429R293i842j12970B23137p1392a88715e3251J2138A12431d3779B03996
9419a58697c0780A44535F8174b34931R6149d5671j25356k76122B4459b8849F5737
$$ plain form
9407 76551 126735 -152217 -157153 -310422 208013 251859 -262905 -234884 -16625 -19953 -25044 45384
9394 13934 80642 16382 -246139 -54424 -155355 455198 -121773 -60585 92999 48059 -3579
9382 -168909 -140296 84803 -363972 80230 199529 -176922 -101135 -133441 -472962 21273 -84823
9370 -208026 -93760 -28922 -354655 -76265 34730 -260645 -5340 9401 68958 40742 113320 -275029
9357 84874 -345124 -305569 -170253 -88005 360021 -322626 -90987 -124943 21910 81064 7337
9345 37156 -117086 -245687 132085 -195894 -38479 45623 -139055 -68096 -89316 -139230 -97136
9334 -97136 -127905 149422 57867 -100376 -286321 100691 -180959 292033 -349682 -325618
9324 -325618 -42884 -158220 14319 -399471 -22130 57707 -79382 -11261 -227499 -314873 -327182
$$ packed form
9407G6551N0184a52217m936j53269B08013M3846b62905K8021a6625l328n091D5384
9394A3934O6708A6382b46139e4424j00931D55198a21773f0585I2999m4940c579
9382a68909K8613H4803c63972H0230J19299a76922P5787l2306l39521B1273h4823
9370b08026i3760b8922l25733g6265C4730b60645e340I401N9557k8216P2578b75029
9357H4874c45124L9555J35316Q2248C60021c22626i0987l3956B1910N9154G337
9345C7156a17086j28601A32085a95894c8479D5623a39055f8096k1220m9914M2094
9334i7136l0769A49422E7867a00376j85945A00691a80959B92033c49682K4064
9324c25618d2884j15336A4319c99471b2130E7707g9382a1261k16238q7374j2309
$$ plain form
9313 -327182 78450 75662 -252337 -66001 -120992 -168603 126903 126056 83467 224299 -279986
9301 -166917 -15092 -234320 5316 -14436 -225895 -24469 -417494 -175910 186036 47559 -466606
9289 5986 25738 -118438 97380 -273356 -358527 156299 -45592 63823 -161784 269185 115612
9277 -40233 -243645 -181880 -226 -35223 591279 -81699 143063 49492 -264330 -43241 71868
9265 -370397 -30330 331474 39598 -511415 -472159 43371 -312280 41219 -44560 1293 -79850
9253 284837 -235175 -78896 -281290 -85441 98533 141674 281581 -256183 268014 224510 211249
9242 211249 167340 -138252 260790 -165469 178796 -57575 1538 -65321 -168762 -454504 71998
9230 -111171 -74949 -388440 -86740 214567 77619 135576 204040 -359042 -325503 -109588 -2498
$$ packed form
9313c27182G8450k788b52337f6001n4991m7611A26903q47m2589J40832b79986
9301a66917a5092k19228E316a4436k11459b4469l93025a75910A86036D7559d66606
9289E986J9752a18438I7380b73356q5171A56299d5592F3823a61784B69185A15612
9277d0233k03412O1765b26l4997E91279h1699A43063D9492b64330d3241G1868
9265c70397c0330C31474C9598e11415L9256D3371c12280D1219d4560A293g9850
9253B84837b35175g8896k02394h5441I8533M3141J39907b56183B68014m3504j3261
9242B11249m3909a38252B60790a65469A78796e7575A538f5321j03441k85742G1998
9230a11171L6222l13491h6740B14567G7619N7957O8464c59042L3539a09588b498
$$ plain form
9218 -148878 -272949 -9139 122657 65263 246739 -192948 -80959 202515 -290659 -91884 47578
9206 -210235 -262742 155290 -165688 -230700 88483 101553 -50006 -340919 -25575 1407 -309147
9194 -186962 -186726 -384146 -102372 -260577 -44039 161383 126597 -137564 -87340 -5144 204831
9182 -235359 -26431 60975 250314 41559 -396387 -342348 106616 -250463 -55518 -156731 -164266
9171 -164266 108080 -325047 51275 60757 -117134 -230622 -143106 -157784 197290 150415 3637
9159 -93539 -460021 356608 -12655 126470 -172319 -248778 135775 48585 75213 -60625 -105375
9148 -105375 -131206 65496 -262637 -119798 371538 15758 -218390 8987 -108625 104023 175033
9137 175033 -183160 -58241 -313773 -48660 -25725 90308 -22166 -370648 75148 -15492 -200643
$$ packed form
9218a48878j24071i139A22657n7394J81476a92948h0959B02515b90659i1884D7578
9206b10235n2507A55290a65688o5012H8483J3070e0006k90913b5575A407c09147
9194a86962K36j97420a02372j58205d4039A61383l4786a37564N0224e144B04831
9182b35359b6431F0975J89339D1559c96387N4039A06616b50463e5518j01213p535
9171a64266A08080c25047E1275R482a17134j13488Q7516j4678A97290m6875C637
9159i3539l66482C56608a2655A26470a72319p6459A35775D8585K6628f0625m4750
9148a05375k5831F5496b62637a19798C71538A5758b18390H987a08625A04023P1010
9137A75033a83160e8241k55532d8660K2935I0308b2166l48482G5148a5492j85151
$$ plain form
9126 -200643 40554 -64988 173082 -85499 133185 -125564 213558 -83194 -110017 -69154 516068
9114 -268606 -116191 -246919 34300 -181240 -264268 2612 -32030 32200 -56987 -239230 366515
9102 -350948 -2216 -58008 69709 -74049 155275 -164118 167229 4252 -192112 440810 -48008
9090 77317 -195163 93988 -40682 -13201 52571 -15493 -24625 -55745 189599 -216 -120416 -152589
9078 -152589 -33417 -35805 8673 -205218 -210403 -99923 -378092 -138407 42390 174246 -110384
9066 -418806 -144551 -136927 -19289 -341035 -7889 -142963 -90876 -270720 -75112 103913 43253
9054 42066 -334863 -403723 2287 -73669 -401763 -129610 -47547 -426087 -180667 44469 24086
9043 24086 191252 -200457 218732 -190346 -246150 -130814 167118 -113685 85331 36588
$$ packed form
9126b00643D0554f4988A73082h5499A33185a25564B13558h3194k6823M0863E16068
9114b68606a16191j30728C4300a81240q3028B612c2030C2200e6987j82243C66515
9102c50948b216n5792F9709g4049A55275a64118A67229D252a92112D40810d8008
9090G7317a95163I3988d0682a3201E2571a5493r132l1120A89599b16j20200l2173
9078a52589c3417k388H673b05218n185i9923k78169a38407D2390J31856a10384
9066d18806a44551P624a9289l21746g889j35074N2087j79844g5112A03913D3253
9054D2066c34863o8860B287g3669l28094a29610d7547l78540a80667D4469k0383
9043B4086J67166b00457B18732a90346n5804J15336A67118a13685H5331C6588
$$ plain form
9032 -249736 -274943 167721 87386 29551 446 -89040 36412 -77727 -24177 198184 81222 -123735
9019 -263609 -84875 36899 -32059 83040 -116819 -54898 -224449 100210 -106331 -57654 -105767
9008 -105767 273351 -116853 36064 -29279 -65709 -179399 -179488 -169554 108742 31863 -271513
8996 15847 159573 -204266 -244311 -77942 -124811 23506 -140492 -36545 46386 -128170 -715
8984 -277085 119276 -258809 40567 -61145 -19485 -315731 -26445 -105683 139051 176687 104883
8973 104883 24315 -152725 -212845 316473 -278159 -186506 -91453 -216325 12206 -29539 -24247
8962 -24247 -156597 69627 -184950 -92022 -13724 -248212 58999 105560 -220103 210544 -314488
8950 -144121 -124145 -391577 -280821 14611 138323 -67990 6224 -233298 108457 -280547 -297217
$$ packed form
9032b49736k5207A67721q0335B9551D46h9040C6412g7727b4177A98184H1222a23735
9019b63609h4875C6899c2059H3040a16819e4898j69551A00210a06331M8677m8113
9008a05767B73351a16853C6064b9279l6430j13690q9R934A08742C1863b71513
8996A5847J43726b04266m0045g7942m6869B3506a40492c6545D6386a28170g15
8984b77085A19276b58809D0567f1145a9485k96246b6445p9238A39051L7636p1804
8973A04883B4315a52725o0120C16473b78159R1653i1453j24872A2206b9539N292
8962b4247j32350F9627a84950i2022a3724k34488E8999M6561b20103B10544c14488
8950a44121J9976k67432J10756A4611J23712f7990F224b33298A08457b80547j6670
$$ plain form
8939 -297217 116071 77019 183326 -155040 -141384 379110 -87822 202260 -319201 -156402
8928 183093 -130925 105806 116387 350437 614116 1254405 4483533 5270300 1405752 612788
8917 306974 110211 -110659 17658 90502 -8516 112705 -11365 -179531 279696 302778 321412
8906 321412 -70270 -200220 -27999 -163194 -246058 -225883 283580 -185314 -352588 -51559 -111259
8895 -111259 -32182 -202821 -242584 -129742 40349 -179880 27526 333881 164364 -221133
$$ packed form
8939b97217A16071l9052J06307a55040J3656C79110h7822B02260c19201a56402
8928A83093a30925A05806J0581K34050K63679O40289L229128P86767A405752F12788
8917C06974A10211a10659A7658P2844h516A12705a1365j68166B79696K3082J8634
8906C21412g0270j29950b7999j35195q2864K0175B83580a85314j67274e1559n9700
8895a11259c2182j70639l9763J12842D0349a79880B7526L06355A64364b21133
$$ [...]
##END NTUPLES=NMR SPECTRUM
##END=
