
##TITLE=AC1321_SOiAH12150_6609688_FKkP90VOrA
##JCAMPDX= 6.0         $$ Bruker NMR JCAMP-DX V2.0
##DATA TYPE= NMR SPECTRUM
##DATA CLASS= NTUPLES
##ORIGIN= BRUKER
##OWNER= Administrator
$$ 1.72 TOPSPIN		Version 2.1
$$ 2012-08-01 20:56:18.484 -0500  Administrator@TOPSPIN
$$ Compression mode = diff/dup
##.OBSERVE FREQUENCY= 400.02188249412
##.OBSERVE NUCLEUS= ^1H
##.ACQUISITION MODE= SIMULTANEOUS (DQD)
##.ACQUISITION SCHEME= undefined
##.AVERAGES= 8
##.DIGITISER RES= 22
##SPECTROMETER/DATA SYSTEM= spect
##.PULSE SEQUENCE= zg30
##.SOLVENT NAME= COFFEE_meoh
##.SHIFT REFERENCE= INTERNAL, COFFEE_meoh, 1, 14.98509
##AUDIT TRAIL= $$ (NUMBER, WHEN, WHO, WHERE, PROCESS, VERSION, WHAT)
$$ ##TITLE= Audit trail, TOPSPIN		Version 2.1
$$ ##JCAMPDX= 5.01
$$ ##ORIGIN= Bruker BioSpin GmbH
$$ ##OWNER= Administrator
$$ $$ C:\Bruker\TOPSPIN/data/COFFEE/nmr/AC1321_SOiAH12150_6609688_FKkP90VOrA/10/pdata/1/auditp.txt
$$ ##AUDIT TRAIL=  $$ (NUMBER, WHEN, WHO, WHERE, PROCESS, VERSION, WHAT)
(   1,<2012-08-01 20:56:10.062 -0500>,<Administrator>,<TOPSPIN>,<go>,<TOPSPIN 2.1>,
      <created by zg
	started at 2012-08-01 20:55:03.546 -0500,
	POWCHK enabled, PULCHK disabled,
       configuration hash MD5:
       6B 1B 68 BB D9 2E 58 E2 7F 35 AD 54 07 DF 0E 41
       data hash MD5: 64K
       7A 64 4F 49 CC 40 07 B6 9A E2 7C B8 01 65 01 60>)
(   2,<2012-08-01 20:56:14.312 -0500>,<Administrator>,<TOPSPIN>,<proc1d>,<TOPSPIN 2.1>,
      <Start of raw data processing
       efp LB = 0 FT_mod = 6 PKNL = 1 PHC0 = 0 PHC1 = 0 SI = 32K 
       data hash MD5: 32K
       13 E6 E9 0B 0D 59 F2 58 E0 8C 0F DA 7D E5 12 B8>)
(   3,<2012-08-01 20:56:14.593 -0500>,<Administrator>,<TOPSPIN>,<proc1d>,<TOPSPIN 2.1>,
      <pk PHC0 = 173.172 PHC1 = 0 
       data hash MD5: 32K
       37 14 4F 42 63 58 E1 F1 92 E4 CD 83 4C 86 90 65>)
(   4,<2012-08-01 20:56:14.671 -0500>,<Administrator>,<TOPSPIN>,<proc1d>,<TOPSPIN 2.1>,
      <abs ABSG = 1 
       data hash MD5: 32K
       D2 72 55 A5 98 88 DC 84 FD 7F 53 47 29 55 5C BD>)
(   5,<2012-08-01 20:56:14.703 -0500>,<Administrator>,<TOPSPIN>,<proc1d>,<TOPSPIN 2.1>,
      <abs ABSG = 2 
       data hash MD5: 32K
       3C CB 5E FF EE 9D 57 0B 91 2A 85 BE 04 BC 50 91>)
(   6,<2012-08-01 20:56:14.734 -0500>,<Administrator>,<TOPSPIN>,<proc1d>,<TOPSPIN 2.1>,
      <abs ABSG = 3 
       data hash MD5: 32K
       8E 5B 03 B6 AC 6F 6D FA 87 94 50 6C 3A 46 FD F2>)
(   7,<2012-08-01 20:56:14.765 -0500>,<Administrator>,<TOPSPIN>,<proc1d>,<TOPSPIN 2.1>,
      <abs ABSG = 4 
       data hash MD5: 32K
       5E 0F C5 B4 F2 4C 3E CE 5C 99 45 11 8E C0 CB 00>)
(   8,<2012-08-01 20:56:14.796 -0500>,<Administrator>,<TOPSPIN>,<proc1d>,<TOPSPIN 2.1>,
      <abs ABSG = 5 
       data hash MD5: 32K
       9B 0E 8C CB D9 2F A9 B1 45 A8 80 DB 69 C0 21 B5>)
$$ ##END=
$$ 
$$ $$ hash MD5
$$ $$ 62 05 BC 26 00 F0 FD 0B 11 DB D0 4D FD A2 82 44
##$RELAX= 
##$RELAX= 
##$RELAX= 
##$RELAX= 
##$RELAX= 
##$RELAX= 
##$RELAX= 
$$ Bruker specific parameters
$$ --------------------------
$$ [...]
##$TP= (0..7)
150 150 150 150 150 150 150 150
##$TP07= 0
##$TPNAME0= <>
##$TPNAME1= <>
##$TPNAME2= <>
##$TPNAME3= <>
##$TPNAME4= <>
##$TPNAME5= <>
##$TPNAME6= <>
##$TPNAME7= <>
##$TPOAL= (0..7)
0.5 0.5 0.5 0.5 0.5 0.5 0.5 0.5
##$TPOFFS= (0..7)
0 0 0 0 0 0 0 0
##$TUNHIN= 0
##$TUNHOUT= 0
##$TUNXOUT= 0
##$USERA1= <user>
##$USERA2= <user>
##$USERA3= <user>
##$USERA4= <user>
##$USERA5= <user>
##$V9= 5
##$VALIST= <valist>
##$VCLIST= <CCCCCCCCCCCCCCC>
##$VD= 0
##$VDLIST= <DDDDDDDDDDDDDDD>
##$VPLIST= <PPPPPPPPPPPPPPP>
##$VTLIST= <TTTTTTTTTTTTTTT>
##$WBST= 1024
##$WBSW= 4
##$XGAIN= (0..3)
0 0 0 0
##$XL= 0
##$YL= 0
##$YMAX_a= 465567
##$YMIN_a= -600129
##$ZGOPTNS= <>
##$ZL1= 120
##$ZL2= 120
##$ZL3= 120
##$ZL4= 120
##$ABSF1= 14.98509
##$ABSF2= -5.573092
##$ABSG= 5
##$ABSL= 3
##$ALPHA= 0
##$AQORDER= 0
##$ASSFAC= 0
##$ASSFACI= 0
##$ASSFACX= 0
##$ASSWID= 0
##$AUNMP= <proc_prof1d_extract_pilot.lims>
##$AXLEFT= 0
##$AXNAME= <>
##$AXNUC= <1H>
##$AXRIGHT= 0
##$AXTYPE= 0
##$AXUNIT= <>
##$AZFE= 0.1
##$AZFW= 0.1
##$BCFW= 0
##$BC_mod= 0
##$BYTORDP= 0
##$COROFFS= 0
##$CY= 15
##$DATMOD= 1
##$DC= 0
##$DFILT= <>
##$DTYPP= 0
##$F1P= 0
##$F2P= 0
##$FCOR= 0.5
##$FTSIZE= 32768
##$FT_mod= 6
##$GAMMA= 0
##$GB= 0
##$INTBC= 1
##$INTSCL= 1
##$ISEN= 128
##$LB= 0
##$LEV0= 0
##$LPBIN= 0
##$MAXI= 10000
##$MC2= 0
##$MEAN= 0
##$ME_mod= 0
##$MI= 0
##$NCOEF= 0
##$NC_proc= -8
##$NLEV= 6
##$NOISF1= 0
##$NOISF2= 0
##$NSP= 0
##$NTH_PI= 0
##$NZP= 0
##$OFFSET= 14.98509
##$PC= 1
##$PHC0= 173.172
##$PHC1= 0
##$PH_mod= 1
##$PKNL= yes
##$PPARMOD= 0
##$PPDIAG= 0
##$PPIPTYP= 0
##$PPMPNUM= 2147483647
##$PPRESOL= 1
##$PSCAL= 4
##$PSIGN= 0
##$PYNMP= <proc.py>
##$REVERSE= no
##$SF= 400.02
##$SI= 32768
##$SIGF1= 0
##$SIGF2= 0
##$SINO= 400
##$SIOLD= 32768
##$SPECTYP= <>
##$SREGLST= <1H.CDCl3>
##$SSB= 0
##$STSI= 32768
##$STSR= 0
##$SW_p= 8223.68421052631
##$SYMM= 0
##$S_DEV= 0
##$TDeff= 65536
##$TDoff= 0
##$TI= <>
##$TILT= no
##$TM1= 0
##$TM2= 0
##$TOPLEV= 0
##$USERP1= <user>
##$USERP2= <user>
##$USERP3= <user>
##$USERP4= <user>
##$USERP5= <user>
##$WDW= 1
##$XDIM= 32768
##$YMAX_p= 466551200
##$YMIN_p= -743218
##$CURPLOT= <Network HP LaserJet P1505>
##$CURPRIN= <$Network HP LaserJet P1505>
##$DFORMAT= <normdp>
##$LAYOUT= <+/1D_H.xwp>
##$LFORMAT= <normlp>
##$PFORMAT= <normpl>
##$SURQMSG= 1
$$ End of Bruker specific parameters
$$ ---------------------------------
##NTUPLES= NMR SPECTRUM
##VAR_NAME=  FREQUENCY,     SPECTRUM/REAL,   SPECTRUM/IMAG
##SYMBOL=    X,             R,               I
##VAR_TYPE=  INDEPENDENT,   DEPENDENT,       DEPENDENT
##VAR_FORM=  AFFN,          ASDF,            ASDF
##VAR_DIM=   32768,         32768,           32768
##UNITS=     HZ,            ARBITRARY UNITS, ARBITRARY UNITS
##FACTOR=    0.250966925370066, 1,           1
##FIRST=     8223.43324360094, -16889,       -159892
##LAST=      0,             -8557,           1484
##MIN=       0,             -743218,         0
##MAX=       8223.43324360094, 466551200,    0
$$ Real data points
##PAGE= N=1
##DATA TABLE= (X++(R..R)), XYDATA
$$ [...]
19480i863o1433k24176B5114c89720A60853D4321a69064A0053e2818h329c341
$$ -9863 -71296 -295472 25114 -389720 160853 44321 -169064 10053 -52818 -8329 -3341
19468c28630A44731a45519A94199g2322A06821i2551M018j23059A14758a42543
$$ -328630 144731 -145519 194199 -72322 106821 -92551 -88533 -211592 114758 -142543
19457b01821B53977a04640m9958L630l7576r1752B19550a75026E7451b29345m4181
$$ -201821 253977 -104640 -154598 -150968 -188544 -280296 219550 -175026 57451 -229345 -273526
19446b73526A71462e9711b1554k8813j45986G9595b3600F6411b77641C4479c56869
$$ -273526 171462 -59711 -21554 -50367 -196353 79595 -23600 66411 -277641 34479 -356869
19434i8104C0689c62579a34984A94612c56624B51404c22412P3575c5934j04358
$$ -98104 30689 -362579 -134984 194612 -356624 251404 -322412 -248837 -35934 -140292
19424a40292B732b0076k07815C5956h5736j48589F45456f113H8966g6889j96493
$$ -140292 2732 -20076 -227891 35956 -85736 -234325 645456 -6113 88966 -76889 -273382
19413b73382a17720B95616i382B428b12999g3626F0855J1876a89090b98D5894
$$ -273382 -117720 295616 -9382 2428 -212999 -73626 60855 72731 -189090 -298 45894
19401a14608k5736C05665F288b33263J00339c4479A72225g9093j027l42696b3387
$$ -114608 -140344 305665 6288 -233263 -132924 -34479 172225 -79093 -80120 -422816 -23387
19389c93147J41050R5558c2393p9997M9599j28809Q4559C1189b20148A00921a6217
$$ -393147 -252097 -156539 -32393 -112390 -62791 -191600 -107041 31189 -220148 100921 -16217
19377a10291D4180P7958l7274J756N360J61907c84527K0809a66180j23599h9152
$$ -110291 44180 122138 84864 86620 91980 253887 -384527 -363718 -166180 -289779 -89152
19365b2558j24106k1744F8028P604a11557j5010B26465q8471b90040J08060q4608
$$ -22558 -146664 -168408 68028 75632 -111557 -126567 226465 137994 -290040 -181980 -266588
19354b66588A14743d00054b4049l54528i4665j59024E0275c07756a50589l029
$$ -266588 114743 -400054 -24049 -378577 -94665 -253689 50275 -307756 -150589 -153618
19344a53618b1745k06943o1625Q6004g6071j98136f5308A25585h5741p1659B04168
$$ -153618 -21745 -228688 -290313 -204309 -76071 -274207 -65308 125585 -85741 -157400 204168
19332c47840a5973j99413L9500A90548g7282n7730f0533M779k2415j1525L177
$$ -347840 -15973 -215386 -175886 190548 -77282 -135012 -60533 -55754 -78169 -89694 -86517
19321h6517H4145B0384J993i166k63412a35778f3698A10791A313a07614K7949
$$ -86517 84145 20384 22377 -9166 -272578 -135778 -63698 110791 1313 -107614 -79665
19310g9665j33329J03135k80233P0379A08858P7309J4529C8740a21452K5889A40922
$$ -79665 -212994 -109859 -390092 -319713 108858 186167 200696 38740 -121452 -95563 140922
19298b70796E8083L47699b55770a12265K8272l4129L4447l0137b8513q5685B21446
$$ -270796 58083 405782 -255770 -112265 -83993 -118122 -83675 -113812 -28513 -114198 221446
19286h9004J4032D1006d2550k0595l0179B1301b20341P0917j07534J10082I7184
$$ -89004 -74972 41006 -42550 -63145 -93324 21301 -220341 -149424 -256958 -146876 97184
19274B39782H6756a99123n0873M1696N4438k4856C05947A37599i7824M3743H3465
$$ 239782 86756 -199123 -249996 -208300 -153862 -178718 305947 137599 -97824 -54081 83465
19262A63561a16284A7567c5388l58503J95256G0109a40995a4076C3034h8675A28512
$$ 163561 -116284 17567 -35388 -393891 -198635 70109 -140995 -14076 33034 -88675 128512
19250a77165N8346E2051P5821e759F7496f6364A87308k7455a34233m0175e7971
$$ -177165 -118819 52051 127872 -5759 67496 -66364 187308 159853 -134233 -174408 -57971
19238a43901e8703p2984H0210C8662d14841J95509A66682B9130a40519b081j2335
$$ -143901 -58703 -131687 80210 38662 -414841 -219332 166682 29130 -140519 -2081 -14416
19227a4416k59201c9013A40319g793G237a9230A30783L45894A55529a33828j03214
$$ -14416 -273617 -39013 140319 -7793 7237 -19230 130783 476677 155529 -133828 -237042
19216b37042B37814f9323j87948h727k02118A50712J76022c7134j30627A8761
$$ -237042 237814 -69323 -257271 -8727 -210845 150712 326734 -37134 -167761 18761
19205b24611D3969a75977D4383a78615c8170A80735a29218a1375m1959A85977
$$ -224611 43969 -175977 44383 -178615 -38170 180735 -129218 -11375 -53334 185977
19194c06255i3513L6389j33158i2657l2556k20843j662H4872c54912a02568o5744
$$ -306255 -93513 -57124 -190282 -92657 -125213 -346056 -347718 84872 -354912 -102568 -168312
19183a68312O5161l6151j20835k1236R8734q1986j43099F3952B3142d38579A02551
$$ -168312 -103151 -139302 -260137 -281373 -182639 -264625 -407724 63952 23142 -438579 102551
19171b31040B1564b68524r2451B87286J2458j963q1042D9429a33847b0681j44446
$$ -231040 21564 -268524 -360975 287286 299744 297781 216739 49429 -133847 -20681 -165127
19160a65127L2566A49177a24337I869K18574f019j35606j15645I8016a65320B95872
$$ -165127 -132561 149177 -124337 9869 228443 -6019 -141625 -257270 98016 -165320 295872
19148a83033Q769H9536e9106A17294e9205A32430a73059A85936c2582A95625b43031
$$ -183033 -174264 89536 -59106 117294 -59205 132430 -173059 185936 -32582 195625 -243031
19136A25969P4060G683K9937M8234k5118b52971j0207h0681j64552L0344l6331
$$ 125969 200029 7683 37620 85854 60736 -252971 -263178 -80681 -245233 -214889 -251220
19125b51220j24178a69316c2096k03858d4949H3633L5172h1986k32352A25893
$$ -251220 -375398 -169316 -32096 -235954 -44949 83633 118805 -81986 -314338 125893
19114a40894A1014Q9835a11434j804p5123B6913J8465d1625o5180I1546J14577
$$ -140894 11014 100849 -111434 -113238 -188361 26913 45378 -41625 -106805 91546 206123
19103B06123a27544n5487A24612m4512g8664b447B8825c70556a27267k9063K6817
$$ 206123 -127544 -183031 124612 80100 -78664 -2447 28825 -370556 -127267 -156330 -129513
19092a29513A16103b20576B18273a07580l03938g0328A21426e6838p2096N7251
$$ -129513 116103 -220576 218273 -107580 -411518 -70328 121426 -56838 -128934 -71683
19082g1683c3252A90661n0251K7242d08813J09652f4620A61198c24288D116c32494
$$ -71683 -33252 190661 140410 167652 -408813 -299161 -64620 161198 -324288 4116 -332494
19070A13697g3708C0706h6330e321A8079g3577j67962f7451b2011k7511l93426
$$ 113697 -73708 30706 -86330 -5321 18079 -73577 -241539 -67451 -22011 -49522 -442948
19059d42948h0648R263A91000b1828B35963L5704G4679a679o6118A62448J8286
$$ -442948 -80648 -71385 191000 -21828 235963 271667 74679 -1679 -67797 162448 180734
19048A80734J20385b05736F8420g6614k70815c8050m2852J2553B5240G888J5681
$$ 180734 301119 -205736 68420 -76614 -347429 -38050 -80902 -68349 25240 7888 23569
19037B3569a45411D8571a01357A15796c05211a29530C7128d2786A47608Q6237
$$ 23569 -145411 48571 -101357 115796 -305211 -129530 37128 -42786 147608 233845
19027B33845b786A88937l0114c6960B0307J6358R3205M0576g5527A94188O2494
$$ 233845 -2786 188937 158823 -36960 20307 36665 129870 170446 -75527 194188 256682
19016B56682a64588l55179a68276A62018c88355C36313b38190e6740j3154o1931
$$ 256682 -164588 -519767 -168276 162018 -388355 336313 -238190 -56740 -69894 -131825
19006a31825N4245A1284E48J82696a03100C3624J14371a90397A24103L7294q049
$$ -131825 -77580 11284 548 183244 -103100 33624 147995 -190397 124103 161397 153348
18995A53348i8867k1180G6481a20952j00299q4773a20904B07881c5376r5915F9233
$$ 153348 -98867 -120047 76481 -120952 -221251 -306024 -120904 207881 -35376 -131291 69233
18983a89215A6065b68664I1562b15172p7827j95932G5665e6369c305F0311J64756
$$ -189215 16065 -268664 91562 -215172 -292999 -488931 75665 -56369 -3305 60311 225067
18972B25067P236K40936L25601k77790j74416A19463j7299a20270c4511G5877
$$ 225067 232303 473239 798840 521050 346634 119463 102164 -120270 -34511 75877
18961i7872B34808b73585M1223B15764d82276e5366k84205f0150j35837Q9666
$$ -97872 234808 -273585 -232362 215764 -482276 -55366 -339571 -60150 -195987 -106321
18951a06321k41101J45609H145C717J62101M8173a22754a6566D1652e89881A25067
$$ -106321 -347422 -201813 8145 3717 165818 213991 -122754 -16566 41652 -589881 125067
18939I6484b03794A41352D1443Q4819K4980C3901c2135j39327K4406B03048b27115
$$ 96484 -203794 141352 41443 126262 151242 33901 -32135 -171462 -147056 203048 -227115
18927a0829F0594c69435G0155J10726c38990O3054a32134j96478H046i1933j02242
$$ -10829 60594 -369435 70155 180881 -338990 -275936 -132134 -328612 8046 -91933 -194175
18916a94175A86153L6492f02543B35164a56980r5755d4254m2849B15333J20092
$$ -194175 186153 222645 -602543 235164 -156980 -252735 -44254 -87103 215333 335425
18906C35425M3292J62132B65673E6795K36124D4731J4155a19278E63904d194j78783
$$ 335425 378717 540849 265673 56795 292919 44731 58886 -119278 563904 -4194 -182977
18895a82977L4511L6466j55023J33404l17153A41537D6630b62138D57059A0327
$$ -182977 -148466 -112000 -267023 -133619 -450772 141537 46630 -262138 457059 10327
18884B56850a18432p9101k0452j5365l001A22854e6300J7820Q000l84238A43002
$$ 256850 -118432 -197533 -217985 -233350 -236351 122854 -56300 -38480 -30480 -414718 143002
18872a21563H4509a1371A09042b78996K5349f5890k04474C7824L78102a99360
$$ -121563 84509 -11371 109042 -278996 -253647 -65890 -270364 37824 415926 -199360
18861A40262j7505l4025e6902B53850c85528d6161R422a6843k6839J2018k75806
$$ 140262 122757 88732 -56902 253850 -385528 -46161 -36739 -16843 -43682 -31664 -307470
18850c07470A4775K92641a28958J6922E2078R1814a10608M6899j19380j30922
$$ -307470 14775 307416 -128958 -112036 52078 143892 -110608 -63709 -183089 -314011
18840c14011B80159i2584b29j01670n7955I2821K4432a65953A04878d6477B13347
$$ -314011 280159 -92584 -229 -101899 -159854 92821 117253 -165953 104878 -46477 213347
18828a43513O4926k46900R0490G4703a21524B27902i5975a8013k03728J6606A02499
$$ -143513 -78587 -325487 -234997 74703 -121524 227902 -95975 -18013 -221741 -205135 102499
18816A49239F4312b01173e2181m2919A82736a00208d294k74625A77524G6164a16568
$$ 149239 64312 -201173 -52181 -95100 182736 -100208 -4294 -278919 177524 76164 -116568
18804B63945d1773B6529M721g1584j27690f1608B32665d4812j03862N6303F0429
$$ 263945 -41773 26529 31250 -71584 -199274 -61608 232665 -44812 -148674 -92371 60429
18792f9668G3356a48195D2457K8375B0633g6208j97520J07630m6347k55602d357
$$ -69668 73356 -148195 42457 70832 20633 -76208 -273728 -166098 -212445 -468047 -4357
18780b59399d1914k60762F7317a22609H7930a26245B31835d59405J03291h1833
$$ -259399 -41914 -302676 67317 -122609 87930 -126245 231835 -459405 -356114 -81833
18769G6755e4392k2641k90259A36526e5669A11316M4473a10745d2126j42774o6032
$$ 76755 -54392 -77033 -367292 136526 -55669 111316 155789 -110745 -42126 -184900 -250932
18758b50932a18660B76201j14816b068m6818q4933j31460N0083J03374k59834
$$ -250932 -118660 276201 161385 -2068 -48886 -133819 -265279 -215196 -111822 -371656
18748c71656A4541a85846A32665E0104c11993a41231A93508i1447A37409N4988
$$ -371656 14541 -185846 132665 50104 -311993 -141231 193508 -91447 137409 192397
18738A92397C967h6066A81809Q6797a42870j76641A2208a7914p6985E2474H402
$$ 192397 3967 -86066 181809 268606 -142870 -319511 12208 -17914 -94899 52474 8402
18726i8539C44502i2426j27971I9187b8817k89124i5671C95441A47118c29787
$$ -98539 344502 -92426 -220397 99187 -28817 -317941 -95671 395441 147118 -329787
18715G432J68106D4826N154J728a46036l149A0303J32833e1730j00183f1239G5998
$$ 7432 175538 44826 49980 51708 -146036 -149185 10303 143136 -51730 -151913 -61239 75998
18702A38962b64403a17113D0162b96156J14803j79795A2668a79030k8651B64080
$$ 138962 -264403 -117113 40162 -296156 -181353 -361148 12668 -179030 -207681 264080
18691d83920K41531a15937A07594A0161i0117C29060h7113p4291A32883c2801
$$ -483920 -242389 -115937 107594 10161 -90117 329060 -87113 -161404 132883 -32801
18680h8593B23352I2711a83605m4872L0150N6938a8217j87762O8738q2718A40258
$$ -88593 223352 92711 -183605 -228477 -198327 -141389 -18217 -205979 -137241 -219959 140258
18668a29058N6759l9921r4908a5010F150A852L7281d0444m06671B9759h5081j64325
$$ -129058 -72299 -112220 -207128 -15010 6150 1852 39133 -40444 -447115 29759 -85081 -249406
18656b49406A15987n2432g0995j20960E7740a15339A45534h7253B38557E7697
$$ -249406 115987 63555 -70995 -191955 57740 -115339 145534 -87253 238557 57697
18645F4030J98138a90221I2880F893b03589J6644B7341c91560b4176j84105Q4921
$$ 64030 262168 -190221 92880 6893 -203589 -186945 27341 -391560 -24176 -208281 -123360
18634a23360O0538j10282f3358j68681P3864A47643a23010N3175m2266j8050B6851
$$ -123360 -62822 -173104 -63358 -232039 -158175 147643 -123010 -69835 -112101 -130151 26851
18622b06357k0095p5757h3686o981j39638P0195n3279e2076l68417a93087G6639
$$ -206357 -226452 -302209 -83686 -90667 -230305 -160110 -213389 -52076 -420493 -193087 76639
18610f8816H1845i8327n5030n2475j17228A06405b92952A21260a97194d1549C0027
$$ -68816 81845 -98327 -153357 -205832 -323060 106405 -292952 121260 -197194 -41549 30027
18598b68142A32605b60057J16432B2424F122R4871J14127c18521A29206k0792
$$ -268142 132605 -260057 -143625 22424 6122 100993 215120 -318521 129206 108414
18588A08414n0828L32769a15239j31906M6283q6998H0513a43645l7895m1528o6015
$$ 108414 57586 390355 -115239 -247145 -200862 -287860 80513 -143645 -181540 -223068 -289083
18577b89083J31518n1194l6476A0813d4721B9020a37079A03741a62639n3027M6858
$$ -289083 -157565 -208759 -245235 10813 -44721 29020 -137079 103741 -162639 -215666 -168808
18566a68808a4699H2656c6228A19277b49785K0222A12142k9537b15057C87030
$$ -168808 -14699 82656 -36228 119277 -249785 -229563 112142 82605 -215057 387030
18555B20025E3880c6506J8212A36947D9393d54422a83098E5771e35481C14754
$$ 220025 53880 -36506 -18294 136947 49393 -454422 -183098 55771 -535481 314754
18544H0440J19099r4435J95045F2048b5781j5069F4105a33285I1336B3862g6313
$$ 80440 199539 105104 300149 62048 -25781 -40850 64105 -133285 91336 23862 -76313
18532G7373a2644j37679K4929E2135b90050A82576h3734j9783c0422m6944G0693
$$ 77373 -12644 -150323 -125394 52135 -290050 182576 -83734 -103517 -30422 -77366 70693
18520F5928B398a34961J8159A53017j6795b73809P9798d3206C2934a74987D7372
$$ 65928 2398 -134961 -116802 153017 136222 -273809 -194011 -43206 32934 -174987 47372
18508d4771k8796R719j38337j32573J46033B6967e8980A76034g5174j0938b4927
$$ -44771 -73567 -63848 -202185 -334758 -188725 26967 -58980 176034 -75174 -86112 -24927
18496B6407a27646J4135d9226F53f7761B563e04582c1735a4880m735j15698B7221
$$ 26407 -127646 -113511 -49226 653 -67761 2563 -504582 -31735 -14880 -19615 -135313 27221
18483B38301a73361k18485a11365c9223C39920b12475A05120P708c51947A58246
$$ 238301 -173361 -391846 -111365 -39223 339920 -212475 105120 112828 -351947 158246
18472G0267A022d77949q645b31007A44537J08306e1570A38368M9328b56506B85294
$$ 70267 1022 -477949 -486594 -231007 144537 252843 -51570 138368 187696 -256506 285294
18460d07908I9823L0825a71151f4320B62705h3685k07209B48385b6692l94898
$$ -407908 99823 130648 -171151 -64320 262705 -83685 -290894 248385 -26692 -421590
18450d21590a0403B27853a1120j6928j65856R623L3243G0930b99387j35184c718
$$ -421590 -10403 227853 -11120 -28048 -193904 -184281 -151038 70930 -299387 -434571 -3718
18438i1188a7300B16138A5710J54508a57359A81017c30110a49027A2676a20161
$$ -91188 -17300 216138 15710 170218 -157359 181017 -330110 -149027 12676 -120161
18427a50953A57706O7598b50386m1146g3675k0418A83289b54939N8715A32774
$$ -150953 157706 225304 -250386 -291532 -73675 -94093 183289 -254939 -196224 132774
18416b01614i3587K9134A62354a20745r9539j975O2734j67011C01113k2786P1993
$$ -201614 -93587 -64453 162354 -120745 -220284 -222259 -159525 -326536 301113 278327 350320
18405C50320b72586I2326N7080m4918a9909n0988j01714B89794j39928g4382D8516
$$ 350320 -272586 92326 149406 104488 -19909 -70897 -172611 289794 149866 -74382 48516
18393b70271B18503e939A12031d12227f9870A71890a5410j22657A622e7431k0493
$$ -270271 218503 -5939 112031 -412227 -69870 171890 -15410 -138067 1622 -57431 -77924
18382g7924G9678b36044B42912A14091A6933M8160a0743k82982A31227a14956
$$ -77924 79678 -236044 242912 114091 16933 65093 -10743 -293725 131227 -114956
18371d02379B44624E1087c3737j61551B2041c798D3064b3341k62220c8923C37736
$$ -402379 244624 51087 -33737 -195288 22041 -3798 43064 -23341 -285561 -38923 337736
18359a77804A13303b30320A0892K7537F755a3855C90102d7501j02753n9406P6498
$$ -177804 113303 -230320 10892 38429 6755 -13855 390102 -47501 -150254 -209660 -133162
18348a33162l5126l2202C6858a44291c6105m04714B03094g9108C6377J24727h2971
$$ -133162 -168288 -200490 36858 -144291 -36105 -440819 203094 -79108 36377 161104 -82971
18336A39858i5779m0668f7369r298A47442F7542g0183G6427L7809b36632D02899
$$ 139858 -95779 -136447 -67369 -76667 147442 67542 -70183 76427 114236 -236632 402899
18324B151J13132a8017E1000e3503C2255c2463k9903j92144C4940b18042n7115
$$ 2151 115283 -18017 51000 -53503 32255 -32463 -62366 -254510 34940 -218042 -275157
18313b75157F5388J6447a75492O4558k96574B73362B2122b46371b4053A25410
$$ -275157 65388 81835 -175492 -110934 -407508 273362 22122 -246371 -24053 125410
18302A18552a47005A43825c44780i0149J7819j9154j12261m4311j11175a28928
$$ 118552 -147005 143825 -344780 -90149 -72330 -91484 -203745 -248056 -359231 -128928
18291a38104A1326c34439a10295A4050a77739b2600j11512j31590e4720H8243
$$ -138104 11326 -334439 -110295 14050 -177739 -22600 -134112 -265702 -54720 88243
18280B66855c08431I8753J2998a55009A80140a41341k8228A0270a84933C2244
$$ 266855 -308431 98753 111751 -155009 180140 -141341 -169569 10270 -184933 32244
18269E1402h7603H0360c3011j20164N5603k40104e5972k04918b6058k3686I4944
$$ 51402 -87603 80360 -33011 -153175 -97572 -337676 -55972 -260890 -26058 -49744 94944
18257e7402F9048a25985B8689J11608o0139K0353B0128c307A65486a07592o7901
$$ -57402 69048 -125985 28689 140297 80158 100511 20128 -3307 165486 -107592 -175493
18246a75493C06648b24529Q2555j70245A74673m0976b42701b9005H6042B0357
$$ -175493 306648 -224529 -141974 -312219 174673 133697 -242701 -29005 86042 20357
18235B27145F0851h0710j59676f4514A30469b1511k01667c3381A69529b70569
$$ 227145 60851 -80710 -240386 -64514 130469 -21511 -223178 -33381 169529 -270569
18224A78235j8629F6734Q0858a1242j00054e0784H344P3477i9781A09833i8953
$$ 178235 159606 66734 147592 -11242 -111296 -50784 8344 81821 -99781 109833 -98953
18212b90990C42173E9039b88470d7441j09132k0657f3270E3574K6250a93955a9073
$$ -290990 342173 59039 -288470 -47441 -156573 -177230 -63270 53574 79824 -193955 -19073
18200B0205a89798L1196o4208A97215m8931g0041C00306l5083b53484B48717i944
$$ 20205 -189798 -158602 -222810 197215 148284 -70041 300306 265223 -253484 248717 -9944
18188H0387k4468a43619f9607k08721a22231E30963b11945g0142A095L5546b51457
$$ 80387 55919 -143619 -69607 -278328 -122231 530963 -211945 -70142 1095 36641 -251457
18176A11322a32864L6678A78887f2477c237k39889B80654a1726D7834j2924R5369
$$ 111322 -132864 -96186 178887 -62477 -3237 -243126 280654 -11726 47834 34910 130279
18165A30279G410b62193A75512K02836C8766J51080B2592O0553e7420l16580A00448
$$ 130279 7410 -262193 175512 378348 38766 189846 22592 83145 -57420 -374000 100448
18153d12575B4693a35425A14527m3510b03596A46235M7285G9100B6056K5480J18417
$$ -412575 24693 -135425 114527 71017 -203596 146235 193520 79100 26056 51536 169953
18142A69953c12758C3955a31391C40558A34963f3120p4928A63443a68870L3432
$$ 169953 -312758 33955 -131391 340558 134963 -63120 -138048 163443 -168870 -135438
18132a35438k20775a58926C69725q6838a10380L5573H5351i9126j72521h8366
$$ -135438 -356213 -158926 369725 282887 -110380 -74807 85351 -99126 -271647 -88366
18121b6123j16735A54195o922J55285b2001C0133b52445q5793R2531G4797C0356
$$ -26123 -142858 154195 147273 302558 -22001 30133 -252445 -338238 -245707 74797 30356
18109e05912f7100F1945f7537j860B93356H0157b39892D4055d6872k04016A59754
$$ -505912 -67100 61945 -67537 -69397 293356 80157 -239892 44055 -46872 -250888 159754
18097a53908G3239P6313C9727d8564r3546L3459A08845B6132L13252c03001J15824
$$ -153908 73239 149552 39727 -48564 -142110 -108651 108845 26132 339384 -303001 -187177
18086a87177B339i0836A55106b00803R8781j48913N8544C6573c2685A93003B497
$$ -187177 2339 -90836 155106 -200803 -102022 -250935 -192391 36573 -32685 193003 2497
18074D4914f6554k7653j59366b2616B7145P7682a07110B87655d6402r5295j41110
$$ 44914 -66554 -94207 -253573 -22616 27145 104827 -107110 287655 -46402 -141697 -282807
18063b82807g3834q6809c090m12284A29816b99074A10345R7811a55882A15878
$$ -282807 -73834 -160643 -3090 -415374 129816 -299074 110345 208156 -155882 115878
18052h0128I8909d74182a95022G0553k4354J49500k5526m2553c0494G0751C143
$$ -80128 98909 -474182 -195022 70553 46199 195699 170173 127620 -30494 70751 3143
18040A83355H7986a04581c7528A00819a42798A34903G661O148L16496d70600A38057
$$ 183355 87986 -104581 -37528 100819 -142798 134903 7661 13809 330305 -470600 138057
18028d7102A12287h5971I5062K76601a11125R306j9616A60943a77724M4945G0461
$$ -47102 112287 -85971 95062 371663 -111125 -101819 -121435 160943 -177724 -132779 70461
18016B45630i3479i727j92108J4277F8439J94631e2356B30516P1813G5384B1725
$$ 245630 -93479 -9727 -201835 -187558 68439 263070 -52356 230516 302329 75384 21725
18004A9920h1533m5963B15072h8256A18345i8496j61112f7178A18075D3299a51898
$$ 19920 -81533 -127496 215072 -88256 118345 -98496 -259608 -67178 118075 43299 -151898
17992i7188j27747A23560h2735G5020h5806b7439B22096G0440K2252a61646e0106
$$ -97188 -224935 123560 -82735 75020 -85806 -27439 222096 70440 92692 -161646 -50106
17980A80400D2901Q6900j8497k5076J2794a76647B1252f8362j09350B6326e6554
$$ 180400 42901 129801 111304 86228 99022 -176647 21252 -68362 -177712 26326 -56554
17968B14987A1263N1852g8992E9537a13219m94638A02262g6728c0309I6185m426
$$ 214987 11263 63115 -78992 59537 -113219 -607857 102262 -76728 -30309 96185 91759
17957I1759k7333j6927J6895e2712A32796b15650f5904l9701A9674a82129N2530
$$ 91759 64426 47499 64394 -52712 132796 -215650 -65904 -105605 19674 -182129 -129599
17946a29599j35770k6653J9129A36572b68081F0449J15738d3928B68877a47698
$$ -129599 -265369 -292022 -272893 136572 -268081 60449 176187 -43928 268877 -147698
17935A86740F3603b28132A6022b35427f156A39296B3400j0293b1711D6140o760
$$ 186740 63603 -228132 16022 -235427 -6156 139296 23400 13107 -21711 46140 39380
17924C9380a24466b2334j14658J9522j7354A61352B4677K90343g894B05709f490
$$ 39380 -124466 -22334 -136992 -117470 -134824 161352 24677 315020 -7894 205709 -6490
17912e9994A26169m9066c93247J31281a30279A54270N105J95495B2764f0754q2098
$$ -59994 126169 77103 -393247 -261966 -130279 154270 159375 354870 22764 -60754 -142852
17901a42852j86420A16739i1057I7715D5015J22621J41595c78099C48687b67553
$$ -142852 -329272 116739 -91057 97715 45015 167636 309231 -378099 348687 -267553
17890A52402A5667d6394A73499g8959A46490d78733B8986O0979m894J98975j41274
$$ 152402 15667 -46394 173499 -78959 146490 -478733 28986 89965 85071 284046 142772
17879A42772a49220k50111a40992A66494h0210a1877E08507a41113F3152P5607
$$ 142772 -149220 -399331 -140992 166494 -80210 -11877 508507 -141113 63152 138759
17869A38759C9873a48985D3093a67147A43325a42072A04916b6259H9225i1827
$$ 138759 39873 -148985 43093 -167147 143325 -142072 104916 -26259 89225 -91827
17858A40103l0391q911h7203C34555a68245A73910a37565B03288d5212A96372
$$ 140103 109712 100801 -87203 334555 -168245 173910 -137565 203288 -45212 196372
17847A06825c19712A1197n034J1204a9222H6976R9660b65379K3198C76009j77793
$$ 106825 -319712 11197 6163 17367 -19222 86976 186636 -265379 -242181 376009 198216
17836A98216d9031m6383r035A88600a0955J53M583A60095J33351h3144k60644
$$ 198216 -49031 -95414 -104449 188600 -10955 -10802 -6219 160095 293446 -83144 -343788
17825c43788B6622K23170H200O0700J15567E5305a66441I2802O1671b8189k5896
$$ -343788 26622 249792 8200 68900 184467 55305 -166441 92802 154473 -28189 -54085
17814e4085A95676h4297B33491a63448E753J4976c2942B3351a01051B93341g4721
$$ -54085 195676 -84297 233491 -163448 5753 20729 -32942 23351 -101051 293341 -74721
17802A37047b54181A75618c1614A29846c8459A00774i6560o1417d9968j39276
$$ 137047 -254181 175618 -31614 129846 -38459 100774 -96560 -157977 -49968 -189244
17792a89244E2230j9871L30777A73970k9372l2761B7923A2885d03481E5057L14944
$$ -189244 52230 32359 363136 173970 144598 111837 27923 12885 -403481 55057 370001
17781C70001a28598J1144D8738J96788a27763b627C11364j3614h6030A46395k7206
$$ 370001 -128598 -117454 48738 245526 -127763 -2627 311364 297750 -86030 146395 119189
17770A19189d458H3304a15167n2104P1907D21317A59362l251o5206b1913C8482
$$ 119189 -4458 83304 -115167 -167271 -95364 421317 159362 156111 90905 -21913 38482
17758I3477J07757N5038m5280B1970a3841B31639n0139a10853G6584e7900B27025
$$ 93477 201234 256272 210992 21970 -13841 231639 181500 -110853 76584 -57900 227025
17746A65048F0417c64079J38845A87914m6528b19143D6326J7O6274f4020C43457
$$ 165048 60417 -364079 -225234 187914 141386 -219143 46326 46343 112617 -64020 343457
17734C1092a29184A78034C1485N5175J06474K1284a37941F9155J44199q1031k1125
$$ 31092 -129184 178034 31485 86660 193134 214418 -137941 69155 213354 132323 111198
17723A11198J61586C2723K15689k1001a17634F7102J38196d6547D3504j4691a41086
$$ 111198 272784 32723 248412 227411 -117634 67102 205298 -46547 43504 28813 -141086
17711B2470Q786K54951A01354Q9192I1138q310b33303A61888M4979g733B05004
$$ 22470 31256 286207 101354 190546 91138 82828 -233303 161888 206867 -7733 205004
17699B31413B0427e4168F7130j0039j0094J56583l2059r744k8169K0705k6010
$$ 231413 20427 -54168 67130 57091 46997 203580 171521 161777 133608 154313 128303
17688A28303e7922D46169A59063a0487F1923P7594D1100R1280M8410L1621j888
$$ 128303 -57922 446169 159063 -10487 61923 139517 41100 132380 180790 212411 210523
17677B10523M2912E7123b93294G3185L7805L1162f8082J1899A14631L1368J87935
$$ 210523 253435 57123 -293294 73185 110990 142152 -68082 -56183 114631 145999 333934
17666C33934p6214p4175c1150m4910A68946L2600K08039B4071b11065C45612j04105
$$ 333934 257720 183545 -31150 -76060 168946 201546 409585 24071 -211065 345612 241507
17655B41507r8870b31205I7907l2152J94644f2113B2923J8453J69619a06482B96784
$$ 241507 142637 -231205 97907 65755 260399 -62113 22923 41376 210995 -106482 296784
17643A87941b18699B44649e279B88445a64138G2920l142N4836L429J67342m1222
$$ 187941 -218699 244649 -5279 288445 -164138 72920 69778 124614 128043 295385 254163
17632B54163a07206C3784K26518P4301F3845K23002j36127M7620K94054j94978
$$ 254163 -107206 33784 260302 334603 63845 286847 150720 198340 492394 297416
17622B97416A30461L3801a6927I0746N3124N5891M6772a2167B08117A0212K36973
$$ 297416 130461 164262 -16927 90746 143870 199761 246533 -12167 208117 10212 247185
17611B47185c5710j96330E129L56268A21600D6495R9934n2540L5659J99244R2275
$$ 247185 -35710 -232040 5129 361397 121600 46495 146429 93889 129548 328792 421067
17600D21067A06827c0066C14143j13835J90562C9525Q7588a6502C32082H4707
$$ 421067 106827 -30066 314143 200308 390870 39525 127113 -16502 332082 84707
17589A37103M1225A6576K38479K29799A92783G2435K4612c661I0061a15083B04040
$$ 137103 178328 16576 255055 484854 192783 72435 97047 -3661 90061 -115083 204040
17577A62919a37446m5270g42A90626R2767g268k49497C6582e4485j6690A02366
$$ 162919 -137446 -182716 -742 190626 283393 -7268 -256765 36582 -54485 -71175 102366
17565F1061J85320J35329n3827p1591d5208j19294B05365J11335q8560g8468D75971
$$ 61061 246381 381710 327883 256292 -45208 -164502 205365 316700 228140 -78468 475971
17553A28006K20991j45407J69476A9228N777L07741H2897A2998K64183p5185k3278
$$ 128006 348997 203590 373066 19228 25005 332746 82897 12998 277181 201996 178718
17542A78718N15219C29912k696J9980E7312K13032J2206j40289N12801a2478E35595
$$ 178718 693937 329912 327216 347196 57312 270344 282550 142261 655062 -12478 535595
17530B79194K88537k11114j62027K64112K32545K29336K16667j59303L73115o29798
$$ 279194 567731 356617 194590 458702 691247 920583 1137250 977947 1351062 721264
17520G21264j46734k49598L8206j00259J57815j56423J86847K64269j50967O3674
$$ 721264 574530 324932 363138 262879 420694 264271 451118 715387 564420 628094
17510F28094K12584J85038K85149p5108l61627j50587L558j88775q1650B21443
$$ 628094 840678 1025716 1310865 1235757 874130 723543 727101 538326 456676 221443
17499B08095L2199N4322N9946j45275K34462M0690k08641J6208K39415B46513
$$ 208095 240294 294616 354562 209287 443749 484439 275798 292006 531421 246513
17488G59349B11944k0831p9142J11156K86398k21544J29588A04123L11274J92142
$$ 759349 211944 191113 111971 223127 509525 287981 417569 104123 415397 607539
17478F07539j45995A07409J4892K92345j09449K32382j33347A68638J77052j4976
$$ 607539 461544 107409 122301 414646 305197 537579 404232 168638 345690 330714
17468C30714r8688R0209J79291k50519K53j02692N2993J10403R5446A37221J842
$$ 330714 232026 322235 501526 251007 251260 148568 201561 311964 407410 137221 139063
17457A39063K69603J55902B7625l240M96460A91868p5737K14635j18468J48168
$$ 139063 408666 564568 27625 24385 520845 191868 116131 330766 212298 360466
17447C60466n864N0225k6578K6921D7453L28931O7784M5363K08948B69390A24447
$$ 360466 354602 404827 378249 405170 47453 376384 444168 489531 698479 269390 124447
17435A23759K93652J5140A71544C5471a77737B87399n8128J7178l329L1026r6418
$$ 123759 417411 432551 171544 35471 -177737 287399 229271 246449 243120 274146 177728
17424A77728Q9351Q5443n3103L45728R2837l53097J86560B59969j3762J38311
$$ 177728 267079 352522 299419 645147 737984 384887 571447 259969 246207 384518
17414C84518A41683O48048B02705K81480I1853k584J00106J49800j57292R7499
$$ 384518 141683 789731 202705 484185 91853 89269 189375 339175 181883 279382
17404B79382r3164P808l7522K08571j4096L3563A09382L33161J4874A28377k4876
$$ 279382 186218 194026 156504 365075 350979 384542 109382 442543 457417 128377 103501
17393A03501M19801A87772H4179M14306j54405C9595J55714o7474K09713J60230
$$ 103501 523302 187772 84179 498485 344080 39595 195309 127835 337548 497778
17383D97778k409m2047C195K91662H7363J21516K05952j21972J24727N4544J93871
$$ 497778 495369 453322 3195 294857 87363 208879 414831 292859 417586 472130 666001
17372F66001I7242F236J87744k070Q0535G8775J54837j01636J17925K51093H0352
$$ 666001 97242 6236 193980 191910 272445 78775 233612 131976 249901 500994 80352
17360B50616a41536C99549A90422j9792Q9060j3880K25394k03896J51983A90051
$$ 250616 -141536 399549 190422 170630 259690 245810 471204 267308 419291 190051
17349B82960O880F8092E875K23832a92588B60202E5539N53955A87627r0548b2327
$$ 282960 289840 68092 5875 229707 -192588 260202 55539 609494 187627 97079 -22327
17337A53627m0697L30910k16685J19466A61734a1293D69384A75793P6282K92684
$$ 153627 112930 443840 227155 346621 161734 -11293 469384 175793 252075 544759
17327E44759A94256c623m2202F1564K26343R3997J1534D3803J74002O46647A78772
$$ 544759 194256 -3623 -45825 61564 287907 381904 393438 43803 217805 864452 178772
17315B91415q35B3783J88429N567J40614K13809j87733q1911M5772J971J39527
$$ 291415 290580 23783 212212 217779 358393 572202 384469 302558 348330 350301 489828
17304D89828j25280j12966P5760j07303j6672J75970o0527j29750J2059k3650
$$ 489828 364548 251582 327342 220039 203367 379337 318810 189060 201119 177469
17294A77469q4275J33543K5154J15672j71193I6029K75172j49651l3087L3430
$$ 177469 93194 226737 251891 367563 196370 96029 371201 221550 188463 221893
17284B21893N6849m9204N8993l2979H0221l4578J75369P6640p1953p432j8884
$$ 221893 278742 229538 288531 255552 80221 45643 221012 297652 225699 218267 199383
17273A99383m2667d3572a101B21229n2356o881L8235q6018J90796q3330M8789
$$ 199383 156716 -43572 -1101 221229 168873 161992 200227 114209 305005 221675 270464
17262B70464O1230n1520A08554J38498K4655K83544F0049M27103k10761C5591
$$ 270464 331694 280174 108554 247052 271707 555251 60049 487152 276391 35591
17251C28879k6191A35776K87481K6928m8977m1352j71389o3518K25247M5118C6745
$$ 328879 302688 135776 423257 450185 401208 359856 188467 124949 350196 395314 36745
17239B20589k7067J60209J89308k54149o6914A07607O63388C17871A29754L32136
$$ 220589 193522 353731 543039 288890 221976 107607 770995 317871 129754 461890
17229D61890A25167M52903k7746R6010H3863O15942j98455a08155D44526J61363
$$ 461890 125167 578070 550324 646334 83863 699805 501350 -108155 444526 605889
17219F05889D4638L94335A47513L52167A14596m0597J60792L03724k33651l7052
$$ 605889 44638 438973 147513 499680 114596 73999 234791 538515 304864 267812
17209B67812K33425p2774B02706J00592M92792k95921j48267K8937K78250B94587
$$ 267812 501237 428463 202706 303298 796090 500169 351902 380839 659089 294587
17198E21050J07503j20887r5694k9712N8057K04372q1764r3125j63855l1745J65075
$$ 521050 628553 507666 411972 382260 440317 644689 562925 469800 305945 274200 439275
17187D39275J69326j34908O816L4395N8590k17033L29630l34581K51958j10886
$$ 439275 608601 473693 480509 514904 573494 356461 686091 351510 603468 492582
17177D92582K16971q5535j48285k04053M1039L08294C01390J3051N26509k56283
$$ 492582 709553 624018 475733 271680 312719 621013 301390 314441 840950 584667
17167E84667j88156A41657L71820J31261A65436L05341C8570M12391k05060K60596
$$ 584667 396511 141657 513477 644738 165436 470777 38570 450961 245901 506497
17157E06497k09652P0013J0038M6927o9107M5246K0714N9871K68335k33794k07307
$$ 506497 296845 366858 376896 423823 354716 399962 420676 480547 748882 515088 307781
17146C07781J09364J20227J75201J410k77631P29K26899k49972L11775k69426
$$ 307781 417145 537372 712573 713983 436352 437081 663980 414008 725783 456357
17136D56357Q0905L3648r2778J04492k2167L305k2061j92603l1139K06304K34132
$$ 456357 537262 570910 478132 582624 560457 563762 541701 349098 317959 524263 758395
17125G58395k22986K88989j31740j87276Q3373R5516q6526J61327j98949p4557
$$ 758395 535409 824398 692658 505382 588755 684271 597745 759072 560123 485566
17115D85566j91798L43336M7286J8294l19226K74192j24511M5441N7659k273l1162
$$ 485566 293768 637104 684390 702684 383458 657650 533139 578580 636239 633966 602804
17104F02804K30344k06214Q8070O6648o5926p4088r2195K15160j40794K45409
$$ 602804 833148 626934 715004 781652 715726 641638 549443 764603 623809 869218
17094H69218l53387j18332J30055O2217q1262q1744P9239M68087j96232k29492
$$ 869218 515831 397499 527554 589771 508509 426765 506004 974091 777859 548367
17084E48367J09242k7980K86919k35373n8370m7329J62004R6640l18740K86155
$$ 548367 657609 629629 916548 681175 622805 575476 737480 834120 515380 801535
17074H01535J05210k49770m3695J44338M38561k96219l29447M70328l92399J42436
$$ 801535 906745 656975 613280 757618 1196179 899960 570513 1040841 648442 790878
17064G90878n0421j98560P0727L6579J57160j37954N04856n40081L54086k88836
$$ 790878 740457 541897 612624 649203 806363 668409 1173265 633184 987270 698434
17054F98434M59048j70541j90729j17125M5851Q7903l61767M57411J68446k56127
$$ 698434 1157482 986941 796212 679087 724938 812841 451074 908485 1076931 820804
17044H20804l1359M99534j01035l90629K27380J39879K0559E32157N55131J09556
$$ 820804 789445 1288979 1187944 797315 1024695 1164574 1185133 532157 1087288 1196844
17034A196844j92134j51277K8927N8260m3114L5044P04894m26352k08499j4048
$$ 1196844 1004710 853433 882360 940620 897506 932550 1637444 1211092 1002593 988545
17024I88545j08616L28546k91820K69716j31966N7253k55577L16658o4429J60608
$$ 988545 879929 1208475 916655 1186371 1054405 1111658 856081 1172739 1108310 1268918
17014A268918n8746k54452k1710K76964k62341L29859l98373M25739J4161k04506
$$ 1268918 1210172 955720 934010 1210974 948633 1278492 880119 1305858 1320019 1115513
17004A115513K29454j67001L15952l17098K4380J37135j99158J51606k0791Q7760
$$ 1115513 1344967 1177966 1493918 1176820 1201200 1338335 1139177 1290783 1269992 1357752
16994A357752j45302J96202M57j65094p4384J17124k9890K25899j09922l57101
$$ 1357752 1212450 1408652 1409109 1244015 1169631 1286755 1256865 1482764 1372842 1015741
16984A015741L16776n3757K77758j41804l14419m9761K07417K86413N6396k58174
$$ 1015741 1332517 1278760 1556518 1414714 1100295 1050534 1257951 1544364 1600760 1342586
16974A342586J1352L46287j85618n2526K8138M2852l307r9865k8884r7913J99542
$$ 1342586 1353938 1700225 1514607 1462081 1490219 1533071 1529764 1429899 1401015 1303102 1502644
16963A502644P1491k20418K06562j7061r7790J32424j17655J53680r0396j63020
$$ 1502644 1574135 1353717 1560279 1543218 1445428 1577852 1460197 1613877 1523481 1360461
16953A360461O57363k92621k00538J51801M2203j25048l09564K66103J15751N8996
$$ 1360461 2017824 1725203 1524665 1676466 1718669 1593621 1284057 1550160 1665911 1724907
16943A724907P33p5803K7444J31336J1305J69818k02029K24997k653L05581j62136
$$ 1724907 1725640 1649837 1677281 1808617 1819922 1989740 1787711 2012708 2010055 2315636 2153500
16932B153500k64148j14049K77208o1290L15102K13578j71717j80535J49876k37631
$$ 2153500 1889352 1775303 2052511 1991221 2306323 2519901 2348184 2167649 2317525 2079894
16922B079894N2778K14700J13819k71173M8839J0789K2368Q2813J98686j67625
$$ 2079894 2132672 2347372 2461191 2190018 2238857 2249646 2272014 2354827 2553513 2385888
16912B385888J84732k40273j60987K83008K80357R0311r4260L49k51234M58759
$$ 2385888 2570620 2330347 2169360 2452368 2732725 2823036 2728776 2729125 2477891 2936650
16902B936650j99034J0544J44654k4479J00710p4618l91094O46719m50146L81197
$$ 2936650 2737616 2748160 2892814 2868335 2969045 2894427 2503333 3150052 2699906 3081103
16892C081103L4383l5565j58421K38396L73987m11964M5213K36763P2831J02495
$$ 3081103 3115486 3079921 2921500 3159896 3533883 3121919 3167132 3403895 3476726 3579221
16882C579221j90211Q9422K5487j32148k4846L39380K50204l16499J03660m2624
$$ 3579221 3389010 3478432 3503919 3371771 3346925 3686305 3936509 3620010 3723670 3681046
16872C681046L06061l96034M84962J98064j41332n3278K75292k16554J93456q6096
$$ 3681046 3987107 3591073 4076035 4274099 4132767 4079489 4354781 4138227 4331683 4245587
16862D245587L85183k34530J01304l62090L15651K89109J08438M0428K94420k34839
$$ 4245587 4630770 4396240 4497544 4135454 4451105 4740214 4848652 4889080 5183500 4948661
16852D948661K31996j66867L32141L6755N0176p1508l3823j3782N44418j76319
$$ 4948661 5180657 5013790 5345931 5382686 5432862 5361354 5327531 5313749 5858167 5681848
16842E681848K29606o4937K76656M19123q7223J23743N08683n60181J67124q3169
$$ 5681848 5911454 5846517 6123173 6542296 6455073 6578816 7087499 6527318 6694442 6611273
16832F611273L07786j05736N17232k46422N61262M2128N7471J7296K99564N6821
$$ 6611273 6919059 6813323 7330555 7084133 7645395 7687523 7744994 7762290 8061854 8118675
16822H118675p1909K82582L35118K18875J389L91293J58633J12302N16108j53615
$$ 8118675 8046766 8329348 8664466 8883341 8884730 9276023 9434656 9546958 10063066 9909451
16812I909451K285J62625M84019k00441M38479L57893p7321K69657K93903L09052
$$ 9909451 9911736 10074361 10558380 10357939 10796418 11154311 11076990 11346647 11640550 11949602
16802A1949602N48240M2107L5076O64753j19670L95343P29581O6532N01479J67375
$$ 11949602 12497842 12539949 12575025 13239778 13120108 13515451 14245032 14311564 14813043 14980418
16792A4980418J16573N02572P21411M00685K44427M18488K05142O22255N02993
$$ 14980418 15096991 15599563 16320974 16721659 16966086 17384574 17589716 18211971 18714964
16783A8714964N27471N85404L96487O51067N98448N44698N88696P20131Q85938
$$ 18714964 19242435 19827839 20224326 20875393 21473841 22018539 22607235 23327366 24213304
16774B4213304K53880P70521J029559L85757J056847P16839P90269J389868N81649
$$ 24213304 24467184 25237705 26267264 26653021 27709868 28426707 29216976 30606844 31188493
16765C1188493R71722P15073J256505J258050R41447J348188J358040J510404
$$ 31188493 32160215 32875288 34131793 35389843 36331290 37679478 39037518 40547922
16757D0547922J099174J633532J569965J194020J908862J820463J426335K032398
$$ 40547922 41647096 43280628 44850593 46044613 47953475 49773938 51200273 53232671
16749E3232671J846936K178086J771890K169265K459293J900574K555927K235900
$$ 53232671 55079607 57257693 59029583 61198848 63658141 65558715 68114642 70350542
16741G0350542K346215K769136K907516K455217K602122K689253K888140K318935
$$ 70350542 72696757 75465893 78373409 80828626 83430748 86120001 89008141 91327076
16733I1327076L023422K427540K958996K235897K250558K377589K405284J658291
$$ 91327076 94350498 96778038 99737034 101972931 104223489 106601078 109006362 110664653
16725A10664653J733310J593810J129967P74962R19503j6984N49912l14545p51223
$$ 110664653 112397963 113991773 115121740 115896702 116816205 116799221 117349133 117034588 116283365
16716A16283365o17900r90397j308028j858486j628189k076220j998700k376535
$$ 116283365 115665465 114675068 113367040 111508554 109880365 107804145 105805445 103428910
16708A03428910k832653k468128k287359l063221k519809l189956k299831l087649
$$ 103428910 100596257 98128129 95840770 92777549 90257740 87067784 84767953 81680304
16700H1680304k671087k533474k823377k438055k283583k760817j910465k702173
$$ 81680304 79009217 76475743 73652366 71214311 68930728 66169911 64259446 61557273
16692F1557273k403227j975032j854924k425446j819164j723647j647618j453916
$$ 61557273 59154046 57179014 55324090 52898644 51079480 49355833 47708215 46254299
16684D6254299j660345k008970j230722j323735j496933j348358j317869j013107
$$ 46254299 44593954 42584984 41354262 40030527 38533594 37185236 35867367 34854260
16676C4854260j290854r84637j071856j024426q78473j449615n12763p32372r03951
$$ 34854260 33563406 32578769 31506913 30482487 29604014 28154399 27641636 26909264 26005313
16667B6005313r97746p83931p76296l03124m51194r55645m59148q84589k36264
$$ 26005313 25007567 24223636 23447340 23144216 22693022 21737377 21278229 20393640 20157376
16658B0157376o93410o60715o51894j43009o17181n51997m96040j26929k95252
$$ 20157376 19463966 18803251 18151357 18008348 17391167 16839170 16343130 16216201 15920949
16649A5920949n26676m81562j72221j19694p47423m22749Q1828n98802l55731
$$ 15920949 15394273 14912711 14740490 14620796 13873373 13450624 13532452 12933650 12577919
16640A2577919k58751j51147l64028j29436j07018p34743p1998r4369k6820o67102
$$ 12577919 12319168 12168021 11803993 11674557 11567539 10832796 10760798 10666429 10639609 9972507
16630I972507k31054J35771l13921k63765m26318L449l2541k56953k20880j91601
$$ 9972507 9741453 9877224 9563303 9299538 8873220 8876669 8844128 8587175 8366295 8174694
16620H174694k4543j95714m0342m63092J35305j46448k83304q9882k5835p6731
$$ 8174694 8150151 7954437 7914095 7451003 7586308 7439860 7156556 7066674 7040839 6964108
16610F964108j83609l75235K80810l79693k78883J15250J13566l48925Q61j29792
$$ 6964108 6780499 6405264 6686074 6306381 6027498 6142748 6256314 5907389 5908250 5778458
16600E778458k6476l14618R71R3203o4865p036k88821j05911P6535M40119m11209
$$ 5778458 5751982 5437364 5438335 5531538 5466673 5459637 5170816 5064905 5141440 5581559 5170350
16589E170350j61630k20588J513l84801L84431l200j08318l03403o9541n4191
$$ 5170350 5008720 4788132 4789645 4404844 4789275 4786075 4677757 4374354 4304813 4250622
16579D250622J56214l41343R8466j32221j14271R4907J12259k16877p4879j59911
$$ 4250622 4406836 4065493 4163959 4031738 3917467 4012374 4124633 3907756 3832877 3672966
16569C672966k45099M39127m48749L003K44089m77777L37014j40082j63138J05649
$$ 3672966 3427867 3866994 3418245 3421248 3665337 3187560 3524574 3384492 3221354 3327003
16559C327003j38433o2046J05431m9420K9789k35251J63006k82311j09536j48144
$$ 3327003 3188570 3126524 3231955 3182535 3212324 2977073 3140079 2857768 2748232 2600088
16549B600088K97934j05892k19018O8888r0275J51823J90520k56861j01660N2608
$$ 2600088 2898022 2792130 2573112 2642000 2551725 2703548 2894068 2637207 2535547 2588155
16539B588155j13321J17308J34865m20433M04508o6141o19214M10992N5955m7563
$$ 2588155 2474834 2592142 2727007 2306574 2711082 2644941 2025727 2436719 2492674 2445111
16529B445111j18652N450K4037l44107M42420k31549j74263K61717l93389J22000
$$ 2445111 2326459 2331909 2355946 2011839 2454259 2222710 2048447 2310164 1916775 2038775
16519B038775r6388o4738K496q4868K14912q1375J39878N87p0561r3837j06788
$$ 2038775 1942387 1877649 1880145 1795277 2010189 1928814 2068692 2069279 1998718 1904881 1798093
16508A798093J16292q6201k41380K32999q7177j8340p5292K84928l35006n1096
$$ 1798093 1914385 1828184 1586804 1819803 1732626 1714286 1638994 1923922 1588916 1537820
16498A537820K64600k53355N49396k62056j30715L12322m03828Q813L9626J7775
$$ 1537820 1802420 1549065 2098461 1836405 1705690 2018012 1614184 1622997 1662623 1680398
16488A680398j81919k98026K20505j94694J69601K95214l0060m54963L07334j42028
$$ 1680398 1498479 1200453 1420958 1226264 1395865 1691079 1661019 1206056 1513390 1371362
16478A371362O8904o72m81781J15023M69190j2590l5745l28291O08374n19256
$$ 1371362 1440266 1439594 957813 1072836 1542026 1529436 1493691 1165400 1773774 1254518
16468A254518Q7071j17027K26568J29144k31245o6761j1275K58319l97666r2523
$$ 1254518 1341589 1224562 1451130 1580274 1349029 1282268 1270993 1529312 1131646 1039123
16458A039123J78956K14392k16815k91759L06058j12606p00P5789P2332j16495
$$ 1039123 1218079 1432471 1215656 923897 1229955 1117349 1116649 1192438 1264770 1148275
16448A148275j30121o4366L56601k66675K28905M2302j85953R5313M0297k49590
$$ 1148275 1018154 953788 1310389 1043714 1272619 1314921 1128968 1224281 1264578 1014988
16438A014988K29073j53120p6455L75380m31805K24345k36720q0024J78229j25874
$$ 1014988 1244061 1090941 1014486 1389866 958061 1182406 945686 865662 1043891 918017
16428I18017K64480j67993J81424m37510K43840P5049k34626J20788q4824P1578
$$ 918017 1182497 1014504 1195928 758418 1002258 1077307 842681 963469 878645 950223
16418I50223M66990m27706j85548K33717q8131j3087j39357M3140K5067N4482
$$ 950223 1417213 989507 803959 1037676 949545 936458 797101 840241 865308 919790
16408I19790M1420q4928k28768L36127j06522k2896J20316k07890M1365p1281
$$ 919790 961210 876282 647514 983641 877119 854223 974539 766649 808014 736733
16398G36733j95752L88738l62409N45742D77526L33352j54209K04727o5352k30968
$$ 736733 540981 929719 567310 1113052 477526 810878 656669 861396 796044 565076
16388E65076K83092m12467L76323j85364K50102l47780K17300j0952K56432k94824
$$ 565076 848168 435701 812024 626660 876762 528982 746282 735330 991762 696938
16378F96938M4573Q6939j9160j82132A79175L72386K26077j46949L20380k00568
$$ 696938 741511 828450 809290 627158 179175 551561 777638 630689 951069 750501
16368G50501l9657C09388K47902K61257J26972k27748j51017o897q7615K31592
$$ 750501 710844 309388 557290 818547 945519 717771 566754 559857 472242 703834
16358G03834q7569j283K30060C05653O17886j50240r4941j59758K10559r4838
$$ 703834 616265 614982 845042 305653 923539 773299 678358 518600 729159 634321
16348F34321M38698l84384j01342k32777L97702M02544n61013J3769K62439k89067
$$ 634321 1073019 688635 587293 354516 752218 1154762 593749 607518 869957 580890
16338E80890O3916p4951M1721n1488R2684j09857R4273J01764M5418C55684J64446
$$ 580890 644806 569855 611576 560088 652772 542915 637188 738952 784370 355684 520130
16327E20130J15972p3460n9152P6997k11463J55744M05633A15766O18358n2441
$$ 520130 636102 562642 503490 580487 369024 524768 930401 115766 734124 681683
16317F81683k5868C12197P0042j48706j0833R0510K86556J7406B96857M72552
$$ 681683 655815 312197 382239 233533 222700 313210 599766 617172 296857 769409
16307G69409C35420M62466C77381j33707L06096j16303n8806R539A66398K44976
$$ 769409 335420 797886 377381 243674 549770 433467 374661 384200 166398 411374
16297D11374K14916k69500P2100M7993N9736j33547J0539j66240A08538J51379
$$ 411374 626290 356790 428890 476883 536619 403072 413611 247371 108538 259917
16287B59917K36047l5571j17672L9584J13057o123k44389K36791A66675L09612
$$ 259917 495964 460393 342721 382305 495362 489239 244850 481641 166675 476287
16277D76287n6466k05892N14080C08844K50110A55175O06684l08917A33041O19147
$$ 476287 419821 213929 728009 308844 558954 155175 761859 452942 133041 752188
16267G52188C52029j71159J35647J81297j62138L482j20949K19591J1779k9031
$$ 752188 352029 180870 316517 497814 335676 339158 218209 437800 449579 420548
16257D20548p9999A64425J82120N5267H56L98226Q6923j24382J00903R0836B39906
$$ 420548 340549 164425 346545 401812 856 399082 486005 361623 462526 553362 239906
16245D14111J13598b14645I2256M08446f6922C80996j63932r202J10845j34146
$$ 414111 527709 -214645 92256 500702 -66922 380996 217064 207862 318707 184561
16235A84561Q7540O8616p4592J09889j02626j10376K38460K10037a35444D22938
$$ 184561 272101 340717 266125 376014 273388 163012 401472 611509 -135444 422938
16224D93518m8734k07649J29367L4440p8791M3601j81250L53509j5611k34605
$$ 493518 444784 237135 366502 400942 322151 365752 184502 538011 522400 287795
16214B87795j16900K74499j97731J8893a07106K6377A99992M16752j54044j49162
$$ 287795 170895 445394 247663 266556 -107106 -80729 199992 616744 462700 313538
16204C13538J0708p7769j6589k750j01490J0039c5290A1754K33083Q03G4578K79820
$$ 313538 324246 246477 229888 227138 125648 135687 -35290 11754 244837 245640 74578 354398
16192C54398j0227N3001p0988j07238n8409Q4742K63039j82479K27066k60973
$$ 354398 344171 397172 326184 218946 160537 245279 508318 325839 552905 291932
16182B91932Q3015E308J50460J26930K20537A66714K8052O7808g4141A06333a95838
$$ 291932 374947 5308 155768 282698 503235 166714 194766 262574 -74141 106333 -195838
16170i84B0887O17L80622j51913K30552Q4714G7220j331e7080B25005L2344J52898
$$ -984 20887 21504 402126 250213 480765 565479 77220 75889 -57080 225005 257349 410247
16158D10247B01347k7033l426q296G7948R0921l5982J50768j28494g0486B23712
$$ 410247 201347 174314 170888 162592 77948 168869 132887 283655 155161 -70486 223712
16146G7902K67658n8593j07239p3532A3504a41972F48526B91076R29q6480m2172
$$ 77902 345560 286967 179728 106196 13504 -141972 648526 291076 292005 205525 163353
16135A63353K29301h0060B32674J2653F2892C299a3265q9046M099A09522J53355
$$ 163353 392654 -80060 232674 245327 62892 3299 -13265 -102311 -98212 109522 262877
16124B62877K526p0498n6305L8601a59254A84671a55956A68557m9499K05987A28019
$$ 262877 265403 194905 138600 177201 -159254 184671 -155956 168557 119058 325045 128019
16112C01208E689c1911B21033D1883K05653D5994h4024A88266h8446B61967j01051
$$ 301208 5689 -31911 221033 41883 247536 45994 -84024 188266 -88446 261967 160916
16101A60916R3879K2493j26016M7966h6640b5062A33317J22319J43581D5410a09751
$$ 160916 254795 277288 151272 199238 -86640 -25062 133317 255636 399217 45410 -109751
16089C37364j61950a35632d4259n883m2588A7872P971J94433H9297l5188B4958
$$ 337364 175414 -135632 -44259 -50142 -92730 17872 25843 220276 89297 54109 24958
16077A90835o4433M44964A34832J87999A45818O1642b5090o9107a3957I4273O233
$$ 190835 126402 571366 134832 322831 145818 207460 -25090 -94197 -13957 94273 100506
16066A00506J10122J1644J14074a52278f3300L590j8861C6966J5830N2809J12040
$$ 100506 210628 222272 336346 -152278 -63300 -59710 -78571 36966 52796 105605 217645
16055B17645b06285a6171B05951R591h1050E8982K37819j26467k7636a71278P3949
$$ 217645 -206285 -16171 205951 215542 -81050 58982 296801 170334 142698 -171278 -97329
16044i7329B37834n2005G9533J47620B0845K86169E7980J42220r3861a3789A17001
$$ -97329 237834 185829 79533 227153 20845 307014 57980 200200 106339 -13789 117001
16032b85388E1170c1850C4981K4675a42872A95829m3565b95748h8714m4338j02894
$$ -285388 51170 -31850 34981 59656 -142872 195829 152264 -295748 -88714 -133052 -235946
16021b35946c9642A04026c01360D55369F832a17907B93423A22594j0004g7924
$$ -235946 -39642 104026 -301360 455369 6832 -117907 293423 122594 112590 -77924
16010A12966D6764J19438b89945A14857B5427L6283B3561a9281A70436b89232
$$ 112966 46764 166202 -289945 114857 25427 61710 23561 -19281 170436 -289232
15999A84916J95379L2h4333j06632A09355D1341h6949K4305C91077O8904a99914
$$ 184916 380295 380327 -84333 -190965 109355 41341 -86949 -62644 391077 459981 -199914
15987B52757K76824J88810M94147J56451n9143k95287C94389K45808l2194B6888
$$ 252757 529581 718391 1212538 1368989 1309846 1014559 394389 640197 608003 26888
15976d1003C64738I5386K59019I4700d0992j08133j0877D1784j4122J04008b25349
$$ -41003 364738 95386 354405 94700 -40992 -149125 -160002 41784 27662 131670 -225349
15964B00248c5681C84561A51310f6612B7124L88422a9923j34286B1317M0192M579
$$ 200248 -35681 384561 151310 -66612 27124 415546 -19923 -154209 21317 61509 66088
15953F6088a46714B59976q4449b87480I1945i5I3928c21688A70822E6916c09105
$$ 66088 -146714 259976 175527 -287480 91945 -95 93928 -321688 170822 56916 -309105
15941A41369R758o1107d2309k5497B22625b68204F1905a25268L5354c8522A16038
$$ 141369 151127 90020 -42309 -67806 222625 -268204 61905 -125268 -89914 -38522 116038
15929A57384B3063a82768C43992f8511I1040K09081H3900a80255A49005d0450
$$ 157384 23063 -182768 343992 -68511 91040 300121 83900 -180255 149005 -40450
15918A49085c9958j70240D2931J08031j8751h4662B45054a0431p2853A81162b81304
$$ 149085 -39958 -210198 42931 150962 132211 -84662 245054 -10431 -83284 181162 -281304
15906b65073q232B58694B0524J84707E0954a46908l6575b1102m2518k31726c4493
$$ -265073 -273305 258694 20524 205231 50954 -146908 -183483 -21102 -63620 -295346 -34493
15894A65144a2410F9429d59904g7596G823a81078N259F0325k9513b27375B37334
$$ 165144 -12410 69429 -459904 -77596 7823 -181078 -175819 60325 30812 -227375 237334
15882a79459A61969a32817A69737e0868A1774Q9720i6027g786r804F2265f5583
$$ -179459 161969 -132817 169737 -50868 11774 101494 -96027 -7786 -17590 62265 -65583
15870A18942a39729B0412M6182J19318a174l09337J16268J0747H9990k1541L84786
$$ 118942 -139729 20412 66594 185912 -1174 -310511 -194243 -183496 89990 68449 453235
15859D53235A1133M1492A5544B637a32792B0717P930a83443a7842k022C4010c87205
$$ 453235 11133 52625 15544 2637 -132792 20717 28647 -183443 -17842 -19864 34010 -387205
15846C97035j74383D8275J74016a67577d1635m488a3179A33805L914J4658D7019
$$ 397035 222652 48275 222291 -167577 -41635 -46123 -13179 133805 137719 152377 47019
15834A78520b1694j43408L6685M2392q1154D15313a8040m8762D9046b28328L598
$$ 178520 -21694 -165102 -128417 -86025 -167179 415313 -18040 -66802 49046 -228328 -224730
15823b24730k920R3254j01201C430J26712P8565B524J7235b94481B68434G8572
$$ -224730 -227650 -134396 -235597 3430 130142 208707 2524 19759 -294481 268434 78572
15811a58760P917D2646a53448A47789k7449m6902P1401c4604A32712c53230i5745
$$ -158760 -150843 42646 -153448 147789 120340 73438 144839 -34604 132712 -353230 -95745
15799E22166A1613g9610B06871F8302c81843n1370D1447L3134a19396B9015g1936
$$ 522166 11613 -79610 206871 68302 -381843 -433213 41447 74581 -119396 29015 -71936
15787A64572b30090a5453C4401N862h471A3049J02986a50333F4228c04816L8427
$$ 164572 -230090 -15453 34401 40263 -8471 13049 116035 -150333 64228 -304816 -266389
15776b66389A96971i010B44500h9148j54941K256L6493B80342i966o3204p2436
$$ -266389 196971 -9010 244500 -89148 -244089 -241833 -205340 280342 -9966 -73170 -145606
15765a45606j2255B21107a41289M3008B4900O5297c32297e899C7791J8680J87452
$$ -145606 -157861 221107 -141289 -98281 24900 90197 -332297 -5899 37791 56471 243923
15754B43923J36366B7403a35627A84058B338d03455B78334a96556A90474F4535
$$ 243923 380289 27403 -135627 184058 2338 -403455 278334 -196556 190474 64535
15743b27474f3021B02790r5830J55186e4249A06275Q0155D0378L0223f6570l8548
$$ -227474 -63021 202790 106960 262146 -54249 106275 186430 40378 70601 -66570 -105118
15732a05118j03031C190M54473a53527A7191a05036A55271a12876B10188E2753
$$ -105118 -208149 3190 457663 -153527 17191 -105036 155271 -112876 210188 52753
15721D10316a73540k1793J3702B20976f0616J9495k24058f3344a4847q410J0335
$$ 410316 -173540 -195333 -181631 220976 -60616 -41121 -265179 -63344 -14847 -23257 -12922
15710a2922n1782N460l2466L2496A08806c06247h6853F3103L57d4871j02879C97809
$$ -12922 -64704 -59244 -91710 -59214 108806 -306247 -86853 63103 63460 -44871 -147750 397809
15697a13131A4388g8993O377p5801A83863C3935a97283B71588A00907J24280A03975
$$ -113131 14388 -78993 -72616 -148417 183863 33935 -197283 271588 100907 225187 103975
15685a20470I8243a80069E2354q192a29794b8898n8654B94503a25456j88619a07586
$$ -120470 98243 -180069 52354 44162 -129794 -28898 -87552 294503 -125456 -314075 -107586
15673E5761a46906A6234K33586a26181a318I6550g9968C08053a20457L5830c2610
$$ 55761 -146906 16234 249820 -126181 -1318 96550 -79968 308053 -120457 -84627 -32610
15661b9354J390B00876D7392a41670Q33o1052D0970i5798I9704N5911h0478J6672
$$ -29354 -27964 200876 47392 -141670 -140837 -201889 40970 -95798 99704 155615 -80478 -63806
15649f3806C1695i9663q0277h5932k53753A21875a664l53035f4747A3770J08106
$$ -63806 31695 -99663 -179940 -85932 -339685 121875 -1664 -354699 -64747 13770 121876
15638A21876a16283E96a80308A69987N0861a50000M2787j66858a13028k05314
$$ 121876 -116283 596 -180308 169987 220848 -150000 -107213 -274071 -113028 -318342
15628c18342B22654b63359A88482e99A61644D6563a79203I4546c12079a947j50327
$$ -318342 222654 -263359 188482 -599 161644 46563 -179203 94546 -312079 -1947 -152274
15617a52274D5072J74999d7643j26197F8817K9068l2766O4776J04935L0004j09498
$$ -152274 45072 220071 -47643 -173840 68817 97885 65119 129895 234830 264834 155336
15606A55336d3032J82A01128b3980B05672E8603k3446a37802d7667B20756A5568
$$ 155336 -43032 -42850 101128 -23980 205672 58603 35157 -137802 -47667 220756 15568
15594B19957e87256a70710l91081a13855o4937B229a10443A76112a76445O3526
$$ 219957 -587256 -170710 -561791 -113855 -178792 2229 -110443 176112 -176445 -112919
15584a12919A2878f4723j25777B6529J12841c63095a07132B18969b07100n626
$$ -112919 12878 -64723 -190500 26529 139370 -363095 -107132 218969 -207100 -212726
15574b12726J2024f9450C1064L3355a31762G8047d7588A12593d237A67754b7148
$$ -212726 -200702 -69450 31064 64419 -131762 78047 -47588 112593 -4237 167754 -27148
15562F496J09538a19618B95439D7477d20224i2771A00074e7420j4428n5348j1734
$$ 6496 116034 -119618 295439 47477 -420224 -92771 100074 -57420 -71848 -127196 -138930
15551a38930B71313A19478M3073a20549D65L1944J36952Q1299e0655l61284a94902
$$ -138930 271313 119478 162551 -120549 465 32409 169361 250660 -50655 -411939 -194902
15539b02566A09192J43874b69459A68255K56591c24989A58036J53511A18385J76254
$$ -202566 109192 253066 -269459 168255 424846 -324989 158036 311547 118385 294639
15529B94639b70726d0818J9384j18120D24925k2377D6154J3903Q3340L61621b2482
$$ 294639 -270726 -40818 -21434 -139554 424925 402548 46154 60057 143397 505018 -22482
15517B31943J36605E5122J96567j6084b02131c3125A40313i3197j42020G6319
$$ 231943 368548 55122 251689 235605 -202131 -33125 140313 -93197 -235217 76319
15506A24544J16032k7591F0956b7626A24712E5730M3804e719B21340n6226J50923
$$ 124544 240576 212985 60956 -27626 124712 55730 99534 -5719 221340 165114 316037
15495C16037J486I5841J86853j25500K9472o0033c2504l2729l5299b9945B58122
$$ 316037 317523 95841 282694 157194 186666 126633 -32504 -65233 -100532 -29945 258122
15483e0221A5267J821c3479B46104A08170J87978g5683F40738A52235N38854K0031
$$ -50221 15267 17088 -33479 246104 108170 296148 -75683 640738 152235 691089 711120
15472G11120C38558O10C2481K64005c14971H2861J91144m6136l2077J78864A73974
$$ 711120 338558 339168 32481 296486 -314971 82861 274005 227869 195792 374656 173974
15460H0336J08542a2771I2211C13K41510g0430K2843A25119b98C0230b8664A24864
$$ 80336 188878 -12771 92211 313 241823 -70430 -47587 125119 -298 30230 -28664 124864
15447A58004R2676E031P8492M89712p0314K20393O00332l1802m06964q6642A22616
$$ 158004 250680 5031 83523 573235 502921 723314 1323646 1291844 884880 798238 122616
15435C2827J92332C0979a1225C0136L20698i4204A34086L80742a35873K6753B64771
$$ 32827 225159 30979 -11225 30136 350834 -94204 134086 514828 -135873 -109120 264771
15423d9238C20565k5681i1689a4317A9414J40619b60650G8420a42586B71521e3512
$$ -49238 320565 294884 -91689 -14317 19414 160033 -260650 78420 -142586 271521 -53512
15411G5324a34600C17746a1198l8018h008B76379q7498a53129E2003c6874j85505
$$ 75324 -134600 317746 -11198 -49216 -8008 276379 188881 -153129 52003 -36874 -222379
15400b22379D05453a13935k4139L2788D2401J5862J54383b08331C21104n3942
$$ -222379 405453 -113935 -138074 -105286 42401 58263 212646 -208331 321104 267162
15390B67162J216o7699a65741A37116a44634r8018f7813j03407A00859B2076c2360
$$ 267162 268378 200679 -165741 137116 -144634 -242652 -67813 -171220 100859 22076 -32360
15378C7150J33995K37393g9618A54947g9532k1866B87381E8287K5510a28033a1041
$$ 37150 171145 408538 -79618 154947 -79532 -101398 287381 58287 83797 -128033 -11041
15366C73530i2533j1351F3932g4857A96246K21566j71022j01537L829a61547C68508
$$ 373530 -92533 -103884 63932 -74857 196246 417812 246790 145253 149082 -161547 368508
15354A58456o2873Q5531K17296e8374B65272G5215J03008j8866K8428N1970o4937
$$ 158456 95583 181114 398410 -58374 265272 75215 178223 159357 187785 239755 174818
15343A74818J24688j12547P2397R1810B7907K24013a76269C2483K0381J4448J2724
$$ 174818 299506 186959 259356 351166 27907 251920 -176269 32483 52864 67312 80036
15332H0036B7686b8237A65152q0703b02295E62196B8787M25524I7716c2252B40316
$$ 80036 27686 -28237 165152 84449 -202295 562196 28787 454311 97716 -32252 240316
15320a98160B21758E339a3376C12107r0917f9788B20551r538D1051J12258J12640
$$ -198160 221758 5339 -13376 312107 221190 -69788 220551 211013 41051 153309 265949
15309B65949L32231E6997M64648k23357E6244P1867D0858J24832J84787c04397
$$ 265949 598180 56997 521645 298288 56244 128111 40858 165690 350477 -304397
15298B82751J18671A84346M5071C9628b40482A82885G7512L51984F7762K10815
$$ 282751 401422 184346 229417 39628 -240482 182885 77512 429496 67762 278577
15288B78577f4699L470B03400J3179B4298M7702j8776b15225j94922a55635j12714
$$ 278577 -64699 -61229 203400 216579 24298 72000 53224 -215225 -410147 -155635 -268349
15277b68349i5291C31852j11865f7394A68130O3787I3245l0000J22106b80146
$$ -268349 -95291 331852 219987 -67394 168130 231917 93245 63245 185351 -280146
15266G193Q4364d5030A77670f7449b6154H1324c3623A49118a56637G1193b5409
$$ 7193 91557 -45030 177670 -67449 -26154 81324 -33623 149118 -156637 71193 -25409
15254E3215O1686b4062E2024L1569Q5478A1283a2040B49995O4788p5224m4707
$$ 53215 114901 -24062 52024 83593 169071 11283 -12040 249995 314783 239559 194852
15243A94852K83303K46944P40211J70933k52064J007300I60000l83510B17347
$$ 194852 478155 725099 1465310 1636243 1384179 2391479 960000 576490 217347
15233a22663C39917J24980j19366A04589b17232R322I2393r270J1118b85640J21055
$$ -122663 339917 464897 345531 104589 -217232 -207910 92393 83123 94241 -285640 -164585
15222a64585B8615K9123J79455l4969P3875j17304E1239k2905J73849a4528j69906
$$ -164585 28615 57738 237193 202224 276099 158795 51239 28334 202183 -14528 -184434
15211a84434I3096b79207B8990h6004B673J4814h951A61360a38869M7569e711
$$ -184434 93096 -279207 28990 -86004 2673 17487 -8951 161360 -138869 -91300 -5711
15199D55350A35989M4561C5314a24091a4965H0422a28835A30295J9732F1717J52089
$$ 455350 135989 180550 35314 -124091 -14965 80422 -128835 130295 150027 61717 213806
15188B13806a5483I05a14180H503a17822H7601C2969C762A125b956C49760a61220
$$ 213806 -15483 905 -114180 8503 -117822 87601 32969 3762 1125 -2956 349760 -161220
15175F8835K62384a57650A88300b98576A18667L5156o1532i831j36838C1109K15348
$$ 68835 331219 -157650 188300 -298576 118667 153823 92291 -9831 -146669 31109 246457
15164B46457j09685J7728J00414n0167L1201q7721a5615A14446d3806D0240c6629
$$ 246457 136772 154500 254914 204747 235948 148227 -15615 114446 -43806 40240 -36629
15152A97368C2093K5850J61822b79628A94023O3024Q2318g7383A49409J0563a7862
$$ 197368 32093 57943 219765 -279628 194023 257047 339365 -77383 149409 159972 -17862
15140H4983N2523D2902K78618j04633r9999n4284J91984d255B62273C2198L57939
$$ 84983 137506 42902 321520 216887 116888 62604 254588 -4255 262273 32198 390137
15129C90137G1336P6480K04108j67541b5437D934J25021J46633b6325B79041K2710
$$ 390137 71336 147816 351924 184383 -25437 4934 129955 276588 -26325 279041 301751
15118C01751B8809O76554p1891k15432L6199j68077P2538H3543g6650R273C37585
$$ 301751 28809 705363 633472 418040 454239 286162 358700 83543 -76650 -67377 337585
15106a63553N3089B94980B481O271O8356J59303c56722A71849J1655B9098J77332
$$ -163553 -110464 294980 2481 8752 77108 236411 -356722 171849 183504 29098 206430
15095B06430n1531B816J11072A5479h7524A29500b17364e2842j17803C9407M04090
$$ 206430 154899 2816 113888 15479 -87524 129500 -217364 -52842 -170645 39407 443497
15084D43497H0481K36736j56636a66296j34106I6387J39564J24095A32535p477
$$ 443497 80481 317217 160581 -166296 -300402 96387 235951 360046 132535 125058
15074A25058J05356p4162K6500R9923A09691b21249H4901M4796N1479b88726i94
$$ 125058 230414 156252 182752 282675 109691 -221249 84901 129697 181176 -288726 -994
15062b4257B43073p1694J06537j28385K1961J42558A18929k7303N98999d6385
$$ -24257 243073 171379 277916 149531 171492 314050 118929 91626 690625 -46385
15051C62871A41755J85522J0179K54184B65554P8310Q5514R719A67659L48550
$$ 362871 141755 327277 337456 591640 265554 343864 429378 439097 167659 516209
15041E16209j74782K00917j12176A33643J67087N74039G9278L49185A29049N85923
$$ 516209 341427 542344 430168 133643 300730 874769 79278 428463 129049 714972
15031G14972j52217O11131l53173j38335J84083j37911A9860N44855R4839j92489
$$ 714972 562755 1173886 820713 682378 866461 728550 19860 564715 659554 467065
15021D67065J69292K3422j46666J70694j9375k3591p8866A15014R1388K26246
$$ 467065 636357 659779 513113 683807 664432 640841 561975 115014 206402 432648
15011D32648r9764J36298o2365j77330L7213J65804j26431L64778l02808P4308
$$ 432648 332884 469182 406817 229487 266700 432504 306073 670851 368043 442351
15001D42351j45581J41758m9779K4206P0509m784j07071j0241j74605J11292K90112
$$ 442351 296770 438528 388749 412955 483464 478680 371609 361368 186763 298055 588167
14990E88167n1008J06091B99169K71074O838r9757p564K44642j73437L17936M81383
$$ 588167 537159 643250 299169 570243 577081 477324 469760 714402 540965 858901 1340284
14979A340284n80893j73862J30716q3638k37488M23027j32293N3093j5510J17260
$$ 1340284 759391 585529 716245 632607 395119 818146 685853 738946 723436 840696
14969H40696j47839B65122K60241P8110B38091L90769j10732O1900B77736L86306
$$ 840696 692857 265122 525363 603473 238091 628860 518128 580028 277736 664042
14959F64042j69169j39941L3935K48330B92314R7673N381L8449j45088r4916K14292
$$ 664042 494873 354932 388867 637197 292314 389987 395368 433817 288729 193813 408105
14948D08105K9224r1922J67165k07016N33422J2928O0701l56521Q9467C14681
$$ 408105 437329 345407 512572 305556 838978 851906 912607 556086 645553 314681
14937H27153k83086k64954J90035L9973K53464J10426K8939K39573K12687l0070
$$ 827153 544067 279113 469148 509121 762585 873011 901950 1141523 1354210 1324140
14927A324140k61056K26592O37791k44971J22591j09717O4738m51751K99832J05803
$$ 1324140 1063084 1289676 1927467 1682496 1805087 1695370 1760108 1308357 1608189 1713992
14917A713992R05799P3587j56835l46849m18554k71249m90897n2242j12061m21895
$$ 1713992 2619791 2693378 2536543 2189694 1771140 1499891 1008994 956752 844691 422796
14907D22796j08178R5144J33246G1244K91331K15371k10150A48329L91199j85118
$$ 422796 314618 409762 543008 71244 362575 577946 367796 148329 539528 354410
14897C54410r6393K69495J42225j98327F5042N45181o1765M7999R7909m5886j3443
$$ 354410 258017 527512 669737 471410 65042 610223 548458 596457 694366 648480 635037
14886F35037k15862L81471K21647P3444l6811p4549J71149k2575k93962j27335
$$ 635037 419175 800646 1022293 1095737 1058926 984377 1155526 1132951 838989 711654
14876G11654L83996C99614l2551O645Q7180j7008j66603A34605M68668N2545K04992
$$ 711654 1095650 399614 367063 373708 460888 443880 277277 134605 603273 655818 860810
14865H60810r6556K9470K1454k85171j5880K55262L4527l64282J35422j84828
$$ 860810 764254 793724 815178 530007 514127 769389 803916 439634 575056 390228
14855C90228j35998J67406J19609j93494K75428A38618J48068L53939j53845O0685
$$ 390228 254230 421636 541245 347751 623179 138618 286686 640625 486780 547465
14845E47465K23258O0355L36360j41143J05041N9878j26275j43028m1228j19785
$$ 547465 770723 831078 1167438 1026295 1131336 1191214 1064939 921911 880683 760898
14835G60898J44576O2846j72085J36683m55035K47869k66365J99825q7089o0865
$$ 760898 905474 968320 796235 932918 477883 725752 459387 659212 572123 511258
14825E11258K49203l78537L63287k4148C51770M01853o539J98283K2267j73468
$$ 511258 760461 381924 745211 721063 351770 753623 747084 945367 967634 794166
14815G94166k18844K90421J16340k07496C80211K32337j55814r5317N73178K0943
$$ 794166 575322 865743 982083 774587 380211 612548 456734 361417 934595 955538
14805I55538L34912J59537l00439m67500M9526j24913K29924l43537K41J00353
$$ 955538 1290450 1449987 1149548 682048 731574 606661 836585 493048 493289 593642
14795E93642J83643l69311J18449L3699k4923L0059B61778O80058C15087L55832
$$ 593642 777285 407974 526423 560122 535199 565258 261778 941836 315087 670919
14785F70919Q6336B84258L29606J34425L65477k73189k24234J55467M09722k37611
$$ 670919 757255 284258 613864 748289 1113766 840577 616343 771810 1181532 943921
14775I43921L94241m32526K25114j89890r9391j33834j67851R9014j16677p4504
$$ 943921 1338162 905636 1130750 940860 841469 707635 539784 638798 522121 447617
14765D47617j4762K17251j50003M67072k90212J62360l50967j42499M28533j73864
$$ 447617 432855 650106 500103 967175 676963 839323 488356 345857 774390 600526
14755F00526k332j25160k12495N92523L13605D31065J79373o9319L26303j53853
$$ 600526 598194 473034 260539 853062 1166667 431065 610438 541119 867422 713569
14745G13569K39529k24063K15093j75849C67544M46771j36012L3256J19686n2169
$$ 713569 953098 729035 944128 768279 367544 814315 678303 711559 831245 779076
14735G79076R2426J16101o6074k18483O30200l60424O04727j55480J46970L63638
$$ 779076 871502 987603 921529 703046 1333246 972822 1577549 1422069 1569039 1932677
14725A932677k13709j03374j21190l53657k15092K646O3649j72780K5845j64620
$$ 1932677 1718968 1615594 1494404 1140747 925655 928301 991950 819170 845015 680395
14715F80395K7196O20000D81242J91364K0360J64372p2631J29243J60166j57843
$$ 680395 707591 1327591 481242 672606 692966 857338 784707 913950 1074116 916273
14705I16273j70218N84108Q58L60697K79491M70064p83067K54048n93432J65078
$$ 916273 746055 1330163 1331021 1691718 1971209 2441273 1658206 1912254 1318822 1483900
14695A483900k98766k26916J42797k21487J86604o6190j76105j33696j14474J87844
$$ 1483900 1185134 958218 1101015 879528 1066132 999942 823837 690141 575667 763511
14685G63511J23998r7770L13962j66840J4876J0537N1201l5413p5984k38423K99332
$$ 763511 887509 789739 1103701 936861 951737 962274 1013475 978062 902078 663655 962987
14674I62987P8757k39970k41280M28244m33842L16998M36175l87865J27552k34433
$$ 962987 1041744 801774 560494 988738 554896 871894 1308069 920204 1047756 813323
14664H13323M21046n16030J63993k05077L19238j50794O8039j80123P9299M7678
$$ 813323 1234369 718339 882332 677255 996493 845699 913738 733615 812914 860592
14654H60592L34151M2232K40800Q7566k97709r5368R093p9431K24738m6115l12804
$$ 860592 1194743 1236975 1477775 1565341 1267632 1172264 1181357 1101926 1326664 1280549 967745
14643I67745J92289P8144N0244m38208K23868K2965J35737j07732n8960K86666
$$ 967745 1160034 1238178 1288422 850214 1074082 1097047 1232784 1125052 1066092 1352758
14633A352758l9780k92418J13860m3298p362m5318P0172L15306j07651j85465
$$ 1352758 1312978 1020560 1134420 1091122 1083760 1038442 1108614 1423920 1316269 1130804
14623A130804j07371k0881K83005j22299M7663o1654J22869l3060K22637j20939
$$ 1130804 1023433 1002552 1285557 1163258 1210921 1149267 1272136 1239076 1461713 1340774
14613A340774K40079m78653J84112M7110O4903j73888N25964p19468M97123n9096
$$ 1340774 1580853 1102200 1286312 1333422 1398325 1224437 1750401 1030933 1528056 1468960
14603A468960K09789n17142K88191L37281o25734K04770L78921l0398J37373k66324
$$ 1468960 1678749 1161607 1449798 1787079 1161345 1366115 1745036 1714638 1852011 1585687
14593A585687J76514J3189J1612k9278k94405L07582L46130n36194L01303k18104
$$ 1585687 1762201 1775390 1787002 1757724 1463319 1770901 2117031 1580837 1882140 1664036
14583A664036J93287J05402k33405k45262N18377m3946k05269j94338N57118l64919
$$ 1664036 1857323 1962725 1729320 1484058 2002435 1958489 1753220 1558882 2116000 1751081
14573A751081J55749L05569n167k28836J76163l8793K87486L8813j16482N0389
$$ 1751081 1906830 2212399 2207232 1978396 2154559 2115766 2403252 2442065 2325583 2375972
14563B375972p7257L84100k65547Q0655Q4872R8460J66316P633O42592j08259
$$ 2375972 2298715 2682815 2417268 2497923 2582795 2681255 2847571 2855204 3497796 3389537
14553C389537M25441J79646O97360M26208J784552L195842R184279J7637429M610413
$$ 3389537 3814978 3994624 4691984 5118192 6902744 10098586 19282865 36920294 41530707
14544D1530707B0369436I832187m570263j619896p65374P6821R7891J010984K113472
$$ 41530707 20369436 9832187 5261924 3642028 2876654 2953475 3051366 4062350 6175822
14535F175822k670561q82330l53131k19214K04719l21281L7382K30344l7948L3162
$$ 6175822 3505261 2622931 2269800 2050586 2255305 1934024 1971406 2201750 2163802 2196964
14525B196964J82219k83819K79333J44503k54355L03469k04516J76804j96312
$$ 2196964 2379183 2095364 2374697 2519200 2264845 2568314 2363798 2540602 2344290
14516B344290J22838j03849j45523L80182J39000j65362N8472j42603J11927J22680
$$ 2344290 2467128 2363279 2217756 2597938 2736938 2571576 2630048 2487445 2599372 2722052
14506B722052j42567M2786O9300M41209l19465K79658m7140j40340L1472J3034
$$ 2722052 2579485 2622271 2691571 3132780 2813315 3092973 3045833 2905493 2936965 2949999
14496B949999M9965M34496j78240J09783n4187J3263K74528J27312q6845m82398
$$ 2949999 2999964 3434460 3256220 3366003 3311816 3325079 3599607 3726919 3640074 3157676
14486C157676N99719k21037P7356o2631m5633J91546o1700M05629k25179L60557
$$ 3157676 3757395 3536358 3613714 3551083 3505450 3696996 3635296 4040925 3815746 4176303
14476D176303m1837m4619J5309l2566k12574M98031J21272l14063K58133k62505
$$ 4176303 4134466 4089847 4105156 4072590 3860016 4358047 4479319 4165256 4423389 4160884
14466D160884J40399L02736j64962J62943l67456N61737k2475j09676L10458j34892
$$ 4160884 4301283 4604019 4439057 4602000 4234544 4796281 4773806 4664130 4974588 4839696
14456D839696k09074K86710J72679n2577N6285K40234k44894M48976j98309K85848
$$ 4839696 4630622 4917332 5090011 5037434 5093719 5333953 5089059 5538035 5339726 5625574
14446E625574j40581L55749j17517L30245o13349N85257m66984K16057M67839
$$ 5625574 5484993 5840742 5723225 6053470 5440121 6025378 5558394 5774451 6242290
14437F242290k00335K0739R8262P81504j20439m84186L24666J89578J32137l7035
$$ 6242290 6041955 6062694 6160956 6942460 6822021 6337835 6662501 6852079 6984216 6947181
14427F947181L98707m09737O33005k23511J30643M74670j10711L72436j50330
$$ 6947181 7345888 6936151 7569156 7345645 7476288 7950958 7840247 8212683 8062353
14418H062353K73879J30811L5197j4005K72539o0352K97526m14551K87363L82443
$$ 8062353 8336232 8467043 8502240 8488235 8760774 8700422 8997948 8583397 8870760 9253203
14408I253203K02246K10764L30332J09997J01019P6298K73243r9940q0978L60462
$$ 9253203 9455449 9666213 9996545 10106542 10207561 10283859 10557102 10457162 10376184 10736646
14398A0736646l13448L60127L08539L63O02814m8973N5448M87988J85126P4025
$$ 10736646 10423198 10783325 11091864 11092227 11695041 11646068 11701516 12189504 12374630 12448655
14388A2448655K80559K59137K85279Q3123L26991M96442K2940M13873M26685M51970
$$ 12448655 12729214 12988351 13273630 13356753 13683744 14180186 14203126 14616999 15043684 15495654
14378A5495654o3566K67834Q1553N97222L28905K34312J71749N43426N19394J51903
$$ 15495654 15432088 15699922 15781475 16378697 16707602 16941914 17113663 17657089 18176483 18328386
14368A8328386K21019O87505O79567K86382K09576L15833M29582L94175L05081
$$ 18328386 18549405 19236910 19916477 20202859 20412435 20728268 21157850 21552025 21857106
14359B1857106O56783L0831J074066M62767O74635N90603N09952M39077P18723
$$ 21857106 22513889 22544720 23618786 24081553 24756188 25346791 25856743 26295820 27014543
14350B7014543O21582Q68110M97843R50575N73790R63502P08602J111902P81917
$$ 27014543 27636125 28504235 29002078 29952653 30526443 31489945 32198547 33310449 34092366
14341C4092366R23623P42418J274363Q63955J121803J046628J099460J569016
$$ 34092366 35015989 35758407 37032770 37896725 39018528 40065156 41164616 42733632
14333D2733632J171751J447483J614715J237584J485129J535511J737424J922490
$$ 42733632 43905383 45352866 46967581 48205165 49690294 51225805 52963229 54885719
14325E4885719J515715K005662J961371K376181K399662K226543K741485J801748
$$ 54885719 56401434 58407096 60368467 62744648 65144310 67370853 70112338 71914086
14317G1914086K590179K969909K871150L119881L207201L607518L486318M109024
$$ 71914086 74504265 77474174 80345324 83465205 86672406 90279924 93766242 97875266
14309I7875266L659196M619965M404849M849950N230952N175453N541410O604897
$$ 97875266 101534462 106154427 110559276 115409226 120640178 125815631 131357041 137961938
14301A37961938O506369O763489P072567P798184P777974Q740968R329876R568088
$$ 137961938 144468307 151231796 158304363 166102547 173880521 182621489 191951365 201519453
14293B01519453J0491193J0626730J1370594J2091159J2625820J2840074J3969972
$$ 201519453 212010646 222637376 234007970 246099129 258724949 271565023 285534995
14286B85534995J4112827J5128515J4517902J5641365J5317560J5495621J5111417
$$ 285534995 299647822 314776337 329294239 344935604 360253164 375748785 390860202
14279C90860202J4662751J4006484J2590297J1639114R591322P607692M794706
$$ 390860202 405522953 419529437 432119734 443758848 453350170 460957862 465752568
14272D65752568P98632l288244o076165m797356n777538o385246r905279j1287718
$$ 465752568 466551200 463262956 457186791 452389435 446611897 440226651 430321372 419033654
14264D19033654j1303748j2432662j3838994j5012810j5873563j6253837j6073808
$$ 419033654 407729906 395297244 381458250 366445440 350571877 334318040 318244232
14257C18244232j5470170j5375117j4402487j4046203j3776133j2618422j1907762
$$ 318244232 302774062 287398945 272996458 258950255 245174122 232555700 220647938
14250B20647938j1478977j0932816j0150344q041128q263722q586307p859083
$$ 220647938 209168961 198236145 188085801 180044673 171780951 163194644 155335561
14243A55335561p608558p204721o131018o600291n803861n338280m982400n035560
$$ 155335561 147727003 140522282 134391264 127790973 121987112 116648832 111666432 106630872
14235A06630872m634653m153993m140660l956431l230944l270889l258837l147763
$$ 106630872 101996219 97842226 93701566 89745135 86514191 83243302 79984465 76836702
14227G6836702k872429k720104k869042k392409k679148j963937j901924k288933
$$ 76836702 73964273 71244169 68375127 65982718 63303570 61339633 59437709 57148776
14219E7148776j557946k040696j695546j751428j324274j373712j047300j652868
$$ 57148776 55590830 53550134 51854588 50103160 48778886 47405174 46357874 44705006
14211D4705006j732110j060357j285730j023175n68859j095659r83179j628645
$$ 44705006 42972896 41912539 40626809 39603634 39034775 37939116 36955937 35327292
14203C5327292j148364p33784l93446p21599j034411q16331j244618l83263o46927
$$ 35327292 34178928 33445144 33051698 32330099 31295688 30479357 29234739 28851476 28204549
14194B8204549n61339p24915l77340j091726o63965l28559p15074k84483r50847
$$ 28204549 27643210 26918295 26540955 25449229 24785264 24456705 23741631 23457148 22506301
14185B2506301k93357n63745r6815o93126p16072j62841j42313p11664m41446
$$ 22506301 22212944 21649199 21552384 20859258 20143186 19980345 19838032 19126368 18684922
14176A8684922k88390n27109m45177l47269n01554N9692k86351k58038m50228
$$ 18684922 18396532 17869423 17424246 17076977 16575423 16635115 16348764 16090726 15640498
14167A5640498j04609l44928n67227j19314j72152j15981j57827m77187j45435
$$ 15640498 15535889 15190961 14623734 14504420 14332268 14216287 14058460 13581273 13435838
14158A3435838j54205m12725j27734k05651l84731P7220k81637k23013j28005
$$ 13435838 13281633 12868908 12741174 12535523 12150792 12228012 11946375 11723362 11595357
14149A1595357n00987k60566J75122j9824n18361J5327l11817p9161k99864K64658
$$ 11595357 11094370 10833804 11008926 10989102 10470741 10486068 10174251 10095090 9795226 10059884
14139A0059884l13566R6613q6848p5480l77516k57303p1656k20941j15983r9439
$$ 10059884 9746318 9842931 9756083 9680603 9303087 9045784 8974128 8753187 8637204 8537765
14129H537765r0637m0059k89492J08902j92324n4825k89486J5220m54341R6045
$$ 8537765 8447128 8407069 8117577 8226479 8034155 7979330 7689844 7705064 7250723 7346768
14119G346768J17654m34896K7976j95151P4131L134k73491k3350J04448r1245
$$ 7346768 7464422 7029526 7057502 6862351 6936482 6939616 6666125 6642775 6747223 6655978
14109F655978J47038k96895j05204m64921J70683j74525K75477j94797o3459j34040
$$ 6655978 6803016 6506121 6400917 5935996 6106679 5932154 6207631 6012834 5949375 5815335
14099E815335k5535k26842K17119l28266K31446k64894k22425P2317k28864k43315
$$ 5815335 5789800 5562958 5780077 5451811 5683257 5418363 5195938 5268255 5039391 4796076
14089D796076M06481J76230k48857j55556q9342k9567p9818o5687J15578J5849
$$ 4796076 5202557 5378787 5129930 4974374 4885032 4855465 4775647 4709960 4825538 4841387
14079D841387k30349R695j23791K06902l41066L12186l95371J38485k50899k99565
$$ 4841387 4611038 4620733 4496942 4703844 4362778 4674964 4279593 4418078 4167179 3867614
14069C867614J48348k34949J71308K06339J29504l84259j28981K19868J29286
$$ 3867614 4015962 3781013 3952321 4158660 4288164 3903905 3774924 3994792 4124078
14060D124078J41387l54519j35550M09617j82882n42404o31K32947l14289J42513
$$ 4124078 4265465 3910946 3775396 4185013 4002131 3459727 3459096 3692043 3377754 3520267
14050C520267o3437j98697K15114o4932l08358K14583l16769J07004J93527J39956
$$ 3520267 3456830 3258133 3473247 3408315 3099957 3314540 2997771 3104775 3298302 3438258
14040C438258r5594j91156m53862Q0250J22186R0779k48621L50509K008k28694
$$ 3438258 3342664 3151508 2697646 2777896 2900082 2990861 2742240 3092749 3094757 2866063
14030B866063L82265j92220j51646k44771J93497m9790k94771M45729j96271j39865
$$ 2866063 3248328 3056108 2904462 2659691 2853188 2803398 2508627 2954356 2758085 2618220
14020B618220k41377J02546K53674k80074j16938P3927L34648k06380k69762N3955
$$ 2618220 2376843 2479389 2733063 2452989 2336051 2409978 2744626 2538246 2268484 2322439
14010B322439j73828Q1115j38573J16676J0812J95801k17431n4787M2821p4283
$$ 2322439 2148611 2229726 2091153 2207829 2218641 2414442 2197011 2142224 2185045 2110762
14000B110762J25307l08291M35906l08398L7251k16093O0571N64948l67210L50027
$$ 2110762 2236069 1927778 2363684 2055286 2092537 1876444 1937015 2501963 2134753 2484780
13990B484780l6109L77696K328222O536055J7400556J3997618j6506748j2110684
$$ 2484780 2448671 2826367 5154589 11690644 29091200 43088818 26582070 14471386
13982A4471386n666765j942179j815361o51826n80247m06730j16114n34134L3806
$$ 14471386 8804621 6862442 5047081 4395255 3815008 3408278 3292164 2758030 2791836
13973B791836L2679k55904q5500K2949p5573r1859j31034o0385P2662K58796m27491
$$ 2791836 2824515 2568611 2483111 2506060 2430487 2338628 2207594 2147209 2219871 2478667 2051176
13962B051176J98830j95783J95075K7962k53640J3645l16402R7603p8181L25429
$$ 2051176 2250006 2054223 2249298 2277260 2023620 2037265 1720863 1818466 1740285 2065714
13952B065714P0803j29711q4608J3445l8429k52600j26744M62625k09240n9660
$$ 2065714 2136517 2006806 1922198 1935643 1897214 1644614 1517870 1980495 1771255 1711595
13942A711595J99904K95647l60800j45191l8949k3931R3095j94307K20723K0370
$$ 1711595 1911499 2207146 1846346 1701155 1662206 1638275 1731370 1537063 1757786 1778156
13932A778156l37744K03740m7623R3540k5129J39452k41820k95529L95122j8856
$$ 1778156 1440412 1644152 1596529 1690069 1664940 1804392 1562572 1267043 1662165 1643309
13922A643309k95503K61961k76088L24961k29115k14591N13674k55663k1499J74499
$$ 1643309 1347806 1609767 1333679 1658640 1429525 1214934 1728608 1472945 1451446 1625945
13912A625945j24779l06579L03398l5036p0113k9014K57214j50355k24522J12075
$$ 1625945 1501166 1194587 1497985 1462949 1392836 1363822 1621036 1470681 1246159 1358234
13902A358234K04153j05778j97365M2065j3830j50336L02023K02975k92233m9028
$$ 1358234 1562387 1456609 1259244 1301309 1287479 1137143 1439166 1642141 1349908 1300880
13892A300880l81077K96181L14783q9220N0022k03285r8296Q8939m434K07277
$$ 1300880 919803 1215984 1530767 1441547 1491569 1288284 1189988 1278927 1274493 1481770
13882A481770k59127k4544r6315Q3145J06001j3757O5349k84738K28510q7677
$$ 1481770 1222643 1198099 1101784 1184929 1290930 1277173 1342522 1057784 1286294 1198617
13872A198617k03885j46019J7037L99251l51660J45457J0296K18701k08299J991
$$ 1198617 994732 848713 865750 1265001 913341 1058798 1069094 1287795 1079496 1081487
13862A081487K05856j65822j01753l44985K59269l9416K9158L85261F34122J77732
$$ 1081487 1287343 1121521 1019768 674783 934052 894636 923794 1309055 634122 811854
13852H11854L24247k10617P4088j10887J43444k35347L62184m35656L14452j62351
$$ 811854 1136101 925484 999572 888685 1032129 796782 1158966 723310 1037762 875411
13842H75411j11190L22857k85098J40309K21028l89217K16625J78658k62986o2885
$$ 875411 764221 1087078 801980 942289 1163317 774100 990725 1169383 906397 843512
13832H43512n1961K01013l48343m3206K22894l63036Q0202J49833K94582P0434
$$ 843512 791551 992564 644221 601015 823909 460873 541075 690908 985490 1055924
13822A055924l96925n4717J97902J9395r0802L17594p5436k10476L34772m99663
$$ 1055924 658999 604282 802184 821579 730777 1048371 972935 762459 1097231 597568
13812E97568K95316n7531j0843N9528j06897j35236K97033J27201q2978l25817
$$ 597568 892884 835353 824510 884038 777141 641905 938938 1066139 983161 657344
13802F57344J13982J99172n7910K6703j60431K70840q9951j70631j56388J86991
$$ 657344 771326 970498 912588 939291 778860 1049700 959749 789118 632730 819721
13792H19721j71911R8079q1460k35420L04749j76053K38260l24906K55190j29165
$$ 819721 647810 745889 664429 429009 733758 557705 795965 471059 726249 597084
13782E97084K92273K11370l56548L0372N6984j83423r5491L95977m48170L15264
$$ 597084 889357 1100727 744179 774551 831535 648112 552621 948598 500428 815692
13772H15692k92150J96881N1747j975r1306j96976J67928j05932J75398M9456
$$ 815692 523542 720423 772170 770195 678889 481913 649841 543909 719307 768763
13762G68763l24092j37802K75153K96298l53942J54886j48421P4089k3979J18361
$$ 768763 444671 306869 582022 878320 524378 679264 530843 604932 580953 699314
13752F99314j06973k56365K26908M3763N1638k84174J75899P3606n3985J24777
$$ 699314 592341 335976 562884 606647 658285 374111 550010 623616 569631 694408
13742F94408K4182k49375J97773O3095C34208J56686J19481R1020B81142M20655
$$ 694408 718590 469215 666988 730083 334208 490894 610375 701395 281142 701797
13732G01797j50999K89997l96830L59097l83440r1093J85050B22781J3451K79031
$$ 701797 550798 840795 443965 803062 419622 328529 513579 222781 236232 515263
13722E15263k34769J97687Q0985K06082r1188J49075C95943K74983q2832k1221
$$ 515263 280494 478181 559166 765248 674060 823135 395943 670926 588094 566873
13712E66873J7160K43600k02760o4091l4096j49247L39097j37372n0245k25040
$$ 566873 584033 827633 624873 560782 526686 377439 716536 579164 528919 303879
13702C03879K67087R6725k23208N56634B88319L65729o4808l4001k35130K05747
$$ 303879 570966 667691 444483 1001117 288319 654048 589240 555239 320109 525856
13692E25856J24875k65821j6022L72556k90699q4211L58965j70204k21174K03817
$$ 525856 650731 384910 368888 741444 450745 366534 725499 555295 334121 537938
13682E37938j47209K6071j10379K67428j8598j49329o3961L68017C26417J91548
$$ 537938 390729 416800 306421 573849 555251 405922 341961 709978 326417 517965
13672E17965O5424B21901I8895L65269j03237J72112n5740p0657A66520M48369
$$ 517965 583389 221901 98895 464164 360927 533039 477299 406642 166520 614889
13662F14889B18775q1837K91505J44421l0198k5609A18294K00091O6956p4025
$$ 614889 218775 136938 428443 572864 542666 517057 118294 318385 385341 311316
13652C11316K18122j87348q8055o3360J43022M61253k97865M5713J66186k73979
$$ 311316 529438 342090 254035 190675 333697 794950 497085 542798 708984 435005
13642D35005j16762L63632q9278k64523N4090K84794B04987J89624j26935N9273
$$ 435005 318243 681875 592597 328074 382164 666958 204987 394611 267676 326949
13632C26949j54674j8080K04128q8866N72752f2990D93259j689k08431K87387
$$ 326949 172275 154195 358323 269457 842209 -62990 493259 491570 283139 570526
13622E70526o2933j07441J43241B14445J16993F1646L19841A7505J06996L58957
$$ 570526 507593 400152 543393 214445 331438 61646 381487 17505 124501 483458
13612D83458A66452G5525L30656k1607J85988J8725B15571N7994I0996J40050
$$ 483458 166452 75525 406181 384574 570562 589287 215571 273565 90996 231046
13602B31046K27419o2405A54505L47813B16969P6429j8247J47628o5103E3966
$$ 231046 458465 396060 154505 502318 216969 293398 275151 422779 357676 53966
13591E9375a04334B29829J58031j52357J78866o4114j8697M2300C8883K25319
$$ 59375 -104334 229829 387860 235503 414369 350255 331558 373858 38883 264202
13581B64202M7757o5398F6804K84413j25885L16045j99959J22382J52824a15815
$$ 264202 311959 246561 66804 351217 225332 541377 341418 463800 616624 -115815
13570G8825J71548k2965J03617O5542A58513K66986P2827k12382P8387A82129
$$ 78825 250373 227408 331025 396567 158513 425499 498326 285944 364331 182129
13559B97821d7094B53848q9834J37252d5203D01862Q1471D0453J00133P171D2023
$$ 297821 -47094 253848 164014 301266 -45203 401862 483333 40453 140586 147757 42023
13547B1874K08259J55172P9583A81104P3824J56115l8547F9266M90133B9854L22054
$$ 21874 230133 385305 464888 181104 254928 411043 372496 69266 559399 29854 351908
13536C51908j60286K56719k04199q1889J15875J69343p155A99959a9935D79259
$$ 351908 191622 448341 244142 162253 278128 447471 440316 199959 -19935 479259
13525A29555J78504P22k6881m5843d4679A45702K54577Q7112j35668I1761Q4941
$$ 129555 308059 308781 281900 236057 -44679 145702 400279 487391 351723 91761 176702
13514A76702k5359J96169i104A42939K71601r6280R9832k02303P8355O2602A24314
$$ 176702 151343 347512 -9104 142939 414540 318260 418092 215789 294144 356746 124314
13502G7576L44169A09648K47453b7055F0848M92369k69140o4601K22560E71M12855
$$ 77576 421745 109648 357101 -27055 60848 553217 284077 219476 442036 571 413426
13491D13426I8641J25960I4517L43718A83670D5567a31276E45065j29493B9132
$$ 413426 98641 224601 94517 438235 183670 45567 -131276 545065 415572 29132
13480C25789l9052n2832K12652j35081A49385L6246k4251K09491A70582n8705
$$ 325789 286737 233905 446557 311476 149385 185631 161380 370871 170582 111877
13470A11877D3360a4370B92318B496K43428R1189n6844j13143K70155q9105Q5783
$$ 111877 43360 -14370 292318 2496 245924 337113 280269 167126 437281 348176 433959
13459D33959J2050H8888e580B55618I1731M68024A14110K29765q3880I8867r068
$$ 433959 446009 88888 -5580 255618 91731 559755 114110 343875 259995 98867 89799
13448H9799D2597K43526b8968A25090E236K16305J50140n0081p4542J77166K265
$$ 89799 42597 286123 -28968 125090 5236 221541 371681 321600 247058 424224 426489
13437D26489K716I0888J36733p1321M0161J57088J69252B35674b0313r56F8553
$$ 426489 429205 90888 227621 156300 196461 353549 522801 235674 -20313 -21269 68553
13425C03070j31737K71346k5409B02484l6339J27769A22829J05453J63856J39717
$$ 303070 171333 442679 417270 202484 166145 293914 122829 228282 392138 531855
13415E31855C600K59142j09785p1330R5590D5953K05803i670A3743J4928O036
$$ 531855 3600 262742 152957 81627 177217 45953 251756 -9670 13743 28671 34707
13404C4707R0580N8500O5419l6034J51877b0350A84188l2887D6386a59674F6469
$$ 34707 125287 183787 249206 213172 365049 -20350 184188 151301 46386 -159674 66469
13392a36446D0140J8257K1551M44726B36513J38328A84679K47387A64490A07O2779
$$ -136446 40140 58397 79948 524674 236513 374841 184679 432066 164490 107 62886
13381F2886K00073J8097o9097D3120J44634L5015P038B2844J23474K48623a77345
$$ 62886 262959 281056 211959 43120 187754 222769 229807 22844 146318 394941 -177345
13369C00426J69490l2018g814A63529K40487j71419O7757j23593J00329E9057
$$ 300426 469916 437898 -7814 163529 404016 232597 300354 176761 277090 59057
13358a9509C07958A12044H858L9377K43824m9337I1080K32341m2387K0885C2158
$$ -19509 307958 112044 8858 48235 292059 242722 91080 323421 281034 301919 32158
13346B34706M9406H4868J78255J52144j39073P2211K9490l4826D7135L62315p7856
$$ 234706 284112 84868 263123 415267 276194 348405 377895 343069 47135 409450 331594
13335C31594j40908k7691Q8278b74145D35044q3419n0599J70959B3295L78753
$$ 331594 190686 162995 251273 -274145 435044 351625 301026 471985 23295 402048
13325D02048F1935Q8588E5745K94471r8956J77234d334B49431o801C4699K44135
$$ 402048 61935 150523 55745 350216 251260 428494 -4334 249431 242630 34699 278834
13314B78834J56636A36823k8987c02568A78527J14449O5952p0053J32612j71488
$$ 278834 435470 136823 107836 -302568 178527 292976 358928 288875 421487 249999
13304B49999J3458j10442J15973i4136o2780A13001L2312K27824A8493M4691c5433
$$ 249999 263457 153015 268988 -94136 -156916 113001 145313 373137 18493 63184 -35433
13292C56360a31427A47269e9509C11972c5251C47859H4892A7200a76202C2131
$$ 356360 -131427 147269 -59509 311972 -35251 347859 84892 17200 -176202 32131
13281c56544M8378C31494c5851H4100Q3870K86734H6618b1372G1949O0257C941
$$ -356544 -308166 331494 -35851 84100 167970 454704 86618 -21372 71949 132206 3941
13269C9069P5840N6873c70802D5906K94239c0419A73355K10246d3354A40613b7286
$$ 39069 114909 171782 -370802 45906 340145 -30419 173355 383601 -43354 140613 -27286
13257B45801a5237A06578M5951J67423j27094E5381L8646B0166Q4509P592L46308
$$ 245801 -15237 106578 152529 319952 192858 55381 94027 20166 104675 112267 458575
13246D58575j59158J4641j51008p5931L77976E5854A6458J2402O4824J54147J58213
$$ 458575 299417 314058 163050 87119 465095 55854 16458 28860 93684 247831 406044
13235D06044b28137B59170C6292K26253c66112f8476C78150b25975A56753c8566
$$ 406044 -228137 259170 36292 262545 -366112 -68476 378150 -225975 156753 -38566
13224A17997i1824d076H4911K4245k1196J7080J31427a21049N8718j72360C57551
$$ 117997 -91824 -4076 84911 109156 87960 105040 236467 -121049 -62331 -234691 357551
13212B3974h8092A45930h734B98613A15973J19997J14504a60122B31039b70021
$$ 23974 -88092 145930 -8734 298613 115973 235970 350474 -160122 231039 -270021
13201c6976A03540J55149Q6184b5142D29766j51271n1841o5602p4463J9598J36796
$$ -36976 103540 258689 344873 -25142 429766 278495 226654 161052 86589 106187 242983
13190B42983A7061K53180F5244M9102K31960a1410l5694I5534a46582A51258h0363
$$ 242983 17061 270241 65244 114346 346306 -11410 -47104 95534 -146582 151258 -80363
13178A50292J19955b00120D73111I4961P3789k4920M7502c565D545N36174C5124
$$ 150292 270247 -200120 473111 94961 168750 143830 191332 -3565 4545 540719 35124
13166b25377B08435L02846a7145C2680K67107j08192f3745B246D25c1557E8163
$$ -225377 208435 511281 -17145 32680 299787 191595 -63745 2246 425 -31557 58163
13154F0389i589j97488C46936A05664a92822C1383J6931g9784c3815C28090a05907
$$ 60389 -9589 -207077 346936 105664 -192822 31383 48314 -79784 -33815 328090 -105907
13142A39617n6761i3504B24235j09176B8991M73341k12591p3263b0054D8970Q1437
$$ 139617 82856 -93504 224235 115059 28991 502332 289741 216478 -20054 48970 130407
13131A30407J68422k5479L8405D4630i7311F3049A8203J26050K22399P3816A28852
$$ 130407 298829 273350 311755 44630 -97311 63049 18203 144253 366652 440468 128852
13119B35137q2290R51J8201l3698J45384c62688E18766e0576A19809J8248f2242
$$ 235137 152847 153798 171999 138301 283685 -362688 518766 -50576 119809 138057 -62242
13107b7053C0082P1102i5126l4456B68953a03068B03785D1088K8300b02613B40069
$$ -27053 30082 101184 -95126 -129582 268953 -103068 203785 41088 69388 -202613 240069
13095b95071B27340d7273m3916a0427j85610E0199a292G6930K07824B0301K21091
$$ -295071 227340 -47273 -91189 -10427 -196037 50199 -1292 76930 284754 20301 241392
13084B41392B8160a46092N6827K9396A64839d40398I0703J96820A09221a26735
$$ 241392 28160 -146092 -89265 -59869 164839 -440398 90703 287523 109221 -126735
13073A13106a13696c5951E8494L717P9846F8551k7313J41775O1808a65265K679
$$ 113106 -113696 -35951 58494 62211 142057 68551 41238 183013 244821 -165265 -162586
13062a62586B51094r1211P9033a32254B41559a07859E82946i1307A44273E7833
$$ -162586 251094 159883 238916 -132254 241559 -107859 582946 -91307 144273 57833
13051f4861m4123B38524C8710J92862b08063h9812E6010J9494P2844K7991Q070
$$ -64861 -108984 238524 38710 231572 -208063 -89812 56010 75504 148348 176339 184409
13040A84409O0085M8403G0545J38432j8062E3882c8089B86540G5846J83895C9199
$$ 184409 244494 292897 70545 208977 190915 53882 -38089 286540 75846 259741 39199
13028c44372D78323j38599d3328D405L77322j84745N1153b14708C68765A0275
$$ -344372 478323 339724 -43328 4405 381727 196982 248135 -214708 368765 10275
13017c8788A32349a02535C05453F6181a9869A57363P4515O5439L4917j18691C5001
$$ -38788 132349 -102535 305453 66181 -19869 157363 231878 297317 332234 213543 35001
13005E3798L4677K07642j01464G4869d0863D60311E7368a21390C0688L0042b71847
$$ 53798 88475 296117 194653 74869 -40863 460311 57368 -121390 30688 60730 -271847
12993a53300c7891A68403m8232J99807C0165J31703P4949D4371b40837I0211b91244
$$ -153300 -37891 168403 120171 319978 30165 161868 236817 44371 -240837 90211 -291244
12981D5111A5324P2190d2904a3218D3021j5705K0428J74593C5649a26820l4044
$$ 45111 15324 87514 -42904 -13218 43021 27316 47744 222337 35649 -126820 -160864
12970a60864A39125O6554f7321B5210J26919D0993a79783C7876c1483A95426E8629
$$ -160864 139125 205679 -67321 25210 152129 40993 -179783 37876 -31483 195426 58629
12958A94254p0418j5983c48074A1930b17455d9056j71777p1423Q6569Q3697B91979
$$ 194254 123836 107853 -348074 11930 -217455 -49056 -220833 -292256 -205687 -121990 291979
12946F9076Q8494i9421r8991b172G1102a82848h9947j23511f3189l4033j05950
$$ 69076 157570 -99421 -198412 -2172 71102 -182848 -89947 -213458 -63189 -97222 -203172
12935b03172d4546j30545C29666j08302a39103k2900I8221b8788A45429A865J70139
$$ -203172 -44546 -175091 329666 221364 -139103 -162003 98221 -28788 145429 1865 172004
12924A72004P9871O5893D2556n366j5863G745a07658A53640n27a66223A22896
$$ 172004 251875 317768 42556 37190 21327 7745 -107658 153640 153113 -166223 122896
12912A17970b56776C23934c1007j6971B18883c25186C63602A23068g8221A75022
$$ 117970 -256776 323934 -31007 -47978 218883 -325186 363602 123068 -78221 175022
12901C226e8720B0630f8290A67167h9493L2500n6664A41816l3795a606C11732
$$ 3226 -58720 20630 -68290 167167 -89493 -56993 -113657 141816 108021 -1606 311732
12889a219j2715j68634h5465A3357a63441A32936j9032E6416J24927c9144D2924
$$ -1219 -13934 -182568 -85465 13357 -163441 132936 113904 56416 181343 -39144 42924
12877b42804H2868f3833f766A17219J70255G7879f9337G1629J83634e5188m0892
$$ -242804 82868 -63833 -6766 117219 287474 77879 -69337 71629 255263 -55188 -96080
12866i6080a7741j7728r3751b9713j55402f468B9640d3907B06766q129D2663N2908
$$ -96080 -17741 -35469 -129220 -29713 -185115 -6468 29640 -43907 206766 198637 42663 95571
12854I5571d5283B92491m4049b44800A60547a26934A49353b09093C85437B2738
$$ 95571 -45283 292491 248442 -244800 160547 -126934 149353 -209093 385437 22738
12843A00071C5660a30341M7192B7000d1312H8832A0868K19501g6916j79989C56890
$$ 100071 35660 -130341 -83149 27000 -41312 88832 10868 230369 -76916 -256905 356890
12831b75541e5973C20823e491B98679B580J90624I3709a08777A04841a25732c4768
$$ -275541 -55973 320823 -5491 298679 2580 193204 93709 -108777 104841 -125732 -34768
12819B91232H0956c02686a07563j10058l1103C27225g8795k77224J06701e5484
$$ 291232 80956 -302686 -107563 -217621 -248724 327225 -78795 -356019 -249318 -55484
12808A36988E257c0812k20304R5355M4736j75371A14087J20851f7555k14745R6429
$$ 136988 5257 -30812 -251116 -155761 -111025 -286396 114087 234938 -67555 -282300 -185871
12797a85871P9984A92938c9264j13712I2490l2074i7440M0302H1002a13202H5735
$$ -185871 -105887 192938 -39264 -152976 92490 60416 -97440 -57138 81002 -113202 85735
12785A60684B839J41105b55246B32527E7944j7807K48922F9281i6722E17b16584
$$ 160684 2839 143944 -255246 232527 57944 40137 289059 69281 -96722 517 -216584
12773a45913e403C36755A20003a14788o7433F3233l948M876c5853q9904K8729
$$ -145913 -5403 336755 120003 -114788 -182221 63233 59285 64161 -35853 -125757 -97028
12762i7028F26268B3770K6226J59676e0536G3286c83176a64513M3214F9769a38374
$$ -97028 626268 23770 49996 209672 -50536 73286 -383176 -164513 -121299 69769 -138374
12750a11626l1931O8462m8934j13536D5416Q0765Q73K61314A53066c4547B18526
$$ -111626 -143557 -75095 -124029 -237565 45416 126181 127054 388368 153066 -34547 218526
12738B32031a77471b6203j09757m8422A56559j492b32531J14598n3417g0489p4372
$$ 232031 -177471 -26203 -135960 -184382 156559 155067 -232531 -117933 -171350 -70489 -144861
12727a44861B6190a51660A66540a89428O3310c7825a6650o1181K7034j20855H9084
$$ -144861 26190 -151660 166540 -189428 -126118 -37825 -16650 -77831 -50797 -171652 89084
12715B85202q4176C2937N5622a55930B05224J12604I5694K58338k5490p301A26838
$$ 285202 201026 32937 88559 -155930 205224 317828 95694 354032 328542 321241 126838
12703A64910m3898D9449c0009j9296B25806Q7773J4594j40922J92798l8649L172
$$ 164910 121012 49449 -30009 -49305 225806 313579 328173 187251 380049 341400 344572
12692C44572i0152C30213E2738K15345A02194a14160A99992D635Q6035m3503Q9190
$$ 344572 -90152 330213 52738 268083 102194 -114160 199992 4635 90670 47167 136357
12681A36357c9265A34433m4863K81104B6101M2444O7723n8079a71286f2792b8600
$$ 136357 -39265 134433 89570 370674 26101 68545 136268 78189 -171286 -62792 -28600
12669B1413c48689b8886A45802c73078G3057a7492q5594c2708J2543i453k07569
$$ 21413 -348689 -28886 145802 -373078 73057 -17492 -103086 -32708 -20165 -9453 -217022
12658b17022k19621H266K58446l1896f8769L7l8597d2052l8423D18735f780B72853
$$ -217022 -436643 8266 266712 234816 -68769 -68732 -107329 -42052 -80475 418735 -6780 272853
12645A0626K59534b13816A09097O2m7625b41552O3783j21745A90677L1674a19207
$$ 10626 270160 -213816 109097 109159 61534 -241552 -177769 -299514 190677 222351 -119207
12633A15799O6233a01468A89335P643J67893A53430l3767L8555J43425C9193a95154
$$ 115799 182032 -101468 189335 196978 364871 153430 119663 158218 301643 39193 -195154
12621b02582C57780j12276r9620J15917f0628K6516B45285i0793j57431E6626
$$ -202582 357780 245504 145884 261801 -60628 -34112 245285 -90793 -248224 56626
12610a09419L4482F2095O0865l9722h2427k00270J00375g2285B66624h6452p5418
$$ -109419 -74937 62095 122960 83238 -82427 -282697 -182322 -72285 266624 -86452 -161870
12599a61870A45138K50555A13397B4260N11734c4784k47620R0006E396a09163
$$ -161870 145138 395693 113397 24260 535994 -34784 -282404 -192398 5396 -109163
12588B7911J03856b3288A35541n3289c7267a6012c38B89869b45769c4634B19224
$$ 27911 131767 -23288 135541 82252 -37267 -16012 -338 289869 -245769 -34634 219224
12576D0652a61641F9735a35771B2988a09614p2213e4761A22253m682l8005a10547
$$ 40652 -161641 69735 -135771 22988 -109614 -181827 -54761 122253 117571 79566 -110547
12564b3504p2858B8866f2264j30271r7855N424H1816c1582A90807R5889A765M8051
$$ -23504 -96362 28866 -62264 -192535 -290390 -284966 81816 -31582 190807 286696 1765 49816
12552D9816J63358J85108b31922M7995j19886a49045d9962C8565K55751a69l00759
$$ 49816 213174 398282 -231922 -183927 -303813 -149045 -49962 38565 294316 -169 -300928
12541c00928a45179C16937a22170F0397e258C42151d57168f3046k52959A35257
$$ -300928 -145179 316937 -122170 60397 -5258 342151 -457168 -63046 -316005 135257
12530a39858c8896B57794b68251A94537m4154K9862a21507b9651A32769i3576
$$ -139858 -38896 257794 -268251 194537 150383 180245 -121507 -29651 132769 -93576
12519A45409Q23B9325J77157d6194B91182A27537k7266C2315e5859m6747A29664
$$ 145409 146232 29325 206482 -46194 291182 127537 100271 32315 -55859 -102606 129664
12507C06446A18013M5980n6652g9266D35638j07143C0092a84490B567K9983P1652
$$ 306446 118013 163993 107341 -79266 435638 328495 30092 -184490 2567 32550 104202
12496A04202c26633a7371A86955a41021B56973i7347E7966K2193c21829B2409
$$ 104202 -326633 -17371 186955 -141021 256973 -97347 57966 80159 -321829 22409
12485a01181A28129K75365a36764B2511e4541A6868O2304a16456K9435q875j99901
$$ -101181 128129 403494 -136764 22511 -54541 16868 79172 -116456 -87021 -95896 -295797
12474b95797D4135A8370a89248f8689A74422b34828h7961F5982b03284K9679q7390
$$ -295797 44135 18370 -189248 -68689 174422 -234828 -87961 65982 -203284 -173605 -260995
12463b60995j43824a26613L1534G417O8537C0127K1459b89412i8340A3165f5638
$$ -260995 -404819 -126613 -95079 7417 75954 30127 51586 -289412 -98340 13165 -65638
12451D3229a44584p6894i887j99615f7043j98522B33612l5694N0898C1131J20670
$$ 43229 -144584 -221478 -9887 -209502 -67043 -265565 233612 197918 248816 31131 151801
12440A51801b8969I0642d5844A67210g6039B61387g1421B21206h6326J4433H4790
$$ 151801 -28969 90642 -45844 167210 -76039 261387 -71421 221206 -86326 -71893 84790
12428F5476J87859a40008q6425C60800a68846P7983l3287A08373K902a32028b942
$$ 65476 253335 -140008 -226433 360800 -168846 -90863 -124150 108373 111275 -132028 -2942
12416E9192b42539A42129K49632b37524o3336A37802e6278J0018k46854B6205
$$ 59192 -242539 142129 391761 -237524 -300860 137802 -56278 -46260 -293114 26205
12405a38713k2507L9384d8012J3677k16A43263a64967m347B37970a19821M8934
$$ -138713 -161220 -121836 -48012 -34335 -34551 143263 -164967 -169314 237970 -119821 -70887
12394g0887j9636A56578J54767j47044J04667a25613B76726J7379D0460N0668
$$ -70887 -90523 156578 311345 164301 268968 -125613 276726 294105 40460 91128
12384I1128g7936B64941r1893a5470I6808m5854Q2891F4909Q4972a35929D4090
$$ 91128 -77936 264941 173048 -15470 96808 50954 133845 64909 149881 -135929 44090
12372A19429L10387a82231k7976A21621L0826M9306H9880h7909H6886J92785d2384
$$ 119429 429816 -182231 -210207 121621 152447 201753 89880 -87909 86886 279671 -42384
12360b74741J02613b1187E8902a87801B08687B2453a86495C04686c42861B23900
$$ -274741 -172128 -21187 58902 -187801 208687 22453 -186495 304686 -342861 223900
12349a35850D4799J44515E3918a60226D2351K4499d8142A36385a52898E711J55225
$$ -135850 44799 189314 53918 -160226 42351 66850 -48142 136385 -152898 5711 160936
12338A60936O611F8779J2013f8754a3985A27327J31129b18505B02604C7297K94792
$$ 160936 167547 68779 80792 -68754 -13985 127327 258456 -218505 202604 37297 332089
12327C32089m5257A11900K09861a89651C53271A9587O1910J84305h9466B62028
$$ 332089 286832 111900 321761 -189651 353271 19587 81497 265802 -89466 262028
12316d4789B84423j26269J51240j6929A08107h0214B18534r6227J28445b6703
$$ -44789 284423 158154 309394 292465 108107 -80214 218534 122307 250752 -26703
12305B97719C7091c74130a72670c3197D2256c1142H4475L91747D3703J6012J7876
$$ 297719 37091 -374130 -172670 -33197 42256 -31142 84475 476222 43703 59715 77591
12294G7591L9795b14575D5176J61522m8607E2229K99014k4360r1136k7899j2267
$$ 77591 117386 -214575 45176 206698 158091 52229 351243 326883 235747 207848 195581
12283A95581f7603K2301D1873d817j17812A59474A6375M46288p4089A45851O6880
$$ 195581 -67603 -45302 41873 -4817 -122629 159474 16375 462663 388574 145851 212731
12272B12731k2753l8549K80992j76411A07704J8709L4537K55432F95K98231J50273
$$ 212731 189978 151429 432421 256010 107704 126413 160950 416382 695 298926 449199
12261D49199A78896L4964A02684n1316c03893H6532b5025A28247E051Q7712e0116
$$ 449199 178896 213860 102684 51368 -303893 86532 -25025 128247 5051 92763 -50116
12249B37233b11826A02141l6150K72113I1758i7775G3181a96637D9800a21987
$$ 237233 -211826 102141 65991 338104 91758 -97775 73181 -196637 49800 -121987
12238E1562A8340L32575a8636j04487B94568d20757a11358B63539d1754o0070
$$ 51562 18340 350915 -18636 -123123 294568 -420757 -111358 263539 -41754 -101824
12228a01824q4128j2651L2527d5798B87421d0965i368D41446i5750A36399K3640
$$ -101824 -185952 -198603 -166076 -45798 287421 -40965 -9368 441446 -95750 136399 160039
12217A60039O3253G6253a64273P2971B15942c0446B22873k816E060h4673B46902
$$ 160039 223292 76253 -164273 -91302 215942 -30446 222873 220057 5060 -84673 246902
12205D35077e4724E3462J93233n2709O6508a25861B84938F6589c8601A57951L47264
$$ 435077 -54724 53462 246695 193986 260494 -125861 284938 66589 -38601 157951 505215
12194E05215B20065q734q6425l9523m2360J23004M0841J53198H1538K99136j03602
$$ 505215 220065 211331 124906 85383 43023 166027 206868 360066 81538 380674 277072
12183B77072J29565A19206O9684J26059d4014G8493g9372C07975A01423C9690
$$ 277072 406637 119206 188890 314949 -44014 78493 -79372 307975 101423 39690
12172C15440j34288L37614H3252L1581O8243N1560J93865i3767I0070J64857K2815
$$ 315440 181152 518766 83252 114833 183076 234636 428501 -93767 90070 254927 277742
12161B77742N8223B0343a25918I4090G917O7873N7782E5872e3332j32536a8255
$$ 277742 335965 20343 -125918 94090 7917 75790 133572 55872 -53332 -185868 -18255
12149H4739i5585B86020b08335e6407C12344I724K4245A1647J64930J81850j0786
$$ 84739 -95585 286020 -208335 -56407 312344 9724 33969 11647 176577 358427 347641
12138C47641D0528L6196c67471B20726A04091m634C0187L53133r4623f3327K1351
$$ 347641 40528 76724 -367471 220726 104091 99457 30187 383320 288697 -63327 -41976
12127d1976B16129J04603D0511M48089D8632j467K89981A67013L18384j28809
$$ -41976 216129 320732 40511 488600 48632 47165 337146 167013 485397 356588
12117C56588A47903A970M04676l0726A27202K57154A06590b42256A91600g5578
$$ 356588 147903 1970 406646 375920 127202 384356 106590 -242256 191600 -75578
12106A21071K43473a07424B75392r4249D5351L08535j5847A44920b00654A64083
$$ 121071 364544 -107424 275392 181143 45351 353886 338039 144920 -200654 164083
12095a56026D58263H1660C8274N2236Q042G02Q464M428K75093A15847P9332p3358
$$ -156026 458263 81660 38274 90510 98552 702 9166 13594 288687 115847 195179 121821
12083A21821J43578a16464L0802E4319a33186N6630A07959a34568A97427p1460
$$ 121821 265399 -116464 -85662 54319 -133186 -76556 107959 -134568 197427 125967
12073A25967n2912b6672A93916b89257o5632a15529B10237J01899c1910o7101
$$ 125967 73055 -26672 193916 -289257 -354889 -115529 210237 312136 -31910 -99011
12063i9011l2804A05430R136c95012C55548A69108j7947m9532d9399o4343M8959
$$ -99011 -131815 105430 114566 -395012 355548 169108 151161 101629 -49399 -113742 -64783
12052f4783j6111K726D82030c843D6815h1300C737J66761A2147a5358g345C05505
$$ -64783 -80894 -78168 482030 -3843 46815 -81300 3737 170498 12147 -15358 -7345 305505
12039c558n1885j5666H4976a23641E0032K62892D2769g7753I7419c9081B3981
$$ -3558 -55443 -71109 84976 -123641 50032 312924 42769 -77753 97419 -39081 23981
12027h0663p8321f8077B36267l0802h1071H8172K21766L296j39449B571a78769
$$ -80663 -158984 -68077 236267 205465 -81071 88172 309938 313234 173785 2571 -178769
12015e7278F2119J66198H5533N21517k86908O1474g8544j81129I95b0054B21875
$$ -57278 62119 228317 85533 607050 320142 381616 -78544 -259673 995 -20054 221875
12003C42233j11713e2166p8567l8092I8173e3008C01773a48978j36584J7502b9156
$$ 342233 230520 -52166 -130733 -168825 98173 -53008 301773 -148978 -285562 -268060 -29156
11991B34823b05129D9457c3608G2641b26805F5401d2754D6974j3052f9373j05772
$$ 234823 -205129 49457 -33608 72641 -226805 65401 -42754 46974 33922 -69373 -175145
11980a75145L1796A84593a66077j08209a21666J9849B1474J87313M1569h2174
$$ -175145 -143349 184593 -166077 -274286 -121666 -101817 21474 208787 250356 -82174
11969A62563Q4757D1536b59540f3812A82585b55946I6423c73163h9254F9769J24338
$$ 162563 247320 41536 -259540 -63812 182585 -255946 96423 -373163 -89254 69769 194107
11958A94107b6029j30389B64285Q4369I2009c3489J0382j2581B07497b94311N9635
$$ 194107 -26029 -156418 264285 348654 92009 -33489 -23107 -35688 207497 -294311 -234676
11947b34676k4957M1124K6704f0232j64702Q0792P1495B63271A16727B1987o168
$$ -234676 -259633 -218509 -191805 -60232 -224934 -144142 -72647 263271 116727 21987 15819
11936A5819N2981J10292i3767D8721R03f6538n4189A73602d711B02133E9888J9489
$$ 15819 68800 179092 -93767 48721 49624 -66538 -120727 173602 -4711 202133 59888 79377
11924G9377E568a03510j32250A575J33703M489a36784a4378k84973A00856d7299
$$ 79377 5568 -103510 -235760 1575 135278 139767 -136784 -14378 -299351 100856 -47299
11912I6306a82811k7687A69837L4006f0873k09206A06362d47768a90128F8199
$$ 96306 -182811 -210498 169837 203843 -60873 -270079 106362 -447768 -190128 68199
11901B29240D0650J20820o3658b9941l3452l7116C56534f2833I0395J10049K2682
$$ 229240 40650 161470 97812 -29941 -63393 -100509 356534 -62833 90395 200444 223126
11890B23126h5315j0298m7314n056o3280f5200r9488M2565F9090R4883g2408j22829
$$ 223126 -85315 -95613 -142927 -147983 -211263 -65200 -164688 -122123 69090 163973 -72408 -195237
11878a95237Q5491m5821H3107a03759p501o5450M6723B05420b21465c1179j98220
$$ -195237 -109746 -155567 83107 -103759 -111260 -176710 -129987 205420 -221465 -31179 -229399
11867b29399f2765A6141e5672p4170J772A13642a12061e0861g693o072I3167n12
$$ -229399 -62765 16141 -55672 -129842 -128070 113642 -112061 -50861 -7693 -13765 93167 92655
11855I2655M7566i5335B74739e617r4948B8358O9971k8918g4300j16085B39483
$$ 92655 140221 -95335 274739 -5617 -100565 28358 98329 69411 -74300 -190385 239483
11843e3035q9637A41917c17815j45495b8242B13613f7203R247m0912a4288j72872
$$ -53035 -142672 141917 -317815 -463310 -28242 213613 -67203 -57956 -98868 -14288 -187160
11832a87160b0003l83220A56167b71796a33336C4606b79067j52994B88341d14203
$$ -187160 -20003 -403223 156167 -271796 -133336 34606 -279067 -432061 288341 -414203
11821g593F1273a24241j20307k2074A69191g6417j85270H4966j8205a94133A10713
$$ -7593 61273 -124241 -244548 -266622 169191 -76417 -261687 84966 66761 -194133 110713
11809A89151e3683q419N463P721B78016E3867g4154p1904F2652b77010E06815
$$ 189151 -53683 -62102 -56639 -48918 278016 53867 -74154 -146058 62652 -277010 506815
11797c17660C1144i0151I0135a95237A32316g445m8376h768E4979c22834f8457
$$ -317660 31144 -90151 90135 -195237 132316 -7445 -55821 -8768 54979 -322834 -68457
11785f1013j39823A11664a08380B45849a1235A1928a15043M6381B80156D804K1518
$$ -61013 -200836 111664 -108380 245849 -11235 11928 -115043 -68662 280156 4804 26322
11774B6322c05007p4193d7589A93928j8428c33411i0528H6190c71431A60636e5233
$$ 26322 -305007 -379200 -47589 193928 175500 -333411 -90528 86190 -371431 160636 -55233
11762A47096M2174d6955q3892A74852a6946k89580g7490j69521L4717Q9351B81164
$$ 147096 189270 -46955 -130847 174852 -16946 -306526 -77490 -247011 -212294 -122943 281164
11750A53589b81064G7778a8192I1746a50623j23417A36152J09675E0354I566h9161
$$ 153589 -281064 77778 -18192 91746 -150623 -274040 136152 245827 50354 9566 -89161
11738c5653j33924A51188F2247k3891J53397n695e9180A49702A1966O8396J6303
$$ -35653 -169577 151188 62247 38356 191753 186058 -59180 149702 11966 80362 96665
11727I6665K49236a98609A89659o1266a33496e9029G0295K54050a37070B29458
$$ 96665 345901 -198609 189659 128393 -133496 -59029 70295 324345 -137070 229458
11716e0204F4088K1775b4400A44114B5609R1794D1094c54920D2445J41746B9328
$$ -50204 64088 85863 -24400 144114 25609 117403 41094 -354920 42445 184191 29328
11704c7684D36513a1686D5390J44557G9349J95583a34328l2441L8444A69537g3567
$$ -37684 436513 -11686 45390 189947 79349 274932 -134328 -166769 -128325 169537 -73567
11692B80325A30942i1823B18937l1547G6582J52908g6754l9879o4605D927a88756
$$ 280325 130942 -91823 218937 187390 76582 229490 -76754 -116633 -181238 4927 -188756
11680A70935n4533f7635o4913c0000A17736f4709C2467a9906D6335a34127M1212
$$ 170935 116402 -67635 -132548 -30000 117736 -64709 32467 -19906 46335 -134127 -92915
11669i2915e095j61165Q0135b9426C20283B3781K3113a46501j98539A13347L743
$$ -92915 -5095 -166260 -86125 -29426 320283 23781 46894 -146501 -345040 113347 117090
11658A17090J2197J52456j37625k3343C8087a00074D0489b69879i7832A77735
$$ 117090 129287 281743 144118 120775 38087 -100074 40489 -269879 -97832 177735
11647B58926d9704j03542A86608d9788k80224B2064b9854j13406E4385b29425
$$ 258926 -49704 -153246 186608 -49788 -330012 22064 -29854 -143260 54385 -229425
11636a08058A40564b12474f3093q4655G3772K1905i2021A41070d4228A25173M242
$$ -108058 140564 -212474 -63093 -147748 73772 95677 -92021 141070 -44228 125173 129415
11625A29415d5562j67737i5326B9389J10615J93570D7478i0340j04319L9190l27685
$$ 129415 -45562 -213299 -95326 29389 140004 333574 47478 -90340 -194659 -155469 -483154
11614d83154A48987f0778J6231j48321O1082j15327O5848A29467O3510g2535A22553
$$ -483154 148987 -60778 -44547 -192868 -131786 -247113 -181265 129467 192977 -72535 122553
11602b9398k9258o4322k9961C0729i1190A56847b82998j1166I4834a14538D37009
$$ -29398 -58656 -122978 -152939 30729 -91190 156847 -282998 -294164 94834 -114538 437009
11590G9959j9181a34388C2242J52976n7977h727A00221L86065B06398k5115b51135
$$ 79959 60778 -134388 32242 185218 127241 -8727 100221 486286 206398 181283 -251135
11578B30458I8268Q6020q741o3135J77724j40177D0913c6570k61502A76577a01024
$$ 230458 98268 184288 175547 112412 290136 149959 40913 -36570 -298072 176577 -101024
11566A09374m1777a13402B83205R294R229M988a37092N1192C25393a48713F4121
$$ 109374 67597 -113402 283205 292499 301728 306716 -137092 -85900 325393 -148713 64121
11554C0175K8552O8545J25985B5776c2097j11758A6280b9773C7833f278C45580
$$ 30175 58727 127272 253257 25776 -32097 -143855 16280 -29773 37833 -6278 345580
11542C53931c4758j32887a9191B74600M0155j31878H4339M6821d966o8543E1914
$$ 353931 -34758 -167645 -19191 274600 314755 182877 84339 131160 -4966 -73509 51914
11530A8343L19004i5879q8189H7328k4381j8270L1051L200g2509H4756N7920o9833
$$ 18343 337347 -95879 -184068 87328 62947 44677 75728 78928 -72509 84756 142676 72843
11518G2843f4507C6550K62802b87922E7655M64131A58212L03217d9619j61553
$$ 72843 -64507 36550 299352 -287922 57655 521786 158212 461429 -49619 -211172
11508b11172C45951G4496J21453E459R4171B8574O8672f5483F7997d6782C97531
$$ -211172 345951 74496 195949 5459 99630 28574 97246 -65483 67997 -46782 397531
11496f4136B52202j06292Q9055F176L18437A02528a18996F6536J71630n6566J88848
$$ -64136 252202 145910 234965 6176 324613 102528 -118996 66536 238166 181600 370448
11485C70448A50859e4496B75302A8678i8748a2388I5593E731K12031B7699J91590
$$ 370448 150859 -54496 275302 18678 -98748 -12388 95593 5731 217762 27699 219289
11474B19289a52453A71575b65281d1085B49169b2448A1776n135J20345L1700b3224
$$ 219289 -152453 171575 -265281 -41085 249169 -22448 11776 6641 126986 158686 -23224
11462a25207q8879D67431A38207Q1352B1343J17364l4698J38880d1804k52413
$$ -125207 -214086 467431 138207 219559 21343 138707 104009 242889 -41804 -294217
11452b94217C70701f8117A26586a55505Q996A93906a09133c2120j00450G3529
$$ -294217 370701 -68117 126586 -155505 -146509 193906 -109133 -32120 -132570 73529
11441a89710E09330a63171A72025J91454b1599A21177L2244a906C44502G8260
$$ -189710 509330 -163171 172025 363479 -21599 121177 153421 -1906 344502 78260
11430G4047Q5549J57759g8595A00879J18848a08861l0183L6704J4747j7493A69993
$$ 74047 159596 317355 -78595 100879 219727 -108861 -139044 -102340 -87593 -105086 169993
11418B345b69312A09532J20153r2675b79616B55662a246o7556K9441D392c08199
$$ 2345 -269312 109532 229685 137010 -279616 255662 -1246 -68802 -39361 4392 -308199
11406B59714c02832a31292C60141A31912h4648B38121c9765B31520g8938A90848
$$ 259714 -302832 -131292 360141 131912 -84648 238121 -39765 231520 -78938 190848
11395A23486J29548a06633A41112C0162Q3360g7274j41881a5885o1635E4829L0
$$ 123486 253034 -106633 141112 30162 113522 -77274 -219155 -15885 -77520 54829 54859
11384E4859a8801R137n6171j8743B37883F2408N3013J20773q4565J13070a14979
$$ 54859 -18801 -9664 -65835 -84578 237883 62408 115421 236194 151629 264699 -114979
11372c10372I0845c61950H1697a95157d3546p8261j51835K0009a12239B63881
$$ -310372 90845 -361950 81697 -195157 -43546 -121807 -273642 -253633 -112239 263881
11361h4828a426A45652E9395J67885N3950h1894C6645a76705B3619a83694C6862
$$ -84828 -1426 145652 59395 227280 281230 -81894 36645 -176705 23619 -183694 36862
11349d0660G7501c2778j31170B60305i5515B99193H0332J08701f5462B50360F472
$$ -40660 77501 -32778 -163948 260305 -95515 299193 80332 189033 -65462 250360 6472
11337e2954C00766g8830n6768F3273O2627O7881b9885A11252a94556A43659c1021
$$ -52954 300766 -78830 -135598 63273 125900 193781 -29885 111252 -194556 143659 -31021
11325C50694g24n1673I1034C9572L4440k6463J00409d36694a50724A37694J64302
$$ 350694 -724 -52397 91034 39572 74012 47549 147958 -436694 -150724 137694 301996
11314C01996A914e4486B85780c9303j16279j07085A27093A0352K68104d4952A4732
$$ 301996 1914 -54486 285780 -39303 -155582 -262667 127093 10352 278456 -44952 14732
11302A5283L1347J04229a14204h831A53776b02569h8536q7685J8720c0668j48270
$$ 15283 46630 150859 -114204 -8831 153776 -202569 -88536 -176221 -157501 -30668 -178938
11291a78938A05842K62075a11197M1924B105i4434c1521j56741r8703A81254i0088
$$ -178938 105842 367917 -111197 -69273 2105 -94434 -31521 -188262 -286965 181254 -90088
11279d2618A4411M5097b21796O9978A8937K16556b91123F181J64098a63286G8101
$$ -42618 14411 59508 -221796 -151818 18937 235493 -291123 6181 170279 -163286 78101
11267g0306A74953D6054J44416f8185q5342j85158a69084B6210h0895B0697d0963
$$ -70306 174953 46054 190470 -68185 -153527 -338685 -169084 26210 -80895 20697 -40963
11255B99123a3045k64511d9594J5270k24837A1967b70821B74436j34103g5804
$$ 299123 -13045 -277556 -49594 -34324 -259161 11967 -270821 274436 140333 -75804
11244a31358J6406l7011j9240B27988F9551M2420J19951f6792j72358g4275m621
$$ -131358 -114952 -151963 -171203 227988 69551 111971 231922 -66792 -239150 -74275 -78896
11233g8896j00640j09361A27224D788c9146j10016j22288c3610B6347L060a06204
$$ -78896 -179536 -288897 127224 4788 -39146 -149162 -271450 -33610 26347 29407 -106204
11221e6672A3448b2165B77669A20004a70324H669M0431g7644C4136J85535b4738
$$ -56672 13448 -22165 277669 120004 -170324 8669 49100 -77644 34136 219671 -24738
11209a23187j04350q3544i973j01000q9313f8369J7788q6155l5819C1222a29648
$$ -123187 -227537 -311081 -9973 -110973 -200286 -68369 -50581 -136736 -172555 31222 -129648
11197H4415R2125C8681b84486p3814Q6409n121E848J63138a94794g7778l11851
$$ 84415 176540 38681 -284486 -358300 -271891 -277012 5848 168986 -194794 -77778 -389629
11186c89629a58607k38651a29012m82114b69740g9209o0366b6510l48241M1318
$$ -389629 -158607 -397258 -129012 -611126 -269740 -79209 -139575 -26510 -374751 -333433
11176c33433Q1343n2291A84426c09016G0006r004a39628k03472A10294a75045
$$ -333433 -252090 -304381 184426 -309016 70006 61002 -139628 -343100 110294 -175045
11165D7348P9110e3637b2147j92223M4440A36008J0742C818a52248f1038A71693
$$ 47348 126458 -53637 -22147 -214370 -169930 136008 146750 3818 -152248 -61038 171693
11153C21322j52149b00651b4062j9261o4693c8242j48221B71032a35555J2433
$$ 321322 169173 -200651 -24062 -43323 -108016 -38242 -186463 271032 -135555 -123122
11143a23122o1198p2564E3797N0112m9133K03522D1870b27050a9762j03097j27182
$$ -123122 -184320 -256884 53797 103909 54776 258298 41870 -227050 -19762 -122859 -250041
11132b50041h1520B71112h3169K5513a7915j29322E8550h550B15829O9720D8910
$$ -250041 -81520 271112 -83169 -57656 -17915 -147237 58550 -8550 215829 285549 48910
11120e0314C6147P0810l1217J97448G3683J1046J78765k1194B8514J71992G1525
$$ -50314 36147 106957 75740 273188 73683 84729 263494 242300 28514 200506 71525
11108A32985M0848a12158A09867b37726H511K05829K82520A77840A3860K9839
$$ 132985 173833 -112158 109867 -237726 8511 214340 496860 177840 13860 43699
11098D3699b7711C71520c03872h2769H3047l2036P9205n5923a04558D6053d1846
$$ 43699 -27711 371520 -303872 -82769 83047 51011 130216 74293 -104558 46053 -41846
11086A1251J15744a9005C87270A77103F1881K04563J3257p1753A9425i0797B60892
$$ 11251 126995 -19005 387270 177103 61881 266444 279701 207948 19425 -90797 260892
11074C51029L8913K2252j03268r3288K1700G6788J67496n1513K23744A23325J7018
$$ 351029 389942 412194 308926 215638 237338 76788 244284 192771 416515 123325 140343
11063A40343K84920J03262B15674J2823K98409O3900k17954K39519J20635j77165
$$ 140343 425263 528525 215674 228497 526906 590806 372852 612371 733006 555841
11053E55841R7133n5719j35553J63601k43941M02165P2632q1863k29692O6125
$$ 555841 652974 597255 461702 625303 381362 783527 856159 774296 544604 610729
11043F10729K9120B87086J74179l8452K88676C24031O78341o6284m27670K00456
$$ 610729 639849 287086 461265 422813 711489 324031 1002372 936088 508418 708874
11033G08874j82879j57445K02210Q4809J89798k43461J38504j74594J4949n6683
$$ 708874 525995 368550 570760 655569 845367 601906 740410 565816 580765 524082
11023E24082L41177j77582j70420M1736o2628J13007o6129B38940K59373J55513
$$ 524082 865259 687677 517257 558993 496365 609372 543243 238940 498313 653826
11013F53826q7724P033o3884N5906J641q2615J67012B16823K34444K10629j34551
$$ 653826 566102 573135 509251 565157 566798 484183 651195 216823 451267 661896 527345
11002E27345o7859K95788B78146L42043j11500L11091k70889J22583k44515j97518
$$ 527345 459486 755274 278146 620189 508689 819780 548891 671474 426959 229441
10992B29441K75813K36292q4101j06452j25262J74377N384J24261O6297k06311
$$ 229441 505254 741546 657445 550993 425731 600108 605492 729753 796050 589739
10982E89739k926L6290j9882L18459J12025j68730J01146J54303j55262L39257
$$ 589739 586813 623103 603221 921680 1033705 864975 966121 1120424 965162 1304419
10972A304419O02630r6468O0403J57379J40276J46016k45138L00597n99353k48044
$$ 1304419 1907049 1810581 1870984 2028363 2168639 2314655 2069517 2370114 1770761 1522717
10962A522717L6111j78695l20662J90031M2963k5069K24461q6748J67983K16736
$$ 1522717 1558828 1380133 1059471 1249502 1292465 1267396 1491857 1405109 1573092 1789828
10952A789828j28160j68486k47996J22290j59128j59888J93922n64478Q7613l70489
$$ 1789828 1661668 1493182 1245186 1367476 1208348 1048460 1242382 677904 765517 395028
10942C95028J58363F8600L7227M84283j90709n0250b8180C0875b06339H3982J74292
$$ 395028 553391 68600 105827 590110 399401 349151 -28180 30875 -206339 83982 258274
10931B58274B9913J80076K07286a30220E836M43733a8437B82113a76820M9454
$$ 258274 29913 209989 417275 -130220 5836 449569 -18437 282113 -176820 -127366
10921a27366A2688D079J01207J14292B3207b79745C3383J00743K4869n9513g9836
$$ -127366 12688 4079 105286 219578 23207 -279745 33383 134126 158995 99482 -79836
10909c50208A05478a46022O5486L9595r0662A84315J53153c4109A37721b62976
$$ -350208 105478 -146022 -80536 -40941 -131603 184315 337468 -34109 137721 -262976
10898b0616o710B21269C1454A152d7775k33905a17320A10220A0056e8023K0371
$$ -20616 -27326 221269 31454 1152 -47775 -281680 -117320 110220 10056 -58023 -37652
10887c7652j72140f4000j10925H6731K01910A9315J52852g6280j11845R1284l72404
$$ -37652 -209792 -64000 -174925 86731 288641 19315 172167 -76280 -188125 -96841 -469245
10876d69245f0874j41787G5101a14766j86046M5427J00527A13730a89621A062
$$ -469245 -60874 -202661 75101 -114766 -300812 -255385 -154858 113730 -189621 1062
10865c7370q9078A28326E2451a77792a587F0867b75881A20409h6288l1069j87669
$$ -37370 -126448 128326 52451 -177792 -1587 60867 -275881 120409 -86288 -117357 -305026
10854c05026I5139b1585k88182M4158a17695o4319A44779E2806g8488A6761L14360
$$ -305026 95139 -21585 -309767 -265609 -117695 -182014 144779 52806 -78488 16761 331121
10843C31121a39048B34827r8294l6493J6561b81859N3862h0362C6701a58952e4215
$$ 331121 -139048 234827 136533 100040 116601 -281859 -227997 -80362 36701 -158952 -54215
10831c49207B77061a70242D7502J68089m7622a856A46580L0578b33600j3675J7761
$$ -349207 277061 -170242 47502 215591 167969 -1856 146580 177158 -233600 -247275 -229514
10820b29514F2628d93278e9134A12457K3417c26439B57635G4382b10041L4727
$$ -229514 62628 -493278 -59134 112457 135874 -326439 257635 74382 -210041 -175314
10810a75314D478L30635j07274B6704L0020a60711p4089g0429A93546H7133a32796
$$ -175314 4478 335113 227839 26704 56724 -160711 -234800 -70429 193546 87133 -132796
10798b03742a0591j42548P1543B59464C1595q452a58437j64365J16216A32611
$$ -203742 -10591 -153139 -81596 259464 31595 23143 -158437 -322802 -206586 132611
10787A25318b56978a25314p0428p8722a09065A25194b7713C2373B648a41406f6282
$$ 125318 -256978 -125314 -195742 -274464 -109065 125194 -27713 32373 2648 -141406 -66282
10775b85732N8233a7439k77725f2099p6158j1343B68229B054b1876j19768d2000
$$ -285732 -227499 -17439 -295164 -62099 -138257 -149600 268229 2054 -21876 -141644 -42000
10763h6140g404C82039B6440K3099a87258G3496b41408l1484D8394d3667l9919
$$ -86140 -7404 382039 26440 49539 -187258 73496 -241408 -272892 48394 -43667 -83586
10752h3586B7858d8329b3628k88428E7341Q3239c21044Q3158e7968k39230a17815
$$ -83586 27858 -48329 -23628 -312056 57341 140580 -321044 -237886 -57968 -297198 -117815
10740E9337a88691A18593M6878a13029c0885J0146E220c44600J47824C9896e8062
$$ 59337 -188691 118593 165471 -113029 -30885 -20739 5220 -344600 -196776 39896 -58062
10728D7787P3978k2391f5559o5080r1445L2034b6525A70058b64043H7383K3419
$$ 47787 121765 99374 -65559 -130639 -222084 -190050 -26525 170058 -264043 87383 110802
10717A10802a42271j22262H9312a13130A36972g9274n3011o6798b2932d399C230
$$ 110802 -142271 -264533 89312 -113130 136972 -79274 -132285 -199083 -22932 -4399 3230
10705C3237h7409j3977K2703B0646a32454A72698d4276J4451C6468c24359J41255
$$ 33237 -87409 -101386 -78683 20646 -132454 172698 -44276 -29825 36468 -324359 -183104
10694a83104o8263A94955K64606j88157c4326j6657l17487J58299b5957j55789
$$ -183104 -251367 194955 459561 271404 -34326 -50983 -368470 -210171 -25957 -181746
10684a81746D9537c02005k5423d8858j09573e2656l40747A73199J5615a3629E7541
$$ -181746 49537 -302005 -327428 -48858 -158431 -52656 -393403 173199 188814 -13629 57541
10672a61037A45402B2018J52567b05932B76591g6228B310a46826L3479k89661
$$ -161037 145402 22018 174585 -205932 276591 -76228 2310 -146826 -113347 -403008
10662d03008B55926E1861b79768F9784b73674N8333E0751N7300i0418A0470c56958
$$ -403008 255926 51861 -279768 69784 -273674 -215341 50751 108051 -90418 10470 -356958
10650A41877c15495J42356f68A55610c08947j2325a34893e8832j63175g4419o3557
$$ 141877 -315495 -173139 -668 155610 -308947 -321272 -134893 -58832 -222007 -74419 -137976
10639a37976B34866b49909a24087b2450A43723o6367C1533K93360A02926a75210
$$ -137976 234866 -249909 -124087 -22450 143723 77356 31533 324893 102926 -175210
10628c83516g3157j72380O7831j16649I0916J33702P776C4058J79338N3213G3706
$$ -383516 -73157 -245537 -177706 -294355 90916 224618 232394 34058 213396 266609 73706
10616B09862i4007H9829a10077C5820b94989e8362j93593D8230J62364I2990b41739
$$ 209862 -94007 89829 -110077 35820 -294989 -58362 -251955 48230 210594 92990 -241739
10604b11623q4146c8089j78537F6732h0999m5124j87849j17833E3012O9881n0423
$$ -211623 -295769 -38089 -216626 66732 -80999 -126123 -313972 -431805 53012 122893 72470
10593G2470a61963f3568D9209a83226j15820A35760b85024P0572i8547j2798e2261
$$ 72470 -161963 -63568 49209 -183226 -299046 135760 -285024 -214452 -98547 -111345 -52261
10581f3116A89618i0244L5088B46795b7748A38579a65012P4521r6741F3929b33095
$$ -63116 189618 -90244 -55156 246795 -27748 138579 -165012 -90491 -187232 63929 -233095
10569c56044a35470c3751p9678k15434A14258a00534A60529b50040i8540D7462
$$ -356044 -135470 -33751 -113429 -328863 114258 -100534 160529 -250040 -98540 47462
10558a6459j49542A5367J22932b90577D9473f1540F9618J10591a252j55839B178
$$ -16459 -166001 15367 138299 -290577 49473 -61540 69618 180209 -1252 -157091 2178
10546B30578G8008d4789D3785P0221g7931d072l94027d2111H3951a46856B48594
$$ 230578 78008 -44789 43785 114006 -77931 -4072 -398099 -42111 83951 -146856 248594
10534a76105L6410o3887k7383I692a01688E4821c8891c916l75683J10540A18634
$$ -176105 -139695 -203582 -230965 9692 -101688 54821 -38891 -3916 -379599 -269059 118634
10522b7637n9297K8634k70980C96631b92767J11528j87657a31848r8270A32078
$$ -27637 -86934 -58300 -329280 396631 -292767 -181239 -368896 -131848 -230118 132078
10511E7652J72906a62990L6550e710m42292e0336j49068Q2946A2403a79491N2268
$$ 57652 230558 -162990 -126440 -5710 -448002 -50336 -199404 -116458 12403 -179491 -127223
10500a27223B36858p1778l5042d7535C82586A29610a56663b8232B24945c27596
$$ -127223 236858 165080 130038 -47535 382586 129610 -156663 -28232 224945 -327596
10489A50021K31693A40696D052O3665J92519b97949B8577b38947d5091A95971
$$ 150021 381714 140696 4052 67717 260236 -297949 28577 -238947 -45091 195971
10478A8610i3611j05526E28673k29665K69615j57612B4806J88073k7419K5846
$$ 18610 -93611 -199137 528673 299008 568623 411011 24806 212879 185460 211306
10468B11306n139a26141d1599A57763b02350g7343c8498k11394a18982E4981a97722
$$ 211306 206167 -126141 -41599 157763 -202350 -77343 -38498 -249892 -118982 54981 -197722
10456A2559f2752j31993j6709f1076A4270J02825b82874a10020d7376A88745e4251
$$ 12559 -62752 -194745 -211454 -61076 14270 117095 -282874 -110020 -47376 188745 -54251
10444b71114d8396D1106N8493c1362B55501H3066a43998K3498j36263D4369d2160
$$ -271114 -48396 41106 99599 -31362 255501 83066 -143998 -120500 -256763 44369 -42160
10432H2136c07327h7368j93114A54488b65922A52947b60064g740A43610h551o9692
$$ 82136 -307327 -87368 -280482 154488 -265922 152947 -260064 -7740 143610 -8551 -78243
10421g8243B44731r0977M6117G8247a59482f2492n2481L6420B6871L7047e5930
$$ -78243 244731 153754 199871 78247 -159482 -62492 -114973 -78553 26871 63918 -55930
10409F0672J32512c7820A38368j5366J93285b52702g5242l17682a84656d4545
$$ 60672 193184 -37820 138368 123002 316287 -252702 -75242 -392924 -184656 -44545
10398G4301a05094j06826H039P9364a4338q8697A38913c64754C60673C4202L9953
$$ 74301 -105094 -211920 8039 87403 -14338 -103035 138913 -364754 360673 34202 74155
10387G4155m817a62510B35105Q383F1096c18616A30697A83J85548O5031a06358
$$ 74155 69338 -162510 235105 243488 61096 -318616 130697 183 185731 250762 -106358
10375A1339i3026F3949L0361O7270J9404q9611K44775A37904I010L38644A64111
$$ 11339 -93026 63949 94310 161580 180984 91373 336148 137904 9010 347654 164111
10363B37681L60998A88637K19718j72181K32615A78709e4888D88935H5223M1553
$$ 237681 598679 188637 408355 236174 468789 178709 -54888 488935 85223 126776
10353A26776L31200G6910a06608D9998M24318j84950J85976B25974a97627F6313
$$ 126776 457976 76910 -106608 49998 474316 289366 475342 225974 -197627 66313
10342B49640O8941O7766B3422K61469g952k1946j15768C90263G867J98486A462
$$ 249640 318581 386347 23422 284891 -7952 -29898 -145666 390263 7867 206353 1462
10330H6606M2927J16126a26096L3942A03401k930K22828b85200B16494i9530C60720
$$ 86606 129533 245659 -126096 -92154 103401 100471 323299 -285200 216494 -99530 360720
10318I2287P5731a48250G9530K11769b43721B03526K14939h336B46475r7191B4850
$$ 92287 168018 -148250 79530 291299 -243721 203526 418465 -8336 246475 149284 24850
10306A65884J39046b20380O0900K7588L4999A9440b02923B4693L4127J00778m3110
$$ 165884 304930 -220380 -159480 -131892 -96893 19440 -202923 24693 58820 159598 116488
10295A16488a48037a8559B28821d2442C81085A2395b66100C00627g7602n7374
$$ 116488 -148037 -18559 228821 -42442 381085 12395 -266100 300627 -77602 -134976
10285a34976o0908A9418K33015a69561j39996d8881r3203D0169d9745j30604j85843
$$ -134976 -195884 19418 252433 -169561 -309557 -48881 -142084 40169 -49745 -180349 -366192
10274c66192a69093B92779a09299J1100j02273L8753P8265M574G5480J2022K35405
$$ -366192 -169093 292779 -109299 -98199 -200472 -161719 -83454 -78880 75480 87502 322907
10263C22907i5499K6058J039p829K8982J851p8717r3279C53522A19123a5755B79999
$$ 322907 -95499 -69441 -68402 -76231 -47249 -45398 -124115 -217394 353522 119123 -15755 279999
10250a02679B26067J56643I8992l5034b64509P0349B10159a23837o3482A99950
$$ -102679 226067 382710 98992 63958 -264509 -194160 210159 -123837 -187319 199950
10239F9942K42912a80228g6887R436A5013R8132E0729a16179k44418e768o486
$$ 69942 312854 -180228 -76887 -67451 15013 113145 50729 -116179 -360597 -5768 -12254
10228a2254B90106B7824a33807e8428A64466c68845f7526m7551j87695e8815o7888
$$ -12254 290106 27824 -133807 -58428 164466 -368845 -67526 -115077 -302772 -58815 -126703
10217a26703B65285H7012a50709B05150a4575A25006c04076I8336q642J04100
$$ -126703 265285 87012 -150709 205150 -14575 125006 -304076 98336 89694 193794
10207A93794C673J42049b65322E6533J2334b81472E1135e451B61065a70055N1488
$$ 193794 3673 145722 -265322 56533 68867 -281472 51135 -5451 261065 -170055 -118567
10196a18567m6131g7569L0625C0044M1882a20456j15765B58261e4501o806j17283
$$ -118567 -164698 -77569 -46944 30044 71926 -120456 -236221 258261 -54501 -61307 -178590
10185a78590h7968j19247f0495B60406a03564B40692e8985n4417j10954c7094
$$ -178590 -87968 -207215 -60495 260406 -103564 240692 -58985 -113402 -224356 -37094
10174F7014P2790a67688N0289B09935a12891j24595c0849q0602L2905m3425f0299
$$ 67014 139804 -167688 -117399 209935 -112891 -237486 -30849 -111451 -78546 -121971 -60299
10162b70875A8669d7069A50674a84711I3449c03040g6550k08064j9151a05144
$$ -270875 18669 -47069 150674 -184711 93449 -303040 -76550 -284614 -303765 -105144
10151b0594F1491k8272g8788k97886a3949G6865J84479p9341a85007n8997B1072
$$ -20594 61491 33219 -78788 -376674 -13949 76865 261344 182003 -185007 -244004 21072
10139A42744M7591a46063B09212J6355C8027a66294e0485q0535c6998j35676A23091
$$ 142744 190335 -146063 209212 225567 38027 -166294 -50485 -131020 -36998 -172674 123091
10127A50915a60482A5429M5065a41902j9492c9543p9526Q31K307a5449p3936j8447
$$ 150915 -160482 15429 60494 -141902 -161394 -39543 -119069 -118238 -115931 -15449 -89385 -107832
10115a07832A8158c6260k11255J1984A86684g1j97709j08464h2322D2727c09633
$$ -107832 18158 -36260 -247515 -235531 186684 -71 -197780 -306244 -82322 42727 -309633
10103g1532H0175N2199f4491o9938n5990h2958E7743f3075j68939B03077E844
$$ -71532 80175 132374 -64491 -134429 -190419 -82958 57743 -63075 -232014 203077 5844
10091a8572k7920j73515D1054a00320A38584d6002l17401F9305b08312G4164C3385
$$ -18572 -46492 -220007 41054 -100320 138584 -46002 -363403 69305 -208312 74164 33385
10079A5542a29761D1826a65840K5871C55050a4871j61604c5910k8825k8198j5740
$$ 15542 -129761 41826 -165840 -139969 355050 -14871 -176475 -35910 -64735 -92933 -108673
10068a08673J872b8479B09093p2801B0730a24039G3507a26381o2069i3710A15548
$$ -108673 -106801 -28479 209093 136292 20730 -124039 73507 -126381 -188450 -93710 115548
10056g794m37353A36511E165f6246j04487j47162J40286g0640A08904J31596d8255
$$ -7794 -445147 136511 5165 -66246 -170733 -317895 -177609 -70640 108904 240500 -48255
10044b69633J04388A11278a83122A67481b3449I833a54952b3725n1419k02570
$$ -269633 -165245 111278 -183122 167481 -23449 9833 -154952 -23725 -75144 -277714
10034b77714f296A12133b4575b070m23661A05437b5634A41436a83880F22c6571
$$ -277714 -6296 112133 -24575 -2070 -425731 105437 -25634 141436 -183880 622 -36571
10022g5817C2730J01624a50895n2349D4587a37632A8006J35564F4189q309a19711
$$ -75817 32730 134354 -150895 -203244 44587 -137632 18006 153570 64189 55880 -119711
10010B23671a17559Q840l03048J84122A64678b56673F5840a0388B1218K1868J93041
$$ 223671 -117559 -108719 -411767 -227645 164678 -256673 65840 -10388 21218 43086 236127
9999B36127a29024E6157a56951j92678a21287J753m9360G8464R888c58865M6605
$$ 236127 -129024 56157 -156951 -349629 -121287 -119534 -168894 78464 88352 -358865 -312260
9988c12260J51101c9215p4223F4751B186b66443J28609B00974d7129G9945B5497
$$ -312260 -161159 -39215 -113438 64751 2186 -266443 -137834 200974 -47129 79945 25497
9976h367l22208J52455A14950J45379r4358c4574n25973i4318c1677r5335r2124
$$ -8367 -330575 -178120 114950 260329 165971 -34574 -560547 -94318 -31677 -127012 -219136
9965b19136o0642F4332B0500c5055k00923j0975b2182j36647d8275I3785a06939
$$ -219136 -279778 64332 20500 -35055 -235978 -246953 -22182 -158829 -48275 93785 -106939
9953H0026e164H1456c11639f047j23883l66440c1525H894a62832n7377m3324J19820
$$ 80026 -5164 81456 -311639 -6047 -129930 -496370 -31525 8894 -162832 -220209 -263533 -143713
9941a43713j9605E6473J2412g7021r560n668j64130C42114c30023e186C6806f2368
$$ -143713 -163318 56473 68885 -77021 -86581 -92249 -256379 342114 -330023 -5186 36806 -62368
9928b2952E7354a01863b5424q8431A04985D7925b77271A54819c29464k6241d6348
$$ -22952 57354 -101863 -25424 -113855 104985 47925 -277271 154819 -329464 -355705 -46348
9916a1052l0431A42136E6134I594i8374l1556j68519A13708J07005b15258e2967
$$ -11052 -41483 142136 56134 9594 -98374 -129930 -298449 113708 220713 -215258 -52967
9904A69681a4334B05905d96773b5288B9242d7125o4028a0320k71283k43778A87236
$$ 169681 -14334 205905 -496773 -25288 29242 -47125 -111153 -10320 -281603 -525381 187236
9892e7797A11333a83067n5393A5696b53758c1970k21661e626G1653m838A146J18522
$$ -57797 111333 -183067 -238460 15696 -253758 -31970 -253631 -5626 71653 66815 1146 119668
9880A19668j1046b04769n667A6522c09376j37350c7946q8555A24603a23058I5538
$$ 119668 108622 -204769 -210436 16522 -309376 -446726 -37946 -126501 124603 -123058 95538
9868a23020c4701C3010M6147c05091A31647B0192F424K78880b04905D8794d42958
$$ -123020 -34701 33010 79157 -305091 131647 20192 6424 285304 -204905 48794 -442958
9856B81914E8251h3977j45886J05088o6780h8594j0379A12612i8661D4163e8560
$$ 281914 58251 -83977 -229863 -124775 -191555 -88594 -98973 112612 -98661 44163 -58560
9844a83149m1424f4487l07895L4558g2171l6066a2530n5451k1808B13467a03209
$$ -183149 -224573 -64487 -372382 -337824 -72171 -108237 -12530 -67981 -89789 213467 -103209
9832f3845k4109B11124O8184g1123j19480K5182k8413M2697A00356i0356d3563
$$ -63845 -87954 211124 279308 -71123 -190603 -165421 -193834 -151137 100356 -90356 -43563
9820e5486m8359k51469A36424k5868g7284B49149d45934A77418q7273b57681L7041
$$ -55486 -103845 -355314 136424 110556 -77284 249149 -445934 177418 90145 -257681 -220640
9809b20640p3991b6920E766d9354j13051a5146l1706q003B29102g3344K1628C8119
$$ -220640 -294631 -26920 5766 -49354 -162405 -15146 -46852 -54855 229102 -73344 -51716 38119
9796a30004G7175a47521j81946g5948j31814B1742e1292A47505j1296a2596A41290
$$ -130004 77175 -147521 -329467 -75948 -207762 21742 -51292 147505 136209 -12596 141290
9784d12283f140A2281h1566m063J336o4483A14165a05486A7542O4900j4314k3437
$$ -412283 -6140 12281 -81566 -85629 -84293 -148776 114165 -105486 17542 82442 68128 44691
9772D4691A3173a37076a5724H2315I292a37159E0847c05732C01267b84691b0354
$$ 44691 13173 -137076 -15724 82315 9292 -137159 50847 -305732 301267 -284691 -20354
9760H2748k1142d093D3247M3004a07285E9400P2745a04193J0853A1926h3533J1654
$$ 82748 61606 -4093 43247 86251 -107285 59400 132145 -104193 -93340 11926 -83533 -71879
9748g1879l1438C8822j7909c07643J05690A97577c1928E6766J1501e0741p0082
$$ -71879 -103317 38822 20913 -307643 -201953 197577 -31928 56766 68267 -50741 -120823
9737a20823J0697f10I5208f3707D8174b34434J14060j09610q7920A50819a37472
$$ -120823 -110126 -610 95208 -63707 48174 -234434 -120374 -229984 -317904 150819 -137472
9725A36566B278J05107b67067C6737b86312B37315K7796G6120a07454L9086a082
$$ 136566 2278 107385 -267067 36737 -286312 237315 265111 76120 -107454 -68368 -1082
9713a09318A61963b94910i7627k43796B97071f7791j31378k94595H0435a55024
$$ -109318 161963 -294910 -97627 -341423 297071 -67791 -199169 -493764 80435 -155024
9702g5136m2740A78971a06488d5158C1448A0942a67641p4055k0581B41376a46830
$$ -75136 -117876 178971 -106488 -45158 31448 10942 -167641 -241696 -262277 241376 -146830
9690e7270j84110f7180k9580b5132A50361f7982A1346a45607C420a19288o6514
$$ -57270 -241380 -67180 -96760 -25132 150361 -67982 11346 -145607 3420 -119288 -185802
9679a85802D6439a09917A32205c31422f8373g340n2884Q146m373k1865j72058
$$ -185802 46439 -109917 132205 -331422 -68373 -7340 -60224 -52078 -56451 -78316 -250374
9668b50374A10005M2023B5811a58184N0555B2453b82720g0485j75603A13175a67598
$$ -250374 110005 152028 25811 -158184 -107629 22453 -282720 -70485 -246088 113175 -167598
9656b65034i8853m9196n2289H3988b49933A03341a29833F6417j3124L2005d98549
$$ -265034 -98853 -148049 -200338 83988 -249933 103341 -129833 66417 53293 85298 -498549
9644c05097G1433A6113K8593b67626A18971a15400J905M040C34369j11977d023
$$ -305097 71433 16113 44706 -267626 118971 -115400 -113495 -109455 334369 222392 -4023
9632e1904a4263D1635c31134a00434L6054o811l0766B70935a16242D0959b21933
$$ -51904 -14263 41635 -331134 -100434 -64380 -71191 -101957 270935 -116242 40959 -221933
9620d4114J2554j60745N5190D777b75457L668G259i9000o9561Q1475l06972f5761
$$ -44114 -31560 -192305 -137115 4777 -275457 -271789 7259 -99000 -168561 -87086 -394058 -65761
9607a46530A77999o2968f162B3142J81769a27753M4073E4917a7934j65483k4014
$$ -146530 177999 115031 -6162 23142 204911 -127753 -83680 54917 -17934 -183417 -207431
9596b07431k69549A99929q8529b45205a06074B1079d0055l3879C7743A2232b13337
$$ -207431 -476980 199929 111400 -245205 -106074 21079 -40055 -73934 37743 12232 -213337
9584H3847b41375j41368B77281a59293L8513l08753a93186r4312A623c2460r3357
$$ 83847 -241375 -382743 277281 -159293 -120780 -429533 -193186 -287498 1623 -32460 -125817
9573a25817K8690F9988a85109g5663A29608E0914J84846A1967c59631n3801b04932
$$ -125817 -97127 69988 -185109 -75663 129608 50914 235760 11967 -359631 -413432 -204932
9561C6463N1217c79442a50665m6825m6312c4455j60484k17981i1096k02214a1027
$$ 36463 87680 -379442 -150665 -197490 -243802 -34455 -194939 -412920 -91096 -293310 -11027
9549a02636b522k60578r913J19983d2102A64470A384g4124A66334l4226F5207
$$ -102636 -2522 -263100 -273013 -153030 -42102 164470 1384 -74124 166334 132108 65207
9537f3894a9628n8560c4966l73852B44177p3164D9910b80308A56122b00400R3539
$$ -63894 -19628 -78188 -34966 -408818 244177 171013 49910 -280308 156122 -200400 -106861
9526a06861o7438A96774a26792j5521A82701E3072a67913A38082g6846k5019l1716
$$ -106861 -174299 196774 -126792 -142313 182701 53072 -167913 138082 -76846 -101865 -133581
9515a33581I4790J25111q4545j3594G158J20740C999b23789B03107b01968c8050
$$ -133581 94790 219901 135356 121762 7158 127898 3999 -223789 203107 -201968 -38050
9503d1668m3256B57923H3785a44990p6136J06767r8293k53162A52236l6740e5929
$$ -41668 -84924 257923 83785 -144990 -221126 -114359 -212652 -465814 152236 115496 -55929
9491b11576A0533a06962e1747A47927b15448Q2140Q783C2270c83994e4393C47982
$$ -211576 10533 -106962 -51747 147927 -215448 -133308 -124525 32270 -383994 -54393 347982
9479f9090j19088B8544b23852f329j9788A91153I3220L1801o255b96704f4670
$$ -69090 -188178 28544 -223852 -6329 -26117 191153 93220 125021 118766 -296704 -64670
9467B51871d45082b6087p8569b7035A16878b27318B16918a97069d260D3736J81196
$$ 251871 -445082 -26087 -104656 -27035 116878 -227318 216918 -197069 -4260 43736 224932
9456B24932C5744M5363b36749A02231P8813H7767b49337r1371g6890q0369N4273
$$ 224932 35744 81107 -236749 102231 181044 87767 -249337 -340708 -76890 -157259 -102986
9445a02986N0556m99G3790c7960j27480E0754J82662a31328J0386k1762l7974
$$ -102986 -52430 -52929 73790 -37960 -165440 50754 233416 -131328 -120942 -142704 -180678
9434a80678A76024c07373a31856N970d844G3491a0503A3783g3084A788b17804
$$ -180678 176024 -307373 -131856 -125886 -4844 73491 -10503 13783 -73084 1788 -217804
9422a50182H106J92760h6041L3565l9791F5461b07397b0125k0428j08776l4154
$$ -150182 8106 200866 -86041 -52476 -92267 65461 -207397 -20125 -40553 -149329 -183483
9411a83483N3124j33292A7047K3687i7906J0801j12228O9577A80896i6328b4695
$$ -183483 -130359 -263651 17047 40734 -97906 -87105 -199333 -129756 180896 -96328 -24695
9399E73566a78929c6112A89779c46776J36722n6250O9257N1100F789c82890c5126
$$ 573566 -178929 -36112 189779 -346776 -210054 -266304 -197047 -145947 6789 -382890 -35126
9387A94079d69758J62930a26585A09093B8548O1393a83751h6875c4190m28078
$$ 194079 -469758 -306828 -126585 109093 28548 89941 -183751 -86875 -34190 -462268
9377d62268a9185j32151A34613a44614k11845a8777p0983F6761l23a64566A61656
$$ -462268 -19185 -151336 134613 -144614 -356459 -18777 -89760 66761 66438 -164566 161656
9365F2178e5123k05868j02586c4935B19503a23781j92625K3303c556A16181b3610
$$ 62178 -55123 -260991 -363577 -34935 219503 -123781 -316406 -293103 -3556 116181 -23610
9353a33358K5302q0133G5320P2063g5216L1969A44341b16165J186I0810A016a57647
$$ -133358 -108056 -188189 75320 147383 -75216 -43247 144341 -216165 -214979 90810 1016 -157647
9340b09344A16089h5347K1991j14041n4703i6659J6544G2867i8192C511L2589
$$ -209344 116089 -85347 -63356 -177397 -232100 -96659 -80115 72867 -98192 3511 36100
9329C6100f07342A5397K40523a63345k4778H2784a53145j19141J10937D8061a01647
$$ 36100 -607342 15397 255920 -163345 -188123 82784 -153145 -272286 -161349 48061 -101647
9317a82204A02468a16426I8369d3416G866P9135h4294m0743A298c13326a0183
$$ -182204 102468 -116426 98369 -43416 7866 87001 -84294 -125037 1298 -313326 -10183
9305A00713N6064k0556o1926a99225j75491D7622a324r4666K6502k11271B3686
$$ 100713 156777 136221 74295 -199225 -374716 47622 -1324 -95990 -69488 -280759 23686
9293A99180a78245D1120M7288B5627J11131d5436j82637B98763a19966j4213f085
$$ 199180 -178245 41120 88408 25627 136758 -45436 -228073 298763 -119966 -134179 -6085
9281d7855k6496o9847d214q6012r5604h9088A36645c0128m6864k98186E4721f596
$$ -47855 -74351 -144198 -4214 -90226 -185830 -89088 136645 -30128 -76992 -375178 54721 -6596
9268e2995C0251d9052A49812a32200j14697J4151j85054a38711j13339a20107
$$ -52995 30251 -49052 149812 -132200 -246897 -232746 -417800 -138711 -252050 -120107
9257A80883a29333i949n3623o837Q171A53371g0188A27236c93649B73862g0387
$$ 180883 -129333 -9949 -63572 -70409 -62238 153371 -70188 127236 -393649 273862 -70387
9245B406b65539o3553B25174c56094A2984L84907c62440D7291b1968G0618j0124
$$ 2406 -265539 -329092 225174 -356094 12984 397891 -362440 47291 -21968 70618 60494
9234F0494J13218e6452F2433b69363J00210p6917G4608e2890G4749L098J3123
$$ 60494 173712 -56452 62433 -269363 -169153 -246070 74608 -52890 74749 77847 90970
9223I0970J67204j03228b91131D9324a97937l9170H0515c27526B06884A03043
$$ 90970 258174 154946 -291131 49324 -197937 -237107 80515 -327526 206884 103043
9212B65808d9504j69849A60520k8870b7871A08892k2711K04853b80707a0508k99102
$$ 265808 -49504 -219353 160520 131650 -27871 108892 86181 291034 -280707 -10508 -309610
9201c09610I748c15133E0502a00301j03972H2047a75865l85859G156J20327I373
$$ -309610 9748 -315133 50502 -100301 -204273 82047 -175865 -561724 7156 127483 9373
9189d7873j22362A00997a81660I4457j353m1057H620N7165a43501K5726o0512
$$ -47873 -170235 100997 -181660 94457 93104 52047 8620 65785 -143501 -117775 -178287
9178a78287a2745B86515g9561n3074a9619A10508a90992A27848d4284j8729A18337
$$ -178287 -12745 286515 -79561 -132635 -19619 110508 -190992 127848 -44284 -63013 118337
9166b12598B72387b4711A14872e2658l35088B98492J5349e0198k91959A86982
$$ -212598 272387 -24711 114872 -52658 -387746 298492 313841 -50198 -342157 186982
9155a41552d9799K3943I6179i5770a8262B0285d3669l336C3138M5658N8504a10601
$$ -141552 -49799 -25856 96179 -95770 -18262 20285 -43669 -47005 33138 78796 137300 -110601
9142A70386H0706h9217j34140g8136l66792a12958M1282q7025q5283J0463c2438
$$ 170386 80706 -89217 -223357 -78136 -444928 -112958 -71676 -158701 -243984 -233521 -32438
9130b22376a09263C245b74752I563i8629k79389a34742H9723l174c7175o6221
$$ -222376 -109263 3245 -274752 9563 -98629 -378018 -134742 89723 86549 -37175 -103396
9119a03396F9643M4181c42751a55566c1176k50447a34936e7446j93059a14090
$$ -103396 69643 113824 -342751 -155566 -31176 -281623 -134936 -57446 -250505 -114090
9108D114O1693n240P6969b32193d9675j9641n6026a483m94895A22767D0894Q2383
$$ 4114 65807 60567 137536 -232193 -49675 -69316 -125342 -1483 -496378 122767 40894 123277
9096A23277a17890r6344C1921j0724a16985N7457k2270o3186D0705L7190a84052
$$ 123277 -117890 -214234 31921 21197 -116985 -59528 -81798 -144984 40705 77895 -184052
9084a27543E0911N9020b12601k7035B107b17283N6208B17660m1550i6590k25653
$$ -127543 50911 109931 -212601 -239636 2107 -217283 -161075 217660 176110 -96590 -322243
9073c22243d9649B60478b88181h8779q8937f8270k54120e1409o7986L7824A1736
$$ -322243 -49649 260478 -288181 -88779 -177716 -68270 -322390 -51409 -119395 -81571 11736
9061A6068N9838J5170c39222C33185a1525j47414k32070a73724L4535B2735a26735
$$ 16068 75906 91076 -339222 333185 -11525 -158939 -391009 -173724 -139189 22735 -126735
9049e8786l7131K7783r6601j8753B27283a86035A76816l6836a47874K6672A44688
$$ -58786 -95917 -68134 -164735 -183488 227283 -186035 176816 139980 -147874 -121202 144688
9037B9328a01630A33579e6858l20542J23853A75162C0568a09519C4682e4144o575
$$ 29328 -101630 133579 -56858 -377400 -253547 175162 30568 -109519 34682 -54144 -60719
9026f0719H649b04012k36561C7925K88675D147P6159k3189c65663l5555A20829
$$ -60719 8649 -204012 -440573 37925 326600 4147 80306 57117 -365663 -401218 120829
9014a01901a3739l80937a60122o8072j9753i6995c6456e328k64060b8104k18013
$$ -101901 -13739 -394676 -160122 -228194 -247947 -96995 -36456 -5328 -269388 -28104 -246117
9003b46117e2158q3670L6454K628l2175D1192d4140J2573k27580A74560b42982
$$ -246117 -52158 -135828 -99374 -96746 -128921 41192 -44140 -31567 -259147 174560 -242982
8991e4840A47082g2452K5002A61334B5185b04B06238I807h0896k11119E1681a60238
$$ -54840 147082 -72452 -47450 161334 25185 -204 206238 9807 -80896 -292015 51681 -160238
8978c57396B79317F0581a25493L7955j30731N6691A90198J12335a06206D5253
$$ -357396 279317 60581 -125493 -87538 -218269 -161578 190198 302533 -106206 45253
8967c57250A08042a50839q7227r9425a38455A4166K42705f7973H129b748k41420
$$ -357250 108042 -150839 -238066 -337491 -138455 14166 256871 -67973 8129 -2748 -244168
8956b44168P0896A64953p9407a00598j19818M9304C6335b30014h7162j57288o4996
$$ -244168 -173272 164953 85546 -100598 -220416 -171112 36335 -230014 -87162 -244450 -309446
8945c09446A46115D1551O5484l3513K4444g4614j53627f6085k4538h419F8257
$$ -309446 146115 41551 107035 73522 97966 -74614 -228241 -66085 -90623 -8419 68257
8933a3328j73660B05525b25465D10040b10006k6758A20057g5543B4464R6281J68223
$$ -13328 -186988 205525 -225465 410040 -210006 -236764 120057 -75543 24464 120745 288968
8922B88968J1713J467018L713324P140385D975405A793134H34371j60462B01937
$$ 288968 300681 1767699 5481023 12621408 4975405 1793134 834371 673909 201937
8912C91278n7630C2466J36617l3152J24547C6895R5572E225J99052p3683C5556
$$ 391278 333648 32466 169083 135931 260478 36895 132467 5225 204277 130594 35556
8900e3546q0470H8320M6073f5435m9293N962l53664M2811A1336h5128a747B52164
$$ -53546 -134016 88320 134393 -65435 -114728 -108766 -462430 -419619 11336 -85128 -1747 252164
8887I7681g779E2266J84777A09379a86726b1607B4078a05932A15502b4786j36650
$$ 97681 -7779 52266 237043 109379 -186726 -21607 24078 -105932 115502 -24786 -161436
8876a61436J5180D1380b6407A97416h9448j63452e6254a0968D4204e2733A09723
$$ -161436 -146256 41380 -26407 197416 -89448 -252900 -56254 -10968 44204 -52733 109723
8864a07243P871j68249R6787N0242A44595F8742a14150r5294K8134g7294q8694
$$ -107243 -99372 -267621 -170834 -120592 144595 68742 -114150 -209444 -181310 -77294 -165988
8853a65988O0022m2561a8654B06682K1811a40749F9925a1492j72268e4908j10098
$$ -165988 -105966 -148527 -18654 206682 228493 -140749 69925 -11492 -183760 -54908 -165006
$$ [...]
##END NTUPLES=NMR SPECTRUM
##END=
