
##TITLE=AC1321_SOiAH12150_6609688_FKkP90VOrA
##JCAMPDX= 6.0         $$ Bruker NMR JCAMP-DX V2.0
##DATA TYPE= NMR SPECTRUM
##DATA CLASS= NTUPLES
##ORIGIN= BRUKER
##OWNER= Administrator
$$ 1.72 TOPSPIN		Version 2.1
$$ 2012-08-01 21:09:29.203 -0500  Administrator@TOPSPIN
$$ Compression mode = diff/dup
##.OBSERVE FREQUENCY= 400.02188249412
##.OBSERVE NUCLEUS= ^1H
##.ACQUISITION MODE= SIMULTANEOUS (DQD)
##.ACQUISITION SCHEME= undefined
##.AVERAGES= 64
##.DIGITISER RES= 22
##SPECTROMETER/DATA SYSTEM= spect
##.PULSE SEQUENCE= noesygpps1d.comp
##.SOLVENT NAME= COFFEE_meoh
##.SHIFT REFERENCE= INTERNAL, COFFEE_meoh, 1, 14.96242
##AUDIT TRAIL= $$ (NUMBER, WHEN, WHO, WHERE, PROCESS, VERSION, WHAT)
$$ ##TITLE= Audit trail, TOPSPIN		Version 2.1
$$ ##JCAMPDX= 5.01
$$ ##ORIGIN= Bruker BioSpin GmbH
$$ ##OWNER= Administrator
$$ $$ C:\Bruker\TOPSPIN/data/COFFEE/nmr/AC1321_SOiAH12150_6609688_FKkP90VOrA/12/pdata/1/auditp.txt
$$ ##AUDIT TRAIL=  $$ (NUMBER, WHEN, WHO, WHERE, PROCESS, VERSION, WHAT)
(   1,<2012-08-01 21:09:21.593 -0500>,<Administrator>,<TOPSPIN>,<go>,<TOPSPIN 2.1>,
      <created by zg
	started at 2012-08-01 20:57:51.265 -0500,
	POWCHK enabled, PULCHK disabled,
       configuration hash MD5:
       6B 1B 68 BB D9 2E 58 E2 7F 35 AD 54 07 DF 0E 41
       data hash MD5: 64K
       3B 21 BD 86 C6 21 66 26 A5 DD 2F 97 07 AC 20 7A>)
(   2,<2012-08-01 21:09:26.718 -0500>,<Administrator>,<TOPSPIN>,<proc1d>,<TOPSPIN 2.1>,
      <Start of raw data processing
       efp LB = 0.3 FT_mod = 6 PKNL = 1 PHC0 = 0 PHC1 = 0 SI = 128K 
       data hash MD5: 128K
       DA 63 FE 76 B2 FB 30 B3 04 D4 E2 CE C9 87 9A 07>)
(   3,<2012-08-01 21:09:27.796 -0500>,<Administrator>,<TOPSPIN>,<proc1d>,<TOPSPIN 2.1>,
      <pk PHC0 = -4.487915 PHC1 = 0 
       data hash MD5: 128K
       E8 A2 30 32 6D BF 1A 3A D7 95 BA 12 26 1A F2 D3>)
(   4,<2012-08-01 21:09:28.656 -0500>,<Administrator>,<TOPSPIN>,<proc1d>,<TOPSPIN 2.1>,
      <abs ABSG = 1 
       data hash MD5: 128K
       EC 28 09 BA B2 1D D3 44 6D D4 6C BF 1F 25 E6 24>)
(   5,<2012-08-01 21:09:28.750 -0500>,<Administrator>,<TOPSPIN>,<proc1d>,<TOPSPIN 2.1>,
      <abs ABSG = 2 
       data hash MD5: 128K
       6F 0F 39 DC 83 DE C3 03 D1 83 0E F5 53 A2 B0 9F>)
(   6,<2012-08-01 21:09:28.812 -0500>,<Administrator>,<TOPSPIN>,<proc1d>,<TOPSPIN 2.1>,
      <abs ABSG = 3 
       data hash MD5: 128K
       92 D0 97 43 78 34 74 B0 65 14 65 87 F2 30 97 1C>)
(   7,<2012-08-01 21:09:28.890 -0500>,<Administrator>,<TOPSPIN>,<proc1d>,<TOPSPIN 2.1>,
      <abs ABSG = 4 
       data hash MD5: 128K
       CA 6B B4 EF 62 38 15 04 E5 AE E3 18 9C A3 71 F7>)
(   8,<2012-08-01 21:09:28.953 -0500>,<Administrator>,<TOPSPIN>,<proc1d>,<TOPSPIN 2.1>,
      <abs ABSG = 5 
       data hash MD5: 128K
       11 00 36 1C CD 1D 44 75 41 BA 53 C7 D4 3E 33 68>)
$$ ##END=
$$ 
$$ $$ hash MD5
$$ $$ 00 59 20 A2 AF 54 A6 03 BA 2D 1B D1 AD 1F 15 7F
##$RELAX= 
##$RELAX= 
##$RELAX= 
##$RELAX= 
##$RELAX= 
##$RELAX= 
##$RELAX= 
##$RELAX= 
$$ Bruker specific parameters
$$ [...]
##$TP07= 0
##$TPNAME0= <>
##$TPNAME1= <>
##$TPNAME2= <>
##$TPNAME3= <>
##$TPNAME4= <>
##$TPNAME5= <>
##$TPNAME6= <>
##$TPNAME7= <>
##$TPOAL= (0..7)
0.5 0.5 0.5 0.5 0.5 0.5 0.5 0.5
##$TPOFFS= (0..7)
0 0 0 0 0 0 0 0
##$TUNHIN= 0
##$TUNHOUT= 0
##$TUNXOUT= 0
##$USERA1= <user>
##$USERA2= <user>
##$USERA3= <user>
##$USERA4= <user>
##$USERA5= <user>
##$V9= 5
##$VALIST= <valist>
##$VCLIST= <CCCCCCCCCCCCCCC>
##$VD= 0
##$VDLIST= <DDDDDDDDDDDDDDD>
##$VPLIST= <PPPPPPPPPPPPPPP>
##$VTLIST= <TTTTTTTTTTTTTTT>
##$WBST= 1024
##$WBSW= 4
##$XGAIN= (0..3)
0 0 0 0
##$XL= 0
##$YL= 0
##$YMAX_a= 16434743
##$YMIN_a= -10308019
##$ZGOPTNS= <>
##$ZL1= 120
##$ZL2= 120
##$ZL3= 120
##$ZL4= 120
##$ABSF1= 14.96242
##$ABSF2= -5.595761
##$ABSG= 5
##$ABSL= 3
##$ALPHA= 0
##$AQORDER= 0
##$ASSFAC= 0
##$ASSFACI= 0
##$ASSFACX= 0
##$ASSWID= 0
##$AUNMP= <proc_prof1d_extract.lims>
##$AXLEFT= 0
##$AXNAME= <>
##$AXNUC= <1H>
##$AXRIGHT= 0
##$AXTYPE= 0
##$AXUNIT= <>
##$AZFE= 0.1
##$AZFW= 0.1
##$BCFW= 0
##$BC_mod= 0
##$BYTORDP= 0
##$COROFFS= 0
##$CY= 15
##$DATMOD= 1
##$DC= 0
##$DFILT= <>
##$DTYPP= 0
##$F1P= 0
##$F2P= 0
##$FCOR= 0.5
##$FTSIZE= 131072
##$FT_mod= 6
##$GAMMA= 0
##$GB= 0
##$INTBC= 1
##$INTSCL= 1
##$ISEN= 128
##$LB= 0.3
##$LEV0= 0
##$LPBIN= 0
##$MAXI= 10000
##$MC2= 0
##$MEAN= 0
##$ME_mod= 0
##$MI= 0
##$NCOEF= 0
##$NC_proc= -2
##$NLEV= 6
##$NOISF1= 0
##$NOISF2= 0
##$NSP= 0
##$NTH_PI= 0
##$NZP= 0
##$OFFSET= 14.96242
##$PC= 1
##$PHC0= -4.487915
##$PHC1= 0
##$PH_mod= 1
##$PKNL= yes
##$PPARMOD= 0
##$PPDIAG= 0
##$PPIPTYP= 0
##$PPMPNUM= 2147483647
##$PPRESOL= 1
##$PSCAL= 4
##$PSIGN= 0
##$PYNMP= <proc.py>
##$REVERSE= no
##$SF= 400.020009070588
##$SI= 131072
##$SIGF1= 0
##$SIGF2= 0
##$SINO= 400
##$SIOLD= 131072
##$SPECTYP= <>
##$SREGLST= <1H.CDCl3>
##$SSB= 0
##$STSI= 131072
##$STSR= 0
##$SW_p= 8223.68421052631
##$SYMM= 0
##$S_DEV= 0
##$TDeff= 65536
##$TDoff= 0
##$TI= <>
##$TILT= no
##$TM1= 0
##$TM2= 0
##$TOPLEV= 0
##$USERP1= <user>
##$USERP2= <user>
##$USERP3= <user>
##$USERP4= <user>
##$USERP5= <user>
##$WDW= 1
##$XDIM= 131072
##$YMAX_p= 388204639
##$YMIN_p= -11422
##$CURPLOT= <Network HP LaserJet P1505>
##$CURPRIN= <$Network HP LaserJet P1505>
##$DFORMAT= <normdp>
##$LAYOUT= <+/1D_H.xwp>
##$LFORMAT= <normlp>
##$PFORMAT= <normpl>
##$SURQMSG= 1
$$ End of Bruker specific parameters
$$ ---------------------------------
##NTUPLES= NMR SPECTRUM
##VAR_NAME=  FREQUENCY,     SPECTRUM/REAL,   SPECTRUM/IMAG
##SYMBOL=    X,             R,               I
##VAR_TYPE=  INDEPENDENT,   DEPENDENT,       DEPENDENT
##VAR_FORM=  AFFN,          ASDF,            ASDF
##VAR_DIM=   131072,        131072,          131072
##UNITS=     HZ,            ARBITRARY UNITS, ARBITRARY UNITS
##FACTOR=    0.0627417313425164, 1,          1
##FIRST=     8223.62146879497, -692,         -62584
##LAST=      0,             1083,            -62969
##MIN=       0,             -11422,          0
##MAX=       8223.62146879497, 388204639,    0
$$ Real data points
##PAGE= N=1
##DATA TABLE= (X++(R..R)), XYDATA
$$ [...]
$$ plain form
63178 719985 727770 736867 747110 758045 769227 780658 792688 805419 818465 831498 844646 858004
63166 858004 870985 882720 893054 902588 911617 919417 924748 926671 924695 918597 908541 895183 879349
63153 879349 861639 842477 822255 801250 779713 758292 738021 719488 702286 685770 670168
63142 670168 656434 645134 635999 628471 622110 616487 611309 606783 603365 601109 599765 599482 600640 602851
63128 602851 605000 606675 608786 612242 616668 621072 625122 629023 632658 635777 638733 642160 646069 650041
63114 650041 654075 658451 662894 666808 670351 674311 678693 682428 684835 686634 688961 692028 695230 698035
63100 698035 700238 701756 702738 703565 704274 704238 702949 700870 699052 698044 697695 697828 698523 699696 700973 702261
63084 702261 704043 706823 710530 714795 719663 725614 732863 741040 749826 759541 770664 782893 795310
$$ packed form
63178G19985P785R097J0243J0935J1182J1431J2030J2731J3046J3033J3148J3358
63166H58004J2981J1735J0334R534R029P800N331J923j976o098j0056j3358j5834
63153H79349j7710j9162k0222k1005k1537k1421k0271j8533j7202j6516j5602
63142F70168j3734j1300r135p528o361n623n178m526l418k256j344k83J158K211
63128F02851K149J675K111L456M426M404M050L901L635L119K956L427L909L972
63114F50041M034M376M443L914L543L960M382L735K407J799K327L067L202K805
63100F98035K203J518R82Q27P09l6j289k079j818j008l49J33O95J173J277J288
63084G02261J782K780L707M265M868N951P249Q177Q786R715J1123J2229J2417
$$ plain form
63071 795310 807628 820704 835410 851409 867617 883575 899733 916459 933553 950929 969252
63060 969252 989484 1012122 1037121 1064358 1093880 1125840 1160417 1197789 1238072 1281342 1327636
63049 1327636 1376932 1429210 1484603 1543188 1604329 1666505 1728256 1789249 1849996 1910654 1970612
63038 1970612 2029276 2086659 2143129 2199155 2255512 2313092 2372054 2431499 2490306 2547883 2603638
63027 2603638 2655963 2702173 2739413 2765446 2778866 2779001 2765631 2738589 2697714 2643398 2577119 2501218
63015 2501218 2418202 2330394 2240116 2149810 2061698 1977340 1897696 1823643 1756226 1696130 1643075
63004 1643075 1596266 1555556 1521629 1494747 1473960 1458159 1447379 1442134 1441810 1444719 1449787 1457131
62992 1457131 1466792 1477956 1489891 1502744 1516741 1531241 1545320 1558813 1572082 1585017 1596865
$$ packed form
63071G95310J2318J3076J4706J5999J6208J5958J6158J6726J7094J7376J8323
63060I69252K0232K2638K4999K7237K9522L1960L4577L7372M0283M3270M6294
63049A327636M9296N2278N5393N8585O1141O2176O1751O0993O0747O0658N9958
63038A970612N8664N7383N6470N6026N6357N7580N8962N9445N8807N7577N5755
63027B603638N2325M6210L7240K6033J3420J35j3370k7042m0875n4316o6279p5901
63015B501218q3016q7808r0278r0306q8112q4358p9644p4053o7417o0096n3055
63004A643075m6809m0710l3927k6882k0787j5801j0780n245l24K909N068P344
62992A457131R661J1164J1935J2853J3997J4500J4079J3493J3269J2935J1848
$$ plain form
62981 1596865 1606803 1614145 1618153 1618127 1613575 1603970 1588622 1567184 1540108 1508254 1472272 1432676 1390220
62968 1390220 1345739 1299823 1253067 1206419 1160875 1117015 1075210 1036043 1000064 967309 937486
62957 937486 910485 886265 864443 844573 826763 811441 798443 786821 775656 764720 754244
62946 754244 744401 735143 726288 717555 708662 699396 689515 678792 667459 656512 647131 639593 632972
62933 632972 625986 618033 609421 600919 593229 586639 580931 575611 570392 565505 561492 558609 556479 554420
62919 554420 552125 549850 547961 546559 545727 545655 546070 545830 543882 540640 537770 536429 536307 536590 537113 538093
62903 538093 539265 539959 539842 539213 538730 539027 540265 541753 542424 541961 541039 540118 538643 536009 532758 529961
62887 529961 527659 524781 520691 516120 512352 509960 508513 507217 505673 504158 503221 503009 503134 503210 503105 502593
$$ packed form
62981A596865R938P342M008k6m552r605j5348k1438k7076l1854l5982l9596m2456
62968A390220m4481m5916m6756m6648m5544m3860m1805l9167l5979l2755k9823
62957I37486k7001k4220k1822j9870j7810j5322j2998j1622j1165j0936j0476
62946G54244r843r258q855q733q893r266r881j0723j1333j0947r381p538o621
62933F32972o986p953q612q502p690o590n708n320n219m887m013k883k130k059
62919E54420k295k275j889j402q32p2M15k40j948l242k870j341j22K83N23R80
62903E38093J172O94j17o29m83K97J238J488O71m63r22r21j475k634l251k797
62887E29961k302k878m090m571l768k392j447j296j544j515r37k12J25P6j05n12
$$ plain form
62871 502593 501339 499628 498551 498892 500160 501289 501921 502402 502872 503167 503406 503880 504415 504543 504204 503624 502558
62854 502558 500454 497440 494430 492142 490625 489744 489415 489198 488424 487030 485628 484562 483527 482328 481330
62839 481330 480790 480407 479939 479691 479919 480286 480410 480436 480582 480619 480455 480710 481928 483480 484151 483798 483568 484312 485600
62820 485600 486644 487511 488779 490462 492003 493271 494828 497100 499820 502587 505476 508645 511729 514257
62806 514257 516566 519627 523934 529166 535108 542191 550709 560086 569469 578705 588183 598074 608431 619811
62792 619811 633103 648619 665908 684524 704543 726299 750113 776377 805447 837364 872062
62781 872062 909952 951917 998620 1050219 1106889 1169202 1237833 1313176 1395389 1484411 1579730
62770 1579730 1680421 1785636 1894673 2006327 2118390 2228043 2332505 2429078 2514840 2586800
$$ packed form
62871E02593j254j711j077L41J268J129O32M81M70K95K39M74N35J28l39n80j066
62854E02558k104l014l010k288j517q81l29k17p74j394j402j066j035j199r98
62839D81330n40l83m68k48K28L67J24K6J46L7j64K55J218J552O71l53k30P44J288
62820D85600J044Q67J268J683J541J268J557K272K720K767K889L169L084K528
62806E14257K309L061M307N232N942P083Q518R377R383R236R478R891J0357J1380
62792F19811J3292J5516J7289J8616K0019K1756K3814K6264K9070L1917L4698
62781H72062L7890M1965M6703N1599N6670O2313O8631P5343Q2213Q9022R5319
62770A579730J00691J05215J09037J11654J12063J09653J04462R6573Q5762P1960
$$ plain form
62760 2586800 2642412 2679851 2697868 2695740 2673509 2632282 2574218 2502117 2418769 2326531 2227445
62749 2227445 2123651 2017505 1911223 1806423 1704023 1604593 1508815 1417598 1331744 1251597
62739 1251597 1177219 1108764 1046428 990006 938905 892674 851107 813714 779596 748168 719526
62728 719526 693721 670106 647982 627489 609192 593031 578371 564985 553277 543510 535355 528307
62716 528307 522035 516364 511434 507903 506416 506737 507814 508853 510005 512037 515813 522052 531023 542262
62702 542262 555022 569069 584796 602611 622711 645378 670873 698994 729256 761618 796485
62691 796485 834014 874016 916563 961852 1009239 1057165 1104426 1150805 1195962 1238314 1275604
62680 1275604 1306188 1329203 1343932 1349722 1346486 1334786 1315399 1289071 1256544 1218573 1175970 1129805
$$ packed form
62760B586800N5612L7439J8017k128k2231m1227n8064p2101q3348r2238r9086
62749B227445j03794j06146j06282j04800j02400r9430r5778r1217q5854q0147
62739A251597p4378o8455o2336n6422n1101m6231m1567l7393l4118l1428k8642
62728G19526k5805k3615k2124k0493j8297j6161j4660j3386j1708r767q155p048
62716E28307o272n671m930l531j487L21J077J039J152K032L776O239Q971J1239
62702E42262J2760J4047J5727J7815K0100K2667K5495K8121L0262L2362L4867
62691G96485L7529M0002M2547M5289M7387M7926M7261M6379M5157M2352L7290
62680A275604L0584K3015J4729N790l236j1700j9387k6328l2527l7971m2603m6165
$$ plain form
62668 1129805 1081471 1032417 983880 936859 892025 849556 809312 771239 735417 701843 670593
62657 670593 642151 617006 594811 574463 555190 537066 520391 505225 491687 479937 469383
62646 469383 458682 447151 435698 425653 417111 409136 401231 393752 386915 380214 373132 365916 359355
62633 359355 353989 349734 346179 343078 340461 338311 336344 334352 332554 331230 330143 328908 327921 328157 329771
62618 329771 331611 332580 332897 333467 334605 336100 338145 341331 345741 350767 355930 361456 367949 375814 385025
62603 385025 395146 405590 416103 426990 438802 452058 467408 485661 507191 531623 558607
62592 558607 588750 623252 662665 706434 753669 803937 857242 913544 972355 1032524 1092349
62581 1092349 1150037 1204041 1252873 1294911 1328794 1353898 1370071 1376979 1374112 1361352 1339194 1308468
$$ packed form
62668A129805m8334m9054m8537m7021m4834m2469m0244l8073l5822l3574l1250
62657F70593k8442k5145k2195k0348j9273j8124j6675j5166j3538j1750j0554
62646D69383j0701j1531j1453j0045q542p975p905p479o837o701p082p216o561
62633C59355n366m255l555l101k617k150j967j992j798j324j087j235r87K36J614
62618C29771J840R69L17N70J138J495K045L186M410N026N163N526O493P865R211
62603C85025J0121J0444J0513J0887J1812J3256J5350J8253K1530K4432K6984
62592E58607L0143L4502L9413M3769M7235N0268N3305N6302N8811O0169N9825
62581A092349N7688N4004M8832M2038L3883K5104J6173O908k867j2760k2158l0726
$$ plain form
62569 1308468 1270326 1226566 1179434 1130810 1081740 1032865 984984 938881 894840 852728 812626
62558 812626 775104 740637 708987 679429 651604 625763 602030 579805 558282 537349 517527
62547 517527 499175 482220 466575 452185 438634 425377 412647 401580 393021 386521 380790 374823
62535 374823 368411 362073 356795 353388 351685 350671 349735 349318 349998 351472 353036 354702 357113 360538 364568
62520 364568 368756 373045 377627 382872 389383 397657 407614 418759 430849 444175 459274 476593 496340
62507 496340 518412 542531 568542 596368 625541 655129 684341 712766 739702 763743 783556
62496 783556 798764 809579 815893 817311 813649 804767 790342 770764 747992 724482 701162 677392
62484 677392 653027 629434 608026 588716 570572 553382 537788 524212 512467 502317 493744 486567
$$ packed form
62569A308468l8142m3760m7132m8624m9070m8875m7881m6103m4041m2112m0102
62558H12626l7522l4467l1650k9558k7825k5841k3733k2225k1523k0933j9822
62547E17527j8352j6955j5645j4390j3551j3257j2730j1067q559o500n731n967
62535C74823o412o338n278l407j703j014r36m17O80J474J564J666K411L425M030
62520C64568M188M289M582N245O511Q274R957J1145J2090J3326J5099J7319J9747
62507D96340K2072K4119K6011K7826K9173K9588K9212K8425K6936K4041J9813
62496G83556J5208J0815O314J418l662q882j4425j9578k2772k3510k3320k3770
62484F77392k4365k3593k1408j9310j8144j7190j5594j3576j1745j0150q573p177
$$ plain form
62472 486567 480345 474939 470804 468440 467690 467863 468543 470014 472774 476782 481411 486083 490702 495465 500535
62457 500535 506012 511966 518247 524461 530358 536172 542407 549343 556878 564706 572534 580181 587514 594122
62443 594122 599092 601467 601075 598589 594574 588765 580484 569509 556312 541785 526983 512797 499507
62430 499507 486864 474755 463465 453122 443400 434177 425922 418982 412956 407450 403005 400506 399935
62417 399935 400486 401780 404164 407855 412552 417953 424033 430693 437778 445536 454457 464467 474834 485016
62403 485016 495088 505087 514455 522422 528645 533228 536464 538735 540335 541146 540675 538610 535201 530955
62389 530955 526148 520720 514616 508189 502208 497261 493133 489173 485491 483312 483698 486318 490085 494666
62375 494666 500659 508552 518407 530542 545613 563716 584148 606429 631075 659096 691165 727498
$$ packed form
62472D86567o222n406m135k364p50J73O80J471K760M008M629M672M619M763N070
62457E00535N477N954O281O214N897N814O235O936P535P828P828P647P333O608
62443E94122M970K375l92k486m015n809q281j0975j3197j4527j4802j4186j3290
62430D99507j2643j2109j1290j0343r722r223q255o940o026n506m445k499n71
62417C99935N51J294K384L691M697N401O080O660P085P758Q921J0010J0367J0182
62403D85016J0072R999R368P967O223M583L236K271J600Q11m71k065l409m246
62389E30955m807n428o104o427n981m947m128l960l682k179L86K620L767M581
62375D94666N993P893R855J2135J5071J8103K0432K2281K4646K8021L2069L6333
$$ plain form
62363 727498 768029 812419 860200 911125 965014 1021081 1077790 1133524 1187049 1237200 1282533
62352 1282533 1321484 1352624 1374763 1387365 1390968 1386687 1375130 1356375 1331168 1301445 1269046 1234357
62340 1234357 1196779 1156355 1114459 1072978 1033187 995412 959527 925733 894788 867302 842784
62329 842784 819734 796885 774148 752276 731963 713484 696852 681958 668645 656872 646778
62318 646778 638539 632227 627759 624742 622449 620359 618736 618225 618716 619046 618114 615931 613291 610690 607950
62303 607950 604701 600809 596313 591249 585641 579599 573368 567261 561543 556430 552187 549023 546770 544923
62289 544923 543311 542500 543190 545344 548384 552082 556746 562546 569193 576389 584096 592281 600879 610147 620512
62274 620512 631897 643691 655652 668294 682069 696652 711595 727389 745321 766349 790499
$$ packed form
62363G27498M0531M4390M7781N0925N3889N6067N6709N5734N3525N0151M5333
62352A282533L8951L1140K2139J2602L603m281j1557j8755k5207k9723l2399l4689
62340A234357l7578m0424m1896m1481l9791l7775l5885l3794l0945k7486k4518
62329H42784k3050k2849k2737k1872k0313j8479j6632j4894j3313j1773j0094
62318F46778q239o312m468l017k293k090j623n11M91L30r32k183k640k601k740
62303F07950l249l892m496n064n608o042o231o107n718n113m243l164k253j847
62289E44923j612q11O90K154L040L698M664N800O647P196P707Q185Q598R268J0365
62274F20512J1385J1794J1961J2642J3775J4583J4943J5794J7932K1028K4150
$$ plain form
62263 790499 817349 846791 879210 915108 954665 997677 1043784 1092499 1142843 1193177 1241649
62252 1241649 1286684 1326807 1360333 1385889 1403190 1412735 1414657 1408495 1394339 1373642 1348463 1320089
62240 1320089 1288647 1253856 1215998 1176305 1136581 1098374 1062522 1029495 999816 973773 951013
62229 951013 931012 913866 900082 889647 881870 876083 871810 868300 864686 860861 857589 855475 854304
62216 854304 853402 852036 849414 845171 840132 835826 832870 830469 827802 825075 822866 821367 820874 822187 825703
62201 825703 830711 836372 842872 850807 859885 869220 878686 889137 901316 915281 930854 947937 966308
62188 966308 985645 1005875 1027166 1049511 1072510 1095452 1117373 1137349 1155123 1171265 1186449
62177 1186449 1200844 1214574 1228378 1243298 1259903 1278310 1298780 1321777 1347561 1376254 1408183
$$ packed form
62263G90499K6850K9442L2419L5898L9557M3012M6107M8715N0344N0334M8472
62252A241649M5035M0123L3526K5556J7301R545J922o162j4156k0697k5179k8374
62240A320089l1442l4791l7858l9693l9724l8207l5852l3027k9679k6043k2760
62229I51013k0001j7146j3784j0435p777n787m273l510l614l825l272k114j171
62216H54304r02j366k622m243n039m306k956k401k667k727k209j499m93J313L516
62201H25703N008N661O500P935R078R335R466J0451J2179J3965J5573J7083J8371
62188I66308J9337K0230K1291K2345K2999K2942K1921J9976J7774J6142J5184
62177A186449J4395J3730J3804J4920J6605J8407K0470K2997K5784K8693L1929
$$ plain form
62166 1408183 1443564 1481721 1521046 1559875 1597151 1632182 1664050 1691520 1713590 1730145 1742023
62155 1742023 1750275 1755437 1757696 1757503 1755454 1751666 1745985 1738964 1731842 1725285 1718969 1712867 1708092 1705704
62141 1705704 1705370 1706169 1708264 1712794 1720285 1730020 1740835 1751812 1762328 1772318 1782565 1794106 1807230
62128 1807230 1821539 1836767 1852945 1869974 1887812 1906986 1928066 1950591 1973340 1995807 2018605
62117 2018605 2042185 2066096 2089993 2114595 2140896 2168843 2197462 2226086 2254751 2283474 2311831
62106 2311831 2339596 2367470 2396716 2427997 2460794 2494053 2527239 2560559 2594410 2629103 2665166
62095 2665166 2703325 2743840 2786263 2830231 2876177 2924789 2976056 3029293 3083889 3139396 3194954
62084 3194954 3249324 3301802 3352791 3403259 3453822 3504499 3555196 3606119 3657392 3708083 3755880
$$ packed form
62166A408183L5381L8157L9325L8829L7276L5031L1868K7470K2070J6555J1878
62155A742023Q252N162K259j93k049l788n681p021p122o557o316o102m775k388
62141A705704l34P99K095M530P491R735J0815J0977J0516R990J0247J1541J3124
62128A807230J4309J5228J6178J7029J7838J9174K1080K2525K2749K2467K2798
62117B018605K3580K3911K3897K4602K6301K7947K8619K8624K8665K8723K8357
62106B311831K7765K7874K9246L1281L2797L3259L3186L3320L3851L4693L6063
62095B665166L8159M0515M2423M3968M5946M8612N1267N3237N4596N5507N5558
62084C194954N4370N2478N0989N0468N0563N0677N0697N0923N1273N0691M7797
$$ plain form
62073 3755880 3798396 3835089 3867619 3898241 3928348 3958662 3989946 4022689 4056539 4090761 4124980
62062 4124980 4158710 4190396 4217792 4239364 4254786 4264121 4267254 4264261 4255743 4242478 4225075 4204036
62050 4204036 4179786 4152529 4122380 4089726 4055261 4019740 3983967 3948896 3915349 3883709 3854167
62039 3854167 3827112 3802948 3781686 3763054 3746827 3732674 3720013 3708502 3698408 3689956 3682575 3675425
62027 3675425 3668359 3661642 3654935 3647499 3639338 3631189 3623185 3614404 3604044 3592333 3579901 3566881 3552937
62014 3552937 3537665 3520670 3501774 3481453 3460501 3438904 3415560 3389531 3361271 3332260 3303750
62003 3303750 3276100 3248974 3221863 3194552 3167297 3140344 3113290 3085333 3056172 3026113 2995133
61992 2995133 2962426 2927312 2890127 2851836 2813141 2774392 2736068 2698796 2662973 2628704 2596004
$$ packed form
62073C755880M2516L6693L2530L0622L0107L0314L1284L2743L3850L4222L4219
62062D124980L3730L1686K7396K1572J5422R335L133k993q518j3265j7403k1039
62050D204036k4250k7257l0149l2654l4465l5521l5773l5071l3547l1640k9542
62039C854167k7055k4164k1262j8632j6227j4153j2661j1511j0094q452p381p150
62027C675425p066o717o707p436q161q149q004q781j0360j1711j2432j3020j3944
62014C552937j5272j6995j8896k0321k0952k1597k3344k6029k8260k9011k8510
62003C303750k7650k7126k7111k7311k7255k6953k7054k7957k9161l0059l0980
61992B995133l2707l5114l7185l8291l8695l8749l8324l7272l5823l4269l2700
$$ plain form
61981 2596004 2564792 2534810 2505824 2477851 2450955 2424950 2399501 2374550 2350489 2327937 2307311
61970 2307311 2288457 2270571 2252598 2233858 2214357 2194585 2175093 2156179 2137819 2119886 2102462
61959 2102462 2085741 2069545 2053275 2036607 2020007 2004152 1989082 1974357 1959914 1946232 1933727
61948 1933727 1922426 1912239 1903163 1895288 1888991 1884935 1883360 1883537 1884634 1886991 1891844 1899787 1910340
61935 1910340 1923109 1938433 1956567 1977173 2000268 2026984 2058627 2095384 2136582 2181886 2231663
61924 2231663 2286440 2346686 2413111 2486741 2568633 2659873 2761846 2876327 3005371 3151297
61914 3151297 3316757 3504770 3718856 3963130 4242003 4559800 4921161 5331950 5799102
61905 5799102 6328808 6924615 7586911 8312862 9095020 9918747 10760534 11588454 12364150
$$ packed form
61981B596004l1212k9982k8986k7973k6896k6005k5449k4951k4061k2552k0626
61970B307311j8854j7886j7973j8740j9501j9772j9492j8914j8360j7933j7424
61959B102462j6721j6196j6270j6668j6600j5855j5070j4725j4443j3682j2505
61948A933727j1301j0187r076p875o297m056j575J77J097K357M853P943J0553
61935A910340J2769J5324J8134K0606K3095K6716L1643L6757M1198M5304M9777
61924B231663N4777O0246O6425P3630Q1892R1240J01973J14481J29044J45926
61914C151297J65460J88013K14086K44274K78873L17797L61361M10789M67152
61905E799102N29706N95807O62296P25951P82158Q23727Q41787Q27920P75696
$$ plain form
61896 12364150 13045521 13590463 13962183 14135290 14100354 13864919 13451030 12890989 12222799
61887 12222799 11485520 10714756 9939638 9182215 8458346 7778452 7148091 6569223 6041796
61878 6041796 5564367 5133969 4746643 4398738 4087338 3809310 3560620 3337086 3135509
61869 3135509 2953774 2790135 2642790 2510029 2390489 2283231 2187455 2101973 2025088 1955356
61859 1955356 1892297 1835942 1785827 1741042 1701191 1666541 1637018 1611770 1589993 1571552 1556358
61848 1556358 1543750 1533012 1524090 1517315 1512670 1509721 1508016 1507242 1507223 1508044 1509935 1512821 1516236 1519784
61834 1519784 1523387 1527007 1530612 1534604 1539745 1546336 1553856 1561683 1569727 1578203 1587233 1596954 1607521 1618724
61820 1618724 1630183 1642247 1656027 1672065 1689551 1707507 1726343 1747566 1772295 1800615 1832107
$$ packed form
61896A2364150O81371N44942L71720J73107l4936k35435m13889n60041o68190
61887A2222799p37279p70764p75118p57423p23869o79894o30361n78868n27427
61878F041796m77429m30398l87326l47905l11400k78028k48690k23534k01577
61869C135509j81735j63639j47345j32761j19540j07258r5776q5482p6885o9732
61859A955356o3059n6355n0115m4785l9851l4650k9523k5248k1777j8441j5194
61848A556358j2608j0738q922o775m645k949j705p74j9Q21J891K886L415L548
61834A519784L603L620L605L992N141O591P520P827Q044Q476R030R721J0567J1203
61820A618724J1459J2064J3780J6038J7486J7956J8836K1223K4729K8320L1492
$$ plain form
61809 1832107 1866390 1903365 1943486 1987704 2036695 2090326 2148225 2210645 2278315 2351768 2431320
61798 2431320 2517500 2610927 2711897 2820635 2937898 3064930 3202866 3352564 3515046 3691889
61788 3691889 3885405 4098634 4334947 4597434 4888981 5213328 5575799 5982860 6441546
61779 6441546 6959825 7547065 8213464 8969121 9823813 10786688 11864535 13059161 14365144
61770 14365144 15767673 17239537 18738646 20208507 21581867 22785732 23747349 24402434
61762 24402434 24705284 24637273 24209976 23461923 22450751 21243758 19909518 18511681 17104549
61753 17104549 15730198 14418009 13186758 12047401 11004677 10058005 9203128 8434093
61745 8434093 7744121 7125602 6570664 6072280 5624620 5222508 4861212 4536674 4245226
$$ packed form
61809A832107L4283L6975M0121M4218M8991N3631N7899O2420O7670P3453P9552
61798B431320Q6180R3427J00970J08738J17263J27032J37936J49698J62482J76843
61788C691889J93516K13229K36313K62487K91547L24347L62471M07061M58686
61779F441546N18279N87240O66399P55657Q54692R62875J077847J194626J305983
61770A4365144J402529J471864J499109J469861J373360J203865R61617O55085
61762B4402434L02850o8011m27297p48053j011172j206993j334240j397837j407132
61753A7104549j374351j312189j231251j139357j042724r46672q54877p69035
61745H434093o89972o18519n54938m98384m47660m02112l61296l24538k91448
$$ plain form
61736 4245226 3982976 3746074 3531669 3337959 3163077 3004491 2859693 2727009 2605546
61727 2605546 2494854 2394744 2304784 2223608 2149089 2079479 2014092 1952775 1895306 1841627 1792090
61716 1792090 1746897 1705468 1666757 1630103 1595478 1563122 1533264 1506074 1481537 1459274 1438664
61705 1438664 1419145 1400354 1382103 1364338 1347103 1330446 1314344 1298740 1283540 1268583 1253681
61694 1253681 1238711 1223664 1208683 1194090 1180205 1166977 1153940 1140729 1127477 1114489 1101720
61683 1101720 1088930 1076220 1063992 1052348 1040925 1029414 1017942 1006786 995979 985354 974816
61672 974816 964444 954466 945246 937173 930454 924991 920420 916221 911914 907328 902648 898106 893716 889443
61658 889443 885476 882154 879702 878211 877728 878138 879077 880216 881529 883085 884709 886147 887428 888747 890081
$$ packed form
61736D245226k62250k36902k14405j93710j74882j58586j44798j32684j21463
61727B605546j10692j00110q9960q1176p4519o9610o5387o1317n7469n3679m9537
61716A792090m5193m1429l8711l6654l4625l2356k9858k7190k4537k2263k0610
61705A438664j9519j8791j8251j7765j7235j6657j6102j5604j5200j4957j4902
61694A253681j4970j5047j4981j4593j3885j3228j3037j3211j3252j2988j2769
61683A101720j2790j2710j2228j1644j1423j1511j1472j1156j0807j0625j0538
61672I74816j0372r978r220q073o719n463m571m199m307m586m680m542m390m273
61658H89443l967l322k452j491m83M10R39J139J313J556J624J438J281J319J334
$$ plain form
61643 890081 891204 891969 892318 892128 891471 890882 890910 891351 891402 890689 889767 889402 889701 890170 890373 890285 890066 889675 888702
61624 888702 886548 882889 878011 872646 867506 862963 859058 855595 852268 848885 845491 842204 839046 836067
61610 836067 833500 831555 830085 828594 826589 823841 820515 817128 814227 811864 809574 807068 804739 803258
61596 803258 802818 803139 803993 805294 806739 807868 808684 809947 812671 817353 823732 831116 838936 847065 855710
61581 855710 865103 875461 887163 900636 915957 932877 951318 971490 993335 1016322 1040186 1065498
61569 1065498 1093048 1122858 1154215 1186452 1219229 1252228 1285069 1317568 1349681 1381166 1411505
61558 1411505 1440144 1466736 1491370 1514698 1537496 1559821 1580902 1600018 1617063 1631956 1644101
61547 1644101 1652900 1658281 1660195 1658235 1652462 1644028 1634068 1622412 1608429 1592807 1577345 1563077 1549759
$$ packed form
61643H90081J123P65L49j90o57n89K8M41N1p13r22l65K99M69K03q8k19l91r73
61624H88702k154l659m878n365n140m543l905l463l327l383l394l287l158k979
61610H36067k567j945j470j491k005k748l326l387k901k363k290k506k329j481
61596H03258m40L21Q54J301J445J129Q16J263K724M682O379P384P820Q129Q645
61581H55710R393J0358J1702J3473J5321J6920J8441K0172K1845K2987K3864K5312
61569A065498K7550K9810L1357L2237L2777L2999L2841L2499L2113L1485L0339
61558A411505K8639K6592K4634K3328K2798K2325K1081J9116J7045J4893J2145
61547A644101Q799N381J914j960n773q434r960j1656j3983j5622j5462j4268j3318
$$ plain form
61534 1549759 1537207 1525945 1516286 1507897 1500673 1495075 1491260 1488898 1488367 1491173 1498491 1510088 1525412
61521 1525412 1545005 1569995 1600703 1636749 1678315 1726476 1782328 1846454 1919328 2001826 2095293
61510 2095293 2201451 2322161 2458901 2612505 2783698 2973811 3184578 3417026 3670562
61501 3670562 3942864 4230115 4526854 4825455 5115929 5386723 5626263 5824282 5972521
61492 5972521 6065420 6101135 6081935 6013102 5901282 5753830 5578946 5385240 5180716 4972355
61482 4972355 4766372 4567920 4380264 4204878 4042730 3895107 3763113 3647050 3546702
61473 3546702 3461838 3392183 3337318 3296886 3270486 3257155 3255426 3264166 3282924 3311141 3347414 3389848
61461 3389848 3436697 3486379 3537427 3588948 3640752 3692511 3743048 3790983 3835866 3878246 3918844
$$ packed form
61534A549759j2552j1262r659q389p224n598l815k362n31K806P318J1597J5324
61521A525412J9593K4990L0708L6046M1566M8161N5852O4126P2874Q2498R3467
61510B095293J06158J20710J36740J53604J71193J90113K10767K32448K53536
61501C670562K72302K87251K96739K98601K90474K70794K39540J98019J48239
61492E972521R2899L5715j9200o8833j11820j47452j74884j93706k04524k08361
61482D972355k05983j98452j87656j75386j62148j47623j31994j16063j00348
61473C546702q4864o9655n4865m0432k6400j3331j729Q740J8758K8217L6273M2434
61461C389848M6849M9682N1048N1521N1804N1759N0537M7935M4883M2380M0598
$$ plain form
61450 3918844 3958203 3997138 4037002 4079269 4124931 4174257 4226948 4282515 4340607 4400891 4462572
61439 4462572 4524171 4583908 4640153 4691474 4736409 4773407 4800993 4818093 4824367 4820182 4806053 4782208
61427 4782208 4748969 4707462 4659661 4607736 4553630 4499008 4445133 4392817 4342995 4297301 4257519
61416 4257519 4224453 4197848 4177333 4162729 4153415 4148323 4146907 4149365 4155449 4163628 4171842 4178500 4182365
61403 4182365 4182181 4177181 4167624 4154288 4137776 4118855 4099199 4081250 4067489 4060153 4061285 4072573
61391 4072573 4095388 4131444 4183119 4252712 4341692 4451192 4582969 4739223 4921487 5130172
61381 5130172 5364950 5624792 5907248 6208004 6521238 6840078 7156406 7460343 7740369
61372 7740369 7984630 8182925 8328182 8416704 8447751 8423327 8347931 8227453 8067649 7873627
$$ packed form
61450C918844L9359L8935L9864M2267M5662M9326N2691N5567N8092O0284O1681
61439D462572O1599N9737N6245N1321M4935L6998K7586J7100O274m185j4129k3845
61427D782208l3239m1507m7801n1925n4106n4622n3875n2316m9822m5694l9782
61416D257519l3066k6605k0515j4604r314n092j416K458O084Q179Q214O658L865
61403D182365j84n000r557j3336j6512j8921j9656j7949j3761p336J132J1288
61391D072573K2815L6056N1675O9593Q8980J09500J31777J56254J82264K08685
61381E130172K34778K59842K82456L00756L13234L18840L16328L03937K80026
61372G740369K44261J98295J45257Q8522L1047k4424p5396j20478j59804j94022
$$ plain form
61362 7873627 7650489 7403767 7138974 6861278 6575846 6287958 6002331 5722525 5451161
61353 5451161 5190334 4941646 4706364 4485819 4281287 4093311 3921648 3766081 3626742
61344 3626742 3503384 3395037 3300760 3220234 3153241 3099230 3057839 3029141 3012762 3007259 3011073
61333 3011073 3023605 3044746 3073796 3109543 3151002 3197294 3247142 3299230 3352816 3407191 3460757
61322 3460757 3511447 3558074 3600683 3639669 3675201 3707570 3737390 3765257 3791484 3816220 3839536
61311 3839536 3861466 3882173 3901809 3919883 3934985 3945479 3950224 3948380 3939010 3921496 3896105 3863602
61299 3863602 3824484 3779029 3727740 3671210 3609853 3544354 3476188 3407124 3338425 3270999 3206013
61288 3206013 3144741 3088064 3036666 2991348 2952432 2919280 2891268 2868915 2853006 2842658 2835302
$$ packed form
61362G873627k23138k46722k64793k77696k85432k87888k85627k79806k71364
61353E451161k60827k48688k35282k20545k04532j87976j71663j55567j39339
61344C626742j23358j08347r4277q0526o6993n4011m1391k8698j6379n503L814
61333C011073J2532K1141K9050L5747M1459M6292M9848N2088N3586N4375N3566
61322C460757N0690M6627M2609L8986L5532L2369K9820K7867K6227K4736K3316
61311C839536K1930K0707J9636J8074J5102J0494M745j844r370j7514k5391l2503
61299C863602l9118m5455n1289n6530o1357o5499o8166o9064o8699o7426o4986
61288C206013o1272n6677n1398m5318l8916l3152k8012k2353j5909j0348p356
$$ plain form
61277 2835302 2828666 2821925 2814794 2806564 2796492 2784361 2770107 2753481 2734608 2714575 2695018 2677264
61265 2677264 2662016 2649598 2640353 2634944 2634352 2639440 2650695 2668723 2694789 2730441 2776704 2834141
61253 2834141 2903597 2986270 3082930 3193443 3316981 3452112 3596479 3746541 3897446 4042789
61243 4042789 4174776 4285372 4367527 4415376 4424210 4391639 4319144 4211824 4076421 3919899
61233 3919899 3749378 3571948 3393630 3218786 3050592 2891452 2742761 2604961 2478309
61224 2478309 2363181 2259465 2166249 2082476 2007471 1940602 1880966 1827842 1781100 1740747 1706334
61213 1706334 1677045 1652076 1630736 1612577 1597759 1587009 1580920 1579434 1582154 1588821 1599279 1613175
61201 1613175 1629914 1648701 1668514 1688257 1707099 1724518 1739924 1752434 1761119 1765349 1764997 1760533
$$ packed form
61277B835302o636o741p131q230j0072j2131j4254j6626j8873k0033j9557j7754
61265B677264j5248j2418r245n409n92N088J1255J8028K6066L5652M6263N7437
61253B834141O9456Q2673R6660J10513J23538J35131J44367J50062J50905J45343
61243D042789J31987J10596Q2155M7849Q834l2571p2495j07320j35403j56522
61233C919899j70521j77430j78318j74844j68194j59140j48691j37800j26652
61224B478309j15128j03716r3216q3773p5005o6869n9636n3124m6742m0353l4413
61213A706334k9289k4969k1340j8159j4818j0750o089j486K720O667J0458J3896
61201A613175J6739J8787J9813J9743J8842J7419J5406J2510Q685M230l52m464
$$ plain form
61189 1760533 1752889 1742918 1730902 1716693 1700189 1681425 1660435 1637470 1613252 1588587 1563729 1538506
61177 1538506 1512908 1487154 1461299 1435333 1409608 1384594 1360150 1335557 1310371 1284810 1259187
61166 1259187 1233336 1206702 1178766 1149536 1120001 1091840 1066135 1042504 1019994 998522 978730
61155 978730 960713 943899 928173 914025 901281 888546 874325 858127 840302 821565 802893
61144 802893 785115 768215 751714 736023 722595 712337 704614 698318 693198 689530 687117 685440 684483
61131 684483 684776 686823 690884 696989 704720 713211 721773 730331 739010 747633 756017 764446 773490 783533
61117 783533 794614 806514 818808 831130 843509 856133 868710 880546 891352 901471 911112 919783
61105 919783 926636 930905 931940 929489 924230 917400 909601 900504 889957 878688 867519 856520 845396
$$ packed form
61189A760533p644r971j2016j4209j6504j8764k0990k2965k4218k4665k4858k5223
61177A538506k5598k5754k5855k5966k5725k5014k4444k4593k5186k5561k5623
61166A259187k5851k6634k7936k9230k9535k8161k5705k3631k2510k1472j9792
61155I78730j8017j6814j5726j4148j2744j2735j4221j6198j7825j8737j8672
61144H02893j7778j6900j6501j5691j3428j0258p723o296n120l668k413j677r57
61131F84483K93K047M061O105P731Q491Q562Q558Q679Q623Q384Q429R044J0043
61117G83533J1081J1900J2294J2322J2379J2624J2577J1836J0806J0119R641Q671
61105I19783O853M269J035k451n259o830p799r097j0547j1269j1169j0999j1124
$$ plain form
61092 845396 834209 823226 812541 802268 792677 783803 775347 767212 759584 752189 744220 735455 726868
61079 726868 719576 713694 708647 704099 700070 696672 694205 693001 692743 692540 692105 692262 693722 696017 698272
61064 698272 700402 702847 705638 708484 711357 714284 716868 718648 719659 720181 720321 720313 720695 721680 722802 723679
61048 723679 724605 726006 727972 730800 735174 741125 747665 754239 761746 771209 782208 793604 805140 817346
61034 817346 830553 845050 861442 879583 897712 913996 928509 942520 956376 969491 981962
61023 981962 994492 1006817 1017745 1026992 1035762 1045350 1056116 1067785 1079765 1091353 1102662 1115168
61011 1115168 1130318 1147933 1167107 1188078 1211717 1237672 1264933 1294173 1327704 1366892 1411273
61000 1411273 1460354 1514640 1574550 1639836 1710244 1785315 1863791 1945146 2031790 2127670 2234594
$$ packed form
61092H45396j1187j0983j0685j0273r591q874q456q135p628p395p969q765q587
61079G26868p292n882n047m548m029l398k467j204k58k03m35J57J460K295K255
61064F98272K130K445K791K846K873K927K584J780J011N22J40qL82R85J122Q77
61048G23679R26J401J966K828M374N951O540O574P507R463J0999J1396J1536J2206
61034H17346J3207J4497J6392J8141J8129J6284J4513J4011J3856J3115J2471
61023I81962J2530J2325J0928R247Q770R588J0766J1669J1980J1588J1309J2506
61011A115168J5150J7615J9174K0971K3639K5955K7261K9240L3531L9188M4381
61000A411273M9081N4286N9910O5286P0408P5071P8476Q1355Q6644R5880J06924
$$ plain form
60989 2234594 2352106 2480884 2623289 2779938 2948906 3129704 3325423 3540016 3777050
60980 3777050 4043421 4351514 4715777 5150788 5675786 6318491 7112883 8099002 9328701
60971 9328701 10861176 12736363 14948329 17449228 20168809 23000211 25750896 28136997
60963 28136997 29885753 30889767 31273646 31307833 31256547 31291940 31498377 31881878 32332179
60954 32332179 32598961 32368304 31417410 29726016 27460175 24866303 22173470 19553417
60946 19553417 17118841 14929871 13004700 11337171 9911758 8707486 7697095 6850416
60938 6850416 6139576 5540063 5029586 4589292 4205449 3867909 3567756 3297892 3054444
60929 3054444 2835294 2637675 2458687 2297169 2153084 2025423 1912137 1811521 1722034 1641128
$$ packed form
60989B234594J17512J28778J42405J56649J68968J80798J95719K14593K37034
60980C777050K66371L08093L64263M35011N24998O42705P94392R86119J229699
60971I328701J532475J875187K211966K500899K719581K831402K750685K386101
60963B8136997J748756J004014L83879L4187n1286L5393K06437L83501M50301
60954C2332179K66782k30657r50894j691394k265841k593872k692833k620053
60946A9553417k434576k188970j925171j667529j425413j204272j010391q46679
60938F850416p10840n99513n10477m40294l83843l37540l00153k69864k43448
60929C054444k19150j97619j78988j61518j44085j27661j13286j00616q9487q0906
$$ plain form
60919 1641128 1565786 1494117 1425401 1359118 1295314 1235463 1181360 1133129 1089367 1049044 1012131
60908 1012131 978720 948788 922597 900068 879938 860845 843031 827706 814924 803585 793355
60897 793355 784931 778260 772164 766216 761450 758662 757367 757023 757909 760018 762324 764031 765490 767016 767834
60882 767834 767109 765068 762114 757721 751293 743388 734897 725626 714948 703446 692627 683100 674142 665095
60868 665095 656231 648163 641247 635765 632006 629900 629033 629125 630114 631821 633998 636722 640334 645019 650785
60853 650785 657791 666290 676309 687700 700376 714216 728988 744764 762094 781183 801127 820574
60841 820574 839073 857132 875060 892328 908093 921757 932952 941544 947822 952253 954982 955932 955380
60828 955380 954002 952343 950665 949225 948094 946588 943479 937951 930075 920364 909411 897978 886732
$$ packed form
60919A641128p5342p1669o8716o6283o3804n9851n4103m8231m3762m0323l6913
60908A012131l3411k9932k6191k2529k0130j9093j7814j5325j2782j1339j0230
60897G93355q424o671o096n948m766k788j295l44Q86K109K306J707J459J526Q18
60882G67834p25k041k954m393o428p905q491r271j0678j1502j0819r527q958r047
60868F65095q864q068o916n482l759k106q67R2R89J707K177K724L612M685N766
60853F50785P006Q499J0019J1391J2676J3840J4772J5776J7330J9089J9944J9447
60841H20574J8499J8059J7928J7268J5765J3664J1195Q592O278M431K729R50n52
60828I55380j378j659j678j440j131j506l109n528p876r711j0953j1433j1246
$$ plain form
60815 886732 875601 863905 851393 838705 826586 815091 803907 793032 782702 772936 763537 754450
60803 754450 745891 738233 731870 726963 723227 720223 717940 716714 716557 717039 718038 720047 723354 727428 731667
60788 731667 736506 743170 752372 763711 776396 790123 805059 821202 837997 854656 870768 886481
60776 886481 901960 916842 930568 943250 955710 968433 980857 992002 1001528 1009767 1016914 1022753
60764 1022753 1027160 1030426 1032843 1034274 1034387 1033184 1031026 1028143 1024386 1019548 1013836 1007867 1002266 997371
60750 997371 993198 989419 985380 980488 974806 969059 963929 959524 955605 951915 948015 943216 937204 930493
60736 930493 923837 917396 910948 904619 898761 893227 887567 882036 877708 875366 874842 875619 877456 880097 882984
60721 882984 885726 888525 891773 895530 899661 904091 908563 912426 915052 916302 916360 915426 913812 912021 910341
$$ packed form
60815H86732j1131j1696j2512j2688j2119j1495j1184j0875j0330r766r399r087
60803G54450q559p658o363m907l736l004k283j226j57M82R99K009L307M074M239
60788G31667M839O664R202J1339J2685J3727J4936J6143J6795J6659J6112J5713
60776H86481J5479J4882J3726J2682J2460J2723J2424J1145R526Q239P147N839
60764A022753M407L266K417J431J13j203k158k883l757m838n712n969n601m895
60750I97371m173l779m039m892n682n747n130m405l919l690l900m799o012o711
60736I30493o656o441o448o329n858n534n660n531m328k342n24P77J837K641K887
60721H82984K742K799L248L757M131M430M472L863K626J250N8r34j614j791j680
$$ plain form
60706 910341 908490 905986 902746 899126 895494 891913 888076 883404 877495 870629 863656 857152 850831 843870
60692 843870 835609 825920 815144 803829 792299 780439 768100 755674 743856 732874 722473 712738
60680 712738 704337 697714 692522 688167 684521 681846 680403 680318 681464 683365 685730 689150 694586 701927 709825
60665 709825 717321 724792 732717 740344 746505 751173 755306 759480 763583 767579 771634 775510 778670 781115
60651 781115 783510 786484 790353 795502 802313 810472 818838 826303 832600 838204 843644 849023 854101 858853
60637 858853 863825 869609 876014 882325 888585 895891 904991 915266 925746 936438 947799 959373 970020
60624 970020 979305 987641 995112 1001111 1005224 1007623 1008359 1006988 1003161 996987 988655 978363 966837 955310
60610 955310 944629 934826 925787 917928 911939 908235 906902 907863 910851 915328 920547 925598 929548 931856
$$ packed form
60706I10341j851k504l240l620l632l581l837m672n909o866o973o504o321o961
60692H43870q261r689j0776j1315j1530j1860j2339j2426j1818j0982j0401r735
60680G12738q401o623n192m355l646k675j443q5J146J901K365L420N436P341P898
60665G09825P496P471P925P627O161M668M133M174M103L996M055L876L160K445
60651G81115K395K974L869N149O811Q159Q366P465O297N604N440N379N078M752
60637H58853M972N784O405O311O260P306R100J0275J0480J0692J1361J1574J0647
60624I70020R285Q336P471N999M113K399P36j371l827o174q332j0292j1526j1527
60610I55310j0681r803r039p859n989l704j333R61K988M477N219N051L950K308
$$ plain form
60596 931856 932588 932031 930250 927272 923365 918690 913059 906735 901213 898321 898456 900369 902709 905053 907394
60581 907394 909514 911247 912680 913690 913815 912910 911476 910011 908521 906943 905642 905063 905269 906081 907398
60566 907398 909131 911057 912925 914413 914882 913610 910500 906165 901118 895305 888649 881569 874543 867518
60552 867518 860260 853170 847364 843865 842851 843637 845334 847618 850848 855384 861043 867636 875846 887025
60538 887025 902036 920773 942987 969127 1000187 1037093 1080324 1129546 1183147 1238247 1291385
60527 1291385 1339173 1378536 1407023 1423259 1426992 1418738 1399857 1373000 1341771 1309516 1278627 1251011
60515 1251011 1228456 1212006 1201352 1195355 1193061 1193958 1197595 1203378 1210656 1218716 1226825 1234484 1241648
60502 1241648 1248696 1256448 1266192 1279254 1296345 1317618 1343498 1375035 1413198 1458250 1510201 1569537
$$ packed form
60596I31856P32n57j781k978l907m675n631o324n522k892J35J913K340K344K341
60581I07394K120J733J433J010J25r05j434j465j490j578j301n79K06Q12J317
60566I07398J733J926J868J488M69j272l110m335n047n813o656p080p026p025
60552H67518p258p090n806l499j014P86J697K284L230M536N659O593Q210J1179
60538H87025J5011J8737K2214K6140L1060L6906M3231M9222N3601N5100N3138
60527A291385M7788L9363K8487J6236L733q254j8881k6857l1229l2255l0889k7616
60515A251011k2555j6450j0654n997k294Q97L637N783P278Q060Q109P659P164
60502A241648P048P752R744J3062J7091K1273K5880L1537L8163M5052N1951N9336
$$ plain form
60490 1569537 1636979 1712596 1795619 1885225 1981361 2084837 2197024 2319925 2456867 2613076
60480 2613076 2795213 3010066 3263676 3561256 3906490 4299299 4733570 5196586 5669431
60471 5669431 6126924 6538440 6872162 7101511 7209311 7188190 7040277 6778097 6424073 6006279
60461 6006279 5552793 5088355 4633315 4202709 3805478 3445450 3123481 2838595 2588029
60452 2588029 2367976 2175097 2006955 1861002 1733956 1622623 1524836 1439218 1364356 1298580
60442 1298580 1240385 1188774 1143130 1102805 1066850 1034187 1004116 976415 950856 926860 903942
60431 903942 882312 862640 845255 829860 815987 803393 792017 781842 772948 765430 759130 753570
60419 753570 748262 743091 738352 734488 731794 730287 729736 729746 729858 729827 729942 730897 733123 736293 739692 742908
$$ packed form
60490A569537O7442P5617Q3023Q9606R6136J03476J12187J22901J36942J56209
60480B613076J82137K14853K53610K97580L45234L92809M34271M63016M72845
60471E669431M57493M11516L33722K29349J07800k1121j47913k62180l54024m17794
60461F006279m53486m64438m55040m30606l97231l60028l21969k84886k50566
60452B588029k20053j92879j68142j45953j27046j11333r7787q5618p4862o5776
60442A298580n8195n1611m5644m0325l5955l2663l0071k7701k5559k3996k2918
60431I03942k1630j9672j7385j5395j3873j2594j1376j0175q894p518o300n560
60419G53570n308n171m739l864k694j507n51J0J12l1J15R55K226L170L399L216
$$ plain form
60403 742908 745912 748716 751404 754389 758092 762404 767019 772253 778735 786117 792904 798056 802147 806414
60389 806414 811237 816140 820772 825031 828463 830386 830638 829592 827370 823631 818291 811968 805515 799492
60375 799492 794217 789950 786677 783912 781030 777912 775156 773586 773482 774284 775073 775385 775510 776090 777516 779723
60359 779723 782319 784861 787166 789441 792045 795159 798769 802863 807395 812160 817078 822545 829164 837057
60345 837057 845797 854945 864262 873409 882066 890500 899445 909083 918624 927199 934727 941520 947471 952155
60331 952155 955484 957852 959762 961722 964366 968283 973646 980101 986883 993004 997640 1000523 1001803 1001504
60317 1001504 999382 995390 989875 983205 975600 967472 959458 951886 944656 937898 932255 928141 925164 922674
60303 922674 920534 919016 918306 918519 919844 922253 925321 928712 932603 937330 942887 949108 956002 963588 971650
$$ packed form
60403G42908L004K804K688K985L703M312M615N234O482P382O787N152M091M267
60389H06414M823M903M632M259L432J923K52j046k222l739n340o323o453o023
60375G99492n275m267l273k765k882l118k756j570j04Q02P89L12J25N80J426K207
60359G79723K596K542K305K275K604L114L610M094M532M765M918N467O619P893
60345H37057Q740R148R317R147Q657Q434Q945R638R541Q575P528O793N951M684
60331I52155L329K368J910J960K644L917N363O455O782O121M636K883J280k99
60317A001504k122l992n515o670p605q128q014p572p230o758n643m114k977k490
60303I22674k140j518p10K13J325K409L068L391L891M727N557O221O894P586Q062
$$ plain form
60288 971650 979942 988302 996297 1003163 1008498 1012653 1016082 1018690 1020161 1020603 1020468 1020206 1020335 1021427 1023608
60273 1023608 1026458 1029811 1034218 1040219 1047636 1056009 1065275 1075549 1086773 1099165 1113469 1130138 1148750
60260 1148750 1168911 1191198 1216456 1244641 1275258 1308612 1345698 1387131 1433067 1484009 1540766
60249 1540766 1603707 1672955 1749239 1833739 1927036 2029031 2139843 2259910 2388993 2525762
60239 2525762 2668397 2814877 2962601 3108552 3250062 3384859 3510243 3623027 3720675 3802068
60229 3802068 3866924 3914864 3945261 3957735 3952754 3931979 3897973 3853223 3799645 3739333 3675376
60218 3675376 3611262 3549793 3493288 3444419 3405725 3378291 3361999 3357355 3366226 3390505 3430889 3487258
60206 3487258 3559463 3647224 3749810 3866144 3994676 4132862 4277291 4424594 4571735 4715227
$$ packed form
60288I71650Q292Q360P995O866N335M155L429K608J471M42j35k62J29J092K181
60273A023608K850L353M407O001P417Q373R266J0274J1224J2392J4304J6669J8612
60260A148750K0161K2287K5258K8185L0617L3354L7086M1433M5936N0942N6757
60249A540766O2941O9248P6284Q4500R3297J01995J10812J20067J29083J36769
60239B525762J42635J46480J47724J45951J41510J34797J25384J12784R7648Q1393
60229C802068O4856M7940L0397J2474m981k0775l4006m4750n3578o0312o3957
60218C675376o4114o1469n6505m8869l8694k7434j6292m644Q871K4279M0384N6369
60206C487258P2205Q7761J02586J16334J28532J38186J44429J47303J47141J43492
$$ plain form
60196 4715227 4850771 4974081 5081656 5170598 5238424 5283542 5305484 5304291 5280109 5233712 5166942
60185 5166942 5082324 4982696 4871548 4753177 4631998 4511983 4396978 4290956 4197311 4118181
60175 4118181 4054846 4008507 3980252 3970603 3979705 4007760 4054670 4119135 4198482 4289479 4389113 4494483
60163 4494483 4602141 4707908 4807574 4897914 4976870 5042711 5093426 5127385 5144407 5145714 5133042
60152 5133042 5108433 5074921 5036698 4998265 4963716 4936789 4920881 4918634 4931815 4961729 5009212
60141 5009212 5074112 5155488 5252838 5366780 5498365 5648402 5818026 6009516 6225867 6469655
60131 6469655 6742513 7045129 7376857 7735299 8116719 8516882 8931036 9353131 9775564
60122 9775564 10189987 10588263 10962782 11306297 11611864 11873008 12084103 12240809 12340353 12381375
$$ packed form
60196D715227J35544J23310J07575Q8942O7826M5118K1942j193k4182m6397o6770
60185E166942q4618r9628j11148j18371j21179j20015j15005j06022r3645p9130
60175D118181o3335m6339k8255r649R102K8055M6910O4465P9347R0997R9634J05370
60163D494483J07658J05767R9666R0340P8956O5841N0715L3959J7022J307j2672
60152E133042k4609l3512l8223l8433l4549k6927j5908k247J3181K9914M7483
60141E009212O4900Q1376R7350J13942J31585J50037J69624J91490K16351K43788
60131F469655K72858L02616L31728L58442L81420M00163M14154M22095M22433
60122I775564M14423L98276L74519L43515L05567K61144K11095J56706R9544M1022
$$ plain form
60112 12381375 12363482 12286961 12152955 11963964 11724251 11439836 11118229 10768149 10399283 10021815
60102 10021815 9645802 9280723 8935230 8616737 8330938 8081893 7872664 7705541 7581578
60093 7581578 7500471 7461321 7463119 7503877 7579457 7683783 7810107 7951779 8102173 8254633
60083 8254633 8402571 8539238 8657624 8751389 8816125 8849466 8850248 8818220 8754544 8661735 8542708
60072 8542708 8400102 8236438 8054290 7856142 7644669 7423483 7197226 6970580 6747352
60063 6747352 6530465 6322436 6125604 5942071 5773582 5621491 5487068 5371998 5278171 5206625
60053 5206625 5157218 5129948 5126237 5148013 5195649 5267470 5361062 5474047 5603578 5746033 5897397
60042 5897397 6053066 6207094 6352658 6483826 6596421 6687013 6752062 6788550 6794859 6770548
$$ packed form
60112A2381375j7893p6521j34006j88991k39713k84415l21607l50080l68866l77468
60102A0021815l76013l65079l45493l18493k85799k49045k09229j67123j23963
60093G581578q1107l9150J798M0758P5580J04326J26324J41672J50394J52460
60083H254633J47938J36667J18386R3765O4736L3341P82l2028o3676r2809j19027
60072H542708j42606j63664j82148j98148k11473k21186k26257k26646k23228
60063F747352k16887k08029j96832j83533j68489j52091j34423j15070r3827p1546
60053E206625m9407k7270l711K1776M7636P1821R3592J12985J29531J42455J51364
60042E897397J55669J54028J45564J31168J12595R0592O5049L6488O309k4311
$$ plain form
60032 6770548 6715884 6632089 6521710 6388396 6236578 6071280 5897425 5718985 5539413 5363020
60022 5363020 5195029 5039771 4899474 4775181 4668068 4579334 4509625 4459373 4429324 4420159
60012 4420159 4432092 4465399 4520954 4599759 4702359 4829104 4980204 5154701 5349662 5560901
60002 5560901 5784016 6014053 6244662 6468510 6678572 6868684 7033413 7168361 7270674
59993 7270674 7338707 7371216 7367363 7327520 7253668 7149134 7018255 6866225 6698885 6522557
59983 6522557 6344002 6169949 6006069 5856448 5724128 5611765 5521414 5454172 5410605 5391355
59973 5391355 5396844 5426536 5478849 5551589 5642073 5747005 5862662 5985188 6110641 6235201
59963 6235201 6355803 6470435 6577513 6675193 6761603 6835372 6895549 6941165 6971390 6986092 6986039
$$ packed form
60032F770548n4664q3795j10379j33314j51818j65298j73855j78440j79572j76393
60022E363020j67991j55258j40297j24293j07113q8734o9709n0252l0049r165
60012D420159J1933L3307N5555P8805J02600J26745J51100J74497J94961K11239
60002E560901K23115K30037K30609K23848K10062J90112J64729J34948J02313
59993G270674O8033L2509l853l9843p3852j04534j30879j52030j67340j76328
59983F522557j78555j74053j63880j49621j32320j12363r0351o7242m3567j9250
59973E391355N489K9692N2313P2740R0484J04932J15657J22526J25453J24560
59963F235201J20602J14632J07078R7680Q6410P3769O0177M5616L0225J4702n3
$$ plain form
59952 6986039 6972785 6948679 6916778 6880487 6843373 6809455 6783277 6769379 6771874 6794799 6842515
59941 6842515 6919417 7029402 7175831 7361701 7589541 7861415 8179132 8543926 8955311 9410235
59931 9410235 9903265 10426926 10971138 11522412 12063972 12576807 13041061 13437618 13749788
59922 13749788 13964450 14072683 14070676 13960905 13752092 13457434 13092582 12674519 12220574 11746800
59912 11746800 11266844 10792352 10333706 9899720 9497013 9130431 8803940 8520556 8281678
59903 8281678 8087214 7936584 7829421 7765505 7744502 7765821 7828492 7931079 8071479 8246354
59893 8246354 8450633 8677865 8920907 9171505 9419087 9650887 9853881 10016354 10127822
59884 10127822 10179014 10163348 10078409 9925784 9710231 9439567 9124320 8776040 8405651 8023472
$$ packed form
59952F986039j3254k4106l1901l6291l7114l3918k6178j3898K495K2925M7716
59941F842515P6902J09985J46429J85870K27840K71874L17717L64794M11385M54924
59931I410235M93030N23661N44212N51274N41560N12835M64254L96557L12170
59922A3749788K14662J08233k007j09771k08813k94658l64852m18063m53945m73774
59912A1746800m79956m74492m58646m33986m02707l66582l26491k83384k38878
59903H281678j94464j50630j07163o3916k1003K1319O2671J02587J40400J74875
59893H246354K04279K27232K43042K50598K47582K31800K02994J62473J11468
59884A0127822N1192j5666q4939j52625k15553k70664l15247l48280l70389l82179
$$ plain form
59874 8023472 7639656 7263265 6900948 6557241 6235831 5939755 5670762 5429365 5215371
59865 5215371 5027603 4863489 4719910 4594424 4484977 4388667 4301745 4220807 4143365 4067570
59855 4067570 3992421 3918326 3846618 3778420 3714625 3656846 3607358 3567721 3537979 3517260 3504468
59844 3504468 3498112 3495991 3495288 3492786 3485135 3469574 3444667 3410295 3367228 3317086 3262236 3205022
59832 3205022 3147145 3090276 3036835 2989240 2948451 2914108 2886107 2865256 2852348 2847565 2851104 2863660
59820 2863660 2885890 2917867 2959251 3009513 3067786 3132919 3203881 3279683 3358876 3439762 3521324
59809 3521324 3603326 3685069 3764383 3838171 3903585 3958333 4000238 4027460 4039769 4039573 4031273 4019242
59797 4019242 4006406 3994745 3986645 3985040 3992386 4010369 4040788 4085845 4147299 4226351 4325095 4447336
$$ packed form
59874H023472l83816l76391l62317l43707l21410k96076k68993k41397k13994
59865E215371j87768j64114j43579j25486j09447r6310q6922q0938p7442p5795
59855D067570p5149p4095p1708o8198o3795n7779m9488l9637k9742k0719j2792
59844C504468o356k121p03k502p651j5561k4907l4372m3067n0142n4850n7214
59832C205022n7877n6869n3441m7595m0789l4343k8001k0851j2908m783L539J2556
59820B863660K2230L1977M1384N0262N8273O5133P0962P5802P9193Q0886Q1562
59809C521324Q2002Q1743P9314P3788O5414N4748M1905K7222J2309j96q300j2031
59797D019242j2836j1661q100j605P346J7983L0419M5057O1454P9052R8744J22241
$$ plain form
59785 4447336 4597186 4777662 4991662 5243743 5539560 5883442 6276838 6717957 7200735
59776 7200735 7713137 8236683 8747326 9216451 9612709 9906788 10078195 10119940 10038798 9852663
59766 9852663 9586844 9269425 8926149 8576988 8235783 7911814 7611321 7338164 7093912
59757 7093912 6878052 6689031 6525798 6388223 6275815 6186744 6118973 6071907 6045880 6040208
59747 6040208 6052930 6082655 6129776 6195610 6281144 6386808 6512750 6659016 6826117 7015686
59737 7015686 7230152 7471750 7742433 8044752 8382017 8757406 9173440 9632418 10136493
59728 10136493 10686886 11283250 11923572 12603765 13316947 14053502 14801859 15548797 16279482
59719 16279482 16979006 17635396 18241853 18797006 19304539 19773238 20216588 20651017 21093554
$$ packed form
59785D447336J49850J80476K14000K52081K95817L43882L93396M41119M82778
59776G200735N12402N23546N10643M69125L96258K94079J71407M1745q1142j86135
59766I852663k65819l17419l43276l49161l41205l23969l00493k73157k44252
59757G093912k15860j89021j63233j37575j12408q9071o7771m7066k6027n672
59747F040208J2722K9725M7121O5834Q5534J05664J25942J46266J67101J89569
59737G015686K14466K41598K70683L02319L37265L75389M16034M58978N04075
59728A0136493N50393N96364O40322O80193P13182P36555P48357P46938P30685
59719A6279482O99524O56390O06457N55153N07533M68699M43350M34429M42537
$$ plain form
59710 21093554 21559869 22062743 22610935 23208712 23855627 24545869 25267650 26003653 26732343
59701 26732343 27429294 28068946 28627443 29085304 29428283 29647500 29740971 29715491 29585744 29370735
59691 29370735 29091185 28769442 28429521 28095392 27789020 27529822 27334752 27218032 27191306
59682 27191306 27264643 27447156 27746620 28169210 28719907 29402216 30216487 31158110 32216479
59673 32216479 33373826 34603459 35868635 37123110 38312751 39377919 40257563 40895293
59665 40895293 41245913 41280962 40992642 40395146 39522308 38422472 37153085 35775817 34351126
59656 34351126 32932478 31562363 30270811 29074754 27977399 26968805 26028226 25127169
59648 25127169 24233212 23315889 22353733 21338705 20275980 19180846 18074869 16981420
$$ packed form
59710B1093554M66315N02874N48192N97777O46915O90242P21781P36003P28690
59701B6732343O96951O39652N58497M57861L42979K19217R3471k5480j29747k15009
59691B9370735k79550l21743l39921l34129l06372k59198j95070j16720k6726
59682B7191306P3337J82513K99464M22590N50697O82309Q14271R41623J058369
59673C2216479J157347J229633J265176J254475J189641J065168Q79644O37730
59665D0895293L50620L5049k88320n97496q72838j099836j269387j377268j424691
59656C4351126j418648j370115j291552j196057j097355j008594r40579r01057
59648B5127169q93957r17323r62156j015028j062725j095134j105977j093449
$$ plain form
59640 16981420 15921116 14909375 13956781 13070090 12252334 11503247 10820789 10202098 9642956
59631 9642956 9137625 8680423 8267198 7894882 7560305 7260095 6991177 6750786 6536548
59622 6536548 6347041 6181617 6039027 5916711 5811892 5722629 5647155 5582839 5526524 5475290
59612 5475290 5426232 5376064 5321795 5261465 5193693 5117155 5031271 4936942 4835851 4729432 4619165
59601 4619165 4507323 4396452 4288363 4184343 4086034 3995181 3912684 3838627 3773185 3716843
59591 3716843 3669780 3631674 3602133 3580902 3567738 3562411 3564642 3573627 3587844 3605768 3626574 3649761
59579 3649761 3674364 3699165 3723622 3748091 3773036 3798314 3823310 3847786 3872649 3899903 3931625
59568 3931625 3969068 4013044 4064880 4126232 4197957 4280039 4372860 4477752 4595986 4728166 4875167
$$ packed form
59640A6981420j060304j011741r52594q86691q17756p49087o82458o18691n59142
59631I642956n05331m57202m13225l72316l34577l00210k68918k40391k14238
59622F536548j89507j65424j42590j22316j04819q9263p5474o4316n6315n1234
59612E475290m9058n0168n4269o0330o7772p6538q5884r4329j01091j06419j10267
59601D619165j11842j10871j08089j04020r8309r0853q2497p4057o5442n6342
59591C716843m7063l8106k9541k1231j3164n327K231Q985J4217J7924K0806K3187
59579C649761K4603K4801K4457K4469K4945K5278K4996K4476K4863K7254L1722
59568C931625L7443M3976N1836O1352P1725Q2082R2821J04892J18234J32180J47001
$$ plain form
59557 4875167 5038884 5221260 5423186 5645009 5887508 6151465 6436538 6741248 7063682
59548 7063682 7401398 7750790 8107344 8466672 8824896 9178115 9522016 9852234 10165045
59539 10165045 10457826 10729078 10978046 11204419 11408489 11591131 11753058 11894518 12016799
59530 12016799 12124239 12223962 12323365 12428406 12543849 12673247 12817366 12973039 13133975 13291918
59520 13291918 13436604 13555717 13636099 13665308 13632561 13529983 13354243 13106663 12791407 12414443
59510 12414443 11984584 11513928 11015722 10501949 9983219 9469460 8969119 8488203 8031242
59501 8031242 7602556 7205436 6840710 6507534 6205408 5934338 5693467 5480928 5295052
59492 5295052 5134661 4998179 4883481 4788798 4713045 4655358 4615098 4592254 4587092 4599423 4628832
$$ packed form
59557D875167J63717J82376K01926K21823K42499K63957K85073L04710L22434
59548G063682L37716L49392L56554L59328L58224L53219L43901L30218L12811
59539A0165045K92781K71252K48968K26373K04070J82642J61927J41460J22281
59530A2016799J07440R9723R9403J05041J15443J29398J44119J55673J60936J57943
59520A3291918J44686J19113Q0382K9209l2747j02578j75740k47580l15256l76964
59510A2414443m29859m70656m98206n13773n18730n13759n00341m80916m56961
59501H031242m28686l97120l64726l33176l02126k71070k40871k12539j85876
59492E295052j60391j36482j14698r4683p5753n7687m0260k2844n162J2331K9409
$$ plain form
59481 4628832 4675493 4740087 4823055 4924572 5045100 5185349 5345856 5527248 5730655 5957018
59471 5957018 6205914 6475400 6762740 7064520 7375964 7690372 7999094 8291877 8557845
59462 8557845 8786790 8969610 9097959 9164883 9166750 9104021 8979819 8798777 8567873 8296851
59452 8296851 7996074 7674307 7339346 6999538 6662770 6334403 6017826 5716592 5434192
59443 5434192 5171802 4928214 4702515 4495449 4307717 4138415 3985966 3849495 3728505
59434 3728505 3621982 3528641 3447577 3378118 3319330 3270143 3229737 3197572 3173224 3156274 3146217
59423 3146217 3142491 3144740 3152793 3166184 3184044 3205754 3231223 3260176 3291718 3325256 3361325 3400795
59411 3400795 3443577 3488516 3533867 3577230 3616020 3649451 3679976 3711940 3749131 3794292 3850052
$$ packed form
59481D628832M6661O4594Q2968J01517J20528J40249J60507J81392K03407K26363
59471E957018K48896K69486K87340L01780L11444L14408L08722K92783K65968
59462H557845K28945J82820J28349O6924J867o2729j24202j81042k30904k71022
59452H296851l00777l21767l34961l39808l36768l28367l16577l01234k82400
59443E434192k62390k43588k25699k07066j87732j69302j52449j36471j20990
59434C728505j06523r3341q1064o9459n8788m9187m0406l2165k4348j6950j0057
59423C146217l726K249Q053J3391J7860K1710K5469K8953L1542L3538L6069L9470
59411C400795M2782M4939M5351M3363L8790L3431L0525L1964L7191M5161N5760
$$ plain form
59400 3850052 3918750 4001563 4099060 4212323 4342198 4487650 4646619 4819006 5007984 5218486
59390 5218486 5455651 5724783 6031276 6379777 6774006 7217307 7712102 8258234 8852556
59381 8852556 9490115 10164473 10866284 11582560 12298129 12997720 13667056 14293728 14868535
59372 14868535 15386339 15845608 16247466 16594867 16891596 17141146 17346157 17508259 17627480
59363 17627480 17701669 17726993 17699090 17613717 17467245 17258107 16988384 16663951 16293648 15888928
59353 15888928 15463322 15030287 14600613 14181774 13778633 13393104 13023169 12663728 12309022
59344 12309022 11953940 11593796 11224850 10845727 10457560 10062736 9664582 9268205 8880067
59335 8880067 8505958 8150025 7815608 7505584 7221369 6962782 6729537 6522066 6340542
$$ packed form
59400C850052O8698Q2813R7497J13263J29875J45452J58969J72387J88978K10502
59390E218486K37165K69132L06493L48501L94229M43301M94795N46132N94322
59381H852556O37559O74358P01811P16276P15569O99591O69336O26672N74807
59372A4868535N17804M59269M01858L47401K96729K49550K05011J62102J19221
59363A7627480P4189K5324k7903q5373j46472k09138k69723l24433l70303m04720
59353A5888928m25606m33035m29674m18839m03141l85529l69935l59441l54706
59344A2309022l55082l60144l68946l79123l88167l94824l98154l96377l88138
59335H880067l74109l55933l34417l10024k84215k58587k33245k07471j81524
$$ plain form
59326 6340542 6184054 6051177 5940491 5850137 5777823 5721773 5680909 5653714 5637691 5630333 5629903
59315 5629903 5634903 5643506 5653730 5663473 5670271 5671871 5667268 5656363 5638525 5612486 5577764 5535066
59303 5535066 5485158 5428634 5367209 5303849 5240906 5179197 5119522 5064034 5015313 4975075 4944607
59292 4944607 4925634 4919760 4927663 4949567 4986005 5037493 5104062 5185771 5283283 5397390 5528334
59281 5528334 5675871 5839422 6017823 6209492 6413022 6626810 6847736 7070959 7291394
59272 7291394 7504638 7706119 7890414 8052235 8187564 8293359 8366946 8406454 8411326 8381822
59262 8381822 8318481 8222636 8097150 7946319 7775387 7590148 7396096 7197441 6997324 6799044
59252 6799044 6606175 6421231 6245154 6078635 5923192 5780588 5652037 5538519 5441106 5360453
$$ packed form
59326F340542j56488j32877j10686r0354p2314n6050m0864k7195j6023p358m30
59315E629903N000Q603J0224R743O798J600m603j0905j7838k6039l4722m2698
59303E535066m9908n6524o1425o3360o2943o1709n9675n5488m8721m0238l0468
59292D944607j8973n874P903K1904L6438N1488O6569Q1709R7512J14107J30944
59281E528334J47537J63551J78401J91669K03530K13788K20926K23223K20435
59272G291394K13244K01481J84295J61821J35329J05795P3587L9508M872k9504
59262H381822o3341r5845j25486j50831j70932j85239j94052j98655k00117j98280
59252F799044j92869j84944j76077j66519j55443j42604j28551j13518r7413q0653
$$ plain form
59242 5360453 5296794 5251148 5225918 5223811 5246739 5296243 5374300 5483217 5625281 5802966 6018898
59231 6018898 6275208 6573346 6914520 7299160 7725204 8187283 8677418 9185208 9696747
59222 9696747 10194453 10659051 11071604 11414059 11669961 11826549 11876373 11816881 11649686 11381201
59212 11381201 11023158 10591297 10103333 9577840 9033252 8486103 7949800 7434969 6949839
59203 6949839 6499517 6085773 5708613 5367891 5063118 4792636 4553914 4344130 4159984
59194 4159984 3997743 3854368 3728041 3616925 3518166 3428998 3348242 3275878 3211605 3154609
59184 3154609 3104281 3060322 3022461 2990683 2965277 2945996 2931647 2921147 2914610 2912883 2916525 2925703
59172 2925703 2940383 2960025 2983831 3012024 3046241 3087814 3136235 3190080 3248820 3312823 3382075
$$ packed form
59242E360453o3659m5646k5230k107K2928M9504P8057J08917J42064J77685K15932
59231F018898K56310K98138L41174L84640M26044M62079M90135N07790N11539
59222I696747M97706M64598M12553L42455K55902J56588M9824n9492j67195k68485
59212A1381201l58043m31861m87964n25493n44588n47149n36303n14831m85130
59203F949839m50322m13744l77160l40722l04773k70482k38722k09784j84146
59194D159984j62241j43375j26327j11116r8759q9168q0756p2364o4273n6996
59184C154609n0328m3959l7861l1778k5406j9281j4349j0500o537j727L642R178
59172B925703J4680J9642K3806K8193L4217M1573M8421N3845N8740O4003O9252
$$ plain form
59161 3382075 3455830 3533165 3612968 3693608 3773413 3851271 3926187 3996509 4060219 4115664 4161501
59150 4161501 4196350 4219254 4230240 4229942 4218955 4198044 4168550 4131998 4089553 4042302 3991693 3939280
59138 3939280 3886340 3834128 3784165 3737988 3697047 3662975 3637347 3620955 3613930 3616700 3630030 3653995
59126 3653995 3688028 3732371 3788390 3856982 3937863 4031031 4137716 4258908 4394106 4542645
59116 4542645 4705370 4883904 5078970 5290547 5518986 5764752 6027362 6305279 6596292
59107 6596292 6897002 7202200 7505181 7797916 8070358 8310658 8507297 8650831 8733497 8748912
59097 8748912 8693925 8570478 8384712 8144851 7860598 7543211 7204032 6852613 6496721 6143351
59087 6143351 5798501 5466433 5150195 4852417 4574704 4316932 4078364 3859008 3658863
$$ packed form
59161C382075P3755P7335P9803Q0640P9805P7858P4916P0322O3710N5445M5837
59150D161501L4849K2904J0986k98j0987k0911k9494l6552m2445m7251n0609n2413
59138C939280n2940n2212m9963m6177m0941l4072k5628j6392p025K770J3330K3965
59126C653995L4033M4343N6019O8592Q0881R3168J06685J21192J35198J48539
59116D542645J62725J78534J95066K11577K28439K45766K62610K77917K91013
59107F596292L00710L05198L02981K92735K72442K40300J96639J43534Q2666J5415
59097H748912n4987j23447j85766k39861k84253l17387l39179l51419l55892l53370
59087F143351l44850l32068l16238k97778k77713k57772k38568k19356k00145
$$ plain form
59078 3658863 3476446 3309369 3156123 3016343 2889695 2775517 2673148 2581604 2499316 2425084
59068 2425084 2358894 2300987 2250699 2207072 2169941 2139488 2115471 2097863 2087371 2084137 2086776 2094008
59056 2094008 2106328 2124462 2146810 2169971 2191209 2208660 2219649 2220921 2210716 2189091 2156278
59045 2156278 2112395 2058955 1999094 1935838 1871252 1807360 1746518 1690382 1639387 1593507 1552744
59034 1552744 1516926 1485984 1460515 1441202 1427598 1418252 1411955 1408168 1406542 1406937 1409661 1414733 1421039
59021 1421039 1427056 1432105 1436052 1438321 1438385 1436914 1435237 1433837 1432482 1431580 1432176 1434714 1438846 1444383 1451497
59006 1451497 1460151 1470276 1482177 1495845 1510307 1524644 1539014 1553479 1566523 1576356 1583353 1589597
58994 1589597 1596265 1603001 1609615 1616647 1624195 1631796 1639634 1648406 1657849 1666905 1675556 1685057 1696098 1708093
$$ packed form
59078C658863j82417j67077j53246j39780j26648j14178j02369r1544q2288p4232
59068B425084o6190n7907n0288m3627l7131l0453k4017j7608j0492l234K639P232
59056B094008J2320J8134K2348K3161K1238J7451J0989J272j0205k1625l2813
59045B156278m3883n3440n9861o3256o4586o3892o0842n6136n0995m5880m0763
59034A552744l5818l0942k5469j9313j3604r346o297l787j626L95K724N072O306
59021A421039O017N049L947K269O4j471j677j400j355r02N96K538M132N537P114
59006A451497Q654J0125J1901J3668J4462J4337J4370J4465J3044R833O997O244
58994A589597O668O736O614P032P548P601P838Q772R443R056Q651R501J1041J1995
$$ plain form
58980 1708093 1720641 1734328 1749613 1766100 1783429 1802035 1822710 1846146 1872969 1903415 1937076
58969 1937076 1973836 2014744 2060897 2111689 2165360 2220892 2278022 2335749 2392586 2448290 2503607
58958 2503607 2558046 2609434 2656028 2697720 2734992 2768293 2798937 2829209 2860903 2894789 2931799
58947 2931799 2973562 3021343 3075613 3136993 3206481 3284445 3370512 3464864 3568564 3682336 3806186
58936 3806186 3940577 4086971 4246788 4420759 4609548 4814149 5035677 5275884 5537942
58927 5537942 5825456 6140509 6483847 6857204 7264228 7708844 8193949 8722063 9296148
58918 9296148 9919232 10593850 11321650 12102279 12932165 13804892 14712102 15642400 16579132
58909 16579132 17500320 18380774 19193430 19909763 20502084 20947389 21229292 21337634 21268980
$$ packed form
58980A708093J2548J3687J5285J6487J7329J8606K0675K3436K6823L0446L3661
58969A937076L6760M0908M6153N0792N3671N5532N7130N7727N6837N5704N5317
58958B503607N4439N1388M6594M1692L7272L3301L0644L0272L1694L3886L7010
58947B931799M1763M7781N4270O1380O9488P7964Q6067R4352J03700J13772J23850
58936C806186J34391J46394J59817J73971J88789K04601K21528K40207K62058
58927E537942K87514L15053L43338L73357M07024M44616M85105N28114N74085
58918I296148O23084O74618P27800P80629Q29886Q72727R07210R30298R36732
58909A6579132R21188Q80454Q12656P16333N92321M45305K81903J08342o8654
$$ plain form
58900 21268980 21028480 20629859 20092723 19440240 18698254 17893470 17050505 16190744 15333259
58891 15333259 14494583 13686884 12917938 12193506 11518372 10894869 10322291 9798745 9322246
58882 9322246 8889523 8495384 8134275 7801401 7491854 7200071 6921145 6651917 6390597
58873 6390597 6136605 5891150 5656598 5434577 5225507 5029844 4848312 4680742 4526259
58864 4526259 4384790 4256830 4141596 4037216 3942962 3859368 3785858 3720424 3662258 3612537
58854 3612537 3571810 3538736 3512317 3493271 3481987 3477123 3477625 3484481 3499143 3521711 3551835 3589782
58842 3589782 3635375 3687365 3745151 3809702 3881769 3960709 4046290 4140010 4243370 4356395 4479257
58831 4479257 4613816 4762065 4924403 5100849 5292658 5501377 5727800 5973486 6242088
$$ packed form
58900B1268980k40500l98621n37136o52483p41986q04784q42965q59761q57485
58891A5333259q38676q07699p68946p24432o75134o23503n72578n23546m76499
58882I322246m32723l94139l61109l32874l09547k91783k78926k69228k61320
58873F390597k53992k45455k34552k22021k09070j95663j81532j67570j54483
58864D526259j41469j27960j15234j04380r4254q3594p3510o5434n8166m9721
58854C612537m0727l3074k6419j9046j1284m864N02O856J4662K2568L0124L7947
58842C589782M5593N1990N7786O4551P2067P8940Q5581R3720J03360J13025J22862
58831D479257J34559J48249J62338J76446J91809K08719K26423K45686K68602
$$ plain form
58822 6242088 6537619 6862466 7218533 7609097 8038018 8508251 9022682 9585306 10199806
58813 10199806 10867631 11588544 12361579 13183334 14045668 14936191 15839899 16738628 17609641
58804 17609641 18426479 19161306 19786363 20275527 20607730 20770093 20758048 20574094 20227941
58795 20227941 19736790 19123244 18412271 17629677 16801079 15949576 15093790 14248347 13425043
58786 13425043 12632407 11875186 11155748 10475661 9835422 9234137 8670990 8146248 7659707
58777 7659707 7209185 6791862 6406198 6051195 5724582 5423108 5143959 4884819 4643303
58768 4643303 4417494 4206419 4009198 3824637 3652416 3493315 3347194 3212158 3086878
58759 3086878 2972307 2869622 2777830 2694976 2620316 2553539 2493105 2437311 2386114 2340023 2298053
$$ packed form
58822F242088K95531L24847L56067L90564M28921M70233N14431N62624O14500
58813A0199806O67825P20913P73035Q21755Q62334Q90523R03708Q98729Q71013
58804A7609641Q16838P34827O25057M89164L32203J62363j2045j83954l46153
58795B0227941m91151o13546p10973p82594q28598q51503q55786q45443q23304
58786A3425043p92636p57221p19438o80087o40239o01285n63147n24742m86541
58777G659707m50522m17323l85664l55003l26613l01474k79149k59140k41516
58768D643303k25809k11075j97221j84561j72221j59101j46121j35036j25280
58759C086878j14571j02685r1792q2854p4660o6777o0434n5794n1197m6091m1970
$$ plain form
58748 2298053 2258609 2221595 2187841 2157134 2128658 2102747 2080364 2061248 2044147 2028361 2013603
58737 2013603 1999034 1984059 1969446 1956056 1943062 1928988 1913763 1898039 1881145 1861617 1839282
58726 1839282 1815006 1788708 1759377 1726852 1691953 1655023 1615871 1575102 1534147 1494027 1455135
58715 1455135 1417885 1382491 1348561 1315981 1285631 1258195 1232986 1209097 1186866 1166990 1149115
58704 1149115 1132689 1118211 1106164 1095620 1085510 1076354 1069117 1063302 1057889 1053248 1050214 1048124 1045719
58691 1045719 1043207 1041332 1039095 1034554 1027431 1018829 1008805 996430 982024 967235 952959 939079
58679 939079 926118 915248 906647 899571 894003 890586 889110 888748 889594 892208 895791 898521 899687 899950
58665 899950 899774 899260 899327 901182 904606 908225 911364 914083 915756 915446 913670 912163 911867 912567 914293 917522
$$ packed form
58748B298053l9444l7014l3754l0707k8476k5911k2383j9116j7101j5786j4758
58737B013603j4569j4975j4613j3390j2994j4074j5225j5724j6894j9528k2335
58726A839282k4276k6298k9331l2525l4899l6930l9152m0769m0955m0120l8892
58715A455135l7250l5394l3930l2580l0350k7436k5209k3889k2231j9876j7875
58704A149115j6426j4478j2047j0544j0110r156p237n815n413m641l034k090k405
58691A045719k512j875k237m541p123q602j0024j2375j4406j4789j4276j3880
58679I39079j2961j0870q601p076n568l417j476l62Q46K614L583K730J166K63
58665H99950j76n14O7J855L424L619L139K719J673l10j776j507k96P00J726L229
$$ plain form
58649 917522 922156 927822 934958 944170 954841 965908 977683 991353 1007094 1024279 1043117 1064325
58637 1064325 1087633 1112423 1139539 1170580 1205684 1243838 1285150 1331051 1382552 1440100 1504800
58626 1504800 1577799 1658727 1746742 1843023 1950356 2070526 2204118 2352703 2519055 2704971
58616 2704971 2910625 3135947 3380651 3642769 3918713 4204495 4494722 4780362 5049405
58607 5049405 5290036 5491933 5645387 5742033 5777321 5751087 5666150 5528258 5347001 5134129
58597 5134129 4900064 4653015 4400684 4150472 3907833 3676286 3458924 3258055 3073706
58588 3073706 2904714 2751296 2614619 2494189 2387960 2294907 2215116 2147379 2089120 2038890
58578 2038890 1996561 1960797 1928552 1897326 1865772 1832015 1793830 1750975 1705306 1658396 1611044
$$ packed form
58649I17522M634N666P136R212J0671J1067J1775J3670J5741J7185J8838K1208
58637A064325K3308K4790K7116L1041L5104L8154M1312M5901N1501N7548O4700
58626A504800P2999Q0928Q8015R6281J07333J20170J33592J48585J66352J85916
58616B704971K05654K25322K44704K62118K75944K85782K90227K85640K69043
58607E049405K40631K01897J53454R6646L5288k6234q4937j37892j81257k12872
58597E134129k34065k47049k52331k50212k42639k31547k17362k00869j84349
58588C073706j68992j53418j36677j20430j06229r3053p9791o7737n8259n0230
58578B038890m2329l5764l2245l1226l1554l3757l8185m2855m5669m6910m7352
$$ plain form
58567 1611044 1564934 1522165 1482737 1444874 1408277 1374716 1344968 1317487 1290698 1264507 1239105
58556 1239105 1214369 1190971 1170077 1151557 1134313 1118445 1105004 1093684 1083098 1073359 1065818 1060020
58544 1060020 1053563 1045334 1036378 1027146 1016511 1004064 990843 977199 962413 946939 932436 919004
58532 919004 904956 890002 876033 864028 852785 841505 831037 821604 811820 801011 790212 779949
58520 779949 769294 758031 747561 738873 731665 725948 722187 719437 715859 711620 708691 707327 705577
58507 705577 702802 700718 700162 699853 699243 699524 700835 701601 701801 703745 708258 713130 716812 720513 725115 729161
58491 729161 731836 735024 740333 746658 752676 759241 767304 775786 783437 790645 797645 803236 807077 811032
58477 811032 816317 821337 824036 824363 822878 819126 813067 806049 798757 790221 780224 770494 762047 753628
$$ packed form
58567A611044m6110m2769l9428l7863l6597l3561k9748k7481k6789k6191k5402
58556A239105k4736k3398k0894j8520j7244j5868j3441j1320j0586r739p541n798
58544A060020o457q229q956r232j0635j2447j3221j3644j4786j5474j4503j3432
58532I19004j4048j4954j3969j2005j1243j1280j0468r433r784j0809j0799j0263
58520G79949j0655j1263j0470q688p208n717l761k750l578m239k929j364j750
58507G05577k775k084n56l09o10K81J311P66K00J944M513M872L682L701M602M046
58491G29161K675L188N309O325O018O565Q063Q482P651P208P000N591L841L955
58477H11032N285N020K699L27j485l752o059p018p292q536r997r730q447q419
$$ plain form
58463 753628 744261 735079 727132 719670 712102 705374 699882 694329 688091 682413 677959 673614 668988 665454
58449 665454 663318 660809 657363 654990 654726 654722 653714 653319 654897 657137 658922 661603 666060 670361 672882
58434 672882 675131 679025 683924 688783 694619 702206 709774 715624 720816 726791 732559 736722 740145 744232
58420 744232 748671 752986 758007 763615 767444 768188 767817 768311 768650 767399 765730 765373 765930 766556 767910 770197
58404 770197 771798 772156 773345 776440 779180 779702 779634 780816 781986 781653 781317 782669 784364 784805 785482 788285
58388 788285 792007 794772 797519 801781 806371 809580 812436 816670 821601 826135 831496 838921 846927 853969
58374 853969 861522 871563 883363 895629 909163 924338 938680 950164 960352 971119 981130 988834
58362 988834 995932 1004269 1012107 1017141 1020511 1024223 1027395 1028769 1030107 1033242 1036548 1038138 1039726 1043387
$$ packed form
58463G53628r367r182p947p462p568o728n492n553o238n678m454m345m626l534
58449F65454k136k509l446k373k64mj008l95J578K240J785K681M457M301K521
58434F72882K249L894M899M859N836P587P568N850N192N975N768M163L423M087
58420G44232M439M315N021N608L829P44l71M94L39j251j669l57N57O26J354K287
58404G70197J601L58J189L095K740N22o8J182J170l33l36J352J695M41O77K803
58388G88285L722K765K747M262M590L209K856M234M931M534N361P425Q006P042
58374H53969P553J0041J1800J2266J3534J5175J4342J1484J0188J0767J0011P704
58362I88834P098Q337P838N034L370L712L172J374J338L135L306J590J588L661
$$ plain form
58348 1043387 1047453 1049684 1051654 1055759 1060767 1064595 1068680 1075159 1082509 1088481 1094654 1103570 1114022 1123718
58334 1123718 1133925 1146823 1160957 1173939 1186992 1202184 1217933 1231987 1245999 1262317 1279100
58323 1279100 1293536 1306960 1321761 1336252 1347898 1358585 1371247 1384319 1395106 1405571 1418946
58312 1418946 1433541 1445949 1457503 1471463 1486608 1499938 1512975 1528943 1546271 1561398 1575541
58301 1575541 1592194 1610468 1627550 1645215 1667034 1691399 1714108 1735638 1759096 1783451 1805765
58290 1805765 1827767 1853099 1880377 1906113 1932061 1962322 1995539 2027519 2059153 2094082 2130906
58279 2130906 2165669 2199826 2237653 2277862 2315895 2352540 2392198 2434604 2476365 2518621 2565034
58268 2565034 2614364 2663133 2713161 2768225 2826069 2882279 2939023 3000928 3065561 3127570 3189063
$$ packed form
58348A043387M066K231J970M105N008L828M085O479P350N972O173Q916J0452R696
58334A123718J0207J2898J4134J2982J3053J5192J5749J4054J4012J6318J6783
58323A279100J4436J3424J4801J4491J1646J0687J2662J3072J0787J0465J3375
58312A418946J4595J2408J1554J3960J5145J3330J3037J5968J7328J5127J4143
58301A575541J6653J8274J7082J7665K1819K4365K2709K1530K3458K4355K2314
58290A805765K2002K5332K7278K5736K5948L0261L3217L1980L1634L4929L6824
58279B130906L4763L4157L7827M0209L8033L6645L9658M2406M1761M2256M6413
58268B565034M9330M8769N0028N5064N7844N6210N6744O1905O4633O2009O1493
$$ plain form
58257 3189063 3255920 3327015 3397419 3469048 3547245 3629889 3711135 3792989 3881745 3975935 4069720
58246 4069720 4165212 4269174 4380366 4492769 4608381 4733765 4866979 5001442 5139825 5290112
58236 5290112 5451014 5615806 5787379 5974329 6175294 6383052 6600908 6838477 7094495
58227 7094495 7361079 7641807 7947552 8277745 8624583 8992302 9392514 9824230 10279525
58218 10279525 10765311 11297447 11877349 12497904 13168230 13907528 14719085 15597609 16557893
58209 16557893 17627571 18816904 20127611 21586725 23238331 25108591 27217787 29622364
58201 29622364 32406239 35641247 39407275 43849493 49170993 55588201 63366007 72899990
58193 72899990 84710425 99384293 117595488 140079723 167318497 199102405 234459074
$$ packed form
58257C189063O6857P1095P0404P1629P8197Q2644Q1246Q1854Q8756R4190R3785
58246D069720R5492J03962J11192J12403J15612J25384J33214J34463J38383J50287
58236E290112J60902J64792J71573J86950K00965K07758K17856K37569K56018
58227G094495K66584K80728L05745L30193L46838L67719M00212M31716M55295
58218A0279525M85786N32136N79902O20555O70326P39298Q11557Q78524R60284
58209A6557893J069678J189333J310707J459114J651606J870260K109196K404577
58201B9622364K783875L235008L766028M442218N321500O417208P777806R533983
58193G2899990J1810435J4673868J8211195K2484235K7238774L1783908L5356669
$$ plain form
58186 234459074 271918009 309442897 343846039 370659583 385413384 385690794 372223963
58179 372223963 348195373 317630160 284183733 250680273 219022433 190244958 164746392
58172 164746392 142587951 123645115 107628618 94145442 82804818 73251390 65144430
58165 65144430 58190048 52197000 47052366 42652023 38895706 35725570 33113467 31019974
58157 31019974 29409644 28291893 27707059 27694017 28310031 29641239 31722917 34462130 37686077
58148 37686077 41213298 44764979 47813195 49663846 49808029 48204359 45227193 41404038
58140 41404038 37215026 33030171 29096481 25537878 22392747 19664909 17338961 15374011
58132 15374011 13716874 12322730 11151586 10156997 9296648 8547734 7898838 7334133 6836507
$$ packed form
58186B34459074L7458935L7524888L4403142K6813544J4753801K77410j3466831
58179C72223963k4028590l0565213l3446427l3503460l1657840k8777475k5498566
58172A64746392k2158441j8942836j6016497j3483176j1340624r553428q106960
58165F5144430o954382n993048n144634m400343l756317l170136k612103k093493
58157C1019974j610330j117751n84834j3042O16014J331208K081678K739213L223947
58148C7686077L527221L551681L048216J850651J44183j603670k977166l823155
58140D1404038m189012m184855l933690l558603l145131k727838k325948j964950
58132A5374011j657137j394144j171144r94589q60349p48914o48896n64705m97626
$$ plain form
58123 6836507 6396878 6008281 5657852 5334327 5035795 4761521 4504383 4259619 4032349
58114 4032349 3827948 3642848 3472335 3318967 3185380 3066668 2957603 2859941 2775188 2697149
58104 2697149 2618723 2539615 2461222 2380838 2297304 2215751 2140494 2069115 1998844 1932386 1872124
58093 1872124 1815038 1758793 1706616 1660879 1617854 1574013 1531729 1493866 1458464 1423521 1391249
58082 1391249 1362920 1335076 1305387 1276836 1251813 1227658 1202294 1178540 1158494 1139225 1118455
58071 1118455 1099039 1083456 1069197 1053987 1040340 1030549 1022243 1013146 1005176 999628 993406 984359 975415
58058 975415 969070 962631 953243 942889 933962 924554 912677 900703 891114 881964 870963 860045 851654
58045 851654 844402 836566 829966 826220 822995 818131 813787 812437 812376 811246 810360 811497 812971 812991 813463 816373
$$ packed form
58123F836507m39629l88597l50429l23525k98532k74274k57138k44764k27270
58114D032349k04401j85100j70513j53368j33587j18712j09065r7662q4753p8039
58104B697149p8426p9108p8393q0384q3534q1553p5257p1379p0271o6458o0262
58093A872124n7086n6245n2177m5737m3025m3841m2284l7863l5402l4943l2272
58082A391249k8329k7844k9689k8551k5023k4155k5364k3754k0046j9269k0770
58071A118455j9416j5583j4259j5210j3647r791q306r097p970n548o222r047q944
58058I75415o345o439r388j0354q927r408j1877j1974r589r150j1001j0918q391
58045H51654p252p836o600l746l225m864m344j350o1j130q86J137J474K0M72K910
$$ plain form
58029 816373 819656 820677 820588 821297 821376 819043 816117 814942 814255 812062 809719 809187 808946 806607 803096 800419
58013 800419 797707 793198 787790 782995 777706 770482 762752 756326 750023 742194 734297 728523 724059 719021
57999 719021 713952 710146 706651 702145 697708 694666 691903 688356 685840 686222 687969 688694 688866 689884 690790
57984 690790 690341 690152 692327 695811 698388 700479 703756 707898 711891 716652 723068 729163 732486 733747 735021
57969 735021 736022 735179 732738 729773 725762 720181 714823 711509 709112 705738 702072 699569 697190 693227
57955 693227 688665 685410 682699 678649 674003 670979 669622 668518 667937 669043 671047 672294 673245 675409 678342
57940 678342 680532 682165 684119 685380 684447 682217 680483 678629 674822 669476 664398 659395 652804 644707
57926 644707 636631 628726 620107 611385 604035 597893 592004 587226 585192 585392 586120 587620 591386 596918 602140
$$ packed form
58029H16373L283J021q9P09P9k333k926j175o87k193k343n32k41k339l511k677
58013H00419k712m509n408m795n289p224p730o426o303p829p897n774m464n038
57999G19021n069l806l495m506m437l042k763l547k516L82J747P25J72J018R06
57984F90790m49j89K175L484K577K091L277M142L993M761O416O095L323J261J274
57969G35021J001q43k441k965m011n581n358l314k397l374l666k503k379l963
57955F93227m562l255k711m050m646l024j357j104n81J106K004J247R51K164K933
57940F78342K190J633J954J261r33k230j734j854l807n346n078n003o591q097
57926F44707q076p905q619q722p350o142n889m778k034K00P28J500L766N532N222
$$ plain form
57911 602140 606710 612080 618547 625031 631630 639760 649680 660135 670281 679833 687735 692955 696267 699150
57897 699150 701426 702154 702118 702891 703924 703059 699727 695258 690369 684663 678409 672557 667068 661255 655486
57882 655486 650710 646754 643014 640187 639182 639017 637959 636209 635304 635591 636533 638777 643372 649462 655228
57867 655228 660664 667054 674204 680730 686604 692830 698972 703669 707260 711157 714795 716014 714558 712457
57853 712457 710693 708156 704297 700267 696755 692933 688280 683562 679444 675745 672396 669610 667028 664212
57839 664212 661803 660590 659795 658147 656194 655422 655503 654734 652964 651578 650592 648337 644262 639622 634972 629323
57823 629323 622276 614829 607463 599505 591040 583523 577805 573196 569011 565436 562436 559443 556514 554341
57809 554341 552835 551227 549684 549196 549729 550210 550451 551402 553375 555778 558697 562960 568459 574244 580475
$$ packed form
57911F02140M570N370O467O484O599Q130R920J0455J0146R552P902N220L312K883
57897F99150K276P28l6P73J033q65l332m469m889n706o254n852n489n813n769
57882F55486m776l956l740k827j005j65j058j750r05K87R42K244M595O090N766
57867F55228N436O390P150O526N874O226O142M697L591L897L638J219j456k101
57853G12457j764k537l859m030l512l822m653m718m118l699l349k786k582k816
57839F64212k409j213p95j648j953p72Q1p69j770j386r86k255m075m640m650n649
57823F29323p047p447p366p958q465p517n718m609m185l575l000k993k929k173
57809E54341j506j608j543m88N33M81K41R51J973K403K919M263N499N785O231
$$ plain form
57794 580475 588423 598308 608982 620043 632322 645852 659168 671139 681791 690906 697557 701595
57782 701595 704098 705828 706614 706478 705828 704304 701020 696241 691230 686218 680242 673322 667051 662502 659121
57767 659121 656222 654146 653486 654436 657176 661538 666201 669674 672228 675388 679550 683721 687622 692147 697560
57752 697560 703100 708686 715195 722618 729730 735982 742105 748417 754285 759637 765377 771832 778429 785191
57738 785191 792876 801276 809118 816040 822911 829861 835924 841116 846940 854197 862061 869966 878619 888465
57724 888465 898885 909683 921732 935430 950064 965320 981789 999404 1017107 1034757 1053716
57713 1053716 1074834 1097468 1121103 1146231 1172924 1200359 1228590 1259097 1292728 1328820 1367254
57702 1367254 1409672 1457587 1510909 1569416 1634210 1706613 1786970 1875606 1973807 2083050 2204629
$$ packed form
57794E80475P948R885J0674J1061J2279J3530J3316J1971J0652R115O651M038
57782G01595K503J730P86j36o50j524l284m779n011n012n976o920o271m549l381
57767F59121k899k076o60R50K740M362M663L473K554L160M162M171L901M525N413
57752F97560N540N586O509P423P112O252O123O312N868N352N740O455O597O762
57738G85191P685Q400P842O922O871O950O063N192N824P257P864P905Q653R846
57724H88465J0420J0798J2049J3698J4634J5256J6469J7615J7703J7650J8959
57713A053716K1118K2634K3635K5128K6693K7435K8231L0507L3631L6092L8434
57702A367254M2418M7915N3322N8507O4794P2403Q0357Q8636R8201J09243J21579
$$ plain form
57691 2204629 2340753 2494602 2668362 2862412 3076941 3312627 3568717 3841831 4127328
57682 4127328 4419940 4711798 4991453 5246382 5465850 5641207 5765834 5837022 5857562 5834829
57672 5834829 5779111 5702667 5617751 5533266 5453284 5378072 5303726 5219772 5110463 4962570 4773033
57661 4773033 4549246 4303792 4049983 3799922 3563056 3345320 3149994 2978787 2831563
57652 2831563 2706213 2600105 2511221 2437565 2376804 2327468 2289416 2262207 2244057 2233287 2229697
57641 2229697 2233702 2245328 2264947 2293678 2332029 2379280 2435218 2501371 2579591 2670712 2775534
57630 2775534 2895803 3033082 3187806 3360342 3551482 3760651 3984828 4220121 4462704
57621 4462704 4706735 4942762 5159769 5347781 5497580 5600052 5648413 5640712 5579001 5467320
$$ packed form
57691B204629J36124J53849J73760J94050K14529K35686K56090K73114K85497
57682D127328K92612K91858K79655K54929K19468J75357J24627P1188K0540k2733
57672E834829n5718p6444q4916q4485p9982p5212p4346q3954j09309j47893j89537
57661D773033k23787k45454k53809k50061k36866k17736j95326j71207j47224
57652B831563j25350j06108q8884p3656o0761m9336l8052k7209j8150j0770l590
57641B229697M005J1626J9619K8731L8351M7251N5938O6153P8220R1121J04822
57630B775534J20269J37279J54724J72536J91140K09169K24177K35293K42583
57621D462704K44031K36027K17007J88012J49799J02472M8361p701o1711j11681
$$ plain form
57611 5467320 5312037 5122795 4910691 4685387 4454697 4225471 4002934 3789803 3587646
57602 3587646 3398564 3224298 3064585 2918026 2783979 2662303 2552066 2452030 2361803 2281099
57592 2281099 2208563 2142670 2083179 2030381 1983645 1941964 1905131 1873004 1844399 1818143 1794432
57581 1794432 1773754 1755361 1738317 1723195 1711056 1701441 1693078 1685915 1680762 1677454 1675140 1673987 1674895
57568 1674895 1677742 1681493 1685846 1691392 1698381 1706671 1716608 1728614 1742192 1756568 1771958 1789020 1807471
57555 1807471 1826500 1846070 1866617 1888017 1910202 1934267 1961547 1992037 2024989 2060570 2099697
57544 2099697 2142829 2190298 2243220 2302629 2368336 2440143 2519602 2609040 2709469 2821021 2944780
57533 2944780 3082367 3234141 3399449 3578060 3769286 3969858 4174294 4376939 4571701
$$ packed form
57611E467320j55283j89242k12104k25304k30690k29226k22537k13131k02157
57602C587646j89082j74266j59713j46559j34047j21676j10237j00036r0227q0704
57592B281099p2536o5893n9491n2798m6736m1681l6833l2127k8605k6256k3711
57581A794432k0678j8393j7044j5122j2139r615q363p163n153l308k314j153R08
57568A674895K847L751M353N546O989Q290R937J2006J3578J4376J5390J7062J8451
57555A807471J9029J9570K0547K1400K2185K4065K7280L0490L2952L5581L9127
57544B099697M3132M7469N2922N9409O5707P1807P9459Q9438J00429J11552J23759
57533B944780J37587J51774J65308J78611J91226K00572K04436K02645J94762
$$ plain form
57524 4571701 4750150 4902292 5019893 5097889 5133063 5123698 5071123 4980170 4857658 4711411
57514 4711411 4550144 4382197 4213680 4048677 3890792 3742950 3606136 3480242 3366066
57505 3366066 3264683 3175107 3094809 3022790 2960096 2906998 2861813 2823148 2791261 2766324 2747113
57494 2747113 2732477 2722654 2718174 2718656 2723558 2732945 2746709 2764083 2784737 2809470 2839172 2873934
57482 2873934 2913754 2959312 3011550 3071224 3139208 3216448 3303401 3400336 3508400 3629473 3764782
57471 3764782 3914429 4078189 4255488 4444274 4640752 4840230 5037054 5223577 5390497
57462 5390497 5528896 5631590 5693063 5709872 5681790 5611759 5504629 5366794 5206626 5033384
57452 5033384 4854881 4676767 4503686 4339492 4186154 4044048 3913771 3796324 3691295
$$ packed form
57524D571701J78449J52142J17601P7996L5174r365n2575r0953j22512j46247
57514D711411j61267j67947j68517j65003j57885j47842j36814j25894j14176
57505C366066j01383q9576q0298p2019o2694n3098m5185l8665l1887k4937j9211
57494B747113j4636r823m480M82M902R387J3764J7374K0654K4733K9702L4762
57482B873934L9820M5558N2238N9674O7984P7240Q6953R6935J08064J21073J35309
57471C764782J49647J63760J77299J88786J96478J99478J96824J86523J66920
57462E390497J38399J02694O1473J6809k8082p0031j07130j37835j60168j73242
57452E033384j78503j78114j73081j64194j53338j42106j30277j17447j05029
$$ plain form
57443 3691295 3596539 3510487 3433489 3366210 3307938 3257182 3212871 3174251 3140608 3111667 3087478
57432 3087478 3067484 3050638 3036641 3025936 3018168 3012011 3007031 3004358 3004816 3007642 3011810 3017410 3024731
57419 3024731 3033012 3041193 3049269 3058028 3067941 3078955 3090862 3103351 3116154 3129524 3144124 3160214
57407 3160214 3177514 3195854 3215221 3235183 3255178 3275395 3296398 3317934 3339301 3360860 3383730
57396 3383730 3407786 3431475 3454051 3476522 3499823 3523542 3547159 3571142 3595893 3620825 3645333
57385 3645333 3669601 3693644 3716762 3738844 3761149 3784851 3809728 3835118 3861042 3887457 3913473
57374 3913473 3938542 3963590 3989735 4016512 4042492 4067263 4091828 4117338 4144155 4171918 4199974
57363 4199974 4228023 4256621 4286502 4317234 4347409 4376473 4405380 4434934 4464602 4493648 4522487
$$ packed form
57443C691295r4756q6052p6998o7279n8272n0756m4311l8620l3643k8941k4189
57432C087478j9994j6846j3997j0705p768o157m980k673M58K826M168N600P321
57419C024731Q281Q181Q076Q759R913J1014J1907J2489J2803J3370J4600J6090
57407C160214J7300J8340J9367J9962J9995K0217K1003K1536K1367K1559K2870
57396C383730K4056K3689K2576K2471K3301K3719K3617K3983K4751K4932K4508
57385C645333K4268K4043K3118K2082K2305K3702K4877K5390K5924K6415K6016
57374C913473K5069K5048K6145K6777K5980K4771K4565K5510K6817K7763K8056
57363D199974K8049K8598K9881L0732L0175K9064K8907K9554K9668K9046K8839
$$ plain form
57352 4522487 4552091 4582816 4614558 4647252 4680506 4713502 4746001 4778759 4812321 4846216 4879926
57341 4879926 4913745 4947991 4982267 5016332 5050802 5086148 5121822 5157279 5193098 5230122 5268062
57330 5268062 5305769 5342330 5377337 5410989 5444647 5480369 5518830 5558381 5597019 5634525 5671856
57319 5671856 5709432 5747192 5785568 5825085 5865430 5906062 5947263 5989510 6032223 6074247 6115314
57308 6115314 6156111 6197247 6239108 6282293 6327050 6372490 6417362 6461591 6506212 6551972 6598834
57297 6598834 6646716 6695853 6746384 6798301 6851822 6907271 6964573 7023298 7083210 7144488 7207491
57286 7207491 7272397 7338776 7405419 7471105 7535595 7599260 7661612 7721108 7776580 7827826 7874345
57275 7874345 7914602 7947371 7972908 7992049 8005044 8012156 8014606 8013927 8011011 8006592 8001890 7997798 7994171
$$ packed form
57352D522487K9604L0725L1742L2694L3254L2996L2499L2758L3562L3895L3710
57341D879926L3819L4246L4276L4065L4470L5346L5674L5457L5819L7024L7940
57330E268062L7707L6561L5007L3652L3658L5722L8461L9551L8638L7506L7331
57319E671856L7576L7760L8376L9517M0345M0632M1201M2247M2713M2024M1067
57308F115314M0797M1136M1861M3185M4757M5440M4872M4229M4621M5760M6862
57297F598834M7882M9137N0531N1917N3521N5449N7302N8725N9912O1278O3003
57286G207491O4906O6379O6643O5686O4490O3665O2352N9496N5472N1246M6519
57275G874345M0257L2769K5537J9141J2995P112K450o79k916m419m702m092l627
$$ plain form
57262 7994171 7990870 7988889 7989402 7992375 7997243 8004371 8014602 8027759 8042854 8059575 8078396 8099305 8121475
57249 8121475 8144294 8167848 8192323 8217602 8243399 8269221 8294336 8318363 8341653 8364564 8386622
57238 8386622 8407015 8425605 8442823 8458794 8473136 8485409 8495296 8502688 8508049 8512342 8516092 8518907
57226 8518907 8520367 8520884 8521232 8521745 8522530 8523989 8526558 8530350 8535382 8541673 8548782 8556007 8563424 8572006 8582259
57211 8582259 8593536 8605075 8616734 8628257 8638974 8648879 8658823 8668817 8677436 8683843 8689144 8694402 8698600
57198 8698600 8700074 8698982 8696643 8693066 8686817 8676952 8663580 8646805 8626489 8602932 8576608 8547411
57186 8547411 8515129 8480306 8443642 8405035 8364208 8321738 8278303 8233421 8186153 8136619 8085661
57175 8085661 8033481 7979799 7924901 7869352 7813128 7756213 7699582 7644338 7590322 7536800 7484030
$$ packed form
57262G994171l301j981N13K973M868P128J0231J3157J5095J6721J8821K0909K2170
57249H121475K2819K3554K4475K5279K5797K5822K5115K4027K3290K2911K2058
57238H386622K0393J8590J7218J5971J4342J2273R887P392N361M293L750K815
57226H518907J460N17L48N13P85J459K569L792N032O291P109P225P417Q582J0253
57211H582259J1277J1539J1659J1523J0717R905R944R994Q619O407N301N258M198
57198H698600J474j092k339l577o249r865j3372j6775k0316k3557k6324k9197
57186H547411l2282l4823l6664l8607m0827m2470m3435m4882m7268m9534n0958
57175H085661n2180n3682n4898n5549n6224n6915n6631n5244n4016n3522n2770
$$ plain form
57164 7484030 7432919 7383712 7336459 7292140 7251679 7214180 7177712 7141651 7106756 7073250 7040425
57153 7040425 7007966 6976017 6943926 6910356 6874628 6836577 6795196 6748984 6697723 6642476 6583816
57142 6583816 6521429 6455487 6386974 6316598 6244865 6173389 6104630 6040024 5979629 5923785 5873747
57131 5873747 5830266 5792674 5759624 5729702 5701074 5671583 5639499 5603651 5563116 5517856 5469474
57120 5469474 5420269 5371752 5325025 5281954 5244362 5212283 5184508 5160604 5140845 5124545 5110588
57109 5110588 5100111 5097161 5106405 5131526 5175861 5242831 5335279 5455913 5609337 5803192 6047779
57098 6047779 6356161 6744902 7233689 7844334 8601122 9531155 10661601 12014929 13605792
57089 13605792 15439253 17507302 19784775 22228888 24782996 27382671 29964973 32479083
$$ packed form
57164G484030n1111m9207m7253m4319m0461l7499l6468l6061l4895l3506l2825
57153G040425l2459l1949l2091l3570l5728l8051m1381m6212n1261n5247n8660
57142F583816o2387o5942o8513p0376p1733p1476o8759o4606o0395n5844n0038
57131E873747m3481l7592l3050k9922k8628k9491l2084l5848m0535m5260m8382
57120E469474m9205m8517m6727m3071l7592l2079k7775k3904j9759j6300j3957
57109E110588j0477k950R244K5121M4335O6970R2448J20634J53424J93855K44587
57098F047779L08382L88741M88787O10645P56788R30033J130446J353328J590863
57089A3605792J833461K068049K277473K444113K554108K599675K582302K514110
$$ plain form
57081 32479083 34886663 37142441 39168111 40848190 42058392 42704351 42741873 42173732 41037849
57072 41037849 39398111 37337832 34953917 32352308 29643637 26936313 24327349 21894017
57064 21894017 19688294 17734740 16032845 14563459 13296231 12195789 11227440 10362413
57056 10362413 9580046 8865909 8209407 7603486 7044513 6530198 6057625 5623615 5225701
57047 5225701 4861449 4527509 4220332 3937326 3676642 3436644 3216223 3014630 2830186
57038 2830186 2660003 2501706 2354473 2217702 2089768 1969058 1855236 1748545 1648725 1555443
57028 1555443 1468862 1388820 1314263 1244371 1179432 1119798 1064887 1014075 967723 926514 890435
57017 890435 859162 832553 810080 790576 773174 757747 744087 731755 721181 713645 709657 708600
$$ packed form
57081C2479083K407580K255778K025670J680079J210202O45959L7522n68141j135883
57072D1037849j639738k060279k383915k601609k708671k707324k608964k433332
57064B1894017k205723j953554j701895j469386j267228j100442r68349q65027
57056A0362413p82367p14137o56502o05921n58973n14315m72573m34010l97914
57047E225701l64252l33940l07177k83006k60684k39998k20421k01593j84444
57038B830186j70183j58297j47233j36771j27934j20710j13822j06691r9820r3282
57028A555443q6581q0042p4557o9892o4939n9634n4911n0812m6352m1209l6079
57017H90435l1273k6609k2473j9504j7402j5427j3660j2332j0574p536l988j057
$$ plain form
57005 708600 710398 716140 726687 742479 765289 798364 844248 904640 983008 1084475 1211684
56994 1211684 1363276 1537160 1730028 1928711 2104668 2223777 2264613 2227281 2127389 1985753
56984 1985753 1822710 1655450 1495552 1348509 1215982 1097719 992007 896857 811839 737601
56974 737601 673399 616757 565967 521422 483983 453436 429068 410454 397022 387755 381858 379087
56962 379087 379289 382449 389175 400182 415116 432607 451355 470184 487147 499644 505646 504208 495189
56949 495189 479526 459626 438341 417417 397624 379906 365215 353380 343493 335512 330428 328838
56937 328838 330490 335304 343694 355661 370632 388525 410075 435553 463445 490370 511902 523890
56925 523890 524101 513035 493076 467173 438490 410216 384417 361221 339907 320515 303712 289719
$$ packed form
57005G08600J798N742J0547J5792K2810L3075M5884O0392P8368J01467J27209
56994A211684J51592J73884J92868J98683J75957J19109M0836l7332r9892j41636
56984A985753j63043j67260j59898j47043j32527j18263j05712r5150q5018p4238
56974G37601o4202n6642n0790m4545l7439l0547k4368j8614j3432r267n897k771
56962C79087K02L160O726J1007J4934J7491J8748J8829J6963J2497O002j438r019
56949D95189j5663j9900k1285k0924j9793j7718j4691j1835r887p981n084j590
56937C28838J652M814Q390J1967J4971J7893K1550K5478K7892K6925K1532J1988
56925E23890K11j1066j9959k5903k8683k8274k5799k3196k1314j9392j6803j3993
$$ plain form
56913 289719 278293 269239 261968 255130 247856 240845 235124 230291 225306 220491 217199 215746 215049 214261
56899 214261 213471 212953 212990 214351 217678 222501 228114 235218 245392 259083 275471 294143 315397 338886
56885 338886 363422 388117 412059 432708 446362 450953 447386 437938 424671 409612 394845 381463
56873 381463 369438 359070 351656 348226 348631 352471 360155 372554 390338 414168 444909 483210 529130
56860 529130 582122 640673 701711 760682 812014 849415 867136 862889 839775 804289 762384 718101
56848 718101 674855 635745 602292 574587 553253 539867 535182 538572 550054 571542 605381 652679
56836 652679 713642 788222 875323 971883 1072936 1171514 1258012 1321289 1352415 1348192 1311539
56825 1311539 1249542 1171281 1085884 1000703 920529 848162 785199 732350 689904 658271 637662
$$ packed form
56913B89719j1426r054p271o838p274p011n721m833m985m815l292j453o97p88
56899B14261p90n18L7J361L327M823N613P104J0174J3691J6388J8672K1254K3489
56885C38886K4536K4695K3942K0649J3654M591l567r448j3267j5059j4767j3382
56873C81463j2025j0368p414l430M05L840P684J2399J7784K3830L0741L8301M5920
56860E29130N2992N8551O1038N8971N1332L7401J7721m247k3114l5486m1905m4283
56848G18101m3246l9110l3453k7705k1334j3386m685L390J1482K1488L3839M7298
56836F52679O0963P4580Q7101R6560J01053R8578Q6498O3277L1126m223l6653
56825A311539o1997p8261q5397q5181q0174p2367o2963n2849m2446l1633k0609
$$ plain form
56814 637662 627346 626203 634325 653249 684248 726990 779963 841238 908038 975621 1036758 1082450
56802 1082450 1104379 1098436 1066671 1015501 952066 882434 811909 744918 684067 630397 584797
56791 584797 548212 520453 500080 485896 477720 475709 480046 491368 510261 535930 566339 599677
56779 599677 634368 667256 693110 706763 705346 688727 659230 621312 580053 538863 498916 460749
56767 460749 425339 393440 365130 340454 319585 302105 287148 274529 264655 257139 250701 244727
56755 244727 239647 235438 231110 226187 221363 217076 212712 207932 203568 200416 198131 196048 194037 191833
56741 191833 188653 184387 180283 177558 176024 174812 173647 172676 171778 170799 169904 169091 167972 166498 165266
56726 165266 164557 163711 161978 159478 156976 155252 154836 155679 156919 157663 158071 158832 159766 160056 159825 160058 160822
$$ packed form
56814F37662j0316j143Q122J8924L0999M2742N2973O1275O6800O7583O1137M5692
56802A082450K1929n943l1765n1170o3435o9632p0525o6991o0851n3670m5600
56791E84797l6585k7759k0373j4184q176k011M337J1322J8893K5669L0409L3338
56779E99677L4691L2888K5854J3653j417j6619k9497l7918m1259m1190l9947l8167
56767D60749l5410l1899k8310k4676k0869j7480j4957j2619r874p516o438n974
56755B44727n080m209m328m923m824m287m364m780m364l152k285k083k011k204
56741A91833l180m266m104k725j534j212j165r71q98r79q95q13j119j474j232
56726A65266p09q46j733k500k502j724m16Q43J240P44M08P61R34K90k31K33P64
$$ plain form
56709 160822 160982 160074 158928 157977 156426 153810 151023 148990 147551 146429 146071 146699 147586 148094 148431 148807
56693 148807 148934 148962 149678 151081 151996 151898 151872 152957 154782 156682 158867 161399 163229 163427 162475 161391 160477
56676 160477 159808 159896 160854 161806 162034 161871 161731 161357 160773 160772 161511 161922 161532 161513 162698 163828 163220 161105 158882
56657 158882 157037 155306 154014 153648 153645 153026 151763 150344 148605 146237 143895 142473 141767 140968 140034 139448
56641 139448 139139 138763 138581 138974 139536 139716 139854 140588 141660 142316 142480 142639 143021 143716 145030 146840 148176
56624 148176 148337 147863 147645 147738 147897 148452 149678 151027 151983 153003 154681 156705 158611 160752 163349 165342
56608 165342 165462 164012 162498 161895 162182 163062 164215 165276 166308 167758 169443 170460 170715 171403 173113 174650
56592 174650 174802 174063 173405 172532 170793 168749 167324 166300 165163 164519 165120 166255 166708 166583 166635 166664 166284
$$ packed form
56709A60822J60r08j146r51j551k616k787k033j439j122l58O28Q87N08L37L76
56693A48807J27K8P16J403R15r8k6J085J825J900K185K532J830J98r52j084r14
56676A60477o69Q8R58R52K28j63j40l74n84jP39M11l90j9J185J130o08k115k223
56657A58882j845j731j292l66lo19j263j419j739k368k342j422p06p99r34n86
56641A39448l09l76j82L93N62J80J38P34J072O56J64J59L82O95J314J810J336
56624A48176J61m74k18R3J59N55J226J349R56J020J678K024J906K141K597J993
56608A65342J20j450j514o03K87Q80J153J061J032J450J685J017K55O88J710J537
56592A74650J52p39o58q73j739k044j425j024j137o44O01J135M53j25N2K9l80
$$ plain form
56575 166284 166539 168812 172604 176252 179477 183360 188014 192241 195663 199446 204548 210560 216614 222377
56561 222377 227944 233580 239663 246205 252660 258791 265193 272210 279053 284893 290020 294865 298748 300929
56547 300929 302128 303510 304811 304896 303604 301560 298749 294865 290594 286940 283544 279163 273559 267538 261471
56532 261471 255186 249018 243517 238358 232885 227450 222903 219143 215555 212420 210400 208967 206899 204127
56518 204127 201610 199559 197243 194397 191430 188388 185065 182019 180135 179286 178579 177733 177080 176474 175416
56503 175416 173963 172495 170927 169183 167834 167230 166730 165942 165808 167043 168455 168409 167177 166180 165770 165542
56487 165542 165932 167506 169374 170375 171310 173863 177823 181444 184147 186751 189520 192212 195663 200921 206917
56472 206917 211324 213727 215751 218182 220311 222246 225367 230058 235073 239604 244045 248461 252296 255834
$$ packed form
56575A66284K55K273L792L648L225L883M654M227L422L783N102O012O054N763
56561B22377N567N636O083O542O455O131O402P017O843N840N127M845L883K181
56547C00929J199J382J301Q5j292k044k811l884m271l654l396m381n604o021o067
56532B61471o285o168n501n159n473n435m547l760l588l135k020j433k068k772
56518B04127k517k051k316k846k967l042l323l046j884q49p07q46o53o06j058
56503A75416j453j468j568j744j349o04n00p88j34J235J412m6j232r97m10k28
56487A65542L90J574J868J001R35K553L960L621K703K604K769K692L451N258N996
56472B06917M407K403K024K431K129J935L121M691N015M531M441M416L835L538
$$ plain form
56458 255834 259989 264317 267216 268378 269178 270378 271382 271981 272769 273525 273224 272083 271614 272238 272780 272761 273235
56441 273235 274822 276741 278319 279686 280619 280490 279746 279522 279466 277876 274464 270963 268457 266045 262771 258960
56425 258960 254982 250495 245624 241267 237641 234043 230430 227531 225090 221880 217851 214416 212143 210097
56411 210097 207903 206492 206181 205963 205313 204896 204914 204645 204199 204824 206759 208590 209329 209470 209558 209574 210120 212154
56393 212154 215014 216751 216959 217293 218683 220255 221615 223888 227614 231729 235558 239771 244558 248913 252552
56378 252552 256476 260814 264262 266525 269126 272845 276502 279290 282080 285369 288114 289798 291470 293599
56364 293599 295056 295437 296176 297940 299119 298388 296837 296046 295921 295888 296421 297897 299637 301412 304128 307791
56348 307791 310704 312102 313698 317124 321592 325567 329026 332550 335876 338937 342804 348094 353888 359499
$$ packed form
56458B55834M155M328K899J162Q00J200J004N99P88P56l01j141m69O24N42j9M74
56441B73235J587J919J578J367R33j29p44k24n6j590l412l501k506k412l274l811
56425B58960l978m487m871m357l626l598l613k899k441l210m029l435k273k046
56411B10097k194j411l11k18o50m17J8k69m46O25J935J831P39J41Q8J6N46K034
56393B12154K860J737K08L34J390J572J360K273L726M115L829M213M787M355L639
56378B52552L924M338L448K263K601L719L657K788K790L289K745J684J672K129
56364B93599J457L81P39J764J179p31j551p91j25l3N33J476J740J775K716L663
56348C07791K913J398J596L426M468L975L459L524L326L061L867N290N794N611
$$ plain form
56334 359499 365808 373534 381762 389510 397278 405806 414794 423996 434038 445030 455952 466446 477521
56321 477521 489554 501346 512171 522793 533385 542474 549103 554022 557612 558763 557096 554148 551042
56308 551042 547121 542151 537641 534500 531570 527898 524307 521361 518214 515016 513865 515598 518066 519487
56294 519487 521126 524718 529718 535254 542362 551932 562612 573084 584398 597753 612130 626487 642238
56281 642238 661043 682002 703455 725814 750282 776710 805091 837259 874606 915865 959611
56270 959611 1007196 1060732 1120071 1184484 1255662 1336246 1426804 1526778 1637044 1758989 1892442
56259 1892442 2036863 2193159 2361905 2541203 2728459 2922595 3121955 3321664 3515631
56250 3515631 3699746 3870766 4023885 4154272 4259783 4339817 4393124 4419326 4421087 4402123
$$ packed form
56334C59499O309P726Q228P748P768Q528Q988R202J0042J0992J0922J0494J1075
56321D77521J2033J1792J0825J0622J0592R089O629M919L590J151j667k948l106
56308E51042l921m970m510l141k930l672l591k946l147l198j151J733K468J421
56294E19487J639L592N000N536P108R570J0680J0472J1314J3355J4377J4357J5751
56281F42238J8805K0959K1453K2359K4468K6428K8381L2168L7347M1259M3746
56270I59611M7585N3536N9339O4413P1178Q0584R0558R9974J10266J21945J33453
56259A892442J44421J56296J68746J79298J87256J94136J99360J99709J93967
56250C515631J84115J71020J53119J30387J05511Q0034N3307K6202J761j8964
$$ plain form
56240 4402123 4364500 4310285 4244015 4170615 4092266 4009889 3925911 3842486 3758502 3671438 3581040
56229 3581040 3488368 3392653 3292130 3186862 3077826 2964357 2845373 2722137 2597119 2471262
56219 2471262 2344939 2220282 2099720 1983363 1870467 1762251 1660695 1565954 1477591 1396794
56209 1396794 1324528 1258982 1197796 1141421 1091488 1047426 1007631 972349 942245 915632 890298
56198 890298 866680 846144 827692 809630 792903 779390 768345 757992 749154 743684 740626 737572
56186 737572 734683 733880 735226 737556 741484 748230 756714 765248 774813 787176 801191 814646 828268
56173 828268 843984 860647 875562 888968 902840 916405 927093 934904 941622 946627 947779 945692
56161 945692 942973 940008 935590 930783 927893 926431 924404 922789 924337 928726 933428 938759 947465 959850
$$ packed form
56240D402123l7623n4215o6270p3400p8349q2377q3978q3425q3984q7064r0398
56229C581040r2672r5715j00523j05268j09036j13469j18984j23236j25018j25857
56219B471262j26323j24657j20562j16357j12896j08216j01556r4741q8363q0797
56209A396794p2266o5546o1186n6375m9933m4062l9795l5282l0104k6613k5334
56198H90298k3618k0536j8452j8062j6727j3513j1045j0353q838n470l058l054
56186G37572k889q03J346K330L928O746Q484Q534R565J2363J4015J3455J3622
56173H28268J5716J6663J4915J3406J3872J3565J0688P811O718N005J152k087
56161I45692k719k965m418m807k890j462k027j615J548M389M702N331Q706J2385
$$ plain form
56147 959850 973994 990475 1012249 1039943 1071875 1108752 1154096 1209959 1276400 1355031 1448813
56136 1448813 1558088 1680441 1814014 1956887 2103673 2246960 2382018 2506648 2617810
56127 2617810 2713265 2795917 2871528 2942066 3005248 3059620 3105156 3139477 3158789 3162905 3155000 3136736
56115 3136736 3107912 3069962 3024540 2968967 2898099 2810659 2709384 2596086 2472055 2342694
56105 2342694 2215992 2096264 1984201 1882141 1793498 1717445 1650050 1590528 1540665 1498608
56095 1498608 1459525 1422434 1390212 1362816 1336827 1311884 1291110 1274665 1259139 1243906 1231862
56084 1231862 1223334 1215539 1208591 1205653 1206530 1207461 1207856 1210823 1216536 1221738 1226446 1234216 1244968 1254513
56070 1254513 1262216 1272173 1285614 1299061 1311265 1325072 1341165 1356805 1371967 1389782 1409796 1427884
$$ packed form
56147I59850J4144J6481K1774K7694L1932L6877M5344N5863O6441P8631R3782
56136A448813J09275J22353J33573J42873J46786J43287J35058J24630J11162
56127B617810R5455Q2652P5611P0538O3182N4372M5536L4321J9312M116p905j8264
56115C136736k8824l7950m5422n5573p0868q7440j01275j13298j24031j29361
56105B342694j26702j19728j12063j02060q8643p6053o7395n9522m9863m2057
56095A498608l9083l7091l2222k7396k5989k4943k0774j6445j5526j5233j2044
56084A231862q528p795o948k938Q77R31L95K967N713N202M708P770J0752R545
56070A254513P703R957J3441J3447J2204J3807J6093J5640J5162J7815K0014J8088
$$ plain form
56058 1427884 1443962 1462519 1484454 1505849 1525961 1548567 1574022 1597909 1619264 1642304 1668388
56047 1668388 1694140 1719144 1747339 1779152 1810425 1840793 1874624 1911995 1947551 1980250 2015257
56036 2015257 2054118 2092265 2128471 2167375 2210226 2252662 2294244 2340534 2392982 2446565 2500098
56025 2500098 2558669 2622874 2686174 2746224 2808305 2874184 2938457 2999563 3063334 3131688 3199054
56014 3199054 3264126 3333807 3411120 3490698 3570506 3656168 3749192 3843150 3936311 4035662 4143601
56003 4143601 4253535 4363713 4482013 4611566 4745274 4880269 5023847 5179373 5340928
55994 5340928 5507856 5689325 5888074 6095453 6309135 6539041 6788741 7048718 7315996
55985 7315996 7602090 7912908 8239713 8579379 8944162 9341665 9765417 10215606 10707784
$$ packed form
56058A427884J6078J8557K1935K1395K0112K2606K5455K3887K1355K3040K6084
56047A668388K5752K5004K8195L1813L1273L0368L3831L7371L5556L2699L5007
56036B015257L8861L8147L6206L8904M2851M2436M1582M6290N2448N3583N3533
56025B500098N8571O4205O3300O0050O2081O5879O4273O1106O3771O8354O7366
56014C199054O5072O9681P7313P9578P9808Q5662R3024R3958R3161R9351J07939
56003D143601J09934J10178J18300J29553J33708J34995J43578J55526J61555
55994E340928J66928J81469J98749K07379K13682K29906K49700K59977K67278
55985G315996K86094L10818L26805L39666L64783L97503M23752M50189M92178
$$ plain form
55976 10707784 11250075 11834171 12460551 13148971 13911868 14742982 15645904 16647010 17766100
55967 17766100 19003977 20375348 21923067 23683369 25672552 27928496 30529428 33553490
55959 33553490 37066370 41178501 46074068 51965100 59082150 67754897 78454662 91738653
55951 91738653 108233392 128670451 153711610 183502442 217394817 254136332 292042012
55944 292042012 328562933 359751461 380850724 388204639 381027742 361530770 333546143
55937 333546143 301002399 267133220 234272787 203850620 176534704 152522362 131780129
55930 131780129 114109347 99166608 86554688 75903754 66869458 59127969 52426651
55923 52426651 46609591 41564239 37172642 33331779 29978041 27058280 24502699 22248863
$$ packed form
55976A0707784N42291N84096O26380O88420P62897Q31114R02922J001106J119090
55967A7766100J237877J371371J547719J760302J989183K255944K600932L024062
55959C3553490L512880M112131M895567N891032P117050Q672747J0699765J3283991
55951I1738653J6494739K0437059K5041159K9790832L3892375L6741515L7905680
55944B92042012L6520921L1188528K1099263P353915p176897j9496972k7984627
55937C33546143l2543744l3869179l2860433l0422167k7315916k4012342k0742233
55930A31780129j7670782j4942739j2611920j0650934r034296p741489o701318
55923E2426651n817060n045352m391597l840863l353738k919761k555581k253836
$$ plain form
55915 22248863 20264641 18524165 16984886 15608512 14381359 13293949 12321011 11439323
55907 11439323 10645107 9936132 9294913 8705666 8169994 7689873 7251768 6842646 6465798
55898 6465798 6126008 5813963 5519461 5245931 4998062 4768304 4548683 4343371 4156908
55889 4156908 3982113 3811729 3650404 3503451 3365125 3229518 3101965 2988130 2882293
55880 2882293 2777672 2678325 2589672 2506826 2423330 2342594 2270021 2202274 2134581 2070502 2014334
55869 2014334 1961630 1907122 1854590 1809320 1767911 1724922 1682695 1645431 1610180 1572847 1536990
55858 1536990 1507896 1483734 1460848 1441888 1430492 1423594 1417128 1413876 1417740 1425320 1430669 1433141 1433378
55845 1433378 1427103 1410666 1387918 1364321 1339011 1309624 1279734 1253976 1230257 1204022 1175990
$$ packed form
55915B2248863j984222j740476j539279j376374j227153j087410r72938q81688
55907A1439323p94216p08975o41219n89247n35672m80121m38105m09122l76848
55898F465798l39790l12045k94502k73530k47869k29758k19621k05312j86463
55889D156908j74795j70384j61325j46953j38326j35607j27553j13835j05837
55880B882293j04621r9347q8653q2846q3496q0736p2573o7747o7693o4079n6168
55869B014334n2704n4508n2532m5270m1409m2989m2227l7264l5251l7333l5857
55858A536990k9094k4162k2886j8960j1396o898o466l252L864P580N349K472K37
55845A433378o275j6437k2748k3597k5310k9387k9890k5758k3719k6235k8032
$$ plain form
55834 1175990 1148828 1120609 1088598 1055534 1025426 996980 967588 939680 916594 896096 874566
55823 874566 853775 836985 821989 804603 785804 769112 754139 738796 724768 714751 707146 699117
55811 699117 691950 688002 685621 682481 680604 682578 686092 687781 689128 692928 697221 698485 697657 697190 695203
55796 695203 688524 678724 669237 659119 645499 629750 615403 602180 587702 572940 560487 549529
55784 549529 537876 526882 519096 513135 506194 499515 496058 494732 492177 488264 484587 479493 470145 457909
55770 457909 446408 435720 423596 410907 400612 392573 384430 376476 370805 366778 362036 356872 353085
55757 353085 349757 344721 338922 334774 331460 326414 320167 315154 311052 305947 300932 298738 298711 297707 295125
55742 295125 292670 290115 285849 280751 277072 274283 270315 266095 264418 265117 265722 266168 268342 271568 273010
$$ packed form
55834A175990k7162k8219l2011l3064l0108k8446k9392k7908k3086k0498k1530
55823H74566k0791j6790j4996j7386j8799j6692j4973j5343j4028j0017p605q029
55811F99117p167l948k381l140j877J974L514J689J347L800M293J264q28m67j987
55796F95203o679r800r487j0118j3620j5749j4347j3223j4478j4762j2453j0958
55784E49529j1653j0994p786n961o941o679l457j326k555l913l677n094r348j2236
55770D57909j1501j0688j2124j2689j0295q039q143p954n671m027m742n164l787
55757C53085l328n036n799m148l314n046o247n013m102n105n015k194k7j004k582
55742B95125k455k555m266n098l679k789l968m220j677O99O05M46K174L226J442
$$ plain form
55727 273010 272239 271170 269873 266594 261612 256999 252834 247598 241954 238159 235993 233157 229453 226753
55713 226753 225179 223128 220879 220472 222200 224769 228542 234920 242864 249754 255383 261551 268154 273449
55699 273449 277800 283266 289671 294879 298777 303189 307866 310450 310562 310283 310364 309432 307087 304382 301181
55684 301181 296497 291439 288339 286797 284095 279777 276424 275659 276627 278612 281797 285087 286420 285757 284964
55669 284964 284609 283761 282761 282991 283927 283691 282582 282831 284749 286382 287092 288197 289864 290700 290691 291326 292537
55652 292537 292747 292143 292474 293266 291748 287081 281357 275767 269100 260762 251998 243253 233425 222685 213104
55637 213104 205508 198408 190885 183875 177887 172168 166821 163036 160506 157279 152843 148804 145926 143160
55623 143160 140161 137970 136575 134558 131873 130223 129946 129273 127455 125878 125240 124357 122691 121433 121088
$$ packed form
55727B73010p71j069j297l279m982m613m165n236n644l795k166k836l704k700
55713B26753j574k051k249m07J728K569L773O378P944O890N629O168O603N295
55699B73449M351N466O405N208L898M412M677K584J12k79Q1r32k345k705l201
55684C01181m684n058l100j542k702m318l353p65R68J985L185L290J333o63p93
55669B84964l55q48j000K30R36k36j109K49J918J633P10J105J667Q36rO35J211
55652B92537K10o04L31P92j518m667n724n590o667q338q764q745r828j0740r581
55637B13104p596p100p523p010n988n719n347l785k530l227m436m039k878k766
55623A43160k999k191j395k017k685j650k77o73j818j577o38q83j666j258l45
$$ plain form
55608 121088 120459 119004 117785 117253 116455 115204 114507 114106 112209 108586 105408 104077 103628 103220 103572 104827
55592 104827 105501 104808 103916 103794 103879 103815 104268 105066 104708 102740 100612 99324 98361 97636 98097 99470 99800 98361
55574 98361 96829 96483 96407 95574 94590 94218 94197 94632 96607 100250 103979 106627 108555 109956 109994 108548 106837
55557 106837 105494 103799 101517 99516 97968 96017 93803 92582 92240 91078 88808 87255 87282 87589 87563 88586
55541 88586 91297 94180 96297 98835 102435 105482 106828 107867 110066 112615 114440 116428 119629 123025
55527 123025 125134 126290 127440 128148 127618 126370 125168 123475 120490 116577 112334 107552 102355 97956 94904
55512 94904 91980 88165 84306 81522 79380 77038 74817 73218 71717 69900 68524 68155 68016 67513 67569 69053
55496 69053 71145 72636 73649 74788 75757 76166 76589 77457 77907 76908 74573 71398 67358 62760 58811 56181
$$ packed form
55608A21088o29j455j219n32p98j251o97m01j897l623l178j331m49m08L52J255
55592A04827O74o93q92j22Q5o4M53P98l58j968k128j288r63p25M61J373L30j439
55574I8361j532l46p6q33r84l72k1M35J975L643L729K648J928J401L8j446j711
55557A06837j343j695k282k001j548j951k214j221l42j162k270j553K7L07k6J023
55541H8586K711K883K117K538L600L047J346J039K199K549J825J988L201L396
55527A23025K109J156J150P08n30j248j202j693k985l913m243m782n197m399l052
55512I4904k924l815l859k784k142k342k221j599j501j817j376l69j39n03N6J484
55496F9053K092J491J013J139R69M09M23Q68M50r99k335l175m040m598l949k630
$$ plain form
55480 56181 54071 51613 49086 46940 44898 42893 41571 41040 40497 39848 40118 41449 42418 42264 41988 42178
55464 42178 41759 40178 38906 39157 39914 39843 39543 40118 41050 41318 41313 41885 42668 42996 43276 43876 43886 42640 41250
55445 41250 40959 41137 40548 39465 38811 38397 37801 37828 39190 40715 40848 40157 40396 41713 42695 42739 42582 42760
55427 42760 43124 43703 44688 45746 46402 46828 47318 47558 47284 46973 46976 46785 46094 45691 46273 47289 47962 48478 49090
55408 49090 49192 48493 47983 48421 48896 48315 47311 47189 47876 48402 48656 49097 49484 49319 48991 49149 49496 49438 49269
55389 49269 49552 49991 50026 49808 49554 48790 47357 46180 45859 45490 44179 42699 42232 42461 42334 41861 41659 41599
55371 41599 41379 41640 43030 44903 46351 47674 49366 50523 49906 47854 45629 43583 41508 39950 39405
55356 39405 38830 36791 33718 31376 30446 30126 29746 29275 28536 27374 26409 26413 27202 28179 29381 30924 32129
$$ packed form
55480E6181k110k458k527k146k042k005j322n31n43o49K70J331R69j54k76J90
55464D2178m19j581j272K51P57p1l00N75R32K68nN72P83L28K80O00J0j246j390
55445D1250k91J78n89j083o54m14n96K7J362J525J33o91K39J317R82M4j57J78
55427D2760L64N79R85J058O56M26M90K40k74l11Lj91o91m03N82J016O73N16O12
55408D9090J02o99n10M38M75n81j004j22O87N26K54M41L87j65l28J58L47n8j69
55389D9269K83M39L5k18k54p64j433j177l21l69j311j480m67K29j27m73k02o0
55371D1599k20K61J390J873J448J323J692J157o17k052k225k046k075j558n45
55356C9405n75k039l073k342r30l20l80m71p39j162r65MP89R77J202J543J205
$$ plain form
55339 32129 32439 32508 33152 33978 34343 34795 36031 37299 37414 36665 36092 35609 34516 33208 32579 32260 31234 29785
55321 29785 29094 29212 29113 28434 27635 26783 25762 25345 26493 28820 31108 32923 34379 34988 34374 33491 33472 33844
55303 33844 33600 33304 34146 35546 35881 35209 34979 35229 34453 32343 30383 29390 28589 27611 27398 28430 29725
55286 29725 30313 30302 30026 29476 28999 29181 29682 29466 28483 27851 28148 28809 29449 30371 31449 31836 31217 30244 29455
55267 29455 28831 28578 29214 30663 32292 33892 35551 36736 36758 36101 35961 36472 36706 36425 36380 36831 37236 37496
55249 37496 38017 38406 37700 36172 35352 35847 36554 36484 35981 35626 35311 34955 34991 35490 35799 35583 35399 35856 36997
55230 36997 38617 40328 41262 40780 39546 38883 39068 39363 39589 40362 41760 43212 44749 46863 48977 49652
55214 49652 48737 47730 47614 47766 47608 47754 48753 49953 50525 50596 50667 50835 51123 51647 51915 50971 48787 46572
$$ packed form
55339C2129L10O9O44Q26L65M52J236J268J15p49n73m83j093j308o29l19j026j449
55321B9785o91J18r9o79p99q52j021m17J148K327K288J815J456O09o14q83j9L72
55303C3844k44k96Q42J400L35o72k30K50p76k110j960r93q01r78k13J032J295
55286B9725N88j1k76n50m77J82N01k16r83o32K97O61O40R22J078L87o19r73p89
55267B9455o24k53O36J449J629J600J659J185K2o57j40N11K34k81m5M51M05K60
55249C7496N21L89p06j528q20M95P07p0n03l55l15l56L6M99L09k16j84M57J141
55230C6997J620J711R34m82j234o63J85K95K26P73J398J452J537K114K114O75
55214D9652r15j007j16J52j58J46R99J200N72P1P1J68K88N24K68r44k184k215
$$ plain form
55196 46572 45232 44442 43677 43100 42879 42635 42186 41941 42014 41803 41025 40385 40601 41448 42184 42347 41803 40728 39787
55177 39787 39589 39818 39640 39056 38851 39059 38622 36948 34794 33190 32409 32358 33016 34041 34830 35376 36276 37579
55159 37579 38533 38792 38948 39447 39909 39968 39947 40221 40641 41021 41465 41895 41930 41511 41008 40579 40125 39940 40518 41618
55139 41618 42451 42888 43520 44451 45106 45413 46027 47132 48107 48711 49531 50917 52516 54177 56267 58727 60872
55122 60872 62496 64130 65830 66782 66510 65510 64359 63176 62293 62289 62906 63035 62260 61383 60984 60560 59594 58394
55104 58394 57322 56222 55164 54792 55400 56545 57976 59922 62126 63737 64660 65850 67738 69481 70348
55089 70348 70663 70795 70401 69421 68695 68795 69258 69638 70235 71103 71504 71248 71424 72833 74680 75820 76364 77048
55071 77048 77884 78522 79211 80315 81437 81892 81537 80459 78556 76196 74535 74283 74802 75192 75588 76542 77820
$$ packed form
55196D6572j340p90p65n77k21k44m49k45P3k11p78o40K16Q47P36J63n44j075r41
55177C9787j98K29j78n84k05K08m37j674k154j604p81n1O58J025P89N46R00J303
55159C7579R54K59J56M99M62N9k1K74M20L80M44M30L5m19n03m29m54j85N78J100
55139D1618Q33M37O32R31O55L07O14J105R75O04Q20J386J599J661K090K460K145
55122F0872J624J634J700R52k72j000j151j183q83mO17J29p75q77l99m24r66j200
55104E8394j072j100j058l72O08J145J431J946K204J611R23J190J888J743Q67
55089G0348L15J32l94r80p26J00M63L80N97Q68M01k56J76J409J847J140N44O84
55071G7048Q36O38O89J104J122M55l55j078j903k360j661k52N19L90L96R54J278
$$ plain form
55054 77820 78710 79033 78969 78441 77417 76316 75417 74377 73056 72226 72663 74036 75388 76286 76794 76822 76241 75323
55036 75323 74519 74089 74243 75065 75956 75920 74865 73895 73831 74243 74483 74750 75419 76154 76564 76982 77743 78296 77980
55017 77980 77218 77117 78179 80003 81874 83109 83292 82708 82110 81716 80969 79612 78237 77362 76770 76210 75914
55000 75914 75813 75148 73509 71555 70071 69062 68334 68042 68056 67730 67016 66924 68075 69691 70792 71441 71955
54983 71955 71935 71138 70451 70805 71769 72300 72223 72020 71860 71919 73012 75655 78977 81633 83415 85056 86951 89091
54965 89091 91762 95212 98941 102319 105653 109785 114916 120558 126262 131751 136932 142515 149969 160010
54951 160010 171768 184224 197590 212179 226774 239497 249709 257626 262565 263187 259376 252417 243285
54938 243285 232030 218979 205326 192158 179832 168546 158677 150243 142654 135307 128116 121440 115841
$$ packed form
55054G7820Q90L23o4n28j024j101q99j040j321q30M37J373J352Q98N08K8n81r18
55036G5323q04m30J54Q22Q91l6j055r70o4M12K40K67O69P35M10M18P61N53l16
55017G7980p62j01J062J824J871J235J83n84n98l94p47j357j375q75n92n60k96
55000G5914j01o65j639j954j484j009p28k92J4l26p14r2J151J616J101O49N14
54983G1955k0p97o87L54R64N31p7k03j60N9J093K643L322K656J782J641J895K140
54965H9091K671L450L729L378L334M132N131N642N704N489N181N583P454J0041
54951A60010J1758J2456J3366J4589J4595J2723J0212P917M939O22l811o959r132
54938B43285j1255j3051j3653j3168j2326j1286r869q434p589p347p191o676n599
$$ plain form
54925 115841 111725 108832 106301 103647 101338 100010 99583 99685 100469 102350 105303 109044 113563 118912 124866
54910 124866 131365 138891 147954 158618 170896 184825 199604 213451 224973 233933 240090 242328 239938
54897 239938 233854 225477 215090 202645 189326 176882 165746 155048 144277 133865 124476 116689
54885 116689 110935 106809 102918 98452 94285 91500 89534 87149 84590 83210 83343 84065 84830 85828 86813
54870 86813 87048 86482 85746 85011 84042 83198 83031 83013 82015 80104 78498 77756 77295 76731 76280 75770 74708 73515
54852 73515 73220 73583 73021 70958 68815 67955 67827 67043 65368 63690 62620 61949 61173 60124 59290 59634 61663
54835 61663 64619 67100 68578 69623 70702 71473 71465 70821 70186 70322 71732 74056 75950 76355 75866 76123 77859
54818 77859 80268 82237 83393 83956 84467 85699 88007 90610 92285 92890 93561 95376 98503 102621 107369
$$ packed form
54925A15841m116k893k531k654k309j328m27J02P84J881K953L741M519N349N954
54910A24866O499P526R063J0664J2278J3929J4779J3847J1522Q960O157K238k390
54897B39938o084q377j0387j2445j3319j2444j1136j0698j0771j0412r389p787
54885A16689n754m126l891m466m167k785j966k385k559j380J33P22P65R98R85
54870H6813K35n66p36p35r69q44j67j8r98j911j606p42m61n64m51n10j062j193
54852G3515k95L63n62k063k143q60j28p84j675j678j070o71p76j049q34L44K029
54835F1663K956K481J478J045J079P71qo44o35J36J410K324J894M05m89K57J736
54818G7859K409J969J156N63N11J232K308K603J675O05O71J815L127M118M748
$$ plain form
54803 107369 112295 117148 122395 128876 136941 146420 157254 169448 182633 196430 211013 226445 241672
54790 241672 255011 265426 272458 275381 273674 268181 260529 251446 240779 229071 217742 207630 198629
54777 198629 190852 184804 180179 175879 171595 168139 165810 163730 161267 158899 157130 155802 155075 155871 158518
54762 158518 161989 165345 169092 174324 181354 189988 200483 213390 228920 247056 267786 290590 314177
54749 314177 337257 359146 379180 396050 408270 414923 415591 410059 398595 382271 362650 341327
54737 341327 319778 299135 279884 262070 245794 231090 217557 204859 193555 184537 177583 171334
54725 171334 164880 158518 152796 147738 143352 139981 137659 135750 133660 131363 129008 126645 124556 123185
54711 123185 122508 121999 121325 120463 119287 117852 116988 117537 118977 119919 120030 120239 120858 120994 120280 119759 120292 121334
$$ packed form
54803A07369M926M853N247O481Q065R479J0834J2194J3185J3797J4583J5432J5227
54790B41672J3339J0415P032K923j707n493p652r083j0667j1708j1329j0112r001
54777A98629p777o048m625m300m284l456k329k080k463k368j769j328p27P96K647
54762A58518L471L356L747N232P030Q634J0495J2907J5530J8136K0730K2804K3587
54749C14177K3080K1889K0034J6870J2220O653O68n532j1464j6324j9621k1323
54737C41327k1549k0643j9251j7814j6276j4704j3533j2698j1304r018o954o249
54725A71334o454o362n722n058m386l371k322j909k090k297k355k363k089j371
54711A23185o77n09o74q62j176j435q64N49J440R42J11K09O19J36p14n21N33J042
$$ plain form
54693 121334 122145 123036 124457 125887 126666 127091 127614 127744 126885 125669 125336 126150 127401 128632 129943 131345
54677 131345 132739 134372 136576 139136 141543 143742 146093 148692 151269 153668 156087 158935 162656 167407
54663 167407 172649 177334 180825 183408 185811 188537 191776 195495 199393 203175 207033 211439 216431 221685
54649 221685 227342 234068 242167 251390 261834 274191 288822 305353 323538 343622 365322 387210
54637 387210 407633 425557 439967 449222 451841 447547 437102 421583 402290 380744 358205 335484
54625 335484 313558 293627 276081 260071 244757 230524 218367 208512 200274 192961 186448 181069
54613 181069 177267 175074 173756 172415 171135 170899 172156 174031 175210 175014 173351 170387 166659 162853 159096
54598 159096 154988 150528 146305 142568 138921 135224 131913 129157 126608 124265 122555 121141 118834 115288
$$ packed form
54693A21334Q11Q91J421J430P79M25N23J30q59j216l33Q14J251J231J311J402
54677A31345J394J633K204K560K407K199K351K599K577K399K419K848L721M751
54663A67407N242M685L491K583K403K726L239L719L898L782L858M406M992N254
54649B21685N657O726Q099R223J0444J2357J4631J6531J8185K0084K1700K1888
54637C87210K0423J7924J4410R255K619m294j0445j5519j9293k1546k2539k2721
54625C35484k1926j9931j7546j6010j5314j4233j2157r855q238p313o513n379
54613A81069l802k193j318j341j280k36J257J875J179j96j663k964l728l806l757
54598A59096m108m460m223l737l647l697l311k756k549k343j710j414k307l546
$$ plain form
54584 115288 111645 108794 106150 103018 100045 98209 97269 96309 95114 93968 92785 91476 90534 90287 90113
54569 90113 89368 88446 87984 87712 87119 86615 86827 87276 87002 86187 85979 86903 88464 90059 91368 91999 91770 91267
54551 91267 91421 92646 94897 98042 101512 104259 105978 107742 110433 113267 115112 116657 119760 124898 130810
54536 130810 136656 143042 150726 159621 169500 180525 192557 204699 215904 225403 232443 236432 237580
54523 237580 236678 233975 228935 221284 211735 201467 191432 182192 173801 165706 157335 148943 141391 135059
54509 135059 129492 124197 119255 115023 111732 109456 108041 106960 105639 103988 102385 101154 100371 100018 99966
54494 99966 99955 99906 100055 100474 100761 100656 100624 101338 102802 104498 106122 107663 109009 110017 110845 111707 112526 113178
54476 113178 113817 114578 115386 116411 118154 120506 122317 122572 121514 119965 118161 116094 114403 113827 114097 114335
$$ packed form
54584A15288l643k851k644l132k973j836r40r60j195j146j183j309r42k47j74
54569I0113p45r22m62k72n93n04K12M49k74q15k08R24J561J595J309O31k29n03
54551I1267J54J225K251L145L470K747J719J764K691K834J845J545L103N138N912
54536A30810N846O386P684Q895R879J1025J2032J2142J1205R499P040L989J148
54523B37580r02k703n040p651r549j0268j0035r240q391q095q371q392p552o332
54509A35059n567n295m942m232l291k276j415j081j321j651j603j231p83l53n2
54494I9966j1m9J49M19K87j05l2P14J464J696J624J541J346J008Q28Q62Q19O52
54476A13178O39P61Q08J025J743K352J811K55j058j549j804k067j691n76K70K38
$$ plain form
54460 114335 114296 114314 114340 113958 113112 111913 110097 107668 105639 104898 104584 102956 99860 96985 95500 94763 93735
54443 93735 92475 91639 91373 91325 91199 90878 90457 90289 90563 90839 90593 90081 89925 89953 89426 88425 87934 88372 89004
54424 89004 89183 89268 89905 91152 92692 94233 95349 95608 95274 95283 96177 97607 99103 100738 102735 105029 107498
54407 107498 110117 112581 114408 115663 117124 119464 122691 126556 130875 135246 139051 142139 145034 148152
54393 148152 151205 153583 154934 155200 154539 153394 152252 151159 149773 147886 145490 142457 138742 134861 131524
54378 131524 128739 125931 122992 120466 118632 117182 115952 115178 114712 113805 112083 110081 108449 107197 106123
54363 106123 105359 105029 104824 104343 103532 102534 101530 100952 101325 102608 104097 105287 106311 107339 108101 108446 108847
54346 108847 109934 111850 114459 117793 121886 126467 131137 135624 139615 142638 144467 145395 145865 146024 145816
$$ packed form
54460A14335l9J8K6l82q46j199j816k429k029p41l14j628l096k875j485p37j028
54443I3735j260q36k66m8j26l21m21j68K74K76k46n12j56K8n27j001m91M38O32
54424H9004J79Q5O37J247J540J541J116K59l34RQ94J430J496J635J997K294K469
54407A07498K619K464J827J255J461K340L227L865M319M371L805L088K895L118
54393A48152L053K378J351K66o61j145j142j093j386j887k396l033l715l881l337
54378A31524k785k808k939k526j834j450j230p74m66r07j722k002j632j252j074
54363A06123p64l30k05m81q11r98j004n78L73J283J489J190J024J028P62L45M01
54346A08847J087J916K609L334M093M581M670M487L991L023J829R28M70J59k08
$$ plain form
54331 145816 145268 144491 143538 142379 140852 138666 135655 131986 127844 123097 117724 112377 107924 104414 101064
54316 101064 97387 93750 90721 88440 86733 85326 83748 81579 79009 76733 75132 73954 72882 71934
54302 71934 71224 70810 70832 71266 71530 70966 69802 68986 68886 68854 68317 67588 67227 67219 67194 66962 66453 65571 64481 63699
54282 63699 63520 63666 63721 63593 63382 63141 62923 62768 62625 62623 63302 65003 67180 68955 70326 72020 74127 75840
54264 75840 76699 77150 77515 77365 76433 75310 74695 74643 75038 76028 77413 78406 78626 78629 78761 78290 76576 74487 73608
54245 73608 74416 76109 77921 79626 80913 81312 80914 80411 80307 80598 81258 82406 83799 84661 84322 82819 80797
54228 80797 79014 77937 77551 77476 77391 77313 77420 77790 78440 79431 80621 81430 81186 79773 77846 76325 75655 75505
54210 75505 75237 74727 74564 75236 76339 76955 76679 75881 75088 74603 74656 75318 76206 76786 77025 77279 77638 78007 78738
$$ packed form
54331A45816n48p77r53j159j527k186l011l669m142m747n373n347m453l510l350
54316A01064l677l637l029k281j707j407j578k169k570k276j601j178j072r48
54302G1934p10m14K2M34K64n64j164q16j00l2n37p29l61qk5k32n09q82j090p82
54282F3699j79J46N5j28k11k41k18j55j43kO79J701K177J775J371J694K107J713
54264G5840Q59M51L65j50r32j123o15n2L95R90J385R93K20LJ32m71j714k089q79
54245G3608Q08J693J812J705J287L99l98n03j04K91O60J148J393Q62l39j503k022
54228H0797j783j077l86p5q5p8J07L70O50R91J190Q09k44j413j927j521o70j50
54210G5505k68n10j63O72J103O16k76p98p93m85N3O62Q88N80K39K54L59L69P31
$$ plain form
54191 78738 80258 81974 82469 81224 79340 78114 77677 77546 77697 78301 78956 79044 78548 77862 77104 76247 75651 75765
54173 75765 76385 76795 76643 76253 76045 76027 75868 75295 74389 73575 73182 73039 72825 72777 73538 75124 76584 77009 76465
54154 76465 75650 75070 74911 75271 76049 76847 77358 77637 77805 77857 77925 78315 79008 79561 79812 80178 80924 81593 81579 80866
54134 80866 79778 78502 77316 76840 77444 78591 79359 79477 79417 79604 79913 79893 79176 77715 75781 73743 71841
54117 71841 70377 69816 70237 70763 70317 69024 68109 68215 68603 68412 67892 67852 68518 69469 70175 70113 68972 67275
54099 67275 66241 66462 67258 67818 68268 68997 69674 69788 69570 69467 69184 68202 66878 66043 65738 65305 64645 64424
54081 64424 64977 65792 66205 65978 65126 63815 62590 62178 62850 64191 65489 66153 65977 65356 65056 65469 66261 67016
54063 67016 67778 68579 68895 68269 67149 66516 66759 67496 68282 69001 69752 70830 72556 74650 76097 76224 75627
$$ packed form
54191G8738J520J716M95j245j884j226m37j31J51O04O55Q8m96o86p58q57n96J14
54173G5765O20M10j52l90k08j8j59n73r06q14l93j43k14m8P61J586J460M25n44
54154G6465q15n80j59L60P78P98N11K79J68N2O8L90O93N53K51L66P46O69j4p13
54134H0866j088j276j186m76O04J147P68J18o0J87L09k0p17j461j934k038j902
54117G1841j464n61M21N26m46j293r15J06L88j91n20m0O66R51P06o2j141j697
54099F7275j034K21P96N60M50P29O77J14k18j03k83r82j324q35l05m33o60k21
54081F4424N53Q15M13k27q52j311j225m12O72J341J298O64j76o21l00M13P92P55
54063F7016P62Q01L16o26j120o33K43P37P86P19P51J078J726K094J447J27n97
$$ plain form
54046 75627 75488 76260 77677 79606 81995 84174 85309 85663 86593 89011 92454 95849 98621 100851 102916
54031 102916 105310 108471 112469 116938 121386 125536 129498 133794 138960 144862 150641 155625 159979 164128
54017 164128 167938 171051 173684 176429 179311 181680 183050 183577 183746 184002 184594 185320 185502 184586 182690 180221
54001 180221 177216 173509 169370 165398 161855 158577 155497 152851 150860 149550 148709 147802 146170 143725 141209
53986 141209 139376 138228 137398 136845 136555 136026 134816 133383 132601 132537 132381 131529 130121 128589 127349 126830 127167
53969 127167 127791 127910 127405 126848 126706 127053 127917 129266 130675 131550 131727 131477 131053 130657 130673 131305 132146 132658
53951 132658 132991 133757 135130 136826 138882 141733 145417 149288 152713 155736 158992 163162 168362 173770 178245
53936 178245 181617 184893 188689 192117 193972 194403 194326 193629 191298 187339 183270 180416 178677 177325 176157
$$ packed form
54046G5627j39P72J417J929K389K179J135L54R30K418L443L395K772K230K065
54031A02916K394L161L998M469M448M150L962M296N166N902N779M984M354M149
54017A64128L810L113K633K745K882K369J370N27J69K56N92P26J82r16j896k469
54001A80221l005l707m139l972l543l278l080k646j991j310q41r07j632k445k516
53986A41209j833j148q30n53k90n29j210j433p82o4j56q52j408j532j240n19L37
53969A27167O24J19n05n57j42L47Q64J349J409Q75J77k50m24l96J6O32Q41N12
53951A32658L33P66J373J696K056K851L684L871L425L023L256M170N200N408M475
53936A78245L372L276L796L428J855M31p7o97k331l959m069k854j739j352j168
$$ plain form
53921 176157 175437 175340 175874 176964 178442 180292 182890 186462 190474 194158 197561 201342 205703 210299 215124
53906 215124 220597 226618 232452 237699 242680 247715 252713 257478 261619 264206 264501 263232 262149 262029 262058
53891 262058 261410 260343 259208 257375 253985 249119 243581 238030 232903 228657 225390 222440 218805 213829
53877 213829 207400 199996 192784 187088 183293 180581 177898 174798 171217 167070 162472 157914 153894 150678
53863 150678 148482 147355 146671 145295 142598 138904 134869 130874 127154 123870 120830 117713 114698 112307
53849 112307 110444 108388 105995 104145 103544 103784 104008 103869 103372 102416 101111 100128 100094 100896 101895 102529 102500 101902
53831 101902 101449 101983 103370 104357 103901 102225 100290 98790 98029 98074 98517 98579 98031 97586 97924 98802 99614 100320
53813 100320 101211 102159 102746 102850 102595 101989 101175 100744 101297 102828 104999 107762 111259 115285 119426 123637
$$ packed form
53921A76157p20r7N34J090J478J850K598L572M012L684L403L781M361M596M825
53906B15124N473O021N834N247M981N035M998M765M141K587K95j269j083j20K9
53891B62058o48j067j135j833l390m866n538n551n127m246l267k950l635m976
53877B13829o429p404p212n696l795k712k683l100l581m147m598m558m020l216
53863A50678k196j127o84j376k697l694m035l995l720l284l040l117l015k391
53849A12307j863k056k393j850o01K40K24j39m97r56j305r83l4Q02R99O34k9n98
53831A01902m53N34J387R87m56j676j935j500p61M5M43O2n48m45L38Q78Q12P06
53813A00320Q91R48N87J04k55o06q14m31N53J531K171K763L497M026M141M211
$$ plain form
53797 123637 128249 133385 138635 143315 146937 149594 151994 154882 158287 161614 164594 167717 171473 175544
53783 175544 179106 181723 183633 185279 186799 187883 188096 187436 186483 185802 185353 184855 184416 184146 183379 181178
53767 181178 177751 174534 172564 171465 170294 168719 167019 165568 164638 164156 163399 161616 159125 157087 155922
53752 155922 154775 152868 150485 148142 145716 143076 140729 139164 138183 137544 137468 137829 137633 136239 134428 133376
53736 133376 133129 132999 132810 132685 132130 130585 128585 127241 126666 126043 125204 125030 126038 127545 128568 128855 128739
53719 128739 128560 128534 128682 128661 128015 126780 125545 124865 124845 125332 126161 127169 128141 128815 128907 128381 127769 127918 129156
53700 129156 131015 132944 134889 136930 138826 140397 142002 144194 147119 150556 154207 157693 160708 163465
53686 163465 166506 169773 172527 174542 176568 179010 180991 181612 181504 182080 183717 185661 187313 188600 189335
$$ packed form
53797A23637M612N136N250M680L622K657K400K888L405L327K980L123L756M071
53783A75544L562K617J910J646J520J084K13o60r53o81m49m98m39k70p67k201
53767A81178l427l217j970j099j171j575j700j451r30m82p57j783k491k038j165
53752A55922j147j907k383k343k426k640k347j565r81o39p6L61j96j394j811j052
53736A33376k47j30j89j25n55j545k000j344n75o23q39j74J008J507J023K87j16
53719A28739j79k6J48k1o46j235j235o80k0M87Q29J008R72O74R2n26o12J49J238
53700A29156J859J929J945K041J896J571J605K192K925L437L651L486L015K757
53686A63465L041L267K754K015K026K442J981O21j08N76J637J944J652J287P35
$$ plain form
53671 189335 189277 188731 188201 187601 186662 185850 185814 186108 185609 184206 182895 182065 180868 178690 176213 174487 173801
53654 173801 173938 174731 175761 176170 175469 174185 173116 172266 171017 169211 167593 167167 168254 170175 171834 172759
53638 172759 173508 174861 176755 178324 178916 178697 178356 178570 179638 181223 182531 183130 183530 184484 185896 186948
53622 186948 187249 187239 187495 188277 189784 192172 195048 197517 199066 200044 201097 202485 204143 206043 208239 210782
53606 210782 213702 216876 219970 222813 225799 229534 234052 238732 243005 246857 250636 254710 259272 264069
53592 264069 268399 271778 274585 277628 281123 284562 287513 290056 292367 294450 296370 298195 299597 300022
53578 300022 299465 298720 298665 299635 301450 303583 305199 305609 304982 304265 304205 304723 305323 305664 305585 305055 304364 304014 304166
53559 304166 304551 305082 306187 308182 310653 312844 314499 315975 317581 319128 320215 320774 321168 321718 322336 322811
$$ packed form
53671A89335n8n46n30o00r39q12l6K94m99j403j311q30j197k178k477j726o86
53654A73801J37P93J030M09p01j284j069q50j249j806j618m26J087J921J659R25
53638A72759P49J353J894J569N92k19l41K14J068J585J308N99M00R54J412J052
53622A86948L01j0K56P82J507K388K876K469J549R78J053J388J658J900K196K543
53606B10782K920L174L094K843K986L735M518M680M273L852L779M074M562M797
53592B64069M330L379K807L043L495L439K951K543K311K083J920J825J402M25
53578C00022n57p45n5R70J815K133J616M10o27p17o0N18O00L41p9n30o91l50J52
53559C04166L85N31J105J995K471K191J655J476J606J547J087N59L94N50O18M75
$$ plain form
53543 322811 323363 324470 326081 327534 328583 330055 332925 337059 341412 345254 348610 351688 354599 357587
53529 357587 360852 364104 366907 369546 372941 377505 382650 387599 392249 397056 402509 408876 416088 423759
53515 423759 431747 440631 451096 462790 474482 485575 496832 509250 522796 536707 550571 564582
53503 564582 579077 594338 610732 628534 647545 667155 686839 706507 726436 746970 768243
53492 768243 790118 812427 835148 858180 881073 903294 924792 946031 967408 988794 1009663
53481 1009663 1029527 1048337 1066706 1085561 1105320 1125489 1145331 1164767 1184229 1203810 1223047
53470 1223047 1241448 1258823 1275100 1290370 1305159 1320150 1335424 1350199 1363427 1374427 1383075
53459 1383075 1389728 1394952 1399035 1401797 1403003 1402676 1400700 1396552 1389931 1381299 1371243 1359742 1346792
$$ packed form
53543C22811N52J107J611J453J049J472K870M134M353L842L356L078K911K988
53529C57587L265L252K803K639L395M564N145M949M650M807N453O367P212P671
53515D23759P988Q884J0465J1694J1692J1093J1257J2418J3546J3911J3864J4011
53503E64582J4495J5261J6394J7802J9011J9610J9684J9668J9929K0534K1273
53492G68243K1875K2309K2721K3032K2893K2221K1498K1239K1377K1386K0869
53481A009663J9864J8810J8369J8855J9759K0169J9842J9436J9462J9581J9237
53470A223047J8401J7375J6277J5270J4789J4991J5274J4775J3228J1000Q648
53459A383075O653N224M083K762J206l27j976m148o621q632j0056j1501j2950
$$ plain form
53446 1346792 1333286 1320233 1307355 1293531 1278569 1263354 1248155 1232068 1214476 1195891 1176859
53435 1176859 1157068 1136269 1115193 1094796 1075327 1056813 1039737 1024464 1010509 997235 984849
53424 984849 974032 964951 957283 950843 945496 940818 936572 933311 931773 931821 932607 933724 935570 938602 942761
53409 942761 947710 953271 959554 966964 976029 986964 999414 1012794 1026807 1041502 1057092 1073931
53397 1073931 1092409 1112621 1134354 1157594 1182683 1209642 1237739 1266238 1295419 1326380 1359866
53386 1359866 1395669 1433113 1471711 1511259 1551608 1592586 1634157 1676593 1720302 1765286 1810852
53375 1810852 1856167 1901036 1945723 1990031 2033137 2074544 2114586 2153569 2190849 2225258 2256157
53364 2256157 2283615 2307769 2328551 2345990 2360366 2371885 2380349 2385158 2385683 2381770 2373821 2362146
$$ packed form
53446A346792j3506j3053j2878j3824j4962j5215j5199j6087j7592j8585j9032
53435A176859j9791k0799k1076k0397j9469j8514j7076j5273j3955j3274j2386
53424I84849j0817r081p668o440n347m678m246l261j538M8P86J117J846L032M159
53409I42761M949N561O283P410R065J0935J2450J3380J4013J4695J5590J6839
53397A073931J8478K0212K1733K3240K5089K6959K8097K8499K9181L0961L3486
53386A359866L5803L7444L8598L9548M0349M0978M1571M2436M3709M4984M5566
53375A810852M5315M4869M4687M4308M3106M1407M0042L8983L7280L4409L0899
53364B256157K7458K4154K0782J7439J4376J1519Q464M809N25l913p949j1675
$$ plain form
53352 2362146 2346335 2325794 2300906 2273081 2243449 2212080 2178784 2143986 2108223 2071283 2032529
53341 2032529 1991945 1950368 1908905 1868537 1830045 1793710 1759106 1725576 1692837 1660869 1629451
53330 1629451 1598196 1566919 1535642 1504475 1473922 1445036 1418700 1394820 1372650 1351859 1332825
53319 1332825 1315922 1301038 1287880 1276351 1266397 1257737 1249863 1242149 1233952 1224767 1214402 1202960
53307 1202960 1190740 1178268 1166180 1154829 1144059 1133630 1123806 1115280 1108499 1103282 1099203 1096164
53295 1096164 1094437 1094132 1094795 1095741 1096816 1098596 1101689 1106134 1111755 1118775 1127496 1137573 1148338 1159953
53281 1159953 1173501 1189645 1207740 1226605 1245624 1264742 1283887 1303001 1322327 1342128 1362171
53270 1362171 1381692 1399641 1414887 1426699 1435478 1442686 1449583 1456153 1461436 1464566 1465217 1463523 1459979
$$ packed form
53352B362146j5811k0541k4888k7825k9632l1369l3296l4798l5763l6940l8754
53341B032529m0584m1577m1463m0368l8492l6335l4604l3530l2739l1968l1418
53330A629451l1255l1277l1277l1167l0553k8886k6336k3880k2170k0791j9034
53319A332825j6903j4884j3158j1529r954q660p874p714q197r185j0365j1442
53307A202960j2220j2472j2088j1351j0770j0429r824q526o781n217m079l039
53295A096164j727l05O63R46J075J780L093M445N621P020Q721J0077J0765J1615
53281A159953J3548J6144J8095J8865J9019J9118J9145J9114J9326J9801K0043
53270A362171J9521J7949J5246J1812Q779P208O897O570N283L130O51j694l544
$$ plain form
53257 1459979 1455105 1448871 1440752 1430605 1419044 1406603 1393139 1378491 1363123 1347389 1330659 1312058
53245 1312058 1291729 1270554 1248894 1226594 1204059 1182311 1161800 1141986 1122323 1102950 1084106
53234 1084106 1065578 1047180 1029300 1012547 997081 982544 968429 954382 940415 926969 914430
53223 914430 902585 890923 879534 869228 860552 853169 846523 840673 835937 831998 827966 823355 818480
53210 818480 813674 808553 802392 794989 786719 777813 768118 757641 746776 735616 723552 710201 696498
53197 696498 684085 673601 664175 654663 644688 634357 623711 612862 602017 590914 578830 565626
53185 565626 552240 539550 527272 514576 501277 487759 474171 460579 447598 435887 425132
53174 425132 414360 403349 392934 383878 376090 369061 362354 355481 347993 340008 332131 324618 317141
$$ packed form
53257A459979m874o234q119j0147j1561j2441j3464j4648j5368j5734j6730j8601
53245A312058k0329k1175k1660k2300k2535k1748k0511j9814j9663j9373j8844
53234A084106j8528j8398j7880j6753j5466j4537j4115j4047j3967j3446j2539
53223I14430j1845j1662j1389j0306q676p383o646n850m736l939m032m611m875
53210H18480m806n121o161p403q270q906r695j0477j0865j1160j2064j3351j3703
53197F96498j2413j0484r426r512r975j0331j0646j0849j0845j1103j2084j3204
53185E65626j3386j2690j2278j2696j3299j3518j3588j3592j2981j1711j0755
53174D25132j0772j1011j0415r056p788p029o707o873p488p985p877p513p477
$$ plain form
53161 317141 309653 302881 297507 293234 289085 284405 279205 273833 268742 264430 261122 258408 255516 252106
53147 252106 248593 245522 242816 239961 236934 234524 233360 232957 232209 230706 228962 227353 225591 223563 221925
53132 221925 221251 221147 220869 220415 220296 220535 220752 221113 222321 224537 227055 229286 231461 234077 237119 240112
53116 240112 242592 244303 245222 245643 245976 246329 246435 246001 244899 243014 240256 236821 233150 229513 225786 221698
53100 221698 217133 212207 207285 202878 199249 196137 193077 189902 186722 183549 180378 177528 175411 173888
53086 173888 172282 170170 167846 165858 164404 163354 162527 161747 160773 159425 157754 156016 154538 153526 152845
53071 152845 152032 150722 149101 147735 146937 146394 145439 143655 141256 138952 137403 136825 137191 138542 140666 142614
53055 142614 143235 142440 141360 140903 140771 140364 139907 139871 139814 138759 136565 133996 131520 128962 126415 124592 123893
$$ packed form
53161C17141p488o772n374m273m149m680n200n372n091m312l308k714k892l410
53147B52106l513l071k706k855l027k410j164m03p48j503j744j609j762k028j638
53132B21925o74j04k78m54j19K39K17L61J208K216K518K231K175K616L042K993
53116B40112K480J711R19M21L33L53J06m34j102j885k758l435l671l637l727m088
53100B21698m565m926m922m407l629l112l060l175l180l173l171k850k117j523
53086A73888j606k112k324j988j454j050q27p80r74j348j671j738j478j012o81
53071A52845q13j310j621j366p98n43r55j784k399k304j549n78L66J351K124J948
53055A42614O21p95j080m57j32m07m57l6n7j055k194k569k476k558k547j823o99
$$ plain form
53038 123893 123771 123439 122760 122114 121720 121404 120880 120144 119648 119942 120886 121491 121018 119971 119442 119645 119806 119455
53020 119455 119041 119072 119375 119511 119394 119187 119013 119030 119429 120123 120751 121143 121417 121624 121643 121494 121352 121205 120956 120809
53000 120809 120978 121046 120314 118974 118176 118644 119881 121098 122218 123510 124778 125595 125974 126342 127054 128271 129999
52983 129999 131881 133302 134118 134947 136386 138283 140204 142251 144827 147833 150740 153431 156434 160219 164642
52968 164642 169160 173299 176792 179537 181583 183085 184175 184853 184972 184328 182848 180723 178226 175433 172339
52953 172339 169239 166714 165092 164144 163431 162761 162100 161285 160084 158515 156894 155538 154552 153868 153391 153035
52937 153035 152671 152146 151431 150725 150259 150065 150088 150440 151222 152156 152861 153621 155253 157895 160507 162077 162851 163758
52919 163758 165030 166190 167060 167885 168550 168569 167915 167156 166673 166431 166554 167367 168759 170184 171454 172776 173906
$$ packed form
53038A23893j22l32o79o46l94l16n24p36m96K94R44O05m73j047n29K03J61l51
53020A19455m14L1L03J36j17k07j74J7L99O94O28L92K74K07J9j49j42j47k49j47
53000A20809J69O8p32j340p98M68J237J217J120J292J268Q17L79L68P12J217J728
52983A29999J882J421Q16Q29J439J897J921K047K576L006K907K691L003L785M423
52968A64642M518M139L493K745K046J502J090O78J19o44j480k125k497k793l094
52953A72339l100k525j622r48p13o70o61q15j201j569j621j356r86o84m77l56
52937A53035l64n25p15p06m66j94K3L52P82R34P05P60J632K642K612J570P74R07
52919A63758J272J160Q70Q25O65J9o54p59m83k42J23Q13J392J425J270J322J130
$$ plain form
52902 173906 174075 173136 172100 172116 173437 175645 178281 180909 183071 184544 185314 185264 184468 183801 184356 185997 187335
52885 187335 187516 187192 187266 187615 187771 188044 189023 190447 191461 191729 191634 191675 192260 193775 196178 198775 200961 202889
52867 202889 204942 206945 208508 209716 210798 211513 211578 211426 211732 212449 213111 213899 215516 218053 220862 223605
52851 223605 226601 229998 233442 236852 240769 245534 250620 255180 258864 261759 263997 265725 267092 267852
52837 267852 267299 265088 261909 258916 256516 254099 250919 246849 242212 237346 232652 228783 226229 224639
52823 224639 222904 220151 216494 212702 209333 206402 203675 201041 198678 197016 196322 196163 195551 193934 191762
52808 191762 189754 188015 186395 185278 185157 185570 185357 184064 182340 180833 179585 178591 178009 177458 176015 173490
52792 173490 171003 169679 169402 169328 168985 168224 166718 164311 161471 158744 156135 153633 151830 151258 151505 151749
$$ packed form
52902A73906J69r39j036J6J321K208K636K628K162J473P70n0p96o67N55J641J338
52885A87335J81l24P4L49J56K73R79J424J014K68r5M1N85J515K403K597K186J928
52867B02889K053K003J563J208J082P15O5j52L06P17O62P88J617K537K809K743
52851B23605K996L397L444L410L917M765N086M560L684K895K238J728J367P60
52837B67852n53k211l179k993k400k417l180m070m637m866m694l869k554j590
52823B24639j735k753l657l792l369k931k727k634k363j662o94j59o12j617k172
52808A91762k008j739j620j117j21M13k13j293j724j507j248r94n82n51j443k525
52792A73490k487j324k77p4l43p61j506k407k840k727k609k502j803n72K47K44
$$ plain form
52776 151749 151884 152298 152775 152519 151281 149715 148447 147411 146235 144874 143681 143075 143124 143318 142933 141783
52760 141783 140302 138721 136682 134096 131740 130303 129269 127571 125081 122601 120568 118673 116784 115358
52746 115358 114661 114217 113406 112110 110613 109204 108096 107398 107001 106637 106118 105392 104507 103754 103552 103898 104158
52729 104158 103832 103278 103225 103745 104229 104215 103766 103147 102625 102531 103073 104134 105524 107112 108360 108235 106351 103831
52711 103831 102239 101905 102102 102573 103734 105396 106580 106999 107752 109936 113294 116727 119527 121615 123168
52696 123168 124554 126177 127845 128681 128124 126657 125099 123541 121551 119192 117214 116174 115752 115108 113747
52681 113747 111956 110398 109254 107915 105775 103202 101275 100456 100022 99044 97522 96152 95231 94307 92884
52666 92884 91056 89311 87950 86903 86022 85317 84783 84179 83264 82210 81412 80800 79813 78373 77488 78334 80832
$$ packed form
52776A51749J35M14M77k56j238j566j268j036j176j361j193o06M9J94l85j150
52760A41783j481j581k039k586k356j437j034j698k490k480k033j895j889j426
52746A15358o97m44q11j296j497j409j108o98l97l64n19p26q85p53k02L46K60
52729A04158l26n54n3N20M84j4m49o19n22r4N42J061J390J588J248j25j884k520
52711A03831j592l34J97M71J161J662J184M19P53K184L358L433K800K088J553
52696A23168J386J623J668Q36n57j467j558j558j990k359j978j040m22o44j361
52681A13747j791j558j144j339k140k573j927q19m34r78j522j370r21r24j423
52666I2884j828j745j361j047q81p05n34o04r15j054p98o12r87j440q85Q46K498
$$ plain form
52649 80832 83584 85099 84792 83038 80875 79570 79820 81177 82630 83742 84788 85875 86628 86960 87505 88829
52633 88829 90565 91699 91573 90377 88866 87783 87393 87412 87430 87360 87300 87117 86569 85822 85384 85438 85595 85431 84906
52614 84906 84126 83125 82135 81666 82001 82860 83821 84852 86147 87654 89014 89923 90358 90550 90874 91651 92851
52597 92851 93985 94401 93803 92596 91753 92123 93676 95512 96808 97640 98656 100177 101970 103714 105218 106231
52581 106231 106571 106520 106650 107166 107807 108479 109491 110947 112365 113258 113811 114681 116289 118500 120853 122907 124526
52564 124526 125956 127471 128908 129827 130264 130970 132551 134609 136127 136665 136805 137335 138333 139308 140044 140895 142149
52547 142149 143466 144311 144802 145632 147132 148814 150028 150677 150993 150982 150475 149540 148507 147681 147253 147293 147648 148080
52529 148080 148724 150057 152092 154020 155032 155239 155371 155893 156841 158139 159500 160306 160198 159585 159025 158432 157554
$$ packed form
52649H0832K752J515l07j754k163j305K50J357J453J112J046J087P53L32N45J324
52633H8829J736J134j26j196j511j083l90J9J8p0o0j83n48p47m38N4J57j64n25
52614H4906p80j001r90m69L35Q59R61J031J295J507J360R09M35J92L24P77J200
52597I2851J134M16n98j207q43L70J553J836J296Q32J016J521J793J744J504J013
52581A06231L40n1J30N16O41O72J012J456J418Q93N53Q70J608K211K353K054J619
52564A24526J430J515J437R19M37P06J581K058J518N38J40N30R98R75P36Q51J254
52547A42149J317Q45M91Q30J500J682J214O49L16j1n07r35j033q26m28M0L55M32
52529A48080O44J333K035J928J012K07J32N22R48J298J361Q06j08o13n60n93q78
$$ plain form
52512 157554 156837 156932 157531 157664 157173 156935 157499 158369 158822 158609 157632 155810 153653 152257 152146 152696 153089 153361
52494 153361 154061 155342 156882 158351 159577 160465 161081 161640 162224 162709 163066 163465 164074 165050 166670 168960 171205
52477 171205 172382 172274 171646 171217 171061 171184 171999 173765 175941 177568 178131 177908 177637 177914 178638 179102 178964
52460 178964 178905 179782 181292 182278 182367 182432 183258 184559 185611 186108 186016 185329 184461 184215 184905 186011 187089 188341
52442 188341 189880 191122 191545 191481 191492 191408 190682 189421 188428 188312 188952 189721 189929 189247 187905 186340 184675 182871
52424 182871 181274 180318 179697 178627 177097 175937 175353 174442 172749 171248 170943 171336 171288 170751 170529 170749 170718
52407 170718 170173 169708 169891 170679 171712 172606 172994 172818 172615 173082 174432 176382 178502 180221 180938 180681 180326
52390 180326 180641 181394 181910 182218 182992 184555 186507 188188 189116 189155 188717 188630 189417 190884 192602 194333 195738
$$ packed form
52512A57554p17R5N99J33m91k38N64Q70M53k13r77j822k157j396j11N50L93K72
52494A53361P00J281J540J469J226Q88O16N59N84M85L57L99O09R76J620K290K245
52477A71205J177j08o28m29j56J23Q15J766K176J627N63k23k71K77P24M64j38
52460A78964n9Q77J510R86Q9O5Q26J301J052M97r2o87q68k46O90J106J078J252
52442A88341J539J242M23o4J1q4p26j261r93j16O40P69K08o82j342j565j665j804
52424A82871j597r56o21j070j530j160n84r11j693j501l05L93m8n37k22K20l1
52407A70718n45m65J83P88J033Q94L88j76k03M67J350J950K120J719P17k57l55
52390A80326L15P53N16L08P74J563J952J681R28L9m38q7P87J467J718J731J405
$$ plain form
52373 195738 196352 196390 196923 198567 200630 202253 203672 205449 207132 207927 208258 209326 211271 213082 214377 215979
52357 215979 218448 221175 223338 224883 226128 227274 228708 230999 234059 236962 239157 241325 244436 248330
52343 248330 251801 253914 254816 255362 256326 258023 260424 263375 266536 269234 270761 271079 270962 271214 272014 273311
52327 273311 275337 278199 281300 283855 285800 287591 289285 290592 291797 293808 297103 301129 304915 307902
52313 307902 310151 312220 314863 318463 322695 327063 331592 336626 342181 348102 354582 361842 369453 376810
52299 376810 384208 392595 402228 412445 422910 434178 446698 460136 474112 488927 504984 522055
52287 522055 539639 557616 576036 594657 613189 631810 650910 670463 689979 709082 727911
52276 727911 746949 766489 786158 805026 822328 838036 852506 865819 877860 888849 899250
$$ packed form
52373A95738O14L8N33J644K063J623J419J777J683P95L31J068J945J811J295J602
52357B15979K469K727K163J545J245J146J434K291L060K903K195K168L111L894
52343B48330L471K113R02N46R64J697K401K951L161K698J527L18j17K52Q00J297
52327B73311K026K862L101K555J945J791J694J307J205K011L295M026L786K987
52313C07902K249K069K643L600M232M368M529N034N555N921O480P260P611P357
52299C76810P398Q387R633J0217J0465J1268J2520J3438J3976J4815J6057J7071
52287E22055J7584J7977J8420J8621J8532J8621J9100J9553J9516J9103J8829
52276G27911J9038J9540J9669J8868J7302J5708J4470J3313J2041J0989J0401
$$ plain form
52265 899250 909111 918035 925818 932606 938365 942726 945509 946964 947336 946671 945127 943004 940236 936292 930814
52250 930814 924096 916871 909936 903917 898868 894074 888813 883446 879249 877074 876747 877891 880610 885094
52236 885094 891135 898431 906902 916358 926341 936621 947430 958955 971034 983636 997084 1011382
52224 1011382 1025770 1039452 1052347 1064674 1076182 1086358 1095172 1103026 1110050 1115905 1120259 1123124
52212 1123124 1124635 1124770 1123267 1119702 1113738 1105424 1095176 1083397 1070273 1056000 1040989 1025657 1010123
52199 1010123 994209 977673 960420 942645 924772 907142 889857 873088 857315 842980 830058
52188 830058 818296 807709 798362 789903 781835 774145 767089 760483 753852 747184 740857 734882 729004 723541
52174 723541 719160 715665 712033 708002 704580 702474 700914 698790 696146 693736 691652 689229 685952 681778
$$ packed form
52265H99250R861Q924P783O788N759M361K783J455L72o65j544k123k768l944n478
52250I30814o718p225o935o019n049m794n261n367m197k175l27J144K719M484
52236H85094O041P296Q471R456R983J0280J0809J1525J2079J2602J3448J4298
52224A011382J4388J3682J2895J2327J1508J0176Q814P854P024N855M354K865
52212A123124J511J35j503l565n964q314j0248j1779j3124j4273j5011j5332j5534
52199A010123j5914j6536j7253j7775j7873j7630j7285j6769j5773j4335j2922
52188H30058j1762j0587r347q459q068p690p056o606o631o668o327n975n878n463
52174G23541m381l495l632m031l422k106j560k124k644k410k084k423l277m174
$$ plain form
52160 681778 676934 672045 668112 665633 663920 661807 658812 655206 651373 647619 644221 641037 637454 633304
52146 633304 629424 626608 624420 621855 618859 616183 613923 611250 607761 604172 601404 599613 598382 597259
52132 597259 595784 593564 590711 587905 585714 584072 582574 580977 579225 577270 575131 572984 571022 569192
$$ packed form
52160F81778m844m889l933k479j713k113k995l606l833l754l398l184l583m150
52146F33304l880k816k188k565k996k676k260k673l489l589k768j791j231j123
52132E97259j475k220k853k806k191j642j498j597j752j955k139k147j962j830
$$ [...]
##END NTUPLES=NMR SPECTRUM
##END=
