
##TITLE=AC1322_SRiAH12151_6535593_kv7ONBTHMZ
##JCAMPDX= 6.0         $$ Bruker NMR JCAMP-DX V2.0
##DATA TYPE= NMR SPECTRUM
##DATA CLASS= NTUPLES
##ORIGIN= BRUKER
##OWNER= Administrator
$$ 1.72 TOPSPIN		Version 2.1
$$ 2012-07-18 00:25:09.265 -0500  Administrator@TOPSPIN
$$ Compression mode = diff/dup
##.OBSERVE FREQUENCY= 400.02188249412
##.OBSERVE NUCLEUS= ^1H
##.ACQUISITION MODE= SIMULTANEOUS (DQD)
##.ACQUISITION SCHEME= undefined
##.AVERAGES= 8
##.DIGITISER RES= 22
##SPECTROMETER/DATA SYSTEM= spect
##.PULSE SEQUENCE= zg30
##.SOLVENT NAME= COFFEE_meoh
##.SHIFT REFERENCE= INTERNAL, COFFEE_meoh, 1, 14.98509
##AUDIT TRAIL= $$ (NUMBER, WHEN, WHO, WHERE, PROCESS, VERSION, WHAT)
$$ ##TITLE= Audit trail, TOPSPIN		Version 2.1
$$ ##JCAMPDX= 5.01
$$ ##ORIGIN= Bruker BioSpin GmbH
$$ ##OWNER= Administrator
$$ $$ C:\Bruker\TOPSPIN/data/COFFEE/nmr/AC1322_SRiAH12151_6535593_kv7ONBTHMZ/10/pdata/1/auditp.txt
$$ ##AUDIT TRAIL=  $$ (NUMBER, WHEN, WHO, WHERE, PROCESS, VERSION, WHAT)
(   1,<2012-07-18 00:25:02.093 -0500>,<Administrator>,<TOPSPIN>,<go>,<TOPSPIN 2.1>,
      <created by zg
	started at 2012-07-18 00:23:55.562 -0500,
	POWCHK enabled, PULCHK disabled,
       configuration hash MD5:
       6B 1B 68 BB D9 2E 58 E2 7F 35 AD 54 07 DF 0E 41
       data hash MD5: 64K
       64 86 04 51 08 2E 4F 14 11 C6 99 DA B6 56 A4 72>)
(   2,<2012-07-18 00:25:05.109 -0500>,<Administrator>,<TOPSPIN>,<proc1d>,<TOPSPIN 2.1>,
      <Start of raw data processing
       efp LB = 0 FT_mod = 6 PKNL = 1 PHC0 = 0 PHC1 = 0 SI = 32K 
       data hash MD5: 32K
       5A 15 87 C1 76 20 E5 D2 AD 02 66 8E C2 DA CA 51>)
(   3,<2012-07-18 00:25:05.437 -0500>,<Administrator>,<TOPSPIN>,<proc1d>,<TOPSPIN 2.1>,
      <pk PHC0 = 180.0604 PHC1 = 0 
       data hash MD5: 32K
       30 F2 31 E0 5B 5F AC FC 04 93 A2 DF CB 72 0A B8>)
(   4,<2012-07-18 00:25:05.500 -0500>,<Administrator>,<TOPSPIN>,<proc1d>,<TOPSPIN 2.1>,
      <abs ABSG = 1 
       data hash MD5: 32K
       22 E0 EE CB 65 A6 C7 2B 5B 87 40 37 6C 7E 4C 67>)
(   5,<2012-07-18 00:25:05.531 -0500>,<Administrator>,<TOPSPIN>,<proc1d>,<TOPSPIN 2.1>,
      <abs ABSG = 2 
       data hash MD5: 32K
       02 D2 D3 6F E2 D6 EE BC D8 7C 64 6B D8 E9 E6 86>)
(   6,<2012-07-18 00:25:05.562 -0500>,<Administrator>,<TOPSPIN>,<proc1d>,<TOPSPIN 2.1>,
      <abs ABSG = 3 
       data hash MD5: 32K
       BA 3B B0 8F E0 8A 4B 8D 7C 82 B8 F3 BC 68 62 B6>)
(   7,<2012-07-18 00:25:05.593 -0500>,<Administrator>,<TOPSPIN>,<proc1d>,<TOPSPIN 2.1>,
      <abs ABSG = 4 
       data hash MD5: 32K
       97 D7 BB 8F F1 C5 E6 43 9B 86 A3 B1 31 22 05 B4>)
(   8,<2012-07-18 00:25:05.625 -0500>,<Administrator>,<TOPSPIN>,<proc1d>,<TOPSPIN 2.1>,
      <abs ABSG = 5 
       data hash MD5: 32K
       4B 34 CE BA BE A2 E6 EB EE 3E C7 B1 D0 88 4C DF>)
$$ ##END=
$$ 
$$ $$ hash MD5
$$ $$ 9A DD BB 5D 4E F6 EB 73 8B F5 5E 2B 8D 3A 0D 90
##$RELAX= 
##$RELAX= 
##$RELAX= 
##$RELAX= 
##$RELAX= 
##$RELAX= 
##$RELAX= 
$$ Bruker specific parameters
$$ --------------------------
$$ [...]
150 150 150 150 150 150 150 150
##$TP07= 0
##$TPNAME0= <>
##$TPNAME1= <>
##$TPNAME2= <>
##$TPNAME3= <>
##$TPNAME4= <>
##$TPNAME5= <>
##$TPNAME6= <>
##$TPNAME7= <>
##$TPOAL= (0..7)
0.5 0.5 0.5 0.5 0.5 0.5 0.5 0.5
##$TPOFFS= (0..7)
0 0 0 0 0 0 0 0
##$TUNHIN= 0
##$TUNHOUT= 0
##$TUNXOUT= 0
##$USERA1= <user>
##$USERA2= <user>
##$USERA3= <user>
##$USERA4= <user>
##$USERA5= <user>
##$V9= 5
##$VALIST= <valist>
##$VCLIST= <CCCCCCCCCCCCCCC>
##$VD= 0
##$VDLIST= <DDDDDDDDDDDDDDD>
##$VPLIST= <PPPPPPPPPPPPPPP>
##$VTLIST= <TTTTTTTTTTTTTTT>
##$WBST= 2048
##$WBSW= 25
##$XGAIN= (0..3)
0 0 0 0
##$XL= 0
##$YL= 0
##$YMAX_a= 507763
##$YMIN_a= -650248
##$ZGOPTNS= <>
##$ZL1= 120
##$ZL2= 120
##$ZL3= 120
##$ZL4= 120
##$ABSF1= 14.98509
##$ABSF2= -5.573092
##$ABSG= 5
##$ABSL= 3
##$ALPHA= 0
##$AQORDER= 0
##$ASSFAC= 0
##$ASSFACI= 0
##$ASSFACX= 0
##$ASSWID= 0
##$AUNMP= <proc_prof1d_extract_pilot.lims>
##$AXLEFT= 0
##$AXNAME= <>
##$AXNUC= <1H>
##$AXRIGHT= 0
##$AXTYPE= 0
##$AXUNIT= <>
##$AZFE= 0.1
##$AZFW= 0.1
##$BCFW= 0
##$BC_mod= 0
##$BYTORDP= 0
##$COROFFS= 0
##$CY= 15
##$DATMOD= 1
##$DC= 0
##$DFILT= <>
##$DTYPP= 0
##$F1P= 0
##$F2P= 0
##$FCOR= 0.5
##$FTSIZE= 32768
##$FT_mod= 6
##$GAMMA= 0
##$GB= 0
##$INTBC= 1
##$INTSCL= 1
##$ISEN= 128
##$LB= 0
##$LEV0= 0
##$LPBIN= 0
##$MAXI= 10000
##$MC2= 0
##$MEAN= 0
##$ME_mod= 0
##$MI= 0
##$NCOEF= 0
##$NC_proc= -8
##$NLEV= 6
##$NOISF1= 0
##$NOISF2= 0
##$NSP= 0
##$NTH_PI= 0
##$NZP= 0
##$OFFSET= 14.98509
##$PC= 1
##$PHC0= 180.0604
##$PHC1= 0
##$PH_mod= 1
##$PKNL= yes
##$PPARMOD= 0
##$PPDIAG= 0
##$PPIPTYP= 0
##$PPMPNUM= 2147483647
##$PPRESOL= 1
##$PSCAL= 4
##$PSIGN= 0
##$PYNMP= <proc.py>
##$REVERSE= no
##$SF= 400.02
##$SI= 32768
##$SIGF1= 0
##$SIGF2= 0
##$SINO= 400
##$SIOLD= 32768
##$SPECTYP= <>
##$SREGLST= <1H.CDCl3>
##$SSB= 0
##$STSI= 32768
##$STSR= 0
##$SW_p= 8223.68421052631
##$SYMM= 0
##$S_DEV= 0
##$TDeff= 65536
##$TDoff= 0
##$TI= <>
##$TILT= no
##$TM1= 0
##$TM2= 0
##$TOPLEV= 0
##$USERP1= <user>
##$USERP2= <user>
##$USERP3= <user>
##$USERP4= <user>
##$USERP5= <user>
##$WDW= 1
##$XDIM= 32768
##$YMAX_p= 472946617
##$YMIN_p= -676002
##$CURPLOT= <Network HP LaserJet P1505>
##$CURPRIN= <$Network HP LaserJet P1505>
##$DFORMAT= <normdp>
##$LAYOUT= <+/1D_H.xwp>
##$LFORMAT= <normlp>
##$PFORMAT= <normpl>
##$SURQMSG= 1
$$ End of Bruker specific parameters
$$ ---------------------------------
##NTUPLES= NMR SPECTRUM
##VAR_NAME=  FREQUENCY,     SPECTRUM/REAL,   SPECTRUM/IMAG
##SYMBOL=    X,             R,               I
##VAR_TYPE=  INDEPENDENT,   DEPENDENT,       DEPENDENT
##VAR_FORM=  AFFN,          ASDF,            ASDF
##VAR_DIM=   32768,         32768,           32768
##UNITS=     HZ,            ARBITRARY UNITS, ARBITRARY UNITS
##FACTOR=    0.250966925370066, 1,           1
##FIRST=     8223.43324360094, 97306,        -268998
##LAST=      0,             138027,          -125186
##MIN=       0,             -676002,         0
##MAX=       8223.43324360094, 472946617,    0
$$ Real data points
##PAGE= N=1
##DATA TABLE= (X++(R..R)), XYDATA
$$ [...]
23839 -102776 221933 -29019 -180213 86095 -110101 -64215 -63015 -83341 313995 129370 -10769
23827 -172749 -104062 -376666 -122109 -47492 17169 -56467 63287 48797 -245874 -86485 44822
23815 212058 -50982 157144 248046 198694 -64172 -68360 202471 -104721 91385 -105330 -239546
23804 -239546 226607 55723 337090 -214812 -8362 124378 82240 48332 1561 17001 -259588
23792 241745 -26590 93029 -252183 -354004 -340473 112292 69489 97780 113065 84367 391894
23781 391894 -31689 -68850 128121 -4712 -144133 253519 63838 56820 1429 13093 -497288
23769 -223452 55117 -29792 -205305 -313193 220 -145799 114354 -25766 -300059 -153998 -92808
23758 -92808 -91336 -180455 139074 38063 -217665 -59463 -82055 -230578 4011 79067 224469
23747 224469 -86581 6532 -250203 262855 -294409 -4179 -134961 -218350 -120529 167915 -138686
23735 182663 -269115 -202140 -179368 -91968 4073 7289 -158548 -145907 -302163 344653 97977
23723 -307012 -39401 -249164 -260832 -170898 -42689 -113656 -74117 -133905 -3588 87031 -21034
23711 -113625 -66262 182332 4604 125762 -126651 -133923 16818 -31587 -480468 232070 -195419
23699 -156399 53394 -21679 114461 255868 -241052 70759 71838 -159927 -95259 41879 -9289
23687 369659 -47903 -198994 348639 -313874 -111282 69594 106514 29426 -1112 25142 -238578
23675 -194584 77414 89074 39245 -6054 70381 -8126 -203974 -175047 181676 236832 122326
23664 122326 -255213 -77326 50305 99606 -115628 340319 120279 -98683 -133921 276800
23653 90456 49962 -107613 -64916 -34472 -168662 -148316 -174510 -152318 114437 205387 330610
23642 330610 99906 -96297 78607 134422 128630 200551 -37084 -34581 47912 82107 -179732 245391
23629 -1198 -168363 168450 -164446 -296286 -256840 19350 213765 -56209 188100 135683 -186284
23617 191281 51192 -233218 52245 -156425 25985 -161129 181150 82661 -79455 210225
23606 -34737 -329203 -148101 -32397 -296802 -12047 64972 101592 -126002 217381 137785 -139101
23594 231577 158748 -93035 44539 -100420 -19426 119945 -31156 91959 146254 -118408 27958
23582 290996 23734 297215 -51314 237343 -150490 -68501 135056 -37266 -100733 119779
23571 13476 81306 324182 -134994 23688 -313461 144105 -21079 62052 -155589 206034
23560 70720 135451 164798 152041 -29249 -233969 -37515 318230 -88220 -338477 43584 113259
23549 113259 193054 -68150 -429084 -198586 1389 44933 -154614 -257359 -136075 -60711 -66364
23538 -66364 -321982 90203 -43644 -17779 87696 -223806 118245 -238441 288141 -85846 161958
23526 38222 -41763 -84996 140147 -318323 20021 87381 -353637 -28277 -1747 120111 20095
23514 -155025 96388 -98741 -447074 306599 328680 -20662 -28409 -58342 -28632 79754 -303519
23502 -125023 -24697 -80903 23247 79243 -39172 -296170 -1500 298570 -217585 210830 -24837
23490 -50437 70996 47632 -29205 36980 -229164 -278464 39171 5370 231336 -41263 -218593
23479 -218593 -351598 -190134 141322 55843 -154988 106062 -80073 -345779 39900 -47023
23468 119525 230513 26985 -11707 -185371 65552 -28690 -251000 59982 -15872 -92302 105148
23456 -86068 -120099 -91982 -253674 -118016 181029 72367 47224 -168754 -174165 -110871 209118
23444 -55311 -31591 11123 -278228 16230 -198884 -318662 84934 -251507 109819 -106191
23433 35893 -86326 -68801 71928 -96930 20096 182888 -133814 -49993 -87428 106250 -259212
23421 -366593 26467 -301089 42229 -72654 121556 -256026 -113615 -123051 6504 -46283 79465
23409 -104035 -246288 142228 -79160 5954 138093 83303 288039 -174327 238205 -10366
23398 116172 -117725 -427005 121314 -250074 -191237 94812 12586 -32926 -291838 -117607
23387 -88616 56656 81749 145924 -46076 38404 104427 237210 311744 -121128 -318350 127549
23375 -335543 20379 -83519 -164760 79135 192765 -152178 -96217 19677 -325377 -82532 94011
23363 182410 127791 68816 -216316 49072 105142 24561 -11171 -91621 -80003 -365148 72660
23351 84496 -112108 160293 117813 -45220 -85265 71562 -149303 328447 -314794 -182168
23341 -182168 -51061 -212473 -294248 -6648 -114952 -203575 -140603 -100877 -102568 -44376 -115857
23330 -115857 -194968 -99711 -441985 -126915 -69816 207729 -96882 44289 85045 -33572 219097
23318 -393710 265748 -185464 204913 144186 -254381 88273 -241669 14047 123084 -145522
23307 -79571 -43523 362094 243306 -49972 -215736 101812 248620 35132 -104616 -104512 -487459
23296 -487459 -56339 -88539 908 -31784 -91748 -181125 -137835 108233 -210717 161772 234331
23285 234331 152699 24231 957 9150 -82376 183147 263248 -13265 -251341 133643 -113241
23273 246794 -20721 -34223 6682 -352941 -107884 364126 106666 -157846 -144936 -184976 123278
23261 18690 151131 -152751 -306347 -241840 90538 -18888 73626 121338 -102997 7341 145221
23250 145221 -3156 98486 -108329 -114569 352061 158920 -55689 -28695 154462 -103199 127034
23238 169632 147210 -201767 319247 79693 -94542 -276948 -317470 313386 -70849 -25298 -108799
23227 -108799 -214964 20149 189258 -131572 402095 10186 180169 -29533 14839 -166147
23216 3695 163194 -138789 379227 -161491 -136850 169876 100219 -133072 -44427 -3440 -72554
23205 -72554 122828 -7477 293295 222085 -6404 -6164 -80966 -342148 106424 -162990 -55706
23193 -6815 -98652 -29169 -265780 1916 -45910 44306 84488 239489 186635 -223013 -40802
23181 69609 190291 -336195 105997 -352818 -283653 -397473 -349902 114790 -9589 389 -319864
23169 198904 69538 289285 -379934 181194 418736 51075 40015 -164626 55728 73928
23159 73928 146684 167532 -42404 109916 -66579 55026 98854 31470 -19382 -130273 64464
23147 -141611 -323852 -67196 -312342 -109426 34891 124995 248271 -173752 184662 461562
23137 461562 -372413 67896 99306 135585 17209 -180786 72960 64860 39756 227181 -117613
23125 -13899 -247520 -89879 92005 -274473 -24264 -3603 -20321 65562 236134 394627 117760
23113 -195814 -101061 -129104 197337 -69819 238880 -82578 273350 298331 76497 -162035 -322200
23102 -322200 143817 -273760 -88888 111545 392838 -86506 97137 48935 -257780 -149880
23092 -149880 64646 2577 260662 -90422 402448 -257383 -42919 179568 -165662 -257878 -407679
23081 -407679 -385698 -120317 34750 -173426 91570 469956 -134916 -52418 176889 -93317
23070 -34895 -199000 103866 178727 120673 -101750 -124349 423460 -128924 -410602 90439
23059 7681 -50884 -102450 -99829 91768 -145922 -11720 -154683 -215282 -34240 -111293 -115965 8127
23046 -85972 104915 73154 -319913 109352 -56985 103628 -193775 37969 -135108 -39419
23035 -240286 44319 116377 -360800 -77541 59136 42345 -18560 126210 -347701 -48164 -128970
23024 -128970 81440 86453 4522 -357963 -80560 306538 43740 -151885 -153272 40856 -464400
23012 76881 -109394 -148864 -81127 -215801 -239215 -300717 70812 179922 -16807 -326073 124983
23000 32412 -12765 21030 297452 120394 -25545 -61435 214618 -164392 44221 -266528 -287986
22989 -287986 -140098 -70254 -34934 -169774 276375 7906 -174636 47269 -229888 -55543 221295
22977 -219791 50245 -257666 63312 86731 21939 201238 -321571 80010 -309150 -169075
22967 -169075 143543 467147 56402 18501 132957 -49312 -379544 146648 184978 17615
22956 -445200 -214016 -199494 247938 8624 -200521 236673 212830 -163722 112007 67108
22946 67108 23524 104717 -97632 260153 -174504 -191030 -51822 64501 27716 -89769 206584
22934 -18899 47466 -29178 -111701 -247764 -33266 -230169 138119 -31165 251170 -384869 -19562
22922 28042 35826 145976 -99765 139082 216023 52217 183655 21479 -168275 -268571 -45684
22910 180272 -119923 -75555 -49628 25961 131172 -10824 15873 -112868 -242683 -10534 131095
22898 164518 115119 -170821 -55866 -110026 128315 -205670 -222350 -216127 -171649 25256 -54794
22886 -86451 -171164 310708 58308 123342 -30050 -14445 -117081 32554 -8353 133062 -177603
22874 -8676 -115166 37406 -115995 184184 -220984 -4492 444829 15529 151486 -5742 -79490
22863 -79490 202376 -315761 271218 354551 25421 -451883 -4811 -18636 -35157 -13367 -262226
22852 -262226 -102290 -371506 -11600 277172 -44088 -92377 -185301 -271630 387441 -168993
22841 -112372 -355036 74461 118185 -264334 -318839 104020 165115 64422 -41813 -110427 -59715
22830 -59715 111411 -116916 37058 -59916 145386 -198662 -45907 234128 72031 153382 -91712
22818 192857 15113 253365 -30287 -15823 -36485 163106 -91641 -335212 49456 -111813 -275831
22807 -275831 -438603 -400906 -162270 417120 -365018 116489 -210450 -83184 9828 -189391
22796 -7740 136291 145632 -308479 2013 -108984 22836 -486146 -232131 -48503 -132124 -2497
22784 22268 101861 57934 96677 62346 -401845 -95800 -87263 -185487 -53057 -381375 130969
22772 -160464 -43337 -65560 191521 176840 -131505 44996 -157075 -164812 -123560 365626 -33597
22760 139145 -32981 -84708 136571 91136 -4422 43820 80536 -396011 132434 50220 110701
22749 110701 -184712 -281814 -78179 152373 -324074 -177829 17136 -156884 -261232 -125503
22738 152854 -129657 -397230 114947 -102877 -121018 -218592 -196229 177644 81589 -137696
22727 -230923 -156523 -93482 -197503 -21357 -339325 -172396 -225493 -199565 -213505 223214 -255981
22715 -128292 -19963 -331137 227975 -89126 -142848 -68651 31624 -54126 -43881 -38444 -104717
22704 -104717 51496 -158058 29056 293614 347564 -31780 9796 20307 33886 -436448 198686
22692 -168667 170641 134046 -236229 -79413 -166236 -11341 41511 -171165 166670 136506 57868
22680 18544 182472 -182125 -379627 -309354 28406 -69323 -252436 -151984 223807 -106561
22669 -162273 187641 67804 3130 -301738 -64174 191514 -273435 -204175 88612 -170296 130313
22657 9312 -2800 210994 -65109 171740 -45880 163824 -281840 169811 -38148 161099 -83393
22645 -72785 28491 156655 -37303 -62955 152600 -196985 184242 -179055 -66837 155076
22634 57497 191316 17860 -397069 -106629 -126678 133762 -170150 113554 -119878 -82562
22624 -82562 -247356 123192 35526 -60855 218884 61231 144482 193603 -136484 -107034 -196122
22613 -196122 9594 229252 -129208 -127203 -103802 190235 141633 -157267 -112338 70266 60236
22602 60236 -115775 17106 -118859 -197268 110938 2876 -192378 39111 6293 -19018 -39470
22591 -39470 -18295 163036 -58939 -219132 -158483 38494 -328188 -176362 103354 46924 299046
22580 299046 132767 7665 500290 -115223 -70448 443812 -20691 -101085 19872 123356 -302846
22568 187724 -116421 -96916 -33236 -166368 86674 -240013 59192 -435665 -282604 -271898
22558 -271898 -67268 45389 -330581 -240030 -384167 24644 145197 -164850 -58939 212023
22547 -78422 245732 -359718 -94568 109207 -100118 -94257 114602 -365330 -28753 111264
22536 -3883 -117982 -158736 -19588 -48305 146700 235714 -144578 -290587 -69473 -331278 -248571
22525 -248571 -99977 -115777 31623 -495980 -109743 -217491 -18181 -271635 -288092 5981 -72628
22513 -56668 200508 458075 48806 212887 -87557 -300802 56861 55473 -373906 -155638 -64991
22501 -158117 -3887 17534 196766 -168789 -282477 -75366 -141604 -100311 -361809 95874 -334029
22489 12033 52444 15726 -114655 238696 73274 -158567 -109802 -14491 -182577 -42932 106947
22477 -386747 399330 183533 100182 -160512 -44416 -71587 -30829 66507 -215461 25876 -40021
22465 -195463 119465 -142808 -156053 -150099 -37394 -15481 14590 -66939 -459665 43823 138186
22454 138186 -44072 -331051 -40650 203093 139708 229061 153343 214949 46081 191198 -78832
22442 -332732 -111181 -278798 -144353 -25900 -151052 -126754 -488785 17857 -376063 -244229
22432 -244229 243980 46213 -260437 -240538 56401 108293 -90477 -149224 122212 41063 -8347
22420 -306436 -51394 81619 152380 -1031 -151422 221283 -422668 -365202 -240038 -82155 94417
22408 32331 -28380 1680 -71644 -68110 353541 -81386 169866 179632 -277439 164127 137958
22397 137958 -31853 -171568 135384 -342102 -80674 17713 69768 -164610 51889 25083 -354435
22385 -48661 -154564 62631 -53415 196939 107414 -113385 -63307 -189168 -244632 278448 56331
22373 -95149 -34446 30658 33061 79917 -178752 -208917 175606 -29536 65005 -26686 157830
22361 -110446 343079 198798 201600 79806 -144523 8565 484208 -112321 107494 -269045
22350 206670 -149630 -7386 -28789 -147108 38252 66192 -92010 133141 53449 -7979 352043
22338 -28470 -136877 -3983 18899 181853 -250200 -72649 266034 180935 -99785 176696 273572
22327 273572 246940 63750 254044 6982 -48577 -271547 -16277 -246207 -115818 96562 29704
22315 -14140 -79123 -68187 335255 146090 -63949 184218 -23785 -13663 -267559 223906 238415
22304 238415 -116468 -19673 -74605 -33977 -173145 116699 -263994 62840 186811 118624
22294 118624 -195412 84111 78541 -3081 29014 12277 52416 -95371 409258 240359 -311423
22282 203520 -59413 -122350 62890 101821 -140962 -47574 -66824 -198532 -31285 71991 -27102
22270 53438 -302669 -172458 286618 -35995 -128593 -268871 424748 20504 114365 267354
22260 267354 -9648 -96637 -348988 86489 135705 176785 -115031 -92929 -94816 -144271 -61954
22248 111394 -298347 -129393 370293 -186745 -82771 40539 13246 -73437 31492 159627
22238 159627 57480 -209189 -241830 56516 205865 -99692 181611 -248974 215252 50172
22227 -170313 41857 -39886 -366370 43102 -229270 -109578 -374739 68729 48034 -26086 64149
22215 -285448 14932 -314631 -312898 161129 -302772 -323110 -3149 -15249 79153 -181789 -469575
22204 -469575 -155680 148988 -369292 19699 -113354 -91945 65937 -10497 -251399 -233215
22194 -233215 -58302 66809 -277114 105774 -144009 -100960 -72394 -143987 1475 -29426 -209775
22183 -209775 -235026 -255 104555 -23435 189234 127950 -30100 -214961 -6706 -136981 12913
22171 81297 -51936 6736 -325917 -46155 9528 -112941 -150155 178038 -124468 135021 -240861
22159 -36098 -377309 -28537 -393420 245599 -49593 195430 267220 10956 -374874 -52150 413713
22147 14073 4266 -218328 -385893 -172928 -68369 48316 -107645 28714 -4375 -78750 122121
22135 -305565 18781 -68341 -229232 90459 226785 -252101 -509893 12934 -365789 60535
22124 -18600 -150867 -115979 -104589 -13937 -38745 -411540 134146 203073 210876 -194592 -184689
22113 -184689 6531 -86366 -36632 -163180 37773 -57882 -25265 -45121 134946 109795 -133302
22101 176174 -5781 -33603 -218475 -163146 185282 -125193 -109942 -164580 30860 55148 -160118
22089 -24518 -237856 -179076 49899 -45976 -23317 167551 -28007 25102 -6511 -188877 147738
22077 -94995 113831 116214 145245 -139413 -363136 233286 46871 -211248 65513 -212719 -39351
22065 49306 -156785 -285097 -146417 96702 142211 -59190 52160 193891 -144489 -90700 -34061
22053 -85814 -31948 -294162 366293 150150 146557 -177260 -9882 170171 -70646 399172 -198970
22041 144782 75192 108213 44413 216025 -255211 -77448 -364268 17558 -48627 161378 -197281
22029 -267169 174067 212775 -7718 271613 -3851 -28296 -99402 -2984 3551 -186576 -51011 -10147
22016 25135 445721 -292587 -233447 -134183 -37540 -45769 -210508 -371127 -97036 -103484 -57108
22005 -57108 22863 -100110 123030 -66922 202929 -127735 171725 -123723 -124669 -177505 -311777
21994 -311777 -241971 204507 56695 -16363 1319 76419 -348739 -305889 189033 34151 -102743
21982 -157700 -55772 -8107 -28132 208762 20963 -284139 -231492 110236 209817 -823 -570259
21971 -570259 -28821 137681 -249623 168749 -354271 -69515 28168 -123151 -201387 382696
21960 -182896 -174114 -326223 36462 -45129 57970 123664 125547 -54670 1859 313553 -207342
21948 -169190 -101478 -59439 -32586 -254573 88533 407710 -126502 71589 -42919 257159 138190
21937 138190 6949 -63431 -104702 -482709 -106562 -8814 -140170 17581 8545 -228998 130609
21925 -121750 -252438 19678 -18497 -353651 -61161 -49994 -67395 -129097 165348 30307 -4558
21913 -227205 -5281 26175 221474 -90533 -145911 176508 143617 -217349 -303693 84375 120382
21902 120382 -153051 -100392 -51837 -178608 -52134 -224110 134589 -141176 5274 -88205 106275
21890 -146258 -74916 -143749 -77608 133719 37086 -75462 66703 20835 -37542 -191403 -70579
21878 49859 237485 -49975 -195645 -167948 -2810 89884 -37626 -63339 322567 152002 -114363
21866 165783 111461 202956 -148005 -209581 -134277 -190344 -595887 87804 28900 -130585 -263157
21855 -263157 -275502 -157053 58928 -89695 86749 -31798 -2357 146079 227914 -184970 -287197
21844 -287197 -29025 -513864 22763 -188806 115967 -159472 259415 -325130 -180880 234325
21833 -398536 -3837 -38870 -59506 -172764 17321 -167294 -162629 -126193 -84366 123311 -45759
21821 -152831 -119717 24097 82350 -116848 -170269 -225785 -202808 355423 301902 31033 58052
21810 58052 -35795 117299 -298799 248133 -60978 -71545 -301474 -71026 -53788 -9983 -64730
21799 -64730 -441876 6718 86849 299173 43447 -221051 126571 33074 -122854 -55450 -216777
21788 -216777 211089 194411 -24599 180118 -56814 -308172 -159641 -181554 -470462 -185370
21777 -119004 -181342 129879 -289768 -117731 186046 -77611 -30357 -164214 -15270 12136
21766 -61424 70830 -248804 -177955 213630 72123 278800 222172 57895 -9668 -250044 -427096
21755 -427096 -207710 -88350 88636 101552 238828 167960 -163281 -42679 124311 -191652
21744 -224782 -67934 372922 21109 -74447 113785 -37921 97962 -186692 -316813 239511
21733 -313744 -186790 183691 -74399 -61980 -212277 85535 31747 -208915 -72963 139970
21722 -9350 -127969 -265067 -180675 189960 285893 -135039 56438 34386 53210 130909 165694
21711 165694 -140989 -31257 -131259 -111955 65469 87766 -226089 193178 -57749 84502 -184644
21699 -126190 -80007 -44308 26019 -102761 150858 -143040 224992 -63560 -78617 -127909 -164466
21688 -164466 47394 46773 -234738 -222453 -235239 -26166 -136543 -63114 -138760 -19613 -139343
21677 -139343 21290 80116 -77361 135962 -168125 84770 -447797 104989 -10941 -90367 156101
21665 -63949 21252 -83811 43844 -1578 -208882 -11398 150461 -204940 -383899 80800 252334
21654 252334 12329 -301346 -8743 -200346 -75354 121348 21235 2329 -121545 -217950 44162
21642 -148978 278602 -258580 356454 -143740 223849 93596 17641 -108615 54569 -13122
21631 -44336 4364 -135993 187787 -146529 98411 -114638 -236503 -75362 137404 -135965
21620 -2663 -86073 -40011 -126513 -336352 -59544 31869 160576 -246127 120088 -2970 -264859
21609 -264859 -261105 53450 88992 -174345 -161281 -86862 -40531 -52363 164092 66652 86614
21598 86614 -222652 -222319 -5135 -120684 49928 86113 -165914 -56099 -57731 -269437 -125327
21586 261990 -497709 -64039 206517 38332 158208 -14581 -139039 76653 -56484 -14777 -189411
21575 -189411 -144220 -45896 79605 -103553 -120394 139058 146228 135471 547767 -30382 -45771
21564 -45771 -84552 -90575 -289957 -62468 57281 93511 -416640 -212604 -176993 23196 -36157
21552 218549 -372040 -246263 -21395 -5222 -47022 -112816 33578 145468 -167167 210642 -15307
21540 -180263 -186215 -5026 -78510 -36602 154608 -8551 -77605 314158 38923 39687 -77979 354342
21527 117473 -46929 139985 14163 -219826 -232292 109009 -76635 912 -113696 -141290 262136
21515 -76198 -176155 40614 161130 -398213 42976 97842 -132687 231051 132834 197263 -185332
21503 -149546 232706 218984 179115 75034 -146143 108229 40779 -100118 -142819 61623 -207997
21491 141316 27865 -2611 -116946 -49075 89393 -93473 120544 122435 -216453 -164460 -88096
21480 -88096 184348 -225141 79818 58048 -37418 110596 17839 136917 -66525 -183775 -28501
21468 -101213 -386579 -49025 -127078 29926 -67314 183494 171471 -70997 -56600 -118372 288424
21456 -17632 -284653 -217875 54635 -312968 -173347 -376742 191476 356005 -295742 -296008 213865
21444 47741 -242991 171547 41059 151070 12671 132191 338942 296064 -128496 12241
21433 -4387 324519 60476 105441 -203974 258196 -30794 169365 79240 33141 -304968 259829
21421 -87185 179926 185582 78711 323449 121366 -10313 -32839 113115 -90196 -34104 -181059
21410 -181059 -74111 -106035 -230972 -54916 22063 180314 -105260 -162063 261049 180804 -128873
21398 205568 147583 9853 -85521 -45568 118566 269954 -77649 42655 -85636 -150281 -231467
21387 -231467 -302457 -275991 -185740 119676 -313118 37736 204897 35070 71305 148603 29672
21375 -80250 -173423 144670 -171496 -392475 -212885 -338566 -99712 -295388 150690 190645
21365 190645 -292094 51778 -346116 -235467 42756 31702 139210 -316774 -287393 -246784
21355 -246784 -46976 -257373 -61085 -250831 65219 48442 211301 -81247 -375344 5406 72694
21344 72694 169760 -32193 -55772 20288 15085 30528 -174729 -59534 -218579 -47406 122465
21332 -162880 -230913 231169 138921 201240 -85710 152282 -71693 -30975 -1919 1161 -40832
21320 95949 18859 -88551 -191506 367031 -277788 95157 193581 -51229 179437 -195162 -133145
21309 -133145 -169785 -351016 -1685 289153 -225058 75978 -347566 -3703 -150699 -43512 132993
21297 26099 150226 -65891 170234 -43684 71872 -348946 154358 -183263 -160271 21573 -259377
21285 -289153 -207865 265459 -106844 172621 20559 -19644 96251 144561 -85531 96074 -85986
21273 14219 -31563 -246820 3466 68164 24523 -20829 -128671 100833 -222220 93919 -252510
21261 -26179 -354203 -117291 -269207 -268616 191465 -136375 -113037 -171414 79456 -248490 -87275
21249 -24946 30200 -24206 -122695 -57948 79714 98451 173589 -219528 68422 -252561 -155561
21238 -155561 -590624 262350 -149956 -90022 -289764 -100451 153793 154812 -359079 -192942
21228 -192942 -64033 25190 -113450 -221026 36039 -120232 56945 -42386 32813 -105071 -50502
21216 -125025 -119844 117572 422584 123990 144161 -457086 97309 59351 -6613 120661 -19786
21204 -466830 -61905 -15423 101984 266552 178279 30077 177665 -131820 -166429 -26365 -292246
21193 -292246 311435 -194230 -255025 -158449 -477799 37845 -54524 119776 -324439 112538
21182 -126825 -104543 -124213 -13869 79105 -159701 -60981 -353512 -133969 -85175 -132110 174141
21170 -135515 -124142 129156 -250749 -16329 77990 -50120 -106005 -73831 87174 -4608 -257527
21159 -257527 -15929 44967 -195010 -163775 263191 77293 221981 -53587 -213290 -50770 224429
21147 22523 100984 -219056 211988 -65157 -134715 97105 -121128 -200385 -174156 -87641 376512
21135 50286 12216 -90001 26891 -263263 -51869 -82303 -49705 -247118 258467 67064 -125832
21123 41421 -53158 -211346 114901 -533754 101450 -52853 -303964 -178647 83793 -125957
21112 40386 60859 -81856 149564 38217 -35727 -45417 -169502 33829 166592 -78412 22638
21100 -12805 -311294 -202658 94675 -162121 -121759 75768 -235249 -375909 -385401 153539 -197672
21088 181634 -110777 138822 28954 144627 129683 -89295 -86739 31408 -153291 -90224 -135750
21077 -135750 146844 86386 -292825 -85112 -224350 -233604 -280115 -131017 44546 260900 33703
21065 -14038 -177864 -42336 43022 -76975 19011 55144 -44487 -143034 -81014 -7636 -247982
21054 -247982 189912 -429472 -13976 94965 117636 65265 -112530 -130002 -132256 -351011 -111888
21042 -228161 -186346 -228683 94968 -505 -36783 -383206 81077 -102443 19332 -258057 26159
21030 -339638 -77151 -45553 208378 -23744 44002 240281 -282526 173370 -308516 53277
21019 -237333 60375 -235022 134139 -161896 -35782 68889 -87124 -290729 -88251 356481
21008 21720 -222607 54432 48830 -243046 -50590 -157007 -157346 9949 182998 -17458 3295 110833
20996 110833 -47985 78662 -134246 -14060 -44770 114074 -133856 65611 -47531 -91134 35404
20984 -178428 67814 93530 141571 171689 -253581 -184652 -179295 54022 -87952 -68442 -173124
20973 -173124 -36003 -165485 82803 -115828 -29061 -17729 2990 -275120 -77279 -36908 62655
20961 -155418 255638 -48339 37279 -32049 -116899 -97544 65095 -118933 132240 -211126 -468082
20950 -468082 -242323 251223 -57505 -66610 -34083 228676 -79065 40472 267994 139319 -66430
20938 -130325 39687 23073 -125954 40239 39101 -14291 -225392 -241754 86957 97922 39464
20926 -91685 261136 78010 -174072 -248830 -32889 161433 57484 61212 -21025 -36209 -205666
20915 -205666 -310 158955 -63751 256075 -423480 -155681 -471833 -107331 14280 104725 -172388
20903 -394091 106266 -95463 -194716 -112314 164940 -409353 -202674 -44105 74328 36264 -3788
20891 -327869 105900 167913 -150584 -223608 -366821 -96204 -477199 249339 -394541 -124070
20880 -70304 82914 -147356 44632 -190397 35522 -235241 -191434 -4523 -108478 184911 21061
20868 -235001 -269321 -471188 53508 220738 -16325 -104586 -123666 172145 -318047 -53692 -201940
20857 -201940 -127441 -157250 -97075 -117796 -111176 34344 -325669 -339032 46758 -57114 -62028 -186198
20845 -186198 -174695 276788 99092 -163819 -165323 59325 -85534 -368915 -116578 -438182 194722
20833 -57174 274750 -516504 -228639 334994 -122957 30298 -106597 -260959 -114176 -214479
20823 -214479 -35195 -248382 14860 -96578 -238976 -21251 -76646 -36961 41386 29680 -190992
20811 -13497 262316 46956 -133823 -316963 -34406 30785 -64208 -251871 -8231 -116803 353657
20799 52316 -222498 -259908 -224238 63866 -38117 -21019 -40077 -121499 -161085 -80359 -69795
20788 -69795 -192439 11371 -215378 68744 202216 -139395 244704 104807 -29085 -324045
20778 -324045 -36961 -57435 -41855 52400 -271598 -65145 99712 28976 139021 -82063 278736
20766 -95670 -181897 120142 92983 -19269 -237711 -193258 -46777 90811 -319979 -127255 108839
20754 -15549 320775 223771 -135850 47489 -147801 142230 -16018 -461207 -80585 -54239 -149455
20743 -149455 83801 -11446 -171929 327368 -188487 -67042 257790 -228130 -135960 -119282
20733 -119282 232808 -275241 60159 -172333 -143330 77976 -147251 89793 -25593 -4799 -2500
20722 -2500 83923 132449 -297124 129805 -27146 35037 21431 -20261 -106514 224879 62803
20710 -413967 63449 300294 -211247 -87063 492206 140962 -80931 -168432 22865 -129851
20699 -107609 -117724 201119 -309697 60762 -46869 -108113 -238882 -19804 300732 39802 66694
20688 66694 11034 353669 -274172 -79190 -44899 -144186 -8378 -266317 -132639 -272093 -310681
20677 -310681 56267 -200962 -323339 -69800 -147638 125433 -128531 -12933 71935 144039 26722
20665 326181 -7203 135198 115892 -204898 41789 -13067 -136277 134200 -70368 140922 -59724
20653 318750 -332033 176256 156126 99568 -406594 -255159 137136 8534 89707 -49362 -123853
20642 -123853 -160016 -320424 -323242 -352609 228871 -105969 -364516 26388 -189219 62895 -178735
20630 -414815 -75101 -144900 119497 71373 157624 -151938 120940 -149471 -56870 -30452 -56860
20619 -56860 156812 2017 6806 -137211 -146384 51950 -55507 69479 -183935 -69659 -52800 -490930
20607 -490930 -30685 -298571 -200181 64050 226930 -72322 -2268 90401 -130871 28042 -178117
20595 -215984 -191955 -302876 -65501 -76088 -117359 -271647 -49883 -169216 -73949 68811 156901
20584 156901 70867 197564 123290 72965 -37017 -133548 -67023 -103229 5320 25481 221926
20573 221926 -148975 -67873 -193210 -106818 -197527 -143114 -91143 -11556 -211712 -127218 -191406
20562 -191406 -73624 -6529 -95680 147032 -228315 396115 -195792 -59639 52621 -35807 -147370
20551 -147370 -122190 208379 -107352 173174 -29217 94469 -91262 -314056 13707 -163913
20540 87604 -119253 -30147 -333586 28445 90207 -129193 -104098 -77412 -236289 -160244 -136463
20529 -136463 -94206 -299373 -95379 -305273 115364 -95130 -300613 -9869 23277 49559 -95661
20517 -70604 -288028 -125695 89272 -7776 -369986 191499 -12946 100388 -40603 -296829 -111137
20505 -51396 -150998 -367500 290919 -216565 -102257 264431 -170012 2278 -33867 96227 8577
20493 382897 -69776 -48245 147948 -95194 -50296 111136 15809 -24661 -238378 -333972 -185948
20482 -185948 -136893 7610 -110334 -34587 546718 156270 -2528 219152 172430 92532 -72741
20470 36524 14532 -263470 -290472 -2483 123433 -207298 89316 -89578 164080 267357 -1432
20458 152842 98674 -29529 116299 24679 331653 5711 -263029 348555 149634 -119733
20447 -71163 410374 -161488 -88713 -84136 279856 155592 162752 -243001 -192953 -136131 138349
20435 -132520 -19225 -233273 158981 3221 -274987 170422 74374 191046 28719 -202467
20424 -134601 -90757 -73777 54048 42158 -118456 80733 -58362 295174 359525 142068 76312
20413 76312 55801 -11842 -308462 53223 -303825 -75188 -92463 -67549 140720 -203955 -55672
20401 -6138 -259031 -129946 45775 -91670 183268 -133968 -159131 94317 -33805 -174093 -69018
20389 -108900 -29669 -65203 -343949 -441908 -381062 -198420 91982 -343308 -216220 -34962 -63058
20378 -63058 -234936 -82366 -320883 -96005 -47812 -175590 -83889 161547 -75492 314728 224310
20367 224310 -144776 26482 178457 -119220 -95650 -90157 33436 94408 -40795 -13481 -99060
20356 -99060 286485 304366 -206930 -229718 160611 -61565 237944 -48556 -302430 -206317 37391
20344 -86617 27175 160416 -413120 235809 -45202 -197870 -207532 -194865 -79527 -179814 92181
20332 208898 -231325 -27745 -209081 -145530 -69176 -386087 110130 -90181 97171 -221663
20321 -140077 17513 448 56460 103992 31708 84268 -38808 45116 -250742 -72271 -12547 -452346
20309 -452346 -136314 -80199 199372 76350 -57791 120428 -502400 268248 -197017 -79566
20298 -71180 62693 -438799 -170836 99096 97036 -59466 128868 384697 86223 33826 6008
20286 218575 6719 -366648 218455 -137042 182064 93854 61461 214493 -126251 -165024
20276 -165024 42196 83865 277709 -184576 -7237 -147052 -305038 -125054 22762 1634 432025
20265 432025 -312134 43121 -237827 -67656 -225940 70436 -197721 31527 74348 -17790 -68506
20254 -68506 10209 -128851 86191 86920 -118010 173072 -256820 -46956 41236 -163116 -96536
20243 -96536 27081 141219 -175708 -9762 -294587 -58492 -488436 -172664 -265192 -115039 -173418
20232 -173418 -380782 -14218 174671 -56328 122185 138230 -313214 -107564 -272645 -105961
20221 -268192 -112409 -45474 364012 -273905 -211449 -31790 -206704 131729 -485104 64703
20210 -222793 -21071 -183300 62722 -5399 104958 -214555 -201476 105465 13465 -126904 122133
20198 123823 -252624 -65750 -76622 -137469 -123278 -190926 -13253 167661 127764 61691 -333426
20186 -312177 -242677 -10746 53675 239748 -219032 -9600 17561 -59475 -13003 71998 1580
20174 77091 -20876 -114943 -319738 33014 105494 -119777 -75655 -149915 28771 191059 -31184
20162 -132674 270064 17271 90100 180084 -120723 -218025 134751 218274 111820 27642 -8001
20150 58287 -132869 65992 -89293 -96810 96392 -139402 127678 -72727 -67858 -71263 -170546 143501
20137 -76026 197702 374879 307071 93713 116607 -363632 -294082 -212760 146213 222587 -229018
20125 268391 -175348 -252842 110006 -83932 -272195 63872 72248 -311868 137637 135535 139797
20114 139797 242265 112726 -50362 -113102 -30015 266335 -76041 125700 -140334 -319042
20104 -319042 39510 -96598 -51397 -283392 117159 -45162 119409 -9361 96956 -19654 178763
20092 141504 -65311 -139661 45902 -167825 -85308 -112920 -188707 25497 -62379 -146919 -145081
20081 -145081 -32798 -2986 208118 58831 111847 -103542 -107116 -164443 -490663 -323145 -92472
20069 -287201 -360026 -48819 58412 -19901 -172596 -87497 -103153 -95624 -75326 -119089 58439
20057 -56673 -124629 -6029 78323 38865 46469 -24932 2035 210182 -187693 290404 -103098
20045 -218980 389683 -115249 -135851 203072 -170918 313716 -127494 10837 -4649 -39107
20035 -39107 -226467 231086 -229587 -120279 -78541 -172032 -180276 45958 -321904 -4943 -278052
20024 -278052 -3752 -76671 -234985 229895 96416 -67332 300953 171479 -218254 81102 -121461
20012 -161597 -295764 30006 -193113 -26361 -233942 5559 219376 301405 28703 -26702 -92403
20001 -92403 -29768 -80182 -27867 367896 -226799 49839 -259962 -198173 149679 64906 4668
19989 35785 92320 -91587 36738 17439 -87797 281177 -94378 -97405 155633 105736 81722
19978 81722 257452 -108582 -38691 147172 -101490 -249339 -266729 -107383 -159455 -145217
19968 -145217 -24562 -23119 206196 -69915 -57708 -164777 -34955 67792 165648 84186 30169
19956 -230824 51107 -323488 -374723 -351306 68757 -177388 216060 -124065 -69579 60267 63593
19945 63593 178559 -8322 92016 -241824 122524 -259569 29323 -48627 -50776 39517 -150897
19933 -123253 -186477 -219675 -53005 -33845 -40323 41350 -55442 -70100 -103284 -146525 -262747
19922 -262747 -183549 -202439 -123891 63560 -15813 224089 -333966 -208200 49944 -112783 25446
19910 11480 -45760 294914 32546 -150025 -107513 87312 -278493 87854 -50588 14405 -83181
19898 -294516 16794 -171258 244659 17191 246977 -118535 -82576 292493 141630 202496
19888 202496 -263792 -48874 -235493 -48644 -425004 -429205 184876 -328217 -189304 44204
19877 -11741 -128795 127186 -105132 -403602 -283267 66032 4558 106244 116990 -166691
19866 -11407 174699 -149083 -60955 -50374 146603 -87570 80560 -47528 -12442 -159307 -72697
19854 -240945 -3212 -34949 -110936 42906 -176143 85269 12330 -48163 -136790 87157 -146880
19842 -294593 129567 -75300 153805 -44808 48311 -303815 10526 32147 11582 34327 -120251
19830 138974 292016 128970 99237 -153610 -72220 -75778 -8859 134337 -375179 20925 -225350
19818 244044 -146901 184017 -240144 -147222 -25869 35397 112017 -350712 89686 234493
19808 234493 -190898 -25257 -76954 -251870 34789 -178044 -382676 -168467 -229022 -204387
19798 -204387 -215696 -130595 -33139 1863 -198957 -208540 -29595 105696 160648 -187238 -8204
19786 -362773 172819 -4978 -405138 -140419 -176663 164217 86046 324832 -107821 -134461
19776 -134461 -459578 -278874 -113582 -208441 -29661 -273542 -171511 298037 -645174 -139928
19765 -563418 190247 -320482 -350176 -258395 252810 -268283 -82815 -218534 67818 -217369
19754 -3787 32715 126638 -75206 -148580 -273147 167198 35141 159269 243774 -309762 -173703
19743 -173703 -104281 78738 -23425 151008 320305 233765 -294527 -173047 -343497 171966
19732 -135811 -228498 -12555 -147164 -120287 247956 119543 100479 -199585 -89144 170004
19721 -309101 -245701 -235587 -210525 64632 -59033 155222 -162250 -121870 1487 -61945 28899
19709 87952 76889 80835 11895 -170504 101110 16805 276716 -76400 94388 -186964 -61262
19697 -210193 -261593 196659 9344 -101328 220810 -354373 215268 -220174 -405590 -17705
19686 218555 -49000 -139844 -148214 -189899 -225027 -41491 124644 -7962 -61112 -121832 188801
19674 -200197 -49067 -33436 19407 -58984 194410 102483 -381654 -495935 -283756 -144459
19664 -144459 -54432 -135951 15914 -97187 -35287 -52150 81941 -211478 -101643 3632 -212518
19652 -18063 -217678 201493 -418565 89797 -155903 -75117 159155 -341735 64730 -263115
19641 128495 -161592 -301939 -285992 60370 -125415 25488 -326724 -374702 -354349 90920 -169679
19629 100936 -133506 -165803 -233488 -122961 -279004 -194406 3341 -99446 -40417 105280 -5900
19617 -95937 152343 -50360 165234 -206696 143870 -410866 -296334 -182490 108651 -82298
19606 254617 -108961 -187650 -2659 -46928 225624 136754 -36769 -37441 -10549 -252556 -78705
19594 28389 -72973 224404 9135 -115434 -192441 280074 27000 -198325 -91228 -127821 -586793
19583 -586793 190227 98444 35406 8700 -35889 174483 -199525 341813 -168160 92013 -134489
19571 182481 42517 -215972 -129934 50191 -116398 -361951 -93032 226224 -4937 17170 241279
19560 241279 -56677 -20642 -328500 -216508 227792 205750 35084 361962 -65072 -83911 73168
19548 96489 -65355 -183119 -293607 -105198 -129866 128173 55964 112320 37938 -73124 -16692
19536 -312597 203712 -238511 235589 -235848 20555 -69318 90245 40041 43184 35656 -8944
19524 -63779 120526 -12487 -2614 -364258 -288289 5792 -140536 130491 -190016 -88740 -27848
19512 96271 74706 42480 -251603 -295157 179647 -275327 87240 -213782 -100652 30615 241630
19501 241630 164808 91564 -224595 -9191 -7129 -203045 41402 -257063 -377103 -183175 -253292
19490 -253292 -100362 52495 -244117 -249406 -202549 -306386 153346 -23563 -134469 -88861 65903
19478 22548 -220701 -18283 -71212 45529 -189520 -71000 -370080 -53734 201707 -59877 -61958
19467 -61958 110211 135143 181564 -73187 68160 -120565 -179842 80433 135500 98598 -12448
19455 14252 -11079 216688 -54923 -74585 -57712 195340 212603 -233992 161508 -71095 -19111
19443 20112 -182208 -217397 138733 -147631 -10067 -203093 -216437 -174178 -112019 -21125 125584
19431 238061 -249228 -198841 -389824 93956 82926 -21992 -19551 290494 -309117 206707 -52344
19419 -160996 634974 -230832 -88397 -182020 3584 -321383 -89172 -80540 -67398 -226040 -243241
19408 -243241 811 -355587 -245926 32785 -251319 222984 -147249 -262484 -46027 94680 -354348
19396 -157421 -367018 -150760 -184886 -85068 -244479 -120938 69143 76009 -284261 -201801 -50997
19384 -196179 211460 -182884 34315 31678 -6591 -120932 -345640 112866 -67268 -187709 -147404
19373 -147404 -26210 15597 -1790 74627 -150544 -359425 -234435 11185 -233646 -326352 -133804
19361 146522 -211830 -81391 65388 -242777 -360919 18698 -209690 -209886 33392 -103670 -8964
19349 -223405 -47408 -232898 93256 4331 58150 -273092 -132196 261178 332261 -40688 84532
19337 188286 -75975 -268456 -193401 -165893 -167116 202763 29412 -116152 -563184 -134011 -146270
19326 -146270 -227991 233830 -202457 158180 194530 -435921 60609 -129969 -565141 -296341
19316 -296341 128280 -48546 220457 115946 103540 -174115 158101 -39110 123281 -22751
19305 -213732 -128379 -31549 213569 -5597 20916 -44622 208825 117178 -74118 180134 64592
19293 -82446 -324317 -139201 151895 -181551 -249459 -118933 -98580 -168149 6427 -161321 -176839
19282 -176839 -50047 -44440 -47305 -198014 -39519 148212 -202507 441188 71050 -186635 -305359
19271 -305359 -95723 197976 -268185 -156300 -170454 97876 -179429 80233 63475 -234722
19260 180389 62427 193801 -57785 -172808 -140808 -79419 -455491 -256588 360117 146157
19249 309414 -159802 -53747 65415 -85873 -176533 -52994 267592 126597 -108686 -132834 58722
19237 78974 -297168 -140383 -133970 57953 10941 -124358 -3175 -112971 -198417 -372572 37688
19225 141567 -86665 -49360 -148841 -308644 642 91236 149072 -229156 -291264 -445997 -36617
19213 -123877 113747 -132289 144680 -89514 149901 -84303 125772 -338393 -328256 70404
19202 -309815 -164714 109885 309172 117238 -3191 -40690 -36641 -110176 -257306 -438802 -192814
19190 -70917 402427 35604 -293540 -377531 207588 85181 -126603 -130967 112492 -148073 -262410
19179 -262410 -137344 -124672 -320634 21334 -29375 -206829 -301010 -265284 -80198 -130601 -112600
19168 -112600 -547378 -174763 -83564 56210 -144049 -236577 -118821 -106639 52908 69196 -128473
19156 -283810 -260411 65720 -39583 74791 52691 -121602 -208142 165148 171510 -69361 -208144
19145 -208144 -171058 -340921 193534 -163386 -80235 -247858 35330 221873 193692 8209 -17037
19133 -115520 -298058 -81718 -320175 -77109 -232706 -212128 -213191 -121583 -66475 -288894 -36701
19121 -29797 -512081 -251079 -153191 44814 210808 -327158 -541 128027 37664 -133971 73123
19109 -233609 12631 169841 -54124 -76165 -4779 96830 -121538 -210974 42647 252818 -119653
19097 132206 110629 -36865 -139675 -237365 213198 -188467 -512240 -303793 -74173 -188063
19087 -188063 4725 58713 -98298 -168232 -195861 995 -215510 -113744 218173 -117677 132042
19075 285257 96821 -181768 -66395 115944 -162886 50939 -248355 -58379 -244017 -30013
19064 11885 -330540 -86945 80323 -119791 -137622 -42544 -128675 -270757 -248677 -168807 174659
19052 120546 199743 -157433 -48021 172552 -152942 201280 6671 83683 -202970 -318017
19042 -318017 119420 -151397 -86110 -116906 -230971 316557 25229 107256 137783 264398
19032 264398 -103778 -147904 -49245 293815 365659 -140380 -50399 77449 62112 198300 290616
19021 290616 33589 18938 -170680 185623 -279364 -117472 170891 -125213 -62475 -300964
19011 -300964 -65261 139245 10223 330620 169822 281383 -353521 -405194 242234 -334440
19000 225645 -68506 3508 -84101 -134209 17530 39715 -65309 84250 99438 -144123 248887
18988 27593 -325573 200785 -229473 -189060 86452 -195919 -446284 -182215 -355398 -223058
18978 -223058 -92520 -98585 -168930 10943 205277 -245718 6070 44045 -266528 -159147 297032
18966 -70988 149698 -336763 65929 -57675 790 -270331 -291214 -100851 85034 63339 17987
18954 -88441 112957 -91801 93667 -355668 -74502 -83005 -287955 83166 -225274 -11044 340739
18942 8774 58939 -154422 9767 58440 -101164 -47311 -127657 116087 233618 -69388 -99615
18931 -99615 -77863 315168 136359 -296982 30161 -120201 112907 -217659 -199606 30001
18920 -71110 327252 -111252 199350 -14603 -106260 205883 202811 -181065 -258527 -303134 76353
18908 -248658 198445 153459 -72779 -237340 72734 -10182 -190334 120985 16765 219086
18898 219086 -301619 -102089 -265091 -45198 -74124 -188272 -47608 -59009 -197034 -13782
18887 -53722 150524 -13931 -80245 110608 88043 -82252 -11650 -46106 -10088 -68992 57636
18875 111258 -438433 123627 43148 -151254 6646 -217395 201170 -89460 -35399 -357336
18865 -357336 -49401 196623 -149860 -101860 -57740 125820 -133675 24821 -239187 -2245 124772
18853 97096 398148 150704 79410 -284131 69677 36861 -216341 160500 396492 -225722
18842 163545 -149955 -110500 2106 -190088 -248810 -332319 226067 -176509 -103780 -379712 42977
18830 -59786 -30988 -45919 92946 -41460 -177259 163464 -29003 -88053 19264 187013 2633
18818 -221578 -131458 -241591 80856 76473 166897 -420574 -180199 228894 377256 467345 164550
18806 -105859 -95419 20085 314987 163438 -117891 30667 -51806 -338281 -110173 -155472
18796 -155472 125256 -12370 -104512 -295963 16891 -104657 42044 -224323 -90185 -218725
18786 -218725 100829 -485713 -240301 -52382 -220999 -248023 -79593 -96117 209629 -238026
18775 -159934 151104 50540 -19274 -338648 5430 201580 -130138 166993 15790 27955 -178769
18763 76170 -87110 186706 19004 317503 -52761 -168981 -164436 196064 -195755 -142417 59102
18751 178731 -63880 -196322 -62911 87830 -150696 -19288 123473 41487 -91365 23889 -70652
18739 375802 -113643 -171172 -230586 -46964 1557 42660 -285860 -464595 -71574 26608 380112
18728 380112 133500 187262 -274857 89155 -102403 166903 84368 -36670 -213576 -298866
18718 -298866 -171362 -253358 -94972 -167054 289688 -174368 -431496 79622 299152 -245795
18707 27086 41712 92939 -76417 -331647 55496 173148 -46373 -507444 20316 98140 -195445
18695 -221561 -143172 -23479 107525 -75162 -352281 -98628 -105675 13658 -53046 -157912 -151529
18684 -151529 28916 -167347 44293 -353872 -238442 -150456 -2123 125076 102015 261575 -259782
18672 -120891 -86910 -106998 -490429 292672 -43216 -140244 292492 -90203 -78682 798 155829
18661 155829 -88731 -56237 -288864 152825 3660 50384 -363516 2591 -89105 67027 -51196
18649 -317765 157829 -10158 40022 8691 89236 -171930 63704 -185702 -10013 -82459 -47672
18638 -47672 223506 -31686 65968 -189198 -26507 -12291 51165 -41338 57453 -78004 -145337
18627 -145337 -151258 -106591 180601 219193 -92185 -102215 153622 -430226 -116500 -7205 75190
18615 28233 190134 29863 23468 -48243 -92548 -46287 108032 -148183 -307787 48255 -279096
18603 -211959 83552 285754 17444 -139753 4897 -226370 -230541 -34717 -218653 81439 -170734
18591 26865 -476032 57769 308477 -159192 159608 -244886 -60264 -106263 15557 108299 210979
18580 210979 149307 -265120 -274225 -129263 -46203 106 111943 108608 125075 112805 -176303
18568 -126962 4595 24451 -39053 -70596 -385641 -74613 -106713 -44646 11041 -380365 -91552
18556 -194461 -419189 -65452 -175732 -68639 126276 3964 -253637 -40474 -167194 -62930 -65740
18545 -65740 -100010 -282625 -23742 103370 171484 108877 -218514 -157158 -319958 63157 396373
18534 396373 -217663 -16505 -187470 101533 -42340 -297105 128318 -82218 17038 -35220
18523 -223470 -217844 -58005 -301340 -312629 133812 -235289 53982 -108851 -42547 -113051 -134083
18512 -134083 -42160 -151261 75169 -36150 292776 -211194 -185956 288523 -82128 -166220 162940
18500 264436 -1278 -10782 -64688 51988 -160109 -11855 170522 -116003 8754 -10968 -236971
18489 -236971 140424 -55770 139673 -396628 -33911 -83686 -277717 89217 -260398 76444
18478 -209571 83896 -88563 46138 -73977 -221122 -146874 318856 187279 163488 53829 -206853
18466 37134 57701 74391 -221568 1225 -421591 25149 -180634 37500 -96727 -47993 105370
18454 -178294 488428 -50220 -101108 125846 -117100 111074 -76662 -216111 102787 -236862
18443 -34692 -34015 -31997 95259 -18598 -154469 102537 120808 -350984 -143765 -51865 49645
18431 -189965 -211156 35307 -162324 -172808 87071 -183456 -78882 -150137 -16274 -183563 -101242
18420 -101242 -211689 173497 17151 263227 -145353 -16861 -190320 35219 -16322 461951
18409 -235771 -39257 -88220 193020 8221 -182710 -78186 171738 160212 239775 -47635 -43686
18398 -43686 -100837 -111632 -238757 -140512 -183691 -58694 -201302 -150697 185832 75086 -132771
18386 141096 -344080 359 152726 -74010 70724 -12261 5246 337547 -64032 205261 -168616
18374 -76928 153696 -46476 -181714 23469 -88636 181634 -13365 37887 118139 18900 -172549
18362 -380142 -131555 169146 -7304 -394335 90217 447115 178775 12408 -67930 -144913 299559
18350 -440141 57523 -388625 24916 13583 -111366 291697 -108194 65566 222834 1963 21155
18339 21155 4837 -349835 64734 -137361 -89428 -46936 -103632 24864 -191125 -190315 -50582 68
18326 119361 141042 -340650 -100897 -15265 -30103 -129139 51857 56658 50139 28049 -15038
18314 -66411 -211290 228041 -15597 -76049 125425 -12654 -26940 -250295 -161254 51460 34716
18303 34716 189356 -71915 -307443 28690 -72896 -28026 -40998 -141722 341196 -241527 285086
18291 -65676 -4963 -21008 -17727 81627 78387 307039 63557 124114 145205 -8067 319474 -14843
18278 191850 20441 98530 74267 -152979 -203524 14222 -167046 -131386 186873 6476 -282674
18266 37015 -276289 -159758 -270588 -77075 96420 -137918 -9508 177538 -18604 -2642 -24208
18255 -24208 -113470 328393 -41237 -15552 20600 -205168 -102983 56739 -179929 -284865 -285140
18244 -285140 66638 104111 -45531 -145993 91252 60299 67443 -180367 73698 -110461 285164
18232 46395 56365 -64423 295654 -86715 -201739 233959 -83502 3236 34428 23097 187777
18221 187777 -257023 -146371 -190580 -18449 -5918 -13372 -56066 100739 -145825 -54461 -99629
18210 -99629 156170 63491 -215331 -53923 -153170 115340 151543 -329698 -190611 -46073 -97454
18199 -97454 -64270 177710 117570 342024 -187206 -501712 81664 269721 -52130 -123860 33098
18187 102508 -148209 -252380 209502 197928 178928 -301633 -135778 344899 -26581 -309243
18177 -309243 4056 -32928 315617 -312004 -62368 267455 -68465 75852 389629 -227318 113137
18165 -162676 -231985 220618 21905 -74384 8592 -108534 -173554 20220 125215 65080 -158045
18153 -20939 -173793 -28571 -103466 -43006 -304171 -347205 -319940 -65586 15647 -12045 -137751
18142 -137751 -47552 -402732 -4902 235012 149675 324751 -33631 -353158 -263028 -199145 -9319
18130 -315756 -61646 -132356 -33266 -64285 -154924 110707 -6824 -526 17493 10532 170478 -371201
18117 -8893 -79932 -186101 -255048 -53094 -198263 -164106 -41170 -253878 207403 17253 54590
18106 54590 -78896 -398263 278137 68464 -130247 223740 84656 230147 -46058 438591
18095 211875 -163403 -224661 422942 -264294 180364 -26560 53109 -198413 7971 -41224 -25047
18084 -25047 -79219 -218005 213183 -43905 -105445 36751 136469 -76118 -159449 -204952 -138834
18073 -138834 191857 -276828 374909 148583 82034 -31797 -39024 -230829 -151163 50795 -83268
18061 93041 -179407 -108977 -17639 -303762 -211152 59614 155086 260986 199897 -342272 -106140
18049 -53025 214523 -24251 187899 2678 -89501 49882 -131096 -62654 -34547 -48036 -55590
18038 -55590 62301 272646 -181977 -313162 91031 -33997 -31929 90902 -84725 238782 -126941
18026 -199740 -38515 -141125 -45425 -128816 -56591 -155008 -28325 105665 -57825 -166282 -201072
18015 -201072 -31078 -242407 -180390 -156309 -50614 27082 24700 72469 -69065 -222114 21581
18003 -69200 -27957 275489 -252565 204157 227438 127459 1050 -133561 7369 156638 -108472
17991 142024 -53689 37742 132398 -1949 55767 -127732 -21154 194332 87693 -291474 -69478
17979 -142163 -281721 193424 -25055 270679 166910 30557 -160431 -223264 203562 91822
17968 42516 -140993 -221589 -219909 34971 22863 95687 110989 196327 -6057 355008 -7328 -13576
17956 -13576 101310 254908 199811 -143571 24143 -126106 -10003 -74319 71481 -248689 -294749
17945 -294749 -73860 -240443 -67833 -104178 -89949 -117324 152896 42970 160315 10769 9123
17934 9123 298377 -35639 -96556 95112 80289 -183752 -111918 -59865 16354 -146164 -389604
17923 -389604 -111053 -64010 -167863 275192 -42679 -56664 109609 -166059 -34752 -58961
17913 -58961 -20665 -35309 -37586 -51197 -94223 37079 -203951 217618 -202788 -179374 -152867
17902 -152867 217169 -29122 -923 -117390 470064 129434 70304 77816 -33608 263231 -184439
17890 322871 150828 219061 157877 -113992 110193 234508 -24040 -242156 90906 -248296
17879 42756 21494 -156212 -78374 49488 166492 186753 -91074 -240302 -70941 -255680 -41563
17867 -31511 -128999 86731 -1775 -169577 -311028 87971 -111764 -173671 -44472 -206573 47767
17855 292461 162298 146057 -106509 -43593 227221 -113842 188638 151318 -266235 295574
17844 161872 264600 -347188 41750 13706 -358618 17534 31258 166369 182335 -6118 293390
17832 -56475 -195010 87059 -112416 235652 229183 -369921 -215019 160171 129854 -148377
17821 -163473 -157740 127285 -60816 -163461 -391535 -80204 319973 -79876 -302586 -79817 82907
17809 -257853 66796 -24770 127110 27013 -119586 131873 162304 43699 155124 -112608
17798 -157665 199275 -38568 -267246 -4651 -106545 -14724 -99686 -232708 -128490 -49949 -375073
17787 -375073 -138114 -88324 -177501 72265 -48150 167826 -99385 -23416 -15253 -157398 47704
17775 288174 12136 99671 -264356 194060 99264 -28322 150051 -264765 -132184 -127914 68877
17763 -46113 -144268 -187781 61786 -197636 170612 46939 63312 -29549 -168362 -72614 -97016
17752 -97016 49205 -260909 40579 45502 270684 -190882 -28864 245786 -220201 10576 -13040
17740 -300916 -102369 140262 191823 -72993 124298 200108 15108 17521 59148 -1270 -140813
17729 -140813 177510 -93962 44878 42661 -108039 -6681 64209 183219 -95497 71491 -125386
17717 188727 -250084 -62961 -245873 -53122 356712 239980 -65206 -149664 314235 -27412
17706 -156050 157202 100380 89284 -136354 170816 -299210 127144 -114242 39028 -145106
17695 94835 -38892 40253 -142236 99604 82836 -236505 -187088 24464 -37222 19832 -136095
17683 -57111 -129516 130303 37872 150487 -53846 249581 -299252 -23506 300149 157498
17673 157498 383050 14715 -274104 -100727 -152525 98664 2310 111941 388410 28385 -49146
17661 -80396 102965 163084 -62622 -98018 -126298 -10482 60948 159248 18262 11543 75377 -304363
17648 3999 -104476 63237 24343 51137 162000 -108654 109334 137624 -97105 147697 76821
17637 76821 -337213 -239892 68824 -192763 -126528 -94184 -33991 18925 360905 -124529 156746
17625 -93679 -187170 8931 270660 -190673 340098 579632 202329 230466 9031 173575 -278829
17613 103284 146712 -18048 -43711 -93769 48650 105921 -115635 -132545 -54689 18988 -241378
17601 267908 110831 -340674 219965 -7203 158313 -148503 227358 -116053 24277 55139
17591 55139 -63393 -49768 163847 -200776 165128 -17546 -32067 -49057 274753 -147261 -198338
17580 -198338 167963 -34292 -131349 228694 -316629 -4837 217761 267435 -70577 296643 83885
17568 327237 151766 95935 -20622 -59477 -133712 -76372 94204 -19958 -67586 44769 86263
17557 86263 373942 330504 175704 42173 -33479 255019 19015 -55227 141152 414748 211446
17546 211446 -101186 359980 510438 -132686 -144208 -118830 20226 52692 171580 18072
17535 111285 242067 250255 -141738 -297046 -133318 -215149 -6863 242349 110252 -156816
17524 144035 40165 62719 -27460 -13967 639650 428810 179939 -30354 -118349 50563 86331
17513 86331 91421 74355 -78459 148139 -39984 -172512 -16570 28260 -25211 -42040 240718
17501 185748 158305 124427 -271340 -122872 189991 637856 76066 -129544 115097 313017
17491 313017 454119 356517 -76820 265412 281744 84451 242555 413507 136373 226877
17481 226877 -3600 449241 224633 -58389 4711 239615 255537 292633 -63905 117967 14559
17469 223829 194885 334421 -359692 245009 316001 144461 -10213 107531 182557 237774
17459 237774 314305 90460 37440 170853 311530 306481 -213620 320229 -315096 122115
17448 -159954 131382 436165 268057 214128 249480 184021 164869 416800 -117703 195188
17437 328209 71822 326473 197463 373852 433501 265015 352893 -68926 -118911 -297857
17427 -297857 498502 268476 152723 511523 232837 180571 -14618 123922 416591 458912
17417 458912 55205 260175 126120 261295 151884 251724 350768 34984 590936 -56686
17406 106068 223991 -92319 191312 160041 -26200 32950 270177 -233770 138726 -9246 -69517
17395 -69517 203659 90577 144536 180211 521559 209657 216275 501980 193490 -57037 95641
17383 -136160 67573 74930 10683 263876 121493 409541 266996 -116493 237977 251070
17373 251070 101818 -119986 -10315 331098 -37612 -10666 243541 79015 180530 115392
17363 115392 201361 50101 278988 9440 143653 -38086 80419 242980 -241283 -128294 96386
17351 -122765 110439 222942 252814 257743 230570 328466 266583 158093 328761 116717 110579
17340 110579 400758 162536 16307 60844 351999 -122014 -303261 -268825 243977 30578
17329 174004 303467 182753 -161125 -65609 330980 -180194 1633 485672 -53933 90664
17318 -49214 210743 -9127 248758 -6975 34030 62079 -115054 167873 322039 384172 -54182
17306 -415558 69673 76554 111807 250473 242946 3239 323091 429270 -9751 106806 66841
17295 66841 238373 158820 237335 -93313 216529 303972 44803 343523 483603 154999 -78514
17283 191492 229230 408458 106476 42280 324417 13797 17772 221423 159902 1643 192601
17272 192601 155969 -157553 114289 164723 -7198 120477 -212393 294473 -58436 752 106652
17261 106652 -22711 158301 290214 97626 252967 256006 182296 436588 14560 89131 429428
17250 429428 85844 38456 390790 73157 134097 276996 -42957 264548 322380 199371 238048
17239 238048 225375 633307 59382 -10098 124587 324841 293459 383586 430953 330070 123823
17227 272749 362381 251086 293818 120416 317693 376885 97146 150387 380408 344603 166609
17215 337593 353471 174536 235881 483516 262442 238822 231192 207688 466681 193711 103412
17204 103412 -4840 169958 237796 165487 144581 79107 211731 331544 257194 69510 344302
17193 344302 212913 148381 56022 291307 -92417 353671 233242 209097 211683 527528 352764
17182 352764 14140 450680 448458 91301 445474 375124 257413 70246 132390 283759 517585
17171 517585 253376 372766 744338 32536 -17760 337826 360241 40471 467647 163123
17160 297184 616850 226503 69891 112553 303772 331761 268728 61245 270604 563651
17150 563651 87841 426615 410222 378890 242567 342391 212094 256569 706577 256183
17139 320428 255879 219191 169693 314490 358285 176806 331590 546930 94152 344135
17129 344135 450275 177724 90179 275109 344433 386413 83376 220836 -52867 142308
17118 294586 168500 55543 318355 635714 487565 391900 68268 251165 614402 588352
17108 588352 186099 485961 323594 515624 128809 29113 425481 301932 581424 469413
17098 469413 237982 388128 224706 329421 468803 323909 778927 212550 231420 531729
17088 531729 462509 96053 574176 451794 559732 518965 388810 209794 558200 244901
17077 680648 599200 315970 68967 336669 719170 72312 481206 378537 370510 242334
17067 242334 109552 397823 496043 803127 277299 260185 451653 510564 354409 637092
17057 637092 235720 542673 216701 663125 471269 546139 556084 621483 600257 704887
17047 704887 504765 677533 511839 861424 430569 233686 509717 478284 618213 768922
17037 768922 572459 555030 679328 461082 579019 553190 587408 564617 685957 660124
17027 660124 445304 438644 457351 514736 754541 357689 323185 602178 397023 551405
17017 551405 673266 661167 982619 900769 413172 874018 586266 797410 506216 659535
17007 659535 622535 364410 697047 535065 720872 816543 551223 585100 837662 707185
16997 707185 1212372 460862 960223 262361 1121095 674456 701158 735765 688150 763850
16987 763850 821633 644132 680521 701389 732154 850661 865641 1060657 744275 913191
16977 913191 970667 1136216 968042 890553 1114548 976616 631963 1040472 797510 741226
16967 741226 1025434 1246533 883473 990439 1028042 870446 1236634 1194862 586770 1114543
16957 1114543 1038695 821463 757295 1183406 953968 801950 1105327 895092 1287714 1296504
16947 1296504 1078859 1296259 1052375 1039697 1005753 1050732 912192 1419565 1272106 1382100
16937 1382100 902618 992882 791222 1014230 1429507 933293 1338454 1223046 1221870 1241615
16927 1241615 1219573 1301960 1351531 1488455 1360941 1312215 1418164 1402260 1388628 1020096
16917 1020096 1314068 1418339 1302598 1383175 1526544 1640920 1434867 1363663 1745027 1633080
16907 1633080 1604820 1790327 1611790 1475705 1555776 1786391 1394316 1718618 1702760 1514388
16897 1514388 1718344 1733939 1641981 1816007 1920594 1779819 1756170 1756162 1926579 1754963 1999280
16886 1999280 1967373 2092838 1900297 2312144 2164786 1961832 2005450 2343121 2307882 2334954
16876 2334954 2032317 2129339 2009804 2404774 2405914 2110070 2439189 2371642 2759544 2496261
16866 2496261 2572247 2549975 2773460 2805043 2454858 2787913 3071553 2703394 2707375 2738407
16856 2738407 2987245 3250025 3492014 2979405 3076091 3081859 3587903 3445474 3156294 3404750
16846 3404750 3219029 3585520 3585187 3633575 3387047 3817409 3526388 3817587 3692564 3981048
16836 3981048 3918823 4229074 4165645 4457286 4229697 4646527 4641441 4728642 4329407 4583785
16826 4583785 4647526 5031321 4858373 4972808 4727168 5117588 5004374 5346798 5832990 5501537
16816 5501537 5598960 5791897 6013394 5844435 5943646 6406928 6249300 6547032 6470807 6873118
16806 6873118 6914014 7056950 7180490 7263508 7391421 7811777 7925336 7826954 8060441 8607883
16796 8607883 8581431 8688396 9002313 9420502 9481702 9520554 10071680 10186733 10323946 10947186
16786 10947186 11177435 11555389 12042571 12025798 12633810 12778958 13025146 13268062 13783305
16777 13783305 14348761 14459806 15188656 15491124 15918704 16502439 17365119 17773268 18712979
16768 18712979 18844323 19286245 20442871 21308966 21707908 22858257 23432241 24680639 25685094
16759 25685094 26316331 27723788 28724038 29971712 31181102 32563082 34198828 35596987
16751 35596987 37333972 39065756 41123085 43220046 45161780 47720297 50205552 52745648
16743 52745648 55862010 58695011 62278139 65691580 69415503 73640183 78032558 83163220
16735 83163220 88032798 93495255 99253163 105019924 111924752 118889753 125921958 133627528
16727 133627528 141469979 149288806 157863607 165674433 173335140 181021504 188032434 193701277
16719 193701277 198980327 202461266 205172421 206350930 205891096 203263318 200424051 195505260
16711 195505260 190090427 183411119 176210761 168570830 160220024 152078441 143930369 135974286
16703 135974286 128147515 120299219 113333043 106295788 99978546 93841922 88224336 83122080
16695 83122080 78104414 73195685 68854522 65183174 61475505 57994662 54824177 51748472
16687 51748472 49108667 46736193 44068801 42047053 39872695 38064688 36405840 34337334
16679 34337334 32865950 31219019 29967839 28448201 27518106 26251400 25027488 23978494
16671 23978494 23159550 22012114 21338713 20624661 19531375 19113146 18574683 17540598 17000337
16662 17000337 15963225 16061945 15222434 14997159 14176381 14110849 13540008 13152136 12481220
16653 12481220 12464697 11955649 11482458 11285172 10876134 10191727 10231910 9972207 9772827 9536520
16643 9536520 9095514 9067018 8841329 8470935 8007997 8148526 7636992 7774472 7363955 7334465
16633 7334465 7032309 6837747 6351641 6573488 6394218 6154255 5977533 6093729 5705308
16624 5705308 5808019 5627463 5396455 5187969 5474372 4883690 5026137 4867399 4333940
16615 4333940 5189487 4530594 4358154 4792606 4238905 4190645 4056020 3926866 3778397 3937342
16605 3937342 3734101 3586030 3601790 3645031 3717832 3239518 3230408 3520397 3006750 2987436
16595 2987436 3354875 3076305 2985365 3017442 3045512 2699538 3164700 2826014 2532416 2650522
16585 2650522 2743277 2870630 2685151 2542709 2377395 2291105 2528045 2582889 2550134 2073307
16575 2073307 2300755 2321675 2548323 2353599 2415078 1907889 2004592 2062871 2080307 1884517
16565 1884517 1929028 2079201 2026796 1972251 1932627 2013014 1951272 1633494 1804830 1528530
16555 1528530 1556184 1526989 1653338 1615901 1682219 1369359 1716378 1385865 1456634 1600006
16545 1600006 1223920 1170555 1453565 1414617 1270734 1494364 1212163 1651588 1183846 1604601
16535 1604601 1428635 1302186 1407744 1268617 881890 1293137 901355 1034232 901455
16526 901455 1161975 1419184 1168720 1082556 1380871 1210718 1039116 982033 1052119 1275792
16516 1275792 1133035 717620 1004942 1421565 732032 1306178 694148 825737 994948
16507 994948 728502 1272262 1101297 963191 644326 1084218 880658 1035343 861942 900511
16497 900511 1002107 977127 980262 853560 807035 834776 839064 816242 995471 654378 826717
16486 826717 535571 697749 742512 1006677 549918 1097684 642802 609341 673758 475980
16476 475980 781863 918996 755477 578382 877402 634478 366608 678953 1018230 849310
16466 849310 806670 280990 852937 462355 575518 537785 641125 561354 347640 649161
16456 649161 558999 626314 686609 677417 545524 539057 595841 444087 270574 552944 397710
16445 397710 400052 560361 505610 495107 488321 342118 343208 337518 576393 475182 449704
16434 449704 642643 466921 582660 606594 491328 502626 570604 454986 270250 579725
16424 579725 449482 416997 607296 776262 177236 484855 308739 350342 57425 370201
16414 370201 109095 612831 143758 513323 488243 115719 556514 272893 585624 230383
16403 434368 321177 284348 111191 -1625 227080 364368 -148247 177935 481106 407452
16393 407452 594981 571950 468977 448954 324860 114047 357141 106440 316559 549901
16383 549901 138399 40314 349770 390915 -147638 190548 360687 578858 342846 358197
16373 358197 -14748 440809 237769 64312 109318 288571 429655 238872 506792 132222
16362 290493 477409 383606 356608 228224 146210 122047 63127 192917 15863 198841 232218
16351 232218 392538 456483 46276 128360 148659 247548 182809 206777 717682 322475 338684
16340 338684 196529 186844 92544 -257618 362129 242058 121077 -25570 265932 204215
16330 204215 -21940 60855 224195 268320 -260604 434609 66177 408879 -95190 45947 240353
16319 240353 205070 312574 360440 3929 195203 160802 379271 170847 293644 323579 162411
16308 162411 -67343 230484 104555 51599 44172 -91223 -133794 -44628 69837 483937 463064
16297 463064 192037 371930 209386 115130 183790 304302 -21306 268580 145076 34983
16286 -47067 101307 -42427 43939 -94834 -60660 367249 -12142 -86104 -107202 154706 159148
16275 159148 66328 158797 520089 -656 -205369 -414850 64149 500683 201403 319231 382708
16264 382708 13169 -163962 -84839 -144992 69804 -25467 146494 208743 -60908 32846 -119027
16252 -287767 162882 213236 40494 196732 106021 9603 255221 143742 -160504 -336 321294
16240 176085 -5965 62025 -121593 182630 36158 337282 -38952 17030 170047 4597 -184518
16228 115762 106052 146826 187279 -101119 190271 -231750 348006 -217975 233739 -34454
16217 42572 91525 195886 -168764 25639 -325553 -109724 -137133 146644 121934 -61565 58880
16205 108827 317384 -79731 -173193 -86988 -22006 -19003 75702 215424 -79275 84245 18522
16193 122096 -107982 -64107 487839 70386 8559 -71494 -187749 -160858 164799 241128 87705
16181 -38049 173232 -66784 182591 -341953 314882 -152327 113166 49124 -150967 76073
16170 -81342 87283 -53691 -160361 204693 -47315 -191947 128748 395039 -14491 -127599
16160 -127599 -90506 -39192 -82653 309571 11800 254661 -68894 -96687 19250 81179 -178241
16148 -54300 -844 239577 91782 -3180 26360 -85269 86729 149729 222996 -61876 71379 125247
16136 125247 -33669 33465 79441 4413 -119467 -221465 -3867 262338 -272703 102700 -318975
16124 -49166 -133126 -65271 160910 -336366 -126617 -78604 105939 -11168 -159910 27938 -230452
16112 57760 -198388 15757 -285266 -170478 -69236 -211420 70872 185898 -1333 -240161 -9112
16100 152795 78844 22999 226072 190846 -126214 10363 241488 -25028 302301 -190072
16089 154219 -6002 112527 -18456 79899 226357 -30676 311829 -100975 -213789 -188886 -59055
16077 214577 -147318 -95875 -2225 -68028 -67163 228019 -48361 -112212 115484 102125 12895
16065 -119952 14950 168525 -306748 27861 -194688 223110 165098 -197606 67745 73583 -428047
16053 8731 -181503 -42474 -264487 -328901 -114933 75055 -38527 81275 -233710 -345736 -10695
16041 46003 -260996 242773 -193068 55683 221732 -104721 -132329 19134 -85337 193241
16030 -228525 258113 129235 -330474 -1306 45142 59197 52308 91124 -41993 217809 -68131
16018 -96321 -13035 -175765 20444 -223496 143896 -137053 -405637 -144323 212378 -100487
16007 269090 -98199 90907 455467 -78950 130626 -4068 -205472 86246 -68186 337107 -75526
15995 89640 57631 -177995 -176842 25424 95261 86732 66288 2309 134823 -66321 349077 365368
15983 365368 639663 -114934 252899 528893 131383 -134383 -104250 61784 138104 -263330
15972 -46910 -48819 56952 17244 -62975 -166391 -102599 40039 317395 235262 88660 -400239
15960 99860 -254053 127365 223169 -94097 -93186 -125673 67861 -279016 -65381 330061 -155193
15948 -192133 -225438 45884 71459 -230136 -214637 -207463 52337 91696 230013 -243357 -98357
15936 131932 264461 -142206 -323595 -18837 -557299 186286 -332733 103965 40072 76147
15926 76147 278238 168602 -38591 -282244 -53009 -372861 49451 -318427 25942 -211616
15915 -28557 77553 -316590 259018 -14036 39609 73910 132225 -89246 -264396 -177108 -41848
15903 22562 -12130 83517 -502792 -10184 179075 59203 17824 -107323 183183 127012 -142101
15891 -214685 58352 289390 -19044 -139273 -269457 -91700 -66374 -50297 353615 -238134
15880 36868 -17351 293518 -64962 -172932 36004 -230649 -71091 -187782 -129488 -158164 -211091
15869 -211091 -281677 201477 -313966 -459741 -102685 109058 -36848 -138589 -255313 73966
15858 186096 27540 -107377 121955 20065 -229956 117888 44729 30109 -144021 21928
15847 150042 -156005 -414708 -195705 -171174 4778 -174344 244635 -61783 -42211 -215706
15837 -215706 85213 146962 174118 493052 102589 157007 10125 -67200 -159802 -13296 -329218
15826 -329218 -125448 10381 147124 -353 -59079 59310 44521 -139449 -395105 26056 196600
15815 196600 -310761 -56290 -262429 -20069 -107326 162556 -48328 -145520 -64095 410557 188828
15803 172352 -159825 217766 114707 88602 -170289 -111458 104854 -52011 140269 -5269
15792 -24818 -115034 -170629 -121246 -103557 -155570 115753 42558 -35342 -380351 123682 66075
15781 66075 133559 -217185 -9841 121621 -14722 -28833 -40231 -72615 76602 233832 -80007
15769 -107460 -198145 274214 -52735 -106326 -155719 296133 -127277 230807 270500 -87036 111120
15757 116927 161781 4596 -60849 118769 -143001 -57511 -148599 185488 9821 110009 106120
15746 106120 207011 41067 219470 -20849 -174693 -99473 -15345 48122 23527 -193690 85854
15734 -25111 -392 -52730 -31455 -220727 136542 -225341 -197938 -55390 129249 327637 62228
15722 -49342 206691 -47175 8653 -396175 51829 -52811 6722 209170 90474 -187850 193367
15710 113353 -343631 -114791 -25468 81452 -222601 160346 -218583 -196291 16798 29976
15700 29976 -158100 -181490 231447 25703 93988 162038 80495 -42210 141448 7913 70345
15689 70345 -211517 105462 -82311 -28602 -246819 7793 41174 417419 70233 174940 -345153
15677 32997 -138097 -158482 -51710 80583 87350 -70426 -86409 -94206 41083 93436 -157654 -18617
15664 27804 -66129 -55603 24958 -67741 27062 12112 -102436 -147930 -87178 33358 42245 -107034
15651 -114618 -154747 -110776 -313048 249183 -303371 -26817 -106681 -36400 -50234 -96686 135457
15639 205848 -234168 -104035 265263 -84902 -204885 53928 -312698 -179525 -103139 216674
15628 171269 -83521 180953 220618 344 -171254 -202043 -231023 -70527 -211572 -63255 171896
15616 -18169 -261699 48941 102648 5468 -45672 370614 119833 139152 -37418 -211174 -156477
15605 -156477 -30560 53537 150686 -256491 -55769 -1383 88899 34974 -2919 144285 186424
15594 186424 -78905 258344 143248 35789 -146127 -177361 8580 121583 50160 -81489 -146033
15583 -146033 406302 -14889 -119771 277647 201517 -222056 290579 -262273 -293833 30261
15572 166460 182272 152003 114600 250851 -232871 -376361 -122595 269998 45352 106373
15562 106373 68327 92290 -65784 197206 -58980 117685 -306989 -133976 -207964 -111492 -46246
15550 6507 -431002 -35866 -7765 -177923 133785 136230 140880 -125861 -295262 -173138 -440737
15539 -440737 106397 198601 238387 -72709 47508 -112313 195996 -105433 141043 197964
15529 197964 -163796 179067 -221257 -80229 -335625 -317394 -83483 -194746 217273 131683
15519 131683 -90865 15749 -185496 266838 -9794 -352577 -173778 -25203 259862 -10176 -83258
15508 -83258 108488 67676 257115 -145172 -171089 42640 275978 -1789 94728 -185793 -67022
15496 -2127 -79479 -164545 -21932 174845 554635 -122948 11091 -219764 104830 107851 5433
15484 44472 -129137 243736 36253 -64145 -6264 164165 150289 119443 -208866 -49072 133348
15472 62331 53028 -12924 -64404 82716 165042 -3744 -47107 22662 -120198 67721 67942 -309376
15459 115943 -109408 -29920 251858 -7572 -147794 -23859 64670 119699 -202882 56405 -200837
15447 15003 -86309 -79416 66012 -225236 6931 -329294 -43321 -195433 92900 40500 -70716
15435 -78085 21400 -119502 100333 -171411 14258 38599 392477 -219083 -220738 18457 -92925
15423 -28572 -180921 5989 112845 -55671 202417 -156875 52183 42849 157301 -201731 -207478
15412 -207478 33641 38289 -237470 360507 115754 16939 -177773 -318616 105215 124233
15402 124233 -213900 2210 -25948 89888 -75247 288606 -257063 99836 79431 -361410 -261635
15391 -261635 -11362 -167541 -326731 -168668 228186 -8364 113409 -133589 51592 98391
15381 98391 169973 192680 101284 298539 -16246 388185 -143560 -199232 182084 15935 210168
15370 210168 93889 -85038 -240363 60715 678467 168205 520408 26852 -167729 -38431
15359 255340 -332130 -166303 146111 -89507 224233 -99922 -247099 154310 -52791 -31169
15349 -31169 148522 241088 -76378 -70640 486039 39341 206784 41631 105324 247021 245978
15338 245978 -277778 -158683 -5524 -91190 -4281 21277 185624 161562 -179128 -44388 107880
15326 -49927 -246851 -93981 506632 -165300 14095 -98930 44479 -9331 -170496 78499 -106275
15314 233827 228167 132595 179234 19487 116960 47462 -90671 -64365 -38907 155844 145783
15303 145783 143683 -213549 174436 -89033 4916 -65784 252730 -43156 16251 -66356 77008
15291 622099 -28670 -1398 -93521 166344 66548 -22208 82573 135048 298027 -15424 248136
15279 -221516 41577 72670 -7177 41095 -51562 247277 -197480 7672 -222926 84733 84491 100377
15267 100377 280028 101978 -57824 104273 119478 413148 207636 167637 140044 94722
15257 94722 84177 118673 -16445 -113077 380389 375920 439189 87347 735886 1735744 1050584
15246 1050584 985029 1684946 553007 72246 370607 -100823 226753 -46729 -323192 -5194
15235 -125590 15038 46435 360841 -161638 -331203 -256845 -280748 56299 -471484 -30503 -101218
15224 -101218 -47049 130226 190726 -6105 30499 342664 138803 37704 42648 -47359 363021
15212 -23330 -40167 -227782 11001 -32060 167954 115642 136292 182797 -12526 -268618 363445
15200 206549 -54120 -48068 -20722 -104851 177431 69768 -92815 -36278 297923 356525 213386
15189 213386 -191980 84143 -9049 -245290 204377 267959 -171457 41359 227639 101938
15178 92262 -226986 173608 -26356 147097 -162423 93385 -41896 -66202 7607 187867 153536
15167 153536 208413 239703 402296 -47548 259877 -67196 341760 41854 -189848 169220
15156 120957 -21257 -70960 108126 -276541 41208 298381 -210081 8 7978 -99771 206429
15144 51352 -22869 -73014 -91939 39841 23955 -37654 35563 44687 113260 37458 165807 -149409
15131 53625 -66408 59870 117580 288942 13500 -65160 295349 -110366 15757 88336 174174
15120 174174 545329 -221631 163604 136522 136657 332575 -72978 181256 -176770 -134100 151231
15108 150446 225697 -83570 76235 42288 157663 -52700 -163709 17588 4044 -108239 166316
15096 271829 100225 -61286 147511 283847 218582 41062 218382 377590 234689 -56112
15085 -11013 24244 175472 35778 88778 141284 184886 206269 171550 177387 176263 201280 239929
15073 239929 -140109 230874 103928 190475 -137106 77794 187890 226173 198304 -74224
15062 -34756 83211 304131 -104134 56025 306318 154229 498169 118894 58579 -39132
15051 33531 178820 199578 228396 -3627 184781 -5848 90059 82454 269236 237091 -133869
15039 85099 521270 360656 144839 282494 185840 656031 4395 531981 332031 313643
15029 313643 170507 102066 73317 122717 53315 -130052 127782 387446 220078 253532
15019 253532 337033 137940 483915 368726 271865 143826 379509 175782 -108793 -120671
15009 -120671 231965 460233 190560 353100 87653 -58509 296994 500393 25055 538879
14999 538879 250328 320778 46766 389270 -119284 374690 190459 333224 -16457 127385
14988 169298 68498 105944 377535 466175 289467 517889 -251618 279076 120851 331112
14978 331112 346088 -48461 312524 158508 165334 458282 263805 337988 302036 64087 270448
14967 270448 124084 515754 -1448 227131 57560 203548 352903 316420 297162 244132 -183046
14955 69838 414091 162747 318233 465592 3708 38471 325726 396536 246683 283282 248859
14944 248859 586775 132184 467717 331011 554209 -90725 480344 271829 234542 232892
14934 232892 435650 462210 350872 203321 -46582 508826 507081 380079 305518 230008 175657
14923 175657 419813 503097 258619 561648 423018 128607 362391 252395 15290 137247
14913 137247 366881 370391 214825 315083 412510 341422 741997 365919 160502 42556
14902 466340 213807 426633 294813 51546 146257 433226 529749 385637 232796 23662
14891 483175 65881 16654 286470 347918 318420 581874 586373 348714 205667 272974 447505
14880 447505 439064 -54742 233957 338696 102691 172567 117844 108409 255594 213935 473007
14869 473007 298432 586609 60048 112911 407883 132085 456838 355221 431851 641894
14859 641894 432822 556690 325674 698796 433617 303941 558989 712873 368565 344434
14849 344434 363850 359700 277415 588810 76588 495655 240168 511035 526562 530757 299512
14838 299512 197995 468460 528182 297647 369425 338562 610874 362442 298376 510709
14828 510709 528458 414613 292643 273494 191711 600007 699491 429641 401415 332068 514513
14817 514513 368477 482907 462927 454996 479901 81666 371062 732558 633564 409081 577595
14806 577595 791063 642719 290701 545110 586475 610203 355779 450138 461510 417399
14796 417399 421592 968735 630210 692111 510549 284252 562155 186183 774125 384285
14785 552194 619267 497235 394501 648342 915709 588353 380526 628838 285693 594660
14775 594660 532011 902288 586690 521440 810303 445228 537620 392708 787088 792754
14765 792754 677867 1137770 792237 817668 606277 651312 754258 546448 913245 465570
14755 465570 789180 808470 712117 1091732 640661 583640 742969 774751 470211 621433
14745 621433 805705 766192 664108 601254 661799 942506 812087 962500 786416 560438
14735 560438 940786 932311 942686 676141 578465 655297 951181 836800 874308 1059016 675279
14724 675279 777584 828232 494612 915998 783725 872052 940230 1125186 452970 500782
14714 500782 610177 1025688 1051016 1302866 1121032 993319 874985 709527 750523 695428
14704 695428 1127166 811267 906894 902959 759763 939282 873501 638393 848153 1053749
14694 1053749 880701 720324 891639 964154 936580 834197 999754 1016716 1359942 872468
14684 872468 859616 1181445 1218695 1138071 872461 615132 745612 813383 1272372 1106470
14674 1106470 927382 1043252 957411 978986 1219874 776649 816285 1266183 723905 824013
14664 824013 1018446 1183732 1098337 1021135 1158663 1321173 1160553 865648 1212053 1253853
14654 1253853 1089446 1444367 1253484 1152678 988880 1104173 997231 921633 1141268 1083197
14644 1083197 1334090 1353206 967545 970364 1265085 1507085 1279010 995149 1061452 1232958
14634 1232958 1266038 1623027 1694555 1155923 1462581 1178942 1445159 1469055 1418135 1427061
14624 1427061 1254226 1210009 1825480 1684553 1448739 1023248 1499278 1468334 1043053 1654341
14614 1654341 1485457 1305622 1348775 1499965 1505778 1426911 1534105 1622454 1889390 1705398
14604 1705398 1510345 1825750 1719480 1413811 1882852 1848780 1994199 1763042 1835131 1693575
14594 1693575 1738279 1623271 1584103 1934689 1884246 2216350 1744079 1580638 2026981 1938581
14584 1938581 1925172 1926088 2152572 2040739 1965515 1881323 1914863 2122093 2183973 1880884 1815186
14573 1815186 2006556 2102786 2406187 2042824 2212955 2195153 2381971 2761013 2390680 2633022
14563 2633022 2766000 2897889 2664337 2796944 2757771 3134618 2915334 3145189 3244986 3772943
14553 3772943 4184510 4397108 4812272 5354883 7374203 11178797 20267595 41287564 50818379
14544 50818379 21970865 8844141 4865965 3470810 2794628 2185136 2271241 2096908 2242863
14535 2242863 1995895 2118981 2088441 2178991 2176390 2287507 2576585 2379703 2010963 2557533
14525 2557533 2637717 2123603 2148814 2643927 2540014 2731836 2462578 2557800 2878176 2675080
14515 2675080 2604411 2750940 2813696 2953264 2703713 3012136 2777738 2755199 2862360 2701216
14505 2701216 3333459 3295400 3315387 3027589 3235680 3300233 3050578 3327055 3131074 3414969
14495 3414969 3311425 3489339 3530518 3468950 3327368 3476646 3582966 3809778 3757512 3740486
14485 3740486 3534669 3850314 3903900 4063424 3711783 4252171 3999792 3832745 3866555 3889616
14475 3889616 4389581 4316142 4472255 4267967 4306880 4498418 4413580 4351488 4510522 4765549
14465 4765549 4693999 4869173 4771892 5140636 4733845 4695470 4996999 5203560 5191558 5447109
14455 5447109 5238320 5373720 5277144 5251583 5332757 5567096 5795679 5877209 5850471 5965536
14445 5965536 6151846 6058365 6152902 6264194 6223748 6286751 6135827 6486530 6655910 6900505
14435 6900505 6797592 6801705 7091126 7162767 7316254 7019566 7482260 7358378 7034721 7582175
14425 7582175 7841574 7892259 7413372 8022378 8121164 8194067 7898729 8246023 8476353 9047752
14415 9047752 8995918 9008008 9040745 8798134 9456561 9161345 9766587 9471925 9905298 9877655
14405 9877655 10090952 10505328 10287043 10633567 11042221 10856833 10843828 11243855 11494906 11738662
14395 11738662 11702855 12043352 12254529 12436444 12799825 12812779 13069643 13505379 13793434 13618572
14385 13618572 13923238 14328241 14057520 14514338 15236648 15030258 15719360 15827393 16415036
14376 16415036 16462616 16669685 17222608 17491585 17644381 18185071 18759318 18826380 18914402 19984509
14366 19984509 20054542 20446161 21129167 21344197 22142364 22393975 22976995 23632033 23479178
14357 23479178 24421417 24643789 25309692 26025596 26968772 27250970 27747665 28743995 29618706
14348 29618706 30287513 30956857 31276971 32483050 33099381 33924178 34774693 35730558 36650714
14339 36650714 37829009 38971700 40337651 41121872 42115556 43463367 45152699 46068458
14331 46068458 47588987 48901248 50444531 51786852 53516974 55472183 57477413 59109571
14323 59109571 61192346 63408582 65565342 67898011 70126388 72684604 75575111 78264145
14315 78264145 80957701 84068853 87518587 91019792 94491333 98350330 102675599 106694935
14307 106694935 111636793 116343500 121332708 126570551 132279373 138735940 145038165 151856307
14299 151856307 158689112 166455115 174715036 183445889 192293221 202169505 212064756 222599540
14291 222599540 234098383 245860733 258149042 270814017 284651811 298826907 312888954
14284 312888954 327937172 343095203 358294173 373635172 388725170 403929043 418048948
14277 418048948 431350280 443669216 454511348 463526433 469903657 472946617 472709699 472559689
14269 472559689 472190209 467806575 460910826 452901866 444260744 434036708 422723444 410192484
14261 410192484 396454949 381962934 367056902 351831627 336225305 320662848 306586536
14254 306586536 291874190 277457960 264247919 250806726 238643342 226899808 215654279
14247 215654279 204992981 194928534 185708712 177588994 169012875 160967407 153676268 146618468
14239 146618468 140300173 134367260 128392035 122785901 117387042 112482747 107719150 103854101
14231 103854101 99775177 96007214 91886448 88188927 85008430 81989088 78905796 75883459
14223 75883459 72805490 70637721 68058063 65772440 64061658 61407305 59421699 57337669
14215 57337669 55628642 54182195 53008546 51143808 49284788 47813472 46337956 45216785
14207 45216785 44805348 43581692 41917501 40315997 39247452 38192355 37653980 36910538
14199 36910538 35789676 34621001 33491920 33059441 31907120 31484069 30740560 29633353
14191 29633353 29164193 28025241 27531792 26917146 26064503 25742927 24906238 24762791 24136932
14182 24136932 23432389 23065378 22537430 21991996 21706133 21079199 20536629 20477974 19842276
14173 19842276 19764186 19202446 18535068 18366494 18066770 17872825 17144154 16971931 16926634 16730001
14163 16730001 16125270 15876638 15791441 15071580 14988307 14891990 14552160 14420447 14130566 13736068
14153 13736068 13557005 13275592 13290833 12856611 12671220 12676972 12327993 12464132 11878827 11693186
14143 11693186 11444462 11238333 11061829 11232664 11070877 10873295 10645253 10171156 10385533
14134 10385533 9907311 9790042 10178512 10110769 9506240 9553655 9398993 9195848 9007243 8653431
14124 8653431 9097804 8993729 8683740 8393421 8425372 8420502 8286014 7758982 7624721 7648771
14114 7648771 7960320 7606816 7549740 7333270 7324991 7261913 6835132 7074784 6788593 6915353
14104 6915353 6824468 6707579 6615329 6620652 6260469 6331016 6484077 6535506 6099224 6308416
14094 6308416 6169533 5858902 5605346 5924400 6250183 5418897 5573739 5803984 5441886
14085 5441886 5413551 5243374 5342017 5456840 5135102 5136393 5244948 4831231 4848953 5095815
14075 5095815 5015046 4964686 4669140 4658768 4847938 4524771 4851720 4769523 4375707 4553634
14065 4553634 4537838 4673593 4622371 4306203 4266132 4373214 4336413 3992036 4306419 4029184
14055 4029184 4012538 4133999 3878572 4003814 4059074 3809718 3800578 3668367 3737450 3827055
14045 3827055 3319146 3520012 3619866 3862920 3244798 3345284 3502896 3203212 3474832 3437037
14035 3437037 3165028 3611975 3126229 3444081 3362627 3418373 3387629 2971455 3254066 3490382
14025 3490382 3248301 3217631 3000095 3179680 2826629 2936839 2749415 2719781 3087765 2675341
14015 2675341 2478575 2972202 2733769 2578792 2894249 2665837 2637469 2923264 2663138 2734418
14005 2734418 2457214 2739947 2246924 2432749 2522187 2076179 2222642 1940065 1729392 2343798
13995 2343798 2344159 1987446 2264883 2254496 2386493 2899744 3401542 5825220 12419677 32966407
13985 32966407 53151656 26128828 13361694 9010556 6446883 5292856 4793350 4022418
13977 4022418 3583214 3930527 3084739 3348733 3095799 2867951 2416399 2259633 2777137
13968 2777137 2801292 2290688 2410565 2287632 2210140 2054708 2245626 2355898 2480970 2607069
13958 2607069 2375714 1850872 2381665 2127318 1767106 2178981 2162861 2234123 2376843 2021681
13948 2021681 2225402 1951369 2175472 1835932 2193729 2197288 2064549 2180013 1920241 1988314
13938 1988314 1993965 1784451 1897685 1670506 1745800 1666897 1952992 1872833 1788728 1526826
13928 1526826 1602244 1786319 1858782 1549800 1605620 1501118 1865258 1451761 1568554 1724147
13918 1724147 1927230 1936658 1487798 1787423 1349576 1410181 1585951 1523171 1542245 1323526
13908 1323526 1772559 1577699 1446990 1266244 1411035 1350980 1245067 1383402 1389201 1215000
13898 1215000 1377155 1508268 1233996 1388996 1372227 1326699 1396657 1364058 1219300 1340436
13888 1340436 1423993 1377881 1429166 1393778 1608419 1448584 1207790 1446287 1531282 1601314
13878 1601314 1721739 1369809 1348498 1231414 1603226 1492743 1124715 1205265 1073653 1192874
13868 1192874 1237261 1225314 1089267 988384 1170180 1438110 1289353 1000458 1184095 1357854
13858 1357854 1304691 1376797 1179958 918593 938660 1406100 1117438 1197540 1187801 964549
13848 964549 922331 1064549 911899 936923 1397238 996517 1198238 991160 1104297 827504
13838 827504 823221 1122553 1129516 902559 751572 1129806 778948 1219294 816895 990391
13828 990391 1076334 1086181 970341 643198 1024945 1071783 980836 1192883 1015016 1122841
13818 1122841 995316 948637 865828 1298467 931987 1026300 741381 916733 876286 776245
13808 776245 875383 913304 1229353 782998 877977 641961 797926 897958 825386 748034
13798 748034 978205 877621 787773 1144370 758205 626398 917734 760036 771710 849890
13788 849890 907901 1107003 1019332 889824 893439 762805 1078178 511544 832879 745514
13778 745514 918126 779736 467876 847242 846897 935486 566317 684774 575021 886858
13768 886858 568473 896231 699690 597942 510700 649853 680141 974567 1076549 897796
13758 897796 793338 761082 754932 390098 545455 842446 719601 695583 766751 774496 480064
13747 480064 946059 718894 915903 566695 675622 549423 353854 490481 505057 734095
13737 734095 617334 294643 878602 581281 612813 823317 601841 485398 760099 756571
13727 756571 806025 529230 749550 637266 480722 842830 396752 149478 806898 786666
13717 786666 567279 385138 389412 474833 865131 514560 1090444 688667 591681 589658 519451
13706 519451 571437 977715 643632 664372 562939 296321 490959 633292 596271 222514
13695 521006 385358 662302 625440 535524 545566 761343 923996 742295 737055 742944 493716
13684 493716 571939 476918 421938 512420 722485 572993 204226 650145 718998 486031
13674 486031 519217 713050 291041 424145 406984 295735 591087 696465 231153 703298
13664 703298 465087 824470 668210 519261 535737 632626 456211 245701 606365 502897
13654 502897 176762 553939 682918 460501 537732 419141 453563 479859 711661 448882
13644 448882 314895 608755 586429 222274 222535 711483 410169 488232 406310 242361 346765
13633 346765 538892 422894 429119 390924 345343 549510 208020 462853 348949 404847
13623 404847 274847 321019 408974 452316 223957 100476 416997 642065 413411 222495
13613 222495 803084 300588 541711 418153 564900 291011 519159 395749 367047 254623
13603 254623 628294 261646 125164 439653 341980 335026 450032 290199 179533 591883
13593 591883 386903 275162 333755 363762 555369 625103 229274 330079 198922 328521
13583 328521 189588 227500 397185 550992 527707 330891 319108 448366 447563 287195 454387
13572 454387 497016 468137 146842 341455 509825 456690 385245 540272 159279 277143
13562 277143 492468 235404 324964 203984 279137 429536 168291 472514 579658 480813
13552 480813 119910 469108 480670 199364 125992 -77210 70831 302596 153003 -5411 -68640
13541 -68640 247568 127508 109224 161976 131279 273226 93425 314360 244498 379101 206544
13530 206544 51580 725445 73965 138007 399412 291161 274918 328161 396025 529215 679887
13519 679887 196091 252225 178889 227125 514444 489397 180332 15403 113581 178045 389999
13508 389999 503859 506054 53491 405300 202359 181017 165312 194112 548480 681343 158014
13496 15967 113480 241208 257520 815767 223716 156660 394739 561833 302137 388209
13486 388209 235379 246023 122688 162479 261119 681151 89713 333281 201887 339872
13476 339872 309612 -47747 206187 333350 308941 385517 152262 -438339 168060 442573
13466 442573 375370 259709 357395 359722 134928 75781 235993 248976 351250 369633 87394
13454 481218 266864 124283 -47769 259613 225477 380197 446179 -120027 -24509 206256
13443 165007 176935 321779 465417 217334 261691 430182 111014 327216 513696 426478
13433 426478 251915 200308 -73599 116516 479536 128314 291670 55784 440106 613336
13423 613336 94296 290010 378730 121006 133354 481384 427764 319207 152222 333086
13413 333086 16117 66498 427914 141059 32585 325268 235364 297674 363641 584216 387897
13402 387897 61118 341777 124839 253926 167847 175300 294563 365926 202984 189775 328120
13391 328120 103864 -30412 513387 54680 -14202 63933 591512 129519 336076 384289
13381 384289 195356 132130 -215499 340920 -96607 356719 384973 302412 217 15579 333850
13370 333850 -184423 218864 351516 442658 269223 287179 260745 272846 301304 186838
13360 186838 195291 262992 387843 88500 464327 258668 115202 302784 262688 -20027 283089
13348 243217 621396 491208 -68463 640694 65509 293462 222282 347414 212666 245094
13338 245094 269500 113805 184309 400574 326082 195289 87876 -100587 350808 361936
13328 361936 170831 -26787 -240943 420743 255660 202110 276254 -154529 265913 175469
13318 175469 185429 138026 241349 363548 -75895 50320 109409 134678 -69115 396317 171662
13306 209679 245547 295191 36978 275823 -56915 238733 140351 219606 249110 189184 315254
13295 315254 60815 58415 173495 187928 98943 -116860 185380 93805 441696 257655 -110348
13283 118803 56115 140889 118446 216426 285989 212457 354474 255174 -15618 241470 65202
13271 -243284 512034 371565 370938 146786 149733 -94571 245750 16103 -93956 -49878 160286
13259 276941 -55401 -171809 -7466 57953 50073 303072 -26987 457979 217814 238448 180935
13248 180935 -108551 293405 -15556 -248295 407972 214360 -71825 -25828 408881 127562
13237 87568 342067 234842 70939 257680 -71045 357280 376439 206563 222305 456673
13227 456673 60865 -4254 421613 -42517 202568 187185 -78799 212703 244700 311856 120363
13215 391138 75128 328646 -3947 410586 -35231 202625 175213 77378 179785 -1588 402439
13203 -7466 154238 87899 214428 107452 255524 41259 200968 -34489 437533 366851 -71484
13191 227824 439906 61477 -42234 219221 -177449 17487 142266 143022 172097 32363 21503
13180 21503 102088 -113102 236869 255017 495516 206195 344941 -7572 29828 51502 -137638
13168 89696 -2001 80652 146690 3224 -104984 120890 37238 266032 -275271 -187174 274675
13156 341716 29359 266455 293951 213944 153563 80168 -161007 123124 144417 -21449 53667
13144 82130 163407 -70681 -46834 42815 10766 98534 -34639 112735 -97537 -201618 306188
13132 30987 406023 229812 -56408 191849 365228 147356 296497 -427107 -59274 -83876
13122 -83876 10597 -214524 -24504 112915 117507 93093 -273808 166335 214484 188671 317919
13111 317919 -210173 140304 194844 241366 -101724 -71940 34462 152898 414173 298279
13101 298279 -85878 181606 173133 219489 135348 104811 40177 46445 176017 233915 134944
13090 134944 -134634 207704 -237907 94127 129570 -207430 27699 -61149 -90394 -37345 127422
13078 24832 -38027 -116620 41776 9992 -13050 278489 171914 -51448 -240137 25245 -135966
13066 62117 -128276 51035 328245 -132454 -47185 86501 294701 97723 -10949 126712 462268
13055 462268 83269 103389 446064 239983 101664 322740 216843 291537 81889 -35931
13044 194782 -35400 310726 -56359 81312 26559 184016 182310 240618 390900 298939 185039
13033 185039 221322 303334 -339500 282531 231490 37647 294324 51477 2178 107187 263934
13022 263934 -13032 335911 346484 269153 384669 342677 -159468 285808 431567 396064
13012 396064 413326 72979 34643 176988 -46040 322548 157024 367891 -41702 19273 106994
13001 106994 82625 132518 -7316 149664 136958 -136013 -37743 567474 225976 -31979 202948
12989 26351 -35859 -35579 162493 167694 22775 70762 -78921 128143 145138 9140 39719 122
12976 261587 124070 195179 99095 307034 -12307 -122172 110895 44658 -86214 233149
12965 147352 251334 162860 153862 -60266 -211657 -109715 -56536 126399 -43121 -48584 80415
12953 -111246 -86850 -71990 -116318 -34081 -345432 162225 44183 12292 -113328 176025 -11264
12941 2960 91651 230052 -69835 397629 79853 287899 212489 17333 32774 74165 24916
12929 -4131 9722 106905 98654 -125038 -136927 -141340 354072 279773 198183 -135128 425715 118547
12916 -119677 -29318 229549 -33001 46270 30542 -287976 -135665 -121726 -213401 -219832 -42235
12904 285316 -281439 -86511 -64905 -83261 -222122 82219 -115960 -2482 154695 423763 10656
12892 -106351 174117 252414 -192744 50229 93618 -75646 264768 122784 373703 119138
12881 177459 -5820 94821 473659 -153695 330448 321495 73882 -252508 44474 -163528 219798
12869 366851 33124 -17047 -6698 -187526 113623 -80586 46779 -34444 40246 125021 69285
12858 69285 118471 221111 109891 208189 -82022 343674 23231 340706 -105335 56263 39480
12847 39480 224689 134925 399681 -9132 -116528 -94946 322183 -5196 -89863 164333 -51481
12835 -150588 91389 89600 -15597 -9001 183113 441073 152723 86511 -128437 264876 158251
12824 158251 166945 1561 -22606 -9230 -183115 315264 81515 -246809 -79467 227403 -187603
12812 -270881 267131 44140 167252 162317 -33543 -49778 -95365 -285723 120086 119716 348454
12801 348454 53278 39675 57438 85365 -14498 -112908 148620 163521 -59779 -41915 216769
12789 267579 78300 11056 262230 442992 71211 -88807 285641 140491 76663 -166689
12778 -168815 39646 376345 126701 -170566 221124 210099 -28220 -8117 7591 -68973 14124
12766 162288 50445 -308969 138421 -319333 -131818 -36323 19958 281865 -96408 171761
12755 -140093 -77211 70160 186550 110225 -27645 -32926 282832 -216667 37659 271305 -48850
12743 -132449 246985 -220823 175251 -69427 94153 524453 134027 158910 -26160 250437
12732 120509 169157 183907 4310 63284 -83252 177714 171419 19452 -78917 265878 -66848
12720 94253 223512 -23718 -203979 73989 137437 164113 -230946 -78831 226807 80782 -121640
12708 122620 778719 155785 304171 186330 -4969 138307 280100 32408 -67061 273209
12697 40978 68467 21461 127745 198692 -48921 -223949 106876 32301 222924 85641 -210262
12685 97035 -210680 39264 73159 211051 -8553 -151388 -40751 238273 453707 97628 206846
12674 206846 86341 -84974 -92950 295975 65048 -269829 -62452 -52460 -299395 -90771 301478
12662 53185 39170 130955 -110101 189463 204568 217442 68207 -266756 134524 -40698 152999
12650 430003 162548 353503 98679 142109 -331679 8712 135357 60145 -60456 476055 -86392
12638 2364 42481 -206907 117132 225681 -107668 264045 224033 240044 103227 352608
12628 352608 286655 382996 331758 320364 -29736 26987 -174399 365205 453642 282302 183195
12617 183195 422939 59022 124905 256807 197982 236781 225487 79220 -188136 77627 170413
12606 170413 41317 117813 -137748 50439 128555 -135033 -144632 115760 323787 63283 -23173
12594 80482 141786 200016 5348 138317 71046 70808 423999 -20600 189584 -409 -307605 313567
12581 -303623 285458 183487 -69313 43945 -235980 -160054 240722 -222552 -13281 -57813
12571 -57813 -47088 46189 74816 274363 -185293 -108096 157120 201593 107075 494674 129318
12559 -117650 123984 288899 243907 239179 -185152 -61189 36612 172210 -355490 86686 -295066
12547 91228 154001 -89293 -220469 399171 -157125 -110218 -180914 187956 -247104 -163870 129672
12535 265431 -160768 335112 170013 63046 -228676 -17170 47419 150389 -46055 39996
12524 -30844 37807 -146231 -305636 47440 -8292 -47748 198060 148171 413736 199614 -274005
12512 -25485 -14869 50912 -18871 -75023 -186204 188585 285819 -331769 33378 163907 -14059
12500 196446 270132 -136146 76294 231206 142523 -768 -186085 -237569 302370 325116 -112015
12488 43553 -157840 -321267 220312 187021 -69315 54998 -102518 6440 306609 147349 -332948
12476 -61268 25584 -398270 -156419 80239 -103126 1659 29137 -76367 -107044 128187 -91512
12464 -97658 -204090 208010 -227799 -170409 -11894 245995 -156098 -123611 -88707 71334 -111363
12452 -79421 -19267 -141068 -24518 -82293 -228432 -312032 146325 148094 -229886 96701 -367256
12440 -3395 -281081 -69665 154338 -175867 186990 -307742 114266 90923 -150672 -9231 145970
12428 216805 -192175 140302 115192 13089 -237521 318256 336667 -142753 -349786 28567
12417 157296 9903 121005 -74193 30729 11078 -93986 112003 22484 141528 96292 -91398
12405 -153188 -37712 -150691 -63316 -270601 -240020 91855 167356 -71201 2163 57715 -147517
12393 21704 237399 -2084 29801 -12421 -37103 -92960 -94198 151915 -358911 37079 -80372
12381 228870 -71208 -108365 138152 50017 96550 32216 -298814 7210 -204247 370297 -207390
12369 -129030 124818 162450 -185086 368815 -20314 105989 392302 -164628 306418 -33890
12358 -175989 173649 30163 11593 163320 115193 249943 -200131 116978 -99599 198683
12347 -69789 62444 -57420 -23334 264386 220110 119805 88756 27340 33877 94697 -405054
12335 -20868 -155559 48196 395844 362561 138611 -81955 404462 -401567 160217 -407298
12324 -123743 -136738 -78651 232405 155735 -56740 -204621 -323010 257731 57347 -124663
12313 31782 -139620 85854 191682 -95962 180987 -86490 197194 120202 309398 63489 -299418
12301 -141825 -154932 -22187 67469 202987 118038 52806 107259 -24605 -55682 -94969 64719
12289 238497 -226445 -17827 121741 152853 178211 -12659 -69048 103396 81274 288378 147110
12278 147110 -213516 31647 242391 190575 382606 459982 128383 418243 135111 439958
12268 439958 111134 42119 228180 -199608 -4509 52162 306942 279562 -261991 -49325 14119
12256 -41205 172082 311375 183246 -182907 -71221 68834 -157477 -144217 -129031 2026 -158364
12244 255112 -163512 96421 19305 -13490 356372 6945 117466 56257 199699 -147663 140814
12232 -72775 208100 98642 -122279 132000 646183 341067 42664 -38941 219837 29588
12221 35098 463808 399199 185353 362307 -7966 190698 454034 -95343 90053 98407 123282
12210 123282 167584 33694 104833 546458 35218 231917 569 149146 284475 336215 303787
12199 303787 286123 28790 219496 75778 66918 170511 147049 695520 375780 -23984 -54943
12188 -54943 305129 41511 228491 152792 60351 393283 -82907 -168268 195776 72383 36024
12176 69438 409521 64439 -10317 167457 70253 219138 541215 -75662 -194534 -221839 21609
12164 140676 184817 190105 166523 83599 -39804 173978 239767 9017 112867 -56740 47272
12152 220163 2524 70256 -53640 2222 39949 -206960 -86227 17468 189131 -31703 65821
12140 -24283 -280272 16534 196365 -3197 39735 120147 383379 -292264 -29084 -87019 484609
12128 105591 -54398 -134572 106850 -6969 -320541 164925 -11078 115144 143611 135181 296762
12117 296762 239624 -8057 -79578 -230930 184815 -168842 81805 7831 -75633 25711 187296
12106 187296 143853 -72373 284648 90540 142864 60359 -69745 218907 18183 326639 -231867
12094 55801 -125960 133025 53379 153721 -128397 93779 -64674 -409352 50407 -226162
12083 62576 47564 225105 -204356 -9471 -107939 121772 213426 1324653 1735467 263285
12072 148961 173213 157785 -155125 -221095 -144587 62001 224911 -142998 235806 428 -204263
12060 -274608 299032 19762 -256355 12092 -119356 200552 -169300 145676 -124344 245848
12049 -149115 4054 -30683 88188 350251 52638 117213 16078 -149176 -58832 233588 14702
12037 -79053 158802 15423 -3908 -133726 -63908 16109 -122722 82081 -348307 85290 -70136
12025 71379 -6842 188411 -22728 -91011 23596 87617 -114973 128682 -151805 219875 3282
12013 -3850 198123 -17675 89169 -83756 -243230 -240414 -2331 144903 90611 -7915 88914 -126892
12000 -54692 80428 -60032 151663 -39071 122190 -157568 -308618 251377 -275825 205342
11989 -381243 96142 204463 320713 -213481 104984 36803 -96398 25826 -103234 -71504
11979 -71504 72801 -76100 113795 -93965 252064 -35152 -2954 -25991 -279889 -74333 -132518
11968 -132518 125168 206862 107246 155893 -30561 -207264 72777 -81520 -45591 309742 -195562
11956 162670 -60232 -1642 -304697 349189 -24986 142221 -160191 148748 158524 -117615 -185904
11945 -185904 294926 279697 15541 14073 342304 224862 -88597 -24739 -162601 18032 -198132
11933 144377 181949 -35917 115403 76540 -120128 121596 79278 -34176 38181 273747 -81919
11921 361545 174691 75471 112926 156417 145944 29129 -152266 228185 182488 -172299 -91039
11910 -91039 137632 -131625 -266932 -17165 46554 -108507 174023 -37802 -224894 -307260
11900 -307260 149042 -23250 -57415 86515 -146946 -201290 -38479 9401 157969 78827 308517
11889 308517 -34897 148922 -72938 -106094 119283 155866 -131871 90121 87614 123153 -495462
11877 33911 131194 17133 -134823 -512129 -154047 -59819 -356640 -84989 -180791 85084 -213597
11865 -99571 -28391 16303 -40366 -32539 -61768 225859 -172220 -167894 53137 132724 92188 76831
11853 76831 279958 -86626 -134091 55307 -206775 -25868 -250367 -152580 -150026 -40679 33121
11841 9444 -138960 -148359 121909 23517 79025 -30893 -85459 -83155 -204538 -105420 11555 -69688
11828 188320 96983 25843 -113235 157739 -292537 367820 -101601 258266 136445 -8915
11817 141285 -105741 -153013 160223 260811 -123776 129877 35616 106564 65879 23705
11806 -462355 -167142 163540 -149770 -38866 225514 14986 -107065 272296 -263938 39313
11795 281444 -325817 -195057 98416 -64227 -122600 160991 -44025 12203 -221298 -222698 -137674
11784 -137674 -82412 89548 -193222 -175426 179141 26894 374646 -133566 -191703 -297152
11774 -297152 -183775 -166801 68719 91911 -93907 157963 399320 718 37750 -87361 -329991
11763 -329991 -79207 129783 163800 -198943 -234329 308887 302795 -91761 -288270 34992 100543
11752 100543 390678 209929 -145229 142603 100634 103490 300693 -101118 -37736 -136537
11742 -136537 51981 -32629 -25327 60758 91471 355045 88758 274393 308797 -189952 77317
11730 -68064 14192 -362197 188254 -47146 194258 103303 14674 133258 110180 -20353 -157680
11719 -157680 -57343 158051 180527 132085 -202163 322701 5659 -63813 -30228 59693 110409
11708 110409 124858 -77886 -74550 254982 8807 79596 5965 86439 43040 3142 210228 279126
11696 279126 -26880 61923 239110 43779 -434306 189196 409052 133020 -266497 141724
11685 -167573 -161838 112604 69625 -151152 -129011 -151126 133082 88969 101250 11684 -151815
11673 -73103 132370 127687 -434082 -144895 136760 22715 -190952 392301 -130756 163553
11662 355894 -195962 125763 100938 -197493 73539 185971 207850 27633 -7097 173634 2233
11650 252511 65993 -250424 -110136 -46324 -50678 -417298 106857 62457 -175950 -95520 -34819
11638 -46491 200709 534749 250705 391710 287351 -8484 -208043 2177 133173 115149 -258980
11626 -205183 -145824 -62377 92354 47534 -365948 58620 -204013 209227 147942 293507 23908
11614 273260 127698 161154 19478 99496 156248 37550 1447 180576 -239442 -156816 -31959
11602 43361 -42425 246979 37463 287937 462593 150653 283146 62719 354117 -350505
11591 -129775 28435 121575 -103994 20810 413782 198473 59405 212214 -93405 338072
11580 329771 -65873 -85583 14229 99510 211366 325740 17196 308631 139383 144002 95100
11569 95100 280096 152095 128356 371658 73448 326729 176952 -28049 169108 -15774
11558 -3650 407079 -58765 237381 -244334 -21231 -13859 68084 -86237 544450 -43568 191850
11546 172679 245540 -44138 126650 67195 89393 -201924 243991 434035 10114 207102
11536 207102 198600 1339 -163483 197805 -28373 314099 132297 373896 -123971 183046
11525 26940 45171 291767 149782 62858 -265811 409445 59592 -198870 -19519 392815
11514 247140 191718 228880 177121 401437 454284 139170 169345 -82592 -188392 -87763 -32419
11502 439893 26308 -73324 44833 211710 475237 369671 212934 -58260 -74900 -13779 -14337
11491 -14337 -70513 292162 115419 309938 -45712 164650 235776 -42015 300950 4399 -92003
11479 -78273 104655 291948 189604 230404 91840 -23988 49574 351216 739037 285944
11468 232097 491606 466231 432987 167510 104464 176937 339104 -51220 115519 247131
11458 247131 -221228 -70767 166536 278720 203267 280727 -98331 218355 200880 172269 290866
11447 290866 7436 71093 279387 -227585 44096 22211 338910 237719 59603 190292 168454
11436 168454 -80656 -135368 13847 -169707 167073 -337647 4434 76154 18280 196145 -201090
11424 -95545 -152011 220546 114479 -236861 211822 -398224 -161316 -261628 145171 -119133
11413 -73361 -92465 -283641 -51962 219498 212913 173702 38692 77561 57854 93547 -41192
11401 231182 26405 47286 -61070 62943 -53634 -25855 -125113 -342344 -21202 -429438 65977
11389 137315 -38549 1227 -36540 140758 95335 -263233 -70090 -148050 506912 -56429 -155764
11378 -155764 159953 -132027 -163265 -53317 35970 -284599 173577 134100 84017 -296160
11367 -37172 184668 -331360 12072 184771 -195768 -90445 -69689 17571 178004 -25668 23385
11355 -112915 -64791 38234 -103488 163906 -221307 289101 -36247 -24403 219742 29089
11344 123431 -2350 -136832 7865 313851 33741 -256229 -128896 62775 -253461 281034 -91556
11332 90932 -3371 -94479 -145269 -250702 -216902 58590 217045 91310 219971 103479 245541
11321 245541 -124631 51663 13399 -132377 -60430 109513 243934 -263043 33305 120398
11311 120398 -73362 131447 -260443 260050 95056 -114352 116973 167188 -102385 -214699
11301 -214699 -277260 -86003 -455918 468419 -33330 137546 176696 237385 360410 -149165
11290 -219782 -170677 182891 31110 -315290 85162 -116375 99888 257177 -150933 235495
11279 -324864 46071 57810 -197594 158456 -349032 12203 407301 203061 -279224 -271757
11269 -271757 -185121 -191894 231538 -65207 -105382 -80750 -243424 215431 -54486 20427 97795
11258 97795 126468 -91284 -172470 350746 -30321 -97076 -49109 -272428 -176644 -171614 -225056
11247 -225056 273656 -86785 -53174 -284405 -41425 -89491 106944 163293 -340796 -370211 -82845
11235 -119771 89002 36313 -221384 52673 5114 20817 17373 -125647 -144199 -15696 -208475
11224 -208475 63518 -324447 -212657 -80647 56543 101917 -94229 465085 -96510 431437 168282
11212 -29876 88387 -128461 -194698 -116878 -44340 -414553 273090 223595 -194833 195807 -59523
11200 -54480 -125694 -227634 -13341 -190166 45397 324545 -132744 -25501 -282100 222379
11189 261805 192979 -36164 215046 53544 88330 38419 -366463 -49269 -299782 -64052 56360
11177 -104169 -294655 -6616 -458331 -81566 154465 -291617 8165 86040 -4712 334887 -12835
11165 80474 -19354 81078 33567 -31142 65613 255243 -278947 -127552 -343868 -122539 -312261
11154 -312261 -190599 221815 36679 -320677 175649 12148 111572 -33270 -192385 -34220
11143 121075 -218379 122489 -207791 194387 253223 -130513 42332 449508 -20430 -184214
11133 -184214 -198022 -318465 -121618 54795 135968 66841 -216955 236859 -196668 19682
11122 -100300 60553 -131677 35934 34781 59361 -8909 292247 223196 18545 -212967 201109
11110 374692 6048 87141 112137 230403 341392 -101107 -21285 160011 120576 -65133 239974
11098 510847 193677 173078 180015 125910 89661 149990 224296 -175881 142640 128817 22672
11086 279359 14483 51092 302704 571142 210199 462064 337434 766915 190581 61205
11075 103222 570869 391952 328004 261343 247966 382682 144041 660219 473874 345220
11065 345220 484884 135355 585644 704501 327563 519865 522578 297545 635450 605247
11055 605247 434344 701315 754226 539853 798151 708027 662849 785557 829472 1010639
11045 1010639 578645 624465 908975 740767 588699 763278 710003 832309 806263 737038
11035 737038 935406 550612 925371 445505 1041154 770408 669864 725245 792773 707471
11025 707471 558425 639863 898209 619439 534792 633808 682207 421757 877571 473801
11015 473801 661545 573433 678974 321563 368774 669458 798003 796786 691071 363407
11005 363407 415589 451925 766212 1001150 703156 542977 600332 600346 590464 686930 498108
10994 498108 693472 940913 776660 596443 912663 933720 1056376 821667 723029 1036079
10984 1036079 1114342 1096593 1498115 1197145 1058459 1595246 1464398 1866303 1805035 1991835
10974 1991835 2393167 2781868 2842349 2491796 2830520 2763455 2548578 2584233 2198871 2121406
10964 2121406 1890530 1774478 1978978 1863324 1895088 2093372 2032296 1713573 2097325 1765547
10954 1765547 1434016 1438777 1299091 1213727 1293478 1160135 937361 743484 449447 340523
10944 340523 224315 244268 586789 80112 186645 228853 391463 86285 2611 -113121 4570
10932 16550 219431 56928 -144051 -142438 63025 172660 91799 -139254 242377 90757 101438
10921 101438 337092 83072 228121 -80132 -257090 60527 -140253 91436 -126365 210725
10910 -235806 -100594 -189829 -95003 -71411 312998 -302511 323307 68793 -223455 -289892
10900 -289892 21160 48808 -82202 128991 94023 171094 -103391 55767 -223499 -60478 157089
10888 214010 119523 -283731 -162907 -163010 -2475 299231 -17344 -90278 25538 -35488 -76456
10877 -76456 -161083 -146691 -5083 -145058 -127169 -104635 -129740 -129418 3583 6734 7213 304256 -147963
10863 245520 -399988 125327 -22488 -101016 -216094 66487 169178 331457 -199892 -22244
10852 60159 98218 -173352 73190 182330 -185765 24434 14779 73293 11367 26547 53214
10841 53214 -227965 774 11240 -253255 -150627 166165 -27972 -179837 -167366 -222754 -31464
10829 -104416 -89468 24593 -76794 57372 233322 26231 -143659 19665 68934 -93043 -196446
10818 -196446 -120201 158700 -27390 -126108 -274431 -60483 -8320 -276009 -348085 -5360 125356
10806 -147395 30373 114413 -381380 79480 -61176 123902 22431 212532 54408 15846 373251
10795 373251 -40070 129187 291227 -195770 22094 -274150 -93624 48137 -82049 -8112 -37959
10784 -37959 -439856 199552 -106809 -174435 -158952 -151714 14539 89440 -33833 -69734 62743
10772 20643 -13677 186855 55248 -53987 -34429 98027 -274470 282015 148446 -212145 138071
10760 -37604 -276266 193320 -55522 -109410 140064 -187935 -357324 -183394 -9246 -302171
10750 -302171 -214463 -57886 266047 -306922 -67656 -25034 133411 -162730 335801 42783
10739 97450 -77868 -384809 -235187 -182906 -240632 7661 -86994 71035 -139373 -64327 163571
10727 210095 -256683 -117558 15588 246355 -134985 72739 116377 82259 -261079 -66752
10716 100873 -153114 -34607 -189088 14085 -60461 -54292 -125638 -52812 87136 43221 -80951
10704 152803 -24830 232032 -169457 -338396 -166884 297114 -84095 148559 -210379 42325
10693 -190011 -208167 82570 85762 -19293 -175232 83932 252516 -424079 -181452 156058 -133179
10681 -246892 -45857 8228 -36533 79928 -115053 683641 -355130 -121499 -137290 33925 171874
10670 171874 -276806 228194 -83023 -138067 13456 69150 -15134 -14159 96694 310582 -164937
10658 -63355 -368622 -316521 -364106 8834 73910 222958 139042 132458 107178 164531 -40036 114996
10645 -166197 -110298 -180822 -130756 -172028 103883 290970 76850 74493 -114550 -122588 -68655
10634 -68655 -252945 -52617 -260917 -252695 221630 76375 -103943 -7814 -180228 440829 419050
10623 419050 -181887 -191686 -139635 -108253 -33859 -58371 60396 79813 50399 73456 -95014
10611 -318081 -290902 -32290 41114 -149722 137821 -183043 204714 -320453 92646 51533
10601 51533 -169048 110734 -231357 -108480 -243607 234039 -3843 30632 -19933 166758
10590 -20672 243543 -139706 -207171 146594 32700 74529 -10901 64628 -25741 -177881 -284312
10579 -284312 9077 -318120 -76284 -36653 70266 85836 -29899 -346514 185491 193493 -177848
10567 -222647 -178831 -236410 -311064 -345336 59670 176333 58454 193407 30866 -367032 83835
10555 70032 -178400 118903 14869 83602 -89768 251024 185399 197332 139714 94487 -128291
10543 62213 -249949 -58168 314149 144023 -201337 182416 14205 1593 -54899 -143090 -97937
10532 -97937 58658 -39631 144060 -43433 -151698 -318863 -76263 -89134 33791 -159738 -211726
10521 -211726 98326 98391 -504376 -302561 113402 -83874 -369972 155256 -21230 -128633 37963
10509 30342 -130344 -243202 158351 -95705 -189279 54092 49023 -44885 -169872 -379478 -222953
10498 -222953 -179680 -84625 396486 45145 326091 -151608 132422 19307 92746 -240592
10487 -1405 -150347 196809 -147863 548709 367882 409402 338634 548259 721786 190476
10476 179845 -18630 133152 248002 50139 59718 -111165 183223 -141926 -198391 89328 51938
10465 51938 -143970 17354 -26297 -49167 594964 75062 97521 -10083 142612 -58684 -200919
10454 -200919 -259041 15930 -123010 -56173 115718 94531 -16840 277786 -118736 -27834 184837
10442 5781 -173908 20871 -27944 -60319 22999 176550 106998 -87946 -106293 -140067 -289263
10431 -289263 -44077 -86821 -18348 98565 55775 -314446 -302762 7558 124059 -122173 -34547
10419 21912 -189989 311078 -360425 -49116 -105205 -73083 -55202 -301383 -152019 118948
10408 38635 -154921 212950 38597 -173825 -49788 127721 32165 -56652 -157683 434660
10397 -147822 5472 84759 -133376 450637 419190 -42216 93301 372785 335803 -135122 -196885
10386 -196885 -47709 -86947 -114005 161857 272253 203821 148842 152156 263776 239449 246257
10375 246257 514597 376023 248090 270309 184794 493793 395864 389058 28347 217038 404242
10364 404242 254565 483155 212916 329147 165379 162214 231486 206626 -81974 272093
10353 261814 437622 175802 233803 930824 503692 438093 190104 294809 428492 232512
10343 232512 535609 241429 600279 286218 198233 428370 150266 -75523 221245 181981
10333 181981 307796 224718 301403 439879 -112186 210337 9181 245049 104137 471678
10323 471678 346616 691622 303268 281154 -154662 68517 112358 455871 -28202 278635
10312 176825 64509 -159660 -295017 146218 91800 339581 10964 83370 329319 -448894
10301 99770 14172 -140725 -8042 98051 38565 66078 -39089 -38574 174513 181635 -104834 -65914
10289 -65914 158241 -126694 -388077 -153751 -108059 48416 -14232 128007 -304582 -200519
10279 -200519 3864 -117257 -286575 128520 -140213 173018 -424246 -93724 -39735 -87374
10269 -87374 39832 96402 271516 34657 350467 -116241 -324988 -51543 -48921 194041 570504
10258 570504 340473 447651 306486 7250 128658 -272562 10875 31972 -101616 49588
10247 61673 117645 -48664 106753 216125 -148007 -138185 27282 50756 -63850 30095 103053
10236 103053 -30890 8939 105741 -285616 -310878 96635 91004 -124154 -121404 87662 -41461 54404
10223 37244 -497935 50249 -448219 -428655 -1268 -406968 94040 2928 -32579 -356950 -435606
10212 -435606 157040 -150654 23216 -384382 91099 -111768 -359387 -114711 107071 -71472
10201 -19436 -134000 234434 18638 -180854 -5533 -5037 50902 -244319 -99090 -69009 -59203 -27005
10188 -65641 24571 211481 246322 260569 -177437 35466 -14625 66031 -136185 58217 -288486
10176 -254385 -266887 1672 134552 122518 109238 -177321 -142428 401318 25472 -381075 -64694
10164 -20328 -264101 -42411 -277625 -100444 -156282 -2412 -99379 209580 64763 -8148 -316026
10153 -316026 42895 -139491 -517766 72286 -119651 -75012 -125763 82605 -13910 106247 138403
10142 138403 -7359 106680 -345527 -36127 160423 -236264 157492 -343446 -38542 -184951
10132 -184951 -127981 -88261 -68518 -205784 -217378 -327787 -239449 139273 -54453 60575 333990
10121 333990 -5763 -173221 63236 -124887 54883 335257 -144675 -238915 121757 -19521 -125682
10110 -125682 -133375 -255610 -74697 35882 81156 70173 230052 161361 7586 -345888 44643
10098 -127462 116822 -73208 -322992 -152443 87174 92102 -61091 -100380 -183244 -118726 107622
10086 44162 -22569 161495 -130431 -97385 116888 11543 93403 -22141 -124302 -6942 -317649
10075 -317649 -179306 -24047 -159440 -249815 -75580 421611 -14231 -389915 -258725 -66974
10064 179075 -72314 -46547 22454 93214 148255 -59750 244979 -19677 -255869 -73726 -179157
10053 -179157 -175961 -90583 106922 -62072 166602 446461 -306897 -129265 -134911 172589 -132210
10041 13921 44292 136085 5185 22144 -119612 -405555 -222273 46921 -219754 -187341 66461
10029 -99786 122488 -247239 -372533 -136559 -73715 334060 16851 -366912 62249 -30983
10018 -181310 167091 265566 -286677 155516 -171455 103709 -199231 62755 -285417 -149680
10008 -149680 225163 -264780 -81970 -27261 34638 -215686 -104820 72269 -340776 198985
9997 223698 -139646 -205864 -164623 91884 155313 -22935 -89846 71561 54412 -4262 96081 -93423
9984 -158321 105853 -376627 -327948 -43747 276524 -144728 -431533 -316659 -190094 -135571
9974 -135571 14668 -112106 -57606 -84276 -213306 -84307 22254 -264118 -255706 52196 199174
9963 199174 -116155 -60191 -56512 169205 25043 58249 344448 -313295 -20579 302885 -10546
9951 -189201 -226609 110348 69016 -227570 208750 -65067 -1862 142601 86932 -140364 71702
9939 -140836 -14529 8127 -324865 56387 46658 105061 254858 188517 -206214 -5313 -207351
9928 -207351 -474393 -98231 67390 171859 324279 -129366 -67377 -23485 124583 3245 -345912
9916 -104178 -125042 158322 -7221 -174908 -411744 83457 72081 -67226 -539745 193665 167133
9905 167133 12146 -145010 -276034 -202291 -32498 -342447 -118932 -19515 -77087 -313313 28356
9893 -248448 39126 -12495 -39855 -52856 -155217 -150326 -121650 -174822 -2973 -142753 -28485 73566
9880 -75966 -357756 -134178 70788 93376 50254 46352 41543 24469 19287 -122615 -145917 -293459
9868 -293459 175126 -116842 -256421 -4349 -83622 -405550 -111049 51165 119944 -129997 -64154
9856 198580 -67690 -136680 -159746 -67469 -210929 -307063 265701 -439542 445980 -377175 -172132
9844 280066 -238981 30824 2514 -237048 100370 -91300 -154836 64363 -95908 359431 -210456
9832 -4525 -86850 -216071 338931 -184610 11205 -121189 24671 384560 -105175 -57141 57159
9820 -75943 -22888 -93808 -339667 -120932 -168728 -501328 -218538 181011 -229981 45179 232916
9809 232916 87706 -44100 86705 -173361 -98025 -307027 79302 -211906 -192493 -353156 -350825
9798 -350825 -61255 157765 106729 -65446 -45661 61244 -219353 196459 -329729 -390145 137039
9786 -150033 -57275 90007 -113990 -175345 -199483 3765 -345469 -308897 -103451 108263 176922
9775 176922 -517845 -142812 -185709 150155 -163584 -69148 73259 6943 132119 -7833 144521
9763 -209483 -173176 54382 190626 115596 125733 -74965 240156 -13922 -123966 -323004 6829
9751 -204847 -191752 -182439 -5936 -193280 -464444 -42145 -245418 29501 37936 -28975 96888 -52909
9738 -84122 -41419 38987 71702 -40416 35438 231801 -54186 -284066 171811 137534 76611
9727 76611 -132388 -204295 297857 400845 -59255 -263754 108030 -16117 -121661 66258 -287818
9715 -161667 -192169 197193 -426166 -178397 62720 150233 -173250 -150014 -70694 69435 178113
9704 178113 -252399 -225734 -30888 91249 53833 -139884 16932 100349 60907 -109445 31546
9692 86843 -28574 -69384 222451 -457478 -174691 46779 -126704 219041 -102073 -75286 -206425
9681 -206425 -381596 59727 -216701 -91838 -154077 68990 -143524 124241 -10634 204401 204299
9670 204299 -192889 19315 113755 4204 -366157 70433 -173973 -194314 -159725 240564 -91742
9658 -240615 -69108 289189 -508477 -108770 5315 -87478 103673 3600 -54827 -49463 -315256
9647 -315256 52368 -50639 -217362 -196606 39422 20862 -23695 -116369 45636 -276574 -414912
9636 -414912 85658 -281604 -83514 -241405 -46250 -53447 139974 32430 -26404 -189421 -233148
9625 -233148 187690 -24885 42807 -263649 -105879 -45553 -200960 296697 172764 -354763
9614 432798 48921 -299880 -106346 -46264 -105907 -287048 -289086 -242222 -307787 121857 -174442
9602 -14763 -208139 -243335 -22780 -139940 71506 -49498 130311 -69794 -189400 37382 -170401
9590 20603 -11690 -109186 38107 19866 -75625 -11925 149390 18105 -193917 104157 -179903
9578 -13394 -44021 162851 352166 -5904 -200011 84458 26547 -200353 -106458 -7849 37371
9566 -206792 -268816 -153942 -297969 98275 -328930 -555 941 -93769 -63985 217671 -318103
9554 -2762 -422800 -144789 295555 -83542 218953 -12679 209149 -135352 -196520 -104176 -173439
9543 -173439 -129594 -123135 -114130 -280285 -54743 -343365 10859 -187837 -202206 366632 -121089
9531 34786 14077 -168148 176661 -1022 -258314 -55517 -149672 13522 -28801 -129438 -168856
9520 -168856 -145795 -353544 -225025 -18364 -134464 199621 184893 -86615 -39235 -105355 -218643
9509 -218643 -130195 -48636 -187265 -254601 -61518 -155098 -377854 45137 105805 -431266 -22342
9497 22488 137990 -21489 -9156 -336506 59421 -121989 -48443 -35135 -135 -111824 93751 -95389
9484 -53614 1782 -72937 -70769 45727 -318088 -117750 -84557 68316 -38308 -212090 -187531 -64257
9471 242323 440872 -206180 -211526 -195837 -317125 -88275 -157607 239488 114970 -303242 -131287
9459 -14682 -305667 -27125 266082 -212254 268580 -31298 -96016 168990 -247202 7723 193337
9448 193337 -316217 -272176 15454 -129378 -307989 126181 -10152 -185607 223477 -88660
9437 -122715 22729 -73900 -24077 50577 35594 146028 128600 -161921 -4134 -45062 -75286
9426 -75286 69806 -3187 170411 82713 -21962 -202792 -534223 360821 408425 -44644 -174263
9415 -174263 140884 146196 -219212 -50721 -338483 146619 156570 -112016 -346124 145410 -184368
9403 152447 -130940 -113496 272133 -48056 43664 292963 -225310 -224653 -99294 -251052 6869
9391 -73358 353353 47265 86517 -184943 -48152 -99204 72398 26845 -120930 -238326 -307774
9380 -307774 14210 -312783 -195073 -51040 103654 -131851 -74520 -67347 -194823 -158590 31896
9368 -28867 116505 -80959 -138437 791 -130221 -64506 318 -123710 -108460 -278216 55132 -36746
9355 -242327 -423776 -188956 45097 -48020 351780 -11916 -368077 127172 73386 47409 12285
9343 -218456 -283781 105450 -176284 195420 -242023 -50895 111899 -265777 187559 258755
9333 258755 46557 -87495 -272893 69782 -288986 115091 -263271 -23279 -215164 -98124 -119158
9322 -119158 91122 -21352 -128555 -64688 -422795 -139900 -281314 -35151 -205965 -152737 66659
9310 -197711 -17666 -147904 -62145 33193 46341 -326312 -159572 175051 -110187 -228681
9300 -228681 -50915 53565 -199917 -79304 -150272 -136578 -191450 -24234 -223580 -106178 -471423
9289 -471423 74760 -80723 46331 -104314 -96750 -258290 -245134 -161967 53828 -135786 158962
9277 -12898 -137178 -218417 -255388 -168311 70229 161439 -185462 -49524 234258 -289699 101063
9265 -2581 -243125 -270882 -80238 -148828 161725 124738 91867 -276601 260442 -70053 -223610
9254 -223610 122065 209906 -107698 191740 -128654 53930 -66862 -38132 -202366 -137661 62640
9242 -280256 -135105 -139402 -605896 -189389 121378 -191316 -131716 88914 -87555 6990 -153652
9230 -270387 391099 -71383 -22214 -28317 -183280 -30311 -28244 -348504 -154696 -147850 107329
9218 -284111 -199756 284581 34399 -168399 49026 -307638 -33859 159803 -202226 251983
9207 37413 -303008 154167 -260365 -123506 47408 445 -185480 -9591 -37501 29382 35761 525
9194 -149664 -295264 -95279 231804 -11561 -248727 -42379 252491 -329217 126079 -14898
9183 -88010 -115933 -88305 20290 99442 204828 157163 138338 -151852 171620 -210226 102910
9171 218943 90092 132177 -221670 -226401 -256380 -10931 -358761 -289687 93784 -272584 -343018
9160 -343018 -58975 9190 143038 -99767 160533 -43379 -28804 46097 -193319 -227134 -13246
9148 -303027 92178 -156056 170347 -54902 134655 -15865 -186062 -104786 -48490 -390335 -534287
9137 -534287 139265 197945 -328995 77432 -191729 166331 337 -61205 164776 19861 -130912
9125 -138444 29760 -11582 -118065 15663 -64977 -143043 -347993 -148028 -133370 80747 -104794
9113 -146909 182451 -199907 -206545 -71081 46118 -170517 106427 -291579 -135332 -138464 -60771
9101 -109123 56177 -296534 -146331 100212 -61980 176834 -92327 12979 -98140 95182 -318492
9089 -186656 192808 -361203 -58540 186796 46172 -229088 -53140 -104008 -35190 -107113 -58079
9078 -58079 -125869 150132 -241643 260738 2485 152795 415821 137372 -180536 -164399 -119488
9067 -119488 140282 -243772 -105219 245249 -199046 63802 24361 -73020 -326140 173350
9056 30829 -136125 -208558 -193541 -365344 -7534 -350235 -29396 -7876 148308 -104086 -261490
9045 -261490 15744 -79296 -193197 -189748 475941 118796 15342 -174414 -225325 -111093 -123461
9034 -123461 77923 -233777 -190042 -116172 -75433 -269385 -277817 428879 53069 -168444 -139941
9023 -139941 -259002 -257626 163735 -281397 158744 -190322 75346 189334 -61908 84359 37059
9011 -12215 144721 81786 244276 -57764 70949 14233 -53287 -242708 303715 -226365 26271
8999 -195542 135968 239362 -56589 506187 367502 152109 -95936 -99246 135256 -227943
8988 -424795 -13640 -68703 -143764 21388 -86049 -326359 63880 -215998 260583 -88495 36708
8976 181636 27747 16379 -125220 176995 134803 -61060 -427828 -111222 -406066 91186 -119855
8964 -226014 -83331 -291914 70813 -265476 -84614 248360 -231043 -337986 298309 174787
8954 174787 -68781 100093 -268047 -127729 -212753 -19485 -327080 201458 -202140 -381850
8944 -381850 -86473 -9153 33670 -134674 174113 -392272 -110595 -46595 401459 -74878 -3339
8932 -259126 54864 421618 -27650 82991 -1672 204050 154146 514912 557219 1289713 6470316
8921 6470316 2298673 602709 287777 -246415 39244 217542 50238 -200174 141356 -69719
8910 -113039 161334 -133245 -172937 -240549 -329002 21973 -401835 -229672 140646 -114731
8899 -2485 -81031 -73975 -115349 74635 -95164 -103934 113352 -179789 243188 136510 80456 -92330
8886 54753 -54897 -104075 -239731 -122806 129721 -112853 -392375 186174 -124592 393420
8875 -56086 -153021 -156054 -86979 -53879 -67322 -438471 -56985 -376198 5881 78532 -80487 -55128
8863 -55128 205218 -261234 -284427 -246127 153580 -242405 -45176 -15212 -110024 24742 -1110
8851 -272375 -89159 -489978 -94814 -209429 -111553 119784 -238790 -205069 17113 -102414 194780
8839 -197226 -180564 -250064 -100621 -49355 -303279 -107840 -337349 20945 162579 -191517
8828 -102009 -82193 48933 296812 -172993 -45785 -273366 -308611 -245876 140934 -54907 68645
8816 9507 158451 69283 -135007 138379 45255 -264246 307752 19749 -217245 -107321 -107320
8805 -107320 -58170 -145232 -192895 -77173 -209301 182690 -15659 -167456 -258823 -50349 79174
8793 -129651 138444 156283 -387580 130506 242161 -308852 -48764 78127 360194 34055
8782 146911 117793 263785 73925 -238839 -53290 250280 115926 -89603 -190701 119753
8771 95592 -19707 121095 -192471 -54363 -70892 179103 267389 -258948 -147792 157727 151588
8760 151588 -214308 17406 -125466 -187169 131286 180518 -104889 -295875 60430 -68472 -150991
8749 -150991 -36651 154199 -139677 194157 -368986 -75861 223018 36005 -102032 239815
8738 106763 224192 208086 -51187 -66047 -152166 51381 -233658 38115 -80045 179960 -412560
8726 -387732 -156181 260414 -71478 -215703 -156770 -48399 -103834 -81453 -356069 -184438 -169689
8715 -169689 -140574 -300628 110830 -42576 13186 -14039 -343601 -102796 134310 32722 51193
8704 51193 281481 -298535 5425 -11861 -331157 -5895 -206660 -162787 391662 -233010 120405
8692 177631 351763 127723 -260354 -214081 230482 -190929 -106756 23228 -32237 -319411
8682 -319411 -212557 -133684 74013 74654 135126 -333189 6244 28507 -196729 139210 165459
8671 165459 -20231 -12429 111809 -191782 164577 -392895 -153355 142465 177258 -30143 218774
8659 -128764 55996 9775 -97488 32942 53419 -61111 268225 -318385 239992 183581 -103530
8647 -327940 267089 125946 -318491 -241617 76807 31098 -48175 -54148 -36342 -19976 -121313
8636 -121313 -86447 -174883 205153 40375 -7811 -98338 -331635 -285277 -389960 -107926 -273911
8625 -273911 -306473 89330 112448 -14085 -32372 -276608 -139642 -182006 -73067 -168686 11434
8613 154957 -193615 196922 478 66729 -221515 -134307 -3645 -41366 140401 64802 -163799
8601 -288531 -364754 223880 -84651 209244 353347 -107213 -52874 239034 -392296 130041
8590 -137575 35652 -30209 68105 125976 20764 -130530 135115 86935 120201 -61143 130049
8578 -276671 -383115 41914 -111003 -249315 17641 262872 108527 -212035 -52552 -36170
8568 -36170 -241340 -250984 -234484 27669 120158 -14038 -105402 -36150 70142 -61312 -8502 -298722
8556 -298722 -111023 48929 -143515 97991 -32611 89838 43459 133712 70317 -285427 -172058
8545 -172058 -43959 -89199 -99128 -115782 -114207 79187 134181 -9831 -352500 -79267 -232560 -183363
8533 -183363 -172710 -13564 83770 -389827 -277950 18693 59068 194663 -375414 94450 546253
8522 546253 34653 -204535 -133798 67613 -148295 -192575 45148 216314 167800 9573 -399533
8510 321580 -172879 102321 -157032 296976 -145950 89650 27470 -79556 -360205 -98706
8499 352698 309133 57441 161736 177540 -105325 130946 -389944 -11889 47435 -78117 -49639
8488 -49639 104725 -191862 -265066 -7210 63632 -99970 -105368 -452772 -157361 -53875 -228541
8477 -228541 158046 -112263 69826 745 58907 -186896 119822 63023 -165363 152405 -78437
8465 -376038 13717 -114216 103266 -191383 -150784 -49133 -62354 -165376 -93192 213318 126188
8454 126188 50385 -246598 201457 -83603 20796 81394 -247686 120586 -91447 135237 231127
8443 231127 265885 93437 99836 5536 66996 28313 -34491 333 -8167 -119420 -157713 224191
8430 124701 -83017 -44163 -74947 -82394 -210984 -245962 96532 -74457 -279889 -129535 296479
8418 128727 102119 40195 203398 -338868 -75248 -102572 274709 -360420 -65006 -11110 332288
8406 -98574 -89848 142127 -92771 172925 -100268 143273 -176567 75251 298734 -159899 -7455
8394 41150 -133792 -10802 -63462 218371 -207709 -153211 -28323 -69860 9804 4345 110188
8383 110188 -115369 -263110 -32361 -253177 131651 -144398 16042 237305 107087 9134
8372 -356674 -166042 -570990 41089 184423 257036 -38325 -218183 224654 -42963 -198861
8362 -198861 -212183 80676 -24503 97235 -38664 -125988 115694 -31560 36532 -16626 -182070
8351 -182070 169892 -289255 198573 30155 -102163 -42955 -131246 -159770 261610 424098
8341 424098 -133650 -232020 -162604 302235 -207157 30635 -137216 -85140 69103 -175138 52280
8329 119074 -194600 -78020 127217 31489 -180894 140285 97824 124826 -83313 -97640 -312744
8318 -312744 -192213 -163471 -342617 66331 -62402 42298 157529 47354 -26321 -41750 -119001
8307 -119001 -269176 -15659 -336611 -224018 -101508 -229413 138477 -183902 109852 53095
8296 -16961 71896 322732 54621 98707 -14052 199348 -19836 198232 -65405 -222168 -166568
8285 -166568 -54247 87206 -27043 -415437 33782 -88373 -129456 85674 63022 12092 -225446
8273 40333 -338395 -227387 106494 77006 -250025 242121 116146 -180196 -116423 -229794
8263 -229794 -211740 -282232 44601 22712 -21594 -24091 -39711 -219961 -71124 48282 -326520
8251 12946 -25138 139958 510732 177060 -338802 -177622 -146706 229946 96890 -210980
8240 -8003 84805 151037 -216111 -73810 -322241 -273309 -189597 47295 36488 4486 -198859 -310132
8228 -310132 29604 -172474 -460948 88535 -130348 254620 -78349 -106293 -72299 -57282 341985
8216 171883 -132905 113794 11209 -60452 73439 -120425 -249364 -249117 125066 78639 -295842
8204 -86216 -186330 -116123 -69863 -265788 -2948 62095 -148540 -161026 117361 39700 -181643
8192 264127 469936 28823 -313395 87918 249147 159210 42114 -121312 -119390 180568 -89941
8180 -72511 -178673 -390090 209923 -260878 -66798 26153 -342293 327693 -40881 91450 68661
8169 68661 -45173 26878 -26711 -60915 -183052 73200 -607081 154330 11724 -84538 -155411
8158 -155411 -41141 -236370 -40296 -200372 59852 123195 -150083 -191473 -147546 -37309 243707
8146 87388 -33289 -180057 -347328 -272241 -309813 -200238 64311 -206350 77015 158442 332107
8135 332107 166944 171228 -298788 -109853 -137024 -20158 245664 -85480 -160033 -8354 57390
8123 -169873 108685 -137700 -17213 74862 -145608 -87158 194412 -2194 -90500 44589 -68954
8111 80073 -85641 -358827 21736 16772 8585 -335707 -90503 -16163 188381 -371784 100538
8099 20942 85079 56482 67369 8144 -7008 -130978 -52364 366121 48343 172374 -358390
8087 -300309 78338 -11940 202256 -140825 -56389 24614 -162141 -229490 -157081 187082 -146413
8075 202187 -180153 -328697 174410 50195 -47534 -137847 -100306 -368712 -153379 136330
8064 -170575 -65048 -255182 10329 10567 -257625 -174567 23920 492865 120077 -78258 -390851
8053 -390851 8750 -59430 -216804 -135390 -26936 -20736 146750 45476 301288 142670 -364390
8041 14768 215153 -18927 -3310 -90123 -137896 -74607 113971 180128 -78557 -195347 14496
8029 -187357 -66749 -436006 -65977 -125812 1508 -22425 -39137 -216065 -97719 13145 -170180
8017 -6211 -32841 108874 -28963 148096 149382 248094 124796 -110952 -76525 -113193 273065
8005 215752 167270 -51782 103602 226719 -103016 237719 34103 203658 -436191 51841
7994 -205796 -18066 67589 -36876 -66692 -20584 -93538 17734 172357 -375244 101038 213421
7983 213421 77953 99429 -341514 -140047 71422 -22087 -180246 -234190 -245392 -205821 -28074
7971 83237 -55946 -154304 -224049 -158790 -387795 29334 19655 -27864 -149568 286466 156312
7960 156312 -85626 -105941 61587 -83936 -15155 -198215 -203105 208436 -7073 -1556 27440 -32305
7947 23395 -270380 -24204 17735 -111493 60650 -336748 -41783 -202368 67594 216994 -263265
7935 111071 58463 183134 -105751 -369920 102683 27281 -171521 -56325 -149741 -197849 -6404
7923 -244186 -148457 -395846 -240198 181143 -198625 -171912 -104687 247467 -129787 72165
7912 -120731 -66706 -173047 95969 -138344 -129070 -235074 314778 -261291 -191553 -241124 47882
7900 17150 -302735 39993 -40022 -366340 -359898 -56455 2809 -14644 -137558 -62143 -2878 10841
7887 -118878 -305322 171256 61835 22102 -154173 29140 -153347 -177674 -206857 -213229 71354
7875 -325995 119872 -63599 -186550 -121382 -236477 -244063 203132 -169889 -340722 -107761
7864 -182291 135776 96036 -137189 -193650 20127 214564 -34931 -78786 -673 90880 89948 152990
7852 152990 129289 -56265 -3656 -192818 31170 -11556 102950 -185120 -138440 134976 -153449
7840 -66765 -61927 113037 -77625 -91657 -221951 122324 25670 -243827 -182484 152616 -137162
7828 76013 54136 20870 -153792 193694 -56543 361711 -11058 36985 174317 -31885 89120
7816 -436820 119114 -139574 -123558 -116602 -59869 71312 -164891 45573 -190510 68674 -103243
7804 97528 -93313 94602 -238425 -96369 -116373 -91803 -20180 57737 -70208 10616 153428
7793 153428 -252861 33306 -7591 -401917 1973 9746 -192782 185924 36294 -54334 -49271 -29581
7781 -29581 -255266 -1576 179823 -174407 -135566 -109877 280059 202903 263671 316488 -62175
7769 -49453 107837 63287 -72252 -184102 -146868 235920 -367369 182378 -104070 -8364 -191712
7758 -191712 34387 -215286 265167 390864 200646 -191655 222603 25892 -313674 216043
7747 -132333 169311 -50832 24471 -19907 -44589 120583 148799 -77107 36497 -99899 16756
7735 -5462 -381074 -34751 -6939 45378 -183204 -15717 28193 77576 161530 -51208 -188972 49790
7722 227981 175822 -60239 -29006 96348 -71440 16174 -257558 6599 179964 -160659 -192108
7711 -192108 48688 -338571 110700 229214 -48913 -5911 -208912 -65062 -110852 -73627 75004
7699 -167187 19052 -142462 -93127 -74639 9533 -194238 91871 23779 -98720 139437 97588
7688 97588 290263 -308855 -91140 -172140 269485 -220215 -47952 8174 37636 -289139 -1043
7676 366718 190307 -138367 -169551 -128906 -422 34649 128366 -28984 -55298 -14898 -280210
7665 -280210 412284 16018 65497 -140226 61312 282675 128386 66078 -326205 -85654 220503
7653 209795 -92365 -135786 -32983 56525 -110525 13961 -38239 38766 -11291 -215203 -131015
7642 -131015 261109 215855 -71714 -63186 -144754 -332143 -273808 -100918 42075 -286963 -329622
7631 -329622 -203704 -159355 -272660 -162531 196290 -194319 131881 -42727 -92781 12577
7620 77668 -26836 171261 -353610 -132538 -46907 -48823 316428 131701 15095 62695 -77623
7608 -162977 -277013 -44319 -43828 -89783 -210652 -91360 -40060 210877 247412 -345689 -304513
7597 -304513 31503 62201 159207 -49013 -241864 -189694 16183 14066 -128822 70 -290376 -127381
7584 174497 83619 -135306 -114167 92304 94385 115706 133159 -48348 -220789 -188875 53123
7572 2960 -147670 -93486 35025 -54915 42754 25141 117877 118624 -222655 64673 -586909 -103320
7559 224051 -66878 -266601 125526 -380629 -177377 177016 -81369 -24772 170866 -34961
7548 32891 26231 -296886 127293 48817 -227689 75314 -17548 6322 -33725 271146 -59956
7536 -50923 33786 -208911 -123240 -103899 -37026 60515 -108805 3506 -176576 139873 -261017
7524 86317 -22888 324786 -358217 70161 -112009 -126128 -117447 -247617 331236 152686 -188681
7512 -232766 -43826 -36396 -182525 -209806 -370890 121828 -304106 -378083 -228586 -337821 -25048
7500 -36090 55722 58312 164642 -161363 398498 36841 -8259 -169101 -228915 -172306 -298615
7489 -298615 -73730 230655 190945 -309968 95540 -106561 -108402 159928 -97648 165104 270035
7478 270035 17455 -218945 35084 -393914 60208 64418 -33105 -4722 -17706 193768 46720
7466 -14140 -205378 -65649 159684 105707 -159961 -44732 140162 134574 47477 -133965 57705
7454 -54400 225357 282957 -191491 25540 224035 -176809 -192855 -60567 -202226 1913 -216486
7442 -93473 -300955 140437 207686 183497 293689 13953 54181 -83340 66275 -191321 37203
7430 158645 -125490 74100 -135809 -355628 -102448 -112328 -147722 46345 142765 180417 68431
7418 -190749 -213806 -52436 37469 -368346 -323623 -27147 -199916 198054 -75043 233838 -188943
7406 -134210 -128837 -45377 -14952 -135402 -132548 -71871 86599 -286652 99387 60127 36634 364751
7394 364751 -366564 -363061 33886 -380856 -183049 -177729 -349671 -104504 -103343 17680 152585
7383 152585 4101 -150990 -183537 -78359 35945 -125372 -260600 -434957 -125468 493982 60561
7371 -253363 212386 -205000 182498 187236 92474 274029 -120401 -149716 18024 -15784 112695
7359 152617 -158 195760 36039 87835 436698 -62642 2191 -200660 -114863 -70593 -8271 -22208
7347 -22208 49907 -162347 104923 -309520 -73305 -29119 31156 149653 -415278 -366639 122125
7335 213481 205072 183525 78371 445806 -215923 124378 -185488 -99511 86574 -325309 -84242
7323 -450530 184544 -72833 189584 -21611 -133867 262350 -255585 -37486 -232047 190337
7312 18720 -17499 139356 88680 240332 309752 -262231 -257598 129535 -241018 212201 -20329
7300 -122197 37098 47917 -98585 -62633 -423762 -130165 78788 20113 51149 -203083 -158169
7289 -158169 -78695 -94197 155385 30005 15022 147226 -257505 52818 229923 305360 90235
7277 45330 -214602 48729 119271 -281207 55215 54027 -280321 159846 -32180 115914 -239970
7265 -19769 -106131 -93272 208050 -298053 137732 -63562 149395 -110012 8539 -218986 -129211
7254 -129211 290828 -353734 -68915 -442694 -174260 13398 92816 -115099 5447 -35777 168439
7242 96387 7746 243850 -100430 -271838 68279 -13529 25358 -84188 38582 -55440 17033
7230 165595 405764 -351864 146031 241716 -153127 -386813 -315257 -124368 -99253 102731
7219 110823 -56943 102942 35187 -68887 348007 86230 -313732 -36429 -406021 -253131 -88008
7207 47759 341970 -155560 -45088 -12471 130159 43039 -5144 -46456 -19085 126519 -137631
7195 -148339 -94644 33962 -183785 105831 -207644 170976 -165637 144034 -187110 33141
7184 143365 35893 81847 93294 -24749 -164485 -4281 22757 162883 -125622 -16290 -13848
7173 -13848 -80242 158535 24791 -80661 177957 -42645 -169337 -99002 -483440 -99901 -114551
7162 -114551 -51930 227747 334223 240842 -303 149794 2541 69604 133211 -87332 -233172
7151 -233172 180237 14381 -43528 -318762 56957 -49977 152081 271330 -126474 -87304 -154065
7140 -154065 -62804 40026 -251923 -393581 159143 136198 -81147 99777 24270 -47904 -164321
7129 -164321 77145 -87804 -116303 230002 -473527 -198851 -9524 94489 -97301 -112456 81603
7117 165904 224290 355228 91742 258939 284067 58091 -38819 -12993 -215047 31091 -82511
7105 -25676 202094 -19538 -86787 -40575 -129841 188141 196683 136576 91075 212827 143100
7094 143100 -206527 -152975 -182689 63835 -277949 -43492 -239715 -230570 96251 -207974 -224980
7083 -224980 40180 -126889 -337746 -84448 -101128 -29473 -145704 200094 -119059 48257 81057
7072 81057 405529 -52176 -173605 51113 12837 -173538 157921 77188 37278 10689 52427
7061 52427 50689 32798 114306 240057 172760 -279020 126502 1168 41263 -58194 165476
7049 331593 -151800 99077 128168 39663 137379 -24827 55360 237257 53161 67746 -63565
7037 71197 81464 394507 -53309 -246948 31400 -250405 -91966 -268566 112974 119536 -31377
7025 150004 -247717 -56163 -195953 141278 -124827 17055 153736 -101296 -148145 -23728
7014 45386 -1759 -170141 -110745 221174 13376 -239719 -198440 53442 -169123 89143 -295778
7002 -287513 -22296 174963 -134102 -4222 -35146 -213401 -243036 -378511 59655 -384754 -137619
6990 -43769 -51004 -194697 -35879 45463 -138162 8937 65881 -108775 48108 248997 168314
6979 168314 -226508 340405 108361 9765 -224697 15641 92055 -384874 -172063 84707 -71901
6967 -117571 100656 -52369 -76275 71305 434097 -118487 54133 -173642 22162 -163537 4022
6955 305984 -355439 185159 -364385 -128435 -249707 -178072 128718 -26853 202522 117283
6945 117283 -14699 101169 165573 10668 53565 131919 -3157 42042 98821 154050 265246
6934 265246 -8751 -283956 41487 23742 104931 13741 -74957 -194672 -170371 -44365 335141
6922 119075 28873 -26491 -13508 127232 235461 167616 -73534 115853 -68576 -157848 -887
6910 -39599 -211136 426472 -138178 -24810 -14968 -206925 110900 -353229 62608 289270 -114740
6898 -170140 135690 75751 -304787 202853 -131194 -239540 112905 419181 573658 -168614
6887 -201748 145333 136379 116885 -261120 13550 268707 -83462 -25751 -93056 -85251 129691
6875 87074 -82199 -84745 -82397 76051 -325570 -19791 -67594 -128265 -214936 -185778 -54561 161703
6862 -37414 21548 -151198 130292 34715 94851 -114865 229242 -337491 17560 -110703 -257592
6851 -257592 -229622 -49870 -228159 249638 -294468 -221351 -292324 -31040 12749 75787 344106
6840 344106 -179054 -135216 33151 -16633 -7093 -253407 -276828 -238321 -265193 99064 71558
6829 71558 -209387 -216543 -79201 -230215 58061 -48208 136343 -20587 -68625 65831 -147077
6817 203962 74761 -7558 102363 114287 90514 334929 31837 -251299 -126646 -184448 -82659
6805 -7512 -28747 61180 417336 27675 -9059 19826 -1894 -298644 -106119 -81529 85102 -188966
6792 -1764 -105660 -182685 -27642 -84052 72158 28711 45726 123578 -251896 -64678 225929
6780 -199833 -68950 -244969 154834 -303037 124945 7176 79149 -112804 157699 255605 319188
6769 319188 -106187 -67268 329240 73052 -37687 191980 31004 98122 -49228 28050 303579
6758 303579 216091 -28990 -101187 -107168 -157422 6477 -79947 -46399 -107845 9630 102208 -192902
6745 99566 -235766 22954 218089 200099 35 -282635 30378 6961 -82141 -47271 26892 -386588
6732 120108 -17956 -441077 -143531 96850 215609 -125528 39637 -254856 -47443 102051
6721 24457 197490 18161 390558 33922 -603253 -171000 -42052 -10217 -46834 50223 -151852
6709 -3020 72133 -87285 -112036 223001 -232710 -140935 394922 6994 -239239 -207710 235612
6697 -82464 48432 55586 184167 -99044 57952 -79836 247119 54550 -58567 136947 -77623
6685 167103 -448387 -74377 20393 -122331 -138762 -57134 -235148 -203369 -143276 -313712 3698
6673 103791 -141295 -146983 -167379 299082 11843 -31285 -224007 -164050 -57024 319868 36203
6661 -265075 -93939 99899 -212452 -28587 -171014 168756 -36829 334394 -28371 -191946 -6019
6649 -426978 -400202 -125682 -153264 204866 62866 -90905 -184602 148910 -31573 135896 -229593
6637 -136882 30109 -106349 22592 -219110 241996 67533 157241 148035 -325575 85863 -20976
6625 129502 -105654 56053 -99762 -82013 373317 -220842 -332076 -348860 -1908 77086 124796
6614 124796 200002 -1464 175956 -24765 75595 -311370 377854 -44914 -372288 -211603 -104766
6602 -76545 -127983 284748 -16301 184108 248131 -204282 60288 -22771 72349 -63509 -11824
6590 127431 -91377 -133117 56990 -21517 -194299 -7976 -49402 -67049 483104 173914 -228574
6578 -15022 -10414 -112729 -101864 -225489 -138102 -176723 -341169 -101541 -66496 59803 -135999
6566 36790 -311892 -93834 148396 6526 42236 -273931 -51699 -300963 158086 -223850 25915
6554 422463 366478 133497 163432 116080 147920 246653 260503 257771 328715 160026 -98874
6542 -77770 -76482 -145626 172131 -69983 -45199 143162 -50541 429416 184673 197475 -56632
6530 -130837 18074 -156337 -313772 129148 -71674 -19316 -219025 133719 -94090 -210356
6520 -210356 381548 1244 -68594 157737 168420 -1337 -220659 91892 -220349 -29680 -327442
6509 -327442 -929 10247 48602 182375 -293426 146147 -179647 42196 344853 -159818 103068
6497 -29646 191298 2991 -85428 42500 -157615 -10311 52769 60407 -15894 128555 103491 211012
6485 211012 -55917 155014 -155503 -2701 -3449 -371271 36229 16675 -202388 14833 457313
6474 457313 -290668 29772 12155 -65465 -89049 134662 127650 -160988 -94927 69284 -29811
6462 -171300 -117160 -245741 -108537 -285706 123990 -50309 -170065 31232 63602 -11141 165853
6450 -115779 112932 -270746 161290 -65873 40270 238520 211427 -235105 -126213 -238582
6440 -238582 -45505 243871 -153953 188873 185709 -319363 -21128 199148 -84490 301163 108125
6428 33816 -15615 112082 -155226 -306822 -30391 -26161 -130651 65594 96595 77591 324096
6417 324096 333417 93720 -66471 77737 -180318 -275079 -246871 -280277 -151644 -219528 -237022
6406 -237022 22049 31467 -14491 -47777 33776 130885 53592 7039 -5862 -134090 104421 -73620
6393 -197705 -146135 -165775 245614 -216226 216472 -123288 230427 -209268 -42875 -81645
6383 -81645 6900 52784 -388180 71236 -19197 -127008 -157848 -274140 -213201 50057 -333223
6371 -223691 -95479 -89905 143472 94142 -38397 249776 -2132 368240 246676 41928 -89056
6359 152059 -29239 -93781 -200433 124346 -301144 -268655 -281232 -269799 -153411 158410 -175591
6347 -31363 -129906 78716 126240 -104002 -10343 -356168 186522 146357 218113 -53205 33118
6335 318419 -132970 -176810 86080 -6050 146839 -157072 -84712 -336344 102978 63940 16123
6323 187976 -141275 -244707 83608 273761 -80255 -124917 6528 233799 -223471 -110038 -20128
6311 -229012 1340 334922 -41469 -123175 -182071 80757 135067 57934 -139675 133450 120967
6300 120967 -351073 69978 -168747 -44743 153880 -142132 26394 119357 14678 -90659 56163
6288 -82088 -115070 -276427 -170032 27771 53832 -118568 -24754 159313 70795 -162588 2709
6276 -94801 75629 21452 146728 215371 284 -65818 84096 -165892 6078 118844 -185476 173762
6263 213576 -430547 99732 -227338 108732 148234 -157666 122674 299239 -131518 -86581
6253 -86581 64617 9664 -198069 216379 51199 117379 200728 213191 -165836 -261305 18506
6241 375664 177944 115852 86191 71875 195260 -173848 40092 -301271 -15233 -298696 -258884
6230 -258884 -130522 93170 -234566 25065 28735 -85560 -294081 160281 -23759 79102 -310483
6218 -33718 -36698 -203957 337347 14037 -290459 -104993 -50377 268398 -207089 428817 -180203
6206 -9211 36369 73265 -61324 -90590 67005 -78297 -106809 207574 117722 52913 17768 257221
6194 257221 126853 -322523 311827 220718 -109639 174023 10501 344742 221050 -258785
6183 -316635 -93459 -290352 159417 -203740 -461151 329772 -118822 -369443 -142171 -272546
6173 -272546 -86656 54735 100471 164923 182449 -304014 97243 -200047 86485 -95656 -367547
6162 -367547 -223950 95707 -105133 86437 40989 134561 255710 -36829 -167404 53352 -225507
6150 -157195 44879 -39556 -267654 -113133 -57281 -47591 20602 86614 -316931 250657 42882
6138 -161703 -161065 37446 -168314 324225 -120487 -210668 -262164 44658 -24244 -306677 87736
6126 -101044 80797 136362 34167 102764 -114692 -195802 140635 -148682 -243783 -81881 -6152
6114 -297160 -297280 118755 97512 -142583 83474 -372080 207669 -44449 -133591 -13198 -27177
6103 -27177 -299775 -207169 -71868 109868 177334 -30239 300733 -74956 142133 -72730 -139590
6092 -139590 -91686 124578 -91103 79819 -19578 256697 189913 -13210 105124 -67005 -19748
6080 313396 -5883 -6247 38613 194559 42151 255823 316284 186701 28032 113283 18813 69788
6068 69788 9039 -115881 -111044 -58193 -286616 -19787 47237 -105618 -44042 -216606 214524
6056 91706 -96751 213765 117544 -175255 -215144 213085 -82081 454704 -45114 -315695 -118018
6044 -189384 139928 -210028 -187777 156744 -1226 -251439 252401 40975 40893 175974 223223
6033 223223 -112067 117798 33100 -58841 131446 -249524 -16806 53848 337629 310671 -160365
6021 -144895 158794 -13763 5696 119657 -208900 -236647 40295 304542 75947 19340 72802
6010 72802 168983 -72061 -222904 65534 59787 -253933 156655 -186570 8710 140920 385576
5999 385576 -58956 -2414 177293 -446315 196169 194840 -300833 -165306 78194 -60342 -126064
5988 -126064 -267214 201622 -147082 -65456 72314 -342249 70595 -104329 -161429 139541
5977 -153544 34006 194337 122067 -127017 140141 152388 -197369 -20510 -231363 133508
5966 33813 235555 -95470 -79275 2618 223007 -104048 193036 120758 319849 193023 88853
5954 98493 17474 -400269 -293835 101251 -28322 -269184 -196683 119593 -102258 -215069
5944 -215069 -162955 4512 -25825 117444 29432 298448 60498 24186 -240708 -54860 -193463
5933 -193463 58539 -15751 -138977 103710 -76170 -25218 127677 -29290 -202968 -103203 118237
5921 195022 -146716 -52354 46445 -59297 -248489 -3550 -213655 134144 230871 273542 -81526
5909 110456 300789 -46359 -99161 -71301 46005 100511 76341 -229756 -63725 110884 -276483
5897 24118 -35134 226226 -147110 -127673 244485 86836 378800 175919 -309936 97084 42820
5885 -86647 38067 -66098 101834 17694 135672 81624 -64320 99112 -168130 207984 161074
5874 161074 -315362 -141522 380817 54025 182144 236702 -324986 5113 49997 -26996 172449
5862 93900 10109 25639 -75418 199453 -84886 -1985 -51479 485672 -393428 130166 120227
5851 120227 134869 28214 25149 -264660 43806 -81355 -416210 118827 -228771 -33046 -240720
5840 -240720 -34870 -511977 -38746 -84276 284501 -367726 -126177 98626 -183590 -126081 15948
5828 -2963 41827 130408 155665 13417 -281803 231764 -165971 -140492 -275348 261381 68238
5816 162353 -6540 -145930 147591 27489 26123 94107 -15112 316788 -143060 161739 54265
5804 -91549 175381 60286 -104997 10161 -114532 17131 -139829 -168734 256167 -6652 258331
5792 -78348 418411 46248 -100749 142092 -172473 -90825 -184124 -328169 135222 -112780
5781 53842 55986 -58 -17846 -94852 167837 -121373 160883 -101541 321853 357099 68447 110274
5769 110274 306562 4390 -250663 6867 199493 542718 -353526 62746 136092 -7759 -90067
5758 -90067 68181 26139 57453 184095 -88112 21804 -285028 151369 -199943 222544 -47623
5746 -152553 108558 128957 7077 127654 415 -89274 -130799 -147821 146218 193692 -77114 167047
5733 -69745 25110 -403953 32876 -470540 -199676 -177682 147226 -64401 -278206 -426 -177088
5722 -177088 -325246 -15918 52423 100981 -74242 157386 -186175 -131843 194887 -126109 95929
5710 -339141 233901 -127980 4349 89080 26113 284806 -145552 158415 190988 36150 -95201
5698 67110 83197 -96738 190556 330915 338642 -240166 61729 -220058 22633 404910 75994
5686 -136664 -1933 -213124 104638 182232 -168079 286875 -274339 -232470 -189621 333375 -116669
5674 213112 110807 210560 -193631 89949 -51589 159476 -285478 59281 -142825 -97129 -185116
5663 -185116 -184599 -291690 -39437 -75081 45381 -68225 -164775 -89899 66018 -64316 148582 222893
5651 222893 -364772 188715 210969 136873 47350 -157296 132085 -104839 114833 379990
5641 379990 -87893 -276298 -17902 18557 -36046 27002 239915 56981 93426 -260643 190205
5629 372077 -116592 210947 -200714 -264707 22235 176012 231484 -203989 197211 11144
5618 -379646 12239 -72769 -54930 -309789 26423 327314 154837 138911 84401 -394489 61471
5606 281679 -61330 -113654 23410 -230384 208393 -171833 -69328 -57418 70710 -22293 -53783
5595 -53783 -291263 -17545 -303896 124692 -114319 43274 -70736 219021 -66638 162667 -159398
5583 -73846 -30002 321831 -123756 103296 -347884 -69449 69990 -151401 -175960 95330 171842
5572 171842 -96872 174004 46894 56367 -126844 1557 -59269 -49291 260655 -245868 39069
5560 163465 -166652 401320 22444 -302836 -113047 -16932 -45707 -99927 -132181 -263809 238604
5548 -3527 -342446 169393 119401 90196 397133 -18180 67516 -106585 161849 5181 108237
5537 108237 235269 -109141 -333711 297876 -354555 42186 77891 -135108 -4123 -73554 93150
5525 111411 -104155 76324 14362 91395 -69716 -280296 -75469 289629 122665 167032 291774
5514 291774 -154591 -46223 68944 4288 249237 -125729 99891 -36579 30058 -184226 -23524
5502 246033 240551 355685 -143288 16534 -14904 -108900 19979 -27227 -126864 -239496 92707
5490 46727 -4551 -2531 -192868 -45366 -399058 -155446 -100516 -235842 75836 -109620 -207030
5479 -207030 -31582 214025 -63954 45277 167399 67145 134949 -293978 -178903 58191 54905
5468 54905 48588 -212656 85815 -288156 -311052 183361 130201 46382 -143590 -76744 198566
5456 -47612 -17873 167217 158981 -208722 467269 82110 -326516 8648 165815 -309468 123294
5444 173780 -44932 -204215 -277890 218629 -262224 -338827 -42687 7188 -46975 -81186 174738
5432 -22275 90859 19487 376478 180703 100949 128915 -192149 69804 -220048 67790 151919
5421 151919 13214 196922 158478 203996 -2926 438788 91203 -54514 100700 357708 119321
5409 188267 -33475 -81860 -128795 70156 281387 -23984 234462 164441 -220758 329898 -116298
5397 154352 -80273 -9773 -4343 -167984 -173413 -277543 270314 -176794 63452 100063 1129 21318
5385 21318 -204848 -34404 -268675 53565 2780 36482 152930 115872 282007 72406 46923
5374 46923 -259718 -52626 64891 -8897 7681 16315 101633 -128371 300642 258915 199152 -229970
5361 143697 172176 -219932 -168120 154432 -517908 220831 80859 -218373 -114584 -15335
5350 105083 -57121 -142806 -156463 -410805 -132423 57333 92126 -118227 -217474 -367921 -192188
5339 -192188 -35649 102329 42091 -132812 105539 126181 -198335 -31809 99686 262275 131272
5328 131272 39141 65948 63580 43881 9085 372559 -114190 194721 -7689 -145004 82745
5316 84710 171619 147310 -128957 -515 -206564 -167919 -88853 -49156 280399 -143357 191066
5304 -177498 156535 -115646 -78577 -24773 -134576 -159445 261874 32947 -79443 -62380 258538
5292 53008 -218538 -144566 56940 -31714 -150905 289359 62250 96947 142100 280780 -132532
5280 136163 145237 -57866 181460 11219 17008 227445 -130918 -50122 -186587 -66467 -2373
5268 -30194 -62273 -104432 321932 -117740 -297045 288687 -51385 -322479 -74668 37172 -173985
5256 206590 -1042 210968 -77966 290634 148829 8326 104166 451086 -150659 -15904 -82802
5245 -82802 -326556 -271928 -179883 -217519 70749 187597 -271527 44338 -6631 158020 -94341
5233 45211 -150205 -124693 -179963 10657 135249 -325183 -34894 -79613 -76644 293991 241869
5222 241869 183236 -339614 176636 -200826 34857 -168171 -1539 -170647 -137601 171641 -188697
5210 7531 -116573 74560 5891 -67382 -59121 -164152 -3838 -8387 -307324 64404 32560 20016
5198 20016 185169 -47579 -143807 37448 99908 -158909 -71227 276558 -4767 44436 -50115
5186 100396 -91134 198131 -161176 -136320 -71826 51572 150946 -394524 -95650 37728 319966
5175 319966 -49379 55332 -120914 130144 -113915 75996 119092 -86725 -114449 -549884 362841
5163 -223101 -375386 -356990 -197927 -49326 43103 -88151 -430423 217482 85543 -54437 -177328
5152 -177328 217270 83069 132537 -153589 159998 156448 239057 -135854 -311568 -43920 -206079
5141 -206079 -48723 -20279 25399 -59718 -97334 217092 -22867 -3009 20103 88029 -149321
5129 258842 79502 -6967 -55399 251005 155128 -33016 -209278 12280 -228919 178441 -592637
5117 -248841 -161459 20816 -183571 198962 -292046 130648 125128 129785 155740 -19836 -2910
5105 -100249 -11939 -100603 27411 23991 -1575 -34198 172284 97441 -67249 181046 10316 109804
5093 109804 50530 -190745 -268038 -164352 -378099 -213564 260004 174605 141552 -166116
5082 137270 303322 116082 -118802 91299 5247 -66500 375186 -263011 68194 171353 51435
5070 108807 -93276 -14150 -180405 93772 221873 -46119 273631 -176617 74555 325866 -116548
5058 -131134 81577 -75336 -41724 154411 87819 137189 110564 212259 22818 68587 109733
5047 109733 -196463 43855 92325 -335487 125751 153869 118264 -88062 214885 -100117 324684
5035 -23298 256366 -11121 -75284 -254503 127765 29499 -36605 -188192 -263513 -188887 -102942
5024 -102942 -112563 162242 219914 -81790 73059 -66280 21595 154639 26456 64517 15455
5012 20786 73156 175803 106615 79129 173303 -152859 -204155 1225 27532 -4095 99725 535242
5000 535242 20253 -134817 134093 -101580 -492256 10349 -111396 186136 168771 96700
4990 96700 -28716 -113174 -199670 144754 234175 -219710 -44277 19053 87006 9212 -82556 322428
4977 -174063 -209376 -238498 243862 -14328 -101782 -337624 -260440 12419 36476 -17567 -3149
4965 130091 -115548 131985 418083 151548 151963 90703 174149 -22644 52559 -180299 114219
4953 -184813 287593 -472084 -178956 -73847 -61772 261895 163320 89319 286942 361911 238691
4942 238691 -197132 188669 -319159 -56997 -121198 21314 118750 80730 -444850 -269938 -15233
4930 -76062 -1795 -394463 -59255 51203 242383 -82326 -47893 117852 -161744 -156036 -57808
4918 -147610 204036 12928 -66674 -3307 -365378 178859 162609 90689 166599 -94911 -88547
4907 -88547 156449 -42953 157634 -188006 -44096 195267 -28231 -104058 272979 -120701 118563
4895 66130 -35669 18705 -24784 179317 174761 -162358 -51441 -33754 45717 103996 124427 77193
4883 77193 73231 -94673 -237881 192347 252138 -207219 160948 24147 155066 24507 -186246
4871 -141271 -126235 -215177 134246 -11442 109615 220331 171230 -217949 100277 327708
4861 327708 -111841 -26275 121826 125887 113338 211625 -38517 49954 185446 -285448 229239
4849 -39853 822 -34813 -160521 70715 -115768 302936 110694 -300416 111886 -43705 -149696
4838 -149696 -81548 -262346 -30134 -100782 -67869 -41987 -215419 -265727 4381 -76614 -19686
4826 -453006 138534 15516 35828 -97044 -201237 -101788 -39813 -80611 -176667 80923 -68286
4814 -130195 244379 -142040 19739 -108463 45653 -163430 130919 -64655 40062 -351393
4803 95086 -124818 170462 -35421 -92168 -46897 -276025 93805 156795 43719 -151937 9242
4791 240558 39027 228083 -240112 -172051 106945 -76328 -203682 -66021 162553 -19386 122139
4779 -270054 361324 1482 -263025 1838 160149 -42939 347687 -203265 195420 284316 144003
4768 144003 -97385 -94402 -64968 135601 38017 -191160 -212881 -138100 18537 -57723 99215
4756 342294 143598 2876 -113181 -433503 276255 -16145 -49962 59845 6082 -56173 269171
4744 -111758 51617 -107886 22484 -21448 191315 312852 28794 -115354 34236 -66337 84149
4732 -55866 11238 2641 67404 -18437 -38680 30493 -34032 -326940 -156540 289544 -141661
4720 299215 135544 447965 112021 -108028 21056 743 78713 -58892 -155798 -53585 -208949
4709 -208949 -56058 144114 29403 -37788 73670 181310 -322428 67697 96857 -87594 46797
4697 122896 259509 -108523 -298797 -67587 85287 73816 158291 -16679 -241791 -5712 189954
4685 45200 223055 -60875 7897 -98198 -239349 -268205 -103933 -2584 258299 44587 190351
4674 190351 150332 -283859 120262 -137282 -172487 -77530 -119177 -180575 353214 51524 -34465
4662 -25314 206490 -290913 -180065 -130291 -175622 365016 -20892 -210639 70280 230063 136928
4651 136928 -180618 -108813 -68798 -161887 309928 20677 133041 -16468 270010 -106138 229955
4639 -117936 -22026 -241316 121793 126456 314781 -23034 -5868 -284536 101047 -209538 -58178
4627 131193 -111325 311962 54995 43287 -213362 158742 -129745 143607 113319 2807 -43208
4615 -150669 -124111 -161255 211952 -220102 104395 253662 -171583 148592 33387 -255792
4604 110540 -136870 23743 -114965 423868 134269 -568512 -78191 230421 30995 -232353
4593 216676 153299 22591 155368 353677 30305 25437 12644 -152656 11832 -10204 102498
4581 282577 -112379 -180126 -52675 127100 -190749 -73218 -114725 212347 -73756 -229718 190692
4569 198190 266896 26646 79613 -203629 161148 35359 265735 48775 -113733 98716 -37741
4557 -20273 364350 79335 -215370 171746 -64044 71415 249324 -51929 -228981 -42172 -199672
4546 -199672 -61286 212178 -12868 77789 13381 195399 -83467 -124588 278687 38691 122719
4535 122719 -8146 -114637 95666 -29172 -226485 5685 -96029 242191 60270 -138446 -121046
4524 -121046 28299 -200738 -6069 -209113 -181371 64589 189638 5472 2817 -105714 -199190
4513 -199190 -26921 -82491 -180906 -332719 -154796 -268881 -106741 -77107 -295420 -245395 267923
$$ [...]
##END NTUPLES=NMR SPECTRUM
##END=
