
##TITLE=AC1322_SRiAH12151_6535593_kv7ONBTHMZ
##JCAMPDX= 6.0         $$ Bruker NMR JCAMP-DX V2.0
##DATA TYPE= NMR SPECTRUM
##DATA CLASS= NTUPLES
##ORIGIN= BRUKER
##OWNER= Administrator
$$ 1.72 TOPSPIN		Version 2.1
$$ 2012-07-18 00:38:13.000 -0500  Administrator@TOPSPIN
$$ Compression mode = diff/dup
##.OBSERVE FREQUENCY= 400.02188249412
##.OBSERVE NUCLEUS= ^1H
##.ACQUISITION MODE= SIMULTANEOUS (DQD)
##.ACQUISITION SCHEME= undefined
##.AVERAGES= 64
##.DIGITISER RES= 22
##SPECTROMETER/DATA SYSTEM= spect
##.PULSE SEQUENCE= noesygpps1d.comp
##.SOLVENT NAME= COFFEE_meoh
##.SHIFT REFERENCE= INTERNAL, COFFEE_meoh, 1, 14.9607
##AUDIT TRAIL= $$ (NUMBER, WHEN, WHO, WHERE, PROCESS, VERSION, WHAT)
$$ ##TITLE= Audit trail, TOPSPIN		Version 2.1
$$ ##JCAMPDX= 5.01
$$ ##ORIGIN= Bruker BioSpin GmbH
$$ ##OWNER= Administrator
$$ $$ C:\Bruker\TOPSPIN/data/COFFEE/nmr/AC1322_SRiAH12151_6535593_kv7ONBTHMZ/12/pdata/1/auditp.txt
$$ ##AUDIT TRAIL=  $$ (NUMBER, WHEN, WHO, WHERE, PROCESS, VERSION, WHAT)
(   1,<2012-07-18 00:38:08.328 -0500>,<Administrator>,<TOPSPIN>,<go>,<TOPSPIN 2.1>,
      <created by zg
	started at 2012-07-18 00:26:37.984 -0500,
	POWCHK enabled, PULCHK disabled,
       configuration hash MD5:
       6B 1B 68 BB D9 2E 58 E2 7F 35 AD 54 07 DF 0E 41
       data hash MD5: 64K
       16 FA 46 63 07 99 A1 4E CA 1C A4 C8 B9 A7 12 F3>)
(   2,<2012-07-18 00:38:11.046 -0500>,<Administrator>,<TOPSPIN>,<proc1d>,<TOPSPIN 2.1>,
      <Start of raw data processing
       efp LB = 0.3 FT_mod = 6 PKNL = 1 PHC0 = 0 PHC1 = 0 SI = 128K 
       data hash MD5: 128K
       B5 E6 75 05 CB E9 27 36 09 64 0C C9 D3 EA A6 D4>)
(   3,<2012-07-18 00:38:12.203 -0500>,<Administrator>,<TOPSPIN>,<proc1d>,<TOPSPIN 2.1>,
      <pk PHC0 = 2.625732 PHC1 = 0 
       data hash MD5: 128K
       74 E5 A1 DF CE 7C C8 BE C5 9F CD F6 1A 84 97 F3>)
(   4,<2012-07-18 00:38:12.437 -0500>,<Administrator>,<TOPSPIN>,<proc1d>,<TOPSPIN 2.1>,
      <abs ABSG = 1 
       data hash MD5: 128K
       5E 14 BF 03 C1 CE 36 39 FB 68 D3 1C B8 E4 76 69>)
(   5,<2012-07-18 00:38:12.500 -0500>,<Administrator>,<TOPSPIN>,<proc1d>,<TOPSPIN 2.1>,
      <abs ABSG = 2 
       data hash MD5: 128K
       21 6A EC 5A 44 AE DA 7B 93 4E 43 B5 96 2E 57 FE>)
(   6,<2012-07-18 00:38:12.593 -0500>,<Administrator>,<TOPSPIN>,<proc1d>,<TOPSPIN 2.1>,
      <abs ABSG = 3 
       data hash MD5: 128K
       8E 6A 37 43 51 74 5B 7B 1B AB FF C7 05 6B 59 24>)
(   7,<2012-07-18 00:38:12.843 -0500>,<Administrator>,<TOPSPIN>,<proc1d>,<TOPSPIN 2.1>,
      <abs ABSG = 4 
       data hash MD5: 128K
       C7 7C 97 F8 24 6F B8 6B B9 1B 63 0A AB 46 54 E2>)
(   8,<2012-07-18 00:38:12.906 -0500>,<Administrator>,<TOPSPIN>,<proc1d>,<TOPSPIN 2.1>,
      <abs ABSG = 5 
       data hash MD5: 128K
       F2 19 E7 96 A5 A9 83 B4 04 47 DB A7 60 26 07 2A>)
$$ ##END=
$$ 
$$ $$ hash MD5
$$ $$ A1 17 82 89 5B 93 63 07 2E F5 7B 44 B1 91 90 36
##$RELAX= 
##$RELAX= 
##$RELAX= 
##$RELAX= 
##$RELAX= 
##$RELAX= 
##$RELAX= 
##$RELAX= 
$$ Bruker specific parameters
$$ [...]
150 150 150 150 150 150 150 150
##$TP07= 0
##$TPNAME0= <>
##$TPNAME1= <>
##$TPNAME2= <>
##$TPNAME3= <>
##$TPNAME4= <>
##$TPNAME5= <>
##$TPNAME6= <>
##$TPNAME7= <>
##$TPOAL= (0..7)
0.5 0.5 0.5 0.5 0.5 0.5 0.5 0.5
##$TPOFFS= (0..7)
0 0 0 0 0 0 0 0
##$TUNHIN= 0
##$TUNHOUT= 0
##$TUNXOUT= 0
##$USERA1= <user>
##$USERA2= <user>
##$USERA3= <user>
##$USERA4= <user>
##$USERA5= <user>
##$V9= 5
##$VALIST= <valist>
##$VCLIST= <CCCCCCCCCCCCCCC>
##$VD= 0
##$VDLIST= <DDDDDDDDDDDDDDD>
##$VPLIST= <PPPPPPPPPPPPPPP>
##$VTLIST= <TTTTTTTTTTTTTTT>
##$WBST= 2048
##$WBSW= 25
##$XGAIN= (0..3)
0 0 0 0
##$XL= 0
##$YL= 0
##$YMAX_a= 12217467
##$YMIN_a= -9220798
##$ZGOPTNS= <>
##$ZL1= 120
##$ZL2= 120
##$ZL3= 120
##$ZL4= 120
##$ABSF1= 14.9607
##$ABSF2= -5.597482
##$ABSG= 5
##$ABSL= 3
##$ALPHA= 0
##$AQORDER= 0
##$ASSFAC= 0
##$ASSFACI= 0
##$ASSFACX= 0
##$ASSWID= 0
##$AUNMP= <proc_prof1d_extract.lims>
##$AXLEFT= 0
##$AXNAME= <>
##$AXNUC= <1H>
##$AXRIGHT= 0
##$AXTYPE= 0
##$AXUNIT= <>
##$AZFE= 0.1
##$AZFW= 0.1
##$BCFW= 0
##$BC_mod= 0
##$BYTORDP= 0
##$COROFFS= 0
##$CY= 15
##$DATMOD= 1
##$DC= 0
##$DFILT= <>
##$DTYPP= 0
##$F1P= 0
##$F2P= 0
##$FCOR= 0.5
##$FTSIZE= 131072
##$FT_mod= 6
##$GAMMA= 0
##$GB= 0
##$INTBC= 1
##$INTSCL= 1
##$ISEN= 128
##$LB= 0.3
##$LEV0= 0
##$LPBIN= 0
##$MAXI= 10000
##$MC2= 0
##$MEAN= 0
##$ME_mod= 0
##$MI= 0
##$NCOEF= 0
##$NC_proc= -2
##$NLEV= 6
##$NOISF1= 0
##$NOISF2= 0
##$NSP= 0
##$NTH_PI= 0
##$NZP= 0
##$OFFSET= 14.9607
##$PC= 1
##$PHC0= 2.625732
##$PHC1= 0
##$PH_mod= 1
##$PKNL= yes
##$PPARMOD= 0
##$PPDIAG= 0
##$PPIPTYP= 0
##$PPMPNUM= 2147483647
##$PPRESOL= 1
##$PSCAL= 4
##$PSIGN= 0
##$PYNMP= <proc.py>
##$REVERSE= no
##$SF= 400.020009755845
##$SI= 131072
##$SIGF1= 0
##$SIGF2= 0
##$SINO= 400
##$SIOLD= 131072
##$SPECTYP= <>
##$SREGLST= <1H.CDCl3>
##$SSB= 0
##$STSI= 131072
##$STSR= 0
##$SW_p= 8223.68421052631
##$SYMM= 0
##$S_DEV= 0
##$TDeff= 65536
##$TDoff= 0
##$TI= <>
##$TILT= no
##$TM1= 0
##$TM2= 0
##$TOPLEV= 0
##$USERP1= <user>
##$USERP2= <user>
##$USERP3= <user>
##$USERP4= <user>
##$USERP5= <user>
##$WDW= 1
##$XDIM= 131072
##$YMAX_p= 447261157
##$YMIN_p= -12732
##$CURPLOT= <Network HP LaserJet P1505>
##$CURPRIN= <$Network HP LaserJet P1505>
##$DFORMAT= <normdp>
##$LAYOUT= <+/1D_H.xwp>
##$LFORMAT= <normlp>
##$PFORMAT= <normpl>
##$SURQMSG= 1
$$ End of Bruker specific parameters
$$ ---------------------------------
##NTUPLES= NMR SPECTRUM
##VAR_NAME=  FREQUENCY,     SPECTRUM/REAL,   SPECTRUM/IMAG
##SYMBOL=    X,             R,               I
##VAR_TYPE=  INDEPENDENT,   DEPENDENT,       DEPENDENT
##VAR_FORM=  AFFN,          ASDF,            ASDF
##VAR_DIM=   131072,        131072,          131072
##UNITS=     HZ,            ARBITRARY UNITS, ARBITRARY UNITS
##FACTOR=    0.0627417313425164, 1,          1
##FIRST=     8223.62146879497, 1184,         -60504
##LAST=      0,             3061,            -60772
##MIN=       0,             -12732,          0
##MAX=       8223.62146879497, 447261157,    0
$$ Real data points
##PAGE= N=1
##DATA TABLE= (X++(R..R)), XYDATA
$$ [...]
63905A769010j26444j10746r6468q4512p4994o6803n9001n1901m6187m1727l7873
63894I72354l4346l1287k8854k7236k6544k6234k5315k3619k2136k1496k0834
63883F84453j9029j6427j4253j2751j1038q654o065l676j344Q55K458L523M913
63870F02965P202R928J2363J4376J6014J6894J6678J5867J5375J5387J5224J4374
63858G72647J3135J2044J1052R585P302M498J782m93k362m038n748p710j0046
63845H01648j2581j4897j6686j8041j9304k0709k2168k3327k3838k3691k3294
63834E83112k2993k2583k1607k0129j8807j8011j7321j6242j4964j4021j3413
63823C83021j2625j1407j0063q878p794o712n823n432n573n884n762m799l275
$$ plain form
63905 1769010 1642566 1531820 1435352 1350840 1275846 1209043 1150042 1098141 1051954 1010227 972354
63894 972354 938008 906721 877867 850631 824087 797853 772538 748919 726783 705287 684453
63883 684453 665424 648997 634744 621993 610955 602301 596236 592560 591216 592071 594529 598052 602965
63870 602965 610167 620095 632458 646834 662848 679742 696420 712287 727662 743049 758273 772647
63858 772647 785782 797826 808878 818463 825765 830263 832045 831552 829190 825152 819404 811694 801648
63845 801648 789067 774170 757484 739443 720139 699430 677262 653935 630097 606406 583112
63834 583112 560119 537536 515929 495800 476993 458982 441661 425419 410455 396434 383021
63823 383021 370396 358989 348926 340048 332254 325542 319719 314287 308714 302830 297068 292269 288994
63810B88994k091j889k268k258j541p55n36p03p10n29o28j229j931k161j756j091
63794B66918p57j122k038k949l368l264k925k534k120j904k293l242l932l518
63780B30952k195j037p16q60q07m80j54J17L12O4p67j413r24L98J136N63m85q78
63762B22826n94l52n00q39j165j356j211p41l80m16m48M7Q97J496J677J704J561
63745B22206R94K35L1P58K010L137L733L574K740J897J827K373K476J613O60P23
63729B50987J617K211K042J832K362L445M300M531M442M591N234O046O297N534
63715C05471M135K982K374J613j1k047l279l230k692k597k918l031k671k032j264
63700B90803n27l45j113k213k322q88J258K943L779L960L578K755K058K082K707
$$ plain form
63810 288994 286903 285014 282746 280488 278947 278192 277656 276953 276243 275714 275086 273857 271926 269765 268009 266918
63794 266918 266161 265039 263001 260052 256684 253420 250495 247961 245841 243937 241644 238402 234470 230952
63780 230952 228757 227720 227004 226144 225337 224857 224703 224820 225132 225196 224429 223016 222092 222490 223626 224189 223704 222826
63762 222826 222232 221880 221380 220541 219376 218020 216809 216068 215688 215272 214824 214871 215768 217264 218941 220645 222206
63745 222206 223200 223435 223466 224224 226234 229371 233104 236678 239418 241315 243142 245515 247991 249604 250264 250987
63729 250987 252604 254815 256857 258689 261051 264496 268796 273327 277769 282360 287594 293640 299937 305471
63715 305471 309606 312588 314962 316575 316564 314517 311238 308008 305316 302719 299801 296770 294099 292067 290803
63700 290803 290276 289931 288818 286605 284283 283395 284653 287596 291375 295335 298913 301668 303726 305808 308515
63685C08515L281L457L427L324K869J834N27l69l40N35J581J948J223j85j359
63670C30268j580p84N12J661K269K316J932J172N3j281k610l708m249l876k802
63655C19293k104k782m488n780n790n005m277l776l306k894k495j702m08P45J207
63640B76438J385J881K357K088J336J166J935K916L499L869M303M651M832N162
63626C17818N804O443O842P162P526P812Q216R327J1206J2933J3728J4110J5295
63613D44222J7605K0149K1989K3172K4478K6533K9295L2100L4189L5263L5503
63602G44498L4930L2875K8480K1795J4084O918J076l493o870q699q673p293n832
63589H43796n493o721r263j2671j6540k0480k4133k7174k9157k9581k8286k5804
$$ plain form
63685 308515 311796 315253 318680 322004 324873 326707 327234 326865 326525 327060 328641 330589 331812 331627 330268
63670 330268 328688 327904 328416 330077 332346 334662 336594 337766 337819 336538 333928 330220 325971 322095 319293
63655 319293 317189 314407 309919 304139 298349 293344 289067 285291 281985 279091 276596 274894 274486 275231 276438
63640 276438 277823 279704 282061 284149 285485 286651 288586 291502 295001 298870 303173 307824 312656 317818
63626 317818 323622 330065 336907 344069 351595 359407 367623 376950 388156 401089 414817 428927 444222
63613 444222 461827 481976 503965 527137 551615 578148 607443 639543 673732 708995 744498
63602 744498 779428 812303 840783 862578 876662 883580 884656 881163 874293 865594 856921 849628 843796
63589 843796 838303 831582 822319 809648 793108 772628 748495 721321 692164 662583 634297 608493
63577F08493k3100k0860j9074j7224j4813j1845q901o625m984l269r44J664L794
63564D82312N084N765O230O744P446Q223Q679Q582Q328Q619R692J1190J2775J4554
63550F04223J6818J9665K2998K6634L0515L4882M0124M5969N0695N1570M6539
63539I90632L5757K1709P806l371j0968j5349j6951j5943j2881r084o018m538
63527I60801m983p494j1833j7243k2968k8654l3817l7456l8862l8522l7523l6261
63515F45185l4445l1992k9130k5845k2186j8940j6949j5788j4174j1844r820q664
63503D05408p738o671o194o655o888n732l875k897k977k872j927q91n81p86q60
63488C47864n93j74J82K97J49J72R83K512L808M057L546L208L390L528L065K268
$$ plain form
63577 608493 585393 564533 545459 528235 513422 501577 492676 486051 481067 477798 476854 478518 482312
63564 482312 487396 493161 499391 506135 513581 521804 530483 539065 547393 556012 565704 576894 589669 604223
63550 604223 621041 640706 663704 690338 720853 755735 795859 841828 892523 944093 990632
63539 990632 1026389 1048098 1055904 1052533 1041565 1026216 1009265 993322 980441 971357 965339 960801
63527 960801 955818 948324 936491 919248 896280 867626 833809 796353 757491 718969 681446 645185
63515 645185 610740 578748 549618 523773 501587 482647 465698 449910 435736 423892 414072 405408
63503 405408 397670 390999 384805 378150 371262 365530 361655 358758 355781 352909 350982 350091 349510 348724 347864
63488 347864 347271 347097 347279 347576 347725 347897 348880 351392 355200 359257 362803 366011 369401 372929 375994 378262
63472C78262J799J659J148j16j533k287k399k565l093l605l784l785l795l661
63458C52245l274k834k452j865q53L48J321J921K201K250K366L087M581O214P149
63443C72405P266P218P598Q435R469J0617J2015J3729J5680J7960K1156K5814
63431E29362L1186L4902L4621L0229K3880J7805J2671Q231M810L426M696Q173
63419G43992J2723J7366K1864K6666L2071L7456M1655M4026M4529M2719L7563
63408A102630K8837J8035P375j687q522j2685j4113j3604j2280j0805r713j0081
63396A063387j2826j7558k2929k8083l2903l6909l9155l9454l8760l7801l6147
63385G20862l3245k9678k6559k4026k1212j7688j4215j1804j0483r278p269m411
$$ plain form
63472 378262 380061 381720 382868 382752 381219 378932 376533 373968 370875 367270 363486 359701 355906 352245
63458 352245 348971 346137 343685 341820 340967 341315 342636 344557 346758 349008 351374 354461 359042 365256 372405
63443 372405 379671 386889 394487 402922 412391 423008 435023 448752 464432 482392 503548 529362
63431 529362 560548 595450 630071 660300 684180 701985 714656 722887 727697 731123 735819 743992
63419 743992 756715 774081 795945 822611 854682 892138 933793 977819 1022348 1065067 1102630
63408 1102630 1131467 1149502 1156877 1155190 1146668 1133983 1119870 1106266 1093986 1083181 1073468 1063387
63396 1063387 1050561 1033003 1010074 981991 949088 912179 873024 833570 794810 757009 720862
63385 720862 687617 657939 631380 607354 586142 568454 554239 542435 531952 522674 515405 510994
63373E10994j338J378L607N476P146Q821J0705J2679J4198J4843J4952J5423J6904
63360F35788J9330K2213K5144K8048L1118L4554L8181M1386M3484M4074M2825
63349A006145L9212L2876K4268J4638N330k695q771j2406j3592j2990j1649j0505
63337A049861j0186j1090j3467j7262k1905k6481l0278l3223l5537l7038l7146
63326G76248l5637l2966k9632k5700k1341j7267j3920j0577o242j476J473P21
63314E83684l580r716j5827k0456k2578k2011j9720j7033j4487j1893r345p507
63302D09531o740o554o257n750n245m608l490k123j285j383j929k237k337k800
63288C56793l815m808n029m298l149k299k014j933j559r16n12o13q52p58l54M
$$ plain form
63373 510994 509656 511034 514641 520117 527263 536084 546789 559468 573666 588509 603461 618884 635788
63360 635788 655118 677331 702475 730523 761641 796195 834376 875762 919246 963320 1006145
63349 1006145 1045357 1078233 1102501 1117139 1122469 1119774 1111003 1098597 1085005 1072015 1060366 1049861
63337 1049861 1039675 1028585 1015118 997856 975951 949470 919192 885969 850432 813394 776248
63326 776248 740611 707645 678013 652313 630972 613705 599785 589208 582966 581490 582963 583684
63314 583684 580104 570388 554561 534105 511527 489516 469796 452763 438276 426383 417038 409531
63302 409531 402791 396237 389980 384230 378985 374377 370887 368764 367479 366096 364167 361930 359593 356793
63288 356793 352978 348170 343141 338843 335694 333395 331381 329448 327889 326973 326461 325848 324996 324238 323884 323888
63272C23888J40N2l11p96q90l40K44J15l84o6J509L402M464M499M034L550L302
63255C46412L358L487L471L688M769O412P340O988O427O936Q254R168R434J0071
63241D36215J1865J4466J6990J8822J9732J9943K0286K1730K4434K7491K9741
63230F61715L0685L0657L0354L0217L0050K9393K8289K7429K7295K7653K8162
63219I81899K9009L0323L1440L1565L0923L0359K9853K8293K4826J9694J3480
63208A281664O283j928j0644j9023k6465l2769l7826m1384m3066m2645m0491l7531
63196I54175l4466l1170k7318k3327j9991j7261j4222j0447o642l502o58K647
63184G67818O281R359J1442J3073J4970J7194J9219K0589K1306K1629K1714K1489
$$ plain form
63272 323888 324028 324080 323769 322973 322083 321743 321987 322102 321718 321652 323161 326563 331027 335526 339560 343110 346412
63255 346412 349770 353257 356728 360416 365185 371597 378937 385925 392352 399288 407542 416710 426144 436215
63241 436215 448080 462546 479536 498358 518090 538033 558319 580049 604483 631974 661715
63230 661715 692400 723057 753411 783628 813678 843071 871360 898789 926084 953737 981899
63219 981899 1010908 1041231 1072671 1104236 1135159 1165518 1195371 1223664 1248490 1268184 1281664
63208 1281664 1287947 1286019 1275375 1256352 1229887 1197118 1159292 1117908 1074842 1032197 991706 954175
63196 954175 919709 888539 861221 837894 817903 800642 786420 775973 769331 765829 765171 767818
63184 767818 774099 783458 794900 807973 822943 840137 859356 879945 901251 922880 944594 966083
63172I66083K0884K0053J9293J8788J8443J7811J6191J3003Q314K821k771q231
63160A110682j3574j8705k3499k7912l1696l4347l5732l6434l6931l6776l5225
63149G79851l2466k9507k6863k4184k1228j8446j6206j4188j2025j0060q859q310
63137E57509p723o807n980n658n551m954l648k206j283p87p3J130K445L533M567
63122E24514N707O612O892O706O416N986N262M482L967L558L016K652K823L098
63108E91691K789K105J845K064K023J585J471J965K323J969J264O42r7r99j354
63093F11286o71L87Q18O09M54O15Q10R09R46P14J45j15O75K212L315L409L180
63076F29698L563M621N722O496P187Q173R402J0464J1105J1547J2252J3436J5099
$$ plain form
63172 966083 986967 1007020 1026313 1045101 1063544 1081355 1097546 1110549 1118863 1121684 1118913 1110682
63160 1110682 1097108 1078403 1054904 1026992 995296 960949 925217 888783 851852 815076 779851
63149 779851 747385 717878 691015 666831 645603 627157 610951 596763 584738 574678 565819 557509
63137 557509 549786 542979 536999 531341 525790 520836 517188 514982 513699 512912 512839 513969 516414 519947 524514
63122 524514 530221 536833 543725 550431 556847 562833 568095 572577 576544 580102 583118 585770 588593 591691
63108 591691 594480 596585 598430 600494 602517 604102 605573 607538 609861 611830 613094 613736 613639 612640 611286
63093 611286 610615 611002 611820 612429 612883 613498 614308 615217 616163 616877 617022 616907 617582 619794 623109 626518 629698
63076 629698 633261 637882 643604 650100 657287 665460 674862 685326 696431 707978 720230 733666 748765
63063G48765J7273J9907K2534K4581K6184K8153L0934L4111L7273M0812M5287
63052A075814N0390N5191N9295O3071O6807P0106P2327P3201P2906P1875P0629
63041A801612O9553O8711O7954O7300O7095O7697O9040P0485P1097P0208O7764
63030B558516O3925N8328N0023L8458K4237Q531q027k5434m3288o0189p4489q5399
63018B505192r3141r8156j00535j00167r7149r1856q4737p6241o6912n7395m8223
63007A590680l9610l1353k2981j4263n682J810P895J3409J9208K4696K8357K9845
62995A602011L0618L2050L3830L4939L5383L5898L6435L6233L5161L3820L2205
62984A978583K9402K4831J8889J2005L944n495j5836k6407l6826m6619n5080o1935
$$ plain form
63063 748765 766038 785945 808479 833060 859244 887397 918331 952442 989715 1030527 1075814
63052 1075814 1126204 1181395 1240690 1303761 1370568 1440674 1513001 1586202 1659108 1730983 1801612
63041 1801612 1871165 1939876 2007830 2075130 2142225 2209922 2278962 2349447 2420544 2490752 2558516
63030 2558516 2622441 2680769 2730792 2769250 2793487 2802018 2793991 2768557 2725269 2665080 2590591 2505192
63018 2505192 2412051 2313895 2213360 2113193 2016044 1924188 1839451 1763210 1696298 1638903 1590680
63007 1590680 1551070 1519717 1496736 1482473 1476791 1478601 1486496 1499905 1519113 1543809 1572166 1602011
62995 1602011 1632629 1664679 1698509 1733448 1768831 1804729 1841164 1877397 1912558 1946378 1978583
62984 1978583 2007985 2032816 2051705 2063710 2067654 2062159 2046323 2019916 1983090 1936471 1881391 1819456
62972A819456o7492p1680p3651p2957p0516o7622o4448o0278n5039m9684m5100
62961A120989m1258l7667l4212l1297k9263k7873k6421k4427k2211k0584k0016
62950H05760k0300k0871k1119k0474j8785j6721j5300j4794j4555j4025j3328
62939F15488j2715j1994j0954r815q842p905o783n615m659l924l311k778k207
62926E23986j469q44q70j540k117k116j940k147k598k722k283j508q04o47j271
62911D99110k198k575k368k519l516m442m153k848j731j486j858k389k825k931
62897D61271k578j980j412q08n8N72P69O10L33o4m80m93rJ96o10j964k676k264
62879D48355j276l08N35J192J401J058M35j14m15m53l74l70l97k63r9l42r41j147
$$ plain form
62972 1819456 1751964 1680284 1606633 1533676 1463160 1395538 1331090 1270812 1215773 1166089 1120989
62961 1120989 1079731 1042064 1007852 976555 947292 919419 892998 868571 846360 825776 805760
62950 805760 785460 764589 743470 722996 704211 687490 672190 657396 642841 628816 615488
62939 615488 602773 590779 579825 570010 561168 553263 546480 540865 536206 532282 528971 526193 523986
62926 523986 522517 521673 520803 519263 517146 515030 513090 510943 508345 505623 503340 501832 501028 500381 499110
62911 499110 496912 494337 491969 489450 485934 481492 477339 474491 472760 471274 469416 467027 464202 461271
62897 461271 458693 456713 455301 454493 454435 455007 455776 456386 456719 456655 456175 455682 455673 455869 455259 453295 450619 448355
62879 448355 447079 446771 447306 448498 449899 450957 451392 451278 450863 450410 450036 449666 449269 449006 448907 448565 447624 446477
62861D46477n57K03M18L81P75J448J658J307J028J137J318J326J269J208J049
62846D60445Q82Q65P79L32k35m25l06m24r37j493j879k172k232j682n56O18J439
62829D53019J921K124K070J929J869J702J187O17N79J133J804K313K855L604M417
62814D83143N085N469N435N038M703M843N419O121O789P312P514P563Q047R172
62800E71653J0368J1222J2212J3720J5057J5479J5616J6631J8426K0052K1630
62789G42066K4350K8455L2765L6561M0602M5779N1916N8440O5259P2457P9953
62778A278603Q7950R6773J05838J13656J19343J23293J25846J26174J23081J16106
62768B416663J05245R0459P2160N1578K9903P548j5134l7022n6784p3775q7889
$$ plain form
62861 446477 445920 446123 446541 446922 447697 449145 450803 452110 453138 454275 455593 456919 458188 459396 460445
62846 460445 461327 462192 462971 463303 463068 462643 462337 461913 460976 459483 457604 455432 453200 451518 450962 451580 453019
62829 453019 454940 457064 459134 461063 462932 464634 465821 466438 467017 468150 469954 472267 475122 478726 483143
62814 483143 488228 493697 499132 504170 508873 513716 519135 525256 532045 539357 546871 554434 562481 571653
62800 571653 582021 593243 605455 619175 634232 649711 665327 681958 700384 720436 742066
62789 742066 766416 794871 827636 864197 904799 950578 1002494 1060934 1126193 1198650 1278603
62778 1278603 1366553 1463326 1569164 1682820 1802163 1925456 2051302 2177476 2300557 2416663
62768 2416663 2521908 2612367 2684527 2736105 2766008 2773556 2758422 2721400 2664616 2590841 2502952
62757B502952r8942j06882j12162j15262j16077j14279j10128j04514r8404r2395
62747A433907q6556q0581p4367o8374o3025n7906n2341m6687m2012l8402l4726
62736G88930l0418k6283k2970j9912j6643j3976j2749j2219j1020r135p689p094
62724E98822o588n483l902k234o92O22J766L021M382N337N680O201P862J0556
62710F25350J3391J5886J8205K0508K2896K5766K9433L3497L7418M1507M6514
62699I30371N2298N7879O2810O7620P2612P7165Q0530Q2703Q3981Q4139Q2447
62688A734555P8221P1097O1053M8388L3592J7227J05j6589l1810m5288n7266o7689
62676A825596p6053q1983q5474q6520q5102q1689p7338p2970o8772o4465n9809
$$ plain form
62757 2502952 2404010 2297128 2184966 2069704 1953627 1839348 1729220 1624706 1526302 1433907
62747 1433907 1347351 1266770 1192403 1124029 1061004 1003098 950757 904070 862058 823656 788930
62736 788930 758512 732229 709259 689347 672704 658728 645979 633760 622740 613605 605916 598822
62724 598822 592234 586751 582849 580615 579923 580545 582311 585332 589714 595051 600731 606932 614794 625350
62710 625350 638741 654627 672832 693340 716236 742002 771435 804932 842350 883857 930371
62699 930371 982669 1040548 1103358 1170978 1243590 1320755 1401285 1483988 1567969 1652108 1734555
62688 1734555 1812776 1883873 1944926 1993314 2026906 2044133 2044238 2027649 1995839 1950551 1893285 1825596
62676 1825596 1749543 1667560 1582086 1495566 1410464 1328775 1251437 1178467 1109695 1045230 985421
62665I85421n4772m9550m4606m0467l7236l4451l1491k8064k4336k0809j7981
62654F01658j5947j4254j2437j0638r430r060r198r421r569r489q867p626o244
62641D69478n345m980m556l540k064p39R0P12J511K219K057P35j039k259k594
62626D49686k384j877r95J76J077J140L54p18j378j179r8J458K920L982M873O071
62610D63108P711R296J0128J0086R827J0158J1270J2737J4152J5561J7369K0040
62598F11443K3775K8272L2792L6789M0474M4487M9033N3609N7552O0445O1914
62587A100585O1490N8974N4576M8546M0851L1392K0364Q314l929j5389k5429l4153
62575A346192m1907m8341n2547n4312n4608n4450n3799n2116m9417m6185m2589
$$ plain form
62665 985421 930649 881099 836493 796026 758790 724339 692848 664784 640448 619639 601658
62654 601658 585711 571457 559020 548382 538952 529892 520694 511273 501704 492215 483348 475722 469478
62641 469478 464133 459153 454597 451057 448993 448254 448344 449056 450567 452786 454843 455578 454539 452280 449686
62626 449686 447302 445425 444430 444606 445683 446823 447177 446459 445081 443902 443804 445262 448182 452164 457037 463108
62610 463108 470819 480115 490243 500329 510156 520314 531584 544321 558473 574034 591403 611443
62598 611443 635218 663490 696282 733071 773545 818032 867065 920674 978226 1038671 1100585
62587 1100585 1162075 1221049 1275625 1324171 1365022 1396414 1416778 1425092 1421163 1405774 1380345 1346192
62575 1346192 1304285 1255944 1203397 1149085 1094477 1040027 986228 934112 884695 838510 795921
62564G95921l8567l4561l1349k9038k6835k4019k0746j7647j4986j2622j0567
62553E34984r185q644q474p953o932n917n250m603l578k468j823j520r70j39L81
62538D67909M58P44J580K309K182J352M37l58r95r14N38L045N341O495O807P340
62522E04270Q825J1083J3447J5621J8040K1205K4917K8551L2007L5734L9753M3326
62510G96779M5866M7588M8885M9603M9334M7895M5140M0787L4891K7996K0472
62499A255236J2216L456m798j1703j7471k2571k6557k8405k7669k4654j9855j3929
62487A073296p857k183L648J0430J7844K4781L0751L6124M1119M5538M9520N3423
62475A376434N6539N6680N1823M2028K9656J7811Q358Q26o975j6973k9257m2322
$$ plain form
62564 795921 757354 722793 691444 662406 635571 611552 590806 573159 558173 545551 534984
62553 534984 525799 517155 508681 500728 493796 487879 482629 478026 474448 471980 470157 468637 467667 467528 467909
62538 467909 468367 469111 470691 473000 475182 476534 476971 476613 475618 474704 475242 478287 483628 490123 496930 504270
62522 504270 513095 524178 537625 553246 571286 592491 617408 645959 677966 713700 753453 796779
62510 796779 842645 890233 939118 988721 1038055 1085950 1131090 1171877 1206768 1234764 1255236
62499 1255236 1267452 1270908 1266110 1254407 1236936 1214365 1187808 1159403 1131734 1107080 1087225 1073296
62487 1073296 1065439 1063256 1066904 1077334 1095178 1119959 1150710 1186834 1227953 1273491 1323011 1376434
62475 1376434 1432973 1489653 1541476 1583504 1613160 1630971 1639329 1640155 1633180 1616207 1586950 1544628
62463A544628n4320o3718o9430p1414p1082p0209o9245o7242o3444n8173n2127
62452H34224m5667l9162l3284k8406k4128j9894j5777j2330r845q115o743n441
62440E85432m060k496o92J280L068M256M780M948M801L788J492j497m032n619
62426E95449o769q082r417j0160r990r232q561q434q691q789q401p703o982o273
62412D77965n562n026m855m996n195n108m423l271k531k925l772l444j497O01
62398D25961J370R79L35l73j128j023O67K871L694K872J873J649J698J490J418
62383D44353J923K762L588M375M951N020N001N880P816R694J0447J0157R546R133
62369E34646R278J0275J1949J3708J5240J6731J8286J9896K2055K5515L0186L5095
$$ plain form
62463 1544628 1490308 1426590 1357160 1285746 1214664 1144455 1075210 1007968 944524 886351 834224
62452 834224 788557 749395 716111 687705 663577 643683 627906 615576 605731 597616 590873 585432
62440 585432 581372 578876 578184 579464 582532 586788 591568 596516 601317 605105 606597 605100 601068 595449
62426 595449 588680 580598 571181 561021 551031 541799 533238 524804 516113 507324 498923 491220 484238 477965
62412 477965 472403 467377 462522 457526 452331 447223 442800 439529 436998 434073 430301 426857 425360 425961
62398 425961 427331 428310 428645 428272 427144 426121 426788 429659 433353 436225 438098 439747 441445 442935 444353
62383 444353 446276 449038 452626 457001 461952 466972 471973 477853 485669 495363 505810 515967 525513 534646
62369 534646 543924 554199 566148 579856 595096 611827 630113 650009 672064 697579 727765 762860
62357G62860L9751M4674N0207N5746O0587O4620O7511O8029O5097N9000N0874
62346A388956M1461L1060K0248R895N74p560j4580k0834k6874l2900l8423m2781
62334A308242m5745m7400m7790m6938m4867m1531l7145l2594k8899k6054k3148
62323H86131j9914j7423j6655j7172j7847j8300j8866j9621k0224k0582k0858
62312F78669k0892k0243j8852j7183j5659j4259j2774j1242r960r066q171o667
62300E13701m602k902k295k310j970j178n40J7J273L143M301L973L160L320M561
62285E21652N958O963P631P972Q025Q328R427J0950J1849J1586J0700J0147J0367
62272F41555J0924J0942J0058Q990Q758R379R932J0017J0332J1473J3036J4520
$$ plain form
62357 762860 802611 847285 897492 953238 1013825 1078445 1145956 1213985 1279082 1338082 1388956
62346 1388956 1430417 1461477 1481725 1491620 1492194 1484634 1470054 1449220 1422346 1389446 1351023 1308242
62334 1308242 1262497 1215097 1167307 1120369 1075502 1033971 996826 964232 935333 909279 886131
62323 886131 866217 848794 832139 814967 797120 778820 759954 740333 720109 699527 678669
62312 678669 657777 637534 618682 601499 585840 571581 558807 547565 537605 528539 520368 513701
62300 513701 509099 506197 503902 501592 499622 498444 497904 497921 499194 502337 506638 510611 513771 517091 521652
62285 521652 527610 534573 542204 550176 558201 566529 575956 586906 598755 610341 621041 631188 641555
62272 641555 652479 663421 673479 682469 691227 700606 710538 720555 730887 742360 755396 769916
62260G69916J6393J9464K3767K8820L4532M1020M7842N4195N9646O3996O6609
62249A226200O6563O3412N7342M8797L8481K7447J6672O629k411j0172j6997k4180
62237A497783l2708m1883m9901n5764n9855o2733o4130o3391o0364n5643n0221
62226I01190m4986m0269l5814l1363k7106k3388k0204j7289j4593j2363j0857
62215F22958j0069r596q752p316o081o026o740o525m604k312j385j772k050j441
62201E48289l29Q45K089L271M065M612N458O655P554P655P158O634O608P356Q625
62186F26545R594R702R454R855J1152J2640J3613J3863J3276J1664R295O997N479
62173G63129M851M925N645P103R379J2511J6423K0927K5882L1223L6737M2054
$$ plain form
62260 769916 786309 805773 829540 858360 892892 933912 981754 1035949 1095595 1159591 1226200
62249 1226200 1292763 1356175 1413517 1462314 1500795 1528242 1544914 1551543 1549132 1538960 1521963 1497783
62237 1497783 1465075 1423192 1373291 1317527 1257672 1194939 1130809 1067418 1007054 951411 901190
62226 901190 856204 815935 780121 748758 721652 698264 678060 660771 646178 633815 622958
62215 622958 612889 603293 594541 587225 581144 575118 568378 561853 557249 554937 553552 551780 549730 548289
62201 548289 547960 548805 550894 554165 558230 562842 568300 574955 582509 590164 597322 603956 610564 617920 626545
62186 626545 636139 645841 655295 665150 676302 688942 702555 716418 729694 741358 750653 757650 763129
62173 763129 767980 772905 778550 785653 795032 807543 823966 844893 870775 901998 938735 980789
62161I80789M6863N0817N3020N2308M8417M2314L4967K6470J7058Q155J288l690
62149A358776q239j3270j8633k4197l0068l5588l9335m0643m0293l9276l7616
62138A031618l4864l1089k6892k2820j9139j5895j2914j0058p629o191n833n985
62126H32309o002n599m718l429k029q32L54K060M392O736Q351Q871Q169O182L077
62111H57892n89m002o291o857n851m279l281l368m498o473q800j0553j1101j0761
62097G71188j0129r042o978m263j941l74J102K926M612N557N854N954O057O194
62083G76717O419O674O897P418Q739J0783J2792J4209J5170J6056J6997J7977
62071I16848J8946J9672J9973K0117K0539K1174K1670K2278K3812K6542K9742
$$ plain form
62161 980789 1027652 1078469 1131489 1183797 1232214 1274528 1309495 1335965 1353023 1361178 1362466 1358776
62149 1358776 1350537 1337267 1318634 1294437 1264369 1228781 1189446 1148803 1108510 1069234 1031618
62138 1031618 996754 965665 938773 915953 896814 880919 868005 857947 850318 844127 838294 832309
62126 832309 826307 820708 815990 812561 810532 809700 810054 812114 816506 823242 831593 840464 848633 854815 857892
62111 857892 857303 853301 847010 840153 834302 830023 826742 823374 818876 812403 803603 793050 781949 771188
62097 771188 761059 752017 745039 740776 738835 738461 739563 742489 747101 752658 758512 764466 770523 776717
62083 776717 783136 789810 796707 804125 812864 823647 836439 850648 865818 881874 898871 916848
62071 916848 935794 955466 975439 995556 1016095 1037269 1058939 1081217 1105029 1131571 1161313
62060A161313L2507L4331L4695L2911K8745K2774J5798Q434J436m343q704j2375
62048A347522j6127k0161k4470k9198l4229l8992m2976m5970m7629m7556m6174
62037I54040m4642m3441m1740l8732l4914l1314k8079k4701k1163j8033j5650
62026F11631j3883j2485j1157r524p679o422o347o914p106o711o287o075n777
62013E05264n358n224n504n742n489m643l218j326M00J112P91M94J141K430L424
61998D78552L872M359N235N976N872M968L932L194K595J849Q83m68k606n580q490
61983E04143j0053r846q706p837p755q079q024p062n425m017l526l684l705l408
61969D13016l327l705l973l607k886k393k137j683r30k70J2L9O6J77K88L17K65
$$ plain form
62060 1161313 1193820 1228151 1262846 1295757 1324502 1347276 1363074 1371508 1372944 1368601 1359897 1347522
62048 1347522 1331395 1311234 1286764 1257566 1223337 1184345 1141369 1095399 1047770 1000214 954040
62037 954040 909398 865957 824217 785485 750571 719257 691178 666477 645314 627281 611631
62026 611631 597748 585263 574106 564582 556903 550481 544134 537220 530114 523403 517116 511041 505264
62013 505264 499906 494682 489178 483436 477947 473304 470086 468760 469160 470272 471063 471557 472698 475128 478552
61998 478552 482424 486783 492018 497994 503866 508834 512766 515960 518555 520404 521287 520819 518213 512633 504143
61983 504143 494090 484244 475538 467701 459946 451867 443843 436781 431356 427339 423813 420129 416424 413016
61969 413016 409689 405984 402011 398404 395518 393125 390988 389305 388375 388105 388117 388156 388222 388399 388687 389004 389269
61952C89269K51L66N60O97Q70J386K449L920N532P077Q406R371R971J0455J1177
61937D61757J2323J3735J4938J5508J5482J5298J5154J4705J3649J2321J1265
61926F16135J0430R310P698N770L544Q81j967m432o318p822q857q992q158o809
61912F00413n206l180p78J573L700N865Q090R983J1471J2834J3758J3220J0898
61899F82641P794M885K008j168m004n747o895q409j0015j0553r902r248r249r142
61885F12996q094o493n318m902m952n281n940o862p848q844r796j0460j0608j0362
61871E07236r966r303q023o213m556l580k982k006m40J163K296L154M243N688
61857D76711P265Q852J0496J2093J3507J4878J6489J8310J9991K1288K2169K2633
$$ plain form
61952 389269 389520 389886 390446 391143 392013 393399 395848 399768 405300 412377 420783 430154 440125 450580 461757
61937 461757 474080 487815 502753 518261 533743 549041 564195 578900 592549 604870 616135
61926 616135 626565 635875 643573 649343 652887 653768 651801 647369 641051 633229 624372 615380 607222 600413
61912 600413 595207 592027 591249 592822 596522 602387 610477 620460 631931 644765 658523 671743 682641
61899 682641 690435 695320 697328 696160 692156 686409 679514 671105 661090 650537 640635 631387 622138 612996
61885 612996 604902 598409 593091 588189 583237 577956 572016 565154 557306 548462 538666 528206 517598 507236
61871 507236 497270 487967 479944 473731 469175 465595 462613 460607 460167 461330 463626 466780 471023 476711
61857 476711 483976 492828 503324 515417 528924 543802 560291 578601 598592 619880 642049 664682
61845F64682K2797K3003K3347K3269K2081J9793J6780J2924P891K218k860o815
61833H29110j0080j2686j3746j2797j0678q387n816k442J438N024Q058J0725J2850
61820G90573J3878J3486J1639Q464M510O21l018p169j2174j6892j9912k1281k2015
61807G40710k2323k1539j9636j7555j5820j4058j2206j1109j1284j1904j1781
61796E71495j0846r917r354q674p539o434n988n964n396l922k517k435l501m137
61782D84871l268j604n72n48p36n26j69k13p55j463j924j918j581j214q02l3J050
61765D68595J774J657J162J103J614K258K906L831N023N965O221N746M719L480
61751E16054K497J962J488O10n17j434k147l031m069m790m902m520l832l083k730
$$ plain form
61845 664682 687479 710482 733829 757098 779179 798972 815752 828676 836567 838785 835925 829110
61833 829110 819030 806344 792598 779801 769123 760736 754920 752478 753916 758940 766998 777723 790573
61820 790573 804451 817937 829576 838040 842550 843171 840153 832984 820810 803918 784006 762725 740710
61807 740710 718387 696848 677212 659657 643837 629779 617573 606464 595180 583276 571495
61796 571495 560649 550732 541378 532704 525165 518731 512743 506779 501383 497461 494944 492509 489008 484871
61782 484871 481603 479999 479427 478879 478143 477617 477448 477235 476480 475017 473093 471175 469594 468380 467578 467545 468595
61765 468595 470369 472026 473188 474291 475905 478163 481069 484900 489923 495888 502109 507855 512574 516054
61751 516054 518551 520513 522001 522611 522094 520660 518513 515482 511413 506623 501721 497201 493369 490286 487556
61736D87556k940l062k289q59Q4r8q95j476j492r42M6J046J536J525J498J643
61720D80881J695J674K024K762L173K787K127J981K375K711K500J580l4j924l248
61705E03064l502l157l033l171k925k135j577j973k976l607l501l203l231l317
61691D61756k991k466k382k796l105l097l296l927m306l837l017k648k573k066
61677D19249j234r01j273j678j772j957k316k138j049J42L89l24j204j704j760
61662D00470j389o94k5K75K76K98N08R91J904L152M144M290L720L154L059L170
61646D27303K825J708K67n10mJ288K131J891J177R74J418J797J543P85J6m46n63
61629D43600m85m19m55m68l95n84j613l584n711o871o575n306l885k686j569m64
$$ plain form
61736 487556 484616 481554 479265 478406 478490 478392 477497 476021 474529 473587 473633 474679 476215 477740 479238 480881
61720 480881 482576 484250 486274 489036 492209 494996 497123 499104 501479 504190 506690 508270 508236 506312 503064
61705 503064 499562 496405 493372 490201 487276 485141 483564 481591 478615 475008 471507 468304 465073 461756
61691 461756 458765 456299 453917 451121 448016 444919 441623 437696 433390 429553 426536 423888 421315 419249
61677 419249 418015 417114 415841 414163 412391 410434 408118 405980 404931 405073 405462 405138 403934 402230 400470
61662 400470 399081 398387 398362 398637 398913 399211 399719 400710 402614 405766 409910 414200 417920 421074 424133 427303
61646 427303 430128 431836 432103 431593 431589 432877 435008 436899 438076 439050 440468 442265 443808 444593 444609 444163 443600
61629 443600 443115 442696 442241 441773 441378 440794 439181 435597 429886 423015 416440 411134 407249 404563 402994 402530
61613D02530L16M21j74j210k441l697m780n485n646n155m163l262l152l817m358
61598C55927m002l068k581l008l796m112l708l006k615k779l128k984k065q02
61584C14273J69N68M08k46j159j830j956j727j339o20L64Q23J25j076j507r15
61568C04355k06M3J71M51N49L62M35R86J351J101R31J598K571K698J914J248J230
61551C21788J301R78O80Q83J101M49j052k310k373j395k47M71Q48J284J964K728
61535C27098L198K991K019P20j36q7N72J040P41k02j068j180n23K36M87L02P8
61518C36286k14r15j905k516k464k167j926j399l86N29P29M31J75j03o83j191
61502C22281j038n00m12q39r84m62J68L64L01L85O88J107J590J948J914J508J038
$$ plain form
61613 402530 402846 403267 403093 401883 399442 395745 390965 385480 379834 374679 370516 367254 364102 360285 355927
61598 355927 351925 348857 346276 343268 339472 335360 331652 328646 326031 323252 320124 317140 315075 314273
61584 314273 314442 315010 315418 315172 314013 312183 310227 308500 307161 306541 306905 307728 307853 306777 305270 304355
61568 304355 304149 304192 304363 304814 305363 305725 306160 307146 308497 309598 310529 312127 314698 317396 319310 320558 321788
61551 321788 323089 324067 324747 325630 326731 327180 326128 323818 321445 320050 319803 320274 321122 322406 324370 327098
61535 327098 330296 333287 335306 336026 335890 335803 336375 337415 338156 337954 336886 335706 335183 335419 335906 336208 336286
61518 336286 336072 335157 333252 330736 328272 326105 324179 322780 322394 322923 323652 324083 324258 324155 323472 322281
61502 322281 321243 320743 320331 319492 318508 318046 318214 318578 318879 319264 319952 321059 322649 324597 326511 328019 329057
61485C29057O82M44M02N80P36P90J216K329L478L754L301L011L074K905K362J907
61469C60028J402J30j669k558j810m20M31Q11J188J185K36j192k045j956j348
61454C52413o72j89l7Q2P16J653J789O56o50q58j82K69J82O9J39J98L57Q48J312
61435C58095J242R22J042J522J717J621J776K099J867J012L20J20j58p86j090
61420C71321n76K11O10R57J929L214L725L064K090J761J989J830O91r57k065k065
61404C87729j365q34r49j472j784j501q27l88n19p91n15K92Q86Q65O59O74N35
61387C80695k01j044j033J4J348K263K608K439J886J389J401J709J650J157R41
61372C97222J456K216K546K464K423K577K717K703K504K026J269N72L65P31J473
$$ plain form
61485 329057 329739 330183 330585 331165 331901 332691 333907 336236 339714 343468 346769 349780 352854 355759 358121 360028
61469 360028 361430 361560 359891 357333 355523 355103 355534 356345 357533 358718 358954 357762 355717 353761 352413
61454 352413 351741 351552 351515 351597 352313 353966 355755 356411 355761 354903 354721 354990 355172 355241 355380 355578 355935 356783 358095
61435 358095 359337 360259 361301 362823 364540 366161 367937 370036 371903 372915 373235 373355 373197 372411 371321
61420 371321 370745 370956 371566 372523 374452 377666 381391 384455 386545 388306 390295 392125 392816 391859 389794 387729
61404 387729 386364 385530 384581 383109 381325 379824 378997 378609 378090 377299 376784 377076 377962 378827 379486 380160 380695
61387 380695 380494 379450 378417 378431 379779 382042 384650 387089 388975 390364 391765 393474 395124 396281 397222
61372 397222 398678 400894 403440 405904 408327 410904 413621 416324 418828 420854 422123 422695 423060 423791 425264
61357D25264K462L578M373M348L639L106L462M549N691O510P053P279O873N673
61343D93860L939K068L56q83j333j089p01n19k58L89J085J255R64P09M84k71j708
61326D98347l166l942l962l511k813k094j551r75N5J392K198K044J646J992L106
61311D88766M197M804N253O087P517R427J1535J3512J5122J6259J6740J6185J4279
61298F29683J1159P447L982J406k60j667l387n152o161o249o232o868p985q926
61284F00790r426r622r523q972p980o780n580m502l617k857k047j140k32O48J477
61269E30637K018K094K061K465L132L280K769K521L353M952O520P788Q773R135
61255E91498Q420O766M759K793J083l2l26j25L2J7O3K02J61k76j070k001k821
$$ plain form
61357 425264 427726 431304 435677 440025 443664 446770 450232 454781 460472 466982 474035 481314 488187 493860
61343 493860 497799 499867 500223 499340 498007 496918 496217 495698 495440 495829 496914 498169 499133 499842 500326 500055 498347
61326 498347 495181 491239 487277 483766 480953 478859 477308 476333 476388 477780 479978 482022 483668 485660 488766
61311 488766 492963 497767 503020 509107 516624 526051 537586 551098 566220 582479 599219 615404 629683
61298 629683 640842 648289 652271 653677 653417 651750 648363 643211 637050 630801 624569 617701 609716 600790
61284 600790 591364 581742 572219 563247 555267 548487 542907 538405 534788 531931 529884 528744 528512 529160 530637
61269 530637 532655 534749 536810 539275 542407 545687 548456 550977 554330 559282 565802 573590 582363 591498
61255 591498 599918 606684 611443 614236 615319 615287 614961 614836 614868 614885 614948 615150 615311 615035 613965 611964 609143
61238F09143l400l783l937l575k655j837j744j940j500n84k53m84K07K506M936
61223E91100N834N604N758O556O971O556N890N466N256N316N745O179O219O206
61209F74656O614O932O199M528K983J982R34l40r64j72J689L732N516P215R207
61194G30711J1663J4161J5813J6164J5744J5163J4065J1722Q400N208K750Q68
61182H62432m43r16q98j283k320l385m127m949o037o817o907o832p278q137q841
61167G93262r205r487r903j0384j0715j0760j0633j0672j1031j1391j1358j0945
61155F66778j0402r764q946q012o913n261k914m40J490K793L516L152J273j538
61141F24812m214o356q024q766q019o261m649l537k329q50K97Q14J180J803K586
$$ plain form
61238 609143 605743 601960 598023 594448 591793 589956 588212 586272 584772 584188 583935 583451 583658 586164 591100
61223 591100 596934 602538 608296 614852 621823 628379 634269 639735 644991 650307 656052 662231 668450 674656
61209 674656 681270 688202 694401 698929 701912 703894 704828 704488 703524 703352 705041 708773 714289 721504 730711
61194 730711 742374 756535 772348 788512 804256 819419 833484 845206 853606 858814 861564 862432
61182 862432 861989 861073 860175 858892 856572 853187 849060 844111 838074 831257 824350 817518 810240 802103 793262
61167 793262 784057 774570 764667 754283 743568 732808 722175 711503 700472 689081 677723 666778
61155 666778 656376 646612 637666 629654 622741 617480 614566 614126 615616 618409 621925 625077 626350 624812
61141 624812 620598 614242 606218 597452 589433 583172 578523 574986 572657 571807 572104 572918 574098 575901 578487
61126E78487L490M745O345Q063R911J1930J3675J4775J5745J7229J8763J9473
61114G22631J9776K0915K2833K4111K4224K4280K5019K5624K5196K4077K2868
61103I81554K1354J9276J7146J5334J3155R793N548J428j998m842p468j0243j3184
61090A046853j5651j6955j7444j8106j9053j9321j8426j7063j5958j5082j4341
61079H59453j3915j3429j1998r571p226n634m294k758j408m12Q87K785M530N511
61065H02521O122O823P448Q054R299J1274J3091J4359J5803J7695J9043J9255
61053I50787J9274K0069K1242K2196K3322K4861K5942K6008K5993K6757K7615
61042A214066K7766K7970K9200L0809L1616L1817L2198L2451L1960L1381L1695
$$ plain form
61126 578487 581977 586722 593067 601130 611041 622971 636646 651421 667166 684395 703158 722631
61114 722631 742407 763322 786155 810266 834490 858770 883789 909413 934609 958686 981554
61103 981554 1002908 1022184 1039330 1054664 1067819 1077612 1083160 1084588 1082590 1077748 1070280 1060037 1046853
61090 1046853 1031202 1014247 996803 978697 959644 940323 921897 904834 888876 873794 859453
61079 859453 845538 832109 820111 810540 803314 797680 793386 790628 789220 788808 789695 792480 797010 802521
61065 802521 808643 815466 822914 830968 840267 851541 864632 878991 894794 912489 931532 950787
61053 950787 970061 990130 1011372 1033568 1056890 1081751 1107693 1133701 1159694 1186451 1214066
61042 1214066 1241832 1269802 1299002 1329811 1361427 1393244 1425442 1457893 1489853 1521234 1552929
61031A552929L2500L2869L3160L4245L5714L6510L6594L6362L5326L3214L1554
61020A930977L2345L5912M1661M9774O0089P0540P9124Q6487R4524J03945J15964
61009B701342J34523J63283K01835K48802L07043L81051M71232N77496P07336
61000E893943Q72051J076144J322126J622920J978706K313817K453646K219441
60992A9752794J588011P54708J4743m27567n37953l80253k9907M10377P53209
60983B1898162P70013L46632m05454j213220j824155k135393k183455k058133
60975A3194997j840509j589861j346108j128801r41315p81910o49361n40466m49641
60966C927025l73386l11596k63513k25934j96103j73096j55415j40249j26150
$$ plain form
61031 1552929 1585429 1618298 1651458 1685703 1721417 1757927 1794521 1830883 1866209 1899423 1930977
61020 1930977 1963322 1999234 2040895 2090669 2150758 2221298 2300422 2386909 2481433 2585378 2701342
61009 2701342 2835865 2999148 3200983 3449785 3756828 4137879 4609111 5186607 5893943
61000 5893943 6765994 7842138 9164264 10787184 12765890 15079707 17533353 19752794
60992 19752794 21340805 22095513 22110256 21682689 21144736 20764483 20734576 21144953 21898162
60983 21898162 22668175 23014807 22609353 21396133 19571978 17436585 15253130 13194997
60975 13194997 11354488 9764627 8418519 7289718 6348403 5566493 4917132 4376666 3927025
60966 3927025 3553639 3242043 2978530 2752596 2556493 2383397 2227982 2087733 1961583
60957A961583j13917j03729r3843q3014p2116o2202n3023m4621l8452l5557l4957
60946A226152l5075l5397l5639l4696l1886k8322k5762k4602k3951k3152k2305
60935I05365k1719k1574k1842k2043k1518k0253j8903j7763j6382j4546j2781
60924F96041j1510j0470r463q848q723q439p613o839o700o711o082m906l778k792
60910E93167j728q70o56p62m06N63J556K090K152J868J416J188J454J908J978
60895F04918J461M65r64k646l965m447m447m681n208n527n575n922o930q257r342
60880E38933r867r698q920q000p480p395p333p027o494n737m843m186l872l146
60866D44935j250J134K293J673P04R27K163L189L551L759M105M239L852L089K293
$$ plain form
60957 1961583 1847666 1743937 1650094 1567080 1494964 1432762 1379739 1335118 1296666 1261109 1226152
60946 1226152 1191077 1155680 1120041 1085345 1053459 1025137 999375 974773 950822 927670 905365
60935 905365 883646 862072 840230 818187 796669 776416 757513 739750 723368 708822 696041
60924 696041 684531 674061 664598 655750 647027 638588 630975 624136 617436 610725 604643 599737 595959 593167
60910 593167 591439 590569 589913 589151 588745 589308 590864 592954 595106 596974 598390 599578 601032 602940 604918
60895 604918 606379 606844 605880 603234 599269 594822 590375 585694 580486 574959 569384 563462 556532 548275 538933
60880 538933 529066 519368 510448 502448 494968 487573 480240 473213 466719 460982 456139 451953 448081 444935
60866 444935 443685 444819 447112 448785 449489 450416 452579 455768 459319 463078 467183 471422 475274 478363 480656
60851D80656J769J775K253K713K710K386K143J944J421N49j99l78J9M94K22j352
60835D99125l678n244n160m205l738l942m039l860m023m519m415l382k440k476
60821D44004k934k753j959j466j668k148k568l039l618m037m162m189m308m415
60807D00740m283l802l044k249j756j785k288k989l513l492k800j772r18l85j1
60792C65653R8l97j267j548o81O27J219Q92M39N44J156J796K043J745J189R72
60776C74480J337J770J613R22K86M5J31N07J182J832J976J575J015N60K07K6Q5
60759C89549J27j44m99n37m89r57j698j650m36Q87J155M90k20o80j139j391p52
60742C81616P85K195K429J423j61j720k994l875m305m359m175l832l405l052k913
$$ plain form
60851 480656 482425 484200 486453 489166 491876 494262 496405 498349 499770 500319 500120 499742 499761 500255 500477 499125
60835 499125 495447 490203 485043 480838 477100 473158 469119 465259 461236 456717 452302 448920 446480 444004
60821 444004 441070 438317 436358 434892 433224 431076 428508 425469 421851 417814 413652 409463 405155 400740
60807 400740 396457 392655 389611 387362 385606 383821 381533 378544 375031 371539 368739 366967 366049 365664 365653
60792 365653 365751 365354 364087 362539 361858 362485 363704 364596 365035 365579 366735 368531 370574 372319 373508 374480
60776 374480 375817 377587 379200 380122 380408 380453 380584 381091 382273 384105 386081 387656 388671 389231 389438 389464 389549
60759 389549 389676 389532 389033 388496 388007 387050 385352 383702 383266 384153 385308 385798 385578 384898 383759 382368 381616
60742 381616 382401 384596 387025 388448 388287 386567 383573 379698 375393 371034 366859 363027 359622 356570 353657
60727C53657k925k831k424j714r01k19J84L52M64O23O63L54j68l99o6N05Q68J119
60709C47142J597K085J855P62k20JJ319K541K722K058J440J390J636J545R16J82
60693C68971j27l8ok02l20j12K86O91J145J569J543Q95K06K09P88J103P15K12
60675C77528M39J472K545K908K573K122J895J533N33r78k347l208l766m165m105
60660C74979l360k319j586j298j165r63o38j38N22J164J683K214K860L442L772
60645C79169L897L862L439K425R30q06k563l940m494m364m289m546m436l341j777
60630C59166o80q3O21J449J715J158L39j00l7L03N46L29k74o08l01M0l32j049
60612C62202j152o40m41p47n72P14K392L421L607L215K211O47p55j129m54M78
$$ plain form
60727 353657 350732 347901 345477 343763 342862 342643 342827 343179 343643 344266 344929 345283 345115 344716 344650 345155 346023 347142
60709 347142 348739 350824 352679 353441 353221 353222 354541 357082 359804 361862 363302 364692 366328 367873 368789 368971
60693 368971 368844 368806 368800 368598 368278 368166 368452 369143 370288 371857 373400 374295 374501 374710 375498 376601 377316 377528
60675 377528 377967 379439 381984 384892 387465 389587 391482 393015 393548 392570 390223 387015 383249 379084 374979
60660 374979 371619 369300 367714 366416 365251 364288 363650 363512 364034 365198 366881 369095 371955 375397 379169
60645 379169 383066 386928 390367 392792 393722 392916 390353 386413 381919 377555 373266 368720 364284 360943 359166
60630 359166 358486 358403 359024 360473 362188 363346 363685 363585 363548 363851 364397 364726 364452 363844 363543 363583 363251 362202
60612 362202 361050 360410 359969 359222 358650 359364 361756 365177 368784 371999 374210 374857 374102 372973 372519 372997
60596C72997R32Q12O11J021K260L645M068L168J748Q54P15P75M48l38j119j286
60580C91311p18j4J95J05M39J371K373L165M114N431O611P198P592Q587J0316
60565D48076J2109J3219J3365J2682J1438R760P565M791J685j355m143o612q404
60552E14176q930p983o001l687j614o8J091K369M076N864P184Q111R162J0531
60538E34281J2081J4026J6773K0056K2869K4430K4516K2876J9212J4002Q462L227
60526G36811k057p331j1231j2494j1736j0883j1068j1768j1919j1176r932q667
60514F16549p531o361m940l247j479J27J366K190K941M292O582R405J2222J5229
60500F47345J9040K3756K8906L4230L9690M4793M8757N1479N3450N4575N3980
$$ plain form
60596 372997 373929 374741 375352 376373 378633 382278 386346 389514 391262 392116 392831 393606 394054 393716 392597 391311
60580 391311 390593 390579 390774 390879 391318 392689 395062 398227 402341 407772 414383 421581 429173 437760 448076
60565 448076 460185 473404 486769 499451 510889 520649 528214 533005 534690 533335 529192 522580 514176
60552 514176 505246 497263 491262 487575 485961 485893 486984 489353 493429 499293 506477 514588 523750 534281
60538 534281 546362 560388 577161 597217 620086 644516 669032 691908 711120 725122 733584 736811
60526 736811 734754 727423 716192 703698 691962 681079 670011 658243 646324 635148 625216 616549
60514 616549 609018 602657 597717 594470 592991 593118 594484 596674 599615 603907 610489 619894 632116 647345
60500 647345 666385 690141 719047 753277 792967 837760 886517 937996 991446 1046021 1100001
60489A100001N1296M7167M2106L5635K7068J6493M476q425k1352l3053m2717n0419
60477A168276n6300n9947o1058o0028n7390n3329m8280m3234l8759l4328k9428
60466F26195k4715k1241j8969j6923j4523j2014r831q230p391p255p349p173o587
60453D63994n630m380l276k994l568m247m557m800n031m504k898j215m94l40J71
60438D16231P92N80l87j073j128j163j438j429r39n26o29j016j355j575j559j083
60422D02303l14K37L18R6k50n33l60M43J323J566J311J270J540J523J014N88P25
60405D12800J292K004K790L480L745L516K998K239J229L92L54J081J851K139K116
60390D44026K144K374K859L515L877L510K733K356K590K784K452J958J938K494
$$ plain form
60489 1100001 1151297 1198464 1240570 1276205 1303273 1319766 1324242 1315817 1294465 1261412 1218695 1168276
60477 1168276 1111976 1052029 990971 930943 873553 820224 771944 728710 689951 655623 626195
60466 626195 601480 580239 561270 544347 529824 517810 507979 499749 492358 485103 477754 470581 463994
60453 463994 458364 453984 450708 447714 444146 439899 435342 430542 425511 421007 418109 416894 416400 416060 416231
60438 416231 417023 417603 417216 416143 415015 413852 412414 410985 410046 409520 408891 407875 406520 404945 403386 402303
60422 402303 401989 402226 402544 402640 402390 401857 401497 401940 403263 404829 406140 407410 408950 410473 411487 412075 412800
60405 412800 414092 416096 418886 422366 426111 429627 432625 434864 436093 436485 436839 437920 439771 441910 444026
60390 444026 446170 448544 451403 454918 458795 462305 465038 467394 469984 472768 475220 477178 479116 481610
60376D81610L255L831M013L815L540L542L815M045M012L674L005K087J321J047
60362E26612J089J096J167J593K175K428K434K797L730M835N889P147Q692J0085
60348E81769J0853J0885J0148Q495N973K918l06l281n338n974n608n257n395n605
60334E94277n470n128m786m367l941l897m327m743m745m566m608m847n024n025
60320E28803m821m339l618k778j685j03J684L003L858N176P551J0247J2138J3201
60306E68317J4308J5768J6970J7558J8042J8679J8410J5785J0983N952K088j563
60294G21297o967j4135k0580k3921k4154k2733k0401j6972j2799r139o888n760
60282E36848m978m125l189k326j775j579j383r69q81j778l210l900l421k770k930
$$ plain form
60376 481610 484865 488696 492709 496524 500064 503606 507421 511466 515478 519152 522157 524244 525565 526612
60362 526612 527701 528797 529964 531557 533732 536160 538594 541391 545121 549956 555845 562992 571684 581769
60348 581769 592622 603507 613655 622150 628123 631041 630735 627454 622116 616142 610534 605277 599882 594277
60334 594277 588807 583679 578893 574526 570585 566688 562361 557618 552873 548307 543699 538852 533828 528803
60320 528803 523982 519643 516025 513247 511562 511459 513143 516146 520004 525180 532731 542978 555116 568317
60306 568317 582625 598393 615363 632921 650963 669642 688052 703837 714820 720772 722860 721297
60294 721297 714330 700195 679615 655694 631540 608807 588406 571434 558635 549496 542608 536848
60282 536848 531870 527745 524556 522230 520455 518876 517493 516524 515643 513865 510655 506755 503334 500564 497634
60267D97634l647m038l740k934j876j059j211k427l651l765k937k223k004j666
60253D60456q16J9K25M0J29O59J211J490J621J782J959K176K537K853K551J389
60237D80281l1q27q15n03k58n4K2j86k87M44J851K755K481J833J840K245K166
60220D92957J705J770K547L245L440L697M562N792O816P431P666P582P403P510
60206E64123P969Q438Q646Q637Q500Q226P924P823P952Q054P868P230O086M655
60192F72131L442K712K147J402P30M91L56l54j700l166m505n836o916p213o802
60177F46919o415o433o426n929n118m453m141m077m024l724l171k744k729k880
60163E84655k809k586k459k324k014j753j671j274k09Q21R47N42O74J307J355
$$ plain form
60267 497634 493987 489949 486209 483275 481399 480340 479129 476702 473051 469286 466349 464126 462122 460456
60253 460456 459640 459659 459884 459924 460053 460712 461923 463413 465034 466816 468775 470951 473488 476341 478892 480281
60237 480281 480250 479423 478608 478105 477847 477793 477815 477629 477342 477786 479637 482392 484873 486706 488546 490791 492957
60220 492957 494662 496432 498979 502224 505664 509361 513923 519715 526531 533962 541628 549210 556613 564123
60206 564123 572092 580530 589176 597813 606313 614539 622463 630286 638238 646292 654160 661390 667476 672131
60192 672131 675573 678285 680432 681834 682564 683055 683411 683057 681357 678191 673686 667850 660934 653721 646919
60177 646919 640504 634071 627645 621716 616598 612145 608004 603927 599903 596179 593008 590264 587535 584655
60163 584655 581846 579260 576801 574477 572463 570710 569039 567765 567556 568377 569324 569866 570540 571847 573202
60148E73202M60n12q74q08m89K22J029J336J403K140L448M206M289N064P083Q870
60132F10069R038Q369Q430R206R484Q815P698O315M437K407J013M30K14K00N84
60117F86709J202J558J578J716K238K954L573L906L773L117K122J014p4r25j285
60102G13176j380j845k863l813m148m115m159m194l881l228k355j210N0Q73J054
60087F77962J115J407J440P58r7l02l6j13o53r96q42o37q16j376k230l370m607
60070F66607n696o793q268r938j0926j0540r174q063q165r170r764r049p568o585
60056E46908o407o069m781k983j588q22k96K52P73J224J617J974K494L380M319
60041E39995M632M248M020M636N686O244O016N478N127N006M713L718J951J17
$$ plain form
60148 573202 573662 573150 572276 571468 570979 571201 572230 573566 574969 577109 580557 584763 589052 594116 601199 610069
60132 610069 619107 627476 635906 645112 654596 663411 671109 677424 681861 684268 685281 685711 685925 686125 686709
60117 686709 687911 689469 691047 692763 695001 697955 701528 705434 709207 712324 714446 715460 715386 714461 713176
60102 713176 711796 709951 707088 703275 699127 695012 690853 686659 682778 679550 677195 675985 676035 676908 677962
60087 677962 679077 680484 681924 682682 682585 682283 682247 682134 681481 680485 679643 679006 678190 676814 674584 671214 666607
60070 666607 660911 654118 645850 635912 624986 614446 605272 597209 589044 579874 570110 561061 553493 546908
60056 546908 540501 534432 529651 526668 525080 524258 523962 524214 524987 526211 527828 529802 532296 535676 539995
60041 539995 544627 548875 552895 557531 563217 569461 575477 580955 586082 591088 595801 599519 601470 601587
60027F01587r80j436j960k725l375m116n668p836r391r809r927j0251r927q419
60013E15767o875o561o915o576n517m681m161l287k218j855k307k740k752k634
59999D56688k341j459k87K81J14N7O38J532K406L276L827L554K809K730L673M659
59983D82157M864M677M759M838M223K936J587M29p26j844k557k745k753k877k910
59968D94058k484j718j195j126q21N37K687M381M847M593M561M954N369N494N147
59953E29284M021K114J72r14j114j207j799k740l433l404k699j911j651j814j759
59938E11146j298j039j434k101k486k614k715k568j847o88N88J961L450M788N764
59923E08907O453O741O221M941L608K540J240m27j553j455p67l01L01J692L344
$$ plain form
60027 601587 600607 599171 597211 594486 591111 586995 581327 573491 564100 554291 544364 534113 524186 515767
60013 515767 508892 502331 495416 488840 483323 478642 474481 471194 468976 467121 464814 462074 459322 456688
59999 456688 454347 452888 452601 452882 452996 453053 453691 455223 457629 460905 464732 468286 471095 473825 477498 482157
59983 482157 487021 491698 496457 501295 505518 508454 510041 510470 509744 507900 505343 502598 499845 496968 494058
59968 494058 491574 489856 488661 487535 486714 487251 489938 494319 499166 503759 508320 513274 518643 524137 529284
59953 529284 533305 535419 535591 534677 533563 532356 530557 527817 524384 520980 518281 516370 514719 512905 511146
59938 511146 509848 508809 507375 505274 502788 500174 497459 494891 493044 492356 492944 494905 498355 503143 508907
59923 508907 515360 522101 528322 533263 536871 539411 540651 540224 538671 537216 536449 536148 536449 538141 541485
59908E41485M270M567N043N714N967N785N514M872L531K303K237K731K139K18
59894E96376j497j914j502r88l45M97J227J879K975M477N615O090O442O888O871
59879F33091O217N741O099O878P359P458P383P026O187M976L545J921L07r02j552
59864G01734j794j730j493j566k271l097l284l019l128l688l997l847l724l581
59850F61515k619o51J482L268N108O998P688O064K673q84l492m893n131m329k754
59835F70043o44J629L091K513j83l446n489n857n262m360l202j682j43N60k69
59820F47299k254l992m439m092m181m990n664n559m838l793k500j313r16j606
59806E97162l094m888o308o417m955l138k434k657k464j648j422k204k752k099
$$ plain form
59908 541485 545755 550322 555365 561079 567046 572831 578345 583217 586748 589051 591288 594019 596158 596376
59894 596376 594879 592965 591463 590475 590130 590627 591854 593733 596708 601185 606800 612890 619332 626220 633091
59879 633091 639308 645049 651148 658026 665385 672843 680226 687252 693439 698415 701960 703881 704188 703286 701734
59864 701734 699940 698210 696717 695151 692880 689783 686499 683480 680352 676664 672667 668820 665096 661515
59850 661515 658896 658245 659727 662995 668103 675101 682789 688853 691526 690642 687150 682257 677126 672797 670043
59835 670043 669399 671028 674119 676632 676449 673003 667514 661657 656395 652035 648833 647151 647008 647568 647299
59820 647299 645045 641053 636614 632522 628341 623351 617687 612128 607290 603497 600997 599684 598768 597162
59806 597162 594068 589180 582872 576455 571500 568362 565928 563271 560807 559159 557737 555533 552781 550682
59792E50682r92o31j069j660k100k275j966j425j343j673j421k23Q65R28N31O22
59776E36850J032J071Q35Q80J187J415J749K562L647M455M777M657M196L898M462
59761E77673N631O084N238M287M461N227N341M950N213O231P009P284P963R460
59747F62052J0916J1539J1646J1818J1774J0835R092P470O637O292N618M264K629
59734G72582J242J53q03j492j736j882k386k869k467j314p86j688l050l391k585
59719G47528j705j513j884k491l230m003m603m863m684m048l234k718k601k449
59705G03502j957j384j020o55K2Q08J268J313J223J348J985L263M817N930O200
59690G26663N728M552K520p2k379l906m903n513n259l972k525j965k349l128m165
$$ plain form
59792 550682 549690 549059 547990 546330 544230 541955 539989 538564 537221 535548 534127 533904 534769 535697 536228 536850
59776 536850 537882 538953 539788 540668 541855 543270 545019 547581 551228 555683 560460 565117 569313 573211 577673
59761 577673 583304 589388 594626 598913 603374 608601 613942 618892 624105 630336 637345 644629 652592 662052
59747 662052 672968 684507 696153 707971 719745 730580 739672 747142 753779 760071 765689 769953 772582
59734 772582 773824 773977 773174 771682 769946 768064 765678 762809 760342 759028 758242 756554 753504 750113 747528
59719 747528 745823 744310 742426 739935 736705 732702 728099 723236 718552 714504 711270 708552 705951 703502
59705 703502 701545 700161 699141 698486 698508 699316 700584 701897 703120 704468 706453 709716 714533 720463 726663
59690 726663 732391 736943 739463 739391 737012 733106 728203 722690 717431 713459 710934 708969 706620 703492 699327
59675F99327n555o813p124o468n763n808o467p003o890o196n346m569l675k460
59661F19190j229n07l07j26L49R99J704K427K882K829K695L174M078M455L978
59646F46591L313K890K230R28o83k346m316o430p658p464o812o934p708q010p217
59631E90374n601l727k189j475j590k015k513l348m474n211n230n039m902m224
59617E38836k811j856k557m341n475n102l757k311j253p39m95L5R10J426J214
59602E11724R56J317J814J665J129J010J286J357J311J805K796L421L151K288
59588E37030J314M75j9o3R2J11k8l10r91k093l003l240l191l415l622l190k342
59571E13515j895k021k063j568p49%L85Q6r54k130k557j989r86k47r4l61n38j95
$$ plain form
59675 699327 693772 686959 679835 673367 667604 661796 655329 648326 641436 635240 629894 625325 621650 619190
59661 619190 617961 617454 617147 617021 617370 618369 620073 622500 625382 628211 630906 634080 638158 642613 646591
59646 646591 649904 652794 655024 655952 655269 652923 648607 642177 634519 627055 620243 613309 605601 597591 590374
59631 590374 584773 581046 578857 577382 575792 573777 571264 567916 563442 558231 553001 547962 543060 538836
59617 538836 536025 534169 531612 527271 521796 516694 512937 510626 509373 508634 508139 508174 509084 510510 511724
59602 511724 512680 513997 515811 517476 518605 519615 520901 522258 523569 525374 528170 531591 534742 537030
59588 537030 538344 538819 538800 538737 538829 538940 538912 538602 537611 535518 532515 529275 526084 522669 519047 515857 513515
59571 513515 511620 509599 507536 505968 505219 505219 505604 505690 504736 502606 500049 498060 497074 496827 496733 496372 495834 495639
59553D95639M81Q27N86K08J29K85O17J331K358L189L671M298N322O343P181Q447
59537E40912J0852J4668J9810K5095K7210K2532J1343j191r703j3185j3771j2765
59525F21807j0034o217k913p37R35K284K831K779K892L001K175M47j182k519m352
59510F11197o634q082q087p622p651p743p010n551m256l762m011m463m450l757
59496E28118k903k482k396k134j563r15k83K69M95M29O51J440K277K808L570M821
59480E32202N555M885L646L307L948M723N603P008Q196P912O387M963L902K346
59466F04583L77q13r78j159j668j576o49jp9K38J771L685M913N594O265O835P245
59449F34583Q043R331J0042R239P458N927M981L918J980j013m505p403q867r097
$$ plain form
59553 495639 496120 496947 497533 497741 497870 498155 498772 500103 502461 505650 509321 513619 518941 525284 532465 540912
59537 540912 551764 566432 586242 611337 638547 661079 672422 671231 661528 648343 634572 621807
59525 621807 611773 605556 602643 601906 602841 605125 607956 610735 613627 616628 618803 619250 618068 615549 611197
59510 611197 604563 596481 588394 580772 573121 565378 558368 552817 548561 544799 540788 536325 531875 528118
59496 528118 525215 522733 520337 518203 516640 515725 515442 515711 516206 516635 517286 518726 521003 523811 527381 532202
59480 532202 537757 542642 546288 549595 553543 558266 563869 570877 579073 586985 593372 598335 602237 604583
59466 604583 604960 604147 603169 602010 600342 598766 598117 598116 598037 598275 600046 603731 608644 614238 620503 627338 634583
59449 634583 642626 651957 661999 671238 678696 684623 689604 693522 695502 694489 689984 682581 673714 664617
59435F64617q803q030o378m353l315l767m708n042m740m165l144j342J105L648
59421F11583N737P118Q227J0099J3181J6491J8774K0109K1603K4041K7894L3549
59409H18406L9455M0698L2403J5338l673j7598k3937k3874j9584j3466p407q93
59397H35868Q172J8763K4662J9772N013j2069k4222k9389k9466k6829k2903j8621
59385G48751j4828j2103j0330q647o241l364j077J84J112K255L185L345K958K459
59371G07659J832J181J131J852K464K221J626J470J448P88k58o64j27P31J513
59356G24867K454L674M834N702O437P208Q034R064J0544J2361J3928J4758J5017
59343H38882J5363J6181J7050J7100J5952J4015J1792R300O559M064K120J76k403
$$ plain form
59435 664617 655814 647784 641406 637053 633738 629971 625263 620221 615481 611316 608172 606830 607935 611583
59421 611583 617320 624438 632665 642764 655945 672436 691210 711319 732922 756963 784857 818406
59409 818406 857861 898559 930962 946300 942627 925029 901092 877218 857634 844168 836761 835868
59397 835868 844040 862803 887465 907237 912250 900181 875959 846570 817104 790275 767372 748751
59385 748751 733923 721820 711490 702843 696602 693238 692161 692345 693457 695712 698897 702242 705200 707659
59371 707659 709491 710672 711803 713655 716119 718340 719966 721436 722884 723672 723414 722750 722623 723354 724867
59356 724867 727321 730995 735829 741531 747968 755176 763210 772274 782818 795179 809107 823865 838882
59343 838882 854245 870426 887476 904576 920528 934543 946335 955635 962194 966258 968378 968554 966151
59330I66151n223p415r000j0646j2292j3205j3365j3596j4147j4288j3589j2534
59318H26851j1577j0582r533q787q380p991p842q458r381r275p780o049m969m059
59304G12188k644r75N60K301M724P811J1390J4917J6467J3430N299n096j4008
59291G66364j9586k1807k1053j8070j4361j1295r083p361o122n294m210k479p62
59278F24881K12Q01J804L235M677O291Q482J0923J2827J3970J4776J5537J6110
59265G34526J6164J5330J3457J0985Q609O358L632L90k488m397n766p166q424
59252G81210r086r043q246o627m738l540l115k480j203j25J73N01J717L213L758
59237G42369L181K326J826J824K355L209L821L876L579K995J766j07j963l399
$$ plain form
59330 966151 960928 953513 944513 933867 921575 908370 895005 881409 867262 852974 839385 826851
59318 826851 815274 804692 795159 786372 777992 770001 762159 753701 744320 735045 727265 721216 716247 712188
59304 712188 709544 708569 709129 711430 716154 723965 735355 750272 766739 780169 785468 780372 766364
59291 766364 746778 724971 703918 685848 671487 660192 651109 643748 637626 632332 628122 625643 624881
59278 624881 625093 625894 627698 630933 635610 641901 650383 661306 674133 688103 702879 718416 734526
59265 734526 750690 766020 779477 790462 799071 805429 809061 809451 806963 802566 796800 789634 781210
59252 781210 772124 763081 754835 748208 743470 739930 736815 734335 733132 733007 733180 733681 735398 738611 742369
59237 742369 745550 747876 749702 751526 753881 757090 760911 764787 768366 771361 773127 773020 771057 767658
59223G67658m708o021o950p547q474r727j0282r639q634p974p231o093n317n420
59209F63641n605n121m628m941n406m881l575k580k137j617p80jM24L95l7k50
59193F22901O75K535L798L597L023L459M608N253N086M650M257M109M743O189
59179F78883P387P432O747O126N521M711M230M371M274L230K021J683J815J517
59165G39948J078J239J562J101J22m47p11j474k627l347l656m369n753p408r121
59150G06137j0643j1189j0346r102q670q803q467p707p410p616p475o673n709
59137E96327m963m553m747n483n853n108l751k679j837p46L91J202K021L103L807
59122E67131L788M040N403O966P465P368P903Q883R361R598J0421J1277J0958
$$ plain form
59223 767658 762950 756929 749979 742432 733958 724231 713949 704310 695676 687702 680471 674378 669061 663641
59209 663641 658036 652915 648287 643346 637940 633059 629484 626904 624767 623150 622370 622369 622793 623188 623151 622901
59193 622901 623576 626111 629909 633506 636529 639988 644596 649849 654935 659585 663842 667951 672694 678883
59179 678883 686270 693702 700449 706575 712096 716807 721037 725408 729682 732912 734933 736616 738431 739948
59165 739948 741026 742265 743827 744928 745050 744603 743892 742418 739791 736444 732788 728419 722666 715258 706137
59150 706137 695494 684305 673959 664857 656187 647384 638917 631210 623800 616184 608709 602036 596327
59137 596327 591364 586811 582064 576581 570728 565620 561869 559190 557353 556607 556998 558200 560221 563324 567131
59122 567131 570919 574959 580362 587328 594793 602161 610064 618947 628308 637906 648327 659604 670562
59109F70562R748Q872Q287P081N658N299N756N468M188L214K978K481J315K28
59095G41135n58j676k941l298k769k577k954k667j269oJ54l00p41j404k336k940
59079G12853l172l902n422o937p963q882r597r139p401n835n562n878n532m494
59065F23137l633l393l565l782l734l288k756k551k486k044j318j024j485k318
59051E85760l007l233k846k158j920k262k214j164n9on03m48j80o49j258n25J254
59034E64582K181J662J130J601K442L002L628M541N301N965P318R457J1589J3561
59020F37960J6061J8898K0673K0710J9792J8438J6002J2169P894M022K55l668
59008G89206p024r064j0004j0300r834q461o527m444k436q85p1O01K015L897M942
$$ plain form
59109 670562 680310 689182 697469 704550 710208 715507 721263 726731 730919 734133 737111 739592 740907 741135
59095 741135 740577 738901 735960 732662 729893 727316 724362 721695 720426 720420 720574 720274 719533 718129 715793 712853
59079 712853 709681 705779 700357 693420 685457 676575 666978 657839 650438 644603 639041 633163 627631 623137
59065 623137 619504 616111 612546 608764 605030 601742 598986 596435 593949 591905 590587 589563 588078 585760
59051 585760 582753 579520 576674 574516 572596 570334 568120 566956 566897 566891 566388 565940 565760 565111 563853 563328 564582
59034 564582 566763 568425 569555 571156 573598 576600 580228 584769 590070 596035 603353 612810 624399 637960
59020 637960 654021 672919 693592 714302 734094 752532 768534 780703 788597 792619 792874 789206
59008 789206 782182 773118 763114 752814 742980 734519 727992 723548 721112 720227 720156 720757 722772 726669 731611
58993G31611M598L553K464J377N13L05L84k10j602k970l950m870n583n402m375
58978G15843l202j860K80K866M728N761P026Q774J0030J0504J1099J2058J2413
58965G96320J1839J1382J1587J1591J0825J0025R706R069P344M936K412l86l509
58952H93141o367q743j1132j3498j4900j5053j4910j5108j5035j4173j3015j2013
58940G39194j0776r138p791p113o443n208l754k488j220Q9R29J100J085J180J213
58925F90859J305J794K277J970J096N95L89n40k201l374l585l614l786l457k532
58910F77196j775j207PJ675K555K618L379N351P235Q346R687J1766J3444J4005
58896G54282J4299J4719J4055J1767R494Q884R524J0311J1343J3015J4781J6143
$$ plain form
58993 731611 736209 739762 742226 743603 744116 744421 744805 744595 742993 740023 736073 731203 725620 720218 715843
58978 715843 712641 710781 711061 713927 718655 724416 731442 740216 750246 760750 771849 783907 796320
58965 796320 808159 819541 831128 842719 853544 863569 873275 882344 889688 894624 897036 896650 893141
58952 893141 886774 878031 866899 853401 838501 823448 808538 793430 778395 764222 751207 739194
58940 739194 728418 719280 711489 704376 697933 692725 688971 686483 685263 685352 686281 687381 688466 689646 690859
58925 690859 692164 693958 696235 698205 699301 699896 700285 699745 697544 694170 690585 686971 683185 679728 677196
58910 677196 675421 674214 674221 675896 678451 681069 684448 689799 697034 705380 715067 726833 740277 754282
58896 754282 768581 783300 797355 809122 818616 827500 837024 847335 858678 871693 886474 902617
58884I02617J7548J9005J9262J7601J5110J2950J0700P663M421J810m50k881n181
58871A020175p052q863j0509j0965r992q874q463p932o570n273n030n340n434
58858I19878n744o862q230r121r792j0614j1194j1263j1252j1176j0284q571p137
58845G98638o337n260l828l485m847o624p942r655j2113j3770j3552j2590j2035
58832F86600j1144r250p634p528p892p153n526l898k069N5J223P82K44R92K043
58817F29845K068J962L144M826N402N206N504N840M936L225K179J791Q97o00j890
58802F74335k962m240n144m872m017l803m231m520m617m846m906m640m722n289
58788F11526n116l613k209k099k117o77J544K958L652M521N079M518L795M356
$$ plain form
58884 902617 920165 939170 958432 976033 991143 1004093 1014793 1022456 1026877 1028687 1028237 1025356 1020175
58871 1020175 1013123 1004260 993751 982786 972794 963920 955457 947525 940955 935682 930652 925312 919878
58858 919878 914134 907272 899042 889921 880129 869515 858321 847058 835806 824630 814346 805775 798638
58845 798638 792301 787041 783213 779728 774881 768257 760315 750660 738547 724777 711225 698635 686600
58832 686600 675456 666206 658572 651044 643152 635999 630473 626575 624506 624561 625784 626566 626810 627802 629845
58817 629845 631913 633875 637019 641845 647247 652453 657957 663797 668733 671958 674137 675928 676825 676225 674335
58802 674335 671373 667133 661989 657117 653100 649297 645066 640546 635929 631083 626177 621537 616815 611526
58788 611526 606410 602797 600588 598489 596372 595695 597239 600197 603849 608370 613449 617967 621762 626118
58774F26118N572N740M759L682K325k80l635o184p520q355q726q087o734n441
58760E93234m261l122k747l406l736k493m62R55J921L175M141L999L442L370L011
58745E97021J427k58l99N37J064J316K282L467L715L470L893M532M238L518L708
58730F33531M590N075N389O245O855O165N162N452O411O274N270N053N739O208
58716G13419O604P851R279R433Q796R060J0079J0168R015P705O189L367n32m090
58702H06343p008r990j2708j4301j5438j7471j9892k1015k0758k0338j9809j8302
58690F09313j6254j4740j3201j0416p234n620n459n057m346m640n552n256l728
58677E07810k857l257l744l890m327m487k974l32J261J386J911L841O125P861
$$ plain form
58774 626118 631690 637430 642189 645871 648196 647916 644281 638097 630577 622222 613496 605409 598675 593234
58760 593234 588973 585851 583104 579698 575962 573469 573007 573962 575883 579058 583199 587198 590640 594010 597021
58745 597021 598448 598190 597791 598328 599392 600708 602990 606457 610172 613642 617535 622067 626305 629823 633531
58730 633531 638121 643196 648585 654830 661685 667850 673012 678464 684875 691149 696419 701472 707211 713419
58716 713419 720023 727874 737153 746586 755382 764442 774521 784689 793704 801409 807598 810965 810433 806343
58702 806343 799335 789345 776637 762336 746898 729427 709535 688520 667762 647424 627615 609313
58690 609313 593059 578319 565118 554702 547468 541848 536389 531332 526986 522346 516794 511538 507810
58677 507810 504953 501696 497952 494062 489735 485248 482274 481942 483203 484589 486500 490341 496466 504327
58663E04327R401J0957J2160J2960J3117J1252O585J043k705m630o302p538p061
58650E53566n748n781o904o864n437m691n246n497m730l918l266k029q50j155
58636D91450k173j690J62J131Q83J324K696K927J445J65k8m56j540j825r91p22
58620D92758j612k109j408n62N0J498L769N309N809O689Q133Q484P247N899N128
58605E45082M076K795K538L057K607J181O63J231Q63r31k149j886j647k191k221
58590E53068j204l94m2J280L642N117N156N567P136Q421Q809R661J1273J1876
58576F29366J0811R756R711R620Q960Q654Q592P376N575N961R454J3845J7499
58563G55180K1092K4818K7276K8312K9654L1570L2154L0834K9190K7269K2863
$$ plain form
58663 504327 513728 524685 536845 549805 562922 574174 580759 581802 579097 574467 568165 560627 553566
58650 553566 547818 542037 535133 528269 522832 518141 512895 507398 502668 498750 495484 493455 492605 491450
58636 491450 489277 487587 487749 488880 489763 491087 493783 496710 498155 498320 498292 497836 496296 494471 493480 492758
58620 492758 491146 489037 487629 487067 487117 488615 492384 497693 503502 510191 518324 526808 534055 539954 545082
58605 545082 549158 551953 554491 557548 560155 561336 561999 563230 564093 563162 561013 559127 557480 555289 553068
58590 553068 551864 551470 551428 552708 556350 561467 566623 572190 579326 587747 596556 606217 617490 629366
58576 629366 640177 649933 659644 669264 678224 686878 695470 702846 708421 714382 723836 737681 755180
58563 755180 776272 801090 828366 856678 886332 917902 950056 980890 1010080 1037349 1060212
58552A060212J5684Q533L024k158p428j0639j0925j0379j0204q997o566n553p251
58539A007353r621j1514j4890k0468k5128k6369k5930k6179k6246k4536k1968
58528G74504j9879j7425j3813j0468q568o939m677l218l585m263l959l779m564
58515F69367m800l447k083k146k595k344k280k944k989j914j503k664l658l268
58501F30732k699k609j491J014K535J781P07Q48Q46k77q25K85J324J120J264K745
58485F37300L870L868M932Q168J1095J1870J2394J4602J7133J8489J9890K2068
58473G85679K2736K0228J6365J2892Q528K390l225o519r116j2325j4158j3156
58461H10319j1446j0692q817m246L24K211L261O211R859J1871J3222J5710J7818
$$ plain form
58552 1060212 1075896 1084429 1087453 1085295 1077867 1067228 1056303 1045924 1035720 1026723 1020157 1014604 1007353
58539 1007353 997732 986218 971328 950860 925732 899363 873433 847254 821008 796472 774504
58528 774504 754625 737200 723387 712919 704351 697412 692735 689517 685932 681669 677710 673931 669367
58515 669367 664567 661120 659037 656891 654296 651952 649672 646728 643739 641825 640322 637658 634000 630732
58501 630732 628033 625424 623933 624947 627482 629263 629970 630818 631664 631387 630562 630847 632171 633291 634555 637300
58485 637300 641170 645038 649970 658138 669233 681103 693497 708099 725232 743721 763611 785679
58473 785679 808415 828643 845008 857900 866428 868818 865593 859074 849958 837633 823475 810319
58461 810319 798873 788181 779364 775118 775442 777653 780914 787125 796984 808855 822077 837787 855605
58448H55605J7029J3831R905M973j262o775j0091j2737j5844j7413j6067j4055
58436H07099j3335j2101q665n198l918l094n83K038K705K836M338O024O633P891
58422G92670J0839J2793J1790J0191J0027Q791M191j079l796n450q315j0352r201
58409H23099p381q205r921r258p446p416q167p211n575n269m767k105N77O70J05
58394G41730J767M142M577M440N881O925N260L388M357N856M343J697J802L683
58380G99848M058L594M528N113K664o43j051M67R30J347M018O949P166O572Q439
58365H53999J1085J1198J0295J1549J3479J3157J2413J4224J6305J5093J2716
58354I95513J3000J3877J1129O459M431M318K478q3q9J054K37m38K590O689P032
$$ plain form
58448 855605 872634 886465 896370 901343 900081 893306 883215 870478 854634 837221 821154 807099
58436 807099 793764 781663 772998 767800 763882 760788 760205 762243 764948 767784 772122 778146 784779 792670
58422 792670 803509 816302 828092 838283 848310 857101 861292 860213 856417 850967 842652 832300 823099
58409 823099 815718 807513 797592 788334 780888 773472 765305 758094 752519 747250 742483 740378 740955 741625 741730
58394 741730 743497 747639 752216 756656 762537 769462 774722 778110 782467 788323 792666 794363 796165 799848
58380 799848 803906 807500 812028 817141 819805 819162 818111 818578 819508 820855 824873 831822 838988 845560 853999
58365 853999 865084 876282 886577 898126 911605 924762 937175 951399 967704 982797 995513
58354 995513 1008513 1022390 1033519 1039978 1044409 1048727 1051205 1051122 1051033 1052087 1052324 1051886 1054476 1061165 1068197
58339A068197N334O483R436R796Q708J0591J4400J5714J5264J6954J9639J9331
58327A219847J7356J7793J9039J6484J1382Q579P676M990J828J985L489J830j050
58314A331228K1L772N129M870P251J0774J0952R564J1437J4685J4215J2032J3729
58301A449659J7557J7726J5760J7434K1148K0739J7467J7507J9937J9046J6346
58290A650326J8065K2703K3412K0942K1822K5462K5711K3408K4625K8150K7730
58279A912356K4981K6725L1311L1333K8201K9950L6045L8711L7970M0751M6346
58268B284680M7636M5684M8065N3778N5086N3095N5909O2623O5092O4249O8145
58257B904042P5160P6242P2455P2841P6398P4342O8728O9861P6518P8359P6576
$$ plain form
58339 1068197 1073531 1080014 1089450 1099246 1107954 1118545 1132945 1148659 1163923 1180877 1200516 1219847
58327 1219847 1237203 1254996 1274035 1290519 1301901 1310480 1318156 1323146 1324974 1326959 1330448 1332278 1331228
58314 1331228 1331249 1335021 1340150 1345020 1352271 1363045 1373997 1383561 1394998 1409683 1423898 1435930 1449659
58301 1449659 1467216 1484942 1500702 1518136 1539284 1560023 1577490 1594997 1614934 1633980 1650326
58290 1650326 1668391 1691094 1714506 1735448 1757270 1782732 1808443 1831851 1856476 1884626 1912356
58279 1912356 1937337 1964062 1995373 2026706 2054907 2084857 2120902 2159613 2197583 2238334 2284680
58268 2284680 2332316 2378000 2426065 2479843 2534929 2588024 2643933 2706556 2771648 2835897 2904042
58257 2904042 2979202 3055444 3127899 3200740 3277138 3351480 3420208 3490069 3566587 3644946 3721522
58246C721522Q1769R2496R7279R7035J03389J15463J21226J21559J29179J43725
58236D824642J52432J55765J66891J85199J96760K01859K14812K35388K48931
58227F582679K56107K72877K99366L19612L34032L59808L96847M27283M51325
58218I699936M88149N38629N84459O27176O88398P68125Q44772R19928J018516
58209A6178088J141439J266732J401465J579879J805581K052572K328499K675005
58201C0429260L101594L590014M171232M921400N876194P037207Q468855J0287211
58193G7882967J2549259J5275816J8584435K2643163K7490671L3075816L9328119
58186B46830246M5573531M9559181M7719774L7527983K0050442j44581j7925947
$$ plain form
58246 3721522 3803291 3895787 3993066 4090101 4193490 4308953 4430179 4551738 4680917 4824642
58236 4824642 4977074 5132839 5299730 5484929 5681689 5883548 6098360 6333748 6582679
58227 6582679 6838786 7111663 7411029 7730641 8064673 8424481 8821328 9248611 9699936
58218 9699936 10188085 10726714 11311173 11938349 12626747 13394872 14239644 15159572 16178088
58209 16178088 17319527 18586259 19987724 21567603 23373184 25425756 27754255 30429260
58201 30429260 33530854 37120868 41292100 46213500 52089694 59126901 67595756 77882967
58193 77882967 90432226 105708042 124292477 146935640 174426311 207502127 246830246
58186 246830246 292403777 341962958 389682732 427210715 447261157 447116576 429190629
58179D29190629l0487504l7724258m0718021m0515339l8021610l4189049k9858251
58172A77676597k5553805k1559203j8055018j5105056j2643492j0584059q893340
58165F5282624p532056o414307n472388m696134m073319l552186l093839k705256
58157B7743139k390994k121688j875595j664958j497229j351609j214483j098658
58149A4527925j008552r23526q33173p53872o94114o37262n73971n18828m79748
58140H104879m42182l98697l64245l47161l32961l11231k91941k81395k67898
58131E067168k44967k24511k13705k01905j82898j67493j61789j54752j39545
58122C375603j26299j21848j17015j05639r6554r5197r2308q2327p4636p5240
$$ plain form
58179 429190629 398703125 360978867 320260846 279745507 241723897 207534848 177676597
58172 177676597 152122792 130563589 112508571 97403515 84760023 74175964 65282624
58165 65282624 57750568 51336261 45863873 41167739 37094420 33542234 30448395 27743139
58157 27743139 25352145 23230457 21354862 19689904 18192675 16841066 15626583 14527925
58149 14527925 13519373 12595847 11762674 11008802 10314688 9677426 9103455 8584627 8104879
58140 8104879 7662697 7264000 6899755 6552594 6219633 5908402 5616461 5335066 5067168
58131 5067168 4822201 4597690 4383985 4182080 3999182 3831689 3669900 3515148 3375603
58122 3375603 3249304 3127456 3010441 2904802 2808248 2713051 2620743 2538416 2463780 2388540
58112B388540p4987o7237o0143o0231o0255n4389m9679n1415n2361m7260m3331
58101A767252m5801m7198m1541l5560l5534l6118l2262k9446l2079l4014l0369
58090A367330k6952k8595k9605k5115k0596k1032k1592j7998j5361j7895k0342
58079A122247j8299j6802k0020k2647k0070j7259j8995k0898j8583j6353j8305
58068I14016j9925j6935j3679j4501j5386j2290r321j0458j1475q152m635n606
58056G71653p852p397p412j1183j4631j3585j1462j2269j2929r965o853p396q481
58043F40238o596m893o661q481o903n350p325r269p260m436m674n284l147j764
58029E58195m821q716q886p846r563j1530r858p085p413q989q074o273o706p461
$$ plain form
58112 2388540 2313553 2246316 2186173 2125942 2065687 2011298 1961619 1910204 1857843 1810583 1767252
58101 1767252 1721451 1674253 1632712 1597152 1561618 1525500 1493238 1463792 1431713 1397699 1367330
58090 1367330 1340378 1311783 1282178 1257063 1236467 1215435 1193843 1175845 1160484 1142589 1122247
58079 1122247 1103948 1087146 1067126 1044479 1024409 1007150 988155 967257 948674 932321 914016
58068 914016 894091 877156 863477 848976 833590 821300 811979 801521 790046 781894 777259 771653
58056 771653 763801 756404 748992 737809 723178 709593 698131 685862 672933 662968 656115 648719 640238
58043 640238 633642 628749 622088 613607 606704 601354 594029 584760 577500 573064 568390 563106 559959 558195
58029 558195 553374 544658 535772 527926 518363 506833 496975 489890 482477 473488 465414 459141 452435 444974
58015D44974n588l294l686m689l375j920l047m178k298j11j055k677j275J160
58001D08941R97k40N63J888R94l44M22J016j489m751n233m411n190o094m769l267
57985C79033m013m478j870Q90j1k321j790M10N98m98k4J029J26j397j045k75j387
57968C62977k454r01J109N25p25M95K308J390n16J26J920J363l92l5J245K3k658
57951C65800l207k161k836m877n189l796l180l152j690M71J223J468L303N491
57937C47668N624M894N892P630P667P114Q430J0211R369O602M644L028k80l942
57923D24551n191n011o196q025q043p323q564j0501r760o904n324n282m379k845
57909C31203k965m129l605j592o42p32K74K030K165P16k87q50k265l385k058N87
$$ plain form
58015 444974 439386 436092 432406 427717 424342 422422 419375 415197 412899 412788 411733 409056 407781 408941
58001 408941 409938 409698 410261 412149 413143 412799 413221 414237 412748 407997 402764 398353 393163 387069 382300 379033
57985 379033 375020 370542 368672 369562 369551 367230 365440 365850 366448 365950 365926 366955 367081 365684 364639 364364 362977
57968 362977 360523 359622 360731 361256 360531 361026 363334 364724 364208 364334 366254 367617 367225 367190 368435 368458 365800
57951 365800 362593 360432 357596 352719 347530 343734 340554 337402 335712 336183 337406 338874 342177 347668
57937 347668 353292 358186 364078 371708 379375 386489 394919 405130 414499 421101 425745 428773 428493 424551
57923 424551 419360 414349 408153 400128 392085 384762 376198 365697 355937 349033 343709 338427 334048 331203
57909 331203 328238 324109 320504 318912 318270 317538 317812 319842 322007 322723 322436 321586 319321 315936 313878 314465
57893C14465J655J328J980L535M022L706M298N148M451L152L308L864K551O76
57879C58139J303L666M147K140K45n72j572k597k262j280j511k381k063j277j884
57864C52241k942k290q67j086k224j819l86j10j87J739M595N253L952L451L796
57849C63116K925J554K205L990L589J067m47m35j211k723k503q50p87k545l095
57834C63850j622o54j205j478q56p70j142l05J201J136n8K91K110K632J512J175
57818C65817J904J324p06j495m79j78j526k733l479n625q959j0678j0096r568
57804C13523r934r357p454o230o031m895k783k074k921k606o06K19j238k401j632
57789B53580n51k91M00J820K075Q22M21J804K911K644K650L766M455M201M708
$$ plain form
57893 314465 316120 317448 319428 322963 326985 330691 334989 340137 344588 347740 351048 354912 357463 358139
57879 358139 359442 363108 367255 369395 369640 369068 367496 364899 362637 361357 359846 357465 355402 354125 352241
57864 352241 349299 347009 346142 345056 342832 341013 340627 340517 340330 342069 346664 351917 355869 359320 363116
57849 363116 366041 367595 369800 373790 377379 378446 377999 377564 376353 373630 371127 370277 369490 366945 363850
57834 363850 362228 361574 360369 358891 358035 357265 356123 355818 357019 358155 358097 358388 360498 363130 364642 365817
57818 365817 367721 369045 368339 366844 366365 366187 364661 361928 358449 352824 343865 333187 323091 313523
57804 313523 303589 294232 286778 280548 274517 269622 266839 264765 261844 259238 258632 258851 257613 255212 253580
57789 253580 253029 252738 253138 254958 257033 257855 258276 260080 262991 265635 268285 272051 276506 280707 285415
57774B85415O278O721N406M641N441N611L805J841J232Q04m43j442j659k308l486
57759C17857l369j770j027j820j689N39K457K179J329J744K451K128J646J945
57745C24600K092J456J203J763J435n94k487k738k431k784k979k257j662j987
57731C12630k175j388m80l5P77K175K901K555K395K748K235N57n52k37K29J70
57715C24505O42J882K388J688J139J068J10j644k094q60k50j229j784p15L28J30
57699C25304r5L98L16o59p05O16R65p81k531k767k987m299n152m561m251n201
57683B93610n414l580j660j266o44J938M965O584P937J0650J3865J6579K0301
57670C63865K6487L3894M1342N0324O1610P1276P3272O4276M4304J5572j6225
$$ plain form
57774 285415 291693 298414 303820 308461 313902 319513 323318 325159 326391 327195 326752 325310 323651 321343 317857
57759 317857 314488 312718 311691 309871 308182 308721 311178 313357 314686 316430 318881 321009 322655 324600
57745 324600 326692 328148 329351 331114 332549 331955 329468 326730 324299 321515 318536 316279 314617 312630
57731 312630 310455 309067 308587 308552 309329 311504 314405 316960 319355 322103 324338 324895 324343 324106 324335 324505
57715 324505 325147 327029 329417 331105 332244 333312 333422 331778 329684 328824 328574 327345 325561 324846 325174 325304
57699 325304 325209 325607 325923 325264 324559 325175 326140 325359 322828 320061 317074 312775 307623 303062 298811 293610
57683 293610 288196 284616 282956 281690 281046 282984 287949 294533 302470 313120 326985 343564 363865
57670 363865 390352 424246 465588 515912 577522 648798 722070 786346 830650 846222 829997
57659H29997m2498n7558o2621o1938n7382m9584m1227l5065l0366k4948j9350
57648C47460j5725j3982j2225r968q020o312m489l423l643l640k127m31k11n51
57634B62713P1P89J60q12m75L00j88j158r17l04j252l091l630k886k552k572j617
57617B42579k10k04j444j991j401r27q06j60O80M30o08p93R2O77N35O24J197J338
57599B39608O97j34r35j926k710k651k060j671j441j085j098j781k231j744j191
57584B17647j456j673p17O89J208J058J079Q03m63j756j797j254j541k321k390
57569B07116k062k331k560j411M79J147K65p05r36p97m38L11Q68N94J60O55J784
57552B02139K584L206M263N148M791L498K311J222l70j997k672k413j761n46J332
$$ plain form
57659 829997 787499 729941 667320 605382 548000 498416 457189 422124 391758 366810 347460
57648 347460 331735 317753 305528 295560 287540 281228 276739 273316 269673 266033 263906 263475 263264 262713
57634 262713 262784 263573 263733 262921 262446 262746 262558 261400 260483 260179 258927 255836 252206 249320 246768 244196 242579
57617 242579 242369 242165 240721 238730 237329 236402 235596 235436 236116 236546 235938 235145 235237 235914 236449 237073 238270 239608
57599 239608 240305 240171 239236 237310 234600 231949 229889 228218 226777 225692 224594 222813 220582 218838 217647
57584 217647 216191 214518 213801 214490 215698 216756 217835 218638 218175 216419 214622 213368 211827 209506 207116
57569 207116 205054 202723 200163 198752 199231 200378 200643 199938 199002 198205 197767 198078 198946 199540 199700 200355 202139
57552 202139 204723 207929 212192 217340 222131 225629 227940 229162 228792 226795 224123 221710 219949 219403 220735
57537B20735K831L071K757K748K389R27o03q59l65l26m21J44O30L1p50k93P95
57520B33441J046Q82J694L054L362K690K484K972L199L113L363L479K528J171
57506B68478Q03J141Q23L5J66J213J727J181L77l27j257k132k313k055j935j604
57490B64321o50O6l10r48p40k78n49q52j79N62J53l27Q11K656L043K233K162K734
57472B73908K070J45r96o53j47j1O15J601J604N81P8O36J219J346J607J881J354
57455B86838M38M95J555K348K578K976L261K422R55M78J064J273Q14Q14J419J568
57439C11296J217J469K313K544K029J854K176K147J919K373L002K534J518J697
57425C40088K836K993K004J827L064L986L555K764K393J994J677K336L497L468
$$ plain form
57537 220735 223566 226637 229394 232142 234531 235458 234855 233996 233631 233305 232884 233028 233658 233689 232939 232646 233441
57520 233441 234487 235369 237063 240117 243479 246169 248653 251625 254824 257937 261300 264779 267307 268478
57506 268478 269281 270422 271245 271280 271446 272659 274386 275567 275944 275617 274360 272228 269915 267860 265925 264321
57490 264321 263671 263737 263427 262479 261739 261461 260912 260060 259881 260443 260596 260269 261080 263736 266779 269012 271174 273908
57472 273908 275978 276123 275127 274474 274327 274316 274931 276532 278136 278717 278795 279431 280650 281996 283603 285484 286838
57455 286838 287276 287771 289326 291674 294252 297228 300489 302911 303866 304344 305408 306681 307495 308309 309728 311296
57439 311296 312513 313982 316295 318839 320868 322722 324898 327045 328964 331337 334339 336873 338391 340088
57425 340088 342924 345917 347921 349748 352812 356798 360353 363117 365510 367504 369181 371517 375014 378482
57411C78482K260J884L110M392M674M714M930M437L083K135K033J718R59J023
57397D19834K217L034K617J981J965K137K348L190M278M305L483L541M782N585
57383D65297N480N992P495Q055O633M912M549M979N249N629O077N455L768K881
57369E42451L537L858K441P74P86K002K898L343L883M175L865L639L903L833L042
57354E88430K688L561M629M875N032O008P109P308O961O797O501N725N233N609
57340F66466O010N554M847M885N517O086O507O655N941M558L925M752N909O212
57326G43824O075O290O485O062N496N511N881O087O186O250N981N702O372P915
57312H30117Q842Q452P958Q444R138Q865P879P127O816O756P108P744P968P682
$$ plain form
57411 378482 380742 382626 385736 390128 394802 399516 404446 408883 411966 414101 416134 417852 418811 419834
57397 419834 422051 425085 427702 429683 431648 433785 436133 439323 443601 447906 451389 454930 459712 465297
57383 465297 470777 476769 484264 492319 498952 503864 508413 513392 518641 524270 530347 535802 539570 542451
57369 542451 545988 549846 552287 553061 553847 555849 558747 562090 565973 570148 574013 577652 581555 585388 588430
57354 588430 591118 594679 599308 604183 609215 615223 622332 629640 636601 643398 649899 655624 660857 666466
57340 666466 672476 678030 682877 687762 693279 699365 705872 712527 718468 723026 726951 731703 737612 743824
57326 743824 749899 756189 762674 768736 774232 779743 785624 791711 797897 804147 810128 815830 822202 830117
57312 830117 838959 847411 855369 863813 872951 881816 889695 896822 903638 910394 917502 925246 933214 940896
57298I40896P760Q572R340R584R842J0251R969Q861Q223Q852R828J0180J0342
57285A062500J0954J1613J1842J1983J2220J2018J1416J1449J2468J3434J3674
57274A195571J3779J3995J3531J2397J2130J3397J4660J4530J3823J3910J4527
57263A346250J4688J4426J4149J3479J2037J0403R259Q668Q883J0439J2600J3432
57251A488713J2477J1640J2333J3553J3991J4109J4617J4718J3669J2496J2400
57240A634716J2785J2530J1975J2030J2489J2816J3348J4296J4692J3837J2682
57229A778196J2402J2704J2849J3041J3559J3776J3404J3351J4078J4513J3955
57218A925828J3539J4313J5323J5195J4250J3552J3107J2551J2357J2907J3610
$$ plain form
57298 940896 948656 957228 966568 976152 985994 996245 1006214 1015075 1023298 1032150 1041978 1052158 1062500
57285 1062500 1073454 1085067 1096909 1108892 1121112 1133130 1144546 1155995 1168463 1181897 1195571
57274 1195571 1209350 1223345 1236876 1249273 1261403 1274800 1289460 1303990 1317813 1331723 1346250
57263 1346250 1360938 1375364 1389513 1402992 1415029 1425432 1434691 1443359 1452242 1462681 1475281 1488713
57251 1488713 1501190 1512830 1525163 1538716 1552707 1566816 1581433 1596151 1609820 1622316 1634716
57240 1634716 1647501 1660031 1672006 1684036 1696525 1709341 1722689 1736985 1751677 1765514 1778196
57229 1778196 1790598 1803302 1816151 1829192 1842751 1856527 1869931 1883282 1897360 1911873 1925828
57218 1925828 1939367 1953680 1969003 1984198 1998448 2012000 2025107 2037658 2050015 2062922 2076532
57207B076532J4110J4971J6016J5798J4107J3018J3843J4995J4698J3797J3749
57196B235634J3879J3044J2273J3023J4195J3617J1461R635Q720P937P359P643
57184B368420Q180P774O661N908N495M873M558N255O235O496O590P324P832P094
57170B458695O255O952Q345Q418P530P896R946J1828J2434J2452J2397J1842J0848
57157B585838J0200R949R380Q447P799P459O820N768M607L342K161J887K600K830
57143B669087J598K38M27J519J774J293J568K807L851M277M575M656M060L220
57129B704950K802K358J252J98J17K85m95j636j613k70J614M259Q393J3566J8921
57114B754701K4900L2266M0292M7884N5599O4618P4763Q5748R9211J17157J39439
$$ plain form
57207 2076532 2090642 2105613 2121629 2137427 2151534 2164552 2178395 2193390 2208088 2221885 2235634
57196 2235634 2249513 2262557 2274830 2287853 2302048 2315665 2327126 2336761 2345481 2353418 2360777 2368420
57184 2368420 2376600 2384374 2391035 2396943 2402438 2407311 2411869 2417124 2423359 2429855 2436445 2443769 2451601 2458695
57170 2458695 2464950 2471902 2480247 2488665 2496195 2504091 2514037 2525865 2538299 2550751 2563148 2574990 2585838
57157 2585838 2596038 2605987 2615367 2623814 2631613 2639072 2645892 2651660 2656267 2659609 2661770 2663657 2666257 2669087
57143 2669087 2670685 2670923 2671350 2672869 2674643 2675936 2677504 2680311 2684162 2688439 2693014 2697670 2701730 2704950
57129 2704950 2707752 2710110 2711362 2711560 2711677 2711962 2711467 2709831 2708218 2707948 2709562 2713821 2722214 2735780 2754701
57114 2754701 2779601 2811867 2852159 2900043 2955642 3020260 3095023 3180771 3279982 3397139 3536578
57103C536578J65300J96498K36278K86174L46478M19110N07349O13286P38005
57094G045056Q83418J051203J240345J447624J669064J898338K125593K341242
57086A9701883K539711K716603K864282K973636L036031L035807K941588K714152
57078D2523693K328834J790377J129937L96047l50981j048417j648180k128394
57070D2992916k487935k732803k869814k908624k863050k749211k584284k386106
57062B1411089k171029j951590j736815j533621j346731j178404j029649r00943
57054I562307p91151o97301o16544n47385m88413m37469l92923l54331l21029
57045D915761k91492k64830k41425k21344k03639j87760j74105j62536j52010
$$ plain form
57103 3536578 3701878 3898376 4134654 4420828 4767306 5186416 5693765 6307051 7045056
57094 7045056 7928474 8979677 10220022 11667646 13336710 15235048 17360641 19701883
57086 19701883 22241594 24958197 27822479 30796115 33832146 36867953 39809541 42523693
57078 42523693 44852527 46642904 47772841 48168888 47817907 46769490 45121310 42992916
57070 42992916 40504981 37772178 34902364 31993740 29130690 26381479 23797195 21411089
57062 21411089 19240060 17288470 15551655 14018034 12671303 11492899 10463250 9562307
57054 9562307 8771156 8073855 7457311 6909926 6421513 5984044 5591121 5236790 4915761
57045 4915761 4624269 4359439 4118014 3896670 3693031 3505271 3331166 3168630 3016620
57036C016620j42266j34116j27471j20877j13570j06132r8531q9480p8277o5319
57026A940581n0501l4068k0009j5541k4788m4395o6655q5211r6833j00420r6980
57015A305180q9419q0356p0693o1003n2630m6162m0467l4724k9950k7082k5064
57004G47630k2435j9584j7844j7331j7174j7015j6889j6398j5144j3420j1689
56993E62707j0086q926q626q619p560n132k388J11L021O580R893J2291J3635J2802
56979E69703Q134L58p105j1955j5124j7881j9220j7875j4976j2548j0796q818
56967D41897o759n307m024k019N38K969N441Q363J1360J4086J7081K0428K2288
56954E26342K0260J3740M212o038j4716k0123k2179k2255k1433j9745j7397j5266
$$ plain form
57036 3016620 2874354 2740238 2612767 2491890 2378320 2272188 2173657 2084177 2005900 1940581
57026 1940581 1890080 1856012 1836003 1820462 1795674 1751279 1684624 1599413 1502580 1402160 1305180
57015 1305180 1215761 1135405 1064712 1003709 951079 904917 864450 829726 799776 772694 747630
57004 747630 725195 705611 687767 670436 653262 636247 619358 602960 587816 574396 562707
56993 562707 552621 543695 535069 526450 518890 513758 511370 511481 514502 521082 530975 543266 556901 569703
56979 569703 577837 578195 571090 559135 544011 526130 506910 489035 474059 461511 450715 441897
56967 441897 435138 429831 425807 423788 424326 427295 432736 441099 452459 466545 483626 504054 526342
56954 526342 546602 560342 564554 558516 543800 523677 501498 479243 457810 438065 420668 405402
56942D05402j3481j1032p612m313j676J264N007Q423J0883J3849J8878K5336L1248
56929D82176L4884L4250K7030J3251l068j6864k5954l0930l2596l1351k8221k4583
56917C98024k1112j7990j5475j3390j1071q692p513p810p960o730n053m239l854
56904B67135k845j492o60k43J99L51J06N04K234M330N691O703Q060R335J0258
56889C09666J2002J5472J9528K2686K5152K7251K7074K2148J2867K288p047j4297
56877D74790j9061k0887k0048j7382j3548r354n977l683j233K357O473J0554J5609
56864C98610K2530L0114L6799M3309N1410O0532O7218O7450N8373L9298J3336
56853H88979j2753l2642m4454m9741m9837m5294l7821k9931k2644j5431q189j415
$$ plain form
56942 405402 391921 380889 373277 368964 367288 368552 373559 381982 392865 406714 425592 450928 482176
56929 482176 517060 551310 578340 591591 588523 571659 545705 514775 482179 450828 422607 398024
56917 398024 376912 358922 343447 330057 318986 310294 302781 294971 287011 280281 275228 270989 267135
56904 267135 264290 262798 262138 261895 262094 262445 262551 263055 265289 269619 275310 282013 290073 299408 309666
56889 309666 321668 337140 356668 379354 404506 431757 458831 480979 493846 496134 489087 474790
56877 474790 455729 434842 414794 397412 383864 374510 368533 364850 363617 365974 372447 383001 398610
56864 398610 421140 451254 488053 531362 582772 643304 710522 777972 836345 875643 888979
56853 888979 876226 843584 799130 749389 699552 654258 616437 586506 563862 548431 540242 538827
56841E38827N343J3210K2208L1537M1476N3288O7260Q2376R7378J09827J14049
56830A176779J02740P2713K8965j7481n5737q0154r1269r2924q8485p9684o8163
56819H07300n6316m5684l5887k6209j7132r199j510P237J7071K7418L8529N0917
56807G56535O3911P5372Q1681P7588N8652K6310j0827m2747o4550p6390p9597
56796H65938p5769o8073n9860n1911m3272l4323k6677k0529j4619q560k954K601
56784D61992R245J6748K3899L0746L7909M3400M2705L3047J6149l502k1575l5144
56772F55619m3104m6338m6512m4397m0197l4929l0084k6084k2436j9153j6635
56761B85750j4488j2000r513p909p091o355n740n559n190l950k632k386k715k392
$$ plain form
56841 538827 544170 557380 579588 611125 652601 705889 773149 855525 952903 1062730 1176779
56830 1176779 1279519 1352232 1381197 1363716 1307979 1227825 1136556 1043632 955147 875463 807300
56819 807300 750984 705300 669413 643204 626072 616873 615363 622600 639671 667089 705618 756535
56807 756535 820446 895818 977499 1055087 1113739 1140049 1129222 1086475 1021925 945535 865938
56796 865938 790169 722096 662236 610325 567053 532730 506053 485524 470905 462345 459391 461992
56784 461992 471237 487985 511884 542630 580539 623939 666644 699691 715840 712338 690763 655619
56772 655619 612515 566177 519665 475268 435071 400142 370058 343974 321538 302385 285750
56761 285750 271262 259262 249749 241840 234749 228394 222654 217095 211905 207955 205323 202937 200222 197830
56747A97830j752k002k809k740j781j284j522j507j130j339k091k154j178j22
56733A74419M72R13J079N17k17q8N67M71l91q66p41q58j198q55QJ73n08q18j91
56714A71888P22J520K353K794K227J298J191J584J226L71M95J662K343J972J454
56699A95100J058R0j052q33Q26K019J616O47L05L44J84oM4K40O83J421J740J055
56681B05481K83O46J544J483P45Q65J677J421j38j237j154j212k209l083k895
56666B02217k094j246l61Q8n71j631j633p53m53p57k44J012J244K14j22R83J746
56649A97639R82L5L52J348J982K347K522J815M47K9J124K131J788J026J135J704
56633B18406J707J160N88M1m29m61j93k05l40oK84n68k021k317j299p37j359j962
$$ plain form
56747 197830 196078 194076 191267 188527 186746 185462 183940 182433 181303 179964 177873 175719 174541 174419
56733 174419 174891 175804 176883 177400 177183 177095 177662 178133 177742 176876 176135 175277 174079 173224 173232 173405 172897 172079 171888
56714 171888 172610 174130 176483 179277 181504 182802 183993 185577 186803 187174 187669 189331 191674 193646 195100
56699 195100 196158 196248 195196 194363 195189 197208 198824 199471 199776 200120 200304 200298 200342 200582 201265 202686 204426 205481
56681 205481 205764 206410 207954 209437 210182 211047 212724 214145 214007 212770 211616 210404 208195 205112 202217
56666 202217 200123 198877 198516 198604 198033 196402 194769 194016 193563 192806 192562 193574 194818 195032 194910 195893 197639
56649 197639 198621 198656 199008 200356 202338 204685 207207 209022 209469 209498 210622 212753 214541 215567 216702 218406
56633 218406 220113 221273 221861 221902 221473 221012 220819 220614 220274 220268 220552 219984 217963 215646 214347 213610 212251 210289
56615B10289j881j960k407k184j333j391k531k795j293K71N30M70J166J733J136
56600A97820L2o42j100j517j240l22P0j98K55J645K183J096J08N09J111O64J4
56583B00488J77M13L6J01J340K414K055J221J265J659J413J101J632K411K553
56568B20279K553L205M134M764N469O509P279P752R063J1600J4215J6120J7510
56555C30452J7482J4030P595J972j96m67j280k209j811q41q91j617j893k196l458
56540C54672m921n354n189n407n676n423n318n863o054n257m686n177n413m366
56526B80568l525m316n309m534k820k139k198j513n10p23j881k480k413k559k668
56511B40980j980j152j252j741j497r48j067j324q16k62p40j496j269o75r84j608
$$ plain form
56615 210289 208408 206448 204041 201857 200524 199133 196602 193807 192514 192785 193315 193785 194951 196684 197820
56600 197820 197852 197210 196110 194593 193353 193031 193101 192903 193158 194803 196986 198082 198190 198699 199810 200474 200488
56583 200488 200665 201078 201114 201215 202555 204969 207024 208245 209510 211169 212582 213683 215315 217726 220279
56568 220279 222832 226037 230171 234935 240404 246913 254192 261944 271007 282607 296822 312942 330452
56555 330452 347934 361964 369559 371531 371335 370868 369588 367379 365568 364727 363836 362219 360326 358130 354672
56540 354672 349751 344397 339208 333801 328125 322702 317384 311521 305467 300210 295524 290347 284934 280568
56526 280568 277043 272727 267418 262884 260064 257925 255727 254214 253704 252981 251100 248620 246207 243648 240980
56511 240980 239000 237848 236596 234855 233358 232410 231343 230019 229203 228941 228201 226705 225436 224761 223777 222169
56495B22169j185j68J19rN96J429J118k0n11j71J28L41P83O43q22k408k441j356
56477B18235p21o36k18K91J76J00R89J982J805J227J701K500J784j64j298r40
56461B26813j95K96P22P21j15q55l25R02J493J522J735J626N15m70J78J733K397
56444B38693K195K339K638K003Q50M04K90p08k124k473j846j438j168j88Q77P20
56428B41064j69k69L12L36j9L70J158J106M73M19N90j46j245j258m67k28l01M38
56410B42164J375R83j95k39Q92J457R66N06L63j12o43m63j54o02q15O31K675L074
56392B51863J907R62M77n08j349n87R27R74l12q24k27o5m50j5R86Q67j44l3J436
56373B55885K444K449K665L238L034K383K805L979M024K866K192K125J241j46
$$ plain form
56495 222169 220984 220816 220935 220926 221522 222951 224069 224049 223538 223367 223495 223836 224619 225262 224440 222032 219591 218235
56477 218235 217514 216878 216660 216951 217127 217227 218216 220198 222003 223230 224931 227431 229215 229051 227753 226813
56461 226813 226618 226914 227636 228357 228242 227387 227062 227964 229457 230979 232714 234340 234855 234385 234563 236296 238693
56444 238693 240888 243227 245865 247868 248718 249122 249412 248704 246580 244107 242261 240823 239655 239467 240344 241064
56428 241064 240895 240626 240938 241274 241255 241625 242783 243889 244362 244781 245371 245225 243980 242722 242255 242027 241726 242164
56410 242164 243539 244522 244327 244088 244980 246437 247403 247909 248272 248160 247517 247054 246900 246298 245483 246114 248789 251863
56392 251863 253770 254732 255209 254701 253352 252765 253692 254666 254354 253530 253303 253238 252788 252773 253759 254626 254482 254449 255885
56373 255885 258329 260778 263443 266681 269715 272098 274903 278882 282906 285772 287964 290089 291330 291184
56359B91184j79R63J146J88R9J187J516P17O35J601J641K47o18j30J98j81J96
56342C00410J540J934Q49K94J201J896J414J293K638M179M659M569M347L400K008
56327C36631J691K695L461L299L109L002J942L49L0R09Q10p94j829j265n74o98
56311C52768o29J6Q6m28J97K230L768M109M850O482P193O340O024P546R148Q814
56295D18514O894M567K190M36N49K247L581L844M311N466O118N973O320P437Q034
56280D86481P887Q281R204R115Q082Q028R218R752R251R716J1834J3782J4607
56267F15238J5544J7112J8195J8916K0936K4127K6382K7591L0085L4384L8395
56256H86905M1738M6724N3855O0663O6458P3932Q4291R5002J04313J13920J24953
$$ plain form
56359 291184 291005 291968 293114 293302 293401 294588 296104 296821 297456 299057 300698 300945 300327 300197 300395 300214 300410
56342 300410 301950 303884 304733 305027 306228 308124 309538 310831 313469 317648 322307 326876 331223 334623 336631
56327 336631 338322 341017 344478 347777 350886 353888 355830 356179 356209 357118 357928 357134 355305 354040 353466 352768
56311 352768 352139 352155 352241 351813 352010 354240 358008 362117 366967 373449 380642 386982 393006 400552 409700 418514
56295 418514 425408 429975 432165 432601 433150 435397 438978 442822 447133 452599 458717 464690 471010 478447 486481
56280 486481 494368 502649 511853 520968 529050 537078 546296 556048 565299 575015 586849 600631 615238
56267 615238 630782 647894 666089 685005 705941 730068 756450 784041 814126 848510 886905
56256 886905 928643 975367 1029222 1089885 1156343 1230275 1314566 1409568 1513881 1627801 1752754
56245A752754J35301J43226J49951J56261J60072J59685J56183J50339J40388
56236C104160J24993J05381Q2728N6674K8126J73k5480m9650p1947q9811j02904
56225C162443j14267j25157j32712j34846j33536j31142j27450j22378j17622
56216B023333j13350j07273r9113r1909q6883q1434p4343o8259o4485o0238n3925
56205A122121m8349m5458m2669l7878l3496l1782l0538k7289k3680k1770j9950
56194G59262j6474j3348j2716j2902j1722j0283r903q877o009l728m047m898m085
56181F40270l195l957m438k672n50l56q40k47K93k13K5J860K795J657J410L751
56165F35593N489M222K956M731P215P267O561P801R521R436R101J0523J2063J2190
$$ plain form
56245 1752754 1888055 2031281 2181232 2337493 2497565 2657250 2813433 2963772 3104160
56236 3104160 3229153 3334534 3417262 3473936 3502062 3502235 3476755 3427105 3355158 3265347 3162443
56225 3162443 3048176 2923019 2790307 2655461 2521925 2390783 2263333 2140955 2023333
56216 2023333 1909983 1802710 1703597 1611688 1524805 1443371 1369028 1300769 1236284 1176046 1122121
56205 1122121 1073772 1028314 985645 947767 914271 882489 851951 824662 800982 779212 759262
56194 759262 742788 729440 716724 703822 692100 681817 671914 663037 657028 653300 649253 644355 640270
56181 640270 637075 633118 628680 626008 625458 625102 624262 624015 624308 624095 624120 625980 628775 630432 631842 635593
56165 635593 641082 645304 648260 652991 660206 667473 674034 681835 691356 700792 709893 720416 732479 744669
56151G44669J3252J6980K0526K1678K3430K8491L4037L7336M1789N1418O3764
56140A097370P4254Q3456R3732J02703J06400J05324J01383R2704P7862O1676
56130A996864N0341M4033M0050L9165M2112M3750L8034K6185J3650K209q602j6145
56118B311646j8076j8254k2581l1551m2888n7556p6224r3376j02469j04178j02835
56107A641658r8263q8361p6174o6423n7947m7184l6213k9618k6194k1515j6119
56096A077647j3412j2188q941n041l936l966j501J634J611L87K140N097N045L734
56082A048310N444Q401Q218O686Q264J1010J0182P717Q755J1686J1300Q998J0000
56069A164971J3148J3418J2022J3841J7317J7220J5116J6553K0121J9958J7040
$$ plain form
56151 744669 757921 774901 795427 817105 840535 869026 903063 940399 982188 1033606 1097370
56140 1097370 1171624 1255080 1348812 1451515 1557915 1663239 1764622 1857326 1935188 1996864
56130 1996864 2047205 2091238 2131288 2170453 2212565 2256315 2294349 2320534 2334184 2336393 2327791 2311646
56118 2311646 2293570 2275316 2252735 2221184 2178296 2120740 2044516 1951140 1848671 1744493 1641658
56107 1641658 1543395 1455034 1378860 1312437 1254490 1207306 1171093 1141475 1115281 1093766 1077647
56096 1077647 1064235 1052047 1043106 1038065 1034129 1030163 1028662 1030296 1031907 1032294 1034434 1039531 1044576 1048310
56082 1048310 1053754 1062155 1070373 1077059 1085323 1096333 1106515 1114232 1122987 1134673 1145973 1154971 1164971
56069 1164971 1178119 1191537 1203559 1217400 1234717 1251937 1267053 1283606 1303727 1323685 1340725
56058A340725J7197J9888J9803J7723J8794K1790K1131J7798J7265J8594J6834
56047A547542J4005J6006K0643K0887J7990J9084K3621K4940K3521K5540K9886
56036A783665K9949K7100K8821L4541L6901L6037L8805M4786M7096M6138M8324
56025B202163N2282N0903M6066M6273N0729N1123M8178N0388N7263O0273N9707
56014B775348O3693P1175P3315P1285P4788Q3217Q6700Q5512Q9480R8227J01741
56003C674481J00620J05447J15798J20919J21511J29152J43421J52130J55040
55994D818519J64042J78994J87822J91687K04425K25386K39520K46423K61522
55985F718340K86091L05206L18394L41791L76372M05607M28752M63457N11041
$$ plain form
56058 1340725 1357922 1377810 1397613 1415336 1434130 1455920 1477051 1494849 1512114 1530708 1547542
56047 1547542 1561547 1577553 1598196 1619083 1637073 1656157 1679778 1704718 1728239 1753779 1783665
56036 1783665 1813614 1840714 1869535 1904076 1940977 1977014 2015819 2060605 2107701 2153839 2202163
56025 2202163 2254445 2305348 2351414 2397687 2448416 2499539 2547717 2598105 2655368 2715641 2775348
56014 2775348 2839041 2910216 2983531 3054816 3129604 3212821 3299521 3385033 3474513 3572740 3674481
56003 3674481 3775101 3880548 3996346 4117265 4238776 4367928 4511349 4663479 4818519
55994 4818519 4982561 5161555 5349377 5541064 5745489 5970875 6210395 6456818 6718340
55985 6718340 7004431 7309637 7628031 7969822 8346194 8751801 9180553 9644010 10155051
55976A0155051N53931N92316O46734P19037P89564Q58523R48975J063022J179722
55967A7506875J303054J463952J667815J892418K145922K469840K876460L347784
55959C4674120L907064M621083N522149O610466P945976R642802J1760374J4314925
55951I8998959J7410725K1212146K5768528L1043225L7026869M3243500M7727576
55944C22431528M6980529L8018758K1108561L52901j8724232l2323123l9573170
55937C38271752m1579497m0007339l6378601l1896915k7351202k3122590j9367424
55930A18568184j6167782j3522958j1340186r524692q035558o832136n838669
55923D7306203m998029m303066l744590l278932k871815k526199k242229j992717
$$ plain form
55976 10155051 10708982 11301298 11948032 12667069 13456633 14315156 15264131 16327153 17506875
55967 17506875 18809929 20273881 21941696 23834114 25980036 28449876 31326336 34674120
55959 34674120 38581184 43202267 48724416 55334882 63280858 72923660 84684034 98998959
55951 98998959 116409684 137621830 163390358 194433583 231460452 274703952 322431528
55944 322431528 369412057 407430815 428539376 428892277 410168045 377844922 338271752
55937 338271752 296692255 256684916 220306315 188409400 161058198 137935608 118568184
55930 118568184 102400402 88877444 77537258 68012566 59977008 53144872 47306203
55923 47306203 42308174 38005108 34260518 30981586 28109771 25583572 23341343 21348626
55915B1348626j760304j558770j396296j253606j117082r99092r07401q26309
55907A1529766p45061o75104o23272n75890n24495m80672m51100m23225l89161
55898F641786l59540l40502l20335k91918k66173k50642k35823k14951j97012
55889D164890j87910j78146j61089j45231j36773j27588j11767r7584r2183q9923
55879B836696q5939q5830r1966r5177q9863q3395q1520p8557p0736o5086o5951
55868A942676o6190o0690n5568n5346n3907m6938m0778m0177l9299l3671k9303
55857A420809l1161l3691l1450k8556k9323k9760k6471k4106k6165k7975k6084
55846A106067k5035k7776k9109k5758k3140k5015k6137k2413j8696j9183j9556
$$ plain form
55915 21348626 19588322 18029552 16633256 15379650 14262568 13263476 12356075 11529766
55907 11529766 10784705 10109601 9486329 8910439 8385944 7905272 7454172 7030947 6641786
55898 6641786 6282246 5941744 5621409 5329491 5063318 4812676 4576853 4361902 4164890
55889 4164890 3976980 3798834 3637745 3492514 3355741 3228153 3116386 3018802 2926619 2836696
55879 2836696 2750757 2664927 2572961 2477784 2387921 2304526 2223006 2144449 2073713 2008627 1942676
55868 1942676 1876486 1815796 1760228 1704882 1650975 1604037 1563259 1523082 1483783 1450112 1420809
55857 1420809 1389648 1355957 1324507 1295951 1266628 1236868 1210397 1186291 1160126 1132151 1106067
55846 1106067 1081032 1053256 1024147 998389 975249 950234 924097 901684 882988 863805 844249
55835H44249j6204j3837j6153j8065j5087j1755j2634j3513r747n388n662p752
55823F98452p204o454q972j1678j1029j0257j2872j5183j2934r378r276j0461
55811E72754q758n933n566n952m022j633j510j574P20L108L291L988P555J0616
55797E67084R821P811P827P573M275P26K64N49j755m745n426n441o982p638n093
55782E68850k575m024p868j0729j2942j5398j5578j1910p569m969j226O045J3670
55769D93777J8604K2850K6929K4569J1158p264k0659k6638k8923k8619k4536j8927
55757D42321j5502j3768j1402r709j0998j3284j3269j2054j2319j2727j0643p628
55745B99018o634o413m189j222k63q2K016M779N358M478M132K845j267n448n858
$$ plain form
55835 844249 828045 814208 798055 779990 764903 753148 740514 727001 717254 711866 706204 698452
55823 698452 691248 684794 675822 664144 653115 642858 629986 614803 601869 592491 583215 572754
55811 572754 563996 558063 552497 546545 542523 540890 539380 537806 538526 541634 544925 548913 556468 567084
55797 567084 576905 584716 592543 600116 604391 605117 605381 605930 604175 599430 594004 588563 581581 573943 568850
55782 568850 566275 562251 554383 543654 530712 515314 499736 487826 480257 475288 474062 480107 493777
55769 493777 512381 535231 562160 586729 597887 590623 569964 543326 514403 485784 461248 442321
55757 442321 426819 413051 401649 391940 380942 367658 354389 342335 330016 317289 306646 299018
55745 299018 292384 285971 281782 280560 280297 280215 282231 287010 292368 296846 300978 303823 302556 297108 291250
55730B91250l854l364m353m256l582m551o145n858m557m647n306m366k880k905
55716B30626l018q56K086L148L629O133R201R813Q944R193R141N746M98k500l021
55701B88763l872n211n246n007o831r306r231p419p157q062p014m241k903l275
55687B03988k705r13j29l70M49K083K439K125L662O561P757O755N767N167L324
55672B45960O13q54j221k404l996l909k588k308k783j827J72P84R2L38J504J605
55656B29178R76J814L722M153L047K686L218K703J363J313K230J746L2m18M28
55641B58191P6j775k919l163m641p300q596q118q151r140q890o907n317m755l551
55626A75044j669j318k726l341k221j414j998k498k174k254k841k237l77N04l64
$$ plain form
55730 291250 287396 284032 279679 275423 271841 267290 261145 255287 250730 246083 240777 236411 233531 230626
55716 230626 227608 226752 228838 231986 235615 241748 250949 260762 269706 278899 288040 293786 294284 291784 288763
55701 288763 284891 279680 274434 269427 262596 253290 244059 236640 229483 221421 214407 210166 207263 203988
55687 203988 201283 200370 200241 199871 200320 202403 204842 206967 210629 217190 224947 231702 237469 242636 245960
55672 245960 246573 245719 244498 242094 238098 234189 231601 229293 226510 224683 224855 225639 225731 226069 227573 229178
55656 229178 230154 231968 235690 239843 242890 245576 248794 251497 252860 254173 256403 258149 258181 257763 258191
55641 258191 258267 256492 253573 250410 245769 238469 229873 221755 213604 204464 195574 188667 183350 178595 175044
55626 175044 173375 172057 169331 165990 163769 162355 160357 157859 155685 153431 150590 148353 147976 148480 148116
55611A48116j131q14p18j447j815j520j766k420j829j87K08j126j978j363r78
55596A29232j790k382j866j401j681j737j214j159j612j208J07O84J72J44J066
55581A15355J543J183J338K250K466J740J626K448K675K030K146L436M307M294
55567A48837M837N985N617L092O47j57m99j564k574k885l351m299m638m152m194
55552A40702n016m954l375j869j405q76L29R15J28p44o44k49j05M97J641K065
55536A27040J395R61J397J610J068Q04J267J375P07K75L00m42k070k860k108j383
55520A29336j881k740l056l275l570l051j639n95k86L51J333J056p90k180j778
55505A07235p01k20qK31k90j586k182j438n90m92m16j5k28j237j693r93j85J56
$$ plain form
55611 148116 146985 146171 145453 144006 142191 140671 138905 136485 134656 134469 134677 133551 131573 130210 129232
55596 129232 127442 125060 123194 121793 120112 118375 117161 116002 114390 113182 113289 113973 114145 114289 115355
55581 115355 116898 118081 119419 121669 124135 125875 127501 129949 132624 134654 136800 140236 144543 148837
55567 148837 153674 159659 165276 168368 169015 168858 168359 166795 164221 161336 157985 153686 149048 144896 140702
55552 140702 135686 130732 127357 125488 124083 123207 123536 124451 124579 123835 123191 122942 122837 123334 124975 127040
55536 127040 128435 129396 130793 132403 133471 134275 135542 136917 137624 137899 138199 137757 135687 132827 130719 129336
55520 129336 127455 124715 121659 118384 114814 111763 110124 109529 109243 109594 110927 111983 111193 109013 107235
55505 107235 106534 106314 106306 106537 106247 104661 102479 101041 100451 99959 99543 99528 99300 98063 96370 95377 95192 95348
55487I5348P32J476J155j26n76K32N84j64m21N18J012J31o24j49L73L2j6R94J649
55468A02160Q39k95o04p85j405j392k87L17n75j494j089m26q77j764j959j846
55452H8518j975j691p76m51j099j133K69J449J051K35L17M48l04q67k51L44k04
55435H3880o13M99J929J917J108J077J465J011O7k20k4l0K15J100J532O76k31
55418I5358J51R57Q37M60J040J802J304J73M6P48P74j35r75j347j469j081q3N18
55400I9078n1r04q92n03p03j054o21J67K76k20o75j063j308o43R12J807J135J66
55382I4904J22J08r42j904j240K73Q77N96N32N26j49q01l26O01N85r9k30%m14
55363I3019j052o94L36N60k25q31o90k75J32N02L87l97r31m57K31L2o85r85j061
$$ plain form
55487 95348 96080 97556 98711 98585 98009 98241 98825 98661 98240 98758 99770 99901 99277 99128 99501 99533 99517 100511 102160
55468 102160 102999 102704 102100 101315 99910 98518 98231 98548 97973 96479 95390 94964 94087 92323 90364 88518
55452 88518 86543 84852 84076 83625 82526 81393 81662 83111 84162 84397 84714 85162 84858 83991 83740 84084 83880
55435 83880 83267 83766 85695 87612 88720 89797 91262 92273 92340 92120 92096 92066 92281 93381 94913 95589 95358
55418 95358 95509 96466 97303 97763 98803 100605 101909 102082 102128 102876 103650 103515 102540 101193 99724 98643 98560 99078
55400 99078 99027 98123 97231 96728 96025 94971 94350 94517 94793 94573 93898 92835 91527 90884 91796 93603 94738 94904
55382 94904 95026 95134 94192 92288 91048 91321 92198 92794 93326 93852 93703 92902 92576 93177 93762 93663 93433 93433 93019
55363 93019 91967 91273 91609 92169 91944 91113 90423 90148 90280 90782 91169 90772 89841 89384 89615 89647 88962 87977 86916
55344H6916j404j352j95J177J489J073R29Q27R2o87o12k38n02q20j88P37O65k1
55326H7886l3N17O40M64O59O69l67j600j570p14n07p93k80P97J007M40O39J769
55308H9623K232J338K54p3p9k68m00l09k18l7M56Q35N65R8J08J73m87j354j282
55289I1175m02J44J10L04J016J671J874J669J051K43j11K4k73j245j572m68P48
55272I5958O55K3J66M63l13j321q54O40J214N05k02m90r15j090j21J261J403M34
55254I7416nM36N56M3j58Q5j12p35q36m92o75j194r10m9k8q63r71Q6Q46M23k96
55233I2567m60m29n69n23j79N1J65M23L30o86j719j255M22J478J203O39N22M29
55215I2409J13p4j81n22o02J97J047O80l68m85L28O10J64K36R60J005M5o77o44
$$ plain form
55344 86916 85512 84160 83965 85142 86631 87704 88633 89460 89552 88865 88253 88015 87513 86693 86505 87242 87907 87886
55326 87886 87853 88370 89010 89474 90133 90802 90435 88835 87265 86551 86044 85251 84971 85768 86775 87215 87854 89623
55308 89623 91855 93193 93447 93374 93295 93027 92627 92318 92100 92063 92519 93354 93919 94017 94125 94298 93811 92457 91175
55289 91175 90773 90917 91027 91331 92347 94018 95892 97561 98612 98855 98744 98768 98495 97250 95678 95210 95958
55272 95958 96613 96636 96802 97265 96952 95631 94777 95417 96631 97136 96934 96444 95529 94439 94318 95579 96982 97416
55254 97416 97411 97847 98403 98446 98288 98373 98261 97526 96690 96198 95523 94329 93419 93370 93342 92479 91508 91594 92440 92863 92567
55233 92567 92107 91678 91109 90586 90407 90458 90623 91046 91376 90690 88971 87716 88138 89616 90819 91458 91980 92409
55215 92409 92522 92448 92267 91745 91143 91340 92387 93067 92699 92214 92542 93152 93316 93552 94512 95517 95562 94885 94241
55196I4241p26j138r85j93J58n2K81J239J491O55n1n9k55r22j048l22J91Q8K92
55177I2885J016J086J04o72m62p9j57j16L29M51P9L9L52p4j233j500j98J225J526
55158I4601J267J172Q16K6k44L97Q78N06P5J63N5o41j023n62j68m85p56m00j22
55139I5555m50p47o38p56j126n82J082K169J555L71l5n2l57k92P17J567J092P5
55121I9148%Q53J492J337M47j040k412k420r86K32M4o47m87L22Q18Q90Q86O67
55103I9144K58L64J118J398N06n08l13Q47J803J982J333r8j640k092j223j21N56
55086A03314J301K096J845M21m78K02J252J284P85O64M73k71o34M7N66k24j240
55069A11403q69L36P05J26l03m27q58j376j301q19m02L17J484J843M23j439j721
$$ plain form
55196 94241 93515 92377 91392 91199 91357 91305 91586 92825 94316 94971 94920 94861 94606 93684 92636 92314 92505 92593 92885
55177 92885 93901 94987 95091 94419 93957 93878 93721 93605 93934 94385 94464 94503 94855 94781 93548 92048 91850 93075 94601
55158 94601 95868 97040 97856 97882 97638 98035 98913 99419 99494 99657 99712 99071 98048 97486 97318 96833 96077 95677 95555
55139 95555 95105 94358 93720 92964 91838 91256 92338 94507 96062 96433 96398 96346 95989 95697 96414 97981 99073 99148
55121 99148 99148 100001 101493 102830 103277 102237 99825 97405 96419 96651 96695 96048 95561 95883 96701 97591 98477 99144
55103 99144 99402 99766 100884 102282 102788 102280 101967 102814 104617 106599 107932 107834 106194 104102 102879 102758 103314
55086 103314 104615 106711 108556 108977 108499 108701 109953 111237 112022 112686 113159 112888 112254 112301 112867 112643 111403
55069 111403 110534 110870 111575 111701 111398 110971 110113 108737 107436 106617 106215 106532 108016 109859 110282 108843 107122
55052A07122n83K52K94M29P79N47k40o59n35n07o37m26l3l2k50j22J06q6l11J4
55032A05122L28j61q11m33O53J163J005J063J296R22K42K43N44k05j776k290j100
55015A05805K34M30R7J26J61l04o33m4R89J387Q84O8n40p98p33m75j92J38O30
54996A07230J163J479J640J893K122J831Q32l79r99n87M67J153Q02r5n27m10n70
54979A17045j193j402p82j48j44k02J78L30l39r81n31N28R21M78l1l18n34l65
54961A12510M57J209J005K45l8J63J06j96j18K30K00j10l1L90N67N85R04J123
54943A19201M18q25j332q03j43K25P61J408J273J12j078j438j179q07l30K89P92
54926A16544J095J485K018K385K515K773L359M108M868N686O537P286P771P590
$$ plain form
55052 107122 106539 106791 107085 107514 108293 108840 108600 107941 107406 106899 106262 105836 105803 105771 105521 105399 105505 105419 105108 105122
55032 105122 105450 105289 104478 104045 104698 105861 106866 107929 109225 110147 110389 110632 111176 110971 109195 106905 105805
55015 105805 106039 106469 106566 106692 106853 106549 105916 105872 106861 108248 109132 109200 108660 107862 107129 106654 106462 106600 107230
54996 107230 108393 109872 111512 113405 115527 117358 118190 117811 116812 116225 116692 117845 118647 118552 118025 117615 117045
54979 117045 115852 114450 113668 113520 113376 113174 113352 113682 113343 112362 111831 112359 113280 113758 113727 113409 112875 112510
54961 112510 112967 114176 115181 115426 115388 115551 115657 115461 115343 115573 115773 115663 115632 116022 116589 117174 118078 119201
54943 119201 119619 118794 117462 116659 116516 116741 117502 118910 120183 120295 119217 117779 116600 115793 115463 115752 116544
54926 116544 117639 119124 121142 123527 126042 128815 132174 136282 141150 146836 153373 160659 168430 176020
54912A76020O246L974J912P87n7j545l435m870n760o471o708n949m716m057l958
54897A41413l457k348j513j526j968k255k207j742q76kN30R76J612J953J440N44
54881A30574J34J53N4K05J459L516N074N705O251P268Q213Q418P790O331M011
54866A95156J285j168l306n423p134p689p299o928o735n862m071k399j806k084
54852A34537k465k567k414k145j950j818j367m82J69j03r89j708k084k256j881
54837A10477p20L80L96l23o53m86n04n74oP51M69o92j153l63M52M03J23K64L52
54818A08593m4l64j64M4j53k40K10P01P70Q14J244J618J399Q19L40m4l24j41N18
54799A15596R20N86K4r7R1Q1j17p5M19J192J844J883J167K39k59m40q05j154p75
$$ plain form
54912 176020 182266 186240 188152 188939 188882 187337 183902 179032 173272 166801 160093 154144 149428 145371 141413
54897 141413 137956 135608 134095 132569 130601 128346 126139 124397 123521 123519 124049 125025 126637 128590 130030 130574
54881 130574 130708 130861 130915 131120 132579 136095 141169 146874 153125 160393 168606 177024 184814 191145 195156
54866 195156 196441 195273 191967 186544 179410 171721 164422 157494 150759 144897 140826 138427 136621 134537
54852 134537 132072 129505 127091 124946 122996 121178 119811 119329 119498 119395 118406 116698 114614 112358 110477
54837 110477 109757 110137 110533 110210 109557 109071 108567 107993 107987 108738 109207 108515 107362 106999 107451 107854 107977 108241 108593
54818 108593 108549 108185 108021 108065 107912 107672 107882 108583 109353 110167 111411 113029 114428 115247 115587 115543 115219 115078 115596
54799 115596 116516 117102 117126 117029 117120 117201 117084 117009 117428 118620 120464 122347 123514 123753 123494 123054 122249 121095 120320
54780A20320K55R96J037R77J235J411J162Q44Q80J215J739K454L026K987K672
54765A43210L028M234N383N858O088O563P022P034O563N563L768J270j418m064
54751B00102o706q730r133p994o644n926n267m047k793k255k174j754q86j81j54
54736A35458q04j608j703o32R29J811J715J278Q47K15l61r9J076K260K965L663
54720A47010M677N510N774N645N096L818K325J769K070J600m59k801l966m350
54706A73718n049n835n679m581l424k563j734j070r88j320j441j204r75r36r80
54691A35939j062j143j032p40n64n02j25N60P30j18j246j566j036m98n31r79j387
54674A24700j434j165j020j243j283m91N84O33m28j072l71O35O03j61m71j62N0
$$ plain form
54780 120320 120575 121571 122608 123585 124820 126231 127393 128237 129117 130332 132071 134525 137551 140538 143210
54765 143210 146238 150472 155855 161713 167801 174364 181386 188420 194983 200546 204314 205584 204166 200102
54751 200102 193396 184666 175533 167539 160895 154969 149702 145655 142862 140607 138433 136679 135793 135612 135458
54736 135458 134654 133046 131343 130711 131640 133451 135166 136444 137291 137506 137145 137046 138122 140382 143347 147010
54720 147010 151687 157197 162971 168616 173712 177530 179855 181624 183694 185294 184835 182034 178068 173718
54706 173718 168669 162834 157155 152574 149150 146587 144853 143783 142795 141475 140034 138830 137855 136919 135939
54691 135939 134877 133734 132702 131962 131398 130896 130771 131331 132061 131943 130697 129131 128095 127597 127066 126087 124700
54674 124700 123266 122101 121081 119838 118555 118064 118648 119281 118853 117781 117410 118045 118648 118487 118016 117854 117904
54657A17904J2K23P18R50O72K24m0n9R2J69r0m41k23O57J322J063K97j34p4P6
54637A23318R5o1m48p97n57J71M14l15j107q86Q7P66Q42O99L45n59j734k293j768
54618A16212n78N19R95P63K88K75Q45J282R57J57m10m75j73L90R88J127O37Q2
54600A23881P0M60O82N06J47q1R5O98J174Q39j02o38m09k80r27j736j718q47J84
54581A21998R11J132O38k72o77j40N72O04K31J62L07J55j54j06J75J52j65l23
54563A25200k39j28J37P59J318J137K64n46q06o67m87m26m00r9O60J434J479Q80
54545A29470O47J272J932J718R82N47L82o0o21o37p6M30N10K75k47j085j861k014
54527A31564j470o37J55P54J004Q68N20k0r12j917k267j609n42J98N45P46P63
$$ plain form
54657 117904 117916 118139 118857 119807 120479 120703 120663 120604 120696 120865 120775 120334 120111 120768 122090 123153 123450 123316 123242 123318
54637 123318 123413 123352 122904 122107 121550 121721 122135 121820 120713 119827 119914 120680 121522 122221 122566 122007 120273 117980 116212
54618 116212 115634 116153 117148 117911 118199 118474 119319 120601 121558 121715 121305 120830 120657 121047 122035 123162 123799 123881
54600 123881 123951 124411 125093 125599 125746 125665 125760 126458 127632 128471 128369 127731 127322 127042 126115 124379 122661 121814 121998
54581 121998 122909 124041 124679 124407 123730 123590 124162 124766 124997 125159 125466 125621 125467 125361 125536 125688 125523 125200
54563 125200 124961 124833 124970 125729 127047 128184 128448 127902 127096 126429 125942 125516 125116 125017 125677 127111 128590 129470
54545 129470 130117 131389 133321 135039 136021 136568 136950 136890 136269 135632 135556 135986 136496 136771 136524 135439 133578 131564
54527 131564 130094 129457 129612 130366 131370 132238 132758 132738 131826 129909 127642 126033 125491 125689 126234 126980 127743
54510A27743N75M66M57J43m71n97J78J083J184O02Q1o4P7M08O34K55n88j017o47
54491A30502j99k59l58RM73O32Q20J185J111M41K01R95J784J495P34N51O11J18
54473A40846m04j1Q35J043P88Q86R83K58o20k67J009J548R94O86J290J890J697
54456A53451R88J33q60j625j622j239j348j810j738j199j074j272q15K47P35L90
54440A41342K94P85P87k44j289j446j115q45l81L46O38L03L11J256K278K392J938
54423A47350J825K104K166J650N71q56j947j874q00j9l95j328j773j537j003k94
54407A43840N96J307J414R73M16J32L07P69R91O55J84J70M50M87L92O94J247J383
54389A56407J154J250J666J578P54o8m56q30j358j495j046o07n18l59J07M20M24
$$ plain form
54510 127743 128318 128784 129241 129384 128913 128316 128494 129577 130761 131363 131444 131380 131457 131865 132499 132754 132166 131149 130502
54491 130502 130303 130044 129686 129695 130168 130800 131620 132805 133916 134357 134558 135553 137337 138832 139566 140117 140728 140846
54473 140846 140442 140431 141266 142309 143097 143983 144966 145224 144604 144337 145346 146894 147888 148574 149864 151754 153451
54456 153451 154439 154572 153712 152087 150465 149226 147878 146068 144330 143131 142057 140785 139970 140217 140952 141342
54440 141342 141636 142421 143208 142964 141675 140229 139114 138269 137888 138234 138872 139175 139486 140742 143020 145412 147350
54423 147350 149175 151279 153445 155095 155666 154810 152863 150989 150189 150170 149775 148447 146674 145137 144134 143840
54407 143840 144436 145743 147157 148130 148546 148678 148985 149754 150745 151400 151584 151754 152204 152691 153083 153777 155024 156407
54389 156407 157561 158811 160477 162055 162809 162741 162285 161455 160097 158602 157556 156949 156431 156072 156179 156599 157023
54372A57023P35J705K744L237L301L177K746K116J875K208K487K246J841J667
54358A89108J460P98k81j507k624l230l126k857l095l450k909j520m75l64n69
54343A65359o21p82r30m10M85L58j129k395k179j302j126j463j300n88l8J00p3
54326A51966p28j717k110j350k58J84K82P78J282R00p6m63NM43K91n4j21K0J16
54307A49390Q6r9l52l96j47L2j57m58m97l22j54J4J74R3k37m21k34Q3M68J220
54287A48086K192K541J881R19L91J07l14o03m95m50p90r10k75M88M72n9j94J89
54269A53176N26P00R48J033O08J31L58J071J328Q95M27L66N31P51J013J047O03
54252A65512J03J68N81N75M8m10n82q30j130r47k63J20l03j039j372j238r64o81
$$ plain form
54372 157023 157758 159463 162207 165444 168745 171922 174668 176784 178659 180867 183354 185600 187441 189108
54358 189108 190568 191366 191085 189578 186954 183724 180598 177741 174646 171196 168287 166767 166292 165928 165359
54343 165359 164738 163956 163026 162616 163101 163459 162330 159935 157756 156454 155328 153865 152565 151977 151939 152039 151966
54326 151966 151238 149521 147411 146061 145803 145987 146269 147047 148329 149229 149153 148690 148695 149138 149429 149375 149254 149274 149390
54307 149390 149476 149377 149025 148629 148482 148514 148357 147899 147402 147080 146926 146940 147114 147207 146970 146549 146315 146398 146866 148086
54287 148086 150278 152819 154700 155619 156010 156117 155803 155200 154705 154255 153465 152555 152280 152768 153240 153181 152987 153176
54269 153176 153702 154402 155350 156383 156991 157122 157480 158551 159879 160774 161201 161567 162098 162849 163862 164909 165512
54252 165512 165615 165783 166364 166939 166987 166577 165995 165165 164035 163088 162825 162945 162642 161603 160231 158993 158029 157348
54234A57348l87k22k83l23L2P74J394J307N16j78K4Q11R66m6j234j322l96M50
54216A59231O90P32Q19N72j57p81p95n20o00j098j510j483j089n52n4J94O1j93
54198A53467KP66J366J028J02k22M49J117R05L86N51J121J071N18N81J441J953
54181A66602J547J064J086Q95k5p38l37L42n1j139j305j67R20Q56P7m69o24q10
54163A67724j193j525j505j004k16L37K17m21r05p51j31L78M08J21p1n8q1k29
54145A61095k60k08o16j636k330j824p58m86j005r93L6J021J112Q38Q87J061J011
54128A56945R76J005O15p3n3Q86J454Q52J71N65J200N86r83j850j315j9J355K377
54110A64694K406J367N43J154K454K770K017J549J807J897J581J804K881L723
$$ plain form
54234 157348 156961 156739 156456 156133 156165 156939 158333 159640 160156 159978 160002 160813 161779 161733 160499 159177 158781 159231
54216 159231 159921 160653 161472 162044 161887 161106 160311 159791 159191 158093 156583 155100 154011 153459 153405 153599 153660 153467
54198 153467 153469 154235 155601 156629 156731 156509 156958 158075 158980 159366 159917 161038 162109 162627 163208 164649 166602
54181 166602 168149 169213 170299 171194 171169 170431 170094 170436 170385 169246 167941 167774 168694 169550 169627 169158 168534 167724
54163 167724 166531 165006 163501 162497 162281 162618 162835 162414 161509 160758 160627 161005 161413 161534 161463 161405 161324 161095
54145 161095 160835 160627 160011 158375 156045 154221 153463 152977 151972 150979 151015 152036 153148 153986 154873 155934 156945
54128 156945 157921 158926 159541 159468 159415 160301 161755 162607 162778 163343 164543 165129 164146 162296 160981 160962 162317 164694
54110 164694 167100 168467 169010 170164 172618 175388 177405 178954 180761 182658 184239 186043 188924 192647
54096A92647L506K767K216J559K48j481k958l817l961l420k522j739j106l79K73
54081A81833M19K56N26J362K015J954J511J258J341J687K180K543K527K320K162
54066B05894J626R7k021l432l497k955k777k968k836j921m25R23J300N65l91n08
54050A86674K65J116J554J811K111K324K432K703L175L519L536L430L507L951
54036B22108M833N904O559O470O022N691N346M734M183M008L715K754J747J783
54022B85857K667K994K086O72m01j092j497j367q05n96j389l008m795o051o132
54007B67143m886l186k321k622l330l792m083m345m384m168l951l713l147k324
53993B16891j724j460j179p98o60q06q79p32m90n9O06Q68O7j212j625r35k74l63
$$ plain form
54096 192647 196153 198920 201136 202695 202943 201462 198504 194687 190726 187306 184784 183045 181939 181560 181833
54081 181833 182252 182508 183034 184396 186411 188365 189876 191134 192475 194162 196342 198885 201412 203732 205894
54066 205894 207520 207617 205596 202164 198667 195712 192935 189967 187131 185210 184785 185708 187008 187573 187182 186674
54050 186674 186939 188055 189609 191420 193531 195855 198287 200990 204165 207684 211220 214650 218157 222108
54036 222108 226941 232845 239404 245874 251896 257587 262933 267667 271850 275858 279573 282327 284074 285857
54022 285857 288524 291518 293604 294276 293875 292783 291286 289919 289114 288518 287129 284121 279326 273275 267143
54007 267143 262257 259071 256750 254128 250798 247006 242923 238578 234194 230026 226075 222362 219215 216891
53993 216891 215167 213707 212528 211730 211070 210264 209385 208653 208163 208104 208710 209578 209645 208433 206808 205873 205599 205236
53975B05236o39m59o3J73M06P53R71J170J886L037L747L707L799M848O672Q887
53959B44131J1444J3679J3859J0818N458j64m647p534q596p936o396m939l782
53946B55395k660j580p26OQ06J525J972K310K805L435M065M575M613L713K057
53931B82311N50j83l53k57K91J383K482L131L631M459N443O055O135N874N469
53916C26421N185N374O009O619O929P103P141O647N523M250L132J968P76N8j22
53901C93013m79j368k121k190k130k679l565m159m627n463o430o887o893p014
53887C37008p299p329p078o944p010o996o774o362n563m330l201k755k792k681
53873B59894k347k195k251k154j957k193l012l840m060l654l003k435k063j848
$$ plain form
53975 205236 204597 204138 204075 204248 204654 205407 206378 207548 209434 212471 216218 219925 223724 228572 235244 244131
53959 244131 255575 269254 283113 293931 299389 299225 294578 287044 278448 270512 264116 259177 255395
53946 255395 252735 251155 250429 250435 251241 252766 254738 257048 259853 263288 267353 271928 276541 280254 282311
53931 282311 282861 282678 282325 282068 282359 283742 286224 289355 292986 297445 302888 308943 315078 320952 326421
53916 326421 331606 336980 342989 349608 356537 363640 370781 377428 382951 387201 390333 392301 393077 393135 393013
53901 393013 392534 391166 389045 386855 384725 382046 378481 374322 369695 364232 357802 350915 344022 337008
53887 337008 329709 322380 315302 308358 301348 294352 287578 281216 275653 271323 268122 265367 262575 259894
53873 259894 257547 255352 253101 250947 248990 246797 243785 239945 235885 232231 229228 226793 224730 222882
53859B22882j791j991k436k733k380j454o39l87m55m40l25k09lK80L62J75L5Q5
53841B08576L9j73j69J32K10j52l37L3L12j24o66l63M86P16P5m42j34N12O41J12
53821B09284m87n07K29J197J598J244Q75J235K117K707K656K311K139K329K810
53806B31737L216L113K655K624L383M213M278L844L808M322M730M732M729M906
53792B86290M750L780K347J375J458K255K717K130J008N33R26R58m67k780m461
53777C02819m822m446m142m242m711n272n407m886m177l874l888l691l191k738
53763B43332k519k467k592k834k806k270j652j482j596j507j290j338j498j289
53749B16192p98n57o02m44rK69K69K91L08r8q85j396j249p19q1O88J442J795J785
$$ plain form
53859 222882 221091 219100 216664 213931 211551 210097 209458 209071 208616 208176 207851 207642 207639 207919 208281 208456 208491 208576
53841 208576 208615 208442 208273 208405 208615 208463 208126 208159 208471 208347 207681 207318 207804 208520 208595 208153 208019 208531 209172 209284
53821 209284 208797 208290 208519 209716 211314 212558 213433 214668 216785 219492 222148 224459 226598 228927 231737
53806 231737 234953 238066 240721 243345 246728 250941 255219 259063 262871 267193 271923 276655 281384 286290
53792 286290 291040 294820 297167 298542 300000 302255 304972 307102 308110 308643 309569 310527 310060 307280 302819
53777 302819 297997 293551 289409 285167 280456 275184 269777 264891 260714 256840 252952 249261 246070 243332
53763 243332 240813 238346 235754 232920 230114 227844 226192 224710 223114 221607 220317 218979 217481 216192
53749 216192 215394 214837 214235 213791 213782 214051 214320 214611 214919 214821 213936 212540 211291 210572 210491 211179 212621 214416 216201
53730B16201J944K366K396J563L26m98n40R8J161K232K861L006K976K760J942
53715B40794N36n78n30N16J642K211K324K410K721L170L490L502L251K811K152
53700B70422J470J414K448L950M652M162L457L439L670L112J795Q26Q07J023N32
53685C07179n38j271j181n93P4P03J101Q55l6q27q90n45n30q91j104j052j136
53668B99318j421j455j109p76n86j42O09J090J039R10R83P96J39l56k36n4l01
53651B98448m06J81O99J07j053j275l07N70N25J68K97Q26J305J710K171K577K754
53634C09297K634K211J695J712K696M210N416O089O425O152M846L025J862J670
53620C59940J625J231J008J376J894K124K378L048L900M558N031N258M840L773
$$ plain form
53730 216201 218145 220511 222907 224470 224796 224298 223758 223856 225017 227249 230110 233116 236092 238852 240794
53715 240794 241330 240752 240222 240738 242380 244591 246915 249325 252046 255216 258706 262208 265459 268270 270422
53700 270422 271892 273306 275754 279704 284356 288518 291975 295414 299084 302196 303991 304817 305624 306647 307179
53685 307179 306641 305370 304189 303596 303670 304373 305474 306329 306293 305466 304576 304031 303501 302610 301506 300454 299318
53668 299318 297897 296442 295333 294557 293971 293829 294438 295528 296567 297477 298460 299256 299395 299039 298803 298749 298448
53651 298448 298042 298223 298922 299029 297976 296701 296394 296964 297489 297657 297954 298780 300085 301795 303966 306543 309297
53634 309297 311931 314142 315837 317549 320245 324455 329871 335960 342385 348537 353383 356408 358270 359940
53620 359940 361565 362796 363804 365180 367074 369198 371576 374624 378524 383082 388113 393371 398211 401984
53606D01984K847K687K965L167L473M115M396L338J141q77j830k052k292k668
53592D20394k681j953o88M00N72l49j722k542k230j093m9J90l04r49j452k068
53576D03476k913l492l341k809k613k738k419j299L0P65O84N6p17j217j165p34
53560C79554l06Q9O65J261J363R22M79L29J81p6kO14J198J209R40R63J214J312
53542C91909J423K040L072L916M389M919N731O472O854P056P307P524P733Q375
53528D68720R738J1303J2237J2408J2399J2522J2439J1971J1719J2354J3693J5026
53516F16529J6179J7550J9221K0659K1483K1857K2066K2244K2717K3899K5491
53505H49895K6469K6317K5751K5603K5616K4931K3430K1803K0620J9914J9515
$$ plain form
53606 401984 404831 407518 410483 413650 417123 421238 425634 428972 430113 429236 427406 425354 423062 420394
53592 420394 417713 415760 415072 415472 416044 415695 413973 411431 409201 408108 408059 408249 407945 406996 405544 403476
53576 403476 400563 397071 393730 390921 388308 385570 383151 381852 381882 382647 383331 383387 382670 381453 380288 379554
53560 379554 379248 379337 380002 381263 382626 383548 384027 384356 384537 384461 384459 385073 386271 387480 388420 389383 390597 391909
53542 391909 393332 395372 398444 402360 406749 411668 417399 423871 430725 437781 445088 452612 460345 468720
53528 468720 478458 489761 501998 514406 526805 539327 551766 563737 575456 587810 601503 616529
53516 616529 632708 650258 669479 690138 711621 733478 755544 777788 800505 824404 849895
53505 849895 876364 902681 928432 954035 979651 1004582 1028012 1049815 1070435 1090349 1109864
53494A109864J9204J8802J8420J8398J8587J8319J7533J7201J7934J8845J8849
53483A311956J8355J8471J9025J8878J7887J7008J6390J4992J2470R928Q237O787
53471A490384M668J961q05l583o447r045j1152j3033j4678j5401j4891j3966j3633
53458A380379j3965j4628j5774j7592j9434k0356k0345k0226k0477k0751k0506
53447A176325j9655j8592j7881j7746j7625j6601j4412j1672q891n947k943q16
53435A023544l37r83j506j352p80R0J550L611N740P374Q317Q616Q591Q901J0126
53420A081502J2144J4225J5818J6980J8042J9250K0750K2659K4951K7380K9543
53409A303244L1098L1994L2586L3424L4818L6676L8698M0633M2388M4150M6352
$$ plain form
53494 1109864 1129068 1147870 1166290 1184688 1203275 1221594 1239127 1256328 1274262 1293107 1311956
53483 1311956 1330311 1348782 1367807 1386685 1404572 1421580 1437970 1452962 1465432 1475360 1483597 1490384
53471 1490384 1495052 1497013 1496208 1492625 1486178 1477133 1465981 1452948 1438270 1422869 1407978 1394012 1380379
53458 1380379 1366414 1351786 1336012 1318420 1298986 1278630 1258285 1238059 1217582 1196831 1176325
53447 1176325 1156670 1138078 1120197 1102451 1084826 1068225 1053813 1042141 1033250 1027303 1024360 1023544
53435 1023544 1023207 1022224 1020718 1019366 1018586 1018676 1020226 1023837 1029577 1036951 1045268 1053884 1062475 1071376 1081502
53420 1081502 1093646 1107871 1123689 1140669 1158711 1177961 1198711 1221370 1246321 1273701 1303244
53409 1303244 1334342 1366336 1398922 1432346 1467164 1503840 1542538 1583171 1625559 1669709 1716061
53398A716061M9178N2060N4001N4571N4347N4318N4955N5922N6469N6191N5513
53387B313586N5230N5285N4486N2001M8710M6169M4454M2131L8427L4216L0474
53376B815169K6885K2659J7816J2827P652K047l683r146j4737k1266k8745l6133
53364B791345m2269m6597m9236n0782n1954n3030n3736n3887n3777n3582n2782
53353B229713n0792m7892m4983m2544m0380l8408l7178l7352l8850m0610m1247
53342A769477m0051l7493l4610l2045k9823k7862k6101k4214k1808j9093j6650
53331A459727j4519j2296j0326r870j1434j3771j5307j5883j6309j6738j6513
53320A306761j5424j4126j3300j3002j2906j2611j1741j0229q466o832n148l015
$$ plain form
53398 1716061 1765239 1817299 1871300 1925871 1980218 2034536 2089491 2145413 2201882 2258073 2313586
53387 2313586 2368816 2424101 2478587 2530588 2579298 2625467 2669921 2712052 2750479 2784695 2815169
53376 2815169 2842054 2864713 2882529 2895356 2903008 2905055 2901372 2892226 2877489 2856223 2827478 2791345
53364 2791345 2749076 2702479 2653243 2602461 2550507 2497477 2443741 2389854 2336077 2282495 2229713
53353 2229713 2178921 2131029 2086046 2043502 2003122 1964714 1927536 1890184 1851334 1810724 1769477
53342 1769477 1729426 1691933 1657323 1625278 1595455 1567593 1541492 1517278 1495470 1476377 1459727
53331 1459727 1445208 1432912 1422586 1412716 1401282 1387511 1372204 1356321 1340012 1323274 1306761
53320 1306761 1291337 1277211 1263911 1250909 1238003 1225392 1213651 1203422 1194956 1188124 1182976 1179961
53308A179961n18J720L151L687L698L957N209P454R829J1612J3009J4627J6570
53295A273966J8642K0975K3812K6783K9044L0105L0024K8904K6817K4243K1954
53284A555269K0394J9400J8546J7402J5507J2531Q642M453N68k729n509q042j0584
53271A645848j3166j5648j8022k0365k2562k4440k6091k7613k8448k7836k6165
53260A395492k5095k5705k7232k8214k8325k8260k8336k8146k7401k6334k5300
53249A097144k4577k4364k4484k4279k3458k2694k2703k3019k2507k0928j9221
53238H44910j8146j7516j6878j6123j5179j3751j1789r817q380p434o574n723
53226F97600n359o029p714r693j1127j1799j2188j2808j3798j5097j6577j7751
$$ plain form
53308 1179961 1179443 1181163 1184314 1188001 1191699 1195656 1200865 1208319 1218148 1229760 1242769 1257396 1273966
53295 1273966 1292608 1313583 1337395 1364178 1393222 1423327 1453351 1482255 1509072 1533315 1555269
53284 1555269 1575663 1595063 1613609 1631011 1646518 1659049 1667691 1672144 1672712 1669983 1664474 1656432 1645848
53271 1645848 1632682 1617034 1599012 1578647 1556085 1531645 1505554 1477941 1449493 1421657 1395492
53260 1395492 1370397 1344692 1317460 1289246 1260921 1232661 1204325 1176179 1148778 1122444 1097144
53249 1097144 1072567 1048203 1023719 999440 975982 953288 930585 907566 885059 864131 844910
53238 844910 826764 809248 792370 776247 761068 747317 735528 725711 717331 709897 703323 697600
53226 697600 692241 686212 678498 668805 657678 645879 633691 620883 607085 591988 575411 557660
53214E57660j7852j6609j4663j2867j1477j0284r193q296p641p244p048o757o161
53201D21568n785o513q224r531r434q519p953p970q147q383q668q356o897m965
53187C12223l826l728l853l734l663l692l334k411j482j141j441k040k418k054
53173B73406j057m50j075k325k725j782m53K09Q5m40j050j450j388j041q46q69
53157B56749q55q57j194j730j893j507r87o12k14K87O90R44J217J404J139M38
53141B53019k11m84m93l85j85m1j9J84P96J294J004K90K18R83J615J457R81P26
53123B60749L93l37q43k14J460L134L899L644K799J897J279R54P22M87L20J83
53107B80526j25o53j194j539j688j793k020k380k608k371j775j314j195j053o73
$$ plain form
53214 557660 539808 523199 508536 495669 484192 473908 464715 456419 448778 441534 434486 427729 421568
53201 421568 415783 409270 401046 391515 382081 373562 365609 357639 349492 341109 332441 324085 317188 312223
53187 312223 308397 304669 300816 297082 293419 289727 286393 283982 282500 281359 279918 277878 275460 273406
53173 273406 272349 271899 270824 268499 265774 263992 263539 263748 263833 263393 262343 260893 259505 258464 257618 256749
53157 256749 255894 255037 253843 252113 250220 248713 247726 247114 246900 247187 247877 248821 250038 251442 252581 253019
53141 253019 252808 252324 251831 251446 251261 251220 251201 251385 252181 253475 254479 254769 254987 255970 257585 259042 260023 260749
53123 260749 261142 260805 259962 259748 261208 264342 268241 271885 274684 276581 277860 278814 279536 280023 280343 280526
53107 280526 280401 279748 278554 277015 275327 273534 271514 269134 266526 264155 262380 261066 259871 258818 258145
53092B58145m31o10q49q43r83j546j874j346n81o26j226j266n79n9J3L11R63J163
53074B47776O36K09L89M76j86j071j281p72r6M00N89L08l37q94j117j179j114
53057B42736o80J5M62N22O22R20J055R04Q33Q76N87k8k99j5J84q1l12j49n1l96
53037B47705p85q81j078j586j718r22J43M88K10J51N49Q90Q43O34O39J013J593
53020B47888J888J500P08K08J60J72K12O22J030M87q76j523n90Q59J467J311J023
53003B56546L90q71j863j572n69j43l11j30M20M06k50n03J35R48J247J134Q13
52986B55827K47k34K3J018J957K342K457K549K429K155K226K720K923K261J061
52971B81961j0o92r58p26j47K54K51L61J119K158K491J691L81n22p74q97j401
$$ plain form
53092 258145 257714 257104 256255 255412 254429 252883 251009 249663 249082 248456 247230 245964 245385 245326 245339 245650 246613 247776
53074 247776 248412 248621 249010 249486 249300 248229 246948 246176 246080 246480 247069 247377 247040 246146 245029 243850 242736
53057 242736 242056 242071 242533 243055 243677 244597 245652 246556 247389 248265 248852 248824 248525 248510 248694 248613 248301 248152 248101 247705
53037 247705 246920 246039 244961 243375 241657 240735 240878 241366 241576 241727 242276 243166 244009 244643 245282 246295 247888
53020 247888 249776 251276 251984 252192 252352 252524 252736 253358 254388 254875 253999 252476 251886 252745 254212 255523 256546
53003 256546 256936 256065 254202 252630 252061 251918 251607 251477 251897 252303 252053 251550 251685 252633 253880 255014 255827
52986 255827 256074 255840 255863 256881 258838 261180 263637 266186 268615 270770 272996 275716 278639 280900 281961
52971 281961 281951 281259 280301 279575 279428 279682 279933 280294 281413 283571 286062 287753 288134 287612 286838 285941 284540
52954B84540k118k450k124j437q60o42r01j605k277k149j048J93N54j09j107j700
52938B64760j523o19N11J092P54q8p90j093r94m82J60K92k61p50n36j00k99r04
52920B59130q84rP69P09J70j28m2J59L05L03Mn30q82o84o5M54M63j9o09r35r93
52899B56686r94q90m19K93O32L68P6K71N56L18j46l6O51J067P45P4m98j002j441
52880B56311j536j253r64p71k07J007K345L053L001K542J897J146O45Q85J784
52865B69885K540K450J752J368J786K469K542J869J025L34n59j925l300l994l936
52850B74306l640l556l741m008m069l741l213k919k905k698k040j353j106j103
52836B34214r01n70m16l34j8L98N61N85Q86J485K037K375K439J889N61q76j502
$$ plain form
52954 284540 282422 279972 277848 276411 275551 274909 274008 272403 270126 267977 266929 267122 267676 267567 266460 264760
52938 264760 263237 262618 263129 264221 264975 264887 264097 263004 262010 261528 261688 261980 261719 260969 260433 260333 260034 259130
52920 259130 258246 258237 259006 259715 259885 259757 259715 259874 260179 260482 260486 259956 259074 258390 258325 258779 259242 259223 258614 257679 256686
52899 256686 255692 254802 254383 254676 255308 255676 255752 256023 256579 256897 256751 256715 257366 258433 259178 259252 258754 257752 256311
52880 256311 254775 253522 252558 251787 251580 252587 254932 257985 260986 263528 265425 266571 267216 268101 269885
52865 269885 272425 274875 276627 277995 279781 282250 284792 286661 287686 288020 287461 285536 282236 278242 274306
52850 274306 270666 267110 263369 259361 255292 251551 248338 245419 242514 239816 237776 236423 235317 234214
52836 234214 233313 232743 232327 231993 231975 232373 232934 233519 234405 235890 237927 240302 242741 244630 245191 244315 242813
52819B42813j376j342j630j534p24J25L77L23M89O80M08j55l19J97R50J355J221
52802B41858P33K08k36p61j521k180k065r88L49J009P25j6o40r28q55m26J62M45
52784B34873J28m23m53K38R27Q51K29p9K05N20M08M4l27p66j133r01m8N44K16
52765B35053m69n76j68k4k73l71j95k31n56n63P6R13J429J656J759J615J123N36
52747B40734J78J30L69R15J694K489L100L367L135K551K216K513K829K110L15
52732B68645j277j465l94Q33J350J088M63j00m26o24q56j087j163j046p54k32
52716B62955M23O79Pj380k536k690j926r09k12J21M08P86Q49J52r40j450j064
52699B53273n91o72p04J42J425J962J493P98K69m32j256j489r26k93j13K2N65
$$ plain form
52819 242813 241437 240095 238465 236931 236207 236332 236709 237032 237521 238201 238609 238454 238135 238332 239282 240637 241858
52802 241858 242591 242799 242563 241802 240281 238101 236036 235048 235397 236406 237131 237115 236475 235547 234692 234266 234428 234873
52784 234873 235001 234578 234125 234363 235290 236141 236370 236291 236496 237016 237424 237468 237141 236375 235242 234341 234293 234837 235053
52765 235053 234584 234008 233840 233816 233543 233172 232977 232746 232190 231627 231703 232616 234045 235701 237460 239075 240198 240734
52747 240734 240912 241042 241411 242326 244020 246509 249609 252976 256111 258662 260878 263391 266220 268330 268645
52732 268645 267368 265903 265509 266342 267692 268780 269243 269143 268717 268093 267237 266150 264987 263941 263187 262955
52716 262955 263378 264057 264064 262684 260148 257458 255532 254623 254411 254532 254940 255726 256575 256727 255787 254337 253273
52699 253273 252682 252010 251306 251448 252873 254835 256328 257126 257395 256963 255707 254218 253292 252999 252886 252908 253473
52682B53473J218J495J428J195O90o6o66r49j307j913k180j564m38L87O35N54
52666B51992L88L58P66J462J625P12o29j203o69L78J442K537L557M068L917L485
52650B74186L033K297J032m20j513k163k622k843k466j573r00j009j466j337l80
52635B61856O45R48N77J69K10P98J736K564K791K524K533L261L964L441J492q65
52619B88644k564l343l395k880k016j265r81j062j112q93n12k34j60r8J32L22
52603B68583R0m04m69J85R32J049O12J65q1j85l9L33M34n3n59m22K6n1o30r69
52583B68547r05q96q14N0J601K658K506J753J209Q30K99j61k27j04j57l76o33
52566B75180r83j360j483j336j252j247r20k35K61L09L03M02J05p51j336q95J03
$$ plain form
52682 253473 254691 256186 257614 258809 259499 259433 258767 257818 256511 254598 252418 250854 250416 250803 251438 251992
52666 251992 252380 252738 253504 254966 256591 257303 256674 255471 254802 255180 256622 259159 262716 266784 270701 274186
52650 274186 277219 279516 280548 280128 278615 276452 273830 270987 268521 266948 266048 265039 263573 262236 261856
52635 261856 262501 263449 264026 264195 264405 265203 266939 269503 272294 274818 277351 280612 284576 288017 289509 288644
52619 288644 286080 282737 279342 276462 274446 273181 272200 271138 270026 269133 268621 268387 268227 268129 268261 268583
52603 268583 268673 268269 267800 267985 268917 269966 270578 270743 270662 270477 270438 270771 271205 271152 270593 270171 270197 270146 269516 268547
52583 268547 267642 266746 265932 265982 267583 270241 272747 274500 275709 276539 276838 276677 276450 276346 276189 275813 275180
52566 275180 274197 272837 271354 270018 268766 267519 266599 266364 266625 266934 267237 267639 267744 266993 265657 264762 264865
52549B64865N84K46l32n25j21P29J457J316K02j071j709j773j692j430p84l0L68
52532B60300M64P46J446K373L197L549L065J797L54n92p87k97N47J002L62r78
52516B76548j583o79Q09J528J401J389J996K874L657M294M612M277L243J817L13
52501C06496j025j970k534l062l653l881l445k791k510k496k310j981j794j569
52487B71475j000m30m65q57p43k3M24R6l57j24O92J448J858J989J793J258P85
52470B77819Q64J392J753J615J267J103J112J124J302J973L063M004M283L807
52456C06481K674R50j038k655l557m025m360m251l327k067j430j670k138k251
52442B77336j995j501q64m31n48q92p85k46N2n1L2M13L14o02j408j128k1R64J388
$$ plain form
52549 264865 265449 265695 265363 264838 264717 265446 266903 268219 268421 267350 265641 263868 262176 260746 259962 259932 260300
52532 260300 260764 261510 262956 265329 268526 272075 275140 276937 277291 276699 275912 275615 276162 277164 277526 276548
52516 276548 274965 274286 275095 276623 278024 279413 281409 284283 287940 292234 296846 301123 304366 306183 306496
52501 306496 305471 303501 300967 297905 294252 290371 286926 284135 281625 279129 276819 274838 273044 271475
52487 271475 270475 270045 269580 268723 267980 267957 268381 268477 268120 267996 268688 270136 271994 273983 275776 277034 277819
52470 277819 278683 280075 281828 283443 284710 285813 286925 288049 289351 291324 294387 298391 302674 306481
52456 306481 309155 310105 309067 306412 302855 298830 294470 290219 286892 284825 283395 281725 279587 277336
52442 277336 275341 273840 272976 272545 271997 271105 270320 270074 270126 270075 270107 270520 270834 270232 268824 267696 267675 268639 270027
52423B70027J337R31N15P69J773K545K238J340R26J161J427J540J877K481K978
52408B93865L376M163N560P276R016J0677J1920J1967J0045N942M18m832q090
52395C61303q935q396p594o706n538m374l557k779j617m16O3k53o29m20M33J542
52379C12127K343K472K254K368K805K807K275K345L746N482O210O138O327O661
52365C66360O041M276K365Q25p32k176k461j265R5J81q63j716j473k99J048J885
52349C72091K043J938K063K378K508K436K516K879L295L665M117M648N209O145
52335D17931P860R924J1214J1225J0752J0917J1944J3190J4149J5025J6353J8227
52323E68711K0126K1547K2668K4011K5490K6367K6261K5540K4545K3204K1828
$$ plain form
52423 270027 271364 272295 272810 273579 275352 277897 280135 281475 282401 283562 284989 286529 288406 290887 293865
52408 293865 297241 301404 306964 314240 323256 333933 345853 357820 367865 373807 374225 369393 361303
52395 361303 352368 343972 336378 329672 324134 319760 316203 313424 311807 311391 311454 311201 310572 310152 310585 312127
52379 312127 314470 316942 319196 321564 324369 327176 329451 331796 335542 341024 347234 353372 359699 366360
52365 366360 372401 376677 379042 379867 379135 376959 374498 373233 373328 373509 372646 370930 369457 369158 370206 372091
52349 372091 374134 376072 378135 380513 383021 385457 387973 390852 394147 397812 401929 406577 411786 417931
52335 417931 425791 435715 446929 458154 468906 479823 491767 504957 519106 534131 550484 568711
52323 568711 588837 610384 633052 657063 682553 708920 735181 760721 785266 808470 830298
52312H30298K1378K2134K2955K2677K1650K0876K0360J9438J8182J7187J6327
52301A053462J5087J3841J3367J3199J1975R528P130N353L184j68l873o702q617
52288A126766j0383j2306j4041j5098j5028j3630j1386r236p630o267m802l146
52276A003813j023J892N204P977R955J1781J3762J5338J6086J6315J6227J5530
52264A132857J4409J3945J4780J6123J6775J6602J6258J6033J5660J4929J3853
52253A302224J2546J1337J0611J0212R395P679N223K101j988o854j1346j4373
52241A336767j5930j6626j6811j6729j6907j7643j8436j8595j8127j7533j7015
52230A146415j6458j5789j4898j3502j1604r826q774q293p705o584n028l470k433
$$ plain form
52312 830298 851676 873810 896765 919442 941092 961968 982328 1001766 1019948 1037135 1053462
52301 1053462 1068549 1082390 1095757 1108956 1120931 1130459 1137589 1142942 1146126 1145958 1142085 1135383 1126766
52288 1126766 1116383 1104077 1090036 1074938 1059910 1046280 1034894 1025658 1018028 1011761 1006959 1003813
52276 1003813 1002790 1004682 1009886 1017863 1027818 1039599 1053361 1068699 1084785 1101100 1117327 1132857
52264 1132857 1147266 1161211 1175991 1192114 1208889 1225491 1241749 1257782 1273442 1288371 1302224
52253 1302224 1314770 1326107 1336718 1346930 1356325 1364004 1369227 1371328 1369340 1362486 1351140 1336767
52241 1336767 1320837 1304211 1287400 1270671 1253764 1236121 1217685 1199090 1180963 1163430 1146415
52230 1146415 1129957 1114168 1099270 1085768 1074164 1064338 1055564 1047271 1039566 1032982 1027954 1024484 1022051
52217A022051k124j977j103N95K223L052L278L429L743M447N780P165P246N547
52203A063352L380K222J967J694J473K066L301M103M171M287M848N233M952M449
52189A111498M299M404M414M238L764K740J341K67k96j185l141n660p656q874
52175A110153r797j0433j0161q939p682p023o434n281m089l758l896l105r80J240
52161A029815K451L081M102N450O292O239N443M016K302J289J579K222J715J76
52147A076172p59l12M94O67P15J561K925L771L753L392L162L165L370L673L914
52132A109663M217N060O693Q839J1317J4384J8115K1913K5155K7905L0558L3142
52120A316961L5387L7120L8102L7930L6537L4502L2460L0543K8720K7183K5841
$$ plain form
52217 1022051 1019927 1017950 1016847 1017442 1019665 1022717 1025995 1029424 1033167 1037614 1043394 1050559 1057805 1063352
52203 1063352 1066732 1068954 1070921 1072615 1074088 1076154 1079455 1083558 1087729 1092016 1096864 1102097 1107049 1111498
52189 1111498 1115797 1120201 1124615 1128853 1132617 1135357 1136698 1136965 1136669 1135484 1132343 1126683 1119027 1110153
52175 1110153 1100356 1089923 1079762 1070823 1063141 1056118 1049684 1044403 1040314 1036556 1032660 1029555 1028575 1029815
52161 1029815 1032266 1035347 1039449 1044899 1051191 1057430 1062873 1066889 1069191 1070480 1072059 1074281 1075996 1076172
52147 1076172 1075413 1075101 1075595 1076262 1076977 1078538 1081463 1085234 1088987 1092379 1095541 1098706 1102076 1105749 1109663
52132 1109663 1113880 1118940 1125633 1134472 1145789 1160173 1178288 1200201 1225356 1253261 1283819 1316961
52120 1316961 1352348 1389468 1427570 1465500 1502037 1536539 1568999 1599542 1628262 1655445 1681286
52109A681286K3924K0762J6631J2351Q353M768J962K40q27k047l580m847n481
52096A753495n872o645q012r735j1506j3227j5126j7489k0188k2609k4111k4488
$$ plain form
52109 1681286 1705210 1725972 1742603 1754954 1763307 1768075 1770037 1770277 1769450 1767403 1763823 1758976 1753495
52096 1753495 1747623 1740978 1732966 1723231 1711725 1698498 1683372 1665883 1645695 1623086 1598975 1574487
$$ [...]
##END NTUPLES=NMR SPECTRUM
##END=
