
##TITLE=AC1322_SRiAH12151_6609742_Z0HcQSkvhB
##JCAMPDX= 6.0         $$ Bruker NMR JCAMP-DX V2.0
##DATA TYPE= NMR SPECTRUM
##DATA CLASS= NTUPLES
##ORIGIN= BRUKER
##OWNER= Administrator
$$ 1.72 TOPSPIN		Version 2.1
$$ 2012-08-01 21:32:53.171 -0500  Administrator@TOPSPIN
$$ Compression mode = diff/dup
##.OBSERVE FREQUENCY= 400.02188249412
##.OBSERVE NUCLEUS= ^1H
##.ACQUISITION MODE= SIMULTANEOUS (DQD)
##.ACQUISITION SCHEME= undefined
##.AVERAGES= 8
##.DIGITISER RES= 22
##SPECTROMETER/DATA SYSTEM= spect
##.PULSE SEQUENCE= zg30
##.SOLVENT NAME= COFFEE_meoh
##.SHIFT REFERENCE= INTERNAL, COFFEE_meoh, 1, 14.98509
##AUDIT TRAIL= $$ (NUMBER, WHEN, WHO, WHERE, PROCESS, VERSION, WHAT)
$$ ##TITLE= Audit trail, TOPSPIN		Version 2.1
$$ ##JCAMPDX= 5.01
$$ ##ORIGIN= Bruker BioSpin GmbH
$$ ##OWNER= Administrator
$$ $$ C:\Bruker\TOPSPIN/data/COFFEE/nmr/AC1322_SRiAH12151_6609742_Z0HcQSkvhB/10/pdata/1/auditp.txt
$$ ##AUDIT TRAIL=  $$ (NUMBER, WHEN, WHO, WHERE, PROCESS, VERSION, WHAT)
(   1,<2012-08-01 21:32:44.468 -0500>,<Administrator>,<TOPSPIN>,<go>,<TOPSPIN 2.1>,
      <created by zg
	started at 2012-08-01 21:31:37.875 -0500,
	POWCHK enabled, PULCHK disabled,
       configuration hash MD5:
       6B 1B 68 BB D9 2E 58 E2 7F 35 AD 54 07 DF 0E 41
       data hash MD5: 64K
       E7 6A 17 97 37 73 74 B6 B5 7F AA C3 EA 20 64 B8>)
(   2,<2012-08-01 21:32:48.578 -0500>,<Administrator>,<TOPSPIN>,<proc1d>,<TOPSPIN 2.1>,
      <Start of raw data processing
       efp LB = 0 FT_mod = 6 PKNL = 1 PHC0 = 0 PHC1 = 0 SI = 32K 
       data hash MD5: 32K
       8A C2 CD 0D A5 43 B4 C6 51 FF E1 25 13 20 AE C1>)
(   3,<2012-08-01 21:32:49.203 -0500>,<Administrator>,<TOPSPIN>,<proc1d>,<TOPSPIN 2.1>,
      <pk PHC0 = 177.5775 PHC1 = 0 
       data hash MD5: 32K
       73 87 14 EF 0A A3 16 6A 76 45 0D 5D 4E 20 27 A9>)
(   4,<2012-08-01 21:32:49.281 -0500>,<Administrator>,<TOPSPIN>,<proc1d>,<TOPSPIN 2.1>,
      <abs ABSG = 1 
       data hash MD5: 32K
       E6 F3 44 36 F5 D3 CC B1 92 C7 D0 42 61 D9 2F 7F>)
(   5,<2012-08-01 21:32:49.312 -0500>,<Administrator>,<TOPSPIN>,<proc1d>,<TOPSPIN 2.1>,
      <abs ABSG = 2 
       data hash MD5: 32K
       AA 6D E7 A0 4A AF 0C 91 4E EB 93 17 3B 42 DA EE>)
(   6,<2012-08-01 21:32:49.343 -0500>,<Administrator>,<TOPSPIN>,<proc1d>,<TOPSPIN 2.1>,
      <abs ABSG = 3 
       data hash MD5: 32K
       3B 23 28 6F 3E A7 65 3C E6 4A E0 DF FD E5 FC A3>)
(   7,<2012-08-01 21:32:49.359 -0500>,<Administrator>,<TOPSPIN>,<proc1d>,<TOPSPIN 2.1>,
      <abs ABSG = 4 
       data hash MD5: 32K
       C8 DB 69 13 C7 8A B2 83 49 E0 67 71 48 B3 CD 77>)
(   8,<2012-08-01 21:32:49.406 -0500>,<Administrator>,<TOPSPIN>,<proc1d>,<TOPSPIN 2.1>,
      <abs ABSG = 5 
       data hash MD5: 32K
       C3 02 9E D4 F6 2B B2 A8 7B FB 1F 3B A5 EC BC 44>)
$$ ##END=
$$ 
$$ $$ hash MD5
$$ $$ 8B B8 4E 34 B2 8A 19 B3 DA 5A 85 0C B0 8E E3 51
##$RELAX= 
##$RELAX= 
##$RELAX= 
##$RELAX= 
##$RELAX= 
##$RELAX= 
##$RELAX= 
$$ Bruker specific parameters
$$ --------------------------
$$ [...]
##$TP= (0..7)
150 150 150 150 150 150 150 150
##$TP07= 0
##$TPNAME0= <>
##$TPNAME1= <>
##$TPNAME2= <>
##$TPNAME3= <>
##$TPNAME4= <>
##$TPNAME5= <>
##$TPNAME6= <>
##$TPNAME7= <>
##$TPOAL= (0..7)
0.5 0.5 0.5 0.5 0.5 0.5 0.5 0.5
##$TPOFFS= (0..7)
0 0 0 0 0 0 0 0
##$TUNHIN= 0
##$TUNHOUT= 0
##$TUNXOUT= 0
##$USERA1= <user>
##$USERA2= <user>
##$USERA3= <user>
##$USERA4= <user>
##$USERA5= <user>
##$V9= 5
##$VALIST= <valist>
##$VCLIST= <CCCCCCCCCCCCCCC>
##$VD= 0
##$VDLIST= <DDDDDDDDDDDDDDD>
##$VPLIST= <PPPPPPPPPPPPPPP>
##$VTLIST= <TTTTTTTTTTTTTTT>
##$WBST= 1024
##$WBSW= 4
##$XGAIN= (0..3)
0 0 0 0
##$XL= 0
##$YL= 0
##$YMAX_a= 479969
##$YMIN_a= -627570
##$ZGOPTNS= <>
##$ZL1= 120
##$ZL2= 120
##$ZL3= 120
##$ZL4= 120
##$ABSF1= 14.98509
##$ABSF2= -5.573092
##$ABSG= 5
##$ABSL= 3
##$ALPHA= 0
##$AQORDER= 0
##$ASSFAC= 0
##$ASSFACI= 0
##$ASSFACX= 0
##$ASSWID= 0
##$AUNMP= <proc_prof1d_extract_pilot.lims>
##$AXLEFT= 0
##$AXNAME= <>
##$AXNUC= <1H>
##$AXRIGHT= 0
##$AXTYPE= 0
##$AXUNIT= <>
##$AZFE= 0.1
##$AZFW= 0.1
##$BCFW= 0
##$BC_mod= 0
##$BYTORDP= 0
##$COROFFS= 0
##$CY= 15
##$DATMOD= 1
##$DC= 0
##$DFILT= <>
##$DTYPP= 0
##$F1P= 0
##$F2P= 0
##$FCOR= 0.5
##$FTSIZE= 32768
##$FT_mod= 6
##$GAMMA= 0
##$GB= 0
##$INTBC= 1
##$INTSCL= 1
##$ISEN= 128
##$LB= 0
##$LEV0= 0
##$LPBIN= 0
##$MAXI= 10000
##$MC2= 0
##$MEAN= 0
##$ME_mod= 0
##$MI= 0
##$NCOEF= 0
##$NC_proc= -8
##$NLEV= 6
##$NOISF1= 0
##$NOISF2= 0
##$NSP= 0
##$NTH_PI= 0
##$NZP= 0
##$OFFSET= 14.98509
##$PC= 1
##$PHC0= 177.5775
##$PHC1= 0
##$PH_mod= 1
##$PKNL= yes
##$PPARMOD= 0
##$PPDIAG= 0
##$PPIPTYP= 0
##$PPMPNUM= 2147483647
##$PPRESOL= 1
##$PSCAL= 4
##$PSIGN= 0
##$PYNMP= <proc.py>
##$REVERSE= no
##$SF= 400.02
##$SI= 32768
##$SIGF1= 0
##$SIGF2= 0
##$SINO= 400
##$SIOLD= 32768
##$SPECTYP= <>
##$SREGLST= <1H.CDCl3>
##$SSB= 0
##$STSI= 32768
##$STSR= 0
##$SW_p= 8223.68421052631
##$SYMM= 0
##$S_DEV= 0
##$TDeff= 65536
##$TDoff= 0
##$TI= <>
##$TILT= no
##$TM1= 0
##$TM2= 0
##$TOPLEV= 0
##$USERP1= <user>
##$USERP2= <user>
##$USERP3= <user>
##$USERP4= <user>
##$USERP5= <user>
##$WDW= 1
##$XDIM= 32768
##$YMAX_p= 459389484
##$YMIN_p= -718286
##$CURPLOT= <Network HP LaserJet P1505>
##$CURPRIN= <$Network HP LaserJet P1505>
##$DFORMAT= <normdp>
##$LAYOUT= <+/1D_H.xwp>
##$LFORMAT= <normlp>
##$PFORMAT= <normpl>
##$SURQMSG= 1
$$ End of Bruker specific parameters
$$ ---------------------------------
##NTUPLES= NMR SPECTRUM
##VAR_NAME=  FREQUENCY,     SPECTRUM/REAL,   SPECTRUM/IMAG
##SYMBOL=    X,             R,               I
##VAR_TYPE=  INDEPENDENT,   DEPENDENT,       DEPENDENT
##VAR_FORM=  AFFN,          ASDF,            ASDF
##VAR_DIM=   32768,         32768,           32768
##UNITS=     HZ,            ARBITRARY UNITS, ARBITRARY UNITS
##FACTOR=    0.250966925370066, 1,           1
##FIRST=     8223.43324360094, -59015,       34484
##LAST=      0,             -131328,         -61585
##MIN=       0,             -718286,         0
##MAX=       8223.43324360094, 459389484,    0
$$ Real data points
##PAGE= N=1
##DATA TABLE= (X++(R..R)), XYDATA
$$ [...]
23777 137823 95430 -369133 5972 186826 298711 -200866 251899 194354 206006 -201176
23766 -56599 96021 43516 9650 -41643 -37395 46039 -93727 94861 -276956 109102 -14571 -45892
23754 -45892 56109 364388 -32226 113009 -16376 -117167 -186439 -20132 246766 -112907 -94283
23743 -94283 151319 95149 -91996 -102713 -224554 -66039 28313 -180502 -169311 -110233 -77964
23732 -77964 189109 -2230 -215980 -248372 295614 -83680 -76456 145760 -65930 64025 -84864
23720 -122218 25215 274489 17721 8401 -511 292552 -32490 -13275 -98779 153158 162908 40592
23707 -88246 -59458 -79027 -199732 216638 -220331 -60334 -117510 -548005 -175378 -231037 -259990
23696 -259990 35028 280222 -95171 -88026 -203299 -224863 -372069 111389 -252568 56589 23136
23684 -318540 53393 85871 -56121 -134962 158403 -99125 99566 32537 -326081 8770 -422 -52877
23672 -52877 -104394 14326 -269997 -176581 29247 32152 32389 -54179 -281790 8992 126455 -60260
23659 -241941 -397007 102039 -46912 -20110 -55898 -290842 -40569 105389 70660 479445
23649 479445 56366 141616 325380 -100542 13364 -247572 104508 225999 333504 -138740
23638 -227264 -133715 35678 -57864 -42549 -63037 -142402 172998 -49409 -177695 -279350 -34010
23626 180284 -296539 60864 265477 117767 -117314 -129853 -394976 -13935 -81220 -208942
23616 -208942 -14725 99997 -203123 -24707 -140175 197904 -88301 -77831 348554 236789
23606 236789 -90989 -100499 38467 49777 308618 -51672 -130742 46301 51715 266775 238489
23595 238489 203937 32651 -32716 174842 198929 305692 -49966 302599 498898 -91506 273871
23583 89719 47426 -5546 31555 -220964 113630 116965 103254 -60785 124632 137792 -21815
23571 -164384 -120763 222827 -70953 -34171 -65639 -29368 -109964 -86872 -201548 -570592 182798
23559 -105513 154011 -109479 -68595 -26112 -36658 174994 -80070 -58590 205533 -26230 399795
23547 -5023 84115 202707 -143984 -233481 193222 87977 -333848 25265 -173001 18545 59763
23536 59763 -142321 322419 159052 35125 -314557 80482 -301412 -93403 243977 -299639
23525 -226744 315031 -49655 148011 245983 -72003 335014 188715 -27479 -239643 114049
23514 -34393 -57481 178518 -977 -195628 318075 129432 -69505 -176057 -67123 -261365 143442
23502 412260 5232 60341 170461 -303248 -272146 -6027 -362606 28481 -35980 307201 -87189
23490 -341808 -394535 44743 -74144 -118105 -140419 20211 -38498 -40254 -176090 22867 17054 -31069
23477 330674 165124 1871 122058 160389 482873 -83467 -41749 -136079 -280652 29597 -78292
23465 109475 42314 -206734 -22436 54828 -45648 -121084 42665 8752 -140779 70917 11096
23453 -160393 50503 11261 -216206 420649 -66574 16209 114362 -877 -83027 192853 231253
23442 231253 6009 -377858 6735 -324894 -218852 -322253 70454 -61254 106079 -8342 -76801
23431 -76801 110328 -39536 37334 -34060 -370278 -95462 44003 78384 50587 -234510 -281251
23420 -281251 448035 -10490 -81486 180945 13883 -219114 -330997 35955 -201960 -215913
23410 -215913 -58822 75330 175607 -360962 -231086 5570 -407541 -206844 -76767 108391
23399 118952 279939 -84807 -430016 -49078 7254 150503 -21807 111605 111812 85073 -67326
23387 -261442 -51344 87891 258113 128908 -98786 -214583 -202748 189167 6293 -91458 39410
23375 161196 -103600 -36713 -82052 213040 -90509 -52658 -395850 -236382 -65729 -63365 130798
23363 -71943 -271964 236690 377709 -32608 -40681 -118030 -93254 370132 -245046 -68167 104353
23351 132116 -11781 339370 46979 -158295 16918 -161422 -256107 -14046 -153537 -258077
23341 -258077 170068 -216601 47661 113982 -379652 322252 -45812 29149 79637 -184808
23330 -152336 -63747 95828 183798 786 144146 -263454 -15695 -149434 -137729 189846 -195827
23318 -72212 127024 21951 -83001 -280229 -91965 -126485 -82047 25380 17831 4761 -115821
23306 -55057 18348 118831 -127216 114907 -51574 -217470 -14072 233966 124254 114858 -142419
23294 107122 162682 63124 -187924 2425 -43659 -28898 259623 -32868 -15245 -95934 17854
23282 24166 -304195 -332033 159580 -343380 -474535 46923 127168 -217216 -170227 -215405 154921
23270 -72054 130613 -94186 -166290 -36329 4483 11950 212949 -58678 36833 38716 163601 -265342
23257 227317 62901 -237039 -14191 93220 -99488 242105 206904 -41215 65462 -201995 30153
23245 -96629 -82 -55950 69055 -38548 50354 -34968 115335 -127846 218506 -157531 -283150
23234 -283150 264219 -186681 -74288 -116573 -315214 49287 43997 55442 226314 -110672 -101108
23223 -101108 -216131 8780 -204282 -170341 -44375 9755 -80154 53904 17829 -104381 47377
23211 -94249 206673 -68719 11535 -352081 72042 -51623 -213403 15441 -92839 266957 -178595
23199 -207678 388144 -4079 -9892 -329804 -312962 -394862 -301536 222780 -91940 156727 -319496
23187 92387 152477 165947 -162203 6456 -365090 131010 -42868 -98845 -168252 -193062 -230297
23176 -230297 116239 -87594 -90673 -103336 -183973 -84507 107658 136966 -24697 -10046 -190582
23165 -190582 -85612 -253587 -16618 -388504 128529 376386 -204803 206275 168466 209099
23155 209099 476498 -65909 26437 -428076 182636 -144622 302531 -155220 24611 -161991
23144 33653 -69695 25561 -346989 -46043 91810 -232299 -16219 185358 -224842 141560 9290
23132 -179194 88232 -26957 -83039 43938 10471 42632 210586 157433 15608 -76043 244604
23120 -57274 24074 -135129 -10055 17630 38288 -84911 240533 -76694 47375 459326 -147111
23108 -55286 -234746 -154023 88859 258329 -74049 16416 -178184 -1617 -2190 180641 -71376
23096 195992 -96790 135424 32987 -173968 -40570 -195153 17211 -80984 179092 126459 -152278
23084 -76681 -124515 3410 -147749 10085 78114 21591 18754 -415543 -117344 35552 -96461
23072 39089 78796 122506 263976 88925 223743 74391 -410 -146808 47740 -164825 41704
23060 24816 193728 -141440 19320 84775 210387 307495 36632 -92244 58044 -17778 148228
23048 -52920 85000 189805 130666 23235 -241188 75378 -102894 33955 271838 -149791 -32112
23036 136015 -54554 -87030 75499 399191 -123906 341293 235035 -142526 -295252 265495
23025 183402 -1095 -396924 34677 -92292 190187 240064 -181166 -201536 312910 -2738 98853
23013 -229623 -7255 315599 -52718 -4915 -133033 -24197 193222 74192 -47347 -31964 -29568
23002 -29568 -91186 162788 -29454 -20959 -56510 -181201 -215032 -149881 43490 -203225 -334124
22991 -334124 -139364 -146735 -5069 -306780 41280 -3810 -425236 -16016 100952 -65667 313460
22979 -298112 26535 -424630 -35653 -178712 -124977 -140456 163825 84840 -252374 -122518
22968 -9574 239522 14720 -236608 -108930 -371599 208078 145195 183630 -89202 -23609 -316380
22957 -316380 -16162 -209933 -286375 237147 179602 34714 -45767 268467 -52842 -93275 -63594
22946 -63594 -21529 40041 83877 247232 -206370 8724 -230877 -149497 262132 -438476 161487
22934 92933 -129229 188719 300547 -95592 85761 -103182 294963 -327392 72675 210221
22924 210221 178794 -178406 -145650 -40425 137147 -339052 -218156 157556 -30450 -30916 52568
22912 199089 -115807 130439 -185476 -95474 -273585 -61726 6699 -64109 -393664 141149
22901 -118722 -31606 -19884 93085 -4495 -83984 109452 61685 -177293 -61692 -124330 -212565
22890 -212565 -32312 57997 -111018 21769 167830 82467 3898 91973 -166628 23308 -417311
22878 50787 91714 75031 -129076 -21555 -47566 -232661 98881 -56180 1918 -462699 -165848
22866 -267366 -265924 -67976 -56349 38827 -143699 166088 264337 -164230 -13264 66309 16045
22854 -56448 -312027 -95534 101393 -273872 170212 -44579 29052 141033 31975 -172060
22843 298886 -86160 -51449 -75757 120481 -229584 -70389 58184 59745 206244 107823 -285974
22831 160961 252398 27631 -114719 -166898 241284 -249903 96236 53720 117077 -105705 -334082
22820 -334082 -32320 137714 23647 -119180 -222074 -195179 -83853 -56754 242077 -286022
22809 -129174 270815 -23681 -89224 97718 -20663 -255319 -128649 -8717 58046 -95986 -253529
22798 -253529 -258375 -287133 54250 83466 -283705 1122 119457 251379 131568 -77471 -226992
22787 -226992 -369089 24825 36244 -148767 -375206 -141146 -60159 -101744 -213052 -85658
22776 -103783 89255 -339571 -585679 129512 260359 -228146 -372432 268548 -149629 -163133
22766 -163133 -1148 14452 -220397 254328 80815 -194900 -21349 -116648 103760 49658 -421136
22754 -75766 187414 130640 -335294 -119196 155125 184007 3120 173092 -327221 -87249 97840
22742 -91164 69080 -378776 -141846 -77039 53511 293544 -135042 -56820 59118 232892 564
22730 -3403 -65079 25606 204128 -8028 -98729 -236952 240090 335541 212322 23475 189666
22719 189666 -88714 -212812 -156012 -221237 51859 20700 120719 -137462 -121252 126656 -44951
22707 314943 -227958 94895 156948 76009 -165919 187948 -235788 -66651 239456 283156
22697 283156 89201 -395219 -105582 -98957 12545 310781 -222281 -536787 34540 -66837 -263934
22686 -263934 -28658 -117542 5415 -167989 288290 -91548 264998 -242260 442 -142909 133684
22674 -79240 -518570 -17190 -53544 118179 96260 -114922 135605 177150 -159583 -497 4836
22662 -111542 83549 173526 -287748 36801 117621 78741 -11572 -135084 198293 60973 -261144
22650 -212219 -388426 -80189 89362 -162488 -77521 163647 183751 -150185 -111343 -174661 113635
22638 -199889 368104 186865 -129364 -112401 11376 -153944 -199243 -104475 227838 156708
22628 156708 47282 16941 -274428 23823 113954 -192423 -128355 -198977 -155077 -166490 155283
22616 232570 -259 -76755 -19876 -134255 -140006 90976 93695 -390905 -175676 -112781 42596 26163
22604 26163 143552 74359 -218734 -39867 -303671 -287562 57960 -68164 -77770 79877 -38134
22592 -118478 22408 -272026 -251923 41254 596 -30259 239338 -65402 151068 -202899 -138066
22581 -138066 -230320 36287 -169068 133749 124922 -263963 -206315 18116 -4942 -21828 91333
22569 -88867 -89024 -41953 14857 -70745 -161471 857 13767 -119381 171883 -191933 -209193 397683
22556 -203925 -7544 -89348 -137944 -142811 296730 -93836 -67140 -196130 390659 -130702 -211213
22545 -211213 46447 61453 -74440 -140163 -266084 -16184 159929 12667 42680 131606 40483
22533 -19850 -34567 -420078 -256213 88284 -66191 228766 46699 -124572 -123207 -29093 179016
22521 119925 39598 88863 -105219 -38585 -177340 -538709 -188949 -93936 -360961 81846
22510 238030 234596 61187 213273 -246632 292084 -230165 -182081 22306 54322 4950 -373137
22498 83008 134896 306145 -55554 217797 -209931 -183887 219692 189381 -65059 156839 -59686
22486 -79404 -177921 -67655 -134780 -272670 207624 -76546 -353767 -184030 -50784 -97133 167356
22474 -269367 -77269 -50764 -46631 34702 -105532 242328 -3097 -100599 211437 -221682 -42552
22462 17089 258638 -154392 92462 77241 221491 306158 68835 83846 -321704 -191959 -427518
22451 -427518 263009 21198 -349378 364358 -76917 59825 20376 -20424 -100188 103672 -147094
22439 -364112 -37366 -119459 78411 120652 -79834 -164681 -26757 -186268 -158055 291908 43310
22427 -103953 27427 -72804 144412 -151591 -36888 48118 50303 270671 174146 45933 136125
22416 136125 49746 14938 -6513 -174966 22293 -253347 -251354 -121963 89924 90857 -279909
22404 306285 79000 111124 -100489 -43202 -21818 26980 -249334 -122781 -174277 -111865 -71403
22393 -71403 -311352 -324089 223732 37288 -175702 -287375 -88978 29292 65235 175161 -76824
22381 -108631 -171822 -120158 10069 1550 -30933 130480 -221881 -202755 -4428 198198 -132750
22369 -113152 -251160 37285 411895 -328405 299 176023 -7262 -74741 166127 -46919 -295556
22358 -295556 235634 -277219 -46331 -11421 -132371 -279080 329248 -105515 -128346 -21582
22347 -81834 -197262 -13887 184857 -133381 230483 -302383 169664 -30635 -23185 101135
22336 -28336 246167 -156613 238981 140720 113420 -103900 -80459 -290905 -184940 8158 78889
22325 78889 48656 62925 229343 104480 -257523 322591 -194762 119808 38196 -615883
22314 18373 47323 13574 159446 -90859 44748 166178 168440 -146239 -40418 -65479 -98810
22303 -98810 -34873 7125 -102451 -129970 143147 92117 -128818 -333310 5019 -223137 82133
22291 70351 -492034 -79930 -90709 -240867 -198449 -11650 226006 308651 -129438 263094 -7120
22279 -186024 -237581 32764 531 70985 -105591 73289 160916 154273 -156647 48116 -176605
22267 -91613 158634 -190810 -140946 -299670 -17286 229813 -61216 95931 -187814 -108435 30932
22255 -228777 -312472 -190727 -17314 -8195 169 -27381 186739 102643 -32648 -37197 -181457 -6261
22242 134964 -221080 -267631 -86872 45021 -84046 3593 -390836 -198189 51851 -344472 10592
22230 27029 -41298 -80954 -73201 -191533 -73099 129451 -233632 -240177 -143825 214496 -177171
22218 -67696 -172029 10034 54613 -68549 140879 235683 -13043 176531 -273086 193518 -207687
22206 -33439 379986 -311253 8748 38001 57204 -508757 -49961 -152224 -46753 49803 11069
22194 60042 -101792 37265 73435 151196 -104514 -107046 134165 49953 155270 63685 -9172
22182 -62305 -125079 263364 40151 -237173 128621 -333398 -275367 -190849 -144803 -113311 98735
22170 222500 60359 -210037 -206825 -135105 -77573 -135981 131434 11261 -84007 -194713 326599
22158 55974 -73240 -7559 -194250 -3566 -200610 -102480 118612 23031 193945 -99033 -133779
22147 -133779 337367 -205683 -101797 409320 -104971 -51583 31757 118507 -143302 -297090
22137 -297090 102725 -124599 -51517 -41726 -217125 257283 115249 -93386 -12057 95295 -30439
22125 48272 -119735 -50484 -64043 -227516 -231339 -53186 266055 139919 -358872 181150 202891
22114 202891 31146 -95335 -93237 -237339 -62458 -21963 -60927 -160602 173623 -118428 -111085
22103 -111085 -123486 22132 52355 113559 -13670 256772 -163349 2655 -4894 163812 84069
22092 84069 134339 68797 -539 -65334 49184 201284 -143321 -91701 -105026 99131 -46628 -194482
22080 -194482 -33200 214850 112837 -153075 -192573 124811 -416273 -297139 203899 64855
22069 -296244 15166 16822 -132649 -362931 -136402 121969 -23617 287143 -148969 87893
22058 -92353 -60806 89517 -163265 -146925 16347 -10161 15492 -114313 -224052 -142527 320246
22046 298521 -311767 72362 -169295 -124965 -90740 -7211 -117163 -92948 -132222 -317369 -262517
22035 -262517 -45464 -156839 49390 26052 -112227 -17800 -345639 -170236 -254178 -200278 -164964
22024 -164964 149868 -188932 -193548 -237382 -170733 246299 116852 -62609 -213074 -210440 -197164
22013 -197164 -64954 -307467 -111986 82422 -4088 284833 -237002 -52519 -256949 -240667 71230
22001 -372034 -27198 -232514 141722 -337832 13471 -189029 -131905 8633 16098 113958 -131391
21989 131927 86212 18161 100632 -139492 -101347 79369 64317 -78764 -90095 -291769 -524461
21978 -524461 204893 256249 18789 149726 -27271 -382264 130354 -85922 -107530 -201641 -101781
21967 -101781 37215 -44419 -232667 25053 160924 -189202 -20615 53960 -114639 165743
21956 -109050 147905 -208991 -140533 41829 146968 -214 42356 -45610 86284 -216230 210042
21944 18586 140862 -123350 -251890 -6583 46441 -1741 -262769 -67437 -244759 -203126 -216859
21933 -216859 -65022 85268 -125112 -111643 -62562 -178418 -96882 -165019 -92576 -104515 9525
21921 -110497 227514 -144615 122124 -296761 -30149 9258 -286984 -44547 200389 -206768
21910 -120891 40389 -194147 -11038 147490 -218577 -51538 57521 27382 -54675 55614 -187617
21898 177592 199736 -214238 -155003 -178352 -244709 -309298 -51796 38224 -49193 -58458 -150810
21887 -150810 -254417 64845 -141765 196193 -67869 -107448 80768 -315899 206406 -133014
21876 -149088 -73704 -3528 -202794 -119238 -44506 -396244 58299 111371 -222281 -204042 -16381
21864 -61812 -109207 9101 132165 -328091 -57246 -32114 -162248 143151 203918 -69221 43369
21852 42942 -13935 16996 -201259 -11651 -8559 142583 38931 -79247 -121877 68745 37202
21841 37202 -64842 -109995 92857 150963 16704 -407121 -25253 269916 -78817 -142122 -43254
21829 80392 164384 -7644 -78208 24807 73940 106474 -582994 24846 141253 -292230 -375308
21818 -375308 -253073 -350737 -10410 -155055 -22251 87749 71897 -278181 -359042 157689 94131
21807 94131 -135500 111722 -38338 63176 172000 59203 162716 -77185 -102025 -297190 -214927
21796 -214927 -397035 242802 60844 175358 108312 -19729 101785 -48650 26286 168389
21786 168389 225270 -42653 -23081 180664 47594 -189449 79548 7918 -30549 46734 -79087
21774 -160743 -135445 36560 -164715 159075 -49591 -453178 80083 -62612 184328 94591 44781
21762 76975 170988 100029 185502 203551 -204995 -249503 -38189 201072 75808 47538 93505
21751 93505 -62056 66041 95212 216905 -46386 -160471 -170630 -206170 -92741 -20057 366909
21739 -21081 -46438 -250152 22228 -54187 -117209 308491 113515 -72301 -336513 84339 303953
21728 303953 -193578 62464 -143099 -509716 -19515 -309666 98319 206227 -109450 -105211
21718 -105211 -76687 -13789 211644 -276862 -85599 50871 -143377 185973 38654 -228657
21707 33895 -155263 172439 125617 -133370 -104128 19957 98010 -204544 -171454 -281602 -199711
21696 -199711 -199290 177272 75578 -227968 221033 -165285 -337195 -297322 -103363 10127 31413
21685 31413 -112873 -178809 117342 -274389 73538 -66505 -114668 293608 33942 -347968 -283503
21674 -283503 -60382 -39810 95073 -196163 -129212 -80156 15831 364746 -89005 -423982 -121771
21662 44250 193589 127833 130329 -363958 86144 20189 -32498 -233156 -235231 -59282 35934
21650 162941 218315 111875 20912 -109502 -202806 28098 211018 61213 36529 -258183 -314712
21639 -314712 -36982 -51993 350552 -94846 -149551 -113490 -84448 -67129 -86532 -291549 -168711
21628 -168711 -80635 -43943 -13585 -153727 97051 29465 -57575 -49940 -86642 -249486 27164
21616 -238352 77537 -26322 86707 -151085 -312552 251858 -191736 103668 20381 -103203
21605 52387 268249 16983 -366984 -111108 5646 -174599 -76030 -78210 -243997 307099 119101
21593 85023 -193236 141748 148944 -367329 -252075 4754 -79644 -335529 239022 -76258 -275814
21582 -275814 68161 -213154 -43926 -67803 -105637 -435947 293450 70457 -31410 18962 33360
21571 33360 -85964 -57385 -317659 -86276 -152497 -114616 119434 140266 -386271 -194848 -189385
21560 -189385 115010 -154670 -44053 -28617 -185997 -347591 -32180 -13649 -5204 -64725 -321055
21549 -321055 7900 -3777 186629 -88388 41043 -310839 27762 408053 114494 -117437 -117114
21538 -117114 216175 -15561 -38361 -21536 -164861 -10787 -111753 -35372 205146 -75526 -135981
21527 -135981 77748 198259 23545 -214159 54013 -126642 286795 -28737 465399 55862
21516 -25126 -44461 9094 -13064 -4005 -251846 -105746 -70100 -70726 -40962 4581 -91445 -465618
21504 -465618 -57999 -242732 -421380 122215 56960 -97842 -515089 -152140 -174858 -10554
21493 44408 -136418 -525503 -40334 -118708 -11718 17929 -321918 -48191 270287 -349465 19986
21481 115931 32218 -93684 -23498 -95125 -202599 -128674 211446 56624 -28514 99672 64390
21470 64390 -123784 23914 -40706 -225744 -127133 -360309 -174739 101837 53626 14915 15762
21459 15762 -217771 -38103 80984 -166841 -247231 -277544 46416 321194 -42202 -12938 236323
21447 150248 -277489 19169 -34492 -181225 159980 -18659 66377 228777 332440 127824
21436 32400 135812 421205 407031 381611 86595 185061 647 181349 -200704 286365 -278910
21424 -161510 -128619 220173 11245 -54146 -75780 73658 -109864 -14712 -419201 353663 -211387
21412 -162757 12990 -114915 -299725 424984 -120587 -151065 53498 243977 -230202 -67844
21401 -359573 -235629 57586 -14076 279627 -276698 -242279 232579 -76289 395938 -247534
21390 -200661 -144687 112006 -158245 387401 45261 -335482 -147519 -169110 -51303 -381025
21380 -381025 -41966 -277876 -103203 -224901 -138237 -269316 -165219 -22561 -316906 -174516
21370 -174516 -127510 -348438 -77277 -88884 -278861 14741 -180982 -15563 -41691 78940 71432
21359 71432 70547 71573 -56191 -135244 210509 -4389 -119323 -220996 -147595 -167570 -265732 312925
21346 -130896 47917 214227 107218 100618 -428631 269370 189126 -231176 -49585 100522
21335 -32435 164288 -88843 -19208 359486 -166346 -161220 296423 -83439 30032 -121082 -133110
21324 -133110 -139528 308338 -100981 -236147 391492 -231074 116727 162194 38001 408577
21314 408577 -305328 -32647 31258 270662 -213896 -251242 17747 -200811 -60049 86244 -149455
21302 -18419 35314 25266 195707 53162 -64995 -97665 -17327 -170298 248222 -456074 -182632
21290 -7021 -208390 -217320 -84149 -557182 314804 164562 -57444 10716 342058 -77733 289390
21278 -301059 114414 117327 145458 -238186 -255227 -38411 141164 -154561 4537 -183958 -298928
21267 -298928 -24403 -403310 -151637 258997 -392163 194015 25668 80248 -467920 151892
21256 -65586 -161599 -164689 -131768 175549 45558 -244227 301374 -132889 -140237 -61381 153283
21244 -203161 -408803 -364813 -254245 -15589 136388 -220995 -4322 138348 -25756 -40589 -77970
21233 -77970 39101 72609 -171282 -102330 131289 -178044 -106581 -95474 37475 -175638 -265697
21222 -265697 178923 -175161 -128790 -62673 -18815 -52889 12162 -37586 117832 -80618 -5376
21210 -102257 -271066 -208849 -51947 150049 142913 102418 -74034 -72446 259556 -183939 91973
21198 -66586 -97166 271344 14428 -9340 -223718 -203612 85806 74948 -148863 203609 -108926
21186 -224045 -271663 -66031 36143 22088 55934 122311 -75440 -94351 -296562 25152 53636
21175 53636 -134274 14664 -447653 -228331 330010 -89662 63734 302390 4641 92073 -238555
21163 -98388 -96437 19298 -68103 -180062 -234792 -27117 -240016 15201 -22987 190617 -31633
21151 -251224 -114734 -100126 -534424 -40038 -197576 -190710 3050 144076 -170044 -339396 -66328
21139 -3689 -85131 -428215 29901 -161774 212800 70936 20075 105747 -198808 -95075 -128716
21128 -128716 116926 -435333 -2028 88060 -171136 37104 49081 -402924 -143071 -43285 -172333
21117 -172333 67119 -21718 330925 258057 100807 -241855 268408 -212521 111801 -28918
21106 138339 -136585 -137346 62391 227379 32 -117917 1593 -53243 -171844 -177097 177778 -316362
21093 16187 -240924 -239535 258682 147493 58706 -53979 -297974 -272392 -61847 29480 -227817
21081 -246963 -89062 -14986 39428 4746 -9501 84178 -318559 -85247 291976 -82492 -10523
21069 -125044 86245 -161419 -131463 187747 -79779 -191789 274987 157530 -256419 289272
21058 -12264 -136918 146798 -183706 128560 218704 80531 103449 -56579 -71505 -394554 -209
21046 2574 -178776 -209714 14615 -81636 -33180 -158004 125538 -116707 -433090 15264 248115
21035 248115 60703 153128 -291984 -48107 -5218 -176483 -93846 -110344 -354891 -13183 -217155
21024 -217155 -346713 172609 -159965 -85966 2177 -261412 1990 389787 142494 -305475
21013 -180797 81163 -30384 301188 80299 -211370 290627 34513 499313 852583 329301
21002 9752 40276 317496 3825 91226 -28574 101134 153660 152876 5424 -171103 -14445 179031
20989 -68785 -65440 -5793 -273589 84472 16643 -72663 -127546 117397 -94339 -88227 -105913 -149846
20977 -149846 -199851 -277148 161393 125508 86797 -298309 43201 -122211 233848 30996 -268108
20965 176407 309740 -112472 56308 203419 -23957 -470079 -245355 -99752 -405985 -257393
20955 -257393 -180970 -73719 304137 130358 168216 -197318 -1434 -63209 -183163 -113863 -100572
20944 -100572 264132 437373 462230 576250 125756 152320 -58612 75065 79337 -148214 -164811
20933 -164811 154841 -83892 -176415 -249067 -244034 -258875 -84887 -159101 65956 212443 -205232
20921 229298 -101459 -70763 -327352 -195135 171125 -256219 -35341 -74620 -217881 42518
20910 -124573 -54231 59847 -61333 -56850 242041 19440 -156751 -121259 -205002 153902 104072
20899 104072 -49867 -25498 -152276 -106059 -51300 80753 -132249 49933 300558 -169889 -66167
20887 -406746 -307509 -190295 -173834 -122607 -44617 -453505 40891 -76198 -7652 -322404 29167
20875 -341009 -260439 -254799 -423106 -121073 -227866 -245912 -85172 3090 25386 -286629 -19178
20863 -61446 1515 -361677 -59629 -134444 1763 -47761 -96534 58903 121922 -211622 192391
20851 389039 123975 349205 35102 141675 -30415 -25279 159883 -385843 127221 -182782
20840 -2477 100592 -129374 352614 23716 -196601 -73794 -108007 177356 130575 -279259 -291832
20829 -291832 -44339 -23462 -94112 -321442 -7339 33822 16391 -18710 -299179 163112 -56101
20817 -18005 -180839 -84404 -248414 -204444 -74133 -210115 327315 978 158055 -149922 120808
20805 -297482 -228057 -200179 108367 86540 -134013 232622 -451842 105692 45694 194085
20795 194085 202744 -201291 -160449 -343024 45085 -133319 -20148 -248310 219686 106583
20784 211679 219685 5738 48174 177572 -186824 -54122 -125933 -200488 -139944 -227073 -42 -326506
20772 -326506 -71301 150263 360183 -36536 28678 283075 -189153 237109 -381241 49734
20761 -449610 -200770 -433595 180437 -81462 25031 131364 85889 -416032 -136577 -108422
20751 -108422 -98870 -247906 -39939 -2843 -52742 -178596 -174364 -55238 81432 -234231 -85460
20739 -13900 -267445 158337 119491 -40051 -105541 89685 -31703 61142 90595 35867 308229
20728 308229 11141 -111657 -127091 -201769 114573 -209157 -69935 -72492 -416033 -287482 146340
20716 -123986 230906 79813 54056 -336248 -62764 -379784 -116794 -94228 20971 -161378
20705 -143122 -53888 82551 -214271 -160043 -236335 -298686 104641 -52930 -284972 -93950 -187305
20694 -187305 -330818 -75351 -109079 -300791 39663 -131188 -91356 -186110 -161135 122634 -122512
20682 175068 -346635 -299748 -189365 -13605 -261332 -159547 -103666 71570 94378 -86487 -74652
20671 -74652 -234477 -250934 -62317 101002 -432600 205868 -119988 -20514 47959 202561
20661 202561 219657 -103317 291253 -95309 -350013 49389 190688 17438 3449 38091 -346991
20649 -42103 -131587 -7367 -887 -221867 -272443 -69445 148435 -170768 72043 119147 -15915 88277
20636 -19031 70033 -156140 -391789 132357 -456407 -3359 -348872 -35407 -148359 115407
20625 -53129 13321 -183942 -158967 -22886 -212173 -147390 -138095 -214367 -57994 -325787 63502
20613 145167 -9548 122917 -232720 -391029 -348328 26326 -73261 -255264 157679 -230411
20602 -164728 47742 270251 -42604 -221873 -168297 89829 -90880 -404720 44199 -287917 39563
20590 -357230 -371785 -104176 -31611 -268259 492079 -137297 327841 186676 41220 75659
20580 75659 59461 50726 389650 73456 -157686 48149 112820 49912 -25227 -103116 -97599 -43454
20567 -69959 -88988 -49918 37613 -151474 -360753 18048 84387 -106693 -143705 87396 8702
20555 -355452 -209039 -166939 113497 94184 -163221 40740 -75353 -208381 248096 -66410
20544 -198980 -114395 -115150 -297606 136512 226487 -2081 -257393 -292951 -213471 51917 -37981
20532 76421 105600 -63196 -136131 -358760 110151 -165564 8427 62513 -274244 -124536 -132905
20521 -132905 -316525 -181653 130518 -198864 -36027 -12484 59612 -145230 -35984 -238806
20511 -238806 -121956 -250998 -344776 -326981 -61992 -174222 10405 -19348 69514 150896 52171
20499 199884 -71700 126203 111765 -174038 2900 -63687 7575 -432022 76206 -193338 -26365
20487 -155180 -34420 65394 -68045 347540 -191104 -466002 116219 80706 38546 -121092
20476 -341354 -44820 151831 72165 256346 -92068 -129960 -84528 -43515 -352060 249657 141657
20465 141657 -12707 -164350 -102737 130070 -148830 81952 -150804 142878 -100985 25697
20454 90584 -34293 -78663 5247 -24276 171046 -231931 -233208 -250333 -213874 -282710 -77293 -66636
20442 -66636 -63330 -125443 -145104 -143560 -236809 -327028 -285139 -20685 -197359 -124781 -347455 -102320
20429 -38946 -136771 2983 -154569 -81473 -33305 -102103 102166 -355612 -375826 -387341 -333697
20418 -333697 -213055 -168983 52117 19859 152591 -164163 100642 -43520 -150894 -9445 -118829
20407 -118829 -96633 -31987 -143564 346958 42850 -26006 109246 5562 -32813 -145478 -107071
20396 -107071 -191617 50430 -203831 -214104 -159125 30490 -214662 -228936 -263500 -261877 322421
20384 -220165 77814 156834 -66042 112374 290238 47349 -244941 -165710 1487 -171555 -89811
20373 -89811 -173716 -268095 -402335 312111 177443 -119964 89580 -246904 -69490 -204846
20363 -204846 17000 49957 -18726 -165613 -102760 -170646 54505 19801 91239 -60583 -119414
20352 -119414 135188 -148234 -74139 -183310 -183416 -253950 21493 -1690 -154028 -146340 154769
20340 -127429 -77042 331915 -17551 -842 78677 41622 -176276 -9506 -245762 8027 -458719
20328 -152600 -209627 -10889 192462 36888 -204197 -161756 -283513 -274795 -270376 -395438 25707
20316 -77346 -49727 150339 -199611 -158567 6165 262362 -119790 -96990 -43129 -52231 -122851
20305 -122851 -262197 -170678 -99827 -299272 -143189 87044 -148828 66837 -65375 -129206 279315
20293 247506 226656 -65081 -217160 267203 45796 -179119 -51542 210654 213258 -53772 132904
20281 -33675 -79403 -13912 52409 219952 -165170 172223 -187706 -227168 156979 70786 25974
20269 -193247 158037 -167376 43969 -33552 -167598 -204293 -336005 103787 14138 -73082
20258 -299833 -428418 -5892 -79428 -83620 -44081 -58210 -148951 -275152 -244320 -86348 384801
20246 23080 -267492 -170221 56532 108217 -191415 -156484 -101072 -35146 56731 101972 -316010
20234 41700 -29533 -130411 -108935 121205 -8673 174473 -87349 92196 46743 -212410 177951
20222 62305 -128883 -347416 -195450 -16678 -377233 -109059 375045 -367384 105913 -261303
20211 -41382 -167482 80678 -68620 -89814 -254227 13323 -116201 -38820 -142810 -198424 -49568
20199 93954 -37010 114984 93804 306082 -273082 87033 151293 -186244 -31026 -303504 -131266
20187 348315 -279007 33173 -206448 -111059 314216 -248418 -183697 42569 198103 -207694
20176 31898 96039 -30183 -110578 -7266 264279 23726 477223 111567 -87751 -117993 -244640
20165 -244640 -231749 106066 137614 3293 -85764 3853 186128 -207983 15598 118801 125497
20154 125497 81343 427766 84729 -187069 338422 313694 82317 433680 330589 827100
20144 827100 597462 303619 150395 308192 425648 310400 411532 521812 355442 -205419
20133 -84544 -34867 -284808 -72100 7937 -8650 -128592 -371749 -234107 -50627 166 -147257
20121 164374 -320689 -249062 -123918 -117456 -387863 -35041 -169329 74522 -214267 14684 392707
20110 392707 -81217 49018 -141515 -114809 138363 89780 152631 -212070 -426550 -251420
20100 -251420 -164990 -133437 -57565 -138128 39462 -215311 -127983 116950 -86197 -89730 -173407
20089 -173407 121915 -353224 60669 -35711 26577 -169951 152919 -125229 -6918 -35542 -106650
20078 -106650 58133 -146701 -139449 -173649 285916 -47996 -107018 -375645 -384512 -187723 20923
20066 -321419 9403 -49940 -119850 -244254 -21274 -152555 -253984 13236 221419 -26675 917
20054 68581 99805 -67268 -36541 -28122 249471 -36719 10823 60642 -379086 -236210 149798
20042 152353 357637 -377696 -193467 115666 -44419 -211951 -249842 -63288 -128844 -30221
20031 -270388 281457 150845 -273050 190754 322488 56453 384763 -79481 -119950 66180
20020 -278675 132054 21194 2823 109571 -121115 -463249 28974 -421082 -93377 -97151 -252904
20009 -252904 -41699 -47508 -307537 7308 -203813 -83315 87634 -5755 -105106 -8827 52604 139470
19997 139470 255598 223415 19693 2078 54806 -203363 224687 32277 88914 92807 108115
19986 108115 165680 -5201 238042 -253149 141297 63044 26107 6470 -60463 -213561 320479
19974 -99649 -186004 -31609 182859 178548 -163474 -145743 62394 51451 -2603 50221 203389
19963 203389 -55453 -6862 149259 1397 240693 201722 -98871 283991 69525 -820 96954 41284
19950 311578 377241 -48486 119704 -186378 -24672 187184 143647 -229586 227704 260288
19940 260288 -264800 28237 -218043 51104 -160951 -205836 -268048 -227675 -116792 28710 3409
19928 83889 -203024 57540 180489 -277695 -362678 23458 192809 -129499 -340377 -221678
19918 -221678 -76638 163346 260889 72211 -171655 -207202 -133896 -47345 106580 -310587 -170023
19907 -170023 93452 137440 -161008 -145300 -22947 7114 37086 -46902 -265896 -94308 -92555
19896 -92555 -242885 11580 -170971 -136615 94587 -102654 -94854 226615 -176695 -85327 -343805
19885 -343805 -183004 -116662 -157075 -275403 -239304 -105316 -149228 -307804 -55925 -111572 17739
19873 12370 -137109 107866 -26395 -281103 -35398 -42808 205426 -154542 -301126 179169
19862 -153684 -228259 160464 142663 121836 -18912 -119036 -133565 -85364 -293422 -76689 -282995
19851 -282995 -144569 -2253 145203 -255359 -186832 -4586 82947 285762 -137420 -48151 -224446
19840 -224446 22178 -346166 -50250 -141190 46314 -67423 -111920 -186217 64346 -53195 28670
19828 55958 -123548 24557 -298330 -16663 -34927 162773 -263994 122964 -158081 8183 -131114
19816 163318 -209401 -117766 -255690 -298789 79718 -272500 103770 -4510 -228409 -219458 -185117
19805 -185117 20313 -54798 -37961 -114891 -31852 255237 -127073 -274125 27858 89407 -142987
19793 -267622 220954 -67703 -143484 -50441 -215672 141745 333752 -283697 279675 56027
19782 1362 -231161 6891 -144805 -328694 -36232 -20138 -208827 -71717 -372209 172065 -396319
19770 199825 60421 -16151 100072 232090 -109758 8207 -264370 21455 -337836 -88654 26760
19758 -134432 -248668 -136016 124711 213030 -104381 5440 -291278 -84768 26957 237525
19748 237525 437960 58635 83346 -71492 5570 -202926 -91072 188586 -21613 283210 139267
19736 110932 103591 -19221 -1597 168732 148189 -63414 130604 588832 650178 628649 457376
19725 457376 439021 104549 -93911 179137 76747 -232297 -22277 163337 132721 320625
19715 320625 -417902 -28146 119437 -130451 -25374 -153617 -84773 -410398 -238750 -71688
19704 -20628 270802 76128 113674 468783 95095 35366 130909 115108 320445 353080 275420
19693 275420 -104200 -126879 372616 165594 133912 91341 243151 -61379 -13053 -46738 -217537
19682 -217537 -230265 -80122 -169531 -312357 61066 150299 -131052 -119020 -25720 -288868 23666
19670 30380 154430 -169640 -235486 -44698 -301892 -72244 148995 -89501 -261028 57644 315443
19659 315443 -225923 -169806 -74752 67071 -20740 -48918 -47401 -162136 53495 -211408 -146080
19648 -146080 141816 -73616 -510489 -87257 -387399 -114562 -105839 -357377 -59857 -6606 -28121
19637 -28121 -173619 -109333 -155137 146958 -97171 -289073 -33017 31157 70110 -85240 -323828
19626 -323828 -109518 156227 110133 -1357 -257391 -150425 63362 -324052 216409 194185
19616 194185 -244840 -212774 -155805 -120439 -49958 28969 -321519 -179498 -195127 -281115 -422453
19605 -422453 -155183 -158266 -150779 -95108 -216215 -270158 -104169 -20447 -48559 -382705 -3397
19593 -224687 -18051 -10324 -243146 182927 143150 45038 -214402 -49198 -141518 -233610 -104596
19581 -361267 140835 235496 -227618 43711 240197 13427 -88428 100772 228324 -45056
19570 -7221 75921 -74452 -135886 -242019 -244945 398328 -396384 -87497 -520 -341749 -92182 -154736
19558 -154736 172717 207628 150503 371 -237187 69751 -322593 359892 -103980 -152033 -169321
19547 -169321 -413156 -354548 92563 199348 -7434 -9950 127140 -147948 -401169 -182557 -10568
19535 -210088 -250363 -148021 -102345 -141928 -96314 244829 -357341 -30803 164532 -136435
19524 -1386 -80249 -150887 -251966 114200 -270022 -35536 -339070 148420 -112513 -382323
19514 -382323 257468 -280922 -204540 -1747 -52657 -52095 -80297 -303999 33021 -143495 -170303
19503 -170303 -194117 -37680 171148 -231826 161815 -87753 67833 -337665 -235154 -42621
19492 -168250 -115091 4788 -200186 -407585 44160 151014 217528 114874 42723 -99773 147656
19480 -418986 12142 -164882 -16553 -27177 117481 -88552 101148 48377 -265324 -43722 38971
19468 -330965 -168996 -480054 -86376 217665 -104003 -95819 -169201 -80390 -66001 261695 289021
19457 289021 8120 -449317 -290731 197810 -105904 274392 135472 -101323 11628 -7230
19446 73976 -222250 90476 30335 -44087 -67024 105519 -183281 76471 46681 100712 -287989
19434 -32509 10166 144896 -68928 -248415 89622 -102768 -209804 -327420 279879 -8271 108541
19422 218667 381693 45999 -80410 134975 -20187 -248752 19594 -264395 -35550 86466 -333006
19410 114067 84717 130211 175618 -35814 -257081 -100691 58307 -142156 -112932 -157087 -60484
19398 -433972 217828 15425 -89153 -156010 -313946 -5475 -81552 -222694 81388 -143825 19510
19386 -218546 -318371 -457022 -4527 -25698 -189146 -120381 -51384 -277258 239265 -34050 301946
19374 231104 93993 -7552 107453 -16756 -297741 -492968 -172766 562964 216366 -269240
19363 -50041 108795 58657 -182940 7058 85600 38975 -240363 -104710 -306081 -113916 -292714
19352 -292714 100064 91084 -202975 -99499 -199387 -220565 -207987 -126082 -235425 -91236 -433091
19341 -433091 -42735 -125741 -200925 -26940 -411997 -384306 -362 120474 316236 -246473 -218041
19330 -218041 -189387 -246374 -198029 121655 -94023 129893 28853 -155418 -88571 -326115 14051
19318 226184 -68487 122543 151217 -115746 -90528 -88033 -119447 -13601 -38345 -126583 29299
19306 -166403 237206 -13542 -15386 -228315 -113669 -440262 -343176 195633 25589 82109 -444181
19294 11923 -327627 48128 -118862 -159467 -36527 174427 -141025 95716 -106216 -161242 -167264
19283 -167264 -92789 -79065 -112900 -188987 -159100 143623 23728 6680 -115490 105829 -245884
19271 7582 126641 -166357 41355 -118250 -2288 -142692 -258768 -86759 -169812 4758 -77123
19259 -46472 29561 102318 -94075 -134226 -285411 -446616 219687 142536 -91676 -249274 -2550
19247 -61890 265079 -203156 -16078 -185819 -149847 -73631 166117 183155 -83282 12557 -113233
19235 323678 -262241 68483 -237723 -67329 22555 -459897 -26466 298729 -303047 -229921
19225 -229921 -200034 212058 16365 -128771 -495368 172761 155072 -253777 72404 1862 -99522
19213 -150966 -85021 -375765 -339085 -171579 -249558 -143610 -191024 75801 -166561 154664
19202 -190762 -172884 65779 -335272 -227530 -93842 -244329 -4141 -295844 -40204 -302689 26803
19190 -19360 18636 -132633 -308827 -66976 230240 76909 -148987 -199959 -232912 -128514 -124395
19179 -124395 -2332 -76817 -68676 -44062 -107697 -403404 204235 -188604 -76659 -291547 -46281
19167 -27086 46998 -353534 121842 -49676 33039 99693 -145714 292401 22603 52994 13198
19155 229325 -80244 -88667 1692 -102039 15455 -122733 18803 -79789 -158064 438758 -16902
19143 -254200 -320882 89840 -202876 200569 -35297 12261 100450 -124899 -204992 -258989 69321
19131 23770 48344 -51731 -561998 -34898 -163259 -326177 109428 109333 20028 6094 -376760
19119 42147 42135 -8730 -28887 231962 265188 -163253 -87047 38122 -84734 -7556 -333947 -228288
19107 -228288 -377400 -68611 183063 74502 117249 48117 -241062 -118167 -137931 8531 381930
19096 381930 -58386 346355 72678 82263 -54144 -197783 -919 -206221 -249586 167554 -68683
19084 -201982 57075 -149917 205099 90324 -473005 35480 4053 -76419 -194730 237614 -141488
19072 36560 -86534 -166977 -87558 -121649 -18779 -331486 -44533 -104592 -319462 -67000 -32663
19060 98850 110552 -206521 -275435 -303718 152337 -94707 52558 -176592 -130143 -365617 178109
19048 -234185 16307 -85936 -11550 72212 -156841 3246 -188063 -136600 -110601 87169 -403653
19036 -56530 14720 -100043 -198203 -8456 -32650 -138134 -251480 149291 -73125 -61396 -35198
19025 -35198 203134 -264764 209356 192845 161686 -71543 348466 126783 16215 -82313 312909
19013 90327 82957 -398507 -198498 -12221 122160 -190969 63652 -20324 -28244 -473742 234285
19001 10828 47410 -227457 -23501 -216250 31097 47190 -143417 -42972 -1345 -248841 63718
18989 -195218 -81374 272000 42824 77311 -30056 -157041 105258 -25982 -201627 234776
18978 -448783 189723 13281 211214 136845 -200818 32806 456633 298696 571433 499844
18968 499844 46967 -325418 -51359 232162 -172905 -66604 -47772 -18290 77847 -34393 114516
18956 -155402 -221752 41572 163903 -268906 63412 -51340 108312 -22910 15216 286141 -319790
18944 66755 -318925 141926 -187385 -211374 -34115 328569 40540 14716 -108611 49756 -235956
18932 -86705 176634 -127666 -3283 81286 -69105 -87277 -90151 56132 181356 73628 158491
18921 158491 -65765 41189 137695 -159723 28748 -1199 164557 29634 -6051 -102181 237917
18909 -89295 -18615 101948 736939 178117 47579 -78428 68770 -233998 -337005 -293731 142241
18897 -121005 172915 -84437 -147350 39390 -252468 -316419 49395 -354365 121736 -132848
18886 -145366 -141828 -69896 48317 -193048 -83886 -160596 -270988 -309556 3530 26658 346158
18875 346158 -302639 117160 -162391 -193731 45435 46943 -62622 -52967 -302288 -96446 517078
18863 -162348 181273 -272069 153809 -98894 -94181 -221597 -164341 290180 88621 -131885
18852 141201 69429 -142367 68915 -311475 135597 39260 257550 6351 -179480 -255646 152567
18840 -82647 -231907 152617 70303 -474637 -391295 209929 -16150 -254648 -8205 -227405 -148800
18829 -148800 51809 -40584 -99271 -176156 155164 -86305 -19444 120383 87762 -245749 4071
18817 -69132 -85835 162686 46857 198918 248509 321847 119228 234202 29179 276579 -58256
18805 102638 -70117 236595 72125 -26809 -193426 17395 -509130 81224 434872 -260348
18794 -101902 -171234 -97920 -98940 118412 135500 1273 245132 33431 432155 100492 394546
18783 394546 -470475 -64401 -38901 -26094 -89491 -187952 -56523 1795 37559 219292 -278866
18771 -96262 208622 -117508 -7515 -101585 137862 -122963 4134 -238294 -262985 -204619 -64557
18759 48675 -247772 -258659 -190855 -79491 93855 -151915 -205975 -62943 -372320 10663 -288470
18747 -189782 24521 60049 252583 -194278 -167861 -361318 148108 76740 -81809 258790
18736 71800 111714 -172709 -91170 -76154 205952 52909 -50467 72943 122341 -572296 -235164
18724 174090 101163 107427 -440199 17160 -245122 -123593 -305206 -436599 -437715 56763 216844
18713 216844 253559 147077 -179941 189367 53047 -295739 117351 -218407 19648 222708
18703 222708 -21927 34308 -79480 -95294 -40512 148367 -238593 -156274 104985 -101521 -48594
18691 -278924 -188688 51753 -69579 -82814 -277680 -436952 -190096 -222286 139691 -209063
18680 249289 -438893 -435823 96546 422 45258 -125502 238297 66840 -190562 -600514 -180040
18668 -81730 -13149 10899 -240640 5489 -211452 -328185 -41323 113530 126427 161738 -24232
18656 -92418 -146112 287381 139699 205297 -84523 -150254 -172865 198540 21894 42031 250702
18645 250702 123436 60642 -269078 -145692 -68246 35747 -94480 -31103 -104328 -87336 -182758
18634 -182758 -438551 -59541 153492 -174267 194621 -107967 -215595 25208 55589 -178280
18623 -30690 -280024 -137804 -82760 -70870 -223235 58404 -185913 -216467 109861 -117118
18612 109489 -285127 -24490 98321 8056 -488802 32332 242596 -413443 -187489 89339 31673
18600 119454 217961 -300032 49904 -284621 -157705 7993 -273991 70811 -152797 -104045 -206216
18589 -206216 -179110 -55735 134241 -94937 -2630 54473 -41516 -12558 257001 -305915 -23840
18577 92717 -142167 192756 -114354 233500 -21908 -347267 -104266 -356500 115373 76809
18567 76809 121522 -181375 -28006 78826 -229736 -142986 -332201 -271032 -24195 187209 -112929
18555 40586 -151507 -171045 -173303 -99806 90464 -58690 -58104 -112591 168540 -22316 182715 -78351
18542 49665 -87875 56756 69312 -345 -10181 -167035 -125431 -179703 -131308 20137 153958 84010
18530 84010 37374 -166357 -216724 -9428 -1846 241881 331528 90436 -206055 -264595 235602
18518 294584 -47302 -283954 -248679 -136769 -349140 41505 411576 251417 -59554 -183204
18508 -183204 96038 -33025 -92833 25466 -109839 -193103 33667 155506 -195546 91148 75933
18497 75933 161070 -232181 -10286 -98288 284434 51245 243642 27601 -63019 -97199 258374
18485 195663 77845 7039 44798 -200571 -498393 -108243 91607 197629 -105854 -191770 -133905
18474 -133905 224988 -27009 -269544 -276960 39710 63771 48183 102936 -178360 -51866 117340
18462 -71475 177191 21802 -109919 -4061 61195 -28079 -337826 -178172 215179 -191507 -329309
18451 -329309 -236422 -241057 -75433 56131 78033 -130953 70085 -485494 26450 -258453 -38882
18439 -80654 73499 -125474 302385 37075 -265072 129443 143388 35097 38043 -83468 74126
18427 34629 6183 -139328 -237104 -138831 -17657 -274645 -48641 90405 -50586 -163698 -73730
18415 -113988 -220850 -302537 80642 -43841 64316 284083 150954 62551 -182411 -114965 -21279
18403 36152 -112735 368 118242 96103 -104714 58621 109798 -184162 18281 -10424 211256
18391 37479 -52102 193519 -95872 152988 -9170 215842 131687 209975 -217237 94226 -66019
18379 -106787 -181918 -13459 -229832 -124814 -220101 -64185 -55761 -62497 31224 -53816 -51913 -178511
18367 -178511 5531 246051 -46878 -238380 -175267 -138698 -117733 167722 302926 156584 96660
18356 96660 35637 -80929 114329 373316 110347 -67401 173196 -250978 -135652 -139255 -328740
18345 -328740 136031 140390 -140433 -56148 62977 -158050 40144 70478 31321 -391864 60242
18333 41751 282874 188691 -69002 -100006 -45330 188016 55234 110112 -61028 140227 -55571
18321 -359915 -55465 -218892 -451587 -250654 -43333 -192918 17938 -24516 90552 -71302 -240634
18310 -240634 -65188 -233171 100788 -8231 241393 11908 -128117 234235 142073 44299 -242424
18298 37089 243201 -97538 -298398 2697 -163858 173634 301402 100216 77080 238727
18288 238727 -145908 -23534 35872 225254 -33213 -265192 -75415 -314040 146676 -323152
18277 -134942 241500 -102215 -323292 -321532 -68716 -113165 158022 242579 -139475 156085
18266 -147110 394217 -197442 159066 -97403 -173272 -189324 66852 -43888 83500 -225159 -31959
18254 -285184 -298870 -142285 -232308 -307618 -57301 -200437 -18436 -102564 142 -17201 -110787
18243 -110787 -288380 85262 -189498 335224 94947 -108069 83417 -81922 51251 -110136
18232 22146 -54536 -89930 22755 -174268 198203 -79335 314113 -391308 140506 -12586 160556
18220 170257 -43120 136515 -95748 -126506 -104247 -55296 103196 -27357 -97802 -79417 -119961
18209 -119961 216857 -171830 128399 209733 117821 122818 12714 -261925 -360955 -17083 68710
18197 -75522 206503 16835 76302 256896 -144377 121360 87970 -204653 -136598 -54745 129454
18185 -48508 50376 -127406 -236065 138386 154995 -79234 226375 48817 249740 58065 -172136
18173 27355 350799 203905 -264693 -121430 74699 5124 -91924 -128345 -140748 -103797 44214
18161 -40025 -42318 188461 51334 -180773 -359221 -239430 -196534 -290030 -227338 103073 -46380
18149 -159765 121366 -228867 -26192 -113788 -307785 29216 -82450 -180104 -8974 -23577 210813
18137 377659 -67204 317316 105105 -245777 -155930 333588 -30301 36390 44688 86880 -268353
18125 -34756 -100984 77828 179211 165334 83432 33919 187357 290192 183979 -86349 -168994
18114 -168994 -96270 -241820 343268 27220 -424284 -304482 6766 175435 -371575 240724
18103 -274810 73157 133367 -284332 169966 -287787 48750 196070 114613 -66277 -358729
18093 -358729 -56894 -54744 168248 -240931 -130112 -266900 23065 -184153 24424 -229553
18082 218029 233556 -288418 -35581 -8460 -142679 172066 -36224 85680 305861 -279459 -60889
18070 -125367 -51941 5366 64921 -32017 224282 -40970 -141466 14789 340386 -27888 -88115
18059 -88115 39760 -174502 -62714 22886 -21828 -479167 -2589 389155 49419 39567 -92196
18047 -170316 35603 -131511 -119330 1761 -340549 -57035 64748 -61322 -33941 158747 -380871
18035 271497 -244140 191126 10341 282465 84167 243345 60684 -86074 98955 -193209
18024 194142 -93951 -97292 177799 -42365 75374 216025 -15699 -297784 181599 248983 161980
18013 161980 49195 280278 -191626 -172347 -177328 -209844 86012 38944 155265 -340922 143113
18001 6152 166530 25253 -98599 283407 -229350 255900 -21407 -82671 207644 -249480 43920
17989 -299272 81813 -231925 51750 -84998 -106444 -152528 285310 -64825 -110215 99750 290072
17978 290072 -20484 -90018 -30525 1360 210285 100349 69764 155278 -77137 37311 2823
17966 -52602 -74544 -13434 -154109 20827 -199489 181425 51785 -72187 -47040 178952 15872
17954 33764 63815 -345080 -188761 -390840 -40783 -184281 376411 175562 81042 190885
17944 190885 429420 -68160 38908 269574 -247420 34454 -197905 147712 -24822 376100
17933 124859 161337 326683 -175284 250546 -69879 -19088 -63181 14828 46829 356552 39903
17921 150079 191794 -38056 115301 41421 -114232 -9712 68626 101495 154842 -15586 2828
17909 64195 3835 -83776 -9594 4941 80991 -28056 19614 218174 224604 126495 -385326 206266
17896 -135970 -40219 -65607 -11976 -153284 157592 -36691 142142 55731 -294093 197537
17885 -26951 264202 -37450 223340 129829 69826 139759 -51563 -219798 -50731 -454429 -157469
17873 -99654 37769 73431 -142669 49718 181949 279467 -13300 -153672 148791 92791 53082
17862 53082 210077 -88523 -202866 129725 -43341 -143363 -7663 -144656 -65488 244417 438366
17851 438366 228401 -252932 52163 -98463 95801 281352 373847 38817 -56775 -318263 76159
17839 144048 -86185 116736 3034 251392 1046 -124970 -114079 88916 10433 322633 -11274
17827 70725 197188 -64707 238669 -20615 -28355 158062 131604 73838 26581 112642 34940
17815 44043 334593 61330 -256304 -74245 -287580 311393 87207 -61380 230116 105108
17804 164100 345201 51527 168561 -14875 -112377 369773 283001 164429 -65334 -39746 168122
17792 -153334 -71057 -61900 -138759 -15996 77403 -212504 -61616 -157491 125649 153445 -18097
17780 42536 380230 59154 -115107 -150677 110316 69842 -182183 165134 -97040 -109561 -72631
17769 -72631 -86368 160505 162857 -140100 -253539 78523 93198 -4870 309103 67087 -149341
17757 303491 -100774 -171388 -261486 56740 98899 165008 179872 260110 30236 45705 270632
17746 270632 70882 -25394 -141793 79290 8784 63565 382739 13430 113656 181085 -275992
17734 -130331 -34113 77709 55370 373475 184746 266176 73303 -467733 100727 -95241 145997
17722 378534 12408 91764 -24814 -150061 -58676 195167 -175436 87809 -211632 -60619 231385
17710 183886 12667 -118773 428197 42723 59927 254621 421711 197666 237871 409486
17700 409486 84802 114127 -112352 21647 -179363 196502 -14618 -103211 -40734 221719 110705
17688 36553 115361 12274 97081 280883 -364039 48454 90863 -155982 -64552 586549 -87783
17676 90233 -28977 -4133 201606 -41734 -129485 147818 -63201 36556 -61035 428262 38204
17664 78684 -148184 94726 -14972 288584 121713 -99606 87160 124081 13088 361676 141099
17652 252488 383217 370787 90795 -55318 -302065 35225 51556 94674 387840 92849 209606
17641 209606 -4529 -39257 197622 227102 248885 326742 192582 376722 177649 -3070 200522
17629 130590 516783 106680 77700 165485 -39256 185267 370236 -17701 219123 52575
17618 -203439 9878 13902 -82170 26190 -54278 276492 254884 16101 -22620 171900 19245
17606 -85939 -143517 -68708 60830 -93823 155740 -147509 234804 122459 144397 -139524 421036
17594 248056 71123 89334 58365 171168 263016 210767 50106 75730 -35220 360203 138241
17582 -229962 388778 -11118 70340 71437 163957 -35947 315923 356690 365120 416899 -183960
17570 111797 76022 -22842 200919 -179527 96454 31416 373746 256475 -52686 73668 279185
17559 279185 218905 338860 358568 -318283 -166348 178464 204683 213123 181441 260366 162249
17548 162249 200478 160464 125872 24230 227040 323842 187802 210862 299090 414682 242137
17537 242137 295856 71410 -123974 113113 234308 59917 6534 196980 538513 588365 708846
17526 708846 706878 967826 1139894 697708 769438 503461 567398 562226 135579 376623 395912
17515 395912 411389 215800 432651 558472 1002561 970609 1050713 1135557 1187985 989050
17505 989050 801835 654815 416594 733003 339838 291565 79224 445466 267963 453982
17495 453982 153683 218356 166496 453356 168479 276064 46083 153055 269505 434076
17485 434076 732370 374371 326881 177587 298165 433907 239693 273871 578321 172265
17474 202783 229171 224945 28925 409262 37801 310756 24969 202728 187995 242262 360628
17463 360628 147681 176154 118887 213477 548696 91866 520091 333130 262799 338770 313540
17452 313540 545587 326274 100621 168721 130148 107240 382569 364994 132733 465369
17442 465369 207570 218317 260080 518594 298953 167629 430385 250812 548131 249749
17431 210321 297718 400861 187696 340296 4940 320238 40814 179433 324083 87127
17420 83519 402046 667916 398466 403172 398382 350487 619432 413256 348351 395798 176559
17408 488822 446996 88826 378619 247363 623739 260433 88211 233825 156873 149228 110393
17397 110393 98118 349144 -170380 241294 419152 182856 -103287 167893 26701 341851
17387 341851 -30984 284662 714041 471653 283926 164892 260941 373791 206308 262575
17377 262575 -45260 19468 328402 379587 149845 389378 381044 -211443 429467 144488
17366 495361 533726 84787 103609 -192846 352695 455932 165772 216513 66951 240696
17356 240696 169917 383698 91000 247704 278829 230351 -3319 253193 184306 -73927 288500
17344 -112555 608558 -58514 104409 467644 244457 98730 184146 340883 345375 384390 195577
17333 195577 275991 252753 -36457 308255 227516 595807 173871 38291 86329 -34561 280679
17321 340517 335022 310641 359226 165479 448865 -17747 163959 543510 218517 172860 259646
17310 259646 408954 390961 77749 177502 451702 374789 426113 336765 189868 151470 120599
17299 120599 183722 415620 280175 360649 286284 358249 135757 371694 306297 -71905 405209
17287 276041 452526 505187 416688 306994 13337 353433 49026 237654 151788 129168 97175
17276 97175 284525 353504 368181 647828 476033 436608 463968 164796 246544 459478 578005
17265 578005 285493 388909 417115 329937 329038 113072 375967 363569 403144 293952 624325
17254 624325 343426 468128 319084 98483 362830 328685 348477 597690 335888 527800
17244 527800 392726 181374 172778 521867 281253 191442 308296 291167 564796 479111
17234 479111 657729 301406 327359 228237 337035 421517 289274 295085 299167 355856 189240
17223 189240 244004 192000 461434 318909 232428 176254 539854 579082 451612 155370
17212 325169 251268 51649 341911 602379 -43035 552601 310295 472458 321059 342586
17202 342586 329906 280459 346238 401498 390912 399628 507078 265983 623013 335389 42709
17190 587525 546668 275611 594852 169679 240401 624083 643735 603553 576445 521920 424391
17179 424391 318800 323840 587038 150637 513200 297081 668343 384998 598416 499589
17169 499589 467468 628075 340295 657233 407869 494351 470237 307284 752689 451137
17159 451137 528361 601327 496238 564322 435455 353083 751085 883834 166357 344953
17149 344953 553036 505917 905255 492398 527701 710608 871854 593223 648456 560000
17139 560000 606716 552196 599080 402804 379097 729062 436964 306477 821918 648464
17129 648464 719224 412070 658676 827550 64492 771903 883360 824668 354252 703353
17119 703353 368369 692674 581426 675341 535735 443869 409539 504908 669022 627536
17109 627536 231609 348208 763097 701156 657338 334298 1005613 679059 552387 546090
17099 546090 671189 370058 773501 939817 405686 550985 499556 330289 641125 1174314
17089 1174314 324332 888039 922898 777503 839664 871780 849623 646765 866783 654365
17079 654365 425575 886596 566382 704731 870405 816220 706729 894347 788397 340072
17068 890606 843346 568858 707966 926410 500758 709585 873771 561542 637507 1025313
17058 1025313 917662 666491 965769 935274 925961 830076 937809 798177 770367 694898
17048 694898 586399 875335 788967 836852 1037431 1003234 696639 728384 895641 976955
17038 976955 1007283 864329 894341 1084238 1194900 1191378 840409 1066404 957515 490741
17028 490741 793319 570596 955786 960369 799625 829881 826222 740794 1008465 1206551 1296527
17017 1296527 1166689 993483 976972 1118941 1072636 1190652 931953 1119783 974301 1269041
17007 1269041 1263711 1059528 994520 1215583 1126019 1164554 1348643 1296911 1139169 1553431
16997 1553431 1429028 1337019 1407568 1421178 1112104 1344852 1306626 1501217 1318314 1316908
16987 1316908 1366233 1168931 1380556 1197000 1454756 1325824 972772 1510277 1670721 1528165
16977 1528165 1623622 1601791 1210159 1377604 1623168 1495241 1525177 1589822 1344415 1434264
16967 1434264 1592209 1412348 1807701 1500697 1450131 1145913 2089173 1648448 1902248 1417017
16957 1417017 1842029 1586591 1811877 1727983 1726989 1503407 2015414 1318657 1690812 1771181
16947 1771181 2073454 1736866 1695184 2227449 1858892 2017046 2069759 1707887 1892404 1929087
16937 1929087 1820158 1875490 2127446 2140659 2020731 1812846 1799837 1972558 2243815 2120576
16927 2120576 2228234 2131932 2388200 2266103 2108305 2169392 2305585 2303191 2047772 2201706
16917 2201706 2392714 2488892 2757943 2421949 2526606 2266326 2714791 2426677 2257415 2789886
16907 2789886 2723059 2564011 3123044 2796290 2557072 3128278 2742119 2843000 3112377 3012617
16897 3012617 2841573 2839587 3128510 3315718 3023419 3189654 3340760 3134205 3476041 3383587
16887 3383587 3318357 3247279 3256300 3253337 3120609 3486371 3688529 3523530 3721533 3491682
16877 3491682 3822046 3591066 3927578 3774251 3599498 4104965 4266133 4115711 4185217 4188518
16867 4188518 4292492 4397117 4365160 4148134 4437002 4731679 4695329 4691021 4967463 4435970
16857 4435970 5170387 4824429 4856576 5299585 5084835 5396554 5236588 5312211 5626091 5686591
16847 5686591 5566166 5933504 5818876 5846324 5949212 6184496 5926458 6069182 6275263 6328060
16837 6328060 6670008 6619433 6596148 6810644 7133165 7048457 7043511 7499112 7663806 7570348
16827 7570348 7576752 7827864 7929859 8255656 8117744 8572740 8571652 8881567 8736452 8928689
16817 8928689 8834357 9031038 9583399 9583437 9998637 9940234 10578786 10638827 10717806 10864005 11398688
16806 11398688 11287416 11282668 12095347 11998724 12409137 12614832 12921844 13438074 13513341 13686486
16796 13686486 14055044 14470407 14664812 15075299 15439158 16263656 16322016 17038671 17186739
16787 17186739 17742241 17979164 18089814 19055313 19462365 19951444 20729608 21091973 21846881
16778 21846881 22272180 22681262 23599646 24435030 24995865 25668610 26748032 27135713 28036963
16769 28036963 28880281 29747652 30677284 31641042 32507813 33817970 34998637 36282746 37091724
16760 37091724 38506223 39797109 41292460 42721954 44130068 45372277 47349074 48940876
16752 48940876 50909032 52233221 54524929 56081171 58390038 60595228 62926042 64862109
16744 64862109 67184647 69736091 72171514 75002059 77605803 80498113 82788473 85509233
16736 85509233 88542671 91265738 93801003 96985314 99753453 101859053 104800449 107395694
16728 107395694 109353101 111400559 113686336 115477802 116637965 118041919 119105175 119952064
16720 119952064 120493044 120519818 119785966 119491978 118511370 117449763 116027996 114392810 112224952
16711 112224952 110339092 107935267 105477185 102627173 100227821 97386296 94698045 91592419
16703 91592419 88842767 85970919 83159591 80317152 77546667 74867575 72435471 69189986
16695 69189986 67049067 64596641 62352111 59877490 57581367 55662527 54039235 51609055
16687 51609055 49844865 48348662 46462789 44829666 43014739 41632979 40178526 38841629
16679 38841629 37646522 36185285 35164844 33655327 32918969 31712814 30630721 29752621
16671 29752621 28929006 27792252 27075846 25951854 25300027 24615226 23786858 23168196 22403658
16662 22403658 22177124 21352295 20757661 20070416 19588953 18683677 18337177 18133255 17595131
16653 17595131 17262246 16249873 15900434 15889497 15199124 14973326 14585752 14499041 13924964
16644 13924964 13913794 13280631 13051993 12384923 12742422 12459310 11884171 11587471 11398906
16635 11398906 11047542 11079148 10496857 10330134 10020071 10151146 9876831 9430045 9156283
16626 9156283 9073691 9193493 8806739 8791929 8741165 8502021 8469743 8156783 7489717 7659213
16616 7659213 7669916 7358578 7207012 7318343 7069589 6975131 6847606 6668252 6652392 6261293
16606 6261293 6350774 6517364 5897835 6114173 6539170 5988940 5895481 5702174 5894644 5472784
16596 5472784 5539900 5412579 5439471 5066698 4690199 4921796 4909347 4760841 4813092 4667815
16586 4667815 4498323 4417706 4777253 4454864 4590357 4442443 4609559 4065429 4037548 3655044
16576 3655044 3894858 4014154 3850911 4103522 3890196 3736138 3592767 3571593 3313933 3743984
16566 3743984 3679657 3484872 3020692 3285491 3241127 2916253 3566329 3310544 2988224 3264330
16556 3264330 3207092 3278492 3111044 3048144 2772359 2939223 2947815 2839858 2843449 2815753 2533687
16545 2533687 2874406 2865135 2444168 2855097 2733221 2674233 2541625 2509988 2414724 2247926
16535 2247926 2586160 2520181 2209518 2519160 2505865 2531197 2424257 2171712 2168531 2165653 2298373
16524 2298373 2503673 2161935 2371336 1971736 2346073 2367679 1967040 2224390 1986377 1974457
16514 1974457 2108553 1992812 1872561 1925819 1742856 1695434 1982284 1722948 2083135 1795404
16504 1795404 1950853 1814164 1664070 1694404 1680598 1534304 1639408 1694898 1488148 1359819
16494 1359819 1557596 1643140 1607166 1630478 1646238 1634917 1596541 1435213 1522733 1753184 1470830
16483 1470830 1600052 1718105 1713659 1413145 1184734 1363027 1480269 1419325 1298556 1374855
16473 1374855 800526 1335482 1309324 1389712 1466292 1212525 1154734 1078936 897611 1206527
16463 1206527 1108298 1495731 1448395 1073070 1178912 1043843 1174485 1149250 1234482 1196476
16453 1196476 1299968 1001715 1288262 1107433 1111985 949167 1204044 1275379 1165951 1378316
16443 1378316 925584 1100809 627891 952225 970844 767838 1180099 1420506 985938 825604
16433 825604 1279108 863586 904032 972736 923913 945936 676130 1066468 980972 984065 836705
16422 836705 917363 1106190 1115324 720195 858155 1104654 1170347 1057626 1010925 1301399
16412 1301399 881109 598138 836693 564828 877905 926139 661085 776060 740837 1047254
16402 1047254 1150076 395232 941491 982929 565404 979767 735398 852855 749541 654719
16392 654719 980175 612347 555630 767878 996995 895551 784656 729922 907829 982556
16382 982556 712698 502634 820553 906516 802590 684753 732973 664711 829319 907983
16372 907983 531076 586960 709602 569564 766001 625105 673366 573008 811959 719041
16362 719041 740686 638273 854820 413122 830073 632355 629463 576994 538504 641425
16352 641425 513610 257094 559184 391697 544633 612665 614738 368420 565994 469629
16342 469629 75585 663447 798671 465695 609742 342245 446614 504844 445903 337045
16332 337045 334320 539355 566004 695696 507938 576534 643739 247915 715069 421133
16322 421133 133883 684784 502851 668947 636049 138488 490160 158536 491424 648424
16312 648424 109687 405718 350015 356196 60456 559373 348934 379185 469389 256676 441467
16301 441467 162454 585825 190439 -44134 628779 123014 338476 95507 284469 600986
16291 600986 266977 142708 398480 456243 532412 230479 153916 455451 351256 437047
16281 437047 342615 647344 359453 686801 321334 238596 271589 439257 404135 105196
16270 448011 436051 270663 427704 396161 476557 427810 378462 346857 282014 102166 308770
16259 308770 194679 72733 456998 261736 296660 582621 222282 410625 242053 302082
16249 302082 262869 298665 62140 285591 384980 345236 92376 550987 391594 474483 365264
16238 365264 642359 222109 762115 368493 176891 290242 359022 183807 224142 464109
16228 464109 267526 460709 297143 198844 282557 563370 241484 590015 462249 519945
16218 519945 509728 455640 364793 416163 36886 253702 283192 187435 339437 175972 194232
16207 194232 299720 -30664 34406 -21561 198226 291726 -57494 -34185 306030 47699 277889
16196 277889 181290 302682 269612 -25852 293725 325472 377976 108171 -124232 176515
16185 113552 253669 48766 454925 -85183 183806 328182 391298 610319 111831 162588
16175 162588 -75363 345785 138958 56644 -181125 431689 126591 -144987 201145 498425
16165 498425 65022 284548 408670 183783 359838 243487 53293 130454 233982 114795
16154 180066 140542 400391 203273 95364 248828 158699 149832 48165 280094 206079 74936
16142 -116953 -22415 -10626 -40042 280056 -23817 384225 -180854 -234690 35007 -155657 320617
16130 67744 313398 360234 352482 -59569 -149463 353343 -49047 -94061 -67957 -106339 225490
16118 241903 90879 119201 -36421 373926 265969 648988 282100 368765 -49327 -19919 -439489
16107 -439489 55003 -84618 -39275 -257036 188251 -96959 264473 -112595 105878 311476
16097 311476 283325 -51974 -3786 260084 154091 288645 125712 125249 300754 120925 159365
16086 159365 266452 67765 102833 237785 -309679 -16058 284571 335036 -181261 -33148
16075 178380 116376 -57307 -80760 -322977 137010 46029 36923 -67671 -126522 210243 -45388
16063 -548 80471 174648 25034 18660 222991 356040 39192 326230 -21627 219331 135389
16052 135389 316073 -108331 -83421 226124 321954 111209 -23825 -137163 167366 -74523
16041 346985 -44928 -233873 -215447 154901 225586 54170 125114 206641 40932 66060 154652
16030 154652 155511 91406 -64914 91299 -249245 261769 170962 138176 330277 -130045 -141435
16019 -141435 122440 184621 48408 16050 7578 30204 233783 40354 -154670 8834 76687
16008 76687 26280 -105121 286510 92230 -362823 -301686 145315 -133549 -366305 348619
15997 -115812 75876 -249400 369503 361066 83925 188348 -6288 336406 572712 124487 146583
15986 146583 490298 1273493 1083766 1265745 864561 681326 378125 171050 326346 229895
15976 229895 54351 542678 -8723 -104729 -51386 330768 -195398 -46998 165031 -57091 -13411
15964 202742 100193 -293247 58956 208629 -37939 -154141 85145 23698 123862 -56330
15953 -228514 560109 125360 68244 -63201 93485 214522 160986 98831 -373665 -40041 85559
15941 -2084 266211 47807 46188 -238024 -223220 124930 -37090 158165 -344264 54085 -235973
15929 75072 -62502 35174 188289 21991 16258 11655 -96977 -57685 -4881 54360 -166109 67188
15916 -53298 -156986 136325 -41970 222347 118462 -147370 65780 102529 -101714 165626
15905 -147405 -57261 329623 -188564 53703 -67316 628 -316593 37242 -69946 33920 452726
15894 452726 12624 -243690 -73943 84417 65540 253885 101864 301948 -95098 -92781 -253348
15883 -253348 -104365 102951 -17125 191178 -132091 -274259 -131484 2608 -58030 -465333
15873 -465333 -380777 -189266 -326149 -127860 318593 70928 167991 -111012 -24353 -396884
15863 -396884 130818 -201550 -176177 32232 -285618 -23792 45505 -81824 -73796 -58973 -48717
15852 -48717 -1113 24005 179754 312950 -160849 142028 -214709 64167 54843 65063 173616
15841 173616 -2441 -269873 -224020 80932 -54660 144390 158190 179794 497358 -323011 -13615
15829 -289756 377346 -93476 -1053 -75831 142319 82712 -138599 151621 202915 143317 94122
15818 94122 -60066 186061 -256105 196125 -185969 -200845 26062 -221156 291360 -42330
15807 135806 1235 87429 70539 11039 56210 258323 -59690 258621 -19620 45346 33251
15796 33251 -9257 46294 -251262 -29989 -150733 -83110 228270 25553 77194 -88362 -117316
15785 -117316 -112985 110538 114574 -100108 -85199 -169392 60473 178669 -274644 -226014 176852
15773 16789 -421397 -134343 -35277 57117 -293104 194453 -161084 172089 17985 -79674
15762 -2747 199730 98063 12581 104762 102786 144663 -99197 150488 123915 197621 -128081
15750 384947 145193 37076 -186884 235334 -72467 -69793 157485 98525 -224574 151509
15739 59839 -142259 -140445 145630 -191287 22047 -14549 122464 -221053 -216290 119645 20638
15727 -48974 -54024 274738 105856 44858 -112269 -178349 61729 51002 -85586 -271888 -150797
15716 -150797 -60295 -126488 -221828 130811 -107707 -21660 91168 -370746 -254066 89132 320955
15705 320955 -10725 161371 -4614 119211 56476 -315684 -136648 26110 -345486 17686 -12651
15693 66493 476402 -7336 -150914 -3522 90488 35445 353970 64115 375369 134001 -423641
15681 -121675 -235708 133795 -129962 151527 89611 114484 -69287 -68403 -80108 -229566 -79154
15669 250231 36572 -90165 22423 -41466 32237 -241757 -41954 -249830 -13734 20056 -602454
15657 -79043 29409 -227239 268719 26364 90249 341015 193068 -307303 -119742 9686 51581
15646 51581 -189657 -145516 -313733 -400982 -265412 203708 -54566 -76385 -178741 -174244 -319083
15635 -319083 71392 -17030 -55443 -209865 -175691 141533 9801 163400 120973 113952 323054
15624 323054 -124436 38831 -422036 234997 -175560 195240 -106937 -290895 -137492 -591
15613 -88384 -77793 -266940 -59134 -161265 105733 67339 -1084 61349 147349 -75136 175300
15601 -273977 484646 -281794 -14087 -32882 -82182 -61154 -253991 -92282 -80792 239448 -137996
15589 -90909 -324148 -198889 126926 -47946 31616 117216 -171869 228320 207241 -10223 -177118
15578 -177118 1996 -228038 -3078 25451 -218878 -281436 46468 173910 17420 -81800 208269
15566 305990 10864 -228584 -24033 -325379 35981 349016 126920 234321 50408 121315
15556 121315 -219274 -174356 301206 -76927 -217377 -119725 76944 92946 168572 -87765 -139794
15545 -139794 191559 -28375 89798 130181 99640 -73791 298774 -259030 -52825 73364 182958
15534 182958 -142910 -79957 -133440 40076 153165 5148 139743 24695 198180 -150772 -24559
15522 -74966 -3770 199749 263606 162099 421602 438600 199619 455154 150646 205203 155092
15511 155092 41688 382688 518560 -1935 45511 189123 52540 206386 201182 1222 268774
15500 268774 158121 30819 352567 266543 411149 -97775 -179106 104000 -121234 85968
15489 183485 158406 -92560 172915 37188 2374 -15739 44166 185223 253536 -29091 15885
15477 -139689 134193 45145 -176956 678916 633739 578210 190487 54016 283278 26401
15466 93993 93417 -211337 52421 35174 -154203 -12376 332191 -229784 -202609 -191918 76699
15454 -95170 22332 7361 -217136 -135901 -140969 -314100 150929 47557 5058 456055 441860
15443 441860 530086 613071 893121 1248986 1303916 749705 115188 341878 266674 -205046
15432 8609 41200 -14895 -104411 56143 33658 105168 -66908 208862 213535 -51217 60043 113467
15420 113467 19794 142625 -215577 -69539 -40372 73633 -137204 -103369 109498 -530663
15409 216935 -4461 382033 62381 375904 -231805 -50097 -54483 17455 -289433 304444 188210
15398 188210 116652 -131625 -119297 145842 221561 115897 374406 273337 -253340 -189929
15388 -189929 -162750 86684 371580 -305640 -129400 -97959 100047 -304354 -15172 155071
15377 206894 -86374 37161 156811 109290 77241 18846 344705 -79912 340532 208805 93673
15365 330056 60655 471127 -62890 31843 365551 52739 123354 384359 218254 215429 501645
15354 501645 216938 217279 114245 -31002 -123508 287999 -42276 167554 290607 120973 513795
15343 513795 582666 404072 560652 39863 175272 183040 123088 -72176 423406 340969 94305
15331 220672 238001 246974 95831 316698 212506 184374 -89310 671420 168470 263434 302643
15320 302643 79960 424051 49386 205729 -102897 185826 74958 91065 231178 -118566
15309 279411 456117 286830 477116 32360 226551 -422944 228691 -117018 31706 300168
15299 300168 254727 59480 -130322 -71629 210287 89531 -296848 -233975 -56446 227258 90235
15287 -30241 -7942 362972 -12685 35343 64974 355662 -107773 -2700 -76520 219372 -49236
15275 -157082 52328 221585 213935 180036 -117807 -360448 30676 95742 344759 -49418 114599
15263 39265 -51314 159287 -139545 163137 153938 34466 -194750 329774 194799 164743 58854
15251 194361 -82605 51991 493937 -60979 -29513 238953 220139 41326 385122 738155 1518442
15240 1518442 1689429 1249459 1842529 1058106 474337 276939 306564 118440 -34404 322325
15229 44812 -154334 38806 110704 202403 34194 231422 -243017 244515 168304 231174 -149342
15217 244990 122568 79402 54941 357573 -176472 -28265 185011 -64016 -138777 2144 -256227
15205 -193096 270227 193317 1163 68813 351028 340588 -85205 12335 151612 21785 -124600
15193 -14969 -103606 242387 -109235 134352 179213 86409 197292 -115301 150101 -201863
15182 38850 258127 89806 -265884 67328 377998 98422 46173 349532 158520 -88518 -220453
15171 -220453 216132 181963 115970 64431 276167 44796 -118188 -137690 185849 328901
15161 328901 139065 92577 -436836 165413 151268 73115 242745 -229239 -228445 349471 240931
15150 240931 155660 268823 237109 -8841 -118973 -117348 248521 200131 430870 -27952 -68520
15139 -68520 100828 76535 125836 195391 -14050 80755 110696 29748 271982 153252 168323
15128 168323 96292 122568 50380 383768 253797 106410 -132620 274316 358183 476430
15118 476430 216860 615083 333550 328531 37063 69257 107092 201647 116952 -102050 -374865
15107 -374865 266521 55877 237954 -43029 -37872 -109867 15499 -87215 105562 119970 125544
15096 125544 -186299 168252 348556 285337 42319 43281 23027 125442 -215893 73478 -197820
15084 179849 -103815 -54163 336147 278017 24622 258107 192004 245255 369264 241641
15074 241641 139228 261584 160538 222141 6806 96722 254269 252711 358284 395130 427153
15063 427153 268694 126119 -3656 183258 240342 489511 2583 511500 288568 249705 257623
15052 257623 665296 231466 706638 583855 90432 371462 478046 370495 245230 318632
15042 318632 498991 346815 528683 361980 425999 231980 568811 99867 511427 352507
15032 352507 517504 481483 668907 847951 894813 633791 266456 661838 368263 541204
15022 541204 401855 100836 239555 585729 300105 224881 424095 432251 188074 517502
15012 517502 242415 -100786 523580 409478 466532 669523 764772 -137763 436519 267060
15002 267060 189140 605957 424309 452718 460595 448808 400573 205721 678838 392102 475164
14991 475164 299372 530917 231321 390216 367135 161153 452690 612114 735567 901009
14981 901009 902466 835195 1028645 698915 704761 722948 594971 690556 646991 880341 591344
14970 591344 738406 493850 616513 485171 144961 428418 729121 723570 338472 425065
14960 425065 486781 282694 280779 623125 272267 512248 594796 500235 312021 453563
14950 453563 471668 322098 466528 198183 258054 574962 127428 1089919 840914 635921
14940 635921 574738 521691 201962 681102 469689 718152 595072 713647 602615 949038
14930 949038 1278525 1152337 1392853 1680577 1345295 1767421 2195703 1719195 1467977 1488292
14920 1488292 1348047 1665946 1822767 2279357 2527711 2031680 1809902 1602033 1738688
14911 1738688 1439591 917955 804934 861384 147949 326491 776825 423583 480019 446780
14901 446780 612563 532395 415271 417956 389863 270827 346491 468508 406243 584262 450747
14890 450747 464640 764201 619260 523025 641238 729742 796002 950451 733973 870347
14880 870347 1133095 885180 707286 1183446 373777 557345 431299 354850 378069 246281
14870 246281 205385 432809 407178 647080 790145 680674 398541 790196 773214 625790
14860 625790 280530 500641 -37169 424266 376190 341788 402365 702350 144579 373538
14850 373538 526923 517043 552953 538251 349213 668977 794220 941997 1322042 908815
14840 908815 1290323 1246762 1479394 1033329 830704 668940 609936 737657 598373 804040
14830 804040 420373 590919 664530 829316 754918 634759 813123 848422 678167 465610
14820 465610 531904 600009 621998 698535 819943 1179066 875852 453400 649536 821087
14810 821087 788110 802175 663606 586385 932542 869314 1045954 1158568 729656 912142
14800 912142 861582 934129 662091 595810 745158 493950 531066 447377 545651 491962 497637
14789 497637 605141 735077 657639 676774 531214 584710 968420 1034904 736171 344681
14778 903176 708410 1044463 1165189 953236 1165273 955640 939029 646555 630426 603719
14768 603719 424865 626368 757199 572867 675576 516397 705635 560076 858560 1012611
14758 1012611 270309 431271 726843 412130 830707 367679 573641 392053 579415
14749 579415 784685 610706 803939 776920 711618 892005 792497 647805 459203 830248
14739 830248 711390 377815 898268 747208 937749 996821 920568 1169370 941582 1570508
14729 1570508 1320387 1611638 1831002 2080884 1858835 1882184 1277551 806476 1086339 826809
14719 826809 1004491 716432 782310 794721 791185 988137 993935 950471 613283 918422 834999
14708 834999 1271532 989674 520187 1025646 1368579 1511644 1611671 1861586 1852432 1963197
14698 1963197 1476941 1491962 1577746 1308377 803481 913442 1164334 1067328 670460 1337393
14688 1337393 763571 810128 1099254 865871 1253563 950081 584187 980948 1019671 982025
14678 982025 830440 1135525 881499 892799 1182386 849861 941301 1179811 995707 1157784
14668 1157784 961885 1153218 958255 1070704 841943 1011877 822885 743003 945820 869217
14658 869217 1079887 1178668 1171505 1520338 1259174 1435108 1475408 1282465 1334546 1585282
14648 1585282 1355691 1149707 1144116 1034104 1361218 1218953 866531 982084 1163884 1369108
14638 1369108 816920 1331248 1006055 1457699 1538635 1163981 1269554 1478245 1100379 1149122
14628 1149122 1189766 1192090 1325560 1595310 1281802 1604548 1199674 1455833 1463914 1112991
14618 1112991 1278357 1036381 1488725 1746672 1640743 1664866 1534072 1202233 1441256 1522824
14608 1522824 1034502 1509038 1390231 1603443 1188892 1444512 1605996 1491076 1846359
14599 1846359 1590771 1572218 1427024 1677877 1968612 1755609 1672994 1403250 1620167 1770391
14589 1770391 1680562 1779695 2005134 1957341 1699851 1957599 1751363 1914412 2230148 1953103
14579 1953103 1713126 2101251 2004834 1871754 1833229 2006963 2207872 2132266 2018104 2296288
14569 2296288 2408459 2376077 2469281 2235687 2476220 2430601 2642571 2475435 2783401 2797896
14559 2797896 2896241 2912769 3077970 3318376 2942829 3401032 3831498 4330384 4823773 6168905
14549 6168905 8271373 11691035 19145795 36349543 44133485 19878744 8445464 4312573
14541 4312573 3233725 2748587 2469472 3078947 4095393 5728560 3520588 2386915 2358299
14532 2358299 1998191 1952904 2101567 1892228 2165569 2469470 2626613 2130238 2522839 2602608
14522 2602608 2774111 2548350 2391886 2329753 2292104 2612874 2714997 2751352 2433954 2557890
14512 2557890 2735489 3009257 2717065 2900377 2900065 2698802 2453187 2853122 3174664 3188775
14502 3188775 2769976 3037842 3253640 3180089 3005868 3234670 3295547 3269184 3597017 3358910
14492 3358910 3501138 3301925 3585727 3435022 3267402 3481626 3633913 3668180 3720488 4010027
14482 4010027 3672085 4068750 3866591 3674201 4167585 4115794 3856594 4080497 4260878 4359774
14472 4359774 4184170 4502158 4333254 4416044 4125799 4554069 4647281 4854085 4566680 4412054
14462 4412054 4818294 4655941 4627685 4339526 4717732 5088281 5274245 4991480 5066831 5038549
14452 5038549 5157850 5333588 5861305 5322297 5718639 5874352 5482240 5641486 5939087
14443 5939087 6038633 5654163 5961209 6185436 6131245 6611022 6422305 6342632 6612933 6413963
14433 6413963 6564909 6551471 6818222 7146185 7106429 7278117 7388218 7042415 7752378 7849487
14423 7849487 7826389 7836843 8397027 8425481 8904910 8952434 8404771 8566466 8821712 8680739
14413 8680739 8788881 9045945 9059338 9511677 9756428 9509264 9973081 9827121 10248471 10412662
14403 10412662 10566265 10532030 10760391 10673635 10916610 10801003 11084181 11132801 11458439 11704209
14393 11704209 12242111 11881102 12404907 12278511 13158476 13196231 13593591 13457522 13385695 14114240
14383 14114240 14060146 14783127 15076650 15484309 15675553 15670745 16084990 16300369 16609656 16422153
14373 16422153 17216010 17271127 18150490 18223157 18552257 19319857 19340060 19925282 20449464 20874088
14363 20874088 21079929 21414723 21834669 22445731 22750700 23143830 23841286 24477025 24847511
14354 24847511 25227647 26399424 26704410 27310911 27969756 28885562 29285616 30154394 31026302
14345 31026302 31891914 32738296 33525257 34188045 35563069 36247015 37176975 38135129 39262049
14336 39262049 40426984 41785288 42886799 44068847 45361298 47064124 48235951 49858064
14328 49858064 51733260 53372359 54951748 57045488 58903806 60735570 63141173 65625982
14320 65625982 67598255 70550273 72837823 75104992 78212080 80829032 83989281 87109162
14312 87109162 90534277 94259070 98233530 102587630 106526772 111442396 115756560 121078217
14304 121078217 126533614 132070809 138445295 144746816 151491769 158632248 166389842 174185031
14296 174185031 182757393 191995044 201276434 211224060 222066495 233115890 244790695
14289 244790695 257192049 269836972 282802576 296520669 310537579 324969198 339485416
14282 339485416 354493345 369369952 383935269 398255837 411852597 424744304 436487575
14275 436487575 446425666 453526622 456128367 457793956 458821291 459389484 459083086 454646275
14267 454646275 448894116 441110722 430598584 418939778 405962635 391529320 376866962
14260 376866962 361558380 346081232 330473107 314806575 299741069 284837548 270807691
14253 270807691 257333668 244429912 232252804 220249788 208815481 198611242 190002037
14246 190002037 181260174 172442778 164130188 156356564 149030814 142023577 135365185 129299696
14238 129299696 123921080 118730236 113298422 108226446 104258543 99395970 95638673 92109951
14230 92109951 88322844 85177692 81360936 78373118 75493625 72603882 69965182 67744222
14222 67744222 65146212 63101214 61223298 58880621 57003630 54932563 53238133 51525396
14214 51525396 50296310 48994911 47551096 45791040 44620002 43190181 42013262 41316490
14206 41316490 40187460 38714386 37449152 36916432 35501518 34782134 33977818 33355315 32033999
14197 32033999 31348606 30395626 29557737 29143755 28526654 27351368 27047677 26291164 25537899
14188 25537899 25130706 24804748 23770673 23313401 22843883 22350210 21872757 21458989 21000856
14179 21000856 20724503 20322779 19690967 19444708 18845001 18506550 18274138 17712625 17622752
14170 17622752 17350686 16782985 16595470 16163741 15995845 15689088 15348033 15199211 14904376
14161 14904376 14756839 14329006 14198332 13939631 13817867 13282610 13004542 12848199 12718479
14152 12718479 12324196 12208560 12184141 11824748 11798074 11621762 11478658 11138604 10966405 10879846
14142 10879846 10816779 10424713 10225178 10209220 9812978 9980232 9982825 9848746 9404147 9278490
14132 9278490 9170641 9347503 8824131 8914295 8532397 8573607 8422945 8337626 8649567 8230875
14122 8230875 8415308 8056785 7775429 7741284 7739942 7283319 7343447 7228134 6997555 7088731
14112 7088731 6758187 6654342 6583253 6475189 6691666 6688885 6465287 6487014 6280311 6521519
14102 6521519 6142441 6119210 5881804 5845911 6148067 6152688 5725883 5898281 5610180 5592182
14092 5592182 5736512 5396405 5668445 5126666 5377260 5217051 5229323 4657734 4946857 5098119
14082 5098119 5280305 4759752 4827651 4739025 4402010 4533365 4845608 4868754 4302095 4255039
14072 4255039 4481595 4148270 4500572 4384139 4014152 4246481 4434944 4486084 4073045 4417709
14062 4417709 3877980 4174876 4032047 4409924 4129475 3878519 3739075 3985345 3665713
14053 3665713 3918204 3831209 3740651 3749834 3520578 3624366 3284346 3314001 3574719 3359787
14043 3359787 3363036 3433312 3468870 3297075 3255331 3257526 3158608 3096794 3145684 2769025 2770373
14032 2770373 3512919 3051407 3050394 2776729 2983910 2855474 2956431 2762456 2642973 2774037
14022 2774037 2902008 2645623 2774505 2485897 2917386 2714039 2886097 2491912 2590305 2487460
14012 2487460 2857232 2447523 2581785 2574991 2356450 2264500 2452459 2454293 2298343 2174641
14002 2174641 2449535 2349747 2003681 2108786 2027735 2327169 2019095 2427672 2232464 2199927
13992 2199927 2418312 2530368 3169910 4487057 6716990 12532515 27750966 46293771
13984 46293771 27294615 13798865 8325542 5873472 4836756 3838950 3834268 3432612
13976 3432612 3164311 2825994 2936883 2717088 2758973 2665021 2307354 2659315 2415955 2796353
13966 2796353 2190299 2218112 2352498 2060083 2251198 2234201 2169781 2283960 2010214 2033711
13956 2033711 1746952 2559757 1929015 2335150 2033120 2178084 1821730 2040485 2214294
13947 2214294 2145464 1728640 1800997 1789828 1801898 1589480 1743706 1860638 1942953 1876445
13937 1876445 1582467 1643953 1639571 1786515 1796252 1644813 1607848 1536990 1685761 1501773 1601928
13926 1601928 1764245 1344776 1648460 1689702 1566476 1871410 1391490 1442897 1418053 1739779
13916 1739779 1527414 1425302 1399887 1386941 1618834 1462575 1468168 1585445 1395330 1451672
13906 1451672 1545901 1309728 1319772 1574330 1251779 1390835 1136878 1472654 1317296 1495239
13896 1495239 1656350 1527949 1350391 1221076 1115798 1473330 1528550 1553042 1278241 1183544
13886 1183544 1446740 1452358 1277366 1571800 1085821 1068567 940219 1140048 1100021 1252303
13876 1252303 1060231 1018081 1352774 947946 1210669 1363578 990273 1174184 1259960 1091201
13866 1091201 906287 1145782 862678 1204943 1036750 1358128 999343 849368 1103488
13857 1103488 921469 805417 865561 1235855 1031262 830975 1134769 1113263 535289 820996
13847 820996 1002061 979119 1154087 1061638 1062771 938858 1023424 1088447 1083811 1174507 955454
13836 955454 893057 762322 1024170 817186 1076468 826336 812198 1195615 1080689 920389
13826 920389 1054292 1023049 1057330 893589 689656 620403 995327 868525 727144 708975
13816 708975 794704 457309 806911 805700 925708 927332 891122 868386 809491 626087 720366
13805 720366 855889 891148 968074 731982 1031091 745823 984868 1113874 909113 867876
13795 867876 837991 892955 680574 709934 896086 810302 864346 842299 1147468 689456 536272
13784 536272 626347 1272114 446290 913362 833031 759612 607063 695221 598798 837490
13774 837490 675197 636993 994348 802382 734731 850387 398034 766274 636285 606522
13764 606522 462479 696896 585119 679535 693010 436219 764455 643032 1008042 669203
13754 669203 667197 403979 441380 724419 490748 646600 437386 385786 665619 621187
13744 621187 388010 638684 498861 705977 648703 577902 604444 359392 375501 612027
13734 612027 572870 604409 580543 707905 388299 756199 658239 446780 629716 697305
13724 697305 538532 661995 460324 357951 647263 552126 92168 837287 589975 617511
13714 617511 777987 552443 323477 569187 477963 744109 486513 759931 530366 734682
13704 734682 695845 313344 429030 421193 431864 196590 174502 470674 169435 746321
13694 746321 436445 938266 794327 434592 624527 203599 465158 624620 475531 255623
13684 255623 586234 632092 598721 886094 567984 376664 280099 597688 768182 724948
13674 724948 554252 385231 410375 678410 447795 486777 165062 450786 360091 483960
13664 483960 239564 404913 520654 691760 274348 403714 264151 489640 554502 710817
13654 710817 331003 544379 240083 223715 344808 367568 433807 441242 698606 284541
13643 680185 242556 256429 330068 423353 553048 203816 52510 617347 450414 356017
13633 356017 194278 480267 283597 566354 192682 456655 706978 334470 216262 285130
13623 285130 199491 393787 360632 311758 455124 361708 414312 486272 514205 522095 373462
13612 373462 411404 437333 460573 441269 601157 424379 270303 448101 209565 414800
13602 414800 195566 386495 201536 411753 626913 389163 322617 308180 477039 233169
13591 295868 511674 95471 -135243 671100 520273 681331 -173268 319030 324503 626043
13581 626043 321421 276121 530136 460209 409517 568591 457240 410121 265826 123306
13570 410820 255893 88560 34054 242260 468405 183048 300502 375700 448973 295793
13560 295793 192157 236259 103072 413348 323579 48958 279573 225041 397569 400563 318617
13549 318617 248815 203329 365941 410261 142592 543469 147066 614402 252985 -12191
13538 292792 256736 266834 399559 199778 44001 412124 -233925 157418 323885 451774
13528 451774 88516 71592 240600 234069 199626 477738 237354 309873 123829 14453 140292
13517 140292 194099 63608 459748 524498 383494 458269 346173 325123 210712 26859 212525
13506 212525 166141 382831 356492 296562 259370 -35809 219411 163737 208739 443785 213960
13494 408020 167916 275589 366159 303620 96582 224408 197540 435558 416035 513155 200673
13482 254124 155234 316450 136829 63645 109860 206328 236227 242708 321026 86621 409523
13471 409523 434775 356321 169414 59257 14406 250109 60518 28325 233518 178615 283419
13460 283419 243052 83412 181588 194972 394663 440410 454207 371575 148134 -241346 72722
13448 190413 68754 126442 562951 289281 84527 302788 469177 248258 518704 -78339
13437 31486 41220 -71707 94952 262550 185917 236748 36378 340771 -7985 28510 -20291 406238
13424 583072 268701 269250 310508 245097 110506 106258 -33332 335235 197671 314603 139061
13412 317017 323064 -144505 106571 271028 -32117 348433 175842 66507 151738 490730
13402 490730 294836 485747 119192 209967 224817 193608 249919 553481 -83019 131981
13391 290703 262148 -92285 151605 606477 85225 33076 -6275 119516 258368 62056 156919
13380 156919 -191914 101544 268204 97414 -104062 199585 371722 171860 148369 125086
13370 125086 313226 -40797 499046 306653 147424 -16302 82328 89648 300874 331737 162831
13358 202655 171445 169892 219583 90996 27705 103916 355095 162680 31562 508011 310197
13347 310197 114171 360136 221258 13687 339259 -24949 257200 678071 272598 206966
13337 206966 135811 296691 27921 -27930 304875 160642 157025 62958 503219 103172 77482
13326 77482 192094 354196 -12034 277194 -123604 162074 98088 57181 193073 -6211 254803
13314 366704 -167305 83327 390084 277843 330794 83094 23978 121312 76116 487182 170602
13302 104118 304934 285341 -17522 71275 76041 161899 80302 179367 -139710 116913 208757
13291 208757 -191432 189204 223844 420001 -165476 317717 216270 326064 -203033 109049
13280 -99639 -172307 102144 -36582 -112535 102281 197138 328232 185298 -186293 42701 146298
13269 146298 242590 410327 210543 37741 249908 161763 -22218 -96573 -128746 74298 -68391
13257 180054 331900 -158900 348301 267274 381438 -259767 308375 44872 207635 163495
13247 163495 483988 -92446 18911 25398 -185404 5804 184688 620043 242692 308188 66205
13235 121929 -67828 172619 -176553 -70321 81243 106576 -221997 140032 -153468 132102
13224 428897 377643 -50 -146417 128516 119689 65978 162276 -253100 230069 -24358 128203
13212 -254890 154800 198167 -6886 124628 72070 3711 141295 13838 266267 -17712 -20279
13201 -20279 194524 65789 302976 -107912 145035 9401 -47073 53889 85747 253111 -202748
13189 -50076 198811 426234 135452 -34075 515913 87963 -79071 -102321 289279 -154603
13178 68454 -93557 -39070 179856 105764 6927 91371 8048 246098 -56714 269708 216477
13167 216477 -252954 245856 -353759 27978 173167 -205862 -148748 80153 5415 -84540 88737
13155 -193948 86559 -31465 198793 48428 323758 223499 167834 -41524 18285 322495 283410
13144 283410 45627 283226 -133718 84584 158404 -7960 234156 -122304 -241135 -33413 186679
13132 11432 -54249 349467 218541 72139 395525 411814 -78633 16218 189162 175357 203482
13121 203482 -238642 181497 168244 -149010 114629 28859 54673 199449 -75386 306906
13110 44191 232033 200232 -21560 141516 180298 153905 292959 33234 112674 395381 297751
13099 297751 141496 2975 194262 -265959 -172946 133597 34379 199506 69119 3153 -320881
13087 -74605 79542 104124 34421 277035 -141645 -30818 384431 326776 295039 -88813 175664
13075 -49327 -106878 283748 65929 -41702 219779 -235367 -172827 156267 25706 29671 172292
13064 172292 148743 165002 231096 541797 -75616 336902 -266525 -231201 -335238 78742 317260
13053 317260 94821 29187 -5787 296847 51712 -129104 246682 135317 3694 98258 270396
13042 270396 67881 262249 254447 72528 6246 -88643 349398 148074 99167 -47492 -136268
13031 -136268 127653 -81563 179325 -90444 -324244 -38963 55978 193339 -265794 378134
13020 -164473 -34787 205957 -169343 11944 286815 125696 -118945 85160 251770 30158
13009 -181038 238713 144383 117557 173582 -53745 -101678 326782 -64888 82174 51897 223449
12998 223449 8464 46812 13654 164949 156511 -70281 164257 180976 -47964 83455 -34981
12986 164070 -171572 4549 -19354 212732 182903 101010 32055 36690 52145 -79664 -118325
12975 -118325 259464 -270640 48382 -139570 254056 -11142 279035 15365 -82505 20578
12964 -186994 -140201 337739 -170989 110626 -232314 99674 125826 193076 201186 -237547 -181465
12953 -181465 -225764 -207384 -293062 86021 -215453 -578 -342189 -241323 252951 2906 64792
12942 64792 332254 244125 -61262 139059 83022 113489 280666 -180402 -124990 -164094 -134217
12931 -134217 130924 115756 -236262 -161797 -20075 34297 -96341 191579 83008 19884 -395209
12919 -484422 40195 330079 -21613 153252 -69501 -62496 32869 145794 -222738 107286 9030
12907 273811 19836 113976 -176085 261544 -394226 292915 -82678 194056 -233911 340494
12896 -110301 -111401 125199 -138960 222526 55400 74907 -98645 139134 129141 -65394 202675
12884 113102 -45855 -416843 -136957 108774 110321 152713 82728 168690 -217985 -115054 -18789
12872 114665 264578 106792 75071 -135376 91601 -57880 62155 15719 -169706 47564 8793
12860 369898 58771 198965 151471 134760 71767 -156300 -93894 -101259 244520 -203314 -340446
12849 -340446 -257437 -32274 9144 126989 -159734 -93844 356 -312107 -58982 409777 302731
12838 302731 179972 66659 42899 270771 20227 464074 -36106 125920 -112599 46420
12827 -63236 -384263 120528 -3583 192627 165228 -135673 -212556 -84387 -208498 10097 -133234
12815 -533942 -75713 107648 133344 60248 -31101 -150103 97052 9876 33097 -70249 -179293
12804 -179293 225037 -164407 -96220 -63165 310078 281949 9762 302710 106919 -143890
12793 34164 85355 94940 350309 -107974 32102 -376978 -73563 -96520 -118377 87242 48574
12782 48574 -50121 367039 86281 -182086 237144 46561 124635 30337 274311 -322814 11019
12770 -223090 -98149 91325 16329 39622 -146373 -121675 112401 64580 -89817 315896 -779
12758 -315725 -127065 177756 -126081 -83374 237171 -175471 73352 315618 -51702 108835
12747 -157876 102059 38511 -158306 36608 226605 -46494 14921 67080 62699 334628 -65308
12735 133874 72965 132938 -90908 -133289 195459 249118 16218 110942 200777 128067 -105533
12723 141960 260281 55210 -161393 166849 -11504 -84056 -84818 445382 -195132 190134 216845
12712 216845 -49587 115948 -60941 -34186 237601 4635 242678 450218 -46333 -13480 152567
12700 132547 249207 207900 93922 -139081 -131338 124547 -242277 86916 53327 -114716 -82161
12689 -82161 -89900 198338 80387 91087 -159856 104227 178478 84834 98491 391256 261266
12678 261266 209921 110099 -69221 -162561 299245 -109995 -222841 -63558 -40551 346376 167749
12666 153042 150676 -105988 173650 -195820 -70519 194734 27539 69172 -50997 237341 419720
12655 419720 103177 26564 -293213 35058 -316614 -39089 -135702 230847 -201942 -116984
12645 -116984 16229 -147250 104867 -255858 60715 372988 -15502 -115940 -28683 -37296 36579
12633 82732 -165994 -89290 217111 188230 -92842 307568 51259 342223 30304 68461 20397
12621 71224 132328 -123872 -139314 -11808 -65197 -124045 29169 -299799 -27299 -119691 120633
12609 -202220 215936 -74622 285484 59808 -192398 98042 -45962 -43195 193475 68173 115384
12598 115384 -65017 442775 -70460 -41057 175853 -260125 -327050 -84251 -70525 93758 -29767
12586 -380458 -364733 39192 -172953 256238 -162964 234956 -19348 69828 -94597 218412
12575 216235 140677 -203247 201529 -3809 214684 33463 195733 -76041 298656 -75730 41307
12563 -128579 250598 -147783 -436 143258 -72082 129196 -112348 180889 148456 -136926
12552 67548 16637 -234253 -9890 82312 35070 -223254 124544 177922 87815 -48710 103486
12540 148473 102214 316781 306631 -145768 183890 16730 -51262 -195043 147377 257335
12530 257335 -260383 -164625 258785 -5391 -100109 -91304 5189 -187989 70010 220845 -108558
12518 48866 206076 22032 19310 268213 -203196 -106219 -47473 -76856 -70189 5723 45347 289974
12506 289974 -199840 90499 134356 109655 168113 -177770 34024 372696 -174342 43820 19082
12494 -307034 -119837 100074 -251980 -238700 23206 -287241 -155293 -387760 -197494 -37746
12483 182419 -232192 110012 87310 200160 418473 37089 -16659 -283048 -194118 31682
12472 118710 -96665 -371197 -300240 84674 -255250 -62212 10582 66129 85000 -253557 164260
12460 -112079 -93050 -136049 -107330 -185896 -353755 -145674 -353196 168670 -459287 122781
12449 421507 179888 143005 236689 -71680 -33430 -239177 11612 459471 142020 -127858
12438 -259618 321964 116586 -189403 -10320 -9506 22889 -105738 -33002 -287163 -259106 109526
12426 35571 -122558 304061 28531 -307785 85162 -201760 -25845 32236 -168702 -142655 166452
12414 -153726 73101 260586 -65767 76779 290241 -77148 -178288 209441 132504 -16401 -39628
12403 -39628 -22878 43406 120264 48963 -233323 -6812 29678 23866 145788 -231474 315713
12391 172103 -91532 -312072 74780 159145 69192 -380261 -136666 -254057 199530 129858
12381 129858 77589 147469 303636 149170 129082 143699 -38563 -203382 -100863 185954
12370 -135938 146527 -88587 246054 63638 368450 115888 23139 33902 56443 293620
12360 293620 -76340 -84576 -226197 -302693 50406 -374077 109322 -45568 45250 -80662 153546
12348 -120688 -85597 78367 -284190 6911 84041 83207 -99927 -113622 243002 324680 -41038 117750
12335 -38182 -48905 229402 61131 -157081 -249858 107014 -75546 300045 211592 263914 293543
12324 293543 262753 185773 45118 -52446 324204 267437 165942 -155767 84340 142932 215684
12313 215684 138277 109756 172722 -93381 -100420 41055 199080 68102 179078 155159 49953
12301 152975 59526 119580 -40924 196202 60037 236716 254452 42021 177484 232565 168867
12290 168867 141400 -72058 128980 -149600 205391 212301 -33312 -63218 201095 154063 547216
12279 547216 395314 -137996 303762 -143742 -176184 92798 160866 -68836 377059 315236
12269 315236 103811 75091 -307733 164181 -14321 -94984 61375 103038 -344270 -42469 182279
12257 402657 348842 170637 396527 -96656 164815 189177 -195193 119141 -31678 232289
12246 224262 170451 147637 268844 329718 146639 147796 149124 278419 167477 60406 287489
12235 287489 179127 145567 214026 80416 -288240 -49101 389526 -101139 -7168 286769 -220560
12223 25203 151392 22146 -87410 277319 -73488 161344 315414 48225 13541 95182 58960
12212 58960 97539 211217 24809 -55628 315792 -146183 -125317 152083 29590 91007 198235
12201 198235 235452 266261 164279 291689 43499 305154 162269 132491 314554 191254
12191 191254 232922 40236 148923 118130 77929 168593 112711 334474 475150 267781 157394
12180 157394 80810 135672 -17900 230532 79010 235884 106225 412529 121664 268389
12170 268389 50924 165798 110291 344174 178648 94666 -79287 217409 62252 145096 474449
12159 474449 -98236 -47572 323464 -177286 -45280 -57865 -134420 402687 75187 189505 -237247
12147 -182068 -65960 255622 -24022 89750 329062 -106195 292188 230873 110969 -526 149996
12135 -2431 -44505 226445 -85298 -85500 216132 -108427 64016 47177 -127867 112657 41383
12123 564481 379104 51969 97977 283404 186541 451456 -64400 296687 92511 671170
12113 671170 130817 165894 361068 116640 105489 340839 117553 298986 183102 -174551
12102 -17037 219671 -105832 58568 127830 142074 54988 43182 203080 65762 315234 118732
12090 -45662 -97677 63517 -83130 255179 3468 325868 73879 71476 92301 156402 165959 227075
12078 227075 -84422 111402 41061 -134595 291569 207183 299653 155614 296424 226386
12068 226386 141915 61294 144565 -61232 173131 45142 101253 -107390 -248924 -270306 20629
12056 4635 -80673 -353644 209792 -225511 64224 122946 179951 117126 14541 -164385 -92309
12045 -92309 -138690 -73868 270584 -190583 -125744 473195 108776 5329 -11985 -158813 -60930
12033 -68043 206570 -86182 97902 273137 175425 -29168 -50720 -78916 8884 9440 345712 378882
12021 378882 -259963 60004 305191 -80615 537801 315127 138362 86233 154135 178978
12011 178978 19146 -3332 24461 278891 86050 43720 -35062 26092 -209137 4181 215565
12000 215565 131771 112684 119921 99128 5167 -321965 -75745 -173611 26649 110942 -89128 256324
11987 -90451 182079 -261833 27006 -98800 -97439 -133394 -136964 -89322 -203413 -247057 -161695
11976 -161695 -76465 34799 114367 -198157 -1923 172701 4865 62726 -210457 101216 -281430
11964 -211143 46516 287303 -34722 29227 4916 63175 -28674 87913 116768 294816 273956
11953 273956 -154529 -26030 -5808 -91985 -188286 100566 -90579 84066 29657 28420 -80447
11941 -209019 112451 9312 105612 -206363 241417 -138313 -418054 -236495 19259 150176
11931 150176 261278 -76702 -181908 3685 -279968 191731 -141356 162235 -14089 20571
11920 -185020 -223496 -52798 259339 120063 -105072 18863 202976 -38922 56477 -169309
11909 99287 21082 -149672 132273 -179728 -197389 -100180 -185714 -78981 -257928 15160 -17146
11897 -286128 64428 -76155 -202223 42544 -18760 73683 -367393 -44743 -252709 -101421 -131894
11886 -131894 153609 -173409 -117524 8706 36762 110902 14666 42021 -16137 -196550 -27548
11874 -130935 -264309 38763 3946 -152623 -353043 198966 -355583 -21670 -8190 39952 -198838
11862 69687 -19972 19064 -63622 -292834 -199768 -285168 134330 -93257 -212923 -29488 -75262
11851 -75262 -2099 -238613 -116109 -349288 32904 52579 96175 -145741 124367 4367 -37585
11839 60228 -244025 157559 -330174 -249064 -157092 26375 90717 -18838 -183015 -56142 -422696
11828 -422696 -218390 143598 152428 -8608 -95005 176427 -100911 -182818 141531 258709 -128088
11816 30571 136957 -33873 -75510 25231 -91679 -167515 135210 -115745 -466364 -52042 -127019
11805 -127019 164579 62648 -39418 -296722 124542 -357148 -124599 -144750 68719 374751
11795 374751 -38608 95705 -122544 -97981 46911 -135107 -45667 34621 -49700 -16438 60269
11783 84687 -51108 -31214 186047 -193243 -46237 233377 127531 75890 -4702 6231 -201348
11771 -71025 19788 -373653 249628 -127496 26895 -318372 139714 -13221 121497 -95277
11760 -161856 -137305 -150013 26219 -150291 -172222 -12879 -160204 22440 3795 14526 103396
11749 103396 2229 2928 114323 -28980 -204100 352905 -296928 266926 -92807 68441 -178263
11737 43344 8737 -129588 31388 58255 408145 41250 -125556 126676 156396 96837 -74838
11725 131643 -66215 -95256 130726 -65487 56914 99163 -84925 -118304 -164908 -126174 90214
11713 -35235 75124 128750 -112808 -276794 -265070 34286 5264 40232 19298 183806 210428
11702 210428 124683 21765 -219345 63689 319503 7088 20077 213626 178146 18120 232907
11691 232907 211496 131842 -299053 167169 184863 36453 -21560 252410 -89837 313086 186667
11680 186667 237492 9686 65455 256326 -212494 -298945 89898 -135214 234312 273664 31056
11668 -154628 -115423 -101924 112010 150261 -46505 -130159 -144442 182425 153559 -128778 -167669
11657 -167669 54302 -57393 -120619 -164401 67201 300312 -18708 -9825 217801 184731 -63180
11645 167290 39461 302584 37518 134526 218362 89807 43237 -256260 65121 78540 -244046
11633 189375 -2738 20146 -17165 -264231 21374 58899 151354 -99463 156521 83632 -152723
11621 60609 -74585 -14080 16851 -214557 42710 50536 71376 -22635 -261269 -30808 65591
11609 161476 -353828 -238590 52918 -170427 -359448 -120242 21571 -268006 10003 97426
11599 97426 81512 -59734 -218892 -165419 8996 16722 -81827 74101 102908 -95951 -26156 1460
11586 258900 -209891 -114700 -135980 -8841 25398 320767 328290 -53987 162694 216011 -27994
11574 281418 -184592 14073 -90048 240882 139756 24538 -21714 264727 140913 -192327
11563 198997 27667 321777 267036 -274595 -17305 -76496 204695 -162759 431533 -373944
11552 36023 -244727 -53071 -271919 230103 99093 109871 -200786 -224470 327626 -30878 376214
11540 89216 231312 90012 -9919 60719 254837 -116292 122903 505770 185892 -110279
11529 -88782 273819 311778 210024 202367 -42831 126093 -36577 -194268 79328 41836 -173500
11517 393730 155278 509846 182383 85292 311585 -19682 51128 496505 171432 41490
11506 184228 148038 -36011 226469 159568 21104 -67563 134549 186823 -38918 209500 252645
11495 252645 -139832 263805 101406 165994 109039 218541 -71045 157789 207469 122876
11485 122876 188210 12240 195184 -35356 273615 117733 297404 91060 226466 21125
11474 92451 110519 430274 480797 200454 473730 258102 -248046 416520 42599 193822
11464 193822 119081 -16964 -1261 216232 -22035 34625 111000 338768 124866 -16971 -153466
11453 -153466 -49057 186817 186192 177783 209668 -6670 -112890 -59783 -111701 -231987 370 365251
11441 365251 144484 -89582 119245 135164 108689 55763 -158766 11492 118951 529927
11431 529927 62440 130738 -44443 -15998 132104 -272746 239528 82241 -69479 -43915 -203881
11420 -203881 -238438 -256495 -66276 -166716 -9325 427363 -4654 194902 -254000 -104549 -271992
11409 -271992 -285196 -174125 -214407 -56719 -12533 51407 147028 -168547 136242 -84711 -140053
11398 -140053 46083 -30275 28520 44198 -170589 -45755 227793 -215959 54464 82217 -4177
11386 -260609 19846 -102179 2778 -88982 9880 97141 -194912 -5490 94652 -178652 -95946
11375 -95946 -62400 -102885 261641 -54063 323143 1521 -184485 -134723 -110531 -164727 -257186
11364 -257186 283298 -108295 -176496 -67294 -63796 161173 14966 -206409 -77479 -30333 398307
11352 92624 -328746 -18078 -102867 -21980 -168110 2673 -199506 197986 141683 103626 -183578
11340 -206950 26203 -191024 -135376 194163 -61578 14942 11089 189224 208149 129112 -321843
11328 2052 44566 34406 42965 280950 188839 -103827 78160 -557279 -34516 151523 30898
11316 -91169 -98015 153997 -162851 -169362 -412840 -12633 -278968 -84567 -65691 -15526 73846
11304 -103002 -99426 477017 28800 -298182 112777 -185411 226580 86105 30858 26337 129278
11293 129278 -110306 50550 -349698 134457 -121658 147373 121030 213340 -396769 -5359
11282 80446 -51541 -37682 -125809 -55440 366773 -116269 -11299 176181 -36765 21262 104693
11271 104693 -108970 -76248 165710 25053 -231494 163617 -233345 65580 30501 -78406
11260 -374889 -244229 -102847 359659 54997 -407081 75777 -49772 -155627 -393017 82140
11249 -144896 16621 -183230 96041 -92837 -109549 -290758 -88446 88334 -334972 192065 7833
11237 88292 -212300 167846 174063 -188813 -355236 -208019 22629 67180 -39787 -70401 -144294
11226 -144294 -25487 -152112 -180211 -50307 -4504 -147011 172968 -172792 -87000 -207491 -17353
11214 -105790 -37674 -199952 469044 -56718 -118895 50234 11717 -63516 -228760 85449 -164651
11202 648669 251987 -280645 188233 -82880 -159809 -197522 -246691 -108403 -299818 16353
11191 -143970 -180092 -184687 -391512 -30068 -142738 -185946 -106311 -10327 48402 -226900 -239194
11180 -239194 -177573 136790 -7227 -192108 90054 42354 -39290 9853 -207674 -46087 82808
11168 -147470 135399 279842 -110587 -436827 -450193 -232610 -43880 -2024 137792 160639
11158 160639 -356542 60380 -26165 -340728 193408 -402560 187121 98683 -64803 61955
11147 21555 -16732 -4870 -271264 -157994 67242 91266 -325721 -71242 123601 -125217 22507
11135 107674 -60747 65669 -340780 -294797 61307 236872 78714 99579 -34686 262277 -189984
11123 167058 -43594 3016 267308 194809 25513 99705 168294 485040 238768 -242461 81985
11111 54643 26117 181428 15626 -5113 -65403 73561 -109522 -142871 170224 30364 149178
11100 149178 218863 251754 19487 497470 -120701 165941 107792 337240 189796 -150360
11089 170727 108187 60117 -141403 -171433 -235568 137973 232109 -96851 395450 327947 -86158
11077 30891 91101 206711 -49907 327363 339789 278722 76353 180436 291916 197338 217482
11066 217482 105735 143376 233503 126102 623006 565290 548740 457007 498720 575662 326299
11055 326299 412770 325042 459780 610645 565201 378450 674595 628612 796049 576476
11045 576476 392614 403035 543224 527562 709617 581563 562679 598542 561444 593328 485793
11034 485793 694517 688713 572852 247246 383750 512368 467994 722139 388450 980035
11024 980035 828430 659347 690710 589943 712594 231367 445917 486596 156479 542673
11014 542673 707964 599750 226539 645281 813529 206018 520936 528312 581825 541878
11004 541878 415458 341704 649397 935086 464054 467491 543814 545976 573488 727005 676116
10993 676116 582947 1092430 674735 539907 758538 510018 438128 630645 483898 323272
10983 323272 686097 609329 875465 639841 948977 1014125 1104707 1083729 854055 1534389
10973 1534389 1632079 1679515 1735872 1886813 2372955 2295521 2496262 2294963 2073519 1910747
10963 1910747 1745834 1629535 1869914 1206625 1308388 1408288 1717284 1548040 1737769 2083946
10953 2083946 1404767 1639475 1418714 1566141 1565775 1238754 1119440 953619 591358 724422
10943 724422 263435 323682 305193 293003 605038 69530 27838 338739 -43487 133238 339914
10932 339914 -34448 5432 310240 124083 256743 156385 -75641 -211231 165708 41974
10921 -7779 122684 252966 -266064 49707 -6075 -274287 15421 -259294 -167048 -46729 104039
10909 164861 -208051 -10700 -26808 12960 311928 14559 -15190 -216616 -112934 125140
10898 215984 16336 53161 224351 100990 188929 -271565 210406 -234413 -165276 77209
10887 38588 -123601 40938 52783 218879 24141 4977 166620 98350 36110 34738 327008
10876 327008 -340264 45506 -194983 42671 17366 -63519 -157057 -195303 -39004 39944 -145603
10864 -148128 -4121 177644 5309 113924 -101546 53884 71713 -70065 -169119 -122513 159930
10852 -256594 36333 -125283 -94741 -162906 100781 -395727 47721 4816 -159250 -101432 -44499
10840 58747 -22120 32274 112477 -16612 106522 200985 -25652 18057 74133 89599 -497660
10828 52309 -87052 -26942 267007 76173 101050 -83854 -286385 -186308 64301 -186916 -85074
10816 70645 -200813 -209362 -180712 71541 -2229 -129687 -186264 -47774 -95706 -146417 178733
10804 -39051 -301625 47968 -174310 51810 -105271 -177294 99256 183756 -210797 -93610 161667
10792 -299236 19529 -189465 -144552 29798 2373 -136594 -206565 402245 76974 113599 -151597
10780 -263961 -26450 67669 203647 237605 37440 533708 171926 -64262 -274406 126179
10769 -208932 232038 374549 -369282 -386308 -272157 -205690 -303007 121568 -378925 -115274
10758 -24591 -183916 -145708 116197 -75147 -125964 -114609 -3184 -125182 -119287 -95241 -309305
10747 -309305 92910 -147922 -156719 -167969 -305172 -122052 -48117 -24825 36206 -53717 -87435
10736 -87435 133008 -207004 -281130 -79677 -213170 -25386 43251 699 232392 145924 -181894
10724 -59832 -132505 -55751 -89975 -426943 -419962 18220 -119630 1394 -254265 355816 12866
10712 -156754 -242227 -9098 -61960 104762 -131240 -201710 282129 -77733 -124462 -20902 175181
10700 35086 -236353 -281833 56343 -325163 -229132 234155 170335 -231569 -126292 -295991
10690 -295991 -68576 -96470 97551 -38240 -29030 67903 151122 -11750 -115466 -181227 131928
10678 -79888 -143002 -24112 -283872 -247008 177447 10029 -352400 78193 -54330 -135474 -332201
10667 -332201 30661 -79211 -250785 -58292 12278 54168 -37102 120938 54279 -175625 -131598
10656 -131598 130795 64873 -319220 -150080 197705 -104265 -568655 -108056 47404 -12383
10645 132504 -358123 34489 355 31732 113452 -184105 -274989 -115 -434629 160201 112636
10634 112636 -125314 -171246 97708 -78653 -59351 170345 -86613 -332325 -6462 -176284 -77931
10622 -320210 15835 -390871 -394261 171249 84694 -127192 55266 -276272 -559142 41827 -32119
10610 182995 -161893 -53186 -70241 368128 -113225 42730 -281101 -295187 29377 40657 -200538
10598 180443 118795 -196740 264430 -91355 -397594 19119 -56381 312580 -327960 -90252
10587 36023 -147977 -167723 237874 196703 -111586 244247 -260600 -294165 116580 202867
10577 202867 306 177672 -41040 -138805 -75425 -115418 11329 -52113 56941 -6882 140033 -127543
10564 134769 81878 -191671 -180199 342717 -85608 -84275 -327801 18967 9747 -52140 -349946
10553 -349946 23708 142070 109416 147621 -514546 5046 -129641 -307553 45571 -342566 74126
10541 -47967 19654 33662 196768 156362 -209015 172473 174139 -316240 -280098 -300880 297812
10529 -192682 -40571 -449903 -191136 199693 309713 -89236 -357964 -444881 -404211 -406260 -194776
10517 -96602 5091 -522698 -8072 50350 259844 1396 74054 -24559 -148698 -127431 8478 112317
10505 112317 -19914 -23478 74578 76581 87110 -40460 -158973 60177 -260409 17472 226644
10494 226644 155554 70607 -181076 -33063 -139625 -62284 150251 269097 -201312 -266071
10484 -266071 56479 -113058 164031 -124455 -111665 130804 58787 91393 292271 209377
10474 209377 367208 492421 399146 299515 77005 -63733 -116077 135403 46344 -213305 -374529
10463 -374529 -169762 -76195 -240740 90090 -78600 -184093 293273 -324065 51744 -156875
10452 67516 302807 304660 -200044 3800 -57997 -99735 -201826 -31405 -22866 105344 -25953
10440 -21863 182402 -151552 -101504 -255632 -40602 -23975 -187596 -239104 -72166 -209166 -37628
10428 -10573 -124919 -68659 109068 16644 144239 33720 200156 122112 73877 -105083 85057
10416 9096 147418 49642 45994 -72271 -185736 -177794 -97206 -145196 325319 -125746 -38268
10404 68236 -168771 -196814 50976 -121013 -183013 -113927 1264 269715 256416 -280519 -391058
10393 -391058 120021 -80219 -48938 22264 277524 322217 -7985 -10821 -116199 174645 262478
10382 262478 67129 129940 -106532 -109016 315303 176233 -69658 131246 350733 348213 67583
10370 87036 459107 348154 54063 295146 549187 319991 565815 487053 256106 -5261
10359 271787 248981 521722 154455 -162963 80025 -158866 197035 366967 432358 292313
10349 292313 400979 101905 230658 306633 214261 245655 227431 629413 296860 234795
10339 234795 -76112 180186 391347 -231911 480529 109863 10653 117603 188778 148291
10329 148291 -15117 155670 310246 -175450 -126906 437255 371759 -6914 89841 245185 332807
10318 332807 -7146 -322 167890 157813 -2643 598586 12664 164730 -74699 -61089 -118805 -45315
10305 348707 39578 17017 178248 -161571 -36303 -210441 52674 64493 -250006 -34082 197646
10293 144449 280947 155983 29342 -135651 -212047 15641 247181 -251339 -57608 -387150
10283 -387150 112154 -289074 -5612 -26150 17368 102671 -10554 -105417 -320388 -113395 80197
10271 -18252 -152703 -134049 -93232 301431 120985 93647 -298685 -255557 -125362 -113983 77887
10259 -225354 -41707 -115351 12781 -144095 86878 -188734 189259 291496 248263 222706 42072
10247 -155759 -137752 310681 255571 -44972 -309743 219400 194806 -5292 -318522 -128218 -44956
10235 -23298 -243878 221220 285491 125404 416925 42828 146058 -51762 -31264 -387805
10225 -387805 336523 -289114 66679 -16930 -15125 -288747 -246096 59477 -125719 -164417 63601
10213 159123 -47885 -348664 4824 73458 -238178 -212403 -78547 -119239 43191 -195249 -106516
10202 -106516 70933 -108745 122851 158965 -31031 -266236 -41450 -212911 -22623 -201552
10192 -201552 -122116 -114388 -191750 -215300 88275 -165128 -117804 90567 128336 -3557 -45697 -69711
10180 -69711 44414 -150188 131420 -170309 -34840 223788 310978 24479 -271653 -29405 -258260
10169 -258260 -17226 -201082 5258 -162148 -211484 220145 39387 -95460 -202136 -23411 -200174
10158 -200174 328110 -89169 -113033 -160217 -208330 33588 -119446 125674 -240905 -10671 221524
10146 -335554 125376 -47734 -103259 -330797 104735 -94108 120430 -47639 -94766 -303340
10136 -303340 -558270 -120806 -376024 250503 251645 -97549 -369247 -23280 -99797 -183175 -213120
10125 -213120 -256617 -30376 -40246 -174114 -153801 -254921 -29472 -126699 -104711 170335 299655
10114 299655 265955 -245329 -59275 -55345 -108700 62054 156154 -93831 -232214 32051 -98023
10102 66203 158220 71965 -38913 -358326 192035 80516 91386 -87431 -10650 -63930 -137847
10091 -137847 -114830 -210111 -407210 -216018 -65968 314145 -243208 370279 24368 136428
10081 136428 -188339 -220797 210551 -24648 227317 415802 -116019 45285 15676 141450
10071 141450 -20403 -101651 -149461 -253236 -142597 218145 -48669 -61356 -101556 -218632 100136
10059 36731 -56831 14732 140271 -28921 349565 124611 -58161 -138634 -62642 -5029 157968
10047 72511 -159101 263774 -18015 -201211 -29479 -59154 105235 161832 -161510 17870 167043
10036 167043 326920 57630 10792 -344700 -197798 113606 205438 -97626 -143231 -119768 -131601
10025 -131601 246076 62637 78814 149963 -263361 -53441 -20073 103957 -79138 164747 146346
10014 146346 79041 -121647 49940 19705 51523 -47919 -296427 -349463 -281102 228284 16906
10002 -132302 -269494 -319396 -72848 -161780 -269214 156508 86674 157094 -193050 138260
9991 66675 70152 -392618 -38485 -80987 -18302 -97260 -262207 -3559 -102350 -371322 -1844 -287999
9979 -287999 -214950 -345789 -94995 -257666 -81198 -417874 -247002 -67263 48013 -100991 -380744
9968 -380744 -103584 -172178 -229778 -27398 -67321 229802 -254724 -315368 286397 -154534 -50282
9956 -301355 132467 143564 -169266 37968 -105659 -126418 -193232 101875 -189717 -277010 -261225
9945 -261225 -189742 93115 -287211 -247340 7 70216 -10215 59772 -347432 -243059 -157430 -145646
9933 -145646 20476 43530 -132963 81346 -269653 92070 407804 341619 -139485 151974 -61420
9921 -230251 176614 162433 -336568 23169 47467 130431 72324 41012 -222625 -221801 -109407
9909 93139 80205 -262309 -78247 -274372 -91967 151957 280334 -34455 -58951 -178576 195038
9897 118319 -509167 -242996 -264483 -245650 -49052 20033 -58656 -106311 -49185 272543 -113837
9885 298026 -19227 59126 -163898 -119132 -48060 -120785 -262413 -338665 -113209 -4122 -126649
9874 -126649 313421 61448 173215 -132893 -159301 8109 -285018 -117788 -130980 -135356 22691
9862 -194343 -262454 261310 13128 47512 24731 113694 86530 -251610 -152996 167673 207856
9851 207856 -73024 33345 60185 -128123 -148624 77466 -34375 -175623 -311989 6564 -156317
9839 23928 -153476 126570 -207023 -100239 -57226 -404762 -4362 -214720 309391 -127435
9828 -28273 -106009 -129929 -249793 248613 -21706 -198277 -101942 -294670 -133793 -50871 -33464
9817 -33464 -124874 228671 -329641 -319774 -57670 -123706 -97904 -28707 -178265 23672 192852
9806 192852 35 -5344 -146862 -40354 -196883 26353 -114421 -4859 36656 -105287 320629 -26511
9793 254141 -229024 -41476 245271 -59175 -106470 -104280 49989 -436415 -170594 -88059 21404
9781 -179515 119664 -172934 -177228 127182 -69586 -186799 -15429 -22878 -145283 84413 78226
9770 78226 -316786 118702 -123686 148600 183981 -21092 74736 -256857 -155934 -101841 118334
9758 -329952 -154202 228015 -436490 -6507 -110128 -150745 -69895 -302844 63529 -238678 -167262
9747 -167262 -51847 146405 35974 18489 -44272 -17800 210202 -18531 83937 -169258 134313
9735 -91009 -60131 -138144 -253626 -326506 3622 280586 -20333 142945 -162472 -195612 128796
9723 -11992 -132968 -54567 -73781 333731 -215858 93533 212888 73635 -17036 -130248 2977
9711 -73493 -108884 -35612 -278837 -231292 65823 135640 -201353 -419135 -301058 77382 106434
9700 106434 24231 30915 -201359 241457 -144000 -92043 64984 182110 -155340 75290 249329
9689 249329 -103890 -81380 -324592 -273184 -41295 84373 -123607 -43827 97576 1808 110866
9678 110866 -227787 -357390 -65071 42961 384991 2065 186807 340215 3186 73025 -274174
9666 37019 101421 85926 46696 -104346 -61900 -227819 -19719 -186312 -153703 -236978 43034
9654 151270 -188257 -87261 14028 139146 85389 9685 -109334 -179888 159031 -246876 -51922
9642 -301160 -80493 84391 45824 -45356 -131652 -197306 -188653 224612 -283929 7260 -112185
9630 -4040 181542 -125954 552 -127009 20194 51137 97240 -81995 -345853 29180 -173590
9618 149209 323524 -370366 -107931 -207081 -24090 286690 -118769 -230983 -193371 -39217
9607 -216230 231349 -130493 191294 72468 62903 31540 72566 -131188 -81350 -303158 22324
9595 -92333 -6005 85208 -44196 -50173 -174515 -162950 43897 -289970 -12112 173674 -198360
9583 -97873 436527 -10515 -179004 -81016 -64775 -564003 57646 -281895 96852 -82347 -49031
9572 -49031 -169142 -25398 -369332 -347832 -334937 -118766 76193 83069 -139509 -23322 124566
9560 -127975 -40182 -92930 -236804 -331259 111349 -108852 -88135 -259805 -222716 22543 -211321
9548 -329836 108814 68696 85756 -68889 -271844 -141517 34149 74598 29442 -205366 -228005
9537 -228005 -175851 -121059 70472 -394365 -188938 -5045 -193963 -14369 37758 189081 -49133
9525 -196580 -205120 -101523 2370 19326 -254828 -290965 -183275 -31382 -326118 -170686 -16370
9513 2548 440257 -246955 419387 -70466 -35780 -121469 -43259 32431 187469 -193967 -419917
9502 -419917 175427 -53787 130418 194387 -190364 65411 -134095 -83102 360609 227081
9492 227081 93977 -273853 -201648 -50549 111446 -134944 -60793 -170778 -33592 202439 3299
9480 -63065 58214 105107 170145 12005 -267654 -106424 446109 -257362 -168356 68063 115059
9469 115059 -211242 -176123 -343434 -409832 -327881 -10071 -251717 -234229 -209152 -270116 -24181
9457 59847 158949 -133681 85347 -367036 3832 70126 -30509 123199 208190 -574756 134374
9445 -16188 99641 64499 20591 -36165 -206311 -358247 151543 66705 -245164 372107 94002
9433 93132 -196721 94515 -219827 -127944 34466 113388 -84479 149059 -293316 83755 81728
9422 81728 -166346 -114824 70480 -76817 -135544 -361683 22242 42507 20644 -261567 -154614
9411 -154614 -239179 5126 118109 -86897 165664 26556 274166 17484 -426141 43637 75603
9400 75603 -233960 -39336 17593 151481 183137 -37425 36270 -176752 -257814 27429 134772
9389 134772 79899 48058 -75374 119129 47317 -144672 -41349 126869 -118882 -92513 -70208
9378 -70208 70399 -216893 -53469 -19725 169198 -101292 -155547 138451 153926 -66844 -103271
9367 -103271 -3539 -360734 -97078 -84086 -287782 113911 -110690 -101890 38417 -188955 -348143
9356 -348143 58484 16903 214571 -35871 23036 -47002 -298571 -160556 153282 137620 -53263
9344 141698 -76118 13591 -29524 -41673 89029 12240 191762 -66041 40703 -28427 -225148
9333 -225148 -201184 -347266 -212375 -62872 8524 -282060 -191520 -323890 -220670 76052 161636
9322 161636 122091 -258863 -114462 -149071 261782 -43266 243339 122343 317277 -439017
9311 105535 -219064 -167422 -446997 6627 222765 59423 -80979 -207675 -189386 73719 -176263
9299 79790 183744 -23231 -134264 -36513 127538 153722 -278693 -151510 -139982 -538020 -66795
9287 65362 -126189 -101534 141719 -421663 324235 281999 -144558 188230 -211877 157664
9276 4694 -133126 -44618 -82052 -144036 180438 -99014 88809 -63557 -169030 -13589 -39328
9265 -39328 -37627 -94189 162452 -448779 280165 104624 -495754 22678 55852 266658 -139390
9253 -396559 10745 -250751 -150852 -225537 -147715 -138077 -228010 -147163 31887 -124280 16336
9241 69580 -188092 42586 290013 190536 -29233 -436084 -397629 48885 -137320 92038 200012
9230 200012 86890 137589 154771 -206465 -18998 192721 36577 -92595 35363 -101100 144800
9218 -205830 153384 -309716 -345914 -133274 -303904 -81077 -222453 -83175 -283938 -173208
9208 -173208 21669 -64413 -9544 -359561 -156272 -244646 -324358 -119814 -148867 67997 -36493
9196 48984 -52975 228840 -179857 -253819 -22762 163813 -312408 -114254 -179820 -11228 -241
9184 -263792 -422223 -334740 -561035 -264008 -211595 -200587 -287513 -122826 -186318 -200847 -62763
9172 62030 -92614 318548 -258578 113161 -107315 -181980 27981 -168816 99380 -199878 32405
9160 -56465 -92476 122286 -24428 -219080 -294410 -6324 229648 63988 -93674 -155937 -163674 -146794
9148 -146794 -167763 -56396 -161251 -242790 -197338 -55150 -32355 -21621 96962 8816 -189189
9136 -172624 -13380 -125240 -142613 77842 -150203 186175 -309895 73235 -244711 -87616 24564
9124 54671 24459 33217 -20750 361819 -135930 -102437 -40759 76394 -108129 -150327 -222523
9113 -222523 27832 16439 -23010 10146 -101673 161139 -223054 -227743 -293019 -103085 -41545
9101 -214389 103199 357242 -156425 219624 19645 -194787 37501 -155724 184335 -197587
9090 69101 -255995 -69651 52441 49117 -316915 188004 -54516 83513 -108723 -179999 30375
9078 28457 153887 -263125 -149630 -357883 265550 238774 -335101 -215402 -1257 -171188
9068 -171188 -45391 -386604 85429 259849 193936 46712 -321202 222789 -211666 -8608 292504
9056 -77361 -206276 -141086 83748 -12142 194292 228761 -159837 -14072 -117211 -213460 -47236
9044 28923 -12440 -457396 -22462 -150214 192613 263409 -182076 109486 -60484 31320 -284907
9032 80127 427965 -183463 -326460 3763 -53931 -3241 141544 -227790 278563 10245 -13978
9020 131287 214009 -242821 -153257 -197481 -228193 -97444 51671 43523 -283828 -216334 -314843
9009 -314843 201672 38658 87094 136802 -121831 -63085 -217890 -82704 -113857 171942 14907
8997 -136699 -140845 -244999 -76434 193329 44965 -182799 -182083 -32281 53763 -12675 -49868 -84562
8985 -84562 92075 -52239 207505 233887 246344 -547617 -44751 33861 -175655 -71717 69639
8973 -472777 -265438 -130789 -81611 166150 -28162 -179445 177458 49702 76084 -134151
8962 -38613 -210058 439660 -144305 -232285 26321 293283 -11601 -38592 255424 -58333 -54569
8951 -54569 22518 -97971 -163329 -163690 342980 -55919 -155398 195860 8440 -184842 -68955 -120990
8939 -120990 -416200 -55252 -28164 235756 -15061 114574 234925 171044 315030 -133104
8928 67392 -111933 -30611 143509 69879 634087 500301 1035629 1996699 4570092 12928049
8918 12928049 5059428 1618683 721142 50608 441821 176218 158224 143504 -303793 -131821
8907 -226763 -62031 156093 202544 288579 -183043 -220565 259448 214008 108018 -71508 -273488
8896 -273488 205325 -91614 370444 -12183 -147456 -48514 -49054 -14248 -144941 137338 -73005
8884 -154003 -412973 -13176 66020 -248092 26970 -91041 -217627 -147327 48099 39417 262069
8873 262069 -93685 -67856 116997 -262069 -90085 -382533 -252798 53129 -38113 -60370 54620
8861 -63439 73748 -294187 -20611 16844 -133327 14289 -202965 -10534 296650 97314 -331145
8849 -203409 54224 -27305 67752 -91322 -113058 -41370 -200912 187449 -73785 -243551 -85222
8837 50324 9679 -64909 -383855 -152282 -56864 -208697 -24284 -107218 -136296 -288628 -146521
8826 -146521 -223512 -85520 -250697 -167552 -34865 212787 -25157 9807 -94773 125868 156540
8815 156540 -112643 -72527 51780 80133 -272149 -92759 -425874 -138645 -201832 -277388 53413
8803 -17144 -236412 -399995 -277726 -64865 26568 -184683 -233085 123107 -12045 -128525 -148409
8792 -148409 -55815 -56428 -172859 -44184 -168586 -2447 34948 135498 -301782 153683 -92333
8780 -20992 -293311 101885 -50179 181519 -81513 26355 -102681 12992 -72337 -190793 -72643
8768 -10846 139818 -237670 304039 225591 -182886 -134037 -1730 -118470 -286651 1468 90824
8757 90824 -398016 -308 176928 6376 97374 -95070 4239 -102965 207434 -75955 -192102 104697
8744 312689 157756 60626 142973 -75824 -67990 -237988 -327981 -88748 1083 -105234 -13959
8732 -59150 -147834 -91239 162263 -173325 66429 -75914 82986 38570 -258341 -278998 -293341
8721 -293341 130525 -62186 178530 -50949 -4383 176034 -67732 -80680 -22422 313522 134400
8709 -396145 26903 64935 13348 -16299 273876 121448 -103138 -43224 -448139 85903 79110
8698 79110 17010 -133432 -113643 -307181 -61154 -115723 -61092 -130152 -91539 -117837 -112517 131378
8685 -161784 8893 -79913 -291475 56944 -18267 167884 -41082 -401662 127708 -14964 232995
8673 -34440 42899 -92376 -108971 139919 -231787 -75770 -111935 -25961 175011 -87037 -146954
8662 -146954 -208104 -111033 -145158 17490 -172874 -40389 119498 -289682 155746 -255962 -194678
8651 -194678 -50471 57355 -72596 -59107 36808 134302 31010 25069 -196230 -133733 158268
8639 -426636 -11043 6129 270860 -32441 168806 -438276 -332904 -354982 -259656 80284 -87492
8627 -69049 423824 95485 -209838 79600 -270020 -35161 -133170 185915 -135559 -344477 69062
8615 34690 -222243 -327714 -127785 -106104 -17060 -17025 -61387 -23519 -148188 25486 57093 102479
8603 102479 145029 -5531 -252065 -222350 566850 179545 -45919 77116 -298161 -276326 -90708
8591 -196605 -222088 203124 61422 -64221 -170418 86627 -43984 -136842 -199649 88920 192533
8580 192533 180916 -24142 258316 48947 -145248 -134295 60795 71038 122379 99195 -188134
8568 -136206 -53818 96974 75456 -221464 145531 -17613 14976 -7983 -134962 -358197 -254289
8557 -254289 -5336 -43400 9451 119847 168368 -154667 1007 95278 48484 74748 16069 223081
8545 223081 -311319 -100840 451469 -17099 -53974 4018 42255 -99181 -160717 -168331 394007
8533 -232791 -304023 -325397 -387014 84910 -114837 80672 -30634 125876 124890 -351846 -36766
8521 -148343 207088 -138897 -416565 192085 -211866 40371 -37495 -145563 207293 -229200
8510 25456 70663 -66802 240528 -215033 -24581 366185 68065 81535 -75982 93909 78119
8499 78119 -3198 53515 -225498 310702 -188000 -22026 59612 -177344 -34948 -263878 -101083
8487 58144 -97824 74495 209306 153164 -47751 -172107 -16524 15771 129448 170102 -309478
8475 -137751 -124014 -9357 -43544 13538 -121590 -431086 -271741 -122260 235079 241759 -90421
8463 -127374 2903 35974 121177 192622 -215536 -21302 -86845 -220900 43901 -167096 -87220
8452 -87220 -94349 114419 -43259 -162832 169172 -135365 275703 -54100 -88769 -68387 -38356
8441 -38356 -279664 -94505 -125021 149697 -146316 -221431 -125974 174006 -63938 -13593 -106033
8430 -106033 -65380 -75562 -60663 -188182 148251 -84176 138895 -123591 -541643 100791
8419 37607 -137084 -52660 -351593 83061 -78758 -57329 -22809 -101745 145928 188212 15768
8407 95597 -113617 -163660 105273 -471081 -241250 -42316 382877 245122 -282935 -199642
8397 -199642 -4644 -403342 38594 -48112 64073 -356649 -203470 -139447 62358 -132780 5053
8385 -108966 87910 124330 -200311 -51488 44623 77668 273611 -255644 6987 232578 115975
8373 -4073 -197836 35721 88552 -31775 -234130 -159476 -48700 226018 3582 263573 -164337
8361 -335677 119661 -65825 -8227 153350 48594 159795 -253730 276850 -6184 55115 281713
8350 281713 -58046 -82596 212025 99356 189467 -359552 73779 -50296 -135768 -40491 -31182
8339 -31182 77174 -38135 -319576 114984 -99285 -13581 -346677 -128851 -178798 -220209 -71701
8327 -181171 -176898 -74325 -52449 -389678 -39084 -154166 -10992 69142 48941 -234223 23089
8315 -19796 44570 -45422 272378 64627 57653 -182754 38098 77300 -301928 143653 -170230
8303 8683 -12755 -77451 123263 -333485 -148457 -159182 -80791 -148977 -210474 -475815 -56125
8291 186840 153518 -347748 -25453 -240365 143178 47537 -39936 -118373 -185388 -219845 34007
8279 -160412 291689 117735 38139 -96511 -259329 52936 23068 40463 -116942 49247 -170786
8267 -58308 -205396 134390 -89642 119003 122301 -68621 -124007 -57895 -154897 -143254 116824
8255 -305081 -290376 -29760 -15069 -128157 13407 -445921 31089 -465950 194146 155981 -220299
8243 169281 -146548 36799 -198722 36469 -80864 -207385 -376931 -226881 19583 170950
8233 170950 -182431 -76641 -5195 -205231 -69449 -85989 -301706 43086 -184638 76233 -244187
8221 108967 -138838 390423 25841 -50002 151366 -116955 139066 176088 99470 12273 103432
8210 103432 -17906 -224173 -308429 -290246 86360 -53224 141505 72791 -196693 114861 -132215
8198 -150946 -102028 -87731 250517 174787 172762 180893 1402 -131273 13302 -39092 257084 73107
8185 274945 -134406 204586 -210469 32656 -98073 -121282 -64954 -336615 11260 51342 -271373
8173 80046 -394161 150999 163144 -242347 270222 -173786 -16851 -133561 -180484 250588
8162 274787 7110 440439 41745 -84977 -149772 -378001 -102317 -337380 -353805 -227866 -123495
8151 -123495 18212 -269544 35996 -268377 -181923 144836 -84094 -112548 127 202450 243581
8140 243581 -123774 83539 -210893 29060 750 -35130 -172478 -177305 165515 -32139 -133790
8129 -133790 -90062 141947 167739 91540 -9259 157365 -148891 -115104 -113199 -174645 -139222
8118 -139222 -175781 36662 -428286 113725 -17611 16780 -64534 -19842 -299167 -349558 53639
8106 245998 -127490 -388384 -134731 -368565 -1246 -45951 -302332 -320635 97864 30993 -178413
8094 -305355 -107011 -93828 4515 129986 79582 -193535 -327551 188724 -95983 -220287 -304770
8083 -304770 -77515 -999 62375 -158514 89648 -341484 -152369 -184939 62260 -132680 -224653
8072 -224653 4967 12939 -200491 89015 190706 -8409 -185323 -174621 -148601 -509650 -97979
8060 -385780 289466 -17529 -118993 -204252 188505 -171503 -71063 -4718 -305800 384596 -230425
8048 109652 -157482 -136546 40947 118091 -314890 158746 -200551 -12767 -110776 32098 80665
8037 80665 -133643 9299 -66826 -94206 -97456 -6439 283085 12878 -93984 126430 -91472 288333
8024 206217 31312 230273 -176499 -25812 -86622 -85051 189416 -45189 -403249 71684 167978
8013 167978 -258462 -13495 112466 -153697 -123345 -45029 80074 33432 -124495 49197 106013
8002 106013 -288947 -275380 84106 -63735 4741 -250196 -196620 30839 -68196 -154004 -25388
7990 -268549 107610 160133 -216262 -366472 95150 133813 -245168 25103 -12559 14791 13494
7979 13494 -170262 325654 95943 -145763 192624 235450 112133 168941 -303583 -49214 -152035
7968 -152035 -49079 36404 339096 198081 325772 -32591 -358911 49068 -21523 153894 -197343
7956 -62683 -26543 114356 -55354 -86836 -152330 22715 -58644 379531 -17381 -63441 174227
7944 -256377 -464448 234324 -99093 -52420 316661 13820 -26064 -137171 63512 -284683 -192284
7933 -192284 60159 12961 -15442 -32797 233721 -5108 -103706 -175979 41332 -43151 -25353 75863
7920 306669 -64293 -90395 -133784 182893 -156594 -144983 189197 -208270 200747 -99176 93561
7908 1667 -886 -174509 -126322 186362 -318981 -91036 -115 -122211 56229 293079 27496 -300379
7895 244449 97984 -246508 -277527 -205145 62838 38689 16921 -219780 103073 -144403 -198163
7884 -198163 41546 69207 -444890 254322 -39855 223680 -254216 66790 -158817 -349091
7874 -349091 79369 -124070 -210981 -142742 -2507 -185611 -82922 -33220 -99729 -355330 -93334
7862 -93086 -97063 -224717 -238258 -125745 -159527 40915 62007 -160767 42664 -166764 -259147
7851 -259147 -41080 -49905 -69543 17868 -153499 -267953 -133459 130914 -115984 -201777 -87713
7839 101766 156740 36017 -197879 -12722 -85156 -221925 -300231 192772 28936 103873 -74056
7827 219645 -182 -199961 22924 90958 -54946 -217104 -32579 169221 37734 -269205 -83976
7815 45492 69396 -128792 233746 184377 -348673 4435 326119 -49940 174677 -130679 173694
7803 106453 -122297 -12213 -152930 -216508 91225 -151354 86816 65570 231025 -405944 -54438
7791 27546 -423178 338059 -320375 -31681 -33176 -242063 9955 386196 55672 -193588 -155852
7780 -155852 443494 -129743 27723 -99385 -70624 -117315 -53885 -57201 -400313 -191263 -17338
7768 6094 290780 85091 -44210 126696 172044 122160 271977 -122620 -1827 -11768 176520
7756 -152104 121442 -22653 -137357 61592 -106212 293860 -82729 -59108 -74568 -39086 -278424
7745 -278424 -231468 -11539 -255645 -159428 -29182 -272226 18599 18161 -134710 43490 -144329
7733 187085 166467 159416 -2797 238020 -302394 -151795 106460 -55569 -51607 -245816 -284567
7722 -284567 -19299 183109 -168822 395437 92522 -180643 76970 218783 -454138 6767 82641
7711 82641 -107665 -266101 222892 89063 -143596 309817 -219140 20895 -234946 -163284
7701 -163284 185319 -333539 -379654 -87593 -116378 349330 -301181 178330 -31150 -217850
7691 -217850 -145167 141778 -219784 -16774 235984 160308 -64579 -149526 -26445 -19229 170930
7679 85814 174292 154573 211882 135895 -229938 -264725 -247879 62199 48580 -515361 6538 239634
7667 239634 23697 115464 -360698 245193 -347032 -25227 24905 -367 -47610 -45701 42221 -165007
7654 -203404 50649 36807 197517 47688 -149408 -263918 -21753 241940 -256555 199855
7643 84990 -59741 -159884 -78011 -112476 -388921 97416 -123668 -37684 178579 -109933 -280586
7632 -280586 -54575 -75037 -18359 -284711 341810 106845 -96016 -401710 -55962 7066 90857
7621 90857 -224143 42715 -233603 -114552 24061 -281516 -32093 -170818 145740 247822
7611 247822 208314 -241278 -104175 -358177 -183235 161381 -79572 -72843 -82936 73996 -22043
7599 25098 -38500 -299092 128907 -286283 -167603 -203319 -86077 -321490 -52500 148834 32858
7587 -125142 -329931 343756 -28433 236557 -32500 -96723 -183876 -165257 173128 -179629 -57030
7575 -251414 132914 -119233 -218677 -20489 -22778 26222 40161 112814 -22043 -77701 150172
7563 -216057 -69598 -304633 -47926 146795 141137 -3147 -96124 31243 -165582 -358640 -301051
7552 -301051 106480 -367632 -34811 -25071 -86856 -56011 35931 113618 172095 272624 -35371
7540 -176878 -356407 90269 169353 -153609 -78660 38721 -48442 214146 -148259 -34668 -56633
7529 -56633 -30471 -192680 134139 -48493 -138623 -25172 -399242 99331 -31545 139536 -38434
7517 -104121 -6665 218879 33036 143051 -137397 -109846 121812 -164016 -37318 -28627 48921
7505 -2243 -74956 -163376 274709 -121851 64801 -36494 -174571 -230295 123633 -576895 33269
7493 57445 137795 -9180 166887 93118 297433 119348 -176360 3815 273720 33928 102719
7482 102719 104042 -161736 35687 -237844 142748 -199551 -17727 69126 -222834 -138675 34005
7470 -95295 -164481 -153188 106588 49961 46165 -236181 96142 -58847 56518 -161598 -17416
7458 178928 13621 -217950 -187302 53450 84337 -124234 -89961 -3370 -82902 -137807 114429
7446 -27249 -29592 157019 172460 -229931 48381 47214 91069 -240562 -198571 140167 -124787
7434 282425 131561 44183 -134731 -78065 185836 -93454 -176394 -71466 -308781 -103085 -16969
7422 35044 -192477 -231436 -125343 63821 9830 -195326 -224622 -102072 -98749 -78850 63245
7410 -37269 111381 -209248 -168602 65761 -205220 60684 137319 -113456 178694 -31280 -124639
7399 -124639 71698 -112468 -8342 115636 -21434 -99466 -113094 168358 -129847 52639 -15084
7387 -246583 -101091 155351 181861 25394 110317 -102655 -300298 -307568 -179655 33518 -12795
7375 -144571 -130165 -118570 -53211 -142719 -2578 -130335 21731 -38541 305 68024 -363900 -172116
7362 291622 -80101 -297717 -151137 -7120 14760 186157 -354498 -290987 102039 -174295 9174
7350 -225864 -60108 -76669 -28319 -136506 23966 -5167 157815 -8999 -37050 -17455 131975
7338 115470 -52378 -301567 -190893 -177072 -32118 -174493 -214840 109188 -46614 35666 -7872
7326 276720 -87084 80023 174549 -356401 -131622 -200015 -329825 -143728 88926 -116558 -19978
7314 113815 -225473 69979 232527 328403 -173987 195419 109215 -50951 -3082 55966 -422771
7302 -307204 -276523 83450 -58785 42569 -5334 -169095 441572 -17452 -282215 174186 -32352
7290 189561 181777 11318 -39789 190506 -134305 -369865 -391437 164065 92500 -281391 -13777
7278 311798 -157853 44850 -44698 -264539 21627 -137807 -227085 -102191 143007 -33477 20303
7266 -326367 272237 56661 -12054 -69913 -119592 290844 67552 -124890 48837 -274571 115654
7254 129369 -118195 25920 -256570 27772 -287833 -200271 -104620 122942 122483 361854 -273655
7242 -19888 111267 33770 -325585 105700 104262 -188184 90179 -333626 39612 52522 -109473
7230 -289367 -87041 -11358 -184433 -125151 98452 45851 -381136 125309 86949 -407424 -44653
7218 145985 65946 -205332 189869 32976 54773 -307121 28092 -98101 -126443 83722 -67359
7206 -247429 -32755 -140713 174284 113888 110249 55996 -68533 -239775 -191108 -124372 261988
7194 -217642 -60833 95595 -225370 -71726 259190 260654 -148777 -131355 78188 521787 45020
7182 94776 -97052 22891 -112662 -20151 -247496 89634 160507 -73514 191442 104267 -403977
7170 86930 12748 -302008 13966 339636 -275993 38474 45773 -26756 -80444 217118 -66389
7158 -77611 201226 196366 -263839 -115722 -24859 -261180 195464 -196736 -140044 -188244 -52622
7146 48117 69223 318420 245454 173795 -232285 -316355 -112575 -53074 -218444 -106626 184090
7134 -329533 221992 261919 63284 190611 201532 149972 2256 110255 -20923 -142800 23500
7122 124185 271095 250836 -225021 40389 -116281 139024 -219084 239057 -197431 -59405
7111 157784 -392726 4370 96391 -42842 -142342 117561 13020 -82891 -82367 -138164 -69622 116752
7098 63081 -375667 -422938 -203162 -148486 -22019 141711 -114442 241562 -36442 -85123 342737
7086 -149878 232434 135240 -80865 244446 19685 -340434 -71768 31146 129644 -66922 -29407
7074 -187808 -24684 -159903 -163830 -85943 113131 -354158 -90245 148254 49281 65712 570034
7063 570034 -58721 -2530 -268556 -103385 7442 -217191 104534 -77024 3128 8750 65091 -169689
7050 -143881 -30048 -54883 134521 -254534 -242729 -251017 23939 -47067 -146149 126879 -68539
7038 -700 442592 -182744 -229469 128860 -57590 -48599 -50776 -336637 390218 -168779 40077
7026 -176376 142794 274599 -94291 151418 151649 323147 67995 67975 -95181 96824 -73213 -118067
7014 -118067 -111578 -161839 -132154 -39320 40090 -164351 103221 -306745 85487 -114882 166935
7002 248068 262522 482911 -2923 29445 -101938 -78878 38086 190113 -315846 -304787 97287
6990 -109286 -184630 -173203 20622 -352155 179559 121438 25878 195495 -58464 78607 12477
6978 328257 28122 331203 -35378 -117580 150064 -177626 12066 21633 -198668 973 34960
6967 34960 156550 5594 -89099 101939 52712 43592 -248110 -279 -241947 -68134 -403587 -141553
6954 -92199 108871 -134791 -24110 -69254 114796 -95542 -76856 -71590 -127292 57212 65658 88939
6942 88939 -626128 66208 -166735 30128 -364480 -129791 -278883 -204228 261515 64926 138562
6931 138562 292623 -15869 340633 -231335 48713 40836 -43301 -207621 -105412 142997 21042
6919 296013 -108116 414530 -87691 -445963 -10709 -352874 -70347 -132385 -330017 380528
6908 226800 66934 65069 -313467 -118944 -10630 -109832 16919 62668 237237 -239354 -173384
6897 -173384 -60168 -2933 -130378 -41897 95045 258226 -275080 -115152 2348 308617 74766
6885 71825 93332 -28992 -131783 202386 -22832 -31653 266100 303340 -159808 -160973 -109716
6874 -109716 -213725 -171042 -35662 -52026 -132816 19815 42781 100582 295330 -117681 -161472
6863 -161472 295420 -75339 82298 -106469 -215396 -133446 -5042 112121 -3333 80629 183433
6852 183433 -290862 29998 -22429 -6263 -202634 -263710 -91805 -98491 186712 -60289 238655
6840 -172756 -142430 238964 -137998 79013 123000 102461 115356 227827 171522 122752 -167202
6828 -62100 217781 42721 22389 60526 -125793 21684 -130200 127921 -300321 31877 -119434
6816 -54182 69509 -5089 -558137 13299 -284425 -52846 -13438 66863 37485 -82758 85080 55698
6804 55698 107513 44758 -141318 88557 -45777 -65012 15698 -113913 131109 -296353 139400
6792 -162555 -187610 -108228 37809 -159611 -244038 231457 -241704 -107669 64883 -68689 234225
6780 184746 -158201 219965 223809 -48059 189379 -156088 -43593 59389 -42766 77269 -31628
6768 -149902 -117399 128036 -381655 -88494 154142 -86518 154358 171213 -179563 -76703 273748
6756 -141538 -122592 69020 -88376 165047 -266946 -1149 93026 -159320 28218 -94378 177165
6744 -146394 48158 -18943 -108657 49391 -168352 96016 -186957 -238507 69854 -70495 -47077
6733 -47077 132496 -298483 -142575 50674 -43802 -51402 65342 24869 -238743 95375 -16018
6721 -7107 -124570 -303549 -161886 -171579 -238145 274138 -156092 77374 -182024 133651 54100
6709 6417 30430 40373 116523 -120451 -186618 43437 75691 114040 -133956 -175720 -86532 44542
6696 -20017 -11705 170669 119630 102710 -236025 283738 -166919 145137 182128 254677 -314458
6684 98108 255966 -234132 243203 -19816 175622 -13815 -49895 -70325 10565 -33757 78884
6672 -146000 26954 -70693 -152561 276312 -299035 165207 25530 -264016 -10771 6381 -18103
6660 50710 207925 57418 212701 -193618 -174030 -23566 -126532 -70809 -1382 257806 47200
6648 -139274 184127 64980 37984 133784 -83549 145939 82704 -40877 -214156 -152868 179922
6636 182639 19486 -38775 66354 150664 134961 200486 -148814 159786 86174 -104861 360749
6624 58942 -6361 -257198 -219106 8712 -183204 328234 -470999 118716 -102187 198704 -4309
6612 201470 402136 -26717 197659 -59991 235172 148694 -68368 -198270 236078 78591 -117154
6600 170738 -185509 -8988 -208047 47740 -104459 109084 -76365 87491 -48074 -60039 -10403
6588 -74537 182452 -167101 -165224 -42853 -170689 28176 -141057 -145648 4977 -7727 -16975 -303162
6576 -303162 123403 -180204 -174650 101343 32928 -16688 -52804 65857 30628 -186341 -190712
6565 -190712 -106176 36406 123123 26908 116955 88666 2738 -10365 -69117 -22169 -293562 88308
6552 -134041 231621 -86171 349409 -295267 -178068 -49353 -84967 22542 -39527 6579 62358
6541 62358 201144 269163 380726 78715 -56864 120366 -111290 8691 -312614 -172499 -237666
6530 -237666 85153 112704 220158 72615 -59468 151259 -36515 -110588 65964 -189551 71 -49928
6517 341499 -107112 165079 182548 -161532 -1564 -103965 -156562 -148131 170868 179220 144751
6506 144751 -83693 -82820 -38398 247538 53669 11203 224184 -9909 159080 61487 -101211
6494 69824 59734 37721 -190745 75800 -66759 -7197 -50512 -86543 -109092 -69540 -188694 107742
6481 136288 -105584 -171886 39496 -45290 -232326 36016 -65065 -106269 88138 45903 119846
6470 119846 147374 251338 89989 265010 -231563 29741 25385 -13311 -380709 -280433 227715
6458 -165564 -15651 -118761 17882 23489 -158004 198161 -257961 -68925 67659 130311 -155253
6446 -110451 -27990 73717 -68458 -105678 113214 -156804 -8994 -40826 114472 -154251 131908
6434 292343 394884 272070 -9601 174523 -93860 67845 84195 -520828 -60269 256830 -20201
6422 -123896 -237728 -59852 -34422 57899 258349 -232060 -199987 148591 -11963 -32222 -311024
6411 -311024 -138148 519646 -161561 -119421 -174052 142688 138587 -66911 -11296 488568 -104806
6399 -28795 -164813 -192326 -72149 35143 7412 168217 64877 -37202 258892 -51799 -288181
6388 -288181 -93597 -174945 -77867 -176165 209877 20887 30009 -309050 285749 -140194 79263
6376 -243361 -11432 184428 21869 -123136 90917 -283737 169285 -76070 47026 -170952 82945
6364 -27809 -65893 -52057 -138311 -73969 -149567 -190968 -221262 -21849 -48130 -77256 -4359 1302
6351 15217 -164758 128824 -361119 -346760 -285726 5447 314169 -212542 -294023 59016 128899
6340 128899 -225305 -102448 31392 -222523 297438 -129560 -115997 -27500 76857 -80711 161470
6328 -289210 -183400 371130 55412 -147474 -86094 89011 21653 307354 -162652 -227858 -166934
6317 -166934 185643 -220930 7464 -55575 -370410 14833 114224 -114660 -249851 -9554 71801
6305 68479 -165000 195153 38913 54424 -62386 -63787 -61866 -277142 14806 29874 -142781
6293 257509 -16038 68815 -135657 -68159 -11612 -11945 -127082 -72483 11952 226518 56588
6281 -15344 -219064 -180752 -84854 248226 -85210 -64150 12793 399996 -138393 49204 112663
6270 112663 147392 87731 -75214 -34463 -219739 92024 62488 -92218 79955 13731 72984
6259 72984 -155531 101874 329090 -828 31447 -39294 -163792 -223628 -122927 213651 -52541
6247 9711 120839 -432527 164591 272026 -164089 66029 -8980 -79672 197442 -73583 -9381
6235 -48625 -159494 -171645 -132800 114596 -65598 -41073 183396 192255 -19741 -118221 68816
6223 174403 -85834 -36184 -90592 136958 -128496 -196610 -204050 22047 422805 -62122 -87078
6212 -87078 -104057 -181765 58762 -14895 -233061 -55107 -28129 200986 66331 109160 68554
6201 68554 7309 52704 190710 94510 -190195 13655 -115662 -255207 50687 27797 -99757
6189 -200902 221242 -127191 111058 93824 -7003 44213 -17223 155693 -79175 -31426 -20673
6178 -20673 -39607 32784 -91934 -119171 149809 39700 162834 -25244 -420447 104731 -120278
6166 -152391 -98083 5233 -159595 61818 -3916 -170641 -289709 200644 -76338 109473 -9040
6154 -64261 106896 -46612 123165 -24179 -7900 73176 -245001 -62338 -287414 -205179 -182797
6143 -182797 -139446 25865 307106 -63226 86259 53593 60387 -15404 -86098 221477 -196899
6131 -240542 205261 -104574 -121222 -55767 -317228 -372 97639 291536 33819 -170612 242650
6119 -119835 -195985 -103172 257974 109083 -240325 -214788 -240446 -201367 -157365 -99891 -135927
6108 -135927 175601 -60099 -25289 -170427 151428 98743 103940 177347 30085 -14651 331279
6096 29221 60771 -54979 -126276 -177460 21487 103924 -239323 -127773 -150966 -169514 113647
6084 -191472 308859 46177 -23537 203635 -166544 -107049 89923 244903 157884 196336 -39885
6072 -77693 30468 38177 -201690 -177765 -254289 5099 -252778 -241858 -136319 -81943 240393
6060 252120 -270202 -176850 -97700 35834 242046 179933 -89038 197570 -4744 46677 -167088
6048 221015 154858 168075 -300624 -170319 146230 130016 21398 -62787 -23157 -31658 -6083
6036 209145 -45918 -142014 784 174056 232315 -44526 284594 64803 -183620 27614 -78510
6024 84485 -609 199579 -523094 -8989 99662 318532 239020 -85841 319723 6127 -22365 -3 30169
6010 88574 -27222 -30699 -154270 -83536 150325 -197647 -61196 -15246 -205856 -79287 -71865
5999 -71865 -39987 143897 42464 -214104 -244387 -22039 -122189 123479 -103574 -104214 -52651
5988 -52651 20056 154833 400683 -62428 -139504 108476 -40264 271889 108618 -26826 277946
5976 8501 -164722 271477 -117529 196511 -24616 12018 -110447 -14427 31815 -206892 14234
5964 -234530 -155142 73441 87463 48426 527064 128008 361826 144767 133511 -99873 144094
5952 -141376 61351 -93406 -15803 -123885 -134482 -43765 184507 46950 99986 61393 119204
5941 119204 -122771 -125621 -447246 44859 -75736 -227373 133896 -90279 -218858 168378 -150938
5929 -145461 -2848 -193838 -267216 416731 150978 84573 133652 160472 -327072 87270 110850
5918 110850 -179676 257684 -86879 -228603 56744 3150 -116574 49442 53164 168203 -139334
5906 197176 194327 -270682 66275 42665 252398 69595 136530 252981 -23585 168831 4742
5894 128380 184000 76135 14967 56687 -336041 116363 32843 -13904 -905 -158065 222985
5882 -30895 -218328 89032 -187754 79883 -25249 -120694 -252858 -237291 24277 154479 8142
5870 13460 192424 -237803 -70698 -152877 -197725 -16676 -219444 -206 153202 73517 -21586
5858 166242 152188 -149239 124358 -9472 -33209 -102295 -186843 17319 -227726 -147874 131954
5846 -323561 -123448 -23798 -305278 -75721 102300 -145013 -95809 129729 -258803 317019
5835 -373586 -169996 -46634 33620 54278 -177196 11891 72657 -148561 125851 -102185 -36636
5823 -126852 48356 50023 -218972 -71778 232292 219512 40399 40986 114527 46897 165727 246176
5811 246176 -376122 10302 5477 129490 48966 153273 191691 -178730 133611 70324 -110779
5799 128664 413856 192255 22614 -183683 -243307 -203210 -117462 236054 -34619 -152786 199731
5787 56614 -1032 174889 -42859 85185 63493 82072 -137892 -81978 300327 176996 44021
5775 87290 -101034 127395 -147640 4355 151706 200420 -111872 33915 -55781 135765 -6615
5763 126697 -38382 132225 -22863 73531 -108202 186322 -88837 13599 93494 -60158 92610
5751 -41877 199529 51331 -157280 29215 239571 64763 21290 8755 -337750 236924 -299808
5739 -131311 180508 -40904 -31346 12449 241026 113420 50946 69666 47340 -122338 -117474
5728 -117474 257838 64952 -264293 -180414 55072 78694 140155 110190 182766 4447 -70729
5716 104977 174523 -180410 -88593 466963 -162438 -234981 535729 177864 139263 -149878
5705 64635 -45362 -79367 63329 44750 -99968 -20507 -56979 59511 -193396 287487 -16893
5693 -163860 -271891 -22222 -136577 -81413 -151166 -103837 -57760 -20652 161553 167343 -185286
5681 50 -147491 -278941 -168765 31487 316507 -165574 109242 -164226 36320 -115145 379396
5669 151212 79952 162445 -176734 50038 390949 212070 54334 -13552 151908 341361 166562
5657 -209675 -85794 -452937 -154274 -93001 -101845 72290 119762 218706 22092 32385 -339361
5645 -179292 123885 -51577 -228486 215277 249139 -46307 -172398 -9154 -33733 78380 50092
5634 50092 -73013 -206285 -319881 -151032 20289 135627 376847 -262200 92429 118825 -193832
5622 175303 67162 -25514 -280144 -103495 -36985 107723 4569 -25877 11280 59447 -38892
5610 267192 104644 -58481 -134781 282637 416248 -209991 -104868 208198 -165577 75774
5599 52010 287109 -255235 42677 89638 -242563 -34821 -155410 -62983 150427 -161312 -497
5587 -3968 -204191 15967 -230276 -494753 -84575 32920 -308435 130665 -15400 -43212 57924
5575 -208665 26110 -459013 54960 -147102 115034 -22813 -159380 -35367 203328 -88791 -256961
5564 -256961 9709 70143 -70917 -78421 133555 275952 -131257 -455836 -120825 -95751 -149683
5553 -149683 169165 14859 157951 117934 58766 -91061 91128 158514 12346 179330 -53378
5541 -194551 -20461 251773 147485 -86300 111842 105560 -168548 409585 -16923 143521 120518
5530 120518 57206 147178 139775 -113945 20729 288862 29189 -14475 29273 -41627 -289916
5519 -289916 39412 -155464 -55946 -70852 121929 -167871 187807 -111148 185597 -332757
5508 146637 189524 111265 -66369 103054 -98838 -300550 -142927 101417 197071 -52819 290268
5496 254383 -209964 103910 169442 -251809 333272 -86519 -334548 -233900 -83325 25225
5485 -55792 152386 -160959 -130526 65043 -153670 7661 201401 47889 -23123 -174789 -123029
5474 -123029 148077 121088 331523 16598 385602 -99425 53186 139113 -129501 -105139 -29629
5462 302934 -169331 -267880 -123485 -52366 402448 29612 -159488 -179907 119196 -182194
5451 440532 214517 109474 31815 -203473 123714 -221529 -274259 -75222 118975 -7530 -87431
5440 -87431 277753 -28192 7791 131190 -280661 107354 50057 -244744 -100585 -111723 -202742
5429 -202742 135790 -98181 59688 82784 -331524 37364 -237418 -221196 -258006 -184882 -200084
5418 -200084 58578 -17035 -3933 -136068 -108963 -48032 218097 -51630 185674 25954 13257
5407 13257 -178314 -117153 -316451 220815 282564 -134907 238950 314559 346061 -70579 53247
5395 -320662 265037 85819 237076 -105390 10167 -2898 -218603 5596 -178575 -36870 -17794
5383 272320 138797 216092 5519 -274258 -140337 -50265 57288 -287468 270902 -419237 -29241
5371 -2628 171424 39801 162948 87305 22794 -213473 74479 -158287 -16514 254429 -7395
5359 -194347 -253156 102673 -174998 191237 -232054 131862 -127641 44515 -176524 -278753
5349 -278753 208997 172601 -191341 210640 147358 -60160 -111354 -140511 -162027 -306386 -66128
5337 290808 -61443 202389 3493 316168 -214440 -19792 30251 102346 31248 193696 5391
5325 92306 143977 357887 -23698 11519 -467883 -192261 -80731 -30988 -44517 -72138 165324
5313 -282723 -246052 181237 124235 17613 -87639 -50907 367073 182646 91730 -149464 73217
5301 -93401 163457 216098 -45157 -275506 80712 -174114 184068 -177651 135522 38404 114509
5290 114509 354192 286890 7900 -14340 -1715 18164 -84951 62823 -276121 133513 -128880
5278 -51904 -160830 112561 193504 204922 6646 -269979 161253 -269519 6486 145862 132037
5267 132037 -77402 -65052 77290 23332 -311928 69223 75220 1610 -354706 67640 -15503 -157409
5255 -157409 378212 252585 246420 -93748 -441809 -278325 -25162 104938 -7633 390165 43981
5243 19841 -450407 -98495 94170 147789 88757 197776 -88886 136517 -41234 220485 289630
5232 289630 -43299 -60004 149510 196559 -41941 215847 48821 35359 -31083 6198 73765
5221 73765 -93206 -293785 -159249 -73717 70136 51480 -109203 291283 -131664 -95895 -51650
5210 -51650 -46055 -58701 121966 17982 -138753 -24141 -178518 63586 -194320 -60828 -42004
5199 -42004 -536319 -121272 -54983 -62230 24054 279314 -198133 207764 -133581 -248950 142896
5187 -39135 109081 91098 33199 -267149 109505 269152 -161527 -274410 26590 159912
5177 159912 111641 -43626 -8679 -36917 -199969 94444 -226255 -269430 -259946 -89774 184832
5165 610 -119723 65066 -159851 36685 -59525 217823 271449 -275684 75423 52916 78077
5154 78077 -138177 136025 -99567 20232 76383 -1622 -98531 53656 -1224 134214 -31695 282822
5141 127614 224723 23086 -38321 -89557 338518 39102 -2267 -217517 283084 -75952 -171060
5130 -171060 -184621 196624 100692 -31528 293291 -93980 -137363 16202 179480 -11783 119870
5118 -18236 -224347 -2940 92483 135484 -19204 -127963 121819 -195600 1976 -88027 -161964
5107 -161964 -40370 -51717 239158 -69803 -159700 414611 251905 -139647 204117 156416 -60216
5095 94498 -414537 -143112 197621 45775 -305709 137285 -119927 17997 -49226 92257 453465
5084 453465 -125851 34899 -22500 33651 -266030 -52204 -356397 96410 -233008 15983 116328
5073 116328 61509 174954 -57986 -31564 -202027 81745 111733 171164 -259059 106433 94337
5062 94337 -86669 101844 -51258 40970 -106381 -154580 -418288 -8358 -48150 -23944 -261640
5051 -261640 341645 121091 -149945 -287107 49416 -155944 74120 101685 263661 -185662
5040 -13334 88626 44816 -279138 30590 -256784 -69541 7615 60168 -129973 232466 266053
5029 266053 224839 -63225 221992 -34350 3854 -184879 51603 160951 -83484 25537 -19849
5017 101061 219506 29900 -13615 11700 -232188 -57666 -174426 21927 -140382 128274 54464
5005 -95663 112590 238797 72436 116852 85470 107330 -181028 154114 -12908 531834 -123221
4993 297599 -258485 -44565 177919 52227 401007 -56768 125484 151319 28566 425248 -332575
4981 -11014 -60269 114116 -130433 -330352 -238268 -177031 -148064 -266135 163557 210939 252764
4970 252764 239791 -166154 171883 210862 31179 278905 -76576 70789 256829 271102 -17786
4958 321463 -182874 304608 356412 77882 60688 253443 9879 -380541 -37864 55373 15379
4946 22683 69672 -171215 21006 199029 -4259 77999 131897 108250 56090 44705 -75109 -223275
4934 -223275 -106358 6169 152592 68464 105268 -46088 409370 -159931 -38015 -166467 -127363
4923 -127363 -180240 -269667 -113064 214397 160805 214566 -61060 -29892 318053 -37555 -73850
4912 -73850 124232 -118740 -126630 -152013 -68429 183138 392095 16068 27480 46648 64877
4901 64877 15478 108014 124216 -46563 34859 13975 56679 -170468 133241 226609 -57171
4889 -268 142758 -42379 -28119 -5609 21342 333207 -112872 -60814 93883 92082 150104 140824
4877 140824 -61161 22227 159820 -22456 -110796 163066 -73137 -102374 12789 -63471 286370
4865 -172258 50729 61097 -28165 -279621 -44575 102156 -302389 -55363 -195398 50761 36212
4854 36212 71307 -77589 71248 156559 90339 229779 55025 135564 171980 -217308 402700
4842 -374295 -213057 25259 145740 46119 203607 -213887 144518 -86065 184108 -133764
4831 -128750 -18411 125104 -375008 263423 -31705 -123517 -130840 -222910 46487 15965 -99539
4819 273662 -65627 253857 -77812 -9566 -73945 342259 -122704 -229605 -53905 258299 -10731
4807 59350 -85128 70789 -93567 92530 -105508 408741 -40644 236756 138382 49715 -216840
4795 -144346 -192986 -207775 -57801 -235292 87148 64546 149014 235661 151381 -233749 133403
4783 1299 45477 169835 246122 38852 266828 18420 -44877 -165846 -128792 -118141 218309
4771 202508 180255 -146477 -159669 20971 13866 -12394 -457320 5692 13104 114429 -103906
4759 110152 -131575 157107 -72292 158246 12829 266983 177085 -58472 92277 260390 188658
4748 188658 114931 282089 105845 -4864 -210851 226136 -328828 -71150 74950 54253 117999
4737 117999 84849 -45933 122430 106211 50587 -57385 -137777 -311921 38982 135039 184566
4726 184566 -111842 -148352 56882 122246 -141209 -578162 19123 205655 -11810 -3337 216945
4714 314140 -388550 -183086 -19782 -244531 -107706 -158596 -229763 -137571 -114020 38169 -68216
4702 -76560 188023 -319308 -122482 49687 -140517 395590 -22195 78726 92130 -26979 214591
4690 2141 -197386 193838 301137 -258971 -3847 -140627 -338192 202644 114170 154674 319281
4679 319281 -45175 -122839 -98761 -124764 -61097 183003 137080 -111969 378710 -209735 52361
4667 -19746 -7649 48532 -343851 147036 -39646 -28610 -480196 -381797 -110062 64599 -29610
4655 325983 70465 -158187 92155 -176241 -59507 -210301 2120 -218061 105008 -35372 -54054
4644 -54054 -25531 10614 139869 -58782 -70060 115235 283918 27366 -216170 -70696 -79478
4633 -79478 125952 160352 -142268 194124 267934 -56597 -174995 -70749 -132495 -130884 301302
4621 -55840 68130 324796 -116256 -99940 171932 -171854 -331051 241173 128268 -111201
4610 -200069 -93184 328452 -115955 407881 262098 -144634 161283 147087 -39982 187389
4599 -24177 -133322 36405 103589 -68355 191859 168403 104198 -295227 62241 -39430 195123
4587 -52370 413429 57169 -36791 -281855 -34131 -82371 -37463 24548 154450 193191 -153491
4575 127942 206498 87456 -79554 118602 -57421 17933 -335625 382351 -53822 -115962 -9443
4563 378578 140979 -173274 334358 254305 254502 66446 332735 -94246 1993 -215020 22089
4551 163972 -165983 -139888 34819 164139 77452 -357636 173877 138553 4043 132102 200248
4540 200248 -154655 73459 212859 79236 71036 54356 17585 188302 -69999 -123722 62227
4528 154838 -33668 -86873 257128 66980 224159 124772 -29518 -83533 -154194 -170610 184533
4516 -351065 120954 259694 -262892 -204984 124537 167845 -42321 33130 -170877 134097
4505 -135345 -177386 -49745 12625 78228 214719 -165100 1140 59145 132204 24843 93548
$$ [...]
##END NTUPLES=NMR SPECTRUM
##END=
