
##TITLE=AC1322_SRiAH12151_6609742_Z0HcQSkvhB
##JCAMPDX= 6.0         $$ Bruker NMR JCAMP-DX V2.0
##DATA TYPE= NMR SPECTRUM
##DATA CLASS= NTUPLES
##ORIGIN= BRUKER
##OWNER= Administrator
$$ 1.72 TOPSPIN		Version 2.1
$$ 2012-08-01 21:45:53.218 -0500  Administrator@TOPSPIN
$$ Compression mode = diff/dup
##.OBSERVE FREQUENCY= 400.02188249412
##.OBSERVE NUCLEUS= ^1H
##.ACQUISITION MODE= SIMULTANEOUS (DQD)
##.ACQUISITION SCHEME= undefined
##.AVERAGES= 64
##.DIGITISER RES= 22
##SPECTROMETER/DATA SYSTEM= spect
##.PULSE SEQUENCE= noesygpps1d.comp
##.SOLVENT NAME= COFFEE_meoh
##.SHIFT REFERENCE= INTERNAL, COFFEE_meoh, 1, 14.96247
##AUDIT TRAIL= $$ (NUMBER, WHEN, WHO, WHERE, PROCESS, VERSION, WHAT)
$$ ##TITLE= Audit trail, TOPSPIN		Version 2.1
$$ ##JCAMPDX= 5.01
$$ ##ORIGIN= Bruker BioSpin GmbH
$$ ##OWNER= Administrator
$$ $$ C:\Bruker\TOPSPIN/data/COFFEE/nmr/AC1322_SRiAH12151_6609742_Z0HcQSkvhB/12/pdata/1/auditp.txt
$$ ##AUDIT TRAIL=  $$ (NUMBER, WHEN, WHO, WHERE, PROCESS, VERSION, WHAT)
(   1,<2012-08-01 21:45:48.000 -0500>,<Administrator>,<TOPSPIN>,<go>,<TOPSPIN 2.1>,
      <created by zg
	started at 2012-08-01 21:34:17.718 -0500,
	POWCHK enabled, PULCHK disabled,
       configuration hash MD5:
       6B 1B 68 BB D9 2E 58 E2 7F 35 AD 54 07 DF 0E 41
       data hash MD5: 64K
       D6 3A 6A 85 2F A3 7D F4 F9 69 63 5C 16 59 0C 86>)
(   2,<2012-08-01 21:45:50.718 -0500>,<Administrator>,<TOPSPIN>,<proc1d>,<TOPSPIN 2.1>,
      <Start of raw data processing
       efp LB = 0.3 FT_mod = 6 PKNL = 1 PHC0 = 0 PHC1 = 0 SI = 128K 
       data hash MD5: 128K
       F1 38 D4 8B 59 67 8D 65 63 BE 04 8D 8B 6A 48 1F>)
(   3,<2012-08-01 21:45:51.968 -0500>,<Administrator>,<TOPSPIN>,<proc1d>,<TOPSPIN 2.1>,
      <pk PHC0 = -0.2032471 PHC1 = 0 
       data hash MD5: 128K
       F7 C7 6D EA 65 53 44 6E 6F F9 E1 B7 C2 CE C5 CF>)
(   4,<2012-08-01 21:45:52.859 -0500>,<Administrator>,<TOPSPIN>,<proc1d>,<TOPSPIN 2.1>,
      <abs ABSG = 1 
       data hash MD5: 128K
       2C 5B D2 C0 22 E3 DB BF DD 44 C9 35 FB 65 A4 84>)
(   5,<2012-08-01 21:45:52.953 -0500>,<Administrator>,<TOPSPIN>,<proc1d>,<TOPSPIN 2.1>,
      <abs ABSG = 2 
       data hash MD5: 128K
       86 C6 2E 6D 29 AF B1 D9 D2 23 9D 22 06 4F BD FD>)
(   6,<2012-08-01 21:45:53.031 -0500>,<Administrator>,<TOPSPIN>,<proc1d>,<TOPSPIN 2.1>,
      <abs ABSG = 3 
       data hash MD5: 128K
       BD D9 07 9D 75 81 5F D4 38 F1 9C 4B 91 CE A5 14>)
(   7,<2012-08-01 21:45:53.093 -0500>,<Administrator>,<TOPSPIN>,<proc1d>,<TOPSPIN 2.1>,
      <abs ABSG = 4 
       data hash MD5: 128K
       3E 0B CE 6D 5E B0 F6 DD B9 ED 0B 84 74 07 C1 29>)
(   8,<2012-08-01 21:45:53.140 -0500>,<Administrator>,<TOPSPIN>,<proc1d>,<TOPSPIN 2.1>,
      <abs ABSG = 5 
       data hash MD5: 128K
       25 88 1A 38 B4 ED D8 80 19 35 E9 C5 2C 44 1D FC>)
$$ ##END=
$$ 
$$ $$ hash MD5
$$ $$ 6F F5 BF 09 FB 99 24 2F 27 50 2F 9D 33 57 F6 8B
##$RELAX= 
##$RELAX= 
##$RELAX= 
##$RELAX= 
##$RELAX= 
##$RELAX= 
##$RELAX= 
##$RELAX= 
$$ Bruker specific parameters
$$ [...]
##$TP07= 0
##$TPNAME0= <>
##$TPNAME1= <>
##$TPNAME2= <>
##$TPNAME3= <>
##$TPNAME4= <>
##$TPNAME5= <>
##$TPNAME6= <>
##$TPNAME7= <>
##$TPOAL= (0..7)
0.5 0.5 0.5 0.5 0.5 0.5 0.5 0.5
##$TPOFFS= (0..7)
0 0 0 0 0 0 0 0
##$TUNHIN= 0
##$TUNHOUT= 0
##$TUNXOUT= 0
##$USERA1= <user>
##$USERA2= <user>
##$USERA3= <user>
##$USERA4= <user>
##$USERA5= <user>
##$V9= 5
##$VALIST= <valist>
##$VCLIST= <CCCCCCCCCCCCCCC>
##$VD= 0
##$VDLIST= <DDDDDDDDDDDDDDD>
##$VPLIST= <PPPPPPPPPPPPPPP>
##$VTLIST= <TTTTTTTTTTTTTTT>
##$WBST= 1024
##$WBSW= 4
##$XGAIN= (0..3)
0 0 0 0
##$XL= 0
##$YL= 0
##$YMAX_a= 16580497
##$YMIN_a= -9734606
##$ZGOPTNS= <>
##$ZL1= 120
##$ZL2= 120
##$ZL3= 120
##$ZL4= 120
##$ABSF1= 14.96247
##$ABSF2= -5.595712
##$ABSG= 5
##$ABSL= 3
##$ALPHA= 0
##$AQORDER= 0
##$ASSFAC= 0
##$ASSFACI= 0
##$ASSFACX= 0
##$ASSWID= 0
##$AUNMP= <proc_prof1d_extract.lims>
##$AXLEFT= 0
##$AXNAME= <>
##$AXNUC= <1H>
##$AXRIGHT= 0
##$AXTYPE= 0
##$AXUNIT= <>
##$AZFE= 0.1
##$AZFW= 0.1
##$BCFW= 0
##$BC_mod= 0
##$BYTORDP= 0
##$COROFFS= 0
##$CY= 15
##$DATMOD= 1
##$DC= 0
##$DFILT= <>
##$DTYPP= 0
##$F1P= 0
##$F2P= 0
##$FCOR= 0.5
##$FTSIZE= 131072
##$FT_mod= 6
##$GAMMA= 0
##$GB= 0
##$INTBC= 1
##$INTSCL= 1
##$ISEN= 128
##$LB= 0.3
##$LEV0= 0
##$LPBIN= 0
##$MAXI= 10000
##$MC2= 0
##$MEAN= 0
##$ME_mod= 0
##$MI= 0
##$NCOEF= 0
##$NC_proc= -2
##$NLEV= 6
##$NOISF1= 0
##$NOISF2= 0
##$NSP= 0
##$NTH_PI= 0
##$NZP= 0
##$OFFSET= 14.96247
##$PC= 1
##$PHC0= -0.2032471
##$PHC1= 0
##$PH_mod= 1
##$PKNL= yes
##$PPARMOD= 0
##$PPDIAG= 0
##$PPIPTYP= 0
##$PPMPNUM= 2147483647
##$PPRESOL= 1
##$PSCAL= 4
##$PSIGN= 0
##$PYNMP= <proc.py>
##$REVERSE= no
##$SF= 400.02000904755
##$SI= 131072
##$SIGF1= 0
##$SIGF2= 0
##$SINO= 400
##$SIOLD= 131072
##$SPECTYP= <>
##$SREGLST= <1H.CDCl3>
##$SSB= 0
##$STSI= 131072
##$STSR= 0
##$SW_p= 8223.68421052631
##$SYMM= 0
##$S_DEV= 0
##$TDeff= 65536
##$TDoff= 0
##$TI= <>
##$TILT= no
##$TM1= 0
##$TM2= 0
##$TOPLEV= 0
##$USERP1= <user>
##$USERP2= <user>
##$USERP3= <user>
##$USERP4= <user>
##$USERP5= <user>
##$WDW= 1
##$XDIM= 131072
##$YMAX_p= 401789204
##$YMIN_p= -11156
##$CURPLOT= <Network HP LaserJet P1505>
##$CURPRIN= <$Network HP LaserJet P1505>
##$DFORMAT= <normdp>
##$LAYOUT= <+/1D_H.xwp>
##$LFORMAT= <normlp>
##$PFORMAT= <normpl>
##$SURQMSG= 1
$$ End of Bruker specific parameters
$$ ---------------------------------
##NTUPLES= NMR SPECTRUM
##VAR_NAME=  FREQUENCY,     SPECTRUM/REAL,   SPECTRUM/IMAG
##SYMBOL=    X,             R,               I
##VAR_TYPE=  INDEPENDENT,   DEPENDENT,       DEPENDENT
##VAR_FORM=  AFFN,          ASDF,            ASDF
##VAR_DIM=   131072,        131072,          131072
##UNITS=     HZ,            ARBITRARY UNITS, ARBITRARY UNITS
##FACTOR=    0.0627417313425164, 1,          1
##FIRST=     8223.62146879497, -137,         -60969
##LAST=      0,             1830,            -61891
##MIN=       0,             -11156,          0
##MAX=       8223.62146879497, 401789204,    0
$$ Real data points
##PAGE= N=1
##DATA TABLE= (X++(R..R)), XYDATA
$$ [...]
$$ plain form
63213 1107757 1129802 1152084 1174119 1195087 1213958 1229742 1241636 1248810 1250138 1244397 1231025 1210611
63201 1210611 1184387 1153301 1117843 1078719 1037343 995523 954862 916464 880962 848706 820099
63190 820099 795738 775998 760574 748807 740418 735496 733790 734625 737679 743188 751124 760857 772071
63177 772071 785401 801501 819881 839276 858807 878101 896674 914133 930924 947997 965499
63166 965499 982530 998440 1013651 1028729 1043061 1054941 1062803 1065984 1064498 1058476 1047973 1033120
63154 1033120 1014316 992242 967664 941265 913678 885595 857683 830482 804500 780345 758536
63143 758536 739111 721537 705124 689592 675303 662910 652649 644010 636274 629340 623662 619303
63131 619303 615514 611573 607699 604720 603062 602477 602644 603539 605232 607699 610887 614635 618498 621990 625124
$$ packed form
63213A107757K2045K2282K2035K0968J8871J5784J1894P174J328n741j3372k0414
63201A210611k6224l1086l5458l9124m1376m1820m0661l8398l5502l2256k8607
63190H20099k4361j9740j5424j1767q389m922j706Q35L054N509P936R733J1214
63177G72071J3330J6100J8380J9395J9531J9294J8573J7459J6791J7073J7502
63166I65499J7031J5910J5211J5078J4332J1880P862L181j486o022j0503j4853
63154A033120j8804k2074k4578k6399k7587k8083k7912k7201k5982k4155k1809
63143G58536j9425j7574j6413j5532j4289j2393j0261q639p736o934n678m359
63131F19303l789l941l874k979j658n85J67Q95J693K467L188L748L863L492L134
$$ plain form
63116 625124 628477 632597 637493 642725 647821 652583 657137 661813 666902 672514 678560 684757 690625 695796
63102 695796 700461 705322 710854 716737 722122 726238 728677 729537 729597 729959 731056 732202 732501 731931 731091 730244
63086 730244 729261 728334 727990 728355 729084 730205 732425 736297 741518 747317 753245 759350 765898 773167 781352
63071 781352 790546 800894 812661 825851 839871 854041 868490 884148 901790 921460 942842 965688
63059 965688 989798 1015159 1042365 1072398 1105682 1141749 1180117 1220975 1264654 1310910 1359321
63048 1359321 1410091 1463892 1521002 1580975 1642931 1705712 1767976 1828774 1888095 1946387 2003524
63037 2003524 2058685 2111379 2162142 2212042 2261840 2311835 2362145 2412679 2462885 2511786 2558210
63026 2558210 2600799 2637805 2667031 2686046 2692503 2684592 2661623 2624321 2574313 2513282 2442766 2364762
$$ packed form
63116F25124L353M120M896N232N096M762M554M676N089N612O046O197N868N171
63102F95796M665M861N532N883N385M116K439Q60O0L62J097J146K99n70q40q47
63086G30244r83r27l44L65P29J121K220L872N221N799N928O105O548P269Q185
63071G81352R194J0348J1767J3190J4020J4170J4449J5658J7642J9670K1382K2846
63059I65688K4110K5361K7206L0033L3284L6067L8368M0858M3679M6256M8411
63048A359321N0770N3801N7110N9973O1956O2781O2264O0798N9321N8292N7137
63037B003524N5161N2694N0763M9900M9798M9995N0310N0534N0206M8901M6424
63026B558210M2589L7006K9226J9015O457p911k2969l7302n0008o1031p0516p8004
$$ plain form
63014 2364762 2282047 2197448 2112930 2029734 1949325 1873682 1804587 1743028 1689549 1644735 1608943
63003 1608943 1581653 1561522 1547238 1538290 1535010 1537908 1546800 1560528 1577681 1597587 1620268 1645434
62991 1645434 1672105 1699501 1727718 1756977 1786621 1815532 1843241 1869852 1894930 1917308 1936114
62980 1936114 1951240 1962518 1968985 1969350 1962713 1948535 1926341 1895932 1857657 1812160 1760020 1701975
62968 1701975 1639335 1573900 1507489 1441638 1377517 1315901 1257284 1202174 1151216 1104950 1063553
62957 1063553 1026810 994104 964451 936919 911309 888230 868312 851410 836668 823157 810337
62946 810337 798154 786984 777380 769564 763013 756619 749324 740778 731459 722108 712910 703354 693063
62933 693063 682593 673064 665019 657970 651075 643926 636637 629540 622989 617190 612033 607189 602381 597448
$$ packed form
63014B364762q2715q4599q4518q3196q0409p5643o9095o1559n3479m4814l5792
63003A608943k7290k0131j4284q948l280K898Q892J3728J7153J9906K2681K5166
62991A645434K6671K7396K8217K9259K9644K8911K7709K6611K5078K2378J8806
62980A936114J5126J1278O467L65o637j4178k2194l0409l8275m5497n2140n8045
62968A701975o2640o5435o6411o5851o4121o1616n8617n5110n0958m6266m1397
62957A063553l6743l2706k9653k7532k5610k3079j9918j6902j4742j3511j2820
62946H10337j2183j1170r604p816o551o394p295q546r319r351r198r556j0291
62933F93063j0470r529q045p049o895p149p289p097o551n799n157m844m808m933
$$ plain form
62919 597448 592232 586768 581484 576860 572869 569164 565747 562963 560779 558682 556406 554228 552354 550559
62905 550559 548765 547346 546492 545810 545018 544551 544913 545829 546646 547243 547909 548504 548375 547099 544841 542007 538923
62888 538923 535753 532354 528361 523862 519795 517125 515631 514046 511456 508144 505037 502753 501312 500401
62874 500401 499684 499047 498633 498529 498517 498443 498669 499748 501579 503295 504149 504202 503995 503832 503594 503079 502258 501194
62856 501194 499847 498075 495873 493505 491179 488620 485324 481407 477788 475215 473464 471940 470681 470132
62842 470132 470114 469772 468621 467018 465480 464159 463162 462748 462859 462959 462734 462496 462514 462344 461404 459951 458954 459087
62824 459087 460215 461781 463173 463748 463075 461499 460200 460351 462117 464602 466747 468249 469564 471128 472800
62809 472800 474208 475450 477097 479478 482359 485497 489150 493755 499339 505650 512739 521001 530609 541235
$$ packed form
62919E97448n216n464n284m624l991l705l417k784k184k097k276k178j874j795
62905E50559j794j419q54o82p92m67L62R16Q17N97O66N95j29j276k258k834l084
62888E38923l170l399l993m499m067k670j494j585k590l312l107k284j441r11
62874E00401p17o37m14j04j2p4K26J079J831J716Q54N3k07j63k38n15q21j064
62856E01194j347j772k202k368k326k559l296l917l619k573j751j524j259n49
62842D70132j8l42j151j603j538j321r97m14J11J00k25k38J8j70r40j453r97J33
62824D59087J128J566J392N75o73j576j299J51J766K485K145J502J315J564J672
62809D72800J408J242J647K381K881L138L653M605N584O311P089Q262R608J0626
$$ plain form
62795 541235 552486 564362 577162 591046 605808 621110 636988 654148 673674 696218 721589
62784 721589 749275 779236 811936 847753 886823 929491 976482 1028390 1085408 1147735 1215873
62773 1215873 1290101 1370014 1455023 1545088 1640378 1740249 1843027 1946737 2049399 2148557 2241162
62762 2241162 2324377 2396063 2454215 2496435 2520601 2525909 2512802 2482076 2434616 2372002 2296803
62751 2296803 2211911 2119699 2021888 1920114 1816521 1713792 1614313 1519173 1428133 1340831 1257837
62740 1257837 1180293 1108896 1043674 984497 931191 883169 839644 800294 765202 734017 705775
62729 705775 679747 655920 634361 614647 596396 579905 565805 554239 544741 536697 529658 523458
62717 523458 518344 514685 512304 510432 508743 508056 509500 513227 518450 524556 531529 539441 548290 558532
$$ packed form
62795E41235J1251J1876J2800J3884J4762J5302J5878J7160J9526K2544K5371
62784G21589K7686K9961L2700L5817L9070M2668M6991N1908N7018O2327O8138
62773A215873P4228P9913Q5009R0065R5290R9871J02778J03710J02662R9158R2605
62762B241162Q3215P1686N8152M2220K4166N308j3107l0726m7460o2614p5199
62751B296803q4892r2212r7811j01774j03593j02729r9479r5140r1040q7302q2994
62740A257837p7544p1397o5222n9177n3306m8022m3525l9350l5092l1185k8242
62729G05775k6028k3827k1559j9714j8251j6491j4100j1566r498q044p039o200
62717E23458n114l659k381j872j689o87J444L727N223O106O973P912Q849J0242
$$ plain form
62703 558532 571179 587050 606168 628087 652447 679055 707780 738732 772374 809224 849503
62692 849503 893265 940801 992659 1049085 1109414 1172108 1235539 1298798 1361528 1422881 1480817
62681 1480817 1532705 1576496 1611145 1635995 1650108 1652296 1641707 1618417 1583633 1539350 1487616
62670 1487616 1430050 1367984 1302790 1235940 1168948 1103438 1041019 982625 928110 876855 828799
62659 828799 784534 744451 708237 675275 645096 617284 591367 567167 545037 525385 507995
62648 507995 492081 477013 462764 449583 437430 425956 415037 405097 396640 389504 382842 375903
62636 375903 368682 361690 355422 350179 346088 342880 339838 336416 332937 330318 329033 328587 328049 326849 325001
62621 325001 322859 320826 319268 318553 319046 320800 323148 324958 325721 326230 327844 331141 335667 340800 346324
$$ packed form
62703E58532J2647J5871J9118K1919K4360K6608K8725L0952L3642L6850M0279
62692H49503M3762M7536N1858N6426O0329O2694O3431O3259O2730O1353N7936
62681A480817N1888M3791L4649K4850J4113K188j0589k3290l4784m4283n1734
62670A487616n7566o2066o5194o6850o6992o5510o2419n8394n4515n1255m8056
62659H28799m4265m0083l6214l2962l0179k7812k5917k4200k2130j9652j7390
62648E07995j5914j5068j4249j3181j2153j1474j0919r940q457p136o662o939
62636C75903p221o992o268n243m091l208l042l422l479k619j285m46n38j200j848
62621C25001k142k033j558p15M93J754K348J810P63N09J614L297M526N133N524
$$ plain form
62606 346324 352132 358038 364180 371178 379593 389479 400667 413145 426962 442145 459059 478537 501201
62593 501201 526794 554545 584192 616393 652207 692338 736772 784797 835357 887579 940955
62582 940955 994917 1048335 1099653 1147460 1190585 1227589 1256480 1275309 1283137 1280422 1268491 1248690
62570 1248690 1221962 1189028 1150792 1108462 1063329 1016546 969126 922071 876356 832721 791500
62559 791500 752733 716507 683162 653094 626373 602605 581118 561195 542236 523946 506456
62548 506456 490083 474891 460627 447173 434801 423851 414316 405864 398033 390304 382313 374323 367221
62535 367221 361696 357575 354284 351744 350349 350182 350782 351766 353250 355498 358479 361899 365464 369074 372988
62520 372988 377803 384044 391749 400676 410792 422266 435091 449176 464745 482223 501737 523206
$$ packed form
62606C46324N808N906O142O998Q415R886J1188J2478J3817J5183J6914J9478K2664
62593E01201K5593K7751K9647L2201L5814M0131M4434M8025N0560N2222N3376
62582I40955N3962N3418N1318M7807M3125L7004K8891J8829P828k715j1931j9801
62570A248690k6728l2934l8236m2330m5133m6783m7420m7055m5715m3635m1221
62559G91500l8767l6226l3345l0068k6721k3768k1487j9923j8959j8290j7490
62548E06456j6373j5192j4264j3454j2372j0950r535q452p831p729p991p990p102
62535C67221n525m121l291k540j395j67O00R84J484K248K981L420L565L610L914
62520C72988M815O241P705Q927J0116J1474J2825J4085J5569J7478J9514K1469
$$ plain form
62508 523206 546925 573448 602748 634084 666981 701731 738469 776173 813056 847708 879425
62497 879425 907632 931436 949728 961437 965812 962699 952488 935696 912836 884900 853657 821055
62485 821055 788336 755892 723858 692592 662722 634951 609806 587448 567827 551006 537014
62474 537014 525293 514746 504658 495281 487196 480480 474926 470710 468186 467082 466550 466161 466354 467678
62460 467678 469931 472334 474369 476252 478652 482080 486560 491800 497572 503788 510320 516989 523816 530966
62446 530966 538324 545383 551746 557341 561864 564445 564383 561988 558063 552677 545094 534959 522947 510043
62432 510043 496719 483133 469716 457116 445699 435431 426169 417866 410501 403987 398190 393060 388781
62419 388781 385703 384009 383519 384041 385744 388810 392757 396631 400108 404003 409379 416371 424214 432224 440345
$$ packed form
62508E23206K3719K6523K9300L1336L2897L4750L6738L7704L6883L4652L1717
62497H79425K8207K3804J8292J1709M375l113j0211j6792k2860k7936l1243l2602
62485H21055l2719l2444l2034l1266k9870k7771k5145k2358j9621j6821j3992
62474E37014j1721j0547j0088r377q085o716n554m216k524j104n32l89J93J324
62460D67678K253K403K035J883K400L428M480N240N772O216O532O669O827P150
62446E30966P358P059O363N595M523K581o2k395l925n386p583j0135j2012j2904
62432E10043j3324j3586j3417j2600j1417j0268r262q303p365o514n797n130m279
62419C88781l078j694m90N22J703L066L947L874L477L895N376O992P843Q010Q121
$$ plain form
62404 440345 448756 457284 465406 472697 479211 485359 491402 497057 501702 504961 506941 507873 507768 506569 504398
62389 504398 501422 497612 492884 487473 481928 476781 472402 469096 467124 466557 467242 468960 471510 474777 478939
62374 478939 484567 492281 502311 514649 529585 547690 569177 593678 620897 651158 684942 722191
62362 722191 762482 805742 852224 901723 953272 1005780 1058604 1111318 1163204 1213101 1259395
62351 1259395 1299851 1331840 1353314 1363824 1364486 1357005 1342836 1323079 1298704 1270530 1238971 1203947
62339 1203947 1165295 1123439 1079670 1035637 992582 951183 912009 875668 842493 812405 785313
62328 785313 761284 740071 720863 702790 685463 668762 652523 636852 622418 609867 599135
62317 599135 589827 582036 576176 572173 569459 567696 566809 566337 565550 564313 563135 562085 560411 557577 553976
$$ packed form
62404D40345Q411Q528Q122P291O514O148O043N655M645L259J980R32j05j199k171
62389E04398k976l810m728n411n545n147m379l306j972n67O85J718K550L267M162
62374D78939N628P714J0030J2338J4936J8105K1487K4501K7219L0261L3784L7249
62362G22191M0291M3260M6482M9499N1549N2508N2824N2714N1886M9897M6294
62351A259395M0456L1989K1474J0510O62p481j4169j9757k4375k8174l1559l5024
62339A203947l8652m1856m3769m4033m3055m1399l9174l6341l3175l0088k7092
62328G85313k4029k1213j9208j8073j7327j6701j6239j5671j4434j2551j0732
62317E99135r308p791n860m003k714j763q87m72p87j237j178j050j674k834l601
$$ plain form
62302 553976 550196 546160 541509 536323 530882 525164 519220 513781 509860 507829 507253 507487 508086 508846 509863
62287 509863 511407 513490 515889 518861 523283 529515 536543 543016 548905 555389 563217 571969 580975 590238
62273 590238 600242 611458 624162 638253 653080 668028 683484 700679 720373 742175 765448
62262 765448 790310 817420 847265 880189 916711 957198 1001334 1048343 1097580 1148310 1198893
62251 1198893 1246662 1288886 1323673 1349938 1366926 1374191 1372034 1361698 1344945 1323368 1297958 1269039
62239 1269039 1236414 1199777 1159373 1116488 1073062 1030639 989865 951144 915433 883883 856839
62228 856839 833676 813673 796540 782036 769618 758864 749835 742641 736866 731871 727478 723890 720952
62215 720952 717912 714119 709736 705685 702946 701897 702069 702498 702481 702132 702155 703121 705124 708068 711942 716626
$$ packed form
62302E53976l780m036m651n186n441n718n944n439l921k031n76K34N99P60J017
62287E09863J544K083K399K972M422O232P028O473N889O484P828Q752R006R263
62273E90238J0004J1216J2704J4091J4827J4948J5456J7195J9694K1802K3273
62262G65448K4862K7110K9845L2924L6522M0487M4136M7009M9237N0730N0583
62251A198893M7769M2224L4787K6265J6988P265k157j0336j6753k1577k5410k8919
62239A269039l2625l6637m0404m2885m3426m2423m0774l8721l5711l1550k7044
62228H56839k3163k0003j7133j4504j2418j0754r029p194n775m995m393l588k938
62215G20952l040l793m383m051k739j049J72M29j7l49K3R66K003K944L874M684
$$ plain form
62199 716626 721783 727274 733577 741336 750427 759862 768846 777767 787877 800193 814927 831801 850394
62186 850394 870041 889831 909030 927461 945248 962247 977946 991968 1004558 1016574 1028973
62175 1028973 1042252 1056352 1071140 1087004 1104882 1125713 1149957 1177653 1208679 1242803 1279604
62164 1279604 1318465 1358516 1398466 1436635 1471434 1501765 1526904 1546208 1559269 1566355 1568425 1566629
62152 1566629 1561824 1554500 1544854 1532833 1518314 1501459 1482871 1463336 1443489 1423866 1405266 1388833
62140 1388833 1375475 1365168 1357035 1350294 1344961 1341474 1339888 1339822 1341059 1343604 1347055 1350527 1353557 1356739
62126 1356739 1361092 1367145 1375031 1385059 1397527 1412042 1427684 1443981 1461273 1480003 1500030 1520856
62114 1520856 1542214 1564208 1587057 1610889 1635658 1661139 1687151 1713842 1741601 1770610 1800647
$$ packed form
62199G16626N157N491O303P759R091R435Q984Q921J0110J2316J4734J6874J8593
62186H50394J9647J9790J9199J8431J7787J6999J5699J4022J2590J2016J2399
62175A028973J3279J4100J4788J5864J7878K0831K4244K7696L1026L4124L6801
62164A279604L8861M0051L9950L8169L4799L0331K5139J9304J3061P086K070j796
62152A566629m805p324r646j2021j4519j6855j8588j9535j9847j9623j8600j6433
62140A388833j3358j0307q133o741n333l487j586o6J237K545L451L472L030L182
62126A356739M353O053P886J0028J2468J4515J5642J6297J7292J8730K0027K0826
62114A520856K1358K1994K2849K3832K4769K5481K6012K6691K7759K9009L0037
$$ plain form
62103 1800647 1831400 1862829 1895066 1928086 1961648 1995565 2029941 2065086 2101205 2138225 2176013
62092 2176013 2214748 2254950 2297060 2341177 2387296 2435531 2485694 2536659 2586486 2633487 2677265
62081 2677265 2718816 2759764 2801495 2844860 2890371 2938193 2987562 3036337 3081834 3122588 3159284
62070 3159284 3193933 3228571 3264985 3305066 3350420 3401383 3456807 3515005 3574633 3634640 3693763
62059 3693763 3750344 3802653 3849439 3890374 3925934 3956711 3982877 4004433 4021687 4035085 4044689
62048 4044689 4050243 4051733 4049471 4043623 4034119 4021252 4006060 3989841 3973378 3956689 3939467 3921761
62036 3921761 3904322 3888092 3873142 3858356 3842599 3826095 3810194 3795825 3782678 3769965 3757393
62025 3757393 3745117 3733169 3721361 3709628 3698197 3687477 3677859 3669541 3662509 3656698 3652063 3648443
$$ packed form
62103A800647L0753L1429L2237L3020L3562L3917L4376L5145L6119L7020L7788
62092B176013L8735M0202M2110M4117M6119M8235N0163N0965M9827M7001M3778
62081B677265M1551M0948M1731M3365M5511M7822M9369M8775M5497M0754L6696
62070C159284L4649L4638L6414M0081M5354N0963N5424N8198N9628O0007N9123
62059C693763N6581N2309M6786M0935L5560L0777K6166K1556J7254J3398R604
62048D044689N554J490k262n848r504j2867j5192j6219j6463j6689j7222j7706
62036C921761j7439j6230j4950j4786j5757j6504j5901j4369j3147j2713j2572
62025C757393j2276j1948j1808j1733j1431j0720r618q318p032n811m635l620
$$ plain form
62013 3648443 3645645 3643856 3643581 3644746 3646288 3647222 3647855 3649149 3651155 3653070 3654817 3657413 3661382 3665814 3669527
61998 3669527 3672341 3674511 3675644 3674926 3671833 3665824 3655869 3641213 3622348 3600372 3575578 3547432 3515785
61985 3515785 3481308 3444784 3406783 3368112 3329731 3291952 3254328 3216635 3179436 3143340 3108170
61974 3108170 3073274 3038390 3003848 2970095 2937300 2905392 2874270 2843968 2814638 2786339 2758942
61963 2758942 2732386 2706901 2682776 2659934 2638059 2617073 2597139 2578143 2559561 2541066 2522980
61952 2522980 2505839 2489700 2474161 2459022 2444627 2431481 2419758 2409297 2400006 2392076 2385784 2381139
61940 2381139 2377813 2375403 2373771 2373236 2374427 2377868 2383576 2391220 2400803 2413052 2428894 2448679 2472159
61927 2472159 2499118 2529667 2564066 2602754 2646594 2696616 2753470 2817702 2890718 2974750 3071456
$$ packed form
62013C648443k798j789k75J165J542R34O33J294K006J915J747K596L969M432L713
61998C669527K814K170J133p18l093o009r955j4656j8865k1976k4794k8146l1647
61985C515785l4477l6524l8001l8671l8381l7779l7624l7693l7199l6096l5170
61974C108170l4896l4884l4542l3753l2795l1908l1122l0302k9330k8299k7397
61963B758942k6556k5485k4125k2842k1875k0986j9934j8996j8582j8495j8086
61952B522980j7141j6139j5539j5139j4395j3146j1723j0461r291p930o292m645
61940B381139l326k410j632n35J191L441N708P644R583J2249J5842J9785K3480
61927B472159K6959L0549L4399L8688M3840N0022N6854O4232P3016Q4032R6706
$$ plain form
61916 3071456 3181205 3304415 3443191 3600945 3780778 3985014 4216201 4477662 4772903
61907 4772903 5105227 5478255 5896307 6363881 6884914 7462355 8097437 8788073 9526962
61898 9526962 10300002 11084790 11849330 12552409 13147173 13587808 13837468 13875038 13698764 13325757
61888 13325757 12787885 12125699 11382132 10597190 9804401 9029408 8290227 7598286 6959762
61879 6959762 6377114 5850403 5377812 4955694 4579160 4243334 3944181 3678114 3441253
61870 3441253 3229515 3039468 2868828 2716003 2579289 2456600 2345914 2245822 2155522 2074290
61860 2074290 2001133 1935047 1875420 1821925 1774099 1731302 1693133 1659540 1630338 1604882 1582418
61849 1582418 1562661 1545762 1531743 1520160 1510359 1501960 1494986 1489537 1485363 1481868 1478580 1475620 1473540
$$ packed form
61916C071456J09749J23210J38776J57754J79833K04236K31187K61461K95241
61907D772903L32324L73028M18052M67574N21033N77441O35082O90636P38889
61898I526962P73040P84788P64540P03079N94764M40635K49660L7570j76274l73007
61888A3325757n37872o62186p43567p84942p92789p74993p39181o91941o38524
61879F959762n82648n26711m72591m22118l76534l35826k99153k66067k36861
61870C441253k11738j90047j70640j52825j36714j22689j10686j00092r0300q1232
61860B074290p3157o6086n9627n3495m7826m2797l8169l3593k9202k5456k2464
61849A582418j9757j6899j4019j1583r801q399o974n449m174l495l288k960k080
$$ plain form
61836 1473540 1472712 1473002 1474078 1475771 1477979 1480415 1482844 1485600 1489511 1495037 1501589 1507998 1513721 1519384
61822 1519384 1526077 1534282 1543669 1553792 1564661 1576553 1589587 1603823 1619687 1637967 1659240 1683466
61810 1683466 1710317 1739771 1772157 1807647 1846069 1887473 1932672 1982842 2038559 2099556 2165550
61799 2165550 2237007 2314889 2399877 2492169 2591946 2699783 2816636 2943703 3082242 3233291
61789 3233291 3397657 3576552 3772419 3988890 4229853 4498648 4798121 5131195 5501418
61780 5501418 5913310 6372345 6884424 7455322 8090882 8797764 9583596 10456054 11421611
61771 11421611 12484494 13645433 14899600 16233867 17623600 19029294 20394474 21647265
61763 21647265 22706927 23494341 23944309 24017261 23707203 23042508 22078922 20888214 19547032
$$ packed form
61836A473540q28K90J076J693K208K436K429K756L911N526O552O409N723N663
61822A519384O693Q205R387J0123J0869J1892J3034J4236J5864J8280K1273K4226
61810A683466K6851K9454L2386L5490L8422M1404M5199N0170N5717O0997O5994
61799B165550P1457P7882Q4988R2292R9777J07837J16853J27067J38539J51049
61789C233291J64366J78895J95867K16471K40963K68795K99473L33074L70223
61780E501418M11892M59035N12079N70898O35560P06882P85832Q72458R65557
61771A1421611J062883J160939J254167J334267J389733J405694J365180J252791
61763B1647265J059662P87414M49968P2952l10058o64695r63586j190708j341182
$$ plain form
61754 19547032 18128052 16693457 15291232 13954962 12706173 11556982 10511930 9569640
61746 9569640 8724832 7970247 7297945 6699984 6168637 5696318 5275628 4899856 4563449
61737 4563449 4261881 3991234 3748176 3530150 3335045 3160416 3003251 2860587 2730254
61728 2730254 2611025 2502249 2403376 2313657 2232152 2157977 2090453 2028941 1972598 1920406 1871412
61717 1871412 1825001 1781188 1740530 1703382 1669096 1636389 1604698 1574687 1547066 1521445 1496922
61706 1496922 1473384 1451445 1431209 1411854 1392473 1372699 1352425 1331614 1310663 1290419 1271410
61695 1271410 1253327 1235555 1217964 1201032 1185362 1171243 1158435 1146267 1134115 1121912 1110103
61684 1110103 1099110 1088996 1079633 1070871 1062555 1054610 1047126 1040147 1033403 1026607 1020026 1014378 1010007
$$ packed form
61754A9547032j418980j434595j402225j336270j248789j149191j045052r42290
61746I569640q44808p54585o72302n97961n31347m72319m20690l75772l36407
61737D563449l01568k70647k43058k18026j95105j74629j57165j42664j30333
61728B730254j19229j08776r8873q9719q1505p4175o7524o1512n6343n2192m8994
61717A871412m6411m3813m0658l7148l4286l2707l1691l0011k7621k5621k4523
61706A496922k3538k1939k0236j9355j9381j9774k0274k0811k0951k0244j9009
61695A271410j8083j7772j7591j6932j5670j4119j2808j2168j2152j2203j1809
61684A110103j0993j0114r363q762q316p945p484o979o744o796o581n648m371
$$ plain form
61671 1010007 1006391 1002613 998105 992887 987324 981776 976339 970849 965181 959410 953495 947059 939917 932712
61657 932712 926530 921736 917603 913228 908494 904016 900432 897927 896168 894531 892565 890306 888064 886000
61643 886000 884181 882887 882464 882862 883764 885154 887298 890148 893223 896239 899386 902816 906329 909756 913242
61628 913242 916939 920848 925128 930030 935199 939548 942251 943528 944050 943941 942897 940998 938793 936558 933968
61613 933968 930618 926530 922043 917368 912407 906916 900780 894065 886830 879047 870839 862646 854877 847593
61599 847593 840829 834998 830446 826740 823090 819513 816851 815465 814711 814133 814409 816519 820524 825753 831782
61584 831782 838516 845734 853353 861964 872412 884826 898617 913346 929154 946495 965971 988258
61572 988258 1013512 1040848 1068993 1097489 1126794 1157216 1188432 1220079 1252150 1284507 1316614
$$ packed form
61671A010007l616l778m508n218n563n548n437n490n668n771n915o436p142p205
61657I32712o182m794m133m375m734m478l584k505j759j637j966k259k242k064
61643H86000j819j294m23L98R02J390K144K850L075L016L147L430L513L427L486
61628I13242L697L909M280M902N169M349K703J277N22j09j044j899k205k235k590
61613I33968l350m088m487m675m961n491o136o715p235p783q208q193p769p284
61599H47593o764n831m552l706l650l577k662j386p54n78K76K110M005N229O029
61584H31782O734P218P619Q611J0448J2414J3791J4729J5808J7341J9476K2287
61572I88258K5254K7336K8145K8496K9305L0422L1216L1647L2071L2357L2107
$$ plain form
61561 1316614 1348089 1379070 1409605 1438992 1466117 1490361 1511984 1531836 1550842 1569483 1587410
61550 1587410 1603648 1617339 1628221 1636317 1641440 1643248 1641600 1636593 1628348 1617050 1603200 1587592
61538 1587592 1570940 1553634 1535888 1518067 1500843 1485010 1471090 1459150 1449110 1441230 1436076 1433953
61526 1433953 1434619 1437856 1444161 1454486 1469252 1487998 1510251 1536468 1567817 1605195 1648870 1699096
61514 1699096 1756662 1822621 1897807 1982906 2078754 2186266 2306134 2438906 2585366 2746647
61504 2746647 2924028 3118851 3332385 3565129 3815870 4081360 4356738 4635774 4910474
61495 4910474 5170785 5405174 5602023 5751346 5846356 5884398 5866778 5797915 5684615 5535474
61485 5535474 5359802 5166262 4962383 4755136 4551143 4355707 4171891 4001074 3844270
$$ packed form
61561A316614L1475L0981L0535K9387K7125K4244K1623J9852J9006J8641J7927
61550A587410J6238J3691J0882Q096N123J808j648n007q245j1298j3850j5608
61538A587592j6652j7306j7746j7821j7224j5833j3920j1940j0040p880n154k123
61526A433953O66L237O305J0325J4766J8746K2253K6217L1349L7378M3675N0226
61514A699096N7566O5959P5186Q5099R5848J07512J19868J32772J46460J61281
61504B746647J77381J94823K13534K32744K50741K65490K75378K79036K74700
61495D910474K60311K34389J96849J49323R5010L8042j7620o8863j13300j49141
61485E535474j75672j93540k03879k07247k03993j95436j83816j70817j56804
$$ plain form
61476 3844270 3702584 3576673 3466485 3371822 3292785 3229391 3180938 3146019 3123209 3111655 3110951
61465 3110951 3120534 3139432 3166706 3201880 3244520 3293392 3346482 3401971 3458820 3516218 3572935
61454 3572935 3627683 3679839 3729346 3776079 3819864 3861186 3901411 3942075 3984129 4027934 4073702
61443 4073702 4121600 4171515 4222946 4275355 4328462 4381882 4434279 4483231 4526394 4562800 4592635
61432 4592635 4615816 4631385 4638361 4636582 4626253 4607278 4579639 4544231 4502757 4456928 4408211 4358184
61420 4358184 4308579 4260811 4215817 4174363 4137188 4104888 4077917 4056711 4041517 4032087 4027802 4028019
61408 4028019 4032003 4038557 4046084 4053022 4058025 4059828 4057415 4050459 4039377 4024882 4007768 3989133 3970512
61395 3970512 3953735 3940934 3934719 3937923 3952860 3980936 4023094 4080461 4154423 4246292 4357195
$$ packed form
61476C844270j41686j25911j10188r4663p9037o3394m8453l4919k2810j1554p04
61465C110951R583J8898K7274L5174M2640M8872N3090N5489N6849N7398N6717
61454C572935N4748N2156M9507M6733M3785M1322M0225M0664M2054M3805M5768
61443D073702M7898M9915N1431N2409N3107N3420N2397M8952M3163L6406K9835
61432D592635K3181J5569O976j779j0329j8975k7639l5408m1474m5829m8717n0027
61420D358184m9605m7768m4994m1454l7175l2300k6971k1206j5194r430m285K17
61408D028019L984O554P527O938N003J803k413o956j1082j4495j7114j8635j8621
61395C970512j6777j2801o215L204J4937K8076M2158N7367P3962R1869J10903
$$ plain form
61384 4357195 4488205 4640320 4814272 5010430 5228884 5469352 5730680 6010237 6303648
61375 6303648 6604925 6906529 7199133 7471597 7711800 7908278 8051963 8137486 8163829 8133978
61365 8133978 8053481 7928700 7765840 7570862 7349406 7106488 6846649 6574589 6295407 6014065
61355 6014065 5734914 5461770 5197971 4946019 4707454 4483315 4274465 4081347 3903864
61346 3903864 3741798 3595123 3463728 3347340 3245927 3159661 3088088 3029885 2983812 2949434
61336 2949434 2926461 2913967 2910911 2916904 2931674 2954210 2983217 3018124 3058747 3104179 3152977 3204310
61324 3204310 3257897 3312679 3366521 3417611 3465538 3510697 3553144 3592247 3627070 3657029 3682611
61313 3682611 3705351 3726567 3746178 3763391 3778265 3791633 3803485 3812453 3817122 3816814 3810770 3797713
$$ packed form
61384D357195J31010J52115J73952J96158K18454K40468K61328K79557K93411
61375F303648L01277L01604K92604K72464K40203J96478J43685Q5523K6343k9851
61365H133978q0497j24781j62860j94978k21456k42918k59839k72060k79182k81342
61355F014065k79151k73144k63799k51952k38565k24139k08850j93118j77483
61346C903864j62066j46675j31395j16388j01413q6266p1573n8203m6073l4378
61336B949434k2973j2494l056N993J4770K2536K9007L4907M0623M5432M8798N1333
61324C204310N3587N4782N3842N1090M7927M5159M2447L9103L4823K9959K5582
61313C682611K2740K1216J9611J7213J4874J3368J1852Q968M669l08o044j3057
$$ plain form
61301 3797713 3777065 3749797 3717275 3679790 3636918 3588807 3536283 3479966 3420112 3357283 3292704
61290 3292704 3228019 3165003 3105180 3049311 2997442 2949812 2907382 2871135 2841168 2816902 2797805
61279 2797805 2783360 2772630 2764498 2758222 2753233 2748523 2742770 2735036 2724934 2712246 2696930 2679539
61267 2679539 2661245 2643371 2627183 2613950 2604684 2599740 2599099 2603032 2612113 2626607 2646450 2672194
61255 2672194 2705558 2748640 2802704 2868034 2944844 3033841 3135626 3249704 3374292 3506924
61245 3506924 3644801 3784267 3920192 4046201 4155378 4240506 4294184 4309857 4283738 4216010
61235 4216010 4110517 3973757 3813959 3639908 3459445 3278667 3102372 2934526 2777794
61226 2777794 2633056 2500103 2378783 2269042 2170219 2081089 2000799 1929227 1866247 1811078
$$ packed form
61301C797713k0648k7268l2522l7485m2872m8111n2524n6317n9854o2829o4579
61290C292704o4685o3016n9823n5869n1869m7630m2430l6247k9967k4266j9097
61279B797805j4445j0730q132o276m989m710n753p734j0102j2688j5316j7391
61267B679539j8294j7874j6188j3233r266m944o41L933R081J4494J9843K5744
61255B672194L3364M3082N4064O5330P6810Q8997J01785J14078J24588J32632
61245C506924J37877J39466J35925J26009J09177Q5128N3678J5673k6119o7728
61235D216010j05493j36760j59798j74051j80463j80778j76295j67846j56732
61226B777794j44738j32953j21320j09741r8823q9130q0290p1572o2980n5169
$$ plain form
61216 1811078 1762614 1720078 1683088 1651243 1623888 1600328 1580207 1563694 1551241 1543128 1539209 1539157
61204 1539157 1542796 1550073 1560802 1574610 1591042 1609604 1629729 1650755 1671782 1691436 1708060 1720423
61192 1720423 1728271 1732064 1732362 1729606 1724249 1716647 1706842 1694707 1680353 1664161 1646365 1626874 1605679
61179 1605679 1583332 1560857 1539057 1517894 1496589 1474418 1451333 1427768 1404011 1380117 1356281
61168 1356281 1332806 1309514 1285607 1260363 1233774 1206336 1178562 1150920 1123905 1097849 1072866
61157 1072866 1049222 1027435 1007735 989755 973121 957999 944553 932071 919101 904404 887479
61146 887479 868437 847935 827079 806869 787657 769514 752925 738638 726887 717322 709710 704194
61134 704194 700779 699085 698686 699241 700255 701331 702827 705720 710517 716743 723755 731520 740207 749541 759130
$$ packed form
61216A811078m8464m2536l6990l1845k7355k3560k0121j6513j2453q113l919n2
61204A539157L639P277J0729J3808J6432J8562K0125K1026K1027J9654J6624J2363
61192A720423P848L793K98k756n357p602r805j2135j4354j6192j7796j9491k1195
61179A605679k2347k2475k1800k1163k1305k2171k3085k3565k3757k3894k3836
61168A356281k3475k3292k3907k5244k6589k7438k7774k7642k7015k6056k4983
61157A072866k3644k1787j9700j7980j6634j5122j3446j2482j2970j4697j6925
61146H87479j9042k0502k0856k0210j9212j8143j6589j4287j1751r565p612n516
61134G04194l415j694l99N55J014J076J496K893M797O226P012P765Q687R334R589
$$ plain form
61119 759130 769044 779462 789950 799838 809306 819437 830969 843503 856232 869004 882221 895985
61107 895985 909776 922866 934537 943900 950016 952489 951681 948171 942305 934519 925692 916595 907145 896765
61093 896765 885527 874364 863982 854065 843858 833116 822157 811367 801037 791389 782372 773573
61081 773573 764669 755828 747469 739878 733305 728046 724010 720548 717155 714091 711773 709895 707820 705659
61067 705659 704207 703792 703889 704004 704268 704979 706111 707482 708863 709709 709381 708059 706968 707234 708750 710462
61051 710462 711576 712157 712770 713867 715490 717428 719604 722273 725663 729664 734290 740302 748716 759551
61037 759551 771654 783968 796419 809252 822187 834753 847018 859385 871952 884590 897329
61026 897329 910113 922382 933537 943745 953737 963826 973679 983088 992440 1002208 1012368 1022657
$$ packed form
61119G59130R914J0418J0488R888R468J0131J1532J2534J2729J2772J3217J3764
61107H95985J3791J3090J1671R363O116K473q08l510n866p786q827r097r450j0380
61093H96765j1238j1163j0382r917j0207j0742j0959j0790j0330r648r017q799
61081G73573q904q841q359p591o573n259m036l462l393l064k318j878k075k161
61067G05659j452m15R7J15K64P11J132J371J381Q46l28j322j091K66J516J712
61051G10462J114N81O13J097J623J938K176K669L390M001M626O012Q414J0835
61037G59551J2103J2314J2451J2833J2935J2566J2265J2367J2567J2638J2739
61026H97329J2784J2269J1155J0208R992J0089R853R409R352R768J0160J0289
$$ plain form
61014 1022657 1033236 1044860 1058370 1074062 1091591 1110487 1130770 1152887 1177148 1203556 1232333
61003 1232333 1264277 1300342 1341103 1386857 1438023 1495096 1558245 1627016 1700248 1776466 1855043
60992 1855043 1937372 2026463 2125157 2235258 2358651 2498190 2656493 2834349 3031393 3248220
60982 3248220 3487291 3752653 4050274 4388618 4777815 5228533 5752912 6366417 7087781
60973 7087781 7938576 8946228 10148596 11594311 13338703 15436709 17919994 20740446
60965 20740446 23699627 26437243 28540763 29737124 30031837 29690054 29090940 28580445 28398968
60956 28398968 28649900 29254141 29921068 30221440 29772735 28422599 26297040 23695596 20935906
60947 20935906 18255659 15795481 13621203 11748018 10159870 8826916 7716916 6797911
$$ packed form
61014A022657J0579J1624J3510J5692J7529J8896K0283K2117K4261K6408K8777
61003A232333L1944L6065M0761M5754N1166N7073O3149O8771P3232P6218P8577
60992A855043Q2329Q9091R8694J10101J23393J39539J58303J77856J97044K16827
60982C248220K39071K65362K97621L38344L89197M50718N24379O13505P21364
60973G087781Q50795J007652J202368J445715J744392K098006K483285K820452
60965B0740446K959181K737616K103520J196361K94713l41783n99114n10495j81477
60956B8398968K50932O04241O66927L00372m48705j350136k125559k601444k759690
60947B0935906k680247k460178k174278j873185j588148j332954j110000r19005
$$ plain form
60939 6797911 6038148 5408519 4884998 4447564 4078077 3760753 3483732 3238507 3018152
60930 3018152 2817187 2632600 2463428 2309020 2168285 2040403 1925229 1822663 1732002 1651814
60920 1651814 1579913 1513492 1449988 1388101 1327836 1269622 1213755 1160645 1111134 1066233 1026496
60909 1026496 991582 960398 931855 905612 881942 860876 841888 824512 808768 794624 781523
60898 781523 768976 757326 747428 739720 734012 729888 726836 724250 721944 720532 720750 722500 725069 728129
60884 728129 731879 736244 740590 744336 747306 749384 750336 750038 748471 745458 740895 735198 728990 722346 715000
60869 715000 707343 700468 694911 689963 684597 678575 672328 666229 660435 655137 650597 647114 645088 644797
60855 644797 645961 647919 650447 653972 658833 664772 671385 678672 686878 696230 707043 719671 734039
$$ packed form
60939F797911p59763o29629n23521m37434l69487l17324k77021k45225k20355
60930C018152k00965j84587j69172j54408j40735j27882j15174j02566r0661q0188
60920A651814p1901o6421o3504o1887o0265n8214n5867n3110m9511m4901l9737
60909A026496l4914l1184k8543k6243k3670k1066j8988j7376j5744j4144j3101
60898G81523j2547j1650r898p708n708m124l052k586k306j412K18J750K569L060
60884G28129L750M365M346L746K970K078R52k98j567l013m563n697o208o644p346
60869G15000p657o875n557m948n366o022o247o099n794n298m540l483k026k91
60855F44797J164J958K528L525M861N939O613P287Q206R352J0813J2628J4368
$$ plain form
60842 734039 749599 765921 782823 799811 816096 831536 846791 862001 875943 887205 895670 902195
60830 902195 907358 911374 914807 918355 922065 925596 929137 933103 936870 938772 937763 934439 930155 925674
60816 925674 921025 916130 911061 905792 900046 893397 885521 876451 866576 856182 845135 833203 820623
60803 820623 808023 795926 784654 774555 765843 758248 751233 744669 738968 734535 731424 729505 728621
60790 728621 728582 729366 731300 734653 739112 744155 749973 757422 766829 777376 788017 798656 809986 822470
60776 822470 835874 849637 863232 876087 887577 897494 906507 915867 926345 937417 947679 956102
60764 956102 962684 967896 971974 975049 977588 980104 982521 984272 985131 985589 986330 987576 989030 990168 990560
60749 990560 990047 988701 986649 984078 981519 979747 979115 979121 978861 977688 975220 971164 965694 959660 953798 947848
$$ packed form
60842G34039J5560J6322J6902J6988J6285J5440J5255J5210J3942J1262Q465O525
60830I02195N163M016L433L548L710L531L541L966L767J902j009l324m284m481
60816I25674m649m895n069n269n746o649p876r070r875j0394j1047j1932j2580
60803H20623j2600j2097j1272j0099q712p595p015o564n701m433l111j919q84
60790G28621l9P84J934L353M459N043N818P449R407J0547J0641J0639J1330J2484
60776H22470J3404J3763J3595J2855J1490R917R013R360J0478J1072J0262Q423
60764I56102O582N212M078L075K539K516K417J751Q59M58P41J246J454J138L92
60749I90560n13j346k052k571k559j772o32Ok60j173k468m056n470o034n862n950
$$ plain form
60733 947848 941021 933206 925049 916980 908956 901219 894495 889125 884635 880531 877036 874682 873583 873429
60719 873429 873940 875035 876753 879154 882053 884824 886713 887352 886671 884486 880703 875822 870585 865060 858771
60704 858771 851879 845450 840276 836150 832661 829970 828340 827580 827531 828464 830261 831708 831409 829160 825727
60689 825727 821528 816229 809506 801461 792264 781999 770967 759637 748240 736747 725285 714177
60677 714177 703619 693769 685165 678551 674087 671050 668515 666150 664273 663379 663737 665287 667771 670930
60663 670930 674543 678305 681818 684867 687584 690239 692942 695621 698093 700027 701086 701379 701632 702686 704928
60648 704928 708263 712395 716937 721539 726204 731223 736511 741328 745014 747793 750373 753021 755619 758540
60634 758540 762738 768772 776204 784235 792586 801588 811690 823073 835490 848331 861052 873714 886904
$$ packed form
60733I47848o827p815q157q069q024p737o724n370m490m104l495k354j099j54
60719H73429N11J095J718K401K899K771J889O39o81k185l783m881n237n525o289
60704H58771o892o429n174m126l489k691j630p60m9R33J797J447k99k249l433
60689H25727m199n299o723q045r197j0265j1032j1330j1397j1493j1462j1108
60677G14177j0558r850q604o614m464l037k535k365j877q94L58J550K484L159
60663F70930L613L762L513L049K717K655K703K679K472J934J059K93K53J054K242
60648G04928L335M132M542M602M665N019N288M817L686K779K580K648K598K921
60634G58540M198O034P432Q031Q351R002J0102J1383J2417J2841J2721J2662J3190
$$ plain form
60621 886904 900972 915497 929547 942282 953162 961884 968383 972835 975464 976340 975434 972775 968476
60608 968476 962780 956279 950007 945027 941708 939486 937446 935182 932992 931207 929481 926875 922545 916175
60594 916175 907861 898009 887486 877416 868407 860130 852100 844796 839553 837228 837388 838970 841312 844105
60580 844105 846629 847713 846708 844140 841183 838646 836710 835373 834698 834609 834876 835548 837114 839975 843835
60565 843835 847826 851152 853503 855014 856082 857123 858205 858965 859025 858359 857064 854920 851667 847642 843744
60550 843744 840691 838690 837880 838661 841380 846022 852436 860604 870539 882266 896150 912947 933311 957450
60536 957450 985524 1018101 1055848 1098849 1146315 1196665 1247532 1295762 1337783 1370158 1390036
60525 1390036 1395657 1386902 1365456 1334295 1297077 1257794 1220180 1186752 1158485 1135687 1118911 1108614
$$ packed form
60621H86904J4068J4525J4050J2735J0880Q722O499M452K629Q76r06k659m299
60608I68476n696o501o272m980l319k222k040k264k190j785j726k606m330o370
60594I16175q314r852j0523j0070r009q277q030p304n243k325J60J582K342K793
60580H44105K524J084j005k568k957k537j936j337o75q9K67O72J566K861L860
60565H43835L991L326K351J511J068J041J082P60O0o66j295k144l253m025l898
60550H43744l053k001q10P81K719M642O414Q168R935J1727J3884J6797K0364K4139
60536I57450K8074L2577L7747M3001M7466N0350N0867M8230M2021L2375J9878
60525A390036N621q755k1446l1161l7218l9283l7614l3428k8267k2798j6776j0297
$$ plain form
60513 1108614 1104274 1104668 1109044 1117404 1129413 1143649 1158377 1172776 1187010 1201386 1215949 1230940
60501 1230940 1247284 1266485 1290128 1319468 1355272 1397996 1448296 1507510 1577472 1659754 1755199
60490 1755199 1864254 1987425 2124993 2276514 2441241 2619335 2812481 3023468 3255898
60481 3255898 3514619 3805562 4133741 4500081 4898564 5314228 5722574 6091988 6389567
60472 6389567 6587481 6666499 6617115 6441000 6152596 5777607 5347367 4892390 4438422 4004871
60462 4004871 3604235 3242607 2921461 2639468 2393467 2179410 1993754 1833940 1697260
60453 1697260 1579995 1478363 1389823 1312742 1245248 1185313 1131783 1084444 1043094 1007081 975607
60442 975607 947759 922292 898083 874915 853277 833398 814953 797687 781681 766862 752768
$$ packed form
60513A108614m340L94M376Q360J2009J4236J4728J4399J4234J4376J4563J4991
60501A230940J6344J9201K3643K9340L5804M2724N0300N9214O9962Q2282R5445
60490A755199J09055J23171J37568J51521J64727J78094J93146K10987K32430
60481C255898K58721K90943L28179L66340L98483M15664M08346L69414K97579
60472F389567J97914P9018m9384j76115k88404l74989m30240m54977m53968m33551
60462D004871m00636l61628l21146k81993k46001k14057j85656j59814j36680
60453A697260j17265j01632q8540p7081o7494n9935n3530m7339m1350l6013l1474
60442I75607k7848k5467k4209k3168k1638j9879j8445j7266j6006j4819j4094
$$ plain form
60431 752768 739100 726195 714734 705122 697154 690157 683530 677341 672265 668777 666644 665387 664800 664624
60417 664624 664140 662794 661094 660212 660743 662426 664971 668448 672684 676870 680126 682265 683894 685997 689328
60402 689328 693869 698869 703616 708078 712535 716950 721203 725653 730819 736560 742254 747738 753413 759337
60388 759337 764883 769444 772954 775514 777065 777599 777166 775545 772423 768128 763666 759792 756411 753094 749723
60373 749723 746438 743440 741114 739927 739893 740496 741411 742911 745302 748364 751620 754850 757970 760739 762936
60358 762936 764728 766595 769024 772359 776671 781614 786681 791743 797134 803111 809613 816680 824595 833307
60344 833307 842110 850367 858293 866591 875464 884383 892729 900234 906774 912045 915656 917463 917785 917301 916703
60329 916703 916396 916512 917192 918714 921406 925507 930973 937222 943193 947944 951206 953080 953334 951396 947073
$$ packed form
60431G52768j3668j2905j1461r612p968o997o627o189n076l488k133j257n87j76
60417F64624m84j346j700q82N31J683K545L477M236M186L256K139J629K103L331
60402F89328M541N000M747M462M457M415M253M450N166N741N694N484N675N924
60388G59337N546M561L510K560J551N34m33j621l122m295m462l874l381l317l371
60373G49723l285k998k326j187l4O03R15J500K391L062L256L230L120K769K197
60358G62936J792J867K429L335M312M943N067N062N391N977O502P067P915Q712
60344H33307Q803Q257P926Q298Q873Q919Q346P505O540N271L611J807L22m84n98
60329I16703l07J16O80J522K692M101N466O249N971M751L262J874K54j938m323
$$ plain form
60314 947073 940852 933425 925331 917179 909730 903466 898338 894201 891182 889339 888237 887244 886208 885586 885822
60299 885822 886742 887615 887896 887928 888783 891253 895162 899840 904976 910601 916412 921694 926011 929517 932540 935245
60283 935245 937730 940009 941839 943032 944020 945551 947662 949579 950936 952587 955744 960650 966556 972781
60269 972781 979388 986925 995820 1006065 1017403 1029924 1044399 1061782 1082313 1105443 1130534 1157289
60257 1157289 1185622 1215806 1248910 1286363 1328739 1375503 1426279 1481735 1542808 1609728 1682536
60246 1682536 1762116 1849853 1946337 2051016 2163080 2282093 2407708 2539134 2674864 2812585
60236 2812585 2949308 3081911 3207720 3324639 3430961 3525233 3606062 3671931 3721501 3754305
60226 3754305 3770844 3771835 3757805 3729839 3690223 3641851 3587292 3528971 3469865 3413237 3361720 3317221
$$ packed form
60314I47073o221p427q094q152p449o264n128m137l019j843j102r93j036o22K36
60299H85822R20Q73K81L2Q55K470L909M678N136N625N811N282M317L506L023K705
60283I35245K485K279J830J193R88J531K111J917J357J651L157M906N906O225
60269I72781O607P537Q895J0245J1338J2521J4475J7383K0531K3130K5091K6755
60257A157289K8333L0184L3104L7453M2376M6764N0776N5456O1073O6920P2808
60246A682536P9580Q7737R6484J04679J12064J19013J25615J31426J35730J37721
60236B812585J36723J32603J25809J16919J06322R4272Q0829O5869M9570L2804
60226C754305J6539R91j4030k7966l9616m8372n4559n8321n9106n6628n1517m4499
$$ plain form
60214 3317221 3281621 3256855 3244228 3244222 3257117 3283344 3323161 3376576 3443824 3525369 3621063 3729610
60202 3729610 3849148 3977942 4114010 4254247 4394511 4530712 4659498 4777809 4882253
60193 4882253 4969436 5036895 5083345 5107998 5110061 5089234 5046380 4983370 4902510 4806646 4699599
60182 4699599 4585793 4469213 4353167 4241058 4136690 4043475 3963836 3899634 3852520 3823328
60172 3823328 3811701 3817058 3839626 3879853 3937008 4009057 4093690 4188564 4290363 4394449 4496037
60161 4496037 4591478 4678210 4753907 4816158 4862974 4893439 4907864 4907349 4893169 4866712 4830229 4787492
60149 4787492 4743386 4702725 4669602 4647583 4639792 4648423 4674573 4718979 4782721 4866842 4971477
60138 4971477 5096002 5240193 5404894 5591472 5801135 6035199 6295529 6583891 6900650
$$ packed form
60214C317221l5600k4766j2627oJ2895K6227L9817N3415O7248Q1545R5694J08547
60202C729610J19538J28794J36068J40237J40264J36201J28786J18311J04444
60193D882253Q7183O7459M6450K4653K063k0827m2854o3010q0860r5864j07047
60182D699599j13806j16580j16046j12109j04368r3215p9639o4202m7114k9192
60172C823328j1627N357K2568M0227N7155P2049Q4633R4874J01799J04086J01588
60161D496037R5441Q6732P5697O2251M6816L0465J4425n15j4180k6457l6483m2737
60149D787492m4106m0661l3123k2019p791Q631K6150M4406O3742Q4121J04635
60138D971477J24525J44191J64701J86578K09663K34064K60330K88362L16759
$$ plain form
60129 6900650 7244472 7613209 8004306 8413953 8836375 9264466 9690788 10107572 10506351
60120 10506351 10878471 11216041 11512009 11759847 11954108 12091322 12169590 12187344 12143388 12038172
60110 12038172 11874129 11654660 11383991 11068689 10718410 10344257 9956806 9566053 9182277
60101 9182277 8815531 8474136 8164008 7889078 7651792 7453609 7295798 7179678 7105682 7072514
60091 7072514 7077720 7118694 7192365 7294112 7417754 7556549 7703619 7851575 7992589 8119223
60081 8119223 8225076 8304948 8355112 8373615 8359991 8314795 8239711 8137766 8012560 7867061
60071 7867061 7703489 7524189 7332090 7130329 6922029 6710530 6499334 6291655 6090346
60062 6090346 5898210 5717932 5551679 5401140 5267857 5153085 5057391 4981056 4924955 4890532
$$ packed form
60129F900650L43822L68737L91097M09647M22422M28091M26322M16784L98779
60120A0506351L72120L37570K95968K47838J94261J37214P8268J7754m3956j05216
60110A2038172j64043k19469k70669l15302l50279l74153l87451l90753l83776
60101I182277l66746l41395l10128k74930k37286j98183j57811j16120p3996l3168
60091G072514N206M0974P3671J01747J23642J38795J47070J47956J41014J26634
60081H119223J05853P9872N0164J8503j3624m5196p5084j01945j25206j45499
60071G867061j63572j79300j92099k01761k08300k11499k11196k07679k01309
60062F090346j92136j80278j66253j50539j33283j14772r5694p6335n6101l4423
$$ plain form
60052 4890532 4878846 4890066 4923844 4979491 5055588 5150119 5261318 5387853 5527637 5676664
60042 5676664 5829318 5979633 6122099 6251665 6363621 6453768 6518787 6556499 6565737 6545928
60032 6545928 6496946 6419570 6315886 6188967 6042359 5880313 5708231 5532159 5357501 5188450
60022 5188450 5028419 4880345 4746448 4628292 4527334 4445014 4382171 4338915 4315325 4311754
60012 4311754 4328180 4363924 4418640 4493229 4589123 4706789 4845413 5003818 5180903 5374890
60002 5374890 5582448 5798670 6017519 6232106 6435022 6619154 6778707 6909608 7009198 7075842
59992 7075842 7108896 7108642 7075842 7011343 6916418 6793623 6647276 6483187 6308155 6129426 5953801
59981 5953801 5786619 5631558 5491466 5369057 5266650 5185732 5127220 5091893 5080135 5091462
$$ packed form
60052D890532j1686J1220L3778N5647P6097R4531J11199J26535J39784J49027
60042E676664J52654J50315J42466J29566J11956R0147O5019L7712R238j9809
60032F545928m8982p7376j03684j26919j46608j62046j72082j76072j74658j69051
60022E188450j60031j48074j33897j18156j00958q2320o2843m3256k3590l571
60012D311754J6426L5744N4716P4589R5894J17666J38624J58405J77085J93987
60002E374890K07558K16222K18849K14587K02916J84132J59553J30901R9590O6644
59992G075842L3054k54l2800o4499r4925j22795j46347j64089j75032j78729j75625
59981E953801j67182j55061j40092j22409j02407q0918n8512l5327j1758J1327
$$ plain form
59971 5091462 5124749 5178791 5252200 5342765 5447324 5562313 5684255 5809890 5936279 6060837
59961 6060837 6181048 6294255 6397900 6489933 6568813 6633413 6683309 6719001 6741516 6752000 6751999
59950 6751999 6743974 6731180 6717293 6706487 6703494 6712951 6738854 6785114 6856330 6957229 7091376
59939 7091376 7261026 7468131 7714777 8002519 8331845 8702205 9111748 9556627 10030814
59930 10030814 10526375 11033071 11537476 12023000 12471025 12861893 13175757 13394814 13506735
59921 13506735 13506795 13397281 13185891 12884956 12510878 12082436 11618469 11136316 10651234 10176105
59911 10176105 9721265 9294717 8902535 8549140 8237432 7968871 7743557 7560752 7419851
59902 7419851 7320799 7263142 7245022 7263890 7318196 7407482 7530636 7684727 7865639 8068716
$$ packed form
59971E091462L3287N4042P3409R0565J04559J14989J21942J25635J26389J24558
59961F060837J20211J13207J03645R2033P8880O4600M9896L5692K2515J0484j
59950F751999q025j2794j3887j0806k993R457K5903M6260P1216J00899J34147
59939G091376J69650K07105K46646K87742L29326L70360M09543M44879M74187
59930A0030814M95561N06696N04405M85524M48025L90868L13864K19057J11921
59921A3506735O0j09514k11390l00935l74078m28442m63967m82153m85082m75129
59911A0176105m54840m26548l92182l53395l11708k68561k25314j82805j40901
59902G419851r9052n7657j8120J8868N4306Q9286J23154J54091J80912K03077
$$ plain form
59892 8068716 8288150 8516387 8744647 8963293 9161095 9325073 9442508 9503573 9502119 9434949
59882 9434949 9301718 9105800 8854492 8557824 8226930 7872826 7505677 7134645 6768232
59873 6768232 6414325 6079300 5767118 5479633 5217746 4981981 4772251 4587777 4427482
59864 4427482 4290102 4173745 4075673 3992833 3922518 3862338 3809656 3761338 3714340 3666672 3617782
59853 3617782 3568032 3518024 3468555 3420976 3377130 3338843 3307589 3284407 3269532 3261913 3259418 3259652
59841 3259652 3260273 3258519 3251067 3234985 3208891 3173152 3129195 3078797 3023890 2966780 2910331 2857452
59829 2857452 2809955 2768100 2731709 2701613 2679345 2665490 2659234 2659834 2667780 2684068 2709027 2742480
59817 2742480 2784453 2834886 2892786 2956252 3023412 3093025 3164546 3238022 3313659 3390866 3467656
$$ packed form
59892H068716K19434K28237K28260K18646J97802J63978J17435O1065j454o7170
59882I434949j33231j95918k51308k96668l30894l54104l67149l71032l66413
59873F768232l53907l35025l12182k87485k61887k35765k09730j84474j60295
59864D427482j37380j16357r8072q2840p0315o0180n2682m8318m6998m7668m8890
59853C617782m9750n0008m9469m7579m3846l8287l1254k3182j4875p619k495K34
59841C259652O21j754p452j6082k6094l5739m3957n0398n4907n7110n6449n2879
59829B857452m7497m1855l6391l0096k2268j3855o256O00P946J6288K4959L3453
59817B742480M1973N0433N7900O3466O7160O9613P1521P3476P5637P7207P6790
$$ plain form
59806 3467656 3541168 3608515 3666833 3713060 3744723 3761324 3764776 3758488 3746238 3731613 3717727 3707039
59794 3707039 3701588 3703529 3715299 3739217 3777045 3829991 3899058 3985460 4090821 4217023 4365894
59783 4365894 4539260 4739475 4969763 5233836 5535144 5876354 6258941 6682237 7141576
59774 7141576 7625856 8115373 8581330 8988397 9300624 9489219 9539601 9454933 9254390 8966841
59764 8966841 8623333 8251900 7875502 7511466 7171396 6861958 6586533 6346473 6141395
59755 6141395 5969418 5828003 5714731 5627398 5563995 5522962 5503175 5503524 5522876 5560615 5616739
59744 5616739 5691199 5783660 5894169 6023522 6172640 6342177 6533177 6747494 6986912 7252344
59734 7252344 7544685 7866169 8220175 8609821 9037290 9504321 10012600 10563508 11157739
$$ packed form
59806C467656P3512O7347N8318M6227L1663J6601L452o288j2250j4625j3886j0688
59794C707039n451J941J1770K3918L7828N2946O9067Q6402J05361J26202J48871
59783D365894J73366K00215K30288K64073L01308L41210L82587M23296M59339
59774G141576M84280M89517M65957M07067L12227J88595N0382q4668k00543k87549
59764H966841l43508l71433l76398l64036l40070l09438k75425k40060k05078
59755F141395j71977j41415j13272q7333o3403m1033j9787L49J9352L7739N6124
59744E616739P4460R2461J10509J29353J49118J69537J91000K14317K39418K65432
59734G252344K92341L21484L54006L89646M27469M67031N08279N50908N94231
$$ plain form
59725 11157739 11794694 12471337 13181342 13915594 14663341 15412440 16149003 16858308 17527401
59716 17527401 18147667 18716089 19235585 19714904 20167566 20609650 21057431 21525838 22027439
59707 22027439 22571194 23161082 23795341 24466637 25162586 25865996 26555108 27204827 27789327
59698 27789327 28285050 28672827 28939257 29078210 29092167 28991975 28794831 28522068 28197870
59689 28197870 27848107 27498403 27172196 26889843 26668470 26521848 26460543 26492778 26625370 26863978
59679 26863978 27213013 27675839 28254947 28951517 29764538 30689732 31717772 32831949 34006565
59670 34006565 35206772 36388766 37499707 38479068 39263484 39794351 40025513 39929401 39501293
59661 39501293 38760758 37748973 36522397 35145126 33682051 32193539 30731627 29337700
$$ packed form
59725A1157739O36955O76643P10005P34252P47747P49099P36563P09305O69093
59716A7527401O20266N68422N19496M79319M52662M42084M47781M68407N01601
59707B2027439N43755N89888O34259O71296O95949P03410O89112O49719N84500
59698B7789327M95723L87777K66430J38953J3957j00192j97144k72763l24198
59689B8197870l49763l49704l26207k82353k21373j46622o1305L2235J32592K38608
59679B6863978L49035M62826N79108O96570Q13021R25194J028040J114177J174616
59670C4006565J200207J181994J110941R79361P84416N30867K31162r6112m28108
59661C9501293p40535j011785j226576j377271j463075j488512j461912j393927
$$ plain form
59653 29337700 28041313 26859734 25797904 24848425 23991384 23195223 22420775 21628845 20788700
59644 20788700 19884116 18915624 17898933 16859658 15825797 14821413 13864177 12965921 12133562
59635 12133562 11369671 10673607 10043059 9474774 8964387 8506620 8096168 7728355 7399116
59626 7399116 7104820 6842187 6608113 6399612 6214233 6050410 5907019 5782574 5675057
59617 5675057 5582371 5502611 5433908 5374248 5321316 5272277 5223928 5173329 5118201 5056597 4986714
59606 4986714 4907514 4819336 4723483 4621409 4514626 4405061 4294987 4186652 4082196 3983551
59596 3983551 3892001 3808078 3732234 3665186 3607230 3557733 3515937 3481915 3456160 3438649 3428966
59585 3428966 3426869 3431913 3442833 3458221 3477647 3501289 3528598 3558169 3588754 3619468 3649183 3676897
$$ packed form
59653B9337700j296387j181579j061830r49479q57041p96161p74448p91930q40145
59644B0788700r04584r68492j016691j039275j033861j004384r57236q98256q32359
59635A2133562p63891o96064o30548n68285n10387m57767m10452l67813l29239
59626G399116k94296k62633k34074k08501j85379j63823j43391j24445j07517
59617E675057r2686p9760o8703n9660n2932m9039m8349n0599n5128o1604o9883
59606D986714p9200q8178r5853j02074j06783j09565j10074j08335j04456r8645
59596C983551r1550q3923p5844o7048n7956m9497m1796l4022k5755j7511r683
59585C428966k097N044J0920J5388J9426K3642K7309K9571L0585L0714K9715K7714
$$ plain form
59573 3676897 3703074 3729664 3758448 3789998 3824570 3863265 3907814 3959766 4020253 4090170 4170178
59562 4170178 4260734 4362354 4475683 4601452 4740690 4894891 5065512 5253354 5458870 5682906
59552 5682906 5926444 6189554 6471221 6770173 7085160 7414183 7753973 8100418 8448976
59543 8448976 8794617 9132059 9456588 9764534 10053110 10320416 10565898 10790382 10995271
59534 10995271 11181548 11349057 11496312 11621479 11724689 11809877 11884136 11955375 12030763 12116388
59524 12116388 12216409 12331534 12458623 12591827 12723309 12842871 12938208 12996692 13007060 12959775
59514 12959775 12847288 12665343 12414172 12098105 11724227 11301530 10840697 10353697 9852917
59505 9852917 9349981 8854545 8373845 7913556 7478932 7074597 6703286 6365485 6060532
$$ packed form
59573C676897K6177K6590K8784L1550L4572L8695M4549N1952O0487O9917Q0008
59562D170178R0556J01620J13329J25769J39238J54201J70621J87842K05516K24036
59552E682906K43538K63110K81667K98952L14987L29023L39790L46445L48558
59543H448976L45641L37442L24529L07946K88576K67306K45482K24484K04889
59534A0995271J86277J67509J47255J25167J03210Q5188P4259P1239P5388Q5625
59524A2116388J00021J15125J27089J33204J31482J19562R5337N8484J0368m7285
59514A2959775j12487j81945k51171l16067l73878m22697m60833m87000n00780
59505I852917n02936m95436m80700m60289m34624m04335l71311l37801l04953
$$ plain form
59496 6060532 5787604 5545684 5333381 5149088 4990806 4855767 4741087 4645206 4568081 4509667
59486 4509667 4468921 4444682 4436771 4445533 4470905 4512644 4571110 4647071 4740855 4852239 4981183
59475 4981183 5128346 5294929 5482138 5690458 5919133 6166390 6430208 6708449 6998007
59466 6998007 7293957 7589539 7876559 8145690 8386937 8590346 8746517 8846993 8885297 8858347
59456 8858347 8766909 8614785 8408048 8154935 7865391 7549706 7217358 6876908 6536214 6202043
59446 6202043 5879565 5572419 5283118 5013307 4763920 4535232 4326685 4136983 3964933
59437 3964933 3810145 3672466 3550887 3443663 3349366 3267000 3195239 3132601 3078574 3033566
59427 3033566 2997427 2968996 2947486 2933285 2926736 2926961 2932531 2942558 2956469 2973497 2993237 3016125
$$ packed form
59496F060532k72928k41920k12303j84293j58282j35039j14680r5881p7125n8414
59486D509667m0746k4239p911Q762K5372M1739N8466P5961R3784J11384J28944
59475D981183J47163J66583J87209K08320K28675K47257K63818K78241K89558
59466F998007K95950K95582K87020K69131K41247K03409J56171J00476L8304k6950
59456H858347r1438j52124k06737k53113k89544l15685l32348l40450l40694l34171
59446F202043l22478l07146k89301k69811k49387k28688k08547j89702j72050
59437C964933j54788j37679j21579j07224r4297q2366p1761o2638n4027m5008
59427C033566l6139k8431k1510j4201o549K25N570J0027J3911J7028J9740K2888
$$ plain form
59415 3016125 3042566 3072033 3103817 3138370 3177197 3221505 3271074 3323786 3375821 3423249 3464591
59404 3464591 3501958 3539558 3581616 3631869 3693849 3770455 3863631 3975010 4105918 4255608 4420267
59393 4420267 4595585 4780825 4979887 5198861 5443609 5719292 6030393 6380222 6770926
59384 6770926 7204354 7682365 8205859 8773635 9381901 10023951 10689807 11366503 12039242
59375 12039242 12692804 13312972 13888073 14410026 14874161 15278483 15623641 15913214 16152803
59366 16152803 16347949 16502624 16619015 16697575 16736689 16732743 16681164 16577673 16418930 16203010
59356 16203010 15930388 15605166 15235707 14834049 14414111 13989322 13570638 13165610 12778170
59347 12778170 12408560 12053467 11706888 11361771 11011824 10652735 10282425 9900584 9508271
$$ packed form
59415C016125K6441K9467L1784L4553L8827M4308M9569N2712N2035M7428M1342
59404C464591L7367L7600M2058N0253O1980P6606R3176J11379J30908J49690J64659
59393D420267J75318J85240J99062K18974K44748K75683L11101L49829L90704
59384F770926M33428M78011N23494N67776O08266O42050O65856O76696O72739
59375A2039242O53562O20168N75101N21953M64135M04322L45158K89573K39589
59366A6152803J95146J54675J16391P8560L9114l946n1579j03491j58743k15920
59356A6203010k72622l25222l69459m01658m19938m24789m18684m05028l87440
59347A2778170l69610l55093l46579l45117l49947l59089l70310l81841l92313
$$ plain form
59338 9508271 9108193 8705082 8305112 7914485 7538443 7181219 6846133 6535380 6250075
59329 6250075 5990734 5757410 5549318 5364898 5202660 5061570 4940386 4837092 4749494 4676112
59319 4676112 4616146 4568839 4533273 4508590 4494082 4489223 4493852 4508174 4532388 4566369 4609626 4661117
59307 4661117 4719138 4781932 4848525 4918369 4990032 5060996 5129017 5192920 5251637 5303297 5346016
59296 5346016 5379117 5402961 5418078 5425145 5425517 5421218 5414739 5409198 5408046 5413858 5427732 5450362 5483266
59283 5483266 5528380 5587007 5659941 5748179 5852572 5972897 6107886 6255824 6414357 6579892
59273 6579892 6747855 6913440 7071525 7216311 7342064 7444441 7520792 7569490 7589567 7580747
59263 7580747 7543146 7477226 7384968 7271160 7142925 7007925 6873181 6744817 6627475 6523554
$$ packed form
59338I508271m00078m03111l99970l90627l76042l57224l35086l10753k85305
59329F250075k59341k33324k08092j84420j62238j41090j21184j03294q7598p3382
59319D676112n9966m7307l5566k4683j4508m859M629J4322K4214L3981M3257N1491
59307D661117N8021O2794O6593O9844P1663P0964O8021O3903N8717N1660M2719
59296E346016L3101K3844J5117P067L72m299o479n541j152N812J3874K2630L2904
59283E483266M5114N8627P2934Q8238J04393J20325J34989J47938J58533J65535
59273F579892J67963J65585J58085J44786J25753J02377P6351M8698K0077q820
59263G580747l7601o5920r2258j13808j28235j35000j34744j28364j17342j03921
$$ plain form
59253 6523554 6433541 6357173 6293818 6241909 6198924 6162302 6130166 6101310 6075133 6051677 6031296
59242 6031296 6014298 6001333 5994074 5995132 6007394 6033837 6077710 6142267 6230347 6344709 6488612
59231 6488612 6665500 6877996 7127569 7414888 7739791 8100602 8493437 8911641 9345140
59222 9345140 9780348 10201142 10590213 10929927 11203246 11395267 11494396 11492502 11385404 11174646
59212 11174646 10868638 10481003 10027601 9525256 8991933 8445782 7902768 7375365 6873060
59203 6873060 6402877 5969027 5572943 5214275 4891775 4603458 4346813 4119221 3917902
59194 3917902 3739615 3581117 3440009 3314698 3203557 3104651 3016124 2936304 2863531 2796577
59184 2796577 2735185 2679564 2629454 2584268 2543924 2508689 2478305 2452146 2430236 2413227 2401213
$$ packed form
59253F523554r0013p6368o3355n1909m2985l6622l2136k8856k6177k3456k0381
59242F031296j6998j2965p259J058J2262K6443M3873O4557Q8080J14362J43903
59231F488612J76888K12496K49573K87319L24903L60811L92835M18204M33499
59222I345140M35208M20794L89071L39714K73319J92021R9129j894j07098k10758
59212A1174646l06008l87635m53402n02345n33323n46151n43014n27403n02305
59203F873060m70183m33850l96084l58668l22500k88317k56645k27592k01319
59194C917902j78287j58498j41108j25311j11141r8906q8527p9820p2773o6954
59184B796577o1392n5621n0110m5186m0344l5235l0384k6159k1910j7009j2014
$$ plain form
59173 2401213 2393412 2389301 2389400 2394630 2405367 2421258 2441523 2465392 2492700 2523993 2559666 2599246
59161 2599246 2642233 2689298 2741775 2800076 2863458 2931311 3003697 3080558 3161402 3246043 3334814
59150 3334814 3427669 3523620 3621193 3718874 3815072 3908212 3996818 4078852 4151272 4211212 4257668
59139 4257668 4291183 4312067 4320035 4315591 4300529 4276792 4246035 4210601 4173717 4138093 4105268 4076755
59127 4076755 4054789 4041380 4037684 4044979 4065357 4100591 4151085 4216735 4298155 4396221 4510987
59116 4510987 4641931 4788959 4952448 5132545 5328976 5541342 5769130 6011586 6267672
59107 6267672 6535435 6810696 7086452 7353773 7602999 7824106 8006987 8142610 8224392 8248877
59097 8248877 8215979 8129199 7995133 7822034 7618462 7392754 7152637 6904447 6652605 6399855
$$ packed form
59173B401213p801m111R9N230J0737J5891K0265K3869K7308L1293L5673L9580
59161B599246M2987M7065N2477N8301O3382O7853P2386P6861Q0844Q4641Q8771
59150C334814R2855R5951R7573R7681R6198R3140Q8606Q2034P2420N9940M6456
59139D257668L3515K0884P968m444j5062k3737l0757l5434l6884l5624l2825k8513
59127D076755k1966j3409l696P295K0378L5234N0494O5650Q1420R8066J14766
59116D510987J30944J47028J63489J80097J96431K12366K27788K42456K56086
59107F267672K67763K75261K75756K67321K49226K21107J82881J35623Q1782K4485
59097H248877l2898q6780j34066j73099k03572k25708k40117k48190k51842k52750
$$ plain form
59087 6399855 6147730 5896994 5648458 5403739 5164869 4933122 4708844 4492512 4285201
59078 4285201 4087707 3899956 3721721 3553386 3395588 3248538 3111912 2984957 2866549
59069 2866549 2755806 2652899 2558702 2473453 2396366 2326734 2264587 2209946 2162210 2120652 2084852
59058 2084852 2054299 2028323 2006812 1990147 1977952 1968558 1960114 1951310 1940521 1925316 1903873 1876299
59046 1876299 1843766 1806894 1765855 1721566 1675791 1630255 1586376 1545584 1509006 1476791 1448341
59035 1448341 1423215 1401474 1383267 1368553 1357179 1348958 1343657 1341023 1340711 1342283 1345596 1351061 1358860
59022 1358860 1367841 1375925 1381821 1385735 1388246 1389378 1389158 1388245 1387395 1386870 1386819 1387661 1389587 1392299 1395719 1400453
59006 1400453 1407109 1415681 1425843 1437131 1448490 1458548 1466963 1474718 1482554 1489934 1496226 1501973 1508095
$$ packed form
59087F399855k52125k50736k48536k44719k38870k31747k24278k16332k07311
59078D285201j97494j87751j78235j68335j57798j47050j36626j26955j18408
59069B866549j10743j02907r4197q5249p7087o9632o2147n4641m7736m1558l5800
59058B084852l0553k5976k1511j6665j2195r394q444q804j0789j5205k1443k7574
59046A876299l2533l6872m1039m4289m5775m5536m3879m0792l6578l2215k8450
59035A448341k5126k1741j8207j4714j1374q221n301k634l12J572L313N465P799
59022A358860Q981Q084N896L914K511J132k20r13q50n25n1Q42J926K712L420M734
59006A400453O656Q572J0162J1288J1359J0058Q415P755P836P380O292N747O122
$$ plain form
58993 1508095 1514573 1520892 1527166 1533881 1541035 1548522 1556922 1566924 1578264 1590134 1602355 1615336 1629183
58980 1629183 1643728 1659204 1676011 1693994 1712718 1732304 1753274 1775795 1799812 1825786 1854504
58969 1854504 1886292 1921002 1958636 1999311 2042742 2088413 2136085 2185532 2236033 2286765 2337485
58958 2337485 2388063 2437524 2484400 2528149 2569571 2609844 2649816 2690342 2732691 2778289 2828331
58947 2828331 2883702 2945070 3013013 3088246 3171614 3263777 3365098 3475986 3596987 3728476
58937 3728476 3870732 4024589 4191460 4372450 4568087 4779392 5008568 5258015 5529256
58928 5529256 5823479 6142662 6489430 6866294 7275808 7721074 8205122 8729876 9296329
58919 9296329 9905611 10559222 11258277 12002754 12790787 13617546 14474493 15349779 16228810
$$ packed form
58993A508095O478O319O274O715P154P487Q400J0002J1340J1870J2221J2981J3847
58980A629183J4545J5476J6807J7983J8724J9586K0970K2521K4017K5974K8718
58969A854504L1788L4710L7634M0675M3431M5671M7672M9447N0501N0732N0720
58958B337485N0578M9461M6876M3749M1422M0273L9972M0526M2349M5598N0042
58947B828331N5371O1368O7943P5233Q3368R2163J01321J10888J21001J31489
58937C728476J42256J53857J66871J80990J95637K11305K29176K49447K71241
58928E529256K94223L19183L46768L76864M09514M45266M84048N24754N66453
58919I296329O09282O53611O99055P44477P88033Q26759Q56947Q75286Q79031
$$ plain form
58910 16228810 17093651 17922164 18688497 19364851 19923484 20339100 20591933 20670193 20570687 20298569
58900 20298569 19867383 19298254 18616996 17850632 17025630 16167335 15298665 14438398 13600898
58891 13600898 12797083 12035020 11320029 10655377 10043060 9483394 8974245 8511706 8091780
58882 8091780 7710964 7365461 7050791 6762323 6495646 6246430 6010659 5785387 5569110
58873 5569110 5361561 5163366 4975560 4798848 4633385 4479384 4337395 4207509 4088856
58864 4088856 3980498 3882328 3794383 3715737 3644909 3581018 3523808 3472975 3428396 3390731 3360831
58853 3360831 3338638 3323372 3314571 3312196 3316052 3326067 3342958 3367665 3400153 3439568 3485485 3538241
58841 3538241 3598148 3665303 3740152 3823410 3915397 4016188 4126386 4247001 4378599 4521291
$$ packed form
58910A6228810Q64841Q28513P66333O76354N58633M15616K52833P8260r9506k72118
58900B0298569m31186n69129o81258p66364q25002q58295q68670q60267q37500
58891A3600898q03815p62063p14991o64652o12317n59666n09149m62539m19926
58882H091780l80816l45503l14670k88468k66677k49216k35771k25272k16277
58873E569110k07549j98195j87806j76712j65463j54001j41989j29886j18653
58864D088856j08358r8170q7945p8646p0828o3891n7210n0833m4579l7665k9900
58853C360831k2193j5266q801k375L856J0015J6891K4707L2488L9415M5917N2756
58841C538241N9907O7155P4849Q3258R1987J00791J10198J20615J31598J42692
$$ plain form
58831 4521291 4675656 4843097 5025320 5223990 5440672 5676562 5932505 6209968 6511677
58822 6511677 6840631 7198863 7588093 8011247 8472223 8974173 9518924 10107921 10742582
58813 10742582 11423416 12149363 12917711 13723361 14557536 15407373 16256362 17084310 17867083
58804 17867083 18577709 19188623 19673526 20009024 20177399 20169622 19986236 19636097 19135193 18505898
58794 18505898 17774975 16970335 16118682 15244653 14369850 13511436 12681821 11889676 11140654
58785 11140654 10437349 9779820 9166893 8596871 8067553 7576742 7123021 6705319 6321738
58776 6321738 5969578 5646458 5350444 5079023 4829011 4597647 4382806 4181983 3992331
58767 3992331 3812319 3642511 3484067 3337047 3200608 3074104 2957336 2850093 2751993 2662583
$$ packed form
58831D521291J54365J67441J82223J98670K16682K35890K55943K77463L01709
58822F511677L28954L58232L89230M23154M60976N01950N44751N88997O34661
58813A0742582O80834P25947P68348Q05650Q34175Q49837Q48989Q27948P82773
58804A7867083P10626O10914M84903L35498J68375p777j83386l50139n00904o29295
58794A8505898p30923q04640q51653q74029q74803q58414q29615p92145p49022
58785A1140654p03305o57529o12927n70022n29318m90811m53721m17702l83581
58776F321738l52160l23120k96014k71421k50012k31364k14841k00823j89652
58767C992331j80012j69808j58444j47020j36439j26504j16768j07243r8100q9410
$$ plain form
58757 2662583 2581258 2507282 2440017 2378994 2323720 2273708 2228659 2188358 2152413 2120305 2091471
58746 2091471 2065164 2040608 2017549 1996214 1976403 1957362 1939060 1922701 1909084 1897175 1885274
58735 1885274 1872927 1860621 1848269 1835335 1821857 1807943 1792644 1774864 1754991 1734017 1711280
58724 1711280 1684968 1654895 1622938 1590344 1556419 1520462 1483335 1446237 1409398 1372949 1337916
58713 1337916 1305288 1274864 1245914 1218429 1193045 1170236 1149996 1131850 1114937 1098665 1083408
58702 1083408 1069948 1058201 1047329 1037003 1027532 1018710 1009780 1000721 992335 984711 976909 968724 961557
58689 961557 956743 953866 951409 948246 943914 938252 931462 924033 916157 907701 898980 890853 883852 877961
58675 877961 873425 870896 870529 871762 874155 877483 880770 882477 882206 881305 881235 882229 884130 887535 893155 900451
$$ packed form
58757B662583q1325p3976o7265o1023n5274n0012m5049m0301l5945l2108k8834
58746B091471k6307k4556k3059k1335j9811j9041j8302j6359j3617j1909j1901
58735A885274j2347j2306j2352j2934j3478j3914j5299j7780j9873k0974k2737
58724A711280k6312l0073l1957l2594l3925l5957l7127l7098l6839l6449l5033
58713A337916l2628l0424k8950k7485k5384k2809k0240j8146j6913j6272j5257
58702A083408j3460j1747j0872j0326r471q822q930r059q386p624p802q185p167
58689I61557m814k877k457l163m332n662o790p429p876q456q721q127p001n891
58675H77961m536k529l67J233K393L328L287J707k71r01p0R94J901L405N620P296
$$ plain form
58659 900451 907633 912874 915398 915762 915267 914818 914456 914280 915297 918500 923607 929825 937560 948043 961406
58644 961406 976508 992677 1010241 1029303 1049555 1071540 1096602 1125139 1156239 1189405 1225335
58633 1225335 1264620 1307179 1353434 1404719 1461920 1525013 1594416 1671497 1757203 1851547 1955006
58622 1955006 2069203 2195675 2335315 2489512 2660394 2849241 3055871 3279940 3521159
58613 3521159 3777481 4044446 4316725 4588364 4850525 5090791 5296127 5455595 5560058
58604 5560058 5602060 5578531 5492865 5353021 5168550 4950237 4710406 4460733 4209649 3962726
58594 3962726 3724625 3499251 3288803 3094173 2915932 2754042 2607411 2474890 2356142
58585 2356142 2250775 2157556 2075476 2004594 1944655 1893736 1849424 1810566 1776684 1746482 1718245
$$ packed form
58659I00451P182N241K524L64m95m49l62j76J017L203N107O218P735J0483J3363
58644I61406J5102J6169J7564J9062K0252K1985K5062K8537L1100L3166L5930
58633A225335L9285M2559M6255N1285N7201O3093O9403P7081Q5706R4344J03459
58622A955006J14197J26472J39640J54197J70882J88847K06630K24069K41219
58613C521159K56322K66965K72279K71639K62161K40266K05336J59468J04463
58604E560058M2002k3529q5666j39844j84471k18313k39831k49673k51084k46923
58594C962726k38101k25374k10448j94630j78241j61890j46631j32521j18748
58585B356142j05367r3219q2080p0882n9939n0919m4312l8858l3882l0202k8237
$$ plain form
58574 1718245 1691142 1664945 1638860 1611605 1582275 1550441 1516112 1480346 1445168 1412002 1380745
58563 1380745 1350937 1322826 1296611 1271690 1247579 1224576 1202683 1180938 1158834 1137367 1117681
58552 1117681 1099675 1082977 1068224 1056187 1046494 1038313 1031446 1025754 1020397 1014689 1008797 1002823 996252
58539 996252 989210 982850 977389 971111 962654 952957 943528 934089 923588 912353 901431 890682 879302
58526 879302 867475 855820 843979 831456 819227 808711 799567 790124 779718 769173 759314 750404
58514 750404 742812 736914 732431 728735 725515 722485 719208 715961 713893 713333 713016 711968 711047 711432 712784
58499 712784 714297 716328 719400 722590 724594 725583 726481 727321 727922 729290 732568 737212 741781 745868 749814
58484 749814 753366 756195 759008 762518 766049 768706 771091 774283 777979 781359 784868 789285 793756 796639
$$ packed form
58574A718245k7103k6197k6085k7255k9330l1834l4329l5766l5178l3166l1257
58563A380745k9808k8111k6215k4921k4111k3003k1893k1745k2104k1467j9686
58552A117681j8006j6698j4753j2037r693q181o867n692n357n708n892n974o571
58539I96252p042o360n461o278q457r697r429r439j0501j1235j0922j0749j1380
58526H79302j1827j1655j1841j2523j2229j0516r144r443j0406j0545r859q910
58514G50404p592n898m483l696l220l030l277l247k068n60l17j048r21L85J352
58499G12784J513K031L072L190K004R89Q98Q40O01J368L278M644M569M087L946
58484G49814L552K829K813L510L531K657K385L192L696L380L509M417M471K883
$$ plain form
58470 796639 797706 797667 796182 792209 785833 777982 768900 758632 748470 740023 733219 726842 720550 714793
58456 714793 709354 703658 697984 692757 687300 680992 674937 670779 668455 666767 665345 664367 663314 661916
58442 661916 661380 662695 664573 665201 665077 665913 667643 668990 670180 672476 675531 677831 679472 681954 685444
58427 685444 688669 691472 695111 700071 705731 712066 719548 727560 735010 742268 750408 758879 766184 772472
58413 772472 779098 785944 791571 795819 799745 803190 804919 805158 805563 806633 807523 808300 809946 812090 813239
58398 813239 813383 814035 815515 816610 817017 817823 819378 820985 822842 825966 830010 833381 835778 838518 842252
58383 842252 846465 851158 856832 862837 867848 871912 875869 879155 880610 881123 882875 886172 889690 893587
58369 893587 899464 907244 915026 922286 930399 939680 948599 956271 963188 969276 973827 977478 981680 986066
$$ packed form
58470G96639J067l9j485l973o376p851r082j0268j0162q447o804o377o292n757
58456G14793n439n696n674n227n457o308o055m158k324j688j422r78j053j398
58442F61916n36J315J878O28j24Q36J730J347J190K296L055K300J641K482L490
58427F85444L225K803L639M960N660O335P482Q012P450P258Q140Q471P305O288
58413G72472O626O846N627M248L926L445J729K39M05J070Q90P77J646K144J149
58398H13239J44O52J480J095M07Q06J555J607J857L124M044L371K397K740L734
58383H42252M213M693N674O005N011M064L957L286J455N13J752L297L518L897
58369H93587N877P780P782P260Q113R281Q919P672O917O088M551L651M202M386
$$ plain form
58355 986066 988933 990338 991985 994116 995451 996262 998460 1002393 1006493 1010293 1014828 1019905 1024086 1027633
58341 1027633 1032384 1038416 1043940 1048859 1055242 1063845 1073250 1082875 1093728 1105720 1117373 1128689 1141346
58328 1141346 1155656 1170190 1184512 1199252 1213593 1226022 1237430 1249932 1262783 1273363 1282092
58317 1282092 1292142 1304155 1315658 1326097 1337863 1351674 1365449 1378705 1393446 1409708 1424829
58306 1424829 1438442 1453579 1471264 1488563 1503700 1518845 1535975 1554086 1572322 1591877 1612994
58295 1612994 1633834 1653986 1675417 1698609 1721599 1744014 1767959 1793694 1818710 1842448 1867577
58284 1867577 1895322 1923969 1953230 1985411 2020862 2057035 2093432 2132625 2174968 2217433 2259214
58273 2259214 2303160 2349979 2396472 2441413 2487604 2536037 2583665 2629237 2675754 2724853 2774344
$$ packed form
58355I86066K867J405J647K131J335Q11K198L933M100L800M535N077M181L547
58341A027633M751O032N524M919O383Q603R405R625J0853J1992J1653J1316J2657
58328A141346J4310J4534J4322J4740J4341J2429J1408J2502J2851J0580Q729
58317A282092J0050J2013J1503J0439J1766J3811J3775J3256J4741J6262J5121
58306A424829J3613J5137J7685J7299J5137J5145J7130J8111J8236J9555K1117
58295A612994K0840K0152K1431K3192K2990K2415K3945K5735K5016K3738K5129
58284A867577K7745K8647K9261L2181L5451L6173L6397L9193M2343M2465M1781
58273B259214M3946M6819M6493M4941M6191M8433M7628M5572M6517M9099M9491
$$ plain form
58262 2774344 2823667 2876057 2932890 2991579 3051330 3115073 3183449 3253255 3324193 3400557 3483571
58251 3483571 3568859 3654410 3744051 3839971 3938981 4039649 4145890 4259853 4378360 4500064
58241 4500064 4628916 4766941 4911027 5060405 5219473 5389618 5566523 5749393 5944159
58232 5944159 6153627 6373690 6603548 6849868 7116083 7397762 7693764 8011448 8355245
58223 8355245 8721140 9108619 9526767 9981944 10471265 10995431 11565863 12191631 12872023
58214 12872023 13610148 14420827 15316762 16301276 17384382 18591984 19950256 21477450 23202415
58205 23202415 25175549 27451475 30079738 33124241 36670382 40798170 45570667 51067562
58197 51067562 57412701 64760250 73290119 83246897 94965474 108849784 125373726 145138748
$$ packed form
58262B774344M9323N2390N6833N8689N9751O3743O8376O9806P0938P6364Q3014
58251C483571Q5288Q5551Q9641R5920R9010J00668J06241J13963J18507J21704
58241D500064J28852J38025J44086J49378J59068J70145J76905J82870J94766
58232E944159K09468K20063K29858K46320K66215K81679K96002L17684L43797
58223H355245L65895L87479M18148M55177M89321N24166N70432O25768O80392
58214A2872023P38125Q10679Q95935R84514J083106J207602J358272J527194J724965
58205B3202415J973134K275926K628263L044503L546141M127788M772497N496895
58197E1067562O345139P347549Q529869R956778J1718577J3884310J6523942J9765022
$$ plain form
58189 145138748 168887256 197372226 231067658 269639979 311101763 351066434 383115077
58182 383115077 400860234 400745082 383582461 353738141 316837829 277775850 239938794
58175 239938794 205309148 174807255 148626349 126548656 108171673 93002339 80508865
58168 80508865 70199506 61674868 54611469 48735283 43831045 39746007 36359678 33563470
58160 33563470 31275208 29446623 28041978 27026899 26385561 26129437 26282824 26879173 27978362
58151 27978362 29671177 32053676 35170791 38901611 42804211 46082481 47843681 47542521
58143 47542521 45254344 41553686 37156086 32639989 28372521 24545202 21222715 18393642
58135 18393642 16018570 14049029 12423627 11075562 9951407 9012973 8224811 7554296
$$ packed form
58189A45138748K3748508K8484970L3695432L8572321M1461784L9964671L2048643
58182C83115077J7745157j15152j7162621k9844320l6900312l9061979l7837056
58175B39938794l4629646l0501893k6180906k2077693j8376983j5169334j2493474
58168H0508865j0309359q524638p063399n876186m904238m085038l386329k796208
58160C3563470k288262j828585j404645j015079o41338k56124J53387N96349J099189
58151B7978362J692815K382499L117115L730820L902600L278270J761200l01160
58143D7542521k288177l700658m397600m516097m267468l827319l322487k829073
58135A8393642k375072j969541j625402j348065j124155r38434p88162o70515
$$ plain form
58127 7554296 6981842 6496947 6084117 5723108 5400829 5111899 4848974 4602494 4368319
58118 4368319 4146380 3933696 3727348 3531885 3354834 3196594 3052465 2921869 2807292
58109 2807292 2706515 2614194 2529288 2453048 2381414 2307075 2227941 2146900 2065011 1981675 1899813
58098 1899813 1823925 1754130 1688040 1626918 1573924 1527934 1485137 1445291 1410642 1380122 1350435
58087 1350435 1321514 1295395 1271031 1245617 1219668 1195493 1171990 1146235 1118993 1093508 1069970
58076 1069970 1046181 1022519 1001274 982143 963151 945002 929823 916594 902538 888137 876271
58065 876271 867216 858752 850307 842749 835104 825762 816074 808641 802842 795951 787577 779118 770110 759390
58051 759390 748682 740636 734177 726095 716464 708204 701985 695887 689615 684782 681247 677217 672917 670427
$$ packed form
58127G554296n72454m84895m12830l61009l22279k88930k62925k46480k34175
58118D368319k21939k12684k06348j95463j77051j58240j44129j30596j14577
58109B807292j00777r2321q4906p6240p1634p4339p9134q1041q1889q3336q1862
58098A899813p5888o9795o6090o1122n2994m5990m2797l9846l4649l0520k9687
58087A350435k8921k6119k4364k5414k5949k4175k3503k5755k7242k5485k3538
58076A069970k3789k3662k1245j9131j8992j8149j5179j3229j4056j4401j1866
58065H76271r055q464q445p558p645r342r688p433n799o891q374q459r008j0720
58051G59390j0708q046o459q082r631q260o219o098o272m833l535m030m300k490
$$ plain form
58037 670427 670028 670237 671146 674139 678663 682800 686694 691842 697266 700009 699414 697544 695528 692779 689674
58022 689674 687629 686424 684489 681748 679374 677047 673427 668963 665205 661714 656727 650449 644631 639286
58008 639286 632967 625859 619389 613212 605964 598664 593832 591323 588456 584324 580503 577383 573363 568160
57994 568160 563579 560306 556994 553154 550035 547922 545421 542179 539784 539262 540043 541834 545141 549459 553297
57979 553297 556441 559961 563860 567061 569840 573677 578412 582065 583799 584613 584842 583652 581359 579500 577992
57964 577992 574816 569362 563641 559353 556000 552765 550031 548052 546043 543513 540842 537901 533829 528755
57950 528755 524107 520748 518412 517189 517721 519714 522094 524948 529360 535021 539937 542935 544638 545653
57936 545653 545687 544791 543573 541776 538381 533369 527643 521146 513053 503883 495245 487228 478318 468335 459198
$$ packed form
58037F70427l99K09R09K993M524M137L894N148N424K743n95j870k016k749l105
58022F89674k045j205j935k741k374k327l620m464l758l491m987o278n818n345
58008F39286o319p108o470o177p248p300m832k509k867m132l821l120m020n203
57994E68160m581l273l312l840l119k113k501l242k395n22P81J791L307M318L838
57979E53297L144L520L899L201K779L837M735L653J734Q14K29j190k293j859j508
57964E77992l176n454n721m288l353l235k734j979k009k530k671k941m072n074
57950E28755m648l359k336j223N32J993K380K854M412N661M916K998J703J015
57936E45653L4q96j218j797l395n012n726o497q093r170q638q017q910r983r137
$$ plain form
57921 459198 452186 446622 441918 438784 437565 437332 437495 438614 440948 443960 447862 453846 462036 470910 479413
57906 479413 488011 497116 506164 514782 523099 530382 535202 537685 539774 542553 544939 545671 544895 543124 540362
57891 540362 536956 533622 529954 524550 517274 509760 503029 496413 489467 483046 477626 472356 466799 461975
57877 461975 458760 456716 455338 454856 455006 454704 453907 454213 456635 460345 464605 470223 477853 486330 494068
57862 494068 500913 507426 513391 518263 522230 525823 529202 532473 535808 538651 539819 538946 536880 534255
57848 534255 530818 526469 521736 516901 512042 508105 506224 505605 503958 500588 497137 494630 491875 487764
57834 487764 483044 478511 473467 467503 462025 458235 455001 450434 444354 437648 430463 422713 415288 408971
57820 408971 402851 395423 386736 378157 370645 364443 359721 356183 352655 348301 343801 340338 338017 336183
$$ packed form
57921D59198p012n564m704l134j219k33J63J119K334L012L902N984Q190Q874Q503
57906D79413Q598R105R048Q618Q317P283M820K483K089K779K386P32p76j771k762
57891E40362l406l334l668n404p276p514o731o616o946o421n420n270n557m824
57877D61975l215k044j378m82J50l02p97L06K422L710M260N618P630Q477P738
57862D94068O845O513N965M872L967L593L379L271L335K843J168q73k066k625
57848E34255l437m349m733m835m859l937j881o19j647l370l451k507k755m111
57834D87764m720m533n044n964n478l790l234m567o080o706p185p750p425o317
57820D08971o120p428q687q579p512o202m722l538l528m354m500l463k321j834
$$ plain form
57806 336183 334621 333470 332586 331967 332146 333343 334936 336599 339140 343366 348936 355272 362717 371835 382369
57791 382369 393846 406313 419442 431723 441674 449187 454734 458108 459071 458519 457763 457106 456098 454578
57777 454578 452492 449318 444754 439499 434404 429339 423748 417752 411807 405898 400043 394971 391354 388829
57763 388829 386750 385424 385696 387677 390708 394138 397431 400023 401879 403790 406455 409701 413108 416732
57749 416732 420617 424347 427754 431308 435171 438680 441522 444561 448670 453603 458838 464577 470871 476695
57735 476695 481130 484845 489263 494818 501028 507694 514893 522294 529565 537137 545723 555446 566152 577940
57721 577940 590677 603736 617084 631857 648863 667253 685737 704373 724010 744713 766017
57710 766017 788224 812125 837841 865158 894674 927454 963803 1003413 1046545 1094070 1146641
$$ packed form
57806C36183j562j151q84o19J79J197J593J663K541M226N570O336P445R118J0534
57791C82369J1477J2467J3129J2281R951P513N547L374R63n52p56o57j008j520
57777D54578k086l174m564n255n095n065n591n996n945n909n855n072l617k525
57763C88829k079j326K72J981L031L430L293K592J856J911K665L246L407L624
57749D16732L885L730L407L554L863L509K842L039M109M933N235N739O294N824
57735D76695M435L715M418N555O210O666P199P401P271P572Q586R723J0706J1788
57721E77940J2737J3059J3348J4773J7006J8390J8484J8636J9637K0703K1304
57710G66017K2207K3901K5716K7317K9516L2780L6349L9610M3132M7525N2571
$$ plain form
57699 1146641 1204654 1268704 1339320 1416765 1501939 1596879 1703415 1821980 1952760 2097320
57689 2097320 2257829 2435297 2629889 2842383 3073638 3322605 3585972 3859314 4136866
57680 4136866 4409941 4666923 4895401 5084055 5223493 5307521 5334940 5310001 5241275 5140469
57670 5140469 5021397 4898004 4781723 4679422 4591553 4510039 4418479 4297789 4135191 3930192
57660 3930192 3693742 3442596 3193154 2957502 2742545 2551478 2385430 2243879 2124757
57651 2124757 2025385 1943353 1876288 1821662 1777799 1744510 1721812 1708485 1702810 1704170 1712834 1728645
57639 1728645 1751100 1780501 1817882 1863995 1919293 1984610 2060710 2147492 2244853 2354221 2478036
57628 2478036 2617643 2772655 2942252 3125976 3323122 3532193 3750766 3974684 4197025
$$ packed form
57699A146641N8013O4050P0616P7445Q5174R4940J06536J18565J30780J44560
57689B097320J60509J77468J94592K12494K31255K48967K63367K73342K77552
57680D136866K73075K56982K28478J88654J39438Q4028K7419k4939o8726j00806
57670E140469j19072j23393j16281j02301q7869q1514r1560j20690j62598k04999
57660C930192k36450k51146k49442k35652k14957j91067j66048j41551j19122
57651B124757r9372q2032o7065n4626m3863l3289k2698j3327n675J360Q664J5811
57639A728645K2455K9401L7381M6113N5298O5317P6100Q6782R7361J09368J23815
57628B478036J39607J55012J69597J83724J97146K09071K18573K23918K22341
$$ plain form
57619 4197025 4408495 4598749 4756959 4872174 4935295 4941688 4891674 4789002 4639948 4453451
57609 4453451 4240186 4010430 3772914 3535248 3304053 3084175 2878460 2688430 2514568
57600 2514568 2356115 2211635 2080114 1961034 1853629 1756837 1669819 1591707 1521118 1456821
57590 1456821 1398604 1346478 1299315 1255510 1214851 1178438 1146717 1118778 1093673 1071163 1050978
57579 1050978 1032507 1015529 1000234 986355 973320 961445 951781 944471 938358 932585 927531 923775
57567 923775 921241 919896 920258 922545 926099 930371 935799 943138 952408 963014 974513 986892 1000445
57554 1000445 1015600 1032594 1051308 1071821 1094923 1121420 1151045 1182841 1216556 1252926 1292761
57543 1292761 1336734 1386022 1441937 1504710 1573686 1649065 1732469 1825466 1928502 2041700 2165736
$$ packed form
57619D197025K11470J90254J58210J15215O3121O393n0014j02672j49054j86497
57609D453451k13265k29756k37516k37666k31195k19878k05715j90030j73862
57600B514568j58453j44480j31521j19080j07405r6792q7018p8112p0589o4297
57590A456821n8217n2126m7163m3805m0659l6413l1721k7939k5105k2510k0185
57579A050978j8471j6978j5295j3879j3035j1875r664p310o113n773n054l756
57567I23775k534j345L62K287L554M272N428P339R270J0606J1499J2379J3553
57554A000445J5155J6994J8714K0513K3102K6497K9625L1796L3715L6370L9835
57543A292761M3973M9288N5915O2773O8976P5379Q3404R2997J03036J13198J24036
$$ plain form
57532 2165736 2301303 2448467 2607006 2776571 2955767 3141361 3328581 3511469 3682501
57523 3682501 3832611 3952473 4034108 4071863 4063132 4009007 3914056 3785052 3629852 3456911
57513 3456911 3274647 3090406 2909892 2737259 2575134 2424667 2286335 2160897 2049129
57504 2049129 1950767 1864423 1788612 1722302 1664622 1614838 1572654 1537819 1509448 1486417 1468336
57493 1468336 1455385 1447292 1443303 1443054 1446619 1453789 1464296 1478647 1497706 1521501 1549521 1582187
57481 1582187 1620840 1666221 1718174 1777071 1844303 1920949 2007094 2102761 2208491 2324689 2451461
57470 2451461 2589321 2738816 2898903 3066676 3238846 3412132 3581433 3738714 3874415
57461 3874415 3979388 4045632 4067151 4041712 3971466 3861440 3718129 3549637 3365434 3174366
$$ packed form
57532B165736J35567J47164J58539J69565J79196J85594J87220J82888J71032
57523C682501J50110J19862Q1635L7755q731n4125r4951j29004j55200j72941
57513C456911j82264j84241j80514j72633j62125j50467j38332j25438j11768
57504B049129r8362q6344p5811o6310n7680m9784m2184l4835k8371k3031j8081
57493A468336j2951q093l989k49L565P170J0507J4351J9059K3795K8020L2666
57481A582187L8653M5381N1953N8897O7232P6646Q6145R5667J05730J16198J26772
57470B451461J37860J49495J60087J67773J72170J73286J69301J57281J35701
57461C874415J04973O6244K1519k5439p0246j10026j43311j68492j84203j91068
$$ plain form
57451 3174366 2983003 2796089 2617543 2450254 2295668 2154322 2026319 1911009 1807140
57442 1807140 1713909 1631181 1558392 1494165 1437361 1387464 1343488 1303745 1267326 1234711 1206189
57431 1206189 1180834 1157701 1136867 1118356 1101262 1084932 1069978 1056962 1045149 1033774 1023594
57420 1023594 1015803 1010007 1004618 998747 992573 986317 980110 974645 970866 969058 968913 970123 972223 974413
57406 974413 976439 979240 983832 989875 996080 1001680 1006811 1011860 1017203 1023176 1029608 1035796 1041546 1047695
57392 1047695 1054967 1062967 1071019 1079290 1088142 1097041 1105144 1112546 1120003 1127808 1135788 1143976 1152300 1160027
57378 1160027 1166499 1172227 1178431 1185698 1193732 1202092 1210465 1218627 1226819 1235781 1245756 1255917 1265427 1274454
57364 1274454 1283510 1292475 1301204 1310369 1320679 1331791 1342907 1353924 1365046 1375972 1386569 1397742
$$ packed form
57451C174366j91363j86914j78546j67289j54586j41346j28003j15310j03869
57442A807140r3231q2728p2789o4227n6804m9897m3976l9743l6419l2615k8522
57431A206189k5355k3133k0834j8511j7094j6330j4954j3016j1813j1375j0180
57420A023594p791n796n389n871o174o256o207n465l779j808j45J210K100K190
57406I74413K026K801M592O043O205N600N131N049N343N973O432O188N750O149
57392A047695P272Q000Q052Q271Q852Q899Q103P402P457P805P980Q188Q324P727
57378A160027O472N728O204P267Q034Q360Q373Q162Q192Q962R975J0161R510R027
57364A274454R056Q965Q729R165J0310J1112J1116J1017J1122J0926J0597J1173
$$ plain form
57352 1397742 1410320 1423505 1435683 1446550 1457270 1468777 1481070 1493945 1507275 1520631 1533669
57341 1533669 1546853 1560922 1575858 1591174 1606875 1623175 1639658 1655744 1671635 1687813 1704026
57330 1704026 1719874 1735861 1752572 1769319 1785095 1800536 1817307 1835665 1854241 1872318 1890687
57319 1890687 1909996 1929815 1949859 1970749 1992989 2016231 2040037 2064377 2088988 2113287 2137379
57308 2137379 2162258 2188571 2215915 2243631 2271554 2299824 2328742 2358909 2390651 2423297 2455940
57297 2455940 2488886 2523289 2559422 2596577 2634749 2674916 2717319 2760957 2805426 2851896 2901365
57286 2901365 2953027 3005317 3057676 3110430 3163677 3217219 3271039 3325015 3378427 3430224 3479388
57275 3479388 3524652 3564406 3597410 3623283 3642207 3654777 3662314 3666491 3668196 3667398 3664429 3660743 3658017
$$ packed form
57352A397742J2578J3185J2178J0867J0720J1507J2293J2875J3330J3356J3038
57341A533669J3184J4069J4936J5316J5701J6300J6483J6086J5891J6178J6213
57330A704026J5848J5987J6711J6747J5776J5441J6771J8358J8576J8077J8369
57319A890687J9309J9819K0044K0890K2240K3242K3806K4340K4611K4299K4092
57308B137379K4879K6313K7344K7716K7923K8270K8918L0167L1742L2646L2643
57297B455940L2946L4403L6133L7155L8172M0167M2403M3638M4469M6470M9469
57286B901365N1662N2290N2359N2754N3247N3542N3820N3976N3412N1797M9164
57275C479388M5264L9754L3004K5873J8924J2570P537M177J705p98k969l686k726
$$ plain form
57262 3658017 3657233 3658910 3663388 3670338 3678763 3688101 3698817 3711524 3726209 3742747 3761457 3782500 3805290
57249 3805290 3829049 3853439 3878251 3903094 3927965 3953549 3980373 4008118 4036176 4064362 4092643
57238 4092643 4120764 4148638 4176577 4204584 4231957 4258134 4283364 4308018 4331813 4354443 4376583
57227 4376583 4399486 4423790 4449250 4475416 4502109 4529469 4558035 4588605 4621626 4656876 4693914
57216 4693914 4732411 4771767 4810953 4849277 4887048 4925035 4963530 5002224 5040679 5078552 5115639
57205 5115639 5152082 5188366 5225001 5262444 5301269 5341731 5383050 5423741 5462947 5500759 5537094
57194 5537094 5571287 5603294 5634351 5665569 5696546 5726286 5754900 5783439 5812378 5841263 5869635
57183 5869635 5897445 5924596 5950947 5976894 6003374 6031168 6060536 6091344 6123048 6154669 6185372
$$ packed form
57262C658017p84J677M478O950Q425R338J0716J2707J4685J6538J8710K1043K2790
57249C805290K3759K4390K4812K4843K4871K5584K6824K7745K8058K8186K8281
57238D092643K8121K7874K7939K8007K7373K6177K5230K4654K3795K2630K2140
57227D376583K2903K4304K5460K6166K6693K7360K8566L0570L3021L5250L7038
57216D693914L8497L9356L9186L8324L7771L7987L8495L8694L8455L7873L7087
57205E115639L6443L6284L6635L7443L8825M0462M1319M0691L9206L7812L6335
57194E537094L4193L2007L1057L1218L0977K9740K8614K8539K8939K8885K8372
57183E869635K7810K7151K6351K5947K6480K7794K9368L0808L1704L1621L0703
$$ plain form
57172 6185372 6215168 6244640 6274033 6303021 6331381 6359490 6387998 6417136 6446307 6474315 6500235
57161 6500235 6524147 6546677 6567677 6585872 6600209 6611107 6619903 6627403 6633507 6637895 6640509 6641568
57149 6641568 6641684 6641782 6642186 6641669 6637782 6628219 6611702 6587935 6557431 6521500 6481932 6440360 6397933
57136 6397933 6355433 6313454 6272532 6233370 6196943 6164268 6136218 6113590 6096922 6085866 6078918
57125 6078918 6074017 6069131 6061984 6049667 6029342 5999618 5961087 5915726 5866165 5815467 5766990 5723917
57113 5723917 5688448 5661152 5641050 5626691 5617428 5613689 5616410 5627100 5648939 5687370 5749356 5842747
57101 5842747 5976985 6163800 6416078 6745574 7161663 7671735 8282378 9001096 9838428
57092 9838428 10808793 11928352 13211265 14667097 16299462 18103363 20060734 22137159
$$ packed form
57172F185372K9796K9472K9393K8988K8360K8109K8508K9138K9171K8008K5920
57161F500235K3912K2530K1000J8195J4337J0898Q796P500O104M388K614J059
57149F641568J16R8M04n17l887r563j6517k3767l0504l5931l9568m1572m2427
57136F397933m2500m1979m0922l9162l6427l2675k8050k2628j6668j1056o948
57125F078918m901m886p147j2317k0325k9724l8531m5361m9561n0698m8477m3073
57113E723917l5469k7296k0102j4359r263l739K721J0690K1839L8431O1986R3391
57101E842747J34238J86815K52278L29496M16089N10072O10643P18718Q37332
57092I838428R70365J119559J282913J455832J632365J803901J957371K076425
$$ plain form
57084 22137159 24282279 26433972 28526760 30505035 32335491 34005568 35500551 36772930
57076 36772930 37732279 38271061 38310310 37831359 36874120 35511552 33823849 31886399 29769447
57067 29769447 27541115 25268399 23014923 20836494 18776962 16866801 15124279 13557187
57059 13557187 12164204 10936737 9861612 8923492 8106350 7394568 6773938 6231941 5757280
57050 5757280 5339675 4970258 4641750 4348012 4083674 3844241 3626099 3426118 3241425
57041 3241425 3069620 2908922 2758037 2616202 2483313 2359608 2245078 2139315 2041807 1952014
57031 1952014 1869352 1793517 1724639 1662574 1606233 1554220 1505942 1461397 1420076 1380985 1343838
57020 1343838 1309340 1278056 1249703 1223657 1199491 1176855 1155558 1135855 1117989 1101493 1085782
$$ packed form
57084B2137159K145120K151693K092788J978275J830456J670077J494983J272379
57076C6772930R59349N38782L9249m78951r57239j362568j687703j937450k116952
57067B9769447k228332k272716k253476k178429k059532j910161j742522j567092
57059A3557187j392983j227467j075125r38120q17142p11782o20630n41997m74661
57050E757280m17605l69417l28508k93738k64338k39433k18142j99981j84693
57041C241425j71805j60698j50885j41835j32889j23705j14530j05763r7508q9793
57031A952014q2662p5835o8878o2065n6341n2013m8278m4545m1321l9091l7147
57020A343838l4498l1284k8353k6046k4166k2636k1297j9703j7866j6496j5711
$$ plain form
57009 1085782 1071449 1059998 1052272 1048172 1048029 1053096 1064451 1082605 1108592 1144318 1191550 1251824
56997 1251824 1327935 1424590 1547246 1700441 1884654 2089308 2286394 2435252 2500691 2470959
56987 2470959 2360531 2198325 2014011 1830689 1662714 1515929 1390161 1282752 1190201 1108046
56977 1108046 1031865 959523 891713 830097 775753 729306 691190 661243 638756 623059 613359
56966 613359 608144 605727 605539 608079 613698 622274 634022 649541 668957 691845 717738 745414 771501
56953 771501 791086 800461 798845 787599 768940 745702 721033 697321 675664 656606 640687 627993
56941 627993 618002 610453 605903 605081 608104 614633 624358 637109 653031 672889 697684 727360 759716
56928 759716 790402 813851 824985 821338 804155 777238 744683 709844 675650 644482 617293 593624
$$ packed form
57009A085782j4333j1451p726m100j43N067J1355J8154K5987L5726M7232O0274
56997A251824P6111R6655J22656J53195J84213K04654J97086J48858O5439k9732
56987B470959j10428j62206j84314j83322j67975j46785j25768j07409r2551q2155
56977A108046p6181p2342o7810o1616n4344m6447l8116k9947k2487j5697r700
56966F13359n215k417j88K540N619Q576J1748J5519J9416K2888K5893K7676K6087
56953G71501J9585R375j616j1246j8659k3238k4669k3712k1657j9058j5919j2694
56941F27993r991p549m550q22L023O529R725J2751J5922J9858K4795K9676L2356
56928G59716L0686K3449J1134l647j7183k6917l2555l4839l4194l1168k7189k3669
$$ plain form
56916 593624 572866 555000 540037 527505 516888 508059 500939 495110 489947 484845 479320 473374 467744
56903 467744 463268 459925 456981 454104 451751 450403 450033 450451 451665 453771 456972 461798 468882 478519 490865
56888 490865 506423 525745 548686 574403 601733 628687 651742 666906 672088 668104 657382 642484
56876 642484 625826 609696 595728 584638 576655 571781 569669 570005 573254 580542 592634 609658 631947
56863 631947 660492 696328 740069 792154 852518 918958 985701 1043885 1084067 1099571 1089084
56852 1089084 1056865 1010311 956986 903259 854124 812626 779444 754004 736167 726356 724581 730585
56840 730585 744835 768295 801407 844519 899215 967800 1051169 1148029 1255226 1366013 1467192
56829 1467192 1540869 1572348 1557395 1502409 1419317 1321024 1219234 1122899 1037110 963628 902520
$$ packed form
56916E93624k0758j7866j4963j2532j0617q829p120n829n163n102n525n946n630
56903D67744m476l343k944k877k353j348l70M18J214K106L201M826P084R637J2346
56888D90865J5558J9322K2941K5717K7330K6954K3055J5164N182l984j0722j4898
56876F42484j6658j6130j3968j1090p983m874k112L36L249P288J2092J7024K2289
56863F31947K8545L5836M3741N2085O0364O6440O6743N8184M0182J5504j0487
56852A089084l2219m6554n3325n3727m9135m1498l3182k5440j7837r811j775O004
56840G30585J4250K3460L3112M3112N4696O8585Q3369R6860J07197J10787J01179
56829A467192P3677L1479j4953n4986q3092r8293j01790r6335q5789p3482o1108
$$ plain form
56818 902520 853209 814880 786926 769010 760445 760199 768092 785480 814169 855123 908586 974396
56806 974396 1050637 1131509 1206786 1263750 1290915 1282370 1240452 1174342 1095306 1012681 933051 860780
56794 860780 797886 744285 699452 663670 637199 619104 607867 602603 602952 608568 619702 637633
56782 637633 663382 696257 734290 775104 814948 847514 865660 865051 845851 811471 766845 717501
56770 717501 668375 622475 580964 544447 513387 487387 465264 446352 430972 419218 409960 401606
56758 401606 393456 385849 379309 373976 369752 366587 364445 363073 362008 360924 359865 358861 357427 354984
56744 354984 351828 349101 347474 346392 344996 343221 341500 339897 338188 336424 334735 332834 330395 327800
56730 327800 325846 324722 323774 322330 320352 318290 316643 315639 315113 314766 314669 315266 316693 318388 319677 320353
$$ packed form
56818I02520m9311l8329k7954j7916q565k46P893J7388K8689M0954N3463O5810
56806I74396P6241Q0872P5277N6964K7165q545m1918o6110p9036q2625p9630p2271
56794H60780o2894n3601m4833l5782k6471j8095j1237n264L49N616J1134J7931
56782F37633K5749L2875L8033M0814L9844L2566J8146o09j9200l4380m4626m9344
56770G17501m9126m5900m1511l6517l1060k6000k2123j8912j5380j1754r258q354
56758D01606q150p607o540n333m224l165k142j372j065j084j059j004j434k443
56744C54984l156k727j627j082j396j775j721j603j709j764j689j901k439k595
56730C27800j954j124r48j444j978k062j647j004n26l47r7N97J427J695J289O76
$$ plain form
56714 320353 320379 319410 317075 313562 309547 305695 302367 299591 297106 294729 292814 291947 292067 292423 292555 292655
56698 292655 292725 292184 290767 289062 287585 286049 284211 282760 282509 283236 284096 284758 285342 285748 285910 286406 287863
56681 287863 289954 291708 292702 293270 293827 294660 296073 297964 299422 299513 298387 296991 295897 295071 294538 294516 294860
56664 294860 295052 294675 293515 291449 288804 286495 285177 284458 283557 282396 281382 280407 278904 276731 274229
56649 274229 271489 268225 264283 259686 254367 248502 242874 238251 234552 231237 228280 226033 224430 223088
56635 223088 222106 221941 222581 223537 224577 225782 226999 227919 228597 229231 229622 229488 229146 229160 229513 229876 230412 231472
56617 231472 232658 233093 232591 231753 230979 230245 229829 230321 231805 233736 235683 237528 239064 240126 241065 242334
56601 242334 243719 244805 245980 248023 250793 253346 255322 257119 258675 259333 259155 259172 259828 260225 259515 258146
$$ packed form
56714C20353K6r69k335l513m015l852l328k776k485k377j915q67J20L56J32J00
56698B92655P0n41j417j705j477j536j838j451k51P27Q60O62N84M06J62M96J457
56681B87863K091J754R94N68N57Q33J413J891J458R1j126j396j094q26n33k2L44
56664B94860J92l77j160k066k645k309j318p19r01j161j014r75j503k173k502
56649B74229k740l264l942m597n319n865n628m623l699l315k957k247j603j342
56635B23088r82j65O40R56J040J205J217R20O78O34L91j34l42J4L53L63N36J060
56617B31472J186M35n02q38p74p34m16M92J484J931J947J845J536J062R39J269
56601B42334J385J086J175K043K770K553J976J797J556O58j78J7O56L97p10j369
$$ plain form
56585 258146 257073 256482 256010 255677 255912 256919 258560 260650 263116 266013 269532 273682 277987 281929 285722
56570 285722 290161 295588 301547 307556 313719 320366 327561 335171 343138 351557 360769 371310 383391 396466
56556 396466 409632 422338 434347 445309 454967 463564 471430 478271 483464 486820 488459 488154 485625
56543 485625 481307 476018 469889 462454 453736 444366 434612 424136 412844 401204 389534 377752 366007
56530 366007 354975 345338 337398 331114 325935 320858 315400 310386 306939 304823 302640 299601 296122 292691
56516 292691 289172 285411 281577 277689 273655 269968 267484 266238 265266 263845 262217 260922 260121 259723 259522
56501 259522 259106 258258 257408 257043 256843 256216 255434 255228 255433 255214 254617 254669 255829 257495 259191 261030 262819
56484 262819 263948 264455 265056 265851 266242 266438 267654 270305 273286 275641 277758 280243 282802 285039 287274
$$ packed form
56585B58146j073n91m72l33K35J007J641K090K466K897L519M150M305L942L793
56570B85722M439N427N959O009O163O647P195P610P967Q419R212J0541J2081J3075
56556C96466J3166J2706J2009J0962R658Q597P866O841N193L356J639l05k529
56543D85625m318n289o129p435q718r370r754j0476j1292j1640j1670j1782j1745
56530C66007j1032r637p940o284n179n077n458n014l447k116k183l039l479l431
56516B92691l519l761l834l888m034l687k484j246r72j421j628j295q01l98k01
56501B59522m16q48q50l65k00o27p82k06K05k19n97N2J160J666J696J839J789
56484B62819J129N07O01P95L91J96J216K651K981K355K117K485K559K237K235
$$ plain form
56469 287274 289784 292182 294363 297067 300639 304075 306308 307792 309893 313183 317127 321083 324820 328284
56455 328284 331387 334023 336161 338081 340330 342915 344840 345351 345418 346791 349588 352137 353438 354372 355998
56440 355998 358046 359779 361088 361937 361790 360443 358568 356636 354170 350671 346510 342248 337974 333901 330660
56425 330660 328287 325730 322066 317515 312755 308126 303981 300808 298354 295612 292284 289345 287551 286441
56411 286441 285449 284890 285058 285440 285698 286430 288060 289844 290835 290978 290507 289221 287209 285360 284306 283744 283486
56394 283486 284132 285894 287906 289621 291742 294798 297987 300634 303557 307631 311944 314887 316331 317344
56380 317344 318404 319245 319874 320448 320627 320206 319915 320469 321375 321787 322046 323162 325213 327394 329299 331146 333026
56363 333026 334808 336455 337701 337864 336717 335091 334020 333853 334612 336289 338231 339318 339518 340119 341635
$$ packed form
56469B87274K510K398K181K704L572L436K233J484K101L290L944L956L737L464
56455C28284L103K636K138J920K249K585J925N11O7J373K797K549J301R34J626
56440C55998K048J733J309Q49j47j347j875j932k466l499m161m262m274m073l241
56425C30660k373k557l664m551m760m629m145l173k454k742l328k939j794j110
56411B86441r92n59J68L82K58P32J630J784R91J43m71j286k012j849j054n62k58
56394B83486O46J762K012J715K121L056L189K647K923M074M313K943J444J013
56380C17344J060Q41O29N74J79m21k91N54R06M12K59J116K051K181J905J847J880
56363C33026J782J647J246J63j147j626j071j67P59J677J942J087K00O01J516
$$ plain form
56348 341635 342835 342865 342905 344335 346556 348177 349262 350783 352837 355101 358130 362398 366796 369907 372284
56333 372284 375736 380833 386763 393196 400575 408835 417386 426111 435000 443176 449792 455544 461913 469244
56319 469244 476891 484712 492869 500592 506756 511420 515347 518388 519814 519841 519332 518436 517044 516086 516558 517615
56303 517615 517392 515572 513491 511955 510816 510511 512027 515152 518478 521398 524596 528509 532894 538019 544577
56288 544577 552207 559668 566832 575107 585529 597794 611456 626687 643479 661273 679818 699465
56276 699465 720462 742892 767369 794809 825560 859697 897872 940751 987838 1038145 1092000
56265 1092000 1151069 1216777 1289814 1370810 1460306 1558322 1665211 1782480 1911355 2050892
56255 2050892 2198949 2354522 2517489 2686400 2858281 3030283 3199681 3362371 3513287
$$ packed form
56348C41635J200L0M0J430K221J621J085J521K054K264L029M268M398L111K377
56333C72284L452N097N930O433P379Q260Q551Q725Q889Q176O616N752O369P331
56319D69244P647P821Q157P723O164M664L927L041J426K7n09q96j392r58M72J057
56303E17615k23j820k081j536j139l05J516L125L326K920L198L913M385N125O558
56288E44577P630P461P164Q275J0422J2265J3662J5231J6792J7794J8545J9647
56276F99465K0997K2430K4477K7440L0751L4137L8175M2879M7087N0307N3855
56265A092000N9069O5708P3037Q0996Q9496R8016J06889J17269J28875J39537
56255B050892J48057J55573J62967J68911J71881J72002J69398J62690J50916
$$ plain form
56246 3513287 3648490 3765312 3860719 3931523 3976519 3996857 3994295 3970718 3929252 3873886 3807661
56235 3807661 3732719 3652024 3569153 3486117 3403061 3320166 3238058 3156233 3073039 2987589 2900055
56224 2900055 2809851 2715446 2616384 2513852 2409005 2302382 2195166 2089166 1985096 1882594
56214 1882594 1782232 1685799 1594385 1508019 1427407 1353970 1287663 1226736 1170270 1119093 1073626
56203 1073626 1032783 995692 962667 933653 907444 883295 861723 842998 826340 811305 798411
56192 798411 787737 778410 770048 763241 758041 753580 749709 747398 746952 747500 748816 751904 757116 763427
56178 763427 770328 778748 789264 800952 812809 824869 837267 849696 862468 876467 891299 905013
56166 905013 916403 926137 934993 942539 948265 952486 955360 956467 956080 955516 955593 956116 957289 960134 964962
$$ packed form
56246C513287J35203J16822R5407P0804M4996K0338k562k3577m1466n5366o6225
56235C807661p4942q0695q2871q3036q3056q2895q2108q1825q3194q5450q7534
56224B900055r0204r4405r9062j02532j04847j06623j07216j06000j04070j02502
56214A882594j00362r6433r1414q6366q0612p3437o6307o0927n6466n1177m5467
56203A073626m0843l7091l3025k9014k6209k4149k1572j8725j6658j5035j2894
56192G98411j0674r327q362o807n200m461l871k311m46N48J316L088N212O311
56178G63427O901Q420J0516J1688J1857J2060J2398J2429J2772J3999J4832J3714
56166I05013J1390R734Q856P546N726M221K874J107l87n64P7N23J173K845M828
$$ plain form
56151 964962 971014 978178 987582 1000012 1015220 1033304 1055219 1081608 1112653 1149468 1193875 1246456
56139 1246456 1306539 1374565 1452836 1543627 1648144 1767243 1900835 2045864 2196442 2346207
56129 2346207 2489068 2618522 2729460 2821651 2899413 2967482 3028870 3085839 3139144 3185348 3217909
56118 3217909 3232382 3228926 3209949 3178469 3139075 3096495 3051080 2997922 2931558 2849426 2750508
56107 2750508 2634421 2503850 2365422 2226441 2092478 1968362 1858234 1763097 1680837 1609790
56097 1609790 1549861 1499638 1455734 1416199 1381588 1351627 1324150 1298539 1276717 1259257 1243920
56086 1243920 1229519 1217657 1208966 1201307 1193650 1188124 1186074 1185650 1185469 1187081 1191411 1196341 1200452 1205758
56072 1205758 1214036 1223701 1233003 1243060 1254952 1267010 1277825 1288900 1301581 1314451 1326488 1339611
$$ packed form
56151I64962O052P164R404J2430J5208J8084K1915K6389L1045L6815M4407N2581
56139A246456O0083O8026P8271R0791J04517J19099J33592J45029J50578J49765
56129B346207J42861J29454J10938R2191P7762O8069O1388N6969N3305M6204L2561
56118C217909J4473l456j8977l1480l9394m2580m5415n3158o6364q2132r8918
56107B750508j16087j30571j38428j38981j33963j24116j10128r5137q2260p1047
56097A609790n9929n0223m3904l9535l4611k9961k7477k5611k1822j7460j5337
56086A243920j4401j1862q691p659p657n526k050m24j81J612M330M930M111N306
56072A205758Q278R665R302J0057J1892J2058J0815J1075J2681J2870J2037J3123
$$ plain form
56060 1339611 1355310 1371887 1387826 1404571 1423198 1441819 1459294 1477967 1499468 1521301 1541004
56049 1541004 1560260 1581433 1603441 1624754 1647041 1672046 1698054 1723369 1750174 1781096 1814956
56038 1814956 1849678 1886247 1925966 1967011 2007634 2049595 2094556 2140377 2185009 2230663 2279908
56027 2279908 2331052 2381631 2433131 2487865 2544495 2601013 2658790 2719257 2780144 2839402 2899296
56016 2899296 2962220 3026491 3090932 3159364 3235305 3316217 3398295 3482843 3572515 3665582 3759848
56005 3759848 3858156 3964065 4076026 4191667 4313608 4444958 4583485 4726524 4877187 5039407
55995 5039407 5211553 5391457 5582562 5788141 6004848 6229546 6466996 6722894 6994959
55986 6994959 7279234 7579393 7901062 8242962 8603112 8987869 9405212 9855246 10337382
$$ packed form
56060A339611J5699J6577J5939J6745J8627J8621J7475J8673K1501K1833J9703
56049A541004J9256K1173K2008K1313K2287K5005K6008K5315K6805L0922L3860
56038A814956L4722L6569L9719M1045M0623M1961M4961M5821M4632M5654M9245
56027B279908N1144N0579N1500N4734N6630N6518N7777O0467O0887N9258N9894
56016B899296O2924O4271O4441O8432P5941Q0912Q2078Q4548Q9672R3067R4266
56005C759848R8308J05909J11961J15641J21941J31350J38527J43039J50663J62220
55995E039407J72146J79904J91105K05579K16707K24698K37450K55898K72065
55986F994959K84275L00159L21669L41900L60150L84757M17343M50034M82136
$$ plain form
55977 10337382 10860341 11434539 12061609 12742824 13490552 14319472 15234747 16242396 17363630
55968 17363630 18625419 20046372 21648184 23473024 25574347 28001148 30809348 34077292
55960 34077292 37889075 42313648 47424090 53330012 60174256 68120343 77379602 88244835
55952 88244835 101077792 116296104 134426003 156159795 182298793 213542683 250069712
55945 250069712 290769823 332311440 368915915 393773658 401789204 391869548 367079331
55938 367079331 332765800 294275338 255656274 219463476 187042415 158869934 134883020
55931 134883020 114753055 98030164 84199466 72749280 63243407 55329809 48706650
55924 48706650 43117613 38370134 34322659 30852014 27850493 25242187 22973694 20989475
$$ packed form
55977A0337382N22959N74198O27070O81215P47728Q28920R15275J007649J121234
55968A7363630J261789J420953J601812J824840K101323K426801K808200L267944
55960C4077292L811783M424573N110442N905922O844244P946087R259259J0865233
55952H8244835J2832957J5218312J8129899K1733792K6138998L1243890L6527029
55945B50069712M0700111M1541617L6604475K4857743Q015546r919656k4790217
55938C67079331l4313531l8490462l8619064l6192798l2421061k8172481k3986914
55931A34883020k0129965j6722891j3830698j1450186r505873p913598o623159
55924D8706650n589037m747479m047475l470645l001521k608306k268493j984219
$$ plain form
55916 20989475 19233822 17670121 16277837 15033891 13913482 12903836 11999394 11186169
55908 11186169 10445459 9768990 9155736 8597331 8080740 7602182 7164810 6765058 6393951
55899 6393951 6049405 5734782 5446978 5177535 4924059 4689740 4473023 4268114 4074449
55890 4074449 3895848 3731355 3576024 3429482 3294829 3170358 3051020 2936817 2831344
55881 2831344 2733306 2637864 2545271 2459925 2381675 2306089 2232706 2165207 2103698 2044261 1985989
55870 1985989 1931462 1880408 1829726 1779720 1733773 1691758 1649919 1607209 1565873 1525961 1485271
55859 1485271 1444751 1408220 1376642 1347975 1322567 1303337 1290761 1282977 1280699 1286567 1299142 1312311
55847 1312311 1320988 1323197 1317261 1302189 1281044 1259166 1238474 1217327 1195422 1174307 1153358 1129991
$$ packed form
55916B0989475j755653j563701j392284j243946j120409j009646r04442q13225
55908A1186169p40710o76469o13254n58405n16591m78558m37372l99752l71107
55899F393951l44546l14623k87804k69443k53476k34319k16717k04909j93665
55890D074449j78601j64493j55331j46542j34653j24471j19338j14203j05473
55881B831344r8038r5442r2593q5346p8250p5586p3383o7499o1509n9437n8272
55870A985989n4527n1054n0682n0006m5947m2015m1839m2710m1336l9912m0690
55859A485271m0520l6531l1578k8667k5408j9230j2576p784k278N868J2575J3169
55847A312311Q677K209n936j5072k1145k1878k0692k1147k1905k1115k0949k3367
$$ plain form
55835 1129991 1104100 1078106 1052620 1026146 998798 972166 945774 917975 890203 865991 845763
55824 845763 826771 808028 791033 775620 759490 742285 726109 711684 697794 684661 673980
55813 673980 665419 656911 648625 642911 640159 638448 637342 638180 640494 642071 642801 644593 647149 647826 646129
55798 646129 644380 643304 640758 635572 628916 621062 610471 597103 583209 569831 555749 540757 526734
55785 526734 514556 503070 491961 482590 475118 467883 460534 454860 451700 449868 448716 448632 448207 444113
55771 444113 435044 423103 410406 397085 383410 370872 359998 349739 340078 332677 327964 324153
55759 324153 320044 316276 312992 308947 303836 298907 294290 288324 280496 272527 265578 258917 252270 246824
55745 246824 242831 238812 234340 231014 229431 227672 224287 220481 217935 216579 215853 216104 217325 218421 219019
$$ packed form
55835A129991k5891k5994k5486k6474k7348k6632k6392k7799k7772k4212k0228
55824H45763j8992j8743j6995j5413j6130j7205j6176j4425j3890j3133j0681
55813F73980q561q508q286n714k752j711j106Q38K314J577P30J792K556O77j697
55798F46129j749j076k546n186o656p854j0591j3368j3894j3378j4082j4992j4023
55785E26734j2178j1486j1109r371p472p235p349n674l160j832j152q4m25m094
55771D44113r069j1941j2697j3321j3675j2538j0874j0259r661p401m713l811
55759C24153m109l768l284m045n111m929m617n966p828p969o949o661o647n446
55745B46824l993m019m472l326j583j759l385l806k546j356p26K51J221J096N98
$$ plain form
55730 219019 220281 222781 225325 226792 227339 226940 224745 220916 217089 213992 210502 206011 201743 198668 196057
55715 196057 193172 190553 188608 186773 185021 184412 185284 186801 189048 193428 200149 207493 214574 222565 231988
55700 231988 241144 248586 254965 260951 265483 267803 269312 271625 274389 276610 278554 280669 282141 282103 280992
55685 280992 279323 276523 272334 267986 264612 261884 259466 258310 259129 260946 262566 264123 265914 267126
55671 267126 267124 266700 266722 266834 266739 267270 268775 269937 269720 269127 269492 270369 270728 270963 271907 272961 272967 272139 271505 271214
55651 271214 270850 270590 270514 269550 266574 261922 256509 250236 242566 233952 225255 216408 207015 197684 189415
55636 189415 182135 174980 167668 160611 154185 148765 144836 142137 139330 135416 130840 126507 122601 119143
55622 119143 116640 115097 113390 110752 107987 106069 104464 102124 99336 97256 96216 95691 95405 95318 95024
$$ packed form
55730B19019J262K500K544J467N47l99k195l829l827l097l490m491m268l075k611
55715A96057k885k619j945j835j752o09Q72J517K247M380O721P344P081P991R423
55700B31988R156P442O379N986M532K320J509K313K764K221J944K115J472l8j111
55685B80992j669k800m189m348l374k728k418j156Q19J817J620J557J791J212
55671B67126km24K2J12r5N31J505J162k17n93L65Q77L59K35R44J054Oq28o34k91
55651B71214l64k60p6r64k976m652n413o273p670q614q697q847r393r331q269
55636A89415p280p155p312p057o426n420l929k699k807l914m576m333l906l458
55622A19143k503j543j707k638k765j918j605k340k788k080j040n25k86q7k94
$$ plain form
55607 95024 94167 92996 91635 89503 86425 83574 82213 82101 82118 81823 81380 80672 79598 78781 78934 79928 81217
55590 81217 82616 83907 84505 84410 84714 86137 87754 88178 87335 86102 84886 83664 82758 82484 82459 82222 82001
55573 82001 82137 82392 82632 83379 84730 85579 85003 83764 83357 84190 85694 87472 89268 90468 90843 91185 92207
55556 92207 93358 93775 93691 93749 93679 92942 92084 92093 92827 93351 93448 93559 93601 93121 92376 92085 92323 92781 93858 96334
55536 96334 100032 103858 107136 110048 112882 115638 118239 120486 122025 122976 124117 125738 126856 126411 124711
55521 124711 122823 121084 119108 116745 114020 110631 106498 102372 98930 95737 92132 88639 86311 85011
55507 85011 83518 81105 77992 74524 70921 67648 64990 62438 59364 56067 53329 51257 49464 47980
55493 47980 47001 46062 44538 42739 41545 41142 41007 40822 40441 39356 37287 35084 33968 34022 34364 34527 34645
$$ packed form
55607I5024q57j171j361k132l078k851j361j12J7k95m43p08j074q17J53R94J289
55590H1217J399J291N98r5L04J423J617M24q43j233j216j222r06k74k5k37k21
55573H2001J36K55K40P47J351Q49n76j239m07Q33J504J778J796J200L75L42J022
55556I2207J151M17q4N8p0p37q58RP34N24R7J11M2m80p45k91K38M58J077K476
55536I6334L698L826L278K912K834K756K601K247J539R51J141J621J118m45j700
55521A24711j888j739j976k363k725l389m133m126l442l193l605l493k328j300
55507H5011j493k413l113l468l603l273k658k552l074l297k738k072j793j484
55493D7980r79r39j524j799j194m03j35j85l81j085k069k203j116N4L42J63J18
$$ plain form
55476 34645 34490 33553 32115 31197 31308 31943 32354 32177 31490 30861 31116 32381 33726 34375 34684 35112 34987 33491
55458 33491 31398 30441 31105 32281 33021 33443 33881 34284 34623 35060 35532 35872 36244 36835 37350 37495 37601 37962
55440 37962 37996 37016 35475 34414 33993 33656 33429 33866 34851 35656 36142 36809 37659 38070 37847 37446 37151 36919 36966
55421 36966 37573 38426 38994 39444 40268 41235 41655 41477 41166 40792 40269 40185 41134 42470 42965 42604 42445 42826 43060
55402 43060 42898 42947 43503 44245 45133 46346 47217 46653 44878 43498 43475 44223 44957 45619 46098 45802 44566 42941
55384 42941 41184 38986 36608 35142 35140 35920 36637 37051 36958 36028 34687 33966 33886 33117 30915 28320 26602 25583
55366 25583 24458 23453 23506 24732 26199 27050 27242 27282 27673 28480 29167 29190 28837 29041 30212 31806 33132 33917
55348 33917 33865 32527 30069 27620 26337 26464 27496 28746 29625 29977 30378 31515 33069 33870 33369 32250
$$ packed form
55476C4645j55r37j438r18J11O35M11j77o87o29K55J265J345O49L09M28j25j496
55458C3491k093r57O64J176P40M22M38M03L39M37M72L40L72N91N15J45J06L61
55440C7962L4r80j541j061m21l37k27M37R85Q05M86O67Q50M11k23m01k95k32M7
55421C6966O07Q53N68M50Q24R67M20j78l11l74n23q4R49J336M95l61j59L81K34
55402D3060j62M9N56P42Q88J213Q71n64j775j380k3P48P34O62M79k96j236j625
55384D2941j757k198k378j466kP80P17M14r3r30j341p21q0p69k202k595j718j019
55366B5583j125j005N3J226J467Q51J92M0L91Q07O87K3l53K04J171J594J326P85
55348C3917n2j338k458k449j283J27J032J250Q79L52M01J137J554Q01n01j119
$$ plain form
55332 32250 31292 30375 29049 27439 26126 25579 26036 27413 28989 29674 29042 27766 26836 26706 27318 28370 29270
55315 29270 29311 28232 26431 24586 23359 23229 24020 24714 24449 23657 23504 24303 25374 26397 27777 29466 30556
55298 30556 30545 30030 29600 28891 27440 25801 25083 25725 27211 28661 29347 29073 28381 28096 28467 29109 29773 30580
55280 30580 31447 31995 32255 32783 33841 35049 36071 37011 37880 38351 38327 38162 38041 37664 36806 35602 34158 32476
55262 32476 30899 29957 29590 29210 28677 28466 28781 29302 29994 31295 33178 34843 35669 35746 35297 34475 33934 34531
55244 34531 35934 36539 35365 33288 31794 31325 31446 31903 32805 34162 35758 37134 37560 36715 35504 35308
55228 35308 36181 36803 36469 35971 36020 36106 35686 35305 35572 36068 36368 37148 39012 40972 41412 40156 38432 37198
55210 37198 36613 36826 37995 39569 40600 40850 40855 40934 40876 40555 40137 39669 39064 38447 38021 37638 37032 36367 36080
$$ packed form
55332C2250r58r17j326j610j313n47M57J377J576O85o32j276r30j30O12J052R00
55315B9270M1j079j801j845j227j30P91O94k65p92j53P99J071J023J380J689J090
55298C0556j1n15m30p09j451j639p18O42J486J450O86k74o92k85L71O42O64Q07
55280C0580Q67N48K60N28J058J208J022R40Q69M71k4j65j21l77q58j204j444j682
55262C2476j577r42l67l80n33k11L15N21O92J301J883J665Q26P7m49q22n41N97
55244C4531J403O05j174k077j494m69J21M57R02J357J596J376M26q45j211j96
55228C5308Q73O22l34m98M9Q6m20l81K67M96L00P80J864J960M40j256j724j234
55210C7198n85K13J169J574J031K50NP9n8l21m18m68o05o17m26l83o06o65k87
$$ plain form
55191 36080 36281 36759 37437 38355 39300 39861 39777 38966 37428 35493 33841 32826 31924 30200 27263 23557 19930
55174 19930 17137 15497 14741 14368 14265 14691 15672 16868 18154 19795 21915 24338 27039 30050 32754 34104
55158 34104 33885 33016 32245 31355 30104 29058 28838 29271 29937 30818 31781 32173 31737 31292 31676 32559 33068 33020 32775
55139 32775 32424 32007 32005 32711 33503 33682 33680 34523 36371 38423 40054 41188 41811 41989 42288 43413 45401 47684
55121 47684 49766 51333 52072 52053 51960 52227 52245 51239 49715 49121 50144 52014 53510 53993 53528 52558 51520
55104 51520 50428 48959 47256 46244 46636 48022 49496 50763 51999 53044 53597 53938 54654 55794 56960
55089 56960 57977 58776 58956 58289 57517 57763 59163 60810 61968 62697 63346 64124 65114 66126 66648 66501 66338
55072 66338 66795 67409 67166 65981 64863 64642 65274 66367 67561 68373 68372 67701 66916 66324 66004 66226 67143 68094
$$ packed form
55191C6080K01M78O78R18R45N61q4q11j538j935j652j015r02j724k937l706l627
55174A9930k793j640p56l73j03M26R81J196J286J641K120K423K701L011K704J350
55158C4104k19q69p71q90j251j046k20M33O66Q81R63L92m36m45L84Q83N09m8k45
55139C2775l51m17kP06P92J79kQ43J848K052J631J134O23J78K99J125J988K283
55121D7684K082J567P39j9r3K67J8j006j524n94J023J870J496M83m65r70j038
55104E1520j092j469j703j012L92J386J474J267J236J045N53L41P16J140J166
55089E6960J017P99J80o67p72K46J400J647J158P29O49P78R90J012N22j47j63
55072F6338M57O14k43j185j118k21O32J093J194Q12jo71p85n92l20K22R17R51
$$ plain form
55054 68094 67991 66510 64318 62156 60333 59084 58669 58908 59233 59349 59467 59842 60531 61559 62808 63795 64086
55037 64086 63933 63975 64344 64515 64063 63087 61915 60760 59662 58488 57211 56371 56828 58595 60479 61460 61912
55020 61912 62713 63740 64227 64226 64550 65429 66318 66986 67738 68502 68732 68386 68062 67996 67798 67319 66873 66457 65618 64342
55000 64342 63210 62428 61574 60583 60065 60271 60562 60391 60073 60110 60408 60629 60751 60776 60423 59662 59135 59537 60793
54981 60793 62206 63186 63621 63781 64154 65172 66936 69299 72083 74947 77243 78542 79272 80300 81911 83687
54965 83687 85356 87140 89211 91381 93460 95461 97479 99852 103389 108740 115524 122714 129885 137492
54951 137492 145887 154823 164065 173796 184272 195529 207389 219065 228820 234850 236602 234610 229169
54938 229169 220181 208326 195279 182393 170074 158642 148667 140027 131698 123130 114966 107890 101755
$$ packed form
55054F8094j03j481k192k162j823j249m15K39L25J16J18L75O89J028J249R87K91
55037F4086j53M2L69J71m52r76j172j155j098j174j277q40M57J767J884R81M52
55020F1912Q01J027M87jL24Q79Q89O68P52P64K30l46l24o6j98m79m46m16q39j276
55000F4342j132p82q54r91n18K06K91j71l18L7K98K21J22K5l53p61n27M02J256
54981F0793J413R80M35J60L73J018J764K363K784K864K296J299P30J028J611J776
54965H3687J669J784K071K170K079K001K018K373L537N351O784P190P171P607
54951A37492Q395Q936R242R731J0476J1257J1860J1676R755O030J752j992n441
54938B29169q988j1855j3047j2886j2319j1432r975q640q329q568q164p076o135
$$ plain form
54925 101755 96501 92931 91545 91361 90888 89819 88851 88295 87908 87887 89090 92111 96735 102313 108257 114244
54909 114244 120380 127173 135139 144525 155437 167780 180807 193169 203748 212108 217854 220143 218372
54896 218372 212918 204667 194168 181798 168369 154927 142125 130360 120320 112662 107079 102233
54884 102233 96847 90737 84796 80238 77760 77073 77110 76860 76048 75050 74290 73802 73243 72292 71063 70139 70009
54867 70009 70533 71217 71830 72363 72495 71662 69829 67692 65920 64591 63516 62675 62131 61840 61748 61801 61797 61619 61588
54848 61588 62090 62739 62518 60960 58717 56751 55498 55045 55491 56656 57814 58152 57424 56019 54710 54309
54832 54309 55082 56372 57270 57672 58119 58644 58645 58020 57537 57699 58168 58770 60139 62652 65493 67605 69015 70454
54814 70454 72193 74053 76153 78727 81420 83535 84945 86182 87791 90036 93045 96684 100498 104282
$$ packed form
54925A01755n254l570j386j84m73j069r68n56l87k1J203L021M624N578N944N987
54909A14244O136O793P966R386J0912J2343J3027J2362J0579Q360N746K289j771
54896B18372n454q251j0499j2370j3429j3442j2802j1765j0040p658n583m846
54884A02233n386o110n941m558k478o87L7k50q12r98p60m88n59r51j229r24j30
54867G0009N24O84O13N33J32q33j833k137j772j329j075q41n44k91r2N3mj78l1
54848F1588N02O49k21j558k243j966j253m53M46J165J158L38p28j405j309m01
54832E4309P73J290Q98M02M47N25Jo25m83J62M69O02J369K513K841K112J410J439
54814G0454J739J860K100K574K693K115J410J237J609K245L009L639L814L784
$$ plain form
54800 104282 108542 114019 121031 129619 139980 152166 165665 179735 193877 207494 219567 229290
54788 229290 236710 242091 244916 244245 239873 232505 223034 212328 201503 191569 182729 174596 167057 160325
54774 160325 154302 148680 143731 140269 138604 138061 137767 137392 136984 136651 136724 137853 140502 144521 149393 154778
54758 154778 160681 167264 174697 183165 192948 204362 217549 232334 248524 266267 285761 306369
54746 306369 326328 343542 356447 364069 365799 361596 352232 338958 323054 305798 288366 271277
54734 271277 254242 237004 220136 204590 190750 178395 167402 157986 150293 144199 139425 135600
54722 135600 132304 129332 126745 124456 122065 119405 116848 114746 112983 111492 110742 111074 111959 112536 112591 112346
54706 112346 111642 110165 108366 107243 107159 107586 108041 108586 109272 109799 109970 109927 109759 109339 108757 108483 108926 110145
$$ packed form
54800A04282M260N477P012Q588J0361J2186J3499J4070J4142J3617J2073R723
54788B29290P420N381K825o71m372p368r471j0706j0825r934q840q133p539o732
54774A60325o023n622m949l462j665n43k94l75m08l33P3J129K649M019M872N385
54758A54778N903O583P433Q468R783J1414J3187J4785J6190J7743J9494K0608
54746C06369J9959J7214J2905P622J730m203r364j3274j5904j7256j7432j7089
54734B71277j7035j7238j6868j5546j3840j2355j0993r416p693o094m774l825
54722A35600l296k972k587k289k391k660k557k102j763j491p50L32Q85N77N5k45
54706A12346p04j477j799j123q4M27M55N45O86N27J71m3j68m20n82k74M43J219
$$ plain form
54688 110145 111973 114042 115675 116258 115840 114998 114158 113501 113348 113953 114830 115075 114604 114442 115472 117475 119781
54671 119781 122228 124942 127671 130059 132403 135527 139879 145127 150573 155619 159906 163399 166453 169534
54657 169534 172760 175913 178856 181714 184617 187622 191027 195440 201168 207672 214103 220369 227314 235741
54643 235741 245760 257308 270711 286153 302961 320123 337283 354422 370620 384058 393431 398524
54631 398524 399111 394237 383283 367147 347744 326799 305633 285417 266698 248983 231679 215376
54619 215376 201495 190725 182464 175767 170222 165822 162511 160074 158197 156620 155419 154911 155033 155087 154519
54604 154519 153641 153112 152969 152698 151984 150803 149014 146554 143867 141447 139022 135869 131894 127711 123688
54589 123688 119656 115703 112447 110222 108530 106647 104368 101939 99621 97559 95803 94281 92925 91785
$$ packed form
54688A10145J828K069J633N83m18q42q40o57j53O05Q77K45m71j62J030K003K306
54671A19781K447K714K729K388K344L124M352N248N446N046M287L493L054L081
54657A69534L226L153K943K858K903L005L405M413N728O504O431O266O945Q427
54643B35741J0019J1548J3403J5442J6808J7162J7160J7139J6198J3438R373N093
54631C98524N87m874j0954j6136j9403k0945k1166k0216j8719j7715j7304j6303
54619B15376j3881j0770q261o697n545m400l311k437j877j577j201n08J22N4n68
54604A54519q78n29j43k71p14j181j789k460k687k420k425l153l975m183m023
54589A23688m032l953l256k225j692j883k279k429k318k062j756j522j356j140
$$ plain form
54575 91785 90821 89711 88229 86682 85540 84773 84022 83276 82853 82785 82778 82719 82669 82446 81852 81275 81367 82085 82720 82980
54555 82980 83346 84246 85564 87094 88784 90228 90697 90101 89389 89615 91026 93249 95818 98195 99917 101159
54539 101159 102764 105340 108729 112709 117665 124052 131539 139205 146442 153283 160094 167245 174903 182758
54525 182758 190014 195796 199467 200620 199157 195529 190483 184295 176669 167604 157981 148899 140717 133096
54511 133096 125778 118964 112982 107876 103354 99136 95416 92869 91871 91764 91339 90081 88564 87595 87425
54496 87425 87903 88778 89582 89754 89263 88730 88654 88897 89235 89921 91289 93170 95163 97211 99481 101854 103948
54479 103948 105502 106489 107066 107651 108771 110461 112090 113107 113751 114665 116035 117510 118771 119725 120267 120324
54463 120324 120183 120341 120887 121284 120926 119804 118517 117656 117241 116747 115647 113883 111769 109629 107631 105839
$$ packed form
54575I1785r64j110j482j547j142p67p51p46m23o8pn9n0k23n94n77R2P18O35K60
54555H2980L66R00J318J530J690J444M69n96p12K26J411K223K569K377J722J242
54539A01159J605K576L389L980M956O387P487P666P237O841O811P151P658P855
54525A82758P256N782L671J153j463l628n046o188p626r065r623r082q182p621
54511A33096p318o814n982n106m522m218l720k547r98j07m25j258j517r69j70
54496H7425M78Q75Q04J72m91n33p6K43L38O86J368J881J993K048K270K373K094
54479A03948J554R87N77N85J120J690J629J017O44R14J370J475J261R54N42N7
54463A20324j41J58N46L97l58j122j287q61m15m94j100j764k114k140j998j792
$$ plain form
54447 105839 104168 102404 100519 98902 97967 97638 97488 97216 96681 95649 94083 92544 91745 91724 92008 92451 93149
54430 93149 93583 92835 90926 89049 88115 87922 88152 89206 91252 93255 93983 93597 93386 94208 95936 98165 100595
54413 100595 102795 104366 105429 106411 107372 108065 108666 109841 111965 114637 117106 118956 120387 121987 124195
54398 124195 126830 129314 131444 133562 135807 137691 138847 139670 140707 141764 142215 141829 140684 138609 135500
54383 135500 132023 129212 127321 125699 123735 121347 118571 115406 112144 109290 106994 105056 103475 102428
54369 102428 101675 100618 99070 97441 96071 94943 94101 93714 93573 93141 92329 91629 91305 91103 91030 91656 93150
54352 93150 94697 95495 95854 96648 97988 99181 99821 100280 101118 102533 104436 106590 108610 110208 111560 113142
54336 113142 115116 117104 118637 119607 120197 120557 120642 120289 119323 117599 115010 111601 107746 104107 101147 98719
$$ packed form
54447A05839j671j764j885j617r35l29j50k72n35j032j566j539p99k1K84M43O98
54430I3149M34p48j909j877r34j93K30J054K046K003P28l86k11Q22J728K229K430
54413A00595K200J571J063R82R61O93O01J175K124K672K469J850J431J600K208
54398A24195K635K484K130K118K245J884J156Q23J037J057M51l86j145k075l109
54383A35500l477k811j891j622j964k388k776l165l262k854k296j938j581j047
54369A02428p53j057j548j629j370j128q42l87j41m32q12p00l24k02p3O26J494
54352I3150J547P98L59P94J340J193O40M59Q38J415J903K154K020J598J352J582
54336A13142J974J988J533R70N90L60Q5l53r66j724k589l409l855l639k960k428
$$ plain form
54320 98719 96385 94132 92389 91250 90164 88686 87085 85755 84402 82410 79852 77466 75698 74399
54306 74399 73505 73324 73823 74208 73726 72505 71151 69876 68543 67351 66846 67143 67639 67701 67357 67136 67435 68175
54288 68175 68949 69356 69296 69033 68908 68995 69078 68924 68513 68077 68008 68583 69655 70724 71505 72181 72899 73350 73326 73394
54268 73394 74308 75823 76930 77373 78101 79805 81829 83078 83350 83052 82231 80808 79446 79141 79927 80760 80767
54251 80767 79960 78714 77290 76048 75386 75221 75078 74925 75318 76415 77441 77605 77143 76963 77514 78502 79498
54234 79498 80384 81210 81951 82500 82748 82644 82213 81509 80629 79859 79643 80109 80693 80650 79949 79267 79053 79022 78744 78298
54214 78298 78042 78105 78392 78840 79329 79584 79488 79442 80111 81714 83664 84948 84962 84065 83236 83048 83089 82590 81383
54195 81383 79952 78738 77844 77315 77130 76947 76392 75648 75262 75383 75724 76237 77074 77824 77614 76281 74709 73674
$$ packed form
54320I8719k334k253j743j139j086j478j601j330j353j992k558k386j768j299
54306G4399q94j81M99L85m82j221j354j275j333j192n05K97M96O2l44k21K99P40
54288F8175P74M07o0k63j25Q7Q3j54m11m36o9N75J072J069P81O76P18M51k4O8
54268G3394R14J515J107M43P28J704K024J249K72k98q21j423j362l05P86Q33P
54251H0767q07j246j424j242o62j65j43j53L93J097J026J64m62j80N51R88R96
54234G9498Q86Q26P41N49K48j04m31p04q80p70k16M66N84m3p01o82k14l1k78m46
54214G8298k56O3K87M48M89K55r6m6O69J603J950J284J4q97q29j88M1m99j207
54195H1383j431j214q94n29j85j83n55p44l86J21L41N13Q37P50k10j333j572j035
$$ plain form
54177 73674 73085 72751 73028 74072 75128 75316 74696 73909 73219 72638 72528 73209 74133 74262 73233 71604 70068
54160 70068 69017 68743 69362 70444 71246 71416 71169 70805 70470 70288 70371 70672 71061 71452 71622 71211 70256 69491 69645
54141 69645 70648 71858 72829 73419 73419 72660 71359 69911 68495 67328 66958 67655 68650 68745 67664 66232 65257
54124 65257 64876 65046 65919 67421 68952 69839 69888 69377 68777 68488 68528 68460 67860 66880 66100 65929 66423 67409 68433
54105 68433 68795 68204 67254 66696 66384 65579 64205 63038 62531 62190 61358 60099 59030 58714 59381 60818 62317
54088 62317 63199 63538 63967 64692 65180 65011 64498 64178 64174 64359 64743 65328 65918 66363 66679 66695 65944 64312 62502
54069 62502 61488 61590 62330 63038 63386 63504 63816 64615 65689 66523 66933 67263 67818 68425 68750 68763 68659 68551 68561
54050 68561 68981 69996 71364 72641 73702 74816 76296 78258 80676 83401 86103 88395 90119 91504 92975
$$ packed form
54177G3674n89l34K77J044J056J88o20p87o90n81j10O81R24J29j029j629j536
54160G0068j051k74O19J082Q02J70k47l64l35j82Q3L01L89L91J70m11r55p65J54
54141F9645J003J210R71N90%p59j301j448j416j167l70O97R95R5j081j432r75
54124F5257l81J70Q73J502J531Q87M9n11o00k89M0o8o00r80p80j71M94R86J024
54105F8433L62n91r50n58l12q05j374j167n07l41q32j259j069l16O67J437J499
54088F2317Q82L39M29P25M88j69n13l20mJ85L84N85N90M45L16J6p51j632j810
54069F2502j014J02P40P08L48J18L12P99J074Q34M10L30N55O07L25J3j04j08J0
54050F8561M20J015J368J277J061J114J480J962K418K725K702K292J724J385J471
$$ plain form
54035 92975 94842 97143 99755 102619 105773 109192 112741 116369 120222 124448 129025 133938 139353 145344
54021 145344 151512 157188 162015 166111 169637 172508 174655 176365 178151 180323 182782 185184 187220 188713
54007 188713 189541 189645 189167 188347 187077 184841 181508 178009 175587 174353 173237 171436 169131 166496 163018
53992 163018 158541 154191 151250 149589 148155 146615 145363 144135 142000 138956 136326 135006 134199 132593
53978 132593 130181 128192 127494 127676 127670 126909 125825 125268 125475 125752 125399 124688 124526 125341 126789 128445 130150
53961 130150 131651 132553 132768 132539 131978 131111 130359 130314 130926 131546 131960 132681 134023 135623 137245 139365 142463
53944 142463 146194 149755 152742 155313 157893 160981 164899 169379 173744 177632 181164 184316 186708 188246
53930 188246 189339 190126 190118 189052 187482 186028 184585 182918 181535 181226 182024 183242 184416 185701 187499 190168
$$ packed form
54035I2975J867K301K612K864L154L419L549L628L853M226M577M913N415N991
54021A45344O168N676M827M096L526K871K147J710J786K172K459K402K036J493
54007A88713Q28J04m78q20j270k236l333l499k422j234j116j801k305k635l478
53992A63018m477m350k941j661j434j540j252j228k135l044k630j320q07j606
53978A32593k412j989o98J82op61j084n57K07K77l53p11j62Q15J448J656J705
53961A30150J501R02K15k29n61q67p52m5O12O20M14P21J342J600J622K120L098
53944A42463L731L561K987K571K580L088L918M480M365L888L532L152K392J538
53930A88246J093P87qj066j570j454j443j667j383l09P98J218J174J285J798K669
$$ plain form
53914 190168 193876 198289 202616 206442 210326 215050 220483 225790 230670 235763 241680 248114 254136 259107
53900 259107 263090 266506 269555 272007 273554 274203 274144 273353 271647 269153 266324 263377 260102 256343 252280
53885 252280 248032 243438 238467 233451 228592 223627 218242 212529 206705 200791 194899 189480 184894 180992
53871 180992 177422 174021 170652 167057 163286 159865 157078 154404 151209 147709 144777 142934 141930 141127
53857 141127 139890 137790 134872 131658 128670 126098 124029 122577 121536 120356 118839 117365 116027 114138
53843 114138 111253 108230 106422 106027 105970 105321 104155 103020 102224 101740 101331 100699 99787 98841 97891 96508 94523
53826 94523 92669 91839 91958 92226 92335 92678 93429 94205 94772 95416 96392 97548 98660 99655 100380 100697 100920 101687
53808 101687 103139 104672 105741 106562 107809 109873 112573 115403 117984 120473 123499 127475 132079 136677
$$ packed form
53914A90168L708M413M327L826L884M724N433N307M880N093N917O434O022M971
53900B59107L983L416L049K452J547O49n9p91j706k494k829k947l275l759m063
53885B52280m248m594m971n016m859m965n385n713n824n914n892n419m586l902
53871A80992l570l401l369l595l771l421k787k674l195l500k932j843j004q03
53857A41127j237k100k918l214k988k572k069j452j041j180j517j474j338j889
53843A14138k885l023j808l95n7o49j166j135p96m84m09o32r12r46r50j383j985
53826I4523j854q30J19K68J09L43P51P76N67O44R76J156J112R95P25L17K23P67
53808A01687J452J533J069Q21J247K064K700K830K581K489L026L976M604M598
$$ plain form
53794 136677 141044 145251 149103 152341 155340 158872 163059 167205 170893 174543 178507 182144 184387 184987
53780 184987 184781 184819 185486 186405 186926 186704 185866 184622 182896 180568 177989 175846 174417 173245 171682 169561
53764 169561 167266 165378 164258 163720 163087 161826 160142 158660 157600 156590 155337 154026 152936 151998 150923
53749 150923 149509 147673 145446 143038 140691 138411 136150 134288 133485 133815 134426 134391 133679 132969 132671 132540
53733 132540 132236 131889 131883 132255 132561 132438 132082 131993 132301 132650 132743 132711 132820 133100 133409 133543 133119 131772 129818 128318
53713 128318 128040 128635 129323 129996 131018 132206 132880 132893 132853 133151 133494 133655 134075 135296 137147 138879 139950
53696 139950 140538 141495 143781 147612 152096 156032 159056 161666 164281 166884 169587 172734 176076 178513 179172
53681 179172 178427 177462 177153 177740 179204 181416 183979 186338 188101 189146 189520 189341 188733 187814 186847 186290 186340
$$ packed form
53794A36677M367M207L852L238K999L532M187M146L688L650L964L637K243O00
53780A84987k06L8O67R19N21k22q38j244j726k328k579k143j429j172j563k121
53764A69561k295j888j120n38o33j261j684j482j060j010j253j311j090r38j075
53749A50923j414j836k227k408k347k280k261j862q03L30O11l5p12p10k98j31
53733A32540l04l47oL72L06j23l56q9L08L49R3l2J09K80L09J34m24j347j954j500
53713A28318k78N95O88O73J022J188O74J3m0K98L43J61M20J221J851J732J071
53696A39950N88R57K286L831M484L936L024K610K615K603K703L147L342K437O59
53681A79172p45r65l09N87J464K212K563K359J763J045L74j79o08r19r67n57N0
$$ plain form
53664 186340 186457 185829 184358 182774 181650 180855 180102 179479 179086 178704 178274 178211 178735 179238 178888 177609 175968
53647 175968 174388 173080 172485 173042 174458 175862 176838 177799 179112 180336 180738 180336 180043 180779 182635 184936
53631 184936 186980 188584 189933 191081 191830 192083 192070 192094 192256 192555 193065 193818 194720 195799 197394 199758 202591
53614 202591 205277 207638 210126 213152 216439 219264 221229 222708 224572 227529 231606 236127 240271 243790
53600 243790 247160 250896 254744 257897 260111 262298 265615 270131 274850 279057 283069 287456 292069 296290
53586 296290 299920 303237 306296 308696 310142 310882 311528 312632 314356 316320 317851 318691 319314 320275 321381
53571 321381 321987 321972 321888 322114 322388 322298 321777 320977 320163 319909 320885 323057 325431 326984 327654 328152 328993 330048
53553 330048 330980 331812 332944 334661 336718 338568 340031 341498 343269 344996 346152 346815 347492 348327 349067 349773
$$ packed form
53664A86340J17o28j471j584j124p95p53o23l93l82m30o3N24N03l50j279j641
53647A75968j580j308n95N57J416J404R76R61J313J224M02m02k93P36J856K301
53631A84936K044J604J349J148P49K53j3K4J62K99N10P53R02J079J595K364K833
53614B02591K686K361K488L026L287K825J965J479J864K957M077M521M144L519
53600B43790L370L736L848L153K214K187L317M516M719M207M012M387M613M221
53586B96290L630L317L059K400J446P40O46J104J724J964J531Q40O23R61J106
53571C21381O06j5q4K26K74r0n21q00q14k54R76K172K374J553O70M98Q41J055
53553C30048R32Q32J132J717K057J850J463J467J771J727J156O63O77Q35P40P06
$$ plain form
53537 349773 350924 352754 355026 357592 360567 363836 367038 370246 374073 378788 383934 389098 394399 399851
53523 399851 404969 409564 414391 420318 427285 434720 442570 451221 460685 470654 481266 493058 506075
53510 506075 519597 532889 545812 558643 571670 585098 599117 613894 629577 646193 663537
53499 663537 681399 700012 719888 740991 762457 783529 804394 825618 847132 868368 889186
53488 889186 910001 931053 952105 972880 993294 1013259 1032657 1051509 1069773 1087149 1103599
53477 1103599 1119949 1137309 1155820 1174550 1192722 1210445 1228033 1245261 1261672 1277178 1291940
53466 1291940 1305997 1319370 1332254 1344716 1356326 1366437 1374723 1381199 1385845 1388558 1389411 1388652 1386350
53453 1386350 1382236 1376015 1367761 1357939 1347032 1335262 1322678 1309379 1295472 1280878 1265464 1249473
$$ packed form
53537C49773J151J830K272K566K975L269L202L208L827M715N146N164N301N452
53523C99851N118M595M827N927O967P435P850Q651R464R969J0612J1792J3017
53510E06075J3522J3292J2923J2831J3027J3428J4019J4777J5683J6616J7344
53499F63537J7862J8613J9876K1103K1466K1072K0865K1224K1514K1236K0818
53488H89186K0815K1052K1052K0775K0414J9965J9398J8852J8264J7376J6450
53477A103599J6350J7360J8511J8730J8172J7723J7588J7228J6411J5506J4762
53466A291940J4057J3373J2884J2462J1610J0111Q286O476M646K713Q53p59k302
53453A386350m114o221q254r822j0907j1770j2584j3299j3907j4594j5414j5991
$$ plain form
53441 1249473 1233477 1217701 1201634 1184683 1166994 1149200 1131489 1113499 1095213 1077321 1060382
53430 1060382 1044085 1027849 1011908 997258 984524 973390 963367 954723 948229 944069 941432 939343
53418 939343 937657 936896 937290 938381 939658 941258 943748 947447 952218 957822 964151 971099 978504 986425 995411
53403 995411 1006347 1019912 1036075 1054062 1072929 1092290 1112514 1134234 1157733 1182817 1209097
53392 1209097 1236313 1264542 1294228 1325883 1359574 1394787 1430957 1468090 1506739 1547387 1589920
53381 1589920 1633735 1678298 1723618 1770061 1817563 1865160 1911644 1956649 2000712 2044162 2086519
53370 2086519 2127192 2166228 2203818 2239390 2271873 2300775 2326409 2349084 2368577 2384511 2396777
53359 2396777 2405364 2410183 2411254 2408788 2402853 2393190 2379534 2361949 2340696 2315953 2287886 2256899
$$ packed form
53441A249473j5996j5776j6067j6951j7689j7794j7711j7990j8286j7892j6939
53430A060382j6297j6236j5941j4650j2734j1134j0023q644o494m160k637k089
53418I39343j686p61L94J091J277J600K490L699M771N604O329O948P405P921Q986
53403I95411J0936J3565J6163J7987J8867J9361K0224K1720K3499K5084K6280
53392A209097K7216K8229K9686L1655L3691L5213L6170L7133L8649M0648M2533
53381A589920M3815M4563M5320M6443M7502M7597M6484M5005M4063M3450M2357
53370B086519M0673L9036L7590L5572L2483K8902K5634K2675J9493J5934J2266
53359B396777Q587M819J071k466n935r663j3656j7585k1253k4743k8067l0987
$$ plain form
53347 2256899 2223678 2188942 2153147 2116307 2078156 2038680 1998525 1958699 1919832 1881918 1844795
53336 1844795 1808609 1773768 1740636 1709317 1679474 1650219 1620525 1590073 1559577 1530086 1502117
53325 1502117 1475661 1450731 1427468 1405807 1385546 1366812 1350016 1335150 1321568 1308768 1297022
53314 1297022 1286757 1277556 1268343 1258524 1248327 1237908 1226776 1214505 1201545 1188836 1176861 1165582
53302 1165582 1155104 1145820 1137912 1131197 1125517 1120934 1117536 1115404 1114773 1115737 1117742 1119883 1121952 1124825
53288 1124825 1129586 1136532 1145277 1155536 1167448 1181266 1196921 1213906 1231571 1249689 1268636 1288811
53276 1288811 1309888 1330967 1351386 1370966 1389521 1406688 1422411 1437023 1450619 1462772 1473126
53265 1473126 1481729 1488523 1493102 1495376 1495993 1495551 1493772 1489960 1483972 1476262 1467282 1457312 1446626 1435276
$$ packed form
53347B256899l3221l4736l5795l6840l8151l9476m0155l9826l8867l7914l7123
53336A844795l6186l4841l3132l1319k9843k9255k9694l0452l0496k9491k7969
53325A502117k6456k4930k3263k1661k0261j8734j6796j4866j3582j2800j1746
53314A297022j0265r201r213r819j0197j0419j1132j2271j2960j2709j1975j1279
53302A165582j0478r284p908o715n680m583l398k132o31R64K005K141K069K873
53288A124825M761O946Q745J0259J1912J3818J5655J6985J7665J8118J8947K0175
53276A288811K1077K1079K0419J9580J8555J7167J5723J4612J3596J2153J0354
53265A473126Q603O794M579K274O17m42j779l812n988p710q980r970j0686j1350
$$ plain form
53251 1435276 1422893 1409122 1394066 1377910 1360463 1341537 1321502 1300937 1279986 1258623 1237248
53240 1237248 1216329 1195683 1174831 1154002 1134086 1115579 1098239 1081741 1065981 1050651 1035256
53229 1035256 1019822 1004997 991139 977749 964119 950197 936569 923801 911924 900357 888375
53218 888375 875960 864116 853928 845304 837131 828639 820120 812215 805036 798187 791121 783197 773885
53205 773885 763214 751777 739977 727511 713775 698586 682394 666029 650326 635796 622496
53194 622496 610319 599262 589114 579091 568381 557056 545930 535352 524750 513539 501882
53183 501882 490169 478268 465810 452887 439940 427163 414461 401936 389972 378828 368415
53172 368415 358536 349210 340663 333055 326213 319711 313340 307444 302574 298785 295484 291967 287917 283391
$$ packed form
53251A435276j2383j3771j5056j6156j7447j8926k0035k0565k0951k1363k1375
53240A237248k0919k0646k0852k0829j9916j8507j7340j6498j5760j5330j5395
53229A035256j5434j4825j3858j3390j3630j3922j3628j2768j1877j1567j1982
53218H88375j2415j1844j0188q624q173q492q519p905p179o849p066p924r312
53205G73885j0671j1437j1800j2466j3736j5189j6192j6365j5703j4530j3300
53194F22496j2177j1057j0148j0023j0710j1325j1126j0578j0602j1211j1657
53183E01882j1713j1901j2458j2923j2947j2777j2702j2525j1964j1144j0413
53172C68415r879r326q547p608o842o502o371n896m870l789l301l517m050m526
$$ plain form
53158 283391 278622 273947 269661 265865 262562 259853 257736 255770 253322 250270 247218 244863 243376 242378
53144 242378 241229 239344 236580 233441 230676 228600 227031 225792 224917 224362 223951 223660 223519 223176 222066 220194
53128 220194 218259 216810 215713 214738 214165 214447 215576 217173 218961 220823 222613 224262 225940 227780 229493
53113 229493 230468 230308 229169 227634 226279 225267 224285 222907 220915 218195 214637 210391 205968 201679 197294
53098 197294 192749 188819 186321 184797 182888 180085 177185 174872 172865 170856 169312 168684 168536 168149 167378
53083 167378 166284 164535 161963 159310 157627 157185 157484 157954 158064 157209 155276 153015 151133 149311 146847
53068 146847 144011 141857 140857 140515 140320 140240 140218 140006 139668 139584 139734 139589 138862 137821 136755 135739 135083 135340
53050 135340 136461 137532 137776 137437 137268 137516 137862 138053 138078 137760 136683 134663 132135 129977 128960 129269 130426
$$ packed form
53158B83391m769m675m286l796l303k709k117j966k448l052l052k355j487r98
53144B42378j149j885k764l139k765k076j569j239q75n55m11k91j41l43j110j872
53128B20194j935j449j097r75n73K82J129J597J788J862J790J649J678J840J713
53113B29493R75j60j139j535j355j012r82j378j992k720l558m246m423m289m385
53098A97294m545l930k498j524j909k803k900k313k007k009j544o28j48l87p71
53083A67378j094j749k572k653j683m42K99M70J10q55j933k261j882j822k464
53068A46847k836k154j000l42j95q0k2k12l38q4J50j45p27j041j066j016o56K57
53050A35340J121J071K44l39j69K48L46J91K5l18j077k020k528k158j017L09J157
$$ plain form
53033 130426 131660 132402 132524 132211 131739 131321 131018 130777 130584 130453 130224 129572 128413 127094 125944 124834 123511
53016 123511 122233 121614 121839 122387 122605 122221 121325 120264 119723 120434 122460 124913 126694 127440 127611 127801 128184
52999 128184 128603 128944 129268 129610 129743 129324 128355 127386 127109 127753 129013 130570 132411 134546 136589 137936 138441
52982 138441 138734 139653 141354 143158 144375 145084 145954 147497 149809 152921 156899 161477 165970 169811 172952
52967 172952 175618 177903 179786 181265 182245 182539 182244 181799 181407 180600 178814 176229 173645 171572 169825 168116
52951 168116 166704 166253 167076 168593 169664 169594 168773 168081 167761 167275 166308 165341 164929 164896 164721 164330 164013 163850
52933 163850 163768 163923 164471 165067 165177 164851 164709 165203 166281 167701 169148 170154 170454 170473 170902 171726 172168 171670
52915 171670 170503 169335 168709 168928 169911 171031 171697 172235 173522 175508 176864 176639 175641 175468 176565 177984
$$ packed form
53033A30426J234P42J22l13m72m18l03k41j93j31k29o52j159j319j150j110j323
53016A23511j278o19K25N48K18l84q96j061n41P11K026K453J781P46J71J90L83
52999A28184M19L41L24L42J33m19r69r69k77O44J260J557J841K135K043J347N05
52982A38441K93R19J701J804J217P09Q70J543K312L112L978M578M493L841L141
52967A72952K666K285J883J479R80K94k95m45l92q07j786k585k584k073j747j709
52951A68116j412m51Q23J517J071p0q21o92l20m86r67r67m12l3j75l91l17j63
52933A63850q2J55N48N96J10l26j42M94J078J420J447J006L00J9M29Q24M42m98
52915A71670j167j168o26K19R83J120O66N38J287J986J356k25r98j73J097J419
$$ plain form
52899 177984 178874 179388 180030 180798 181331 181528 181641 181933 182511 183430 184752 186481 188514 190698 192857 194803 196400
52882 196400 197704 198959 200343 201677 202520 202593 202043 201290 200795 201036 202385 204701 207196 209050 210123 210786
52866 210786 211151 210895 209932 208872 208539 209195 210463 211880 213318 214895 216630 218273 219521 220393 221327 222783
52850 222783 224800 227082 229451 232065 235132 238525 241793 244504 246560 248196 249674 251014 252063 252744
52836 252744 253000 252474 250608 247317 243359 239751 236888 234459 232085 229769 227771 226259 225063 223598 221200
52821 221200 217765 213934 210435 207373 204432 201568 199084 197128 195552 194253 193238 192289 190960 189099
52807 189099 187132 185663 184875 184374 183489 181844 179821 178409 178343 179434 180829 181757 181819 180891 179227 177491
52791 177491 176183 175024 173363 171120 168850 166874 164888 162533 159917 157462 155648 154908 155293 156089 156268
$$ packed form
52899A77984Q90N14O42P68N33J97J13K92N78R19J322J729K033K184K159J946J597
52882A96400J304J255J384J334Q43P3n50p53m95K41J349K316K495J854J073O63
52866B10786L65k56r63j060l33O56J268J417J438J577J735J643J248Q72R34J456
52850B22783K017K282K369K614L067L393L268K711K056J636J478J340J049O81
52836B52744K56n26j866l291l958l608k863k429k374k316j998j512j196j465k398
52821B21200l435l831l499l062k941k864k484j956j576j299j015r49j329j861
52807A89099j967j469p88n01q85j645k023j412o6J091J395R28O2r28j664j736
52791A77491j308j159j661k243k270j976j986k355k616k455j814p40L85P96J79
$$ plain form
52776 156268 155469 154120 152532 150560 148382 146899 146791 147601 148222 147994 146917 145160 142997 140981 139552
52761 139552 138448 136961 134841 132590 130785 129445 128174 126702 125051 123301 121381 119220 117027 115250
52747 115250 114143 113461 112754 111869 110943 109965 108691 107022 105212 103578 102210 100993 99696 98093 96289
52732 96289 94901 94552 95108 95793 96121 96314 96742 97373 98002 98572 99008 99086 98726 98104 97279 96114 94816 94100
52714 94100 94413 95311 96010 96263 96331 96398 96489 96796 97596 98908 100550 102383 104173 105404 105709 105424 105331 105914 107143
52695 107143 108815 110686 112266 113024 112927 112532 112373 112434 112196 111078 108913 106177 103716 102042 100937 99863
52679 99863 98633 97461 96600 96175 96194 96390 96224 95425 94404 93704 93135 91956 89918 87611 85700 84275 83136
52662 83136 82258 81693 81340 81127 81146 81345 81377 81002 80383 79682 78677 77252 76048 75993 77132 78511 79395 80065
$$ packed form
52776A56268p99j349j588j972k178j483j08Q10O21k28j077j757k163k016j429
52761A39552j104j487k120k251j805j340j271j472j651j750j920k161k193j777
52747A15250j107o82p07q85r26r78j274j669j810j634j368j217j297j603j804
52732I6289j388l49N56O85L28J93M28O31O29N70M36P8l60o22q25j165j298p16
52714I4100L13Q98O99K53O8O7R1L07Q00J312J642J833J790J231L05k85r3N83J229
52695A07143J672J871J580P58r7l95j59O1k38j118k165k736k461j674j105j074
52679I9863j230j172q61m25J9J96j66p99j021p00n69j179k038k307j911j425j139
52662H3136q78n65l53k13J9J99L2l75o19p01j005j425j204n5J139J379Q84O70
$$ plain form
52644 80065 81055 82099 82392 81661 80400 79119 77965 77118 76921 77383 78088 78885 80217 82335 84696 86629
52628 86629 88144 89441 89983 89010 86892 85055 84322 84055 83214 81594 79664 77820 76346 75616 75741 76241
52612 76241 76514 76450 76305 76272 76524 77363 78833 80413 81565 82434 83569 85050 86349 87052 87337 87718 88551 89783
52594 89783 90990 91745 92121 92680 93739 94866 95373 95110 94438 93656 92920 92584 93078 94375 95946 97327 98436
52577 98436 99338 100084 100898 102180 104170 106734 109508 112107 114182 115554 116376 117067 118037 119506 121428 123473
52561 123473 125226 126615 127929 129244 130088 130053 129579 129694 130964 133010 135007 136365 136979 137234 137730 138713
52545 138713 139788 140496 141089 142314 144415 146782 148635 149658 149925 149673 149330 149315 149585 149637 149151 148319 147386
52528 147386 146284 144997 143998 143890 144699 145837 146732 147330 148032 149282 151159 153195 154652 155115 154823 154414
$$ packed form
52644H0065R90J044K93p31j261j281j154q47j97M62P05P97J332K118K361J933
52628H6629J515J297N42r73k118j837p33k67q41j620j930j844j474p30J25N00
52612G6241K73o4j45l3K52Q39J470J580J152Q69J135J481J299P03K85L81Q33J232
52594H9783J207P55L76N59J059J127N07k63o72p82p36l36M94J297J571J381J109
52577I8436R02P46Q14J282J990K564K774K599K075J372Q22O91R70J469J922K045
52561A23473J753J389J314J315Q44l5m74J15J270K046J997J358O14K55M96R83
52545A38713J075P08N93J225K101K367J853J023K67k52l43j5K70N2m86q32r33
52528A47386j102j287r99j08Q09J138Q95N98P02J250J877K036J457M63k92m09
$$ plain form
52512 154414 154351 154575 154628 154056 152788 151164 149624 148413 147600 147213 147178 147289 147455 147884 148745 149725 150226 150005
52494 150005 149326 148496 147633 146934 146718 147008 147367 147475 147632 148413 149890 151483 152549 153033 153554 154871 157110
52477 157110 159475 160822 160650 159464 158156 157265 156841 156739 156812 157015 157542 158722 160553 162457 163732 164210
52461 164210 164272 164282 164308 164435 164998 166269 168017 169613 170575 170843 170517 169639 168393 167318 166932 167151 167412 167423
52443 167423 167453 167739 168006 167926 167771 168205 169529 171449 173464 175087 175845 175575 174792 174329 174502 174915 175088 174881
52425 174881 174274 173224 171930 170776 169750 168332 166264 164072 162431 161327 160250 158953 157604 156413
52411 156413 155563 155420 156283 157865 159412 160433 161035 161531 162055 162632 163268 163814 164048 164084 164484 165667 167321
52394 167321 168605 168937 168519 168106 168299 169002 169552 169483 169125 169312 170496 172411 174607 176875 178961 180275 180444
$$ packed form
52512A54414o3K24N3n72j268j624j540j211q13l87l5J11J66M29Q61R80N01k21
52494A50005o79q30q63o99k16K90L59J08J57P81J477J593J066M84N21J317K239
52477A57110K365J347j72j186j308q91m24j02P3K03N27J180J831J904J275M78
52461A64210O2J0K6J27N63J271J748J596R62K68l26q78j246j075l86K19K61J1
52443A67423L0K86K67q0j55M34J324J920K015J623P58k70p83m63J73M13J73k07
52425A74881o07j050j294j154j026j418k068k192j641j104j077j297j349j191
52411A56413q50j43Q63J582J547J021O02M96N24N77O36N46K34L6M00J183J654
52394A67321J284L32m18m13J93P03N50o9l58J87J184J915K196K268K086J314J69
$$ plain form
52377 180444 179989 179915 180622 181718 182894 184372 186221 187874 188843 189509 190579 192060 193457 194895 197184 200551
52361 200551 203995 206367 207711 209060 211172 213872 216511 218653 220324 221840 223519 225429 227468 229645
52347 229645 232103 234891 237948 241366 245317 249536 253290 256144 258407 260499 262301 263635 265019 267254
52333 267254 270335 273507 276437 279603 283260 286650 288750 289473 289684 290178 291067 292131 293382 295116 297559
52318 297559 300622 304002 307451 310885 314363 318093 322437 327649 333468 339248 344663 350151 356399 363536
52304 363536 371132 378872 386921 395670 405409 416200 427812 439824 452080 464992 479108 494391
52292 494391 510191 525947 541645 557639 574286 591767 609970 628584 647541 667230 688012
52281 688012 709611 731308 752593 773220 792862 811321 829002 846495 863629 879643 894395
$$ packed form
52377A80444m55p4P07J096J176J478J849J653R69O66J070J481J397J438K289L367
52361B00551L444K372J344J349K112K700K639K142J671J516J679J910K039K177
52347B29645K458K788L057L418L951M219L754K854K263K092J802J334J384K235
52333B67254L081L172K930L166L657L390K100P23K11M94Q89J064J251J734K443
52318B97559L063L380L449L434L478L730M344N212N819N780N415N488O248P137
52304C63536P596P740Q049Q749R739J0791J1612J2012J2256J2912J4116J5283
52292D94391J5800J5756J5698J5994J6647J7481J8203J8614J8957J9689K0782
52281F88012K1599K1697K1285K0627J9642J8459J7681J7493J7134J6014J4752
$$ plain form
52270 894395 908642 922819 936251 948013 957905 966031 972128 976087 978742 981196 983489 984664 984171
52257 984171 982550 980606 978525 976052 973088 969780 966183 962165 957641 952828 948233 944331 941271 938996
52243 938996 937673 937650 938911 940967 943677 947851 954492 963524 973780 984292 995108 1006650 1018809
52230 1018809 1031068 1043272 1055866 1069389 1083945 1099150 1114333 1128749 1141772 1153086 1162751
52219 1162751 1171013 1178023 1183735 1188086 1191214 1193422 1194854 1195219 1193823 1189982 1183492 1174827 1164788 1153907
52205 1153907 1142197 1129418 1115417 1100150 1083702 1066523 1049404 1032900 1016959 1001483 987008
52194 987008 974251 963078 952601 942414 933063 925001 917770 910656 903612 896918 890372 883589 876912
52181 876912 871282 867077 863660 860255 856831 853933 851896 850420 848814 846577 843848 841203 838892 836453
$$ packed form
52270H94395J4247J4177J3432J1762R892Q126O097L959K655K454K293J175m93
52257I84171j621j944k081k473k964l308l597m018m524m813m595l902l060k275
52243I38996j323k3J261K056K710M174O641R032J0256J0512J0816J1542J2159
52230A018809J2259J2204J2594J3523J4556J5205J5183J4416J3023J1314R665
52219A162751Q262P010N712M351L128K208J432L65j396l841o490q665j0039j0881
52205A153907j1710j2779j4001j5267j6448j7179j7119j6504j5941j5476j4475
52194I87008j2757j1173j0477j0187r351q062p231p114p044o694o546o783o677
52181H76912n630m205l417l405l424k898k037j476j606k237k729k645k311k439
$$ plain form
52167 836453 833386 829975 827009 824739 822603 820048 817124 814141 811200 808329 805670 803160 800299 796628
52153 796628 792283 787781 783451 779402 775892 773188 771056 768790 765915 762573 759118 755711 752497 749804
52139 749804 747708 745623 742769 739051 735053 731204 727376 723423 719652 716455 713753 711131 708345 705405
52125 705405 702347 699231 696236 693498 690937 688433 685991 683516 680715 677677 675271 674419 675052 676287 677580
$$ packed form
52167H36453l067l411k966k270k136k555k924k983k941k871k659k510k861l671
52153G96628m345m502m330m049l510k704k132k266k875l342l455l407l214k693
52139G49804k096k085k854l718l998l849l828l953l771l197k702k622k786k940
52125G05405l058l116k995k738k561k504k442k475k801l038k406q52O33J235J293
$$ [...]
##END NTUPLES=NMR SPECTRUM
##END=
