
##TITLE=AC1323_SBUAH12152_6535549_3MPLV89FiF
##JCAMPDX= 6.0         $$ Bruker NMR JCAMP-DX V2.0
##DATA TYPE= NMR SPECTRUM
##DATA CLASS= NTUPLES
##ORIGIN= BRUKER
##OWNER= Administrator
$$ 1.72 TOPSPIN		Version 2.1
$$ 2012-07-18 01:01:25.625 -0500  Administrator@TOPSPIN
$$ Compression mode = diff/dup
##.OBSERVE FREQUENCY= 400.02188249412
##.OBSERVE NUCLEUS= ^1H
##.ACQUISITION MODE= SIMULTANEOUS (DQD)
##.ACQUISITION SCHEME= undefined
##.AVERAGES= 8
##.DIGITISER RES= 22
##SPECTROMETER/DATA SYSTEM= spect
##.PULSE SEQUENCE= zg30
##.SOLVENT NAME= COFFEE_meoh
##.SHIFT REFERENCE= INTERNAL, COFFEE_meoh, 1, 14.98509
##AUDIT TRAIL= $$ (NUMBER, WHEN, WHO, WHERE, PROCESS, VERSION, WHAT)
$$ ##TITLE= Audit trail, TOPSPIN		Version 2.1
$$ ##JCAMPDX= 5.01
$$ ##ORIGIN= Bruker BioSpin GmbH
$$ ##OWNER= Administrator
$$ $$ C:\Bruker\TOPSPIN/data/COFFEE/nmr/AC1323_SBUAH12152_6535549_3MPLV89FiF/10/pdata/1/auditp.txt
$$ ##AUDIT TRAIL=  $$ (NUMBER, WHEN, WHO, WHERE, PROCESS, VERSION, WHAT)
(   1,<2012-07-18 01:01:18.875 -0500>,<Administrator>,<TOPSPIN>,<go>,<TOPSPIN 2.1>,
      <created by zg
	started at 2012-07-18 01:00:12.000 -0500,
	POWCHK enabled, PULCHK disabled,
       configuration hash MD5:
       6B 1B 68 BB D9 2E 58 E2 7F 35 AD 54 07 DF 0E 41
       data hash MD5: 64K
       55 E5 C4 71 04 F6 24 86 FE D1 CF E4 18 9F E8 11>)
(   2,<2012-07-18 01:01:21.500 -0500>,<Administrator>,<TOPSPIN>,<proc1d>,<TOPSPIN 2.1>,
      <Start of raw data processing
       efp LB = 0 FT_mod = 6 PKNL = 1 PHC0 = 0 PHC1 = 0 SI = 32K 
       data hash MD5: 32K
       85 93 CF A4 A6 48 55 BB D9 84 63 36 06 A5 F9 44>)
(   3,<2012-07-18 01:01:21.890 -0500>,<Administrator>,<TOPSPIN>,<proc1d>,<TOPSPIN 2.1>,
      <pk PHC0 = 179.2474 PHC1 = 0 
       data hash MD5: 32K
       FA DB 36 A2 9C 53 D1 78 17 7C D3 2A C4 88 62 D3>)
(   4,<2012-07-18 01:01:22.015 -0500>,<Administrator>,<TOPSPIN>,<proc1d>,<TOPSPIN 2.1>,
      <abs ABSG = 1 
       data hash MD5: 32K
       1A 4E FA 35 1E 4B B5 D0 B2 A4 3E 01 2D 43 E2 60>)
(   5,<2012-07-18 01:01:22.046 -0500>,<Administrator>,<TOPSPIN>,<proc1d>,<TOPSPIN 2.1>,
      <abs ABSG = 2 
       data hash MD5: 32K
       8E B3 8B 54 05 95 9F 87 9C 7B FB 86 C8 22 BB CB>)
(   6,<2012-07-18 01:01:22.078 -0500>,<Administrator>,<TOPSPIN>,<proc1d>,<TOPSPIN 2.1>,
      <abs ABSG = 3 
       data hash MD5: 32K
       C8 88 61 51 B2 E7 BD CB CF DF 8D CB EB B1 D0 A1>)
(   7,<2012-07-18 01:01:22.109 -0500>,<Administrator>,<TOPSPIN>,<proc1d>,<TOPSPIN 2.1>,
      <abs ABSG = 4 
       data hash MD5: 32K
       8F 99 FB 0A 5E BF 9D C5 35 77 A7 6E D2 A7 0B 72>)
(   8,<2012-07-18 01:01:22.140 -0500>,<Administrator>,<TOPSPIN>,<proc1d>,<TOPSPIN 2.1>,
      <abs ABSG = 5 
       data hash MD5: 32K
       3C B0 A7 BD A2 E7 F9 19 CE A1 ED 7A 7A D8 CC 8A>)
$$ ##END=
$$ 
$$ $$ hash MD5
$$ $$ 91 53 7D 8B 9A 7B 6B B2 BA F3 CA 1B D5 B1 42 30
##$RELAX= 
##$RELAX= 
##$RELAX= 
##$RELAX= 
##$RELAX= 
##$RELAX= 
##$RELAX= 
$$ Bruker specific parameters
$$ --------------------------
$$ [...]
150 150 150 150 150 150 150 150
##$TP07= 0
##$TPNAME0= <>
##$TPNAME1= <>
##$TPNAME2= <>
##$TPNAME3= <>
##$TPNAME4= <>
##$TPNAME5= <>
##$TPNAME6= <>
##$TPNAME7= <>
##$TPOAL= (0..7)
0.5 0.5 0.5 0.5 0.5 0.5 0.5 0.5
##$TPOFFS= (0..7)
0 0 0 0 0 0 0 0
##$TUNHIN= 0
##$TUNHOUT= 0
##$TUNXOUT= 0
##$USERA1= <user>
##$USERA2= <user>
##$USERA3= <user>
##$USERA4= <user>
##$USERA5= <user>
##$V9= 5
##$VALIST= <valist>
##$VCLIST= <CCCCCCCCCCCCCCC>
##$VD= 0
##$VDLIST= <DDDDDDDDDDDDDDD>
##$VPLIST= <PPPPPPPPPPPPPPP>
##$VTLIST= <TTTTTTTTTTTTTTT>
##$WBST= 2048
##$WBSW= 25
##$XGAIN= (0..3)
0 0 0 0
##$XL= 0
##$YL= 0
##$YMAX_a= 506845
##$YMIN_a= -647449
##$ZGOPTNS= <>
##$ZL1= 120
##$ZL2= 120
##$ZL3= 120
##$ZL4= 120
##$ABSF1= 14.98509
##$ABSF2= -5.573092
##$ABSG= 5
##$ABSL= 3
##$ALPHA= 0
##$AQORDER= 0
##$ASSFAC= 0
##$ASSFACI= 0
##$ASSFACX= 0
##$ASSWID= 0
##$AUNMP= <proc_prof1d_extract_pilot.lims>
##$AXLEFT= 0
##$AXNAME= <>
##$AXNUC= <1H>
##$AXRIGHT= 0
##$AXTYPE= 0
##$AXUNIT= <>
##$AZFE= 0.1
##$AZFW= 0.1
##$BCFW= 0
##$BC_mod= 0
##$BYTORDP= 0
##$COROFFS= 0
##$CY= 15
##$DATMOD= 1
##$DC= 0
##$DFILT= <>
##$DTYPP= 0
##$F1P= 0
##$F2P= 0
##$FCOR= 0.5
##$FTSIZE= 32768
##$FT_mod= 6
##$GAMMA= 0
##$GB= 0
##$INTBC= 1
##$INTSCL= 1
##$ISEN= 128
##$LB= 0
##$LEV0= 0
##$LPBIN= 0
##$MAXI= 10000
##$MC2= 0
##$MEAN= 0
##$ME_mod= 0
##$MI= 0
##$NCOEF= 0
##$NC_proc= -8
##$NLEV= 6
##$NOISF1= 0
##$NOISF2= 0
##$NSP= 0
##$NTH_PI= 0
##$NZP= 0
##$OFFSET= 14.98509
##$PC= 1
##$PHC0= 179.2474
##$PHC1= 0
##$PH_mod= 1
##$PKNL= yes
##$PPARMOD= 0
##$PPDIAG= 0
##$PPIPTYP= 0
##$PPMPNUM= 2147483647
##$PPRESOL= 1
##$PSCAL= 4
##$PSIGN= 0
##$PYNMP= <proc.py>
##$REVERSE= no
##$SF= 400.02
##$SI= 32768
##$SIGF1= 0
##$SIGF2= 0
##$SINO= 400
##$SIOLD= 32768
##$SPECTYP= <>
##$SREGLST= <1H.CDCl3>
##$SSB= 0
##$STSI= 32768
##$STSR= 0
##$SW_p= 8223.68421052631
##$SYMM= 0
##$S_DEV= 0
##$TDeff= 65536
##$TDoff= 0
##$TI= <>
##$TILT= no
##$TM1= 0
##$TM2= 0
##$TOPLEV= 0
##$USERP1= <user>
##$USERP2= <user>
##$USERP3= <user>
##$USERP4= <user>
##$USERP5= <user>
##$WDW= 1
##$XDIM= 32768
##$YMAX_p= 473785338
##$YMIN_p= -758388
##$CURPLOT= <Network HP LaserJet P1505>
##$CURPRIN= <$Network HP LaserJet P1505>
##$DFORMAT= <normdp>
##$LAYOUT= <+/1D_H.xwp>
##$LFORMAT= <normlp>
##$PFORMAT= <normpl>
##$SURQMSG= 1
$$ End of Bruker specific parameters
$$ ---------------------------------
##NTUPLES= NMR SPECTRUM
##VAR_NAME=  FREQUENCY,     SPECTRUM/REAL,   SPECTRUM/IMAG
##SYMBOL=    X,             R,               I
##VAR_TYPE=  INDEPENDENT,   DEPENDENT,       DEPENDENT
##VAR_FORM=  AFFN,          ASDF,            ASDF
##VAR_DIM=   32768,         32768,           32768
##UNITS=     HZ,            ARBITRARY UNITS, ARBITRARY UNITS
##FACTOR=    0.250966925370066, 1,           1
##FIRST=     8223.43324360094, 84959,        178702
##LAST=      0,             -102733,         -41035
##MIN=       0,             -758388,         0
##MAX=       8223.43324360094, 473785338,    0
$$ Real data points
##PAGE= N=1
##DATA TABLE= (X++(R..R)), XYDATA
$$ [...]
23816 216419 -11204 230198 117425 10860 -17757 -7233 169122 -98421 121681 137892 -348991
23804 -19097 28365 -168202 79225 -125416 54893 186724 -212740 172819 -85782 -66617 -178184
23793 -178184 -73794 30128 43238 -420995 -16774 395668 106668 -176620 -1128 -182443 -43802
23781 -47163 37734 200096 -250778 -137858 216449 212819 -206563 -4934 98872 -138362 26221
23769 320946 227646 -152470 -183167 -77825 -59494 127977 17703 -99691 -201561 67739 134327
23758 134327 52627 38966 258249 50065 -46808 -57869 222849 -86450 161500 -17074 7017
23746 -17961 -138152 -12795 228767 -180251 -69268 -225759 136391 -419292 -340519 -58526
23735 320217 -170734 -220570 -21704 -231052 197619 -206450 -250728 157812 180341 -288262
23724 27071 -331023 51782 273949 -374806 44869 64952 101679 -49653 -220031 -45007 -39410
23713 -39410 236407 -3368 -134242 297290 181573 -144540 80361 -13787 -200831 -162478 47466
23701 -43932 162466 198206 235198 -87233 129742 254891 243230 3676 128115 -115297 -183795
23690 -183795 -117177 61901 -202963 -36335 163638 -44978 128049 4531 -120831 80716 -31091
23678 -277136 -130783 -150579 -204299 213536 -14808 -64799 -270342 -162735 -165281 289913 68989
23666 61839 -109251 -162836 41309 -144587 303582 -48700 -52712 -17700 97084 -87822 -305241
23655 -305241 -27741 -406899 65213 -352872 -72312 -219008 303864 12840 235448 -457334
23644 -200811 -65448 -95266 -128386 -238302 -140397 571430 259129 5518 -34212 -143525 109558
23632 117184 19111 -176046 -219776 -101839 189234 -164452 -187175 -52933 328436 -176934
23621 888 156949 -158961 100449 314402 -188073 -156262 -88036 -227165 -253209 82825 145868
23610 145868 -22038 155962 56098 22985 -81292 159064 -309240 -77707 -57291 68362 -133129
23598 -164144 175452 95974 -170388 -486495 -338076 288262 217859 192585 -385288 -319065
23588 -319065 -31248 -73574 270074 -124239 -272363 -249029 -56415 -252251 -126790 -372304
23578 -372304 279573 102285 53603 40825 133514 256353 -85202 66243 -14698 -144205 53151
23566 103425 115737 115215 124299 231607 -199000 212201 101211 -21772 20227 178575 83864
23554 -37182 -209822 -159064 -53922 15703 -80720 8384 254537 -332088 -27224 -70944 -151035
23543 -151035 -14913 51287 -95748 -80911 -146193 -201167 -63516 79646 -151052 -139015 213762
23531 232115 50278 -65595 -201612 82918 -91481 -107438 -159374 -3417 110689 -412924 -280155
23520 -280155 251830 40712 -146710 247121 -65034 -226698 -1592 -99370 -243748 -50397 -120088
23509 -120088 151986 10903 44239 66182 44414 -177786 243132 -135316 -131706 -203422 150043
23497 51898 -24641 359468 2071 -43072 -45072 -20047 32466 69157 20961 -228696 459960
23485 19057 -173628 -326099 -191729 -137638 -202422 -262142 140390 -231798 -290226 148483
23474 220231 177511 -116495 -19376 -5983 8110 -251045 42275 355444 -88790 -61292 167099
23462 109690 -142909 67905 -50029 -126530 100053 -218810 -162253 -37377 103419 -202083
23451 -9899 70843 -288912 -126495 -157662 -261955 -2349 21017 94374 -151313 -33227 133174
23439 234189 -133532 -187278 227724 189001 -90854 194385 181367 177961 130544 80883 83580
23428 83580 -71250 -164083 46632 119741 266352 100846 -218117 -136214 80395 134600 147638
23417 147638 -110649 98312 -158623 -30030 -252771 -19418 131531 -54959 -43308 198513
23406 -152953 156625 118626 17347 -170970 -88146 -192075 -187617 -8748 -41933 179273 32577
23394 -40346 252849 -252443 -207431 -501502 -105975 102228 74435 -103141 -128787 -24577
23383 -186650 21132 -56960 -182819 -81542 93086 54134 -224764 -226090 -93488 119444 -75091
23371 325118 254331 105414 -8534 87585 98126 276900 138049 -200328 -288087 181017 -142790
23359 1580 -50397 -22776 -40597 -363313 -25021 -75459 299042 -132083 -453550 178132 65497
23347 -295625 -182492 134570 -194583 101135 5453 -118915 -132562 -77721 314342 -175067
23336 216718 -105286 -151179 -80533 -158625 17112 199763 114294 -255568 70730 -392060 -74239
23324 -129018 254759 141161 -105040 -23396 226643 -308434 54714 82574 -99307 43483
23313 13185 129977 -473487 -171482 -2882 -83887 -235890 74035 -148358 60403 227555 20358
23301 63653 -194690 -170177 -52156 -252917 209822 275333 132322 29964 488342 129836
23290 -238403 20309 110772 -37870 -184265 -7099 170047 -172826 86511 55037 -123839 -486553
23279 -486553 -35364 -48416 -55058 -117726 125792 -30280 -15199 4151 -429763 189517 -30962
23267 20677 -392706 173693 -38901 -26712 204237 -100 160628 -49798 10007 -90463 -573471
23256 -573471 111617 -66412 156651 179204 198457 -102091 178807 -438819 -275761 182358
23245 -137583 -244076 47464 -7374 -152616 67110 -54123 -29712 78917 -42756 217389 21481
23233 -181199 -384321 -156207 -174790 111411 -248857 257560 -10374 -141980 -62900 -82530
23223 -82530 397548 -133246 300710 -3236 -261376 213878 -55007 302782 132415 230559
23213 230559 30877 24601 26266 -265400 -99848 -366825 -394678 119781 -67355 211575 167259
23202 167259 272097 -207409 24954 -303519 -102465 -279718 37933 46348 477417 -148886
23191 18739 132588 55165 70124 -19094 -25920 -313973 90226 -71769 -164705 141547 111517
23180 111517 55369 -59072 1229 26976 110348 87570 -214872 -244426 -325888 -87553 -220827
23169 -220827 139867 146013 -174140 263640 141093 -186354 -183704 231644 -57979 87285 209772
23158 209772 -217057 -341798 161354 18139 88608 -197495 -155147 -59979 192237 -345783
23147 -8368 88446 -164379 -68061 -219685 -136811 15085 -307807 219725 -343108 -214798 50048
23135 168377 -307814 67400 -219921 -24928 121428 187630 159835 35500 -237225 -140355 -45288
23123 4244 -34895 -197269 -332040 189204 28175 -201217 -71351 -211264 -254093 -331716 -57343
23111 184584 -188040 -21611 109195 -171409 329133 206030 37957 26324 259969 249412
23101 249412 127945 -162943 323502 -159212 -357083 157333 139803 -237877 -39813 -182878
23091 -182878 -36639 10842 -213181 135578 93907 -35424 68257 -30989 18608 -338276 -166139
23079 -133363 137389 113611 101841 138574 234831 370065 87021 119304 41465 126003 -65559
23067 82819 -74762 -364272 3129 123882 384626 50428 -260734 -98898 364330 -100453 -194061
23056 -194061 -30273 -230180 -243021 -161391 4177 -129493 17881 158737 -189920 -32201 226997
23044 -3996 78305 -139119 123534 53191 27006 -184052 259331 -106664 31619 136833 -88392
23032 -19374 164227 -450447 37929 169736 51280 112453 90002 146868 -383414 -301967 -156104
23021 -156104 95960 94243 38488 10106 63484 74891 -136334 74019 -56993 -387518 -135522
23009 -323012 44190 68135 126296 -121729 -127184 287240 237010 -211408 233279 -236552 118332
22997 18707 165948 -86725 271460 -45593 -308098 30991 26026 10030 -51970 -63934 -162000
22986 -162000 122952 129042 -38278 -317692 -43644 -429470 314088 225044 -381915 -35862 219229
22974 3852 -116389 -35139 31616 268576 -76985 40073 -95964 119286 -79258 112733 -42361
22962 -218021 178532 16368 -39888 57196 -139992 196119 181308 -332708 278217 -35099
22951 83718 344447 144247 150864 -2647 269434 266673 100418 -5979 -394074 95761 -22343
22939 -155422 169952 45819 -106977 15747 -314836 -7051 -145937 159836 -309877 38714
22928 -108577 281771 296114 158035 105849 -301028 -3723 15462 -131347 136816 88700 -239192
22916 -311406 6402 -103745 288963 147640 -258482 -198715 12546 -23714 96758 -102786 -43301
22904 -244133 97375 -221564 -168625 318333 7987 -247088 -150340 -26015 -218497 -260381 -396144
22893 -396144 117764 -46333 9860 758 -84856 144632 -11110 -389499 -493919 -262311 -138082
22882 -138082 -57684 -20324 -54562 -82968 -396 21241 55935 50113 157858 -319521 210280
22870 -83225 24809 -182425 229726 114652 -64534 12363 90719 -77676 58603 18504 -245665
22858 -11140 87581 4961 -317416 -137718 201267 -126867 -112963 -259701 -103663 -12740 -223001
22847 -223001 19513 -201331 387966 -223846 -13829 -48735 -95990 -23458 87295 -104142 -198537
22836 -198537 -126378 42192 -105536 7814 -479671 44592 -36894 136807 3814 -2444 -148194
22825 -148194 -251954 -441117 -240018 -110112 52600 -76307 17877 -63230 -138893 116969
22814 -438599 -52662 -127949 -94573 -169072 18767 -64572 29801 146786 21020 147026 239515
22803 239515 401943 112223 111997 -111446 -283674 156055 -209136 91673 -156384 -18831
22792 -74926 -57962 -57605 77325 44250 23581 166782 9160 -11571 247541 242622 -149558 -146774
22780 -146774 44230 12110 -205342 47827 -119356 -191329 -37457 -442586 -217995 155252
22769 -59236 9237 230349 23079 -39920 -247644 29526 -200173 -226116 87110 -217854 -180556
22758 -180556 184293 64525 -21559 -61923 31048 46998 -118540 122007 219033 -263303 -134347
22747 -134347 58251 -57241 11050 -94276 11468 -90017 -144386 -51012 -158729 -56011 -174966
22736 -174966 67365 -130228 -194380 162439 120428 -1629 136944 -66919 120658 109730 1832
22724 78258 -63220 207561 -135827 -220579 -200840 -88604 6219 124759 -172596 -33915 -97139
22713 -97139 -181780 -158265 92027 -405193 -47149 -64206 -338707 -125610 105717 -131472 73125
22701 115658 25530 -73860 -247750 89601 122846 48521 -186522 -253276 -1524 -35670 82049
22689 37886 7892 -331726 -247368 -81206 -29172 -291082 -166931 -71957 65989 -126541 -220833
22678 -220833 -140127 -96728 88839 372570 -217078 -146697 -64850 -369535 199080 -180599
22667 136042 140545 148520 -239432 109486 34069 268693 196219 -68453 122247 113225 220251
22656 220251 -177306 129501 277699 -384873 -141553 -258647 -136251 -304741 -202674 -29881
22645 -25863 68711 -242395 -104407 -128394 247445 -338698 -236893 -92287 80700 -184236
22634 93125 161371 -93478 99562 -328169 -302936 58454 -309025 237254 33398 281500 -163292
22622 -181590 -200304 160586 -10007 15175 257480 -137608 179053 -151808 102260 -137864
22611 -73814 -2459 102826 21361 12117 -171730 -218842 144726 35824 -120646 -200020 -19178
22599 -14984 162970 6253 -115481 -102432 71114 90351 107963 -316721 23555 222490 103660
22587 -73067 -77031 124334 -2495 -27990 51409 165929 -118317 64837 -127072 171353 307715
22576 307715 -92404 -183255 -29756 -238291 50102 149343 135939 233708 144978 -78390 94220
22564 -231337 113177 -85617 -135976 179345 -273329 -22526 -112453 -28948 -242399 12939 -4268
22552 18163 -374705 -83699 219204 4967 27282 -222351 -40563 -20436 -47490 -162379 -123769
22541 -123769 -126581 183915 160184 -18089 163774 91568 -19847 -172302 -17961 -182379 151247
22529 -86536 263577 -314740 -54176 160445 10318 126789 -309023 -43148 31466 18567 -73288
22517 -6988 -149931 -336369 9164 -410117 -54237 -273656 -239639 -202559 -117097 54293 -80833
22505 305846 -6650 50426 116123 -107044 -25954 106865 151113 -3605 160868 -364367 -182905
22494 -182905 -169741 9902 415995 -95346 -117503 74921 286831 -303114 -41431 -51316 -261911
22483 -261911 126707 33969 -102313 -363167 -160284 72563 -204547 243452 115201 -59014
22472 -177926 187746 -406827 -50289 1329 -125879 -222726 -23464 -427231 236785 -61896 12191
22460 -84348 -99920 123095 -64247 180876 156950 191047 241619 224222 -16182 -364242 95309
22448 12170 131041 -178958 -311917 53715 -31641 -93058 55157 30941 203015 -265675 -324860
22437 -324860 149976 -157140 120747 -238584 73311 189487 184941 -267467 11363 317719
22427 317719 -125970 114771 -38471 2682 119539 -132519 -56445 -313200 -130700 -152057
22417 -152057 110676 112519 113621 266359 -179870 46984 -207620 -159118 170386 -50641 70693
22405 182924 -257496 -53512 -346039 151688 -25963 174166 -224522 -587817 299433 -193833
22394 228562 -63064 -435291 -97020 188896 124127 -130476 -1602 -211737 -255723 -144016 174398
22382 -100202 -145232 -247253 137318 -1614 -166287 65196 -263 -111625 151576 97783 -173661
22370 -556244 232331 -316225 -81158 241145 95736 75347 -23689 -53017 -14539 -404391 -187420
22358 323827 -54486 -8151 98653 -276405 -133047 70942 125257 60822 113831 200636 192716
22347 192716 268901 76216 251554 -154993 381993 -174531 -90764 82877 104557 81470 -66393
22335 -92834 -58187 -104441 131931 -95728 -122482 -73485 -29389 83795 30466 136108 -311501
22323 33473 80888 -33260 -133464 -87729 -24353 -213231 286377 48830 -365194 -228896 -16634
22311 -227832 352845 -37325 32955 21574 138001 359893 14174 -204998 -476598 -136001
22300 68464 172922 -24794 133403 306562 38504 122010 -25836 36588 -198794 164705 -20660
22288 -227931 143826 -147860 47075 159321 202722 207010 -309728 -194959 10737 23688 -80128
22276 2856 123222 57866 350922 -208309 131403 -129602 -67080 -299917 -284482 -522124
22266 -522124 -301771 -213369 86034 165396 -436381 -290185 -181228 98853 -305055 -99460
22255 -421453 -239807 -374243 -346279 -1636 226351 240566 5551 157453 -37771 137975 255179
22244 255179 96361 64622 -108977 92842 -259599 49826 153983 -231488 -272654 14534 -205974
22232 -234279 -29018 60018 -61868 -321177 -112276 -289014 289185 -19132 -139640 -143898 -52845
22220 -387425 341889 299277 -11600 -189284 50955 12143 162730 149290 354025 -151510
22209 -376245 -146109 -32262 146049 171525 -15044 344270 -308462 159381 -66461 -108974
22199 -108974 -63001 -182392 23899 351 120554 -26021 145634 -173694 1407 -134917 -92470
22188 -92470 -161973 -436639 -189607 127475 71868 11546 -135610 -85959 47392 -223726 -28165
22176 -266611 293621 49867 -36491 -35078 31679 -201830 97848 -29249 -306810 396564 -54794
22164 -133465 -155546 147691 227760 -274131 -195084 336916 -197687 -175523 -26252 78227 -425248
22152 82324 6977 -284848 -52408 188913 -146209 -123985 32867 286864 -239184 -96320 -170456
22141 -170456 -39036 -72955 4953 -113851 -258686 -180061 39164 -157906 -145446 164627 -285695
22129 -105442 -185241 24531 -29996 -107330 -12185 501651 2088 47243 -318441 235362 -315299
22117 -121920 244049 -282379 -154961 -242951 -153582 -75282 -172042 -49083 -165343 -139484 -137435
22106 -137435 -394074 -93579 -21265 -10189 -215852 -81372 48242 -169521 -81608 142099 -125765
22094 4403 89672 -145807 -90641 170198 97978 171554 -259549 -149972 -172113 -446512 1741
22082 189911 -134875 140550 -115547 93487 244936 -67538 246366 -254355 -88036 340564
22071 -16154 126459 64496 -279540 -47892 -380933 -107266 -192743 -280995 -169093 -161216 -85340
22060 -85340 151932 -59920 -229914 -133244 105431 133491 -415093 -226471 119812 41337
22049 66125 139125 -463054 44225 -11321 86977 -94630 -13316 -130217 79097 12530 -41423
22037 -340543 -77689 -183420 76091 -256690 -32888 136091 367375 282768 138096 139382 -114277
22025 304900 -106820 243111 -690014 -55108 94385 97806 -82779 -218840 16973 -2472 -121213
22014 -121213 239870 81641 -135324 -240343 -35754 -169758 -49526 54751 175300 -114119
22003 -85710 -154097 -24151 137094 58931 149474 -146210 103736 168839 -408086 -298213 69660
21991 -303912 -104152 -29652 -158606 113913 -66401 -61552 -297686 -99004 -91538 -148326 -398564
21980 -398564 -95581 -404749 -131503 186397 -183245 90202 -115997 -39214 163726 -374900
21969 -74216 150082 377230 -343868 -107173 -104504 -217459 -190615 -114888 274808 -37894 -345260
21958 -345260 -182351 -125660 309014 62794 66662 337919 187443 98058 -255842 45913 -138897
21946 -178601 236105 -241602 56327 -161059 222914 -234405 -186723 -78273 -58654 -25352
21935 185520 113383 340952 47686 7619 -8240 204232 -97736 -261808 39753 6372 -43741
21923 -229451 -381741 -12463 -26254 -129391 -643670 -51644 -106933 80420 -122004 231513
21912 31258 -44020 20672 -432721 -225988 -103759 -7408 108842 -148145 27936 -161436 -410718
21901 -410718 -199793 -21764 -48441 174385 -63513 179575 -28426 30224 79212 -928 -20040
21890 -20040 -78967 215145 74685 -149775 263990 -50398 143918 167581 -79996 43788 -1643
21878 201932 117121 -73159 -12244 -192282 -158880 5137 -153938 -79920 151676 -74238 -267511
21867 -267511 -20973 33879 -163928 -38803 73835 -38477 -183052 -335625 -207943 17192 -91064
21855 87138 -215198 81768 -49631 -129811 -315310 -415306 126849 122975 -568390 -44766 42148
21843 166239 21736 -134761 -348886 121214 43965 356364 266361 -36275 342252 12446
21832 -161019 55071 -135471 -88132 -321130 6288 -91739 -71963 -266177 1696 -267994 37905
21820 -245391 -85080 -109655 -130056 -212982 66300 -41102 -221409 158297 15982 -300800 491964
21808 17825 -178604 3666 -186598 -98744 58958 47278 -384147 114334 -106892 41101 -129850
21796 -28093 299352 101395 -180562 -172775 -14273 30205 272244 131434 -169146 -363283
21786 -363283 -50962 -162749 183073 -15246 19510 27265 189964 -205226 15553 -49331 -156460
21775 -156460 91871 -188311 -8427 -45543 -157573 -20045 115646 220730 -86852 -129344 -228282
21764 -228282 -36833 241460 -153922 212512 -32888 -27101 -50024 67295 345890 -258262 109485
21752 99473 195198 90588 273875 141156 217745 -11656 -82065 76180 -282061 -114181 -4667
21740 -224476 -266015 117159 13622 946 98981 43867 167713 -196872 310845 -112054 300572
21728 81792 258756 104936 -122140 31495 -86077 57716 -288979 69457 -106233 -90268 -67284
21717 -67284 -282210 -74643 -62124 114364 -292547 -284810 104190 118805 -284955 9071 -60781
21705 65349 -93852 238943 81327 141227 -65556 -206585 61064 -137903 -66349 357362 -62603
21693 197297 -208861 25762 153917 -17351 57742 -151212 -130154 -168380 -325226 152625
21682 -14604 -264293 100888 -142284 -379319 -342934 100481 -102193 -179640 34718 -18810
21671 -114999 -5263 -81404 -179443 63461 -502477 51954 -182383 -268410 -328680 112101 117621
21660 117621 -240891 -41493 327695 161521 -257647 180573 245132 26850 -330479 -127573
21649 -167870 -115065 32059 47655 -174526 -230868 62450 69688 -190534 58133 106064 -374809
21637 -69595 -72583 -51975 450481 -99540 58541 52189 -289903 -440825 -33200 42290 -97210
21625 19559 -237353 -69762 -25498 -46832 -38032 21765 84488 79140 157016 43856 -7959 -51189
21613 -51189 -221334 58982 127206 -136615 -203015 -174350 75106 -176406 -8787 -114339 -88018
21602 -88018 232157 -185382 156596 -109669 -115440 -194872 71419 78361 223001 -2707 -11709
21591 -11709 -72473 70599 38099 -32356 234968 208958 -368929 -247258 -245298 -1636 -23938
21580 -23938 -299472 -209783 310837 -232032 -602217 -62741 467909 -240575 34863 -66480
21569 -93843 -67038 -17041 92559 86269 67579 1378 -205384 106751 145843 -207487 -61733
21557 -88718 80926 160764 -204324 -277703 -92601 6777 -42389 -40487 -332847 -157914 -73152
21545 77242 256135 40397 263293 144 -97852 -119081 -168441 -295036 -52256 -69590 153026
21533 42560 -274618 3385 48764 -137965 -251695 -109173 -103175 -192303 -264772 57620 -7307
21521 -87396 138672 46623 130936 192199 97129 451836 150965 -30861 204110 -96606 -13113
21509 98105 -148028 -79300 -51644 -2966 -34978 104071 -112878 -223242 -65115 41658 -440396
21497 -309218 -173890 -218841 42533 -381488 -375397 -43366 -186493 280571 -160246 33874 -236701
21485 214468 226551 -330106 -188929 191277 -60562 320090 264239 -134046 100775 -2345
21474 176216 111259 132810 -128629 91949 -77877 -20147 -113939 172973 -117434 -9618 19641
21462 86541 -362260 142399 10562 -61640 44618 -135754 -176718 145955 -82817 -136203 -146760
21451 -146760 151579 338668 177378 -131254 99349 30549 109063 179405 181651 -19030 9472
21439 -174790 238358 248898 181434 86144 224333 242939 234018 -63525 87827 -350392 -57792
21427 -131776 18187 -276336 -61261 -95512 -93918 131056 -416710 163088 -168974 186927
21416 181746 -433772 -410162 -489044 72239 306966 51083 -93473 -219643 -24125 -170889 -421147
21405 -421147 -61210 -219675 -71057 -25017 -86443 85230 -163980 50695 -98305 25051 -181042
21393 211773 -69130 -24410 -125139 -211336 132364 175668 75125 -68530 -84118 99839 -343639
21381 -183633 -64114 -455176 104473 -25710 115079 -183066 71090 49174 -202035 -367848
21371 -367848 -305438 -108067 -218249 -14649 -12453 157908 -204914 -411240 -223281 -45595
21360 75802 147871 66463 88908 56572 -3921 -68852 -351106 36305 -196280 104220 -36625
21348 269403 11535 158236 -69580 -84120 -173948 -47690 -60505 -53711 -19121 -68861 -40222
21337 -40222 -121289 33949 80985 41886 -13784 257750 -208136 -43858 74294 -30275 -141567
21326 -141567 83696 -73738 -183739 -106113 -94481 172843 -52000 -43858 255453 -86571 -195729
21315 -195729 52705 38953 -22267 -30831 -71916 -344106 -301460 -159907 -187279 232959 -113356
21303 38113 126109 -472922 -203083 -20266 -201665 261037 -273025 -241547 19033 -204742
21292 -364231 -4309 -54890 32600 87848 45817 100910 -109001 86313 -164379 -147812 78692
21280 9310 -307878 -216410 -214938 -90961 -339455 300442 -118892 78257 -235997 -77927 258285
21268 134151 17385 -39184 -80034 -101891 -245389 -308918 184754 -161645 127315 -271275
21257 -44947 124467 40179 -264595 -392644 57763 -125442 225370 98710 -35728 9711 -123242
21245 137976 -50651 -159200 157963 -54857 117326 -79632 -366241 60939 -91630 -53737 7560
21233 -21248 -172613 -274844 -170023 47733 -74624 -78193 7412 -141399 129851 124694 -454595
21221 -303800 248099 -465623 168756 -207962 -85037 254799 -78120 -109963 -193025 78327
21210 -146364 183211 115016 75826 -35208 -47908 -19023 -272051 -196251 -192354 102803 -49875
21198 237068 53139 -211241 69014 -180286 -149421 122508 96855 121253 -281203 -102946
21187 -348549 -149967 45499 -150914 -130550 -285345 -177949 -247290 -163907 -42906 -158011
21177 -158011 172844 60665 -169717 -25166 -291604 2473 -19583 -227689 139098 241882
21167 241882 70034 -152846 3181 -107715 108128 12638 -165807 -192783 3387 -109962 6426
21155 -107057 146121 -8163 -254512 50176 16935 -369828 -251718 -83678 303542 -245345
21144 -315099 -141826 65398 184780 -46493 -93436 122906 -200953 -211747 254926 -186040
21133 94861 12168 40923 79802 414588 5594 -182832 -58702 22376 -45560 -109413 -362097
21122 -362097 -65615 107133 94170 -190767 168823 -151639 49227 -100339 139798 159591
21112 159591 103094 -118377 8338 85837 20430 -92771 -301236 -431154 -214199 43754 -278582
21100 87307 13805 -189 -9815 -421389 -498307 -228831 -184947 -241292 67124 258480 -43139 -64760
21088 -64760 57650 39076 -65153 178358 -474187 90896 -208646 -233081 -282428 169311 245746
21077 245746 72797 219312 54215 -226289 -15791 -376387 30396 -236336 133432 94215
21067 94215 -117552 -175463 175764 -270415 171847 -48407 -98047 284422 -40753 -137917 -236379
21056 -236379 -170233 58308 -325575 -297497 -107316 -109235 63915 81899 -328930 60448 -13546
21044 160171 -338898 -172331 -116142 18780 -181745 106893 60194 96355 -24764 -76433 139764
21032 30978 -130629 167901 38618 21669 -135246 90458 161613 330310 -37933 -193329 251
21020 -79061 -13842 149384 207875 -248987 -29538 258455 -291773 -121572 -133023 74258 269092
21009 269092 -12270 11340 -70671 104539 -59848 69151 66715 -305639 189020 -78289 116222
20997 36635 -10953 114578 38428 243737 -93690 50383 -62077 32449 304227 67513 140546
20986 140546 -29146 -65361 -176758 -173203 12969 -254766 89145 -136070 37554 -13301 -180137
20975 -180137 -16951 -105593 -18405 125911 120295 -57532 106268 84790 -282580 -8663 -31003
20964 -31003 -27878 -141606 -205219 -178716 -30174 -26229 -236712 26729 150938 -40729 112197
20952 -204816 -144356 -407976 -109068 331568 -256431 44272 216674 -222094 -121827 85759
20941 136710 -134016 -2099 -56743 -243130 -290539 132065 -161820 -49714 -29075 172642 -239855
20929 126358 163091 150733 -125495 150168 -191264 36039 49015 107305 348028 -16249 -299242
20918 -299242 -216758 -53638 -233920 -188975 -40180 -154479 -103001 -170450 -422734 -58477 -73678
20907 -73678 -245697 -65393 -123310 93044 -174196 132614 -239744 279819 -131230 100283
20896 -419099 65688 -130941 212752 13269 -38610 158661 275314 236096 -276482 -310884
20886 -310884 -66182 -110984 -4809 -51053 -88798 5240 19331 -229420 -65042 40051 -70200 95702
20873 -24038 129005 -148054 -243797 80044 235855 42462 -204162 -345969 -114141 45317
20862 -185178 237212 -62681 -125775 -132951 -263982 -210699 -104103 -95412 -111031 -273287 1408
20850 -196911 198609 47926 -310544 -175362 -59270 147327 -268548 -91326 -186106 -139997
20840 -139997 -65226 -194237 139995 -86534 -210699 -540239 -35918 166119 5562 -282972
20829 -130175 510210 -245192 5457 209125 -66228 -9604 -74470 -513 11904 -142231 132582
20817 -334192 62966 195275 -182516 -388477 -377451 346921 -248402 -81852 181886 -48279
20806 135912 -137849 257909 -253267 -230485 173084 -201826 33569 -175327 -175424 47580 -25745
20794 -80805 -129702 485224 -163992 -156376 208543 13847 -210940 107858 -169144 6642 -120399
20782 26902 34159 -8493 256655 -242590 220289 53713 265286 -110719 55334 -88043 43605
20770 -161870 113671 -48056 -168025 -204297 -69492 37003 -236276 -37444 -172081 -222369 290845
20758 16221 -68826 -168068 -223051 -181306 351845 -278236 -158562 -63752 413840 124490 -228914
20746 -180059 71570 271642 -219310 -157844 169263 -125156 -65542 -89165 -306951 34427
20735 -61968 -219152 46957 -69012 -126757 -117994 -236424 -239904 -11938 78937 -88129 -105650 -306860
20723 -306860 165903 218886 47377 -2399 50734 -38020 218388 1212 -81011 -93337 -338071
20712 -338071 -119555 -168049 -121986 11836 -190979 -103979 -27330 103500 -61346 246579 78354
20700 173648 220805 -158011 63983 -147116 -115598 57880 163787 60144 242976 88936 -143988
20688 -44248 266436 70108 115182 -119829 -97494 -249231 51300 -29482 303903 -5307 -64362
20677 -64362 -107284 58779 108170 -39866 1529 -93887 -250430 96948 42359 211479 136185
20666 136185 -238807 -126897 -301829 -89564 -161202 172333 -155537 83867 138359 -166863
20655 -32344 -127053 174761 -103047 -50863 -65129 -234943 -78899 -388469 124110 -67645 15450
20643 -13660 19473 -154025 -92559 90890 227181 152450 -377648 104776 -74641 9543 -230827
20631 -248732 -46702 73111 33410 45695 -172752 -267534 -168242 -233617 -380474 -28021 -14320
20620 -14320 -202568 -271266 -160766 5715 284326 168232 -263010 -196564 -95654 105963 9819
20608 -260565 -129404 95480 33090 22415 98510 -42930 -59924 162818 12920 -34196 -186985
20597 -186985 50218 111463 23446 -91579 325669 -132453 -130483 -143963 -59513 -247144 492084
20585 -132039 98594 27931 -71258 -80506 -120019 -183122 -12522 86266 -15701 25980 577357
20574 577357 229440 -235511 114701 -240837 124676 -126224 -338250 198720 -79399 41067
20563 -208199 -253311 -316038 -23987 -296394 -341069 -15617 179284 18358 -207145 -151022 -212965
20552 -212965 100935 101826 245807 -169336 193524 -226818 130347 -21890 92420 6960 21770
20541 21770 58259 6091 -59740 -126153 -60790 317013 70522 -295183 123501 -142632 -182363
20530 -182363 -249294 199426 -190715 31558 35817 -321029 -100656 -701493 111771 -139488
20519 -95719 -8315 108162 96783 -110205 235935 -221266 -160006 251082 -112000 -549117
20509 -549117 27666 118238 64310 130655 235788 -32392 -155725 279487 233521 -111356 28609
20497 -67134 -22671 -48166 -42327 -117137 145843 -97533 -131162 -15945 -98207 30752 -220688
20485 -161367 -489538 36286 100651 -190378 111876 -333334 82707 -402079 51542 50543 -149457
20473 -116762 -138037 76998 -126606 -67479 152732 284717 -280756 232980 -288350 -291956
20463 -291956 99228 37890 102801 -181565 -213548 -144589 98813 -124791 -542371 -156290 312159
20451 380149 118069 -104612 -1759 -259764 -38332 164885 3055 -68231 -39279 172043 -152231
20439 -119116 -148266 -190637 72151 -109767 -82493 -337326 -296502 -86686 -333266 -280424 -27273
20427 44024 -115408 -175637 -199322 -284912 -45003 -209663 -123731 -293661 -13138 63773 -225211
20415 208179 -152793 -431208 -50278 -10561 -138457 152800 -145465 -141869 102639 -51471
20404 70009 -233140 -91323 26271 37001 257029 307291 53398 55810 -424134 -108721 -49321
20392 41161 113591 -26566 -51288 99190 139253 -332995 87907 -387187 -141855 149218 93342
20381 93342 -132355 -53824 35900 81183 -247404 -189725 132328 -203713 -445374 215874
20370 -121476 -9738 -118125 332451 -201817 -134161 47736 17281 57860 -96013 305224 60182
20358 60606 -178687 162021 -167530 -113832 -280298 109082 130174 -11420 -61810 -8525 -36938
20347 -36938 -252704 -81511 43375 -229179 -911 -37537 33972 -215587 -41830 299060 119841
20335 -215322 54897 -157079 10952 139662 -148571 106378 -4668 -2194 289385 145815 212407
20324 212407 100314 -82685 -140151 -492463 106963 -46775 150124 -21976 65238 -141714
20313 -147816 116980 -132090 278883 -125974 -79936 44017 -175360 -77277 -110191 123450
20302 -106802 83450 -216517 -230173 56837 68594 -207749 -225201 -65157 -105775 -28036 21337
20290 130985 212530 -145520 -267391 -412506 -19315 126887 -415262 -9316 8879 -194280 -178093
20279 -178093 -228332 175767 -209563 -58997 -89762 -3305 -6212 -143819 112156 -342182 -28918
20267 -333279 -145730 30925 29718 209980 -172820 -25830 -311874 -156583 26304 101119 44306
20255 -42941 -131949 134532 70323 1191 -145373 14808 -35851 -289447 69421 -156124 142413
20243 -153021 -172630 289950 143253 112942 231638 -120417 -133439 -152826 -110875 -111713 -31692
20231 -176405 -186109 -115663 -482278 -113101 276658 -90886 -311299 303283 -54204 223220
20220 -195196 -54785 -476680 165496 -205743 -344436 -248534 101050 -296674 -134926 49168
20209 -151347 -44914 91969 -326284 58961 -180665 140068 -289488 -455828 -291741 168092
20198 128473 -75126 -256220 142947 39937 -150159 128453 7147 -242485 -256479 -75037 63358
20186 -141819 -289249 -190392 -153946 -311628 29612 -395816 -161186 -94326 -27130 -248977
20176 -248977 189645 190265 19865 -117962 219460 15507 -40168 13655 -32668 -97764 -105381
20165 -105381 -8882 72284 -123176 -103810 99768 -28764 -254419 56344 -88983 -207433 19646
20153 283662 -263594 -186379 -30708 -96590 -230167 -188198 -31455 164939 -163790 25420 -114039
20141 262492 -113506 -274077 -114232 -113722 174972 -154369 -136961 -52669 -161231 -520488
20131 -520488 -23847 -35132 183775 40424 -166698 -293612 -84423 -445029 -255458 -247398 -248208
20120 -248208 14457 -375868 6099 -29837 54829 28120 -377626 35959 122098 -25667 130819
20108 49549 -217073 -267105 -57629 -210211 -329535 203050 -321791 285922 -282048 71007
20097 141555 -31529 -68852 154173 -304356 -92163 132901 -382622 -116354 131348 -102247
20086 202996 -147266 -83190 -132185 -81169 15891 -17752 -37583 32181 -220734 -59777 211750
20074 115333 -215380 92157 -171384 -237068 154334 1128 24039 -206617 -146273 -211949 50896
20062 41749 177492 -88770 -61455 111777 -60570 188761 -124139 -135427 436620 99409 -6041
20050 171682 103084 -70495 -194921 -38531 44417 135412 352589 -74039 114068 -342897 138319
20038 -302704 110604 -150927 -36559 -2276 260593 134865 -60144 -92194 -23284 -44425 -80342
20027 -80342 -124373 10457 -50393 -41062 -180952 124571 128386 -26247 -307913 -42087 178798
20015 88313 105132 120053 5808 147239 -2322 -93507 -54707 -65187 3426 -44624 -129275 -23712
20002 -85774 -135178 -85709 -143552 426850 -218711 -206408 -16348 224950 -316514 82712 148136
19991 148136 264604 -89488 -70703 190315 -187518 231870 -237541 -264823 -103934 372343
19980 -60779 -107497 -168071 202442 -123096 55847 -336756 -48669 244571 -170366 187137
19969 -41655 72896 -15121 78988 -5337 2110 99143 228772 5402 20578 -161518 -224239 56484
19956 -339786 -101074 78445 96244 -86650 -224105 11535 -243466 -132211 -366750 -17019
19945 -82284 152027 -141285 494484 -268789 66051 -48596 3790 -224022 191395 -80820 -144431
19934 -144431 -184032 73648 -126883 -34439 -251308 -165663 -173934 5216 -260721 -341450 -7604
19922 96264 120624 -176482 78554 51982 36953 -103756 -219661 -237677 30179 -254273 70033
19910 -126447 244214 -106795 -25116 -68613 -105853 -199369 146900 -199009 -48845 -214297
19900 -214297 -160068 -248490 -453425 67576 270468 -138919 -424378 -44989 -167671 -318472
19890 -318472 -61367 -53178 40676 -32576 -330820 -110838 76362 -436128 -188769 284073 -83791
19878 -78750 -39447 -45903 -38730 -15263 2712 80768 -58726 26123 -406117 -81364 212120 -131035
19865 -58573 130746 -210059 7723 -221799 -113797 127868 -7511 225336 -207796 -78649 -75401
19854 -75401 -274338 -99868 116153 262607 148837 -153551 -53593 -143062 -183727 -305688
19844 -305688 -222156 15954 26773 239304 -105157 -156722 -65469 200770 49975 184498 -389769
19832 95350 14439 -31090 -161216 16769 -142111 -50244 -52154 -47923 203872 148359 199483
19821 199483 96678 26668 -311248 -461364 -339336 86009 -31839 149212 -4270 3492 6395
19810 6395 -281377 301590 -78461 -162582 -351644 -70147 -329710 -126877 152076 -17964 -48586
19799 -48586 -324682 97501 -141749 151274 -420970 -377811 64193 -197577 -47483 -202777
19789 -202777 -42329 -210363 -223079 -205378 -189242 -243983 120158 -95678 188972 -33259 -34155
19778 -34155 -93397 181284 -110325 134623 175734 27741 199127 -170658 72490 -39715 -52333
19767 -52333 -164845 -23185 -11613 -293657 -271620 173940 -112459 18193 -57799 -138239 76895
19755 211101 74018 93410 -3882 -280552 -363127 -206181 28376 -308882 235829 44505 16060
19743 -37269 -24436 -160025 101213 5191 4980 11963 -181958 -4264 210728 88008 -342178 29933
19730 -331046 -10383 -287131 24131 136894 25413 15749 136226 78029 141965 -300932 54370
19718 -172318 214676 16161 87374 -107928 -73152 -109954 -26394 -175543 -36456 -286091 -91211
19706 -139536 -212322 -30550 68878 235403 22533 47897 -56906 106291 -158491 -50038 -202954
19695 -202954 -63829 -72804 -154838 25379 -131082 189799 76116 77663 -160578 -89623 -228376
19684 -228376 108883 -56475 -307571 31560 -304725 -174205 126264 266302 184306 87232
19673 -27042 84973 -350638 224301 88008 -292600 -62134 59681 -174758 -290152 -265768 -285000
19662 -285000 -241204 -140667 -106878 169370 72108 -39107 -108274 94713 -269820 -255134 -156127
19651 -156127 -264347 -68690 129177 -97580 4698 -296493 -154530 19600 241763 -214234
19640 221264 -350063 -123787 -25084 -48866 -107279 23541 -250711 -23569 -158409 -118904 -235066
19629 -235066 -401498 12301 -68438 218288 -237114 123692 136069 -53223 86694 -274927
19618 140940 -20189 -99712 -323680 11284 -132917 399882 -107796 -13634 -196823 158261
19607 -191624 -160417 -44088 256264 -325564 96461 -138285 -110208 -88852 -30891 -405172 -26819
19595 -134839 -130120 -127559 -48100 144253 -112479 -215446 -39401 -162550 -123249 -107963 -287941
19584 -287941 -71950 -137516 43297 301273 22842 192329 -51125 -410458 -200193 -18716 -467838
19573 -467838 -84765 -158094 -127792 16031 177597 -44682 3625 -335635 11232 -162028 -362019
19562 -362019 330038 -293237 -258144 205640 -401093 -233787 -282299 -100141 27272 283833
19552 283833 -127814 212020 -225492 -178295 -83166 25848 -231779 92047 -78778 200603
19541 -1426 -175197 -170527 -114152 -117382 184793 248801 -72142 -89954 -365236 -542 -103291 -134778
19529 -134778 -27812 -220207 203112 29275 78846 -202356 -145139 -31301 267711 -77060 133466
19517 175976 -32553 -45798 107936 29630 441315 -98688 -90734 -126561 -168557 84425 -443137
19505 16571 95034 -68863 222455 -67866 -274859 82845 -7826 259792 -5991 -350084 63441
19493 -14082 -37022 -258832 -16800 84680 110431 -207043 -73168 -132160 -278094 239510 38030
19481 30105 296222 -163321 152157 -287688 -88963 93235 -58839 -256842 -107620 -250763
19471 -250763 36396 116085 137151 -313943 -267061 70737 -116430 260958 -39912 33743 -256682
19459 -225890 248293 -72963 52655 -194494 -128962 -23831 -42045 106864 -88844 -88969 -11291
19447 -332177 -36851 -185511 -212451 -146622 -287083 131591 26778 33369 -153273 -278116 68762
19435 -71259 60619 149473 -157154 10457 -81932 212679 79442 -126091 -189276 -332197 -59895
19423 -111419 47913 -70500 -49260 71173 -80681 -263712 -210200 -80327 -64142 -136907 240908
19411 -277195 7929 -377930 -43155 224951 -225880 108313 221030 -276563 -103100 -204767
19401 -204767 -58425 -146170 4391 -209655 -189392 149696 -8490 67261 -82614 -19406 229627
19389 -38414 1665 113639 79355 191139 145002 117943 33561 -94630 -360739 235000 -93679
19377 24610 54799 122469 -364174 44101 67329 -54110 -126548 -97026 -96467 204250 -168590
19365 -274643 68116 168533 63570 -158197 -45333 -173813 -216501 -258837 -138346 181921
19354 -223385 -128205 366 -160071 -296524 -137456 8350 138558 -33384 54284 -47598 -186050
19343 -186050 164260 -252264 -8894 -67885 -64875 45411 -265371 -464978 9427 -16989 -239411
19332 -239411 -133272 -31090 -50666 -458332 -20454 -153429 35023 106596 -77743 -409593 -23825
19320 -189216 108697 72912 58728 -227959 76089 -134311 153750 -83510 93816 30502 58570
19309 58570 89167 96000 289394 -89226 -352006 -71249 42002 30361 216285 -245333 124013
19297 216042 1937 17054 -149138 -241436 -335843 -153963 142054 135449 -43972 -172597 -128054
19286 -128054 -149626 -22799 -257189 184798 78880 -89744 -37276 -30943 20879 -177018 -107009
19275 -107009 -5224 -254408 -120167 -278049 356875 2626 -208865 -205145 63672 -181024 79441
19263 70939 -219714 -52972 -12457 3189 -342640 -283947 -73253 209568 -192089 -97641 53067
19251 -93117 -294761 -40501 60831 53888 -169994 -257349 175259 -62992 220072 -52247 90346
19239 -66667 -203405 -212490 -201614 17163 -189192 28902 -26364 -175688 125954 20789 -101450
19227 -137082 -240072 -229536 -105548 -15142 229293 46067 -884 94504 -79820 -46371 -116876
19216 -116876 -53492 17719 -262739 -127349 -232149 -174346 -39155 -104580 194069 166508 -274686
19204 272598 -69750 66443 302262 26759 -125698 -99810 -229077 12804 -126102 -138368 -216698
19193 -216698 -195790 -58274 275788 15811 -205680 -161033 93253 -419004 -4260 61517 -238581
19181 -372594 249445 -44583 -237058 -8240 269638 -7901 119578 277937 224182 54625 -286275
19169 -402524 56740 -100622 -183749 105612 181763 -7206 -106 -107156 -211264 -369946 -50422
19157 -143718 -79758 -267046 -169118 -259810 -109914 -363931 262279 -163179 -118961 -152077
19147 -152077 -30486 -89219 -321503 -166450 47552 133529 42137 -359751 170200 262481 -27357
19135 -98464 55916 26506 -69377 108111 -73444 -275225 160720 -81642 -181683 255274 -84293
19123 181341 18672 -213286 29484 51383 -65203 14637 -189477 78145 -87879 26593 164743
19112 164743 4907 28956 290001 -12620 -374574 -105580 -107309 -101069 -137486 -138983 186900
19100 100710 32248 -93608 118198 180312 -197889 -463002 168865 -135806 3409 -404590
19089 249253 11458 -169144 -515279 -151485 15724 79287 -234135 -111601 123824 117269
19079 117269 -281487 -144300 28205 -242396 -69788 -195538 18231 42093 39688 -205747 -2474
19067 40008 278568 86802 242812 -159141 83927 -304292 106505 86905 -23 41268 280537
19056 280537 76699 -231785 -8544 262644 -77422 -103268 -21971 -160924 176255 224890 20499
19044 -93951 -246227 -26778 114195 118358 151298 -131273 -260702 51681 -10085 63202 -362551
19032 -88183 -93380 -186232 116651 194975 132334 5407 -126793 -180670 380355 318524 55496
19020 25924 -437 -47910 -17640 66163 -131764 -90163 -332757 42173 -103303 13335 -239038
19008 -132077 125982 -99120 69399 -111185 32024 29076 -159982 -113377 -46901 202214 -96740
18996 -45486 189494 42208 69182 -87755 20510 -84546 -98976 -182937 158327 169647 -35585
18984 -260256 -54064 -18550 323013 -109605 -78415 105495 -171134 98046 239607 -183354
18973 150973 -44987 219708 -271725 77818 7496 -47510 -151966 -231171 -65085 -190329 -233746
18962 -233746 -424074 -237891 161451 -232072 -89972 6891 -80522 30091 -148893 56794 -30629
18950 -90821 -37606 6651 -139395 190689 -213091 -64479 -144166 -144246 -130365 -41409 -153644 -130067
18938 -130067 -132918 -102547 120631 -14117 -76882 27640 -44925 -49393 250450 -77654 -45903
18927 -45903 -32074 80880 -453225 -23154 301101 -21935 134630 -39459 56250 -380701 -192364
18916 -192364 -129419 -638496 -38815 -160953 -213509 -155711 46999 34934 -149377 353207 65388
18904 -444167 -123617 -113900 -226153 96265 38450 -183378 82824 127336 -18625 -10839 -205088
18893 -205088 77877 -31129 47645 50895 -69309 -259463 3115 182829 -42111 30987 -168584
18881 -150655 -64798 177728 -114579 78097 -15310 -101710 -150831 -451914 134697 -148699
18870 12783 19604 192074 -89794 59813 -98612 -100255 48091 101245 -198648 162251 -26864
18858 20364 -98515 -72750 -256453 -182956 81781 -226836 -179235 -52785 223550 144418 21030
18846 140349 -434162 -69454 119905 -69659 242558 212534 -73190 -77968 -3596 -288222 -61639
18834 -67611 -27278 382986 -69260 -313974 4202 -144274 -128134 -128342 95058 32833 138 117370
18822 117370 139709 139932 138306 12456 -232346 265251 -250048 285382 334060 135474 109335
18811 109335 115207 209818 -135589 281645 182099 -50112 175421 -160976 -60868 209988 41074
18799 -161464 6418 -35929 -21892 388505 -4037 -167622 93431 -28866 60675 -355147 -134925
18787 10740 -375355 46923 -172076 59866 13664 -244150 -311090 -39705 107054 108598 -223543
18775 -84469 15537 -117743 -251922 173040 -94035 -231236 -97110 -123679 -285941 -175849
18765 -175849 -116346 -278489 -131163 -25370 -6023 107248 -28478 -278120 -176333 -319116
18755 -319116 -40634 -78411 284893 -51476 -224009 -72400 -313039 -55444 -295621 156349
18744 -161657 -214683 -280249 -43556 -16554 171705 -273309 175203 -31509 33781 -579031 118940
18732 1345 -186243 -379393 -65741 -58063 -150597 -329473 227082 -129060 -68652 -75751 190726
18720 153807 -148949 -275138 -23707 -94014 -46893 91017 78050 -187920 -109214 46650 -1886
18708 -216963 -246234 61706 -165163 -58971 -224598 216683 -87628 -31851 -136893 47042 -106293
18696 -146711 -337037 -104091 -137148 23912 121267 36768 -164049 281916 40929 -283115
18685 -22360 84068 -14615 -8056 8016 -30820 180895 -94683 -152924 -232485 90131 -143200 260217
18672 87046 -199086 177324 18793 85099 45806 -113988 -39109 160026 123898 -168885 222279
18660 186198 -229354 96809 -407107 6928 -425282 -270868 18088 30934 -82512 -89850 -246591
18649 -246591 108383 -48725 -169843 180486 -81539 184261 20054 -36093 43239 -127487
18638 -75351 213632 -126189 -108334 -95341 -99913 -51574 -77003 18146 -276623 419910 -142005
18626 -103180 -271637 44521 -98969 67661 -85082 325773 -78486 -189093 -285554 -87590 123257
18614 -330586 -11784 -198594 -423985 35468 -266074 -95793 -107740 37575 94836 144909 -65882
18602 272564 -407353 -110007 -157519 -171115 -230133 104379 25739 35506 -127446 -232488 -225810
18591 -225810 153787 244486 141548 27680 -116573 1472 -226672 156433 -143219 24403
18580 -48631 -94064 -148504 -424619 -100633 -109061 100791 -82082 221148 -126047 -55570 84900
18568 17310 -138044 -63040 -419090 87603 -157603 -292727 -71502 -32707 -217614 -83886 -31793
18556 209297 -180332 21253 -1039 -57800 -33967 -199880 -7858 -161726 -90029 -178408 85766
18544 -45379 -69277 -226555 -7542 62105 431416 -31586 -162311 -85703 141833 -169248 -147761
18533 -147761 -79108 -23134 -172147 -83492 -113385 -171841 191259 85992 -435538 42301 25142
18522 25142 214064 196482 101712 58551 -42159 -137192 -403878 84588 -95799 50219 -62596
18510 -18444 -226983 -134906 135164 -33881 -129571 -65662 126718 -216970 35359 12362 83152
18499 83152 -221005 41222 -217900 72881 -184442 -284894 101538 -195014 -127550 -171825
18489 -171825 186427 12366 116012 -87775 1365 -195733 -186802 138741 -54933 93455 -143674
18477 -7631 81009 -32736 132613 39431 -326338 -393986 126516 -371720 -2181 62621 -317290
18465 172569 -356597 18119 195143 -859 20977 -104970 -120747 -116844 -177798 -15380 -100605
18454 -100605 58219 237202 -110326 -77366 -219961 -186225 83606 -204876 -241896 -86686 -23990
18442 -93843 280927 -59590 -48025 115183 34422 -42597 -177755 -82204 60546 -186186 -221885
18431 -221885 -14551 167581 138244 -116173 -165071 226690 310472 -193249 124165 -100902
18420 109743 37346 8787 173460 -151863 -67894 -298438 -123107 -348056 -283150 -55536 74026
18408 50704 -285192 220526 -137250 -44349 78672 -20615 -114431 -184805 143062 -58459 -22824
18396 89646 -79525 198150 -186950 -195415 -101087 172730 -277700 149990 -66454 108742 87069
18385 87069 -21753 307521 108850 123859 214648 151489 -107024 -204885 -6715 -30776 359408
18373 42053 -56010 187782 85318 211881 28750 -8288 -34153 155944 -294135 -184314 165806
18361 -145741 274053 197143 -66863 -29281 -37781 -150621 -186496 -147087 345840 185278 -72372
18349 -254204 -131074 -178567 113141 -180335 -77816 -97520 -10659 -50165 -168097 16200 -274757
18337 160557 44745 6160 -82165 -56234 229523 377754 65654 40013 -5865 -185104 116509
18325 -60236 -287828 30309 -60895 -63794 54728 -253894 -40848 -149143 53004 -267892 286470
18313 -56351 -232280 -187033 -61453 8461 -322898 28742 110731 -69222 -126522 148755 -167214
18301 -282087 14525 -260789 -286146 177680 -49180 -244952 -310695 -143422 224626 113231
18291 113231 341712 47036 9795 -98727 384906 -382606 -46209 -146485 -206317 42826 -277253
18279 1162 -35591 24457 -285595 -324885 -168647 189431 -282290 -233369 -22715 -75693 104592
18267 33321 -158615 -125545 -408760 -486893 -34004 -142755 -197826 -202454 165744 -23063 -47039
18256 -47039 45589 -212028 -199133 -27199 129527 25013 343663 19780 -97058 -272690 23562
18244 85410 -8480 -87311 10263 186927 -69308 299804 -38713 20549 -258348 -35348 176863
18232 -207985 -237802 -160399 -133941 -406566 -362019 190945 191777 -95704 -34498 -128886 -90438
18221 -90438 117521 -176130 74469 -40328 -94905 7959 -114180 -18655 -213755 9464 -172912
18209 -249010 -192991 -100515 155221 -53669 -129689 -2035 107980 -153454 -72546 -247604 -39338
18197 -10885 163647 73772 -4040 32223 -142577 32159 99379 -214500 -183432 -445308 12619
18185 69664 75042 170733 -293484 -56892 -13995 6866 114222 -155431 65697 -32129 -103270
18174 -103270 -221596 -67891 -53075 321989 -52714 95901 -136035 -122861 1330 -29403 -173899
18163 -173899 136805 90428 -208682 -46928 -109885 65430 282065 170135 -166960 12934
18152 8652 323429 24754 18735 1925 -119260 257548 -136739 34965 -8373 -374559 -287251
18141 -287251 71982 62784 -455581 190815 239307 -156679 197899 186165 85597 235501 233817
18130 233817 -162693 -122097 -184006 -309586 77789 25030 -41003 -238077 -230690 85333 -87713
18118 -160651 81427 -69348 -47391 -32315 -134265 332725 34888 -15400 313769 -31320 -64836
18107 -64836 -257359 -159845 -73772 -351223 -13982 6363 -126647 -247780 158155 -147366 19874
18095 289129 118969 197970 185242 -106132 -10901 -207437 -145995 233158 -237459 -189015
18085 -189015 60045 40439 -205112 -58132 -74554 -219589 84099 -46033 -173699 -2084 -199464
18074 -199464 -255304 -377120 105146 166060 57651 -150982 4469 -8363 37830 -41076 203615
18062 85100 -97903 -366607 -45222 32335 495266 -35870 299523 46221 -314281 -408295 138180
18050 136093 -285077 -213039 76151 -114106 135725 147116 -198646 133416 -353659 106529
18039 -462513 -226141 -21465 122638 22745 -44252 61803 -116752 -200219 157771 69220 -84110
18027 190150 23776 9264 1032 195041 -265291 157293 249304 106047 242200 -266079 -157052
18016 -157052 143159 323435 -226712 143029 -254932 -631837 -420739 -140668 24255 -187778
18005 145687 -270000 210353 -862 -6440 81203 -48992 239119 7397 68954 -467515 13879
17993 8355 -169417 -50184 240126 137365 -172800 -97710 46936 266502 130240 -282616
17982 80393 333431 -105814 228582 224014 -24382 75347 -63178 -213471 83203 105749 -26537
17970 -301381 -11878 -71275 102813 -178728 292327 276488 272969 -12566 149643 110541 -57713
17958 327137 158518 -18470 -159766 -82655 -40653 181103 8814 -198720 57060 -299973 -180048
17947 -180048 -375008 -218432 -63370 153912 -104729 -108866 -264556 -278577 -189483 192346
17936 216427 -387793 84284 -323567 101002 -168087 -34501 -118492 140395 -291587 352456
17925 -198081 -72646 -175085 -229288 -261316 132042 -214550 298165 71096 -144535 -258957
17915 -258957 -73624 -277072 333153 -149570 -39120 152151 -6533 4518 190637 -459868 255216
17903 -26056 -150989 -15126 -44567 135027 60751 -124518 -82645 -35224 48731 166455 -29807
17891 -33513 -68011 -234623 79859 -84124 348916 91523 -57947 -321577 -179545 78848 -40898
17879 37523 -188680 306133 6704 144201 96293 -156432 130803 -42324 -222887 146574
17868 63574 2412 -74974 -203341 214117 9473 22091 264534 -78950 -59399 399093 19364
17856 83405 253790 65030 169991 60230 1247 -148653 -277914 270657 68197 14684 -62638
17844 -67033 -117464 95049 -164763 -154043 -95800 131173 -237937 -239172 96912 464757 -75572
17832 -191861 55278 162738 -120233 178879 -3993 -24452 -349275 -208446 -227256 17940 12016
17821 12016 -162135 -169782 -23817 289013 83971 -145956 -272586 173018 -141205 -68653 -143551
17810 -143551 -208389 2638 80250 162717 -68025 -51606 203716 181313 133527 -132679 48333
17798 6450 68663 96992 -243754 249897 269441 -170621 -144173 -249352 244714 -69583 -96302
17787 -96302 -33294 19969 19169 27396 -104472 -249919 78170 -264636 -65024 -106117 -264367
17776 -264367 -286954 200433 -338167 265756 -113250 -25011 -260226 -272955 -65128 -41883
17766 -41883 -255238 -266897 201576 193004 398335 -58977 -122467 -71682 225239 114806 -292798
17754 163897 -142591 196808 -58406 -219914 -11689 -94502 -15138 -24665 366929 114635 -25192
17742 62731 192353 -44312 -181306 125697 -82901 125549 26570 -275339 -236486 152132
17731 -233952 945 -28781 139260 -122709 -120750 -309569 217821 420995 -433088 -43083 68865
17719 -159772 -120161 258080 292809 3877 216678 -105246 89407 -27831 -282697 252671 -220484
17707 -29850 -94253 201864 76818 4971 -54684 -272936 16444 97626 -107791 62739 14443
17695 38298 39293 -273246 -271074 105284 128312 -54184 300810 -61432 87787 157611 316955
17684 316955 240416 -471816 338841 355140 -129510 226370 14801 -286084 155853 22552
17673 143457 63577 128369 -1825 -144356 187192 251117 102582 -128927 51825 24299 31220
17662 31220 -46176 339188 -90466 -83012 18339 -138034 -157078 472133 -45672 182665 66070
17650 -55064 -37382 220928 21169 208017 124798 24335 -363563 -174989 69893 249895 -188544
17638 88770 -63897 -1970 -153531 305028 246957 -39125 267941 270707 361867 92488 74022
17627 74022 24377 287506 109141 285748 10416 136065 79887 407505 85597 -37611 -278769
17616 -278769 104997 244025 7690 80693 -136992 -152871 -87108 113856 -82570 127271 51866
17604 -77993 15078 6990 310315 21246 -174988 46878 354626 -158246 -323679 -27104 -187479
17593 -187479 -160352 918 61258 81523 161496 -74503 -29610 -50481 211497 325916 105663
17581 51775 -42325 -184539 -51810 -9115 -146989 279813 41776 43025 -140431 347697 258367
17570 258367 81184 338394 117836 -77787 126931 407545 -16626 83161 387654 346790
17560 346790 -96167 -296 -178328 230375 -892 -156900 -95735 396968 71135 -112963 189920
17548 -319578 -43316 5128 -240107 -160009 55940 150007 -194789 97401 -147713 -88476 -15216
17536 168973 34182 -67016 -18172 -89455 -56136 18010 118734 -282584 237701 -215920 -62805
17524 -27517 255884 -159015 -275252 -112465 74350 81754 47729 176244 453684 12564 93105
17513 93105 373507 -117810 -37412 -212428 17736 145441 -30336 179284 203637 601958
17503 601958 114315 -105846 310931 39144 -90561 129425 -52012 -35737 61681 -50966 221091
17491 -118223 225173 412926 168582 97640 78223 252896 80936 91320 -28594 307977
17480 157725 111831 228843 287575 35265 193047 -26781 -120869 134066 319452 195774
17470 195774 224147 231293 199202 445324 138194 -229030 367200 374215 -172141 -45449 102605
17458 -29639 224201 243524 69423 276181 50617 266252 152738 188904 70570 -100297 237436
17446 267621 59085 260320 -67467 -58880 449113 276627 13746 374271 157836 -1066 102855
17434 394291 137437 124216 134179 306495 323723 64103 165735 306906 231524 294590 356453
17423 356453 288235 353070 134147 334492 496551 300088 172029 -22634 -270599 401433
17412 614916 259615 372285 245890 264761 449160 188658 -236172 -136110 -126568 439625
17401 -4069 597581 -85770 417616 109243 103799 56927 27626 -163878 -10143 120813 201719
17390 201719 391595 74360 148198 419143 16815 120777 41642 -213858 -186970 32061 214471
17379 214471 240128 -84586 503665 133514 178840 134258 -121146 -64164 316936 -67240 -299667
17368 -299667 107973 -127518 51526 -150695 257989 292563 24574 67763 292117 251855
17358 251855 376801 57818 210561 192264 533954 73455 64325 373374 7022 180790 -13896
17346 281664 -35692 279320 122615 150201 -148159 125530 319278 358469 40275 82960
17336 82960 -26663 -100331 20015 13398 340777 -39446 205531 51117 31335 87844 106132
17325 106132 191853 -86891 71512 104903 253609 -103910 233269 83324 148200 205849 87660
17313 284229 255470 51499 159192 470500 279646 222257 303975 282118 166455 234936 -5244
17301 112226 119148 93767 115966 49508 -51367 71979 221525 402235 316585 105816 165984
17290 165984 12398 214012 280387 476160 144602 485838 334558 210433 264767 335896
17280 335896 297925 194578 202874 162671 -145891 569423 286044 -236318 -144976 38775 131985
17269 131985 76006 5535 -124335 93913 164330 356555 288666 258539 98626 41567 184209
17258 184209 -16650 319769 221603 265263 101556 362629 -50510 285066 248619 28994 552589
17247 552589 387646 7490 -104366 163616 -180652 292100 406107 303395 -33861 -100688
17237 -100688 212577 165527 218531 49177 537 -91883 57572 153651 27493 -81113 42941 414408
17225 414408 -30184 135467 199765 407595 459684 290743 236232 -179668 96631 174585 -125972
17213 352850 110903 269670 -31773 138872 150039 307354 -154367 54427 82187 29113
17202 143970 232049 -1604 1575 413029 75172 234943 139680 140446 7867 174396 377609 201426
17190 201426 302555 125793 204322 484278 274475 327880 21578 65635 186619 244364
17180 244364 -134221 301253 341952 228564 20751 193063 195834 504944 366830 284222
17170 284222 282924 27073 37882 69417 87268 442730 271849 410298 27131 290329 511881
17159 511881 593888 -60318 77539 222513 183710 318872 458089 155312 225374 41383 117729
17148 117729 -59974 369026 352885 330890 500338 26107 88161 449792 217467 427430
17138 427430 413390 551750 424831 215278 326008 453713 521894 344266 463155 363020
17128 363020 415737 255633 -271440 503947 265415 120960 127389 625546 270161 463255
17118 463255 395145 231573 409024 850682 433513 117566 437665 277692 463526 419711
17108 419711 218622 379646 -43901 242145 151763 475200 250379 121347 238621 456642
17098 456642 192971 195645 441572 420371 452077 311920 768444 354937 598697 593211 477723
17087 477723 410646 181113 171958 372377 392396 332790 534554 427856 27500 114357 703112
17076 703112 465147 375039 599212 535319 561541 402617 678580 494948 567789 350230
17066 350230 696391 776630 486377 446550 377616 523636 553337 367987 497214 669251
17056 669251 422049 569282 385541 328347 541242 289640 561884 241415 336145 575620
17046 575620 881059 440188 918641 663138 496731 519037 582906 503650 603510 416375
17036 416375 646040 151679 895996 613795 368847 788072 673909 565310 749868 437172
17026 437172 319988 517842 475668 552283 605878 601650 538774 527555 508802 474679 816487
17015 816487 635842 437840 561367 856261 704151 648825 647838 720485 955064 636895
17005 636895 426006 524517 659245 614052 694001 778862 938469 742308 590953 1011869
16995 1011869 924372 553544 1005534 702052 633644 897787 1099708 776233 746928 728654
16985 728654 608750 246510 826143 693062 1073449 954345 928668 934795 845946 969254
16975 969254 830836 589739 741838 1336515 1061285 722753 1030108 959676 1061194 867577
16965 867577 1328685 886080 673917 939820 547941 817412 847543 1036981 629427 972806
16955 972806 1150762 1234397 1141673 704265 1170050 1348714 1059704 1032176 1079622 1117769
16945 1117769 747956 1232857 1149086 1356554 914446 1355083 1175805 1325707 1043883 1178517
16935 1178517 1070151 1019223 1442983 1518885 910335 1122736 992411 1318412 1452909 1387799
16925 1387799 1063922 1699902 1391012 1249699 1217037 1370722 1503606 1254118 1273988 1342477
16915 1342477 1296546 1546103 1645928 1297363 1547954 1146305 1449886 1469392 1663287 1532267
16905 1532267 1726693 1350278 1696115 1689786 1694440 1552358 1687121 1802103 1783932 1882766
16895 1882766 1965171 2043491 1904289 1699144 1917309 1756764 1814707 2027301 2270789 2136073
16885 2136073 1943685 2122626 2079613 2265029 2054374 2385342 2003657 2111955 2217773 2499498
16875 2499498 2390510 2317638 2413903 2436703 2405767 2657499 2478993 2354275 2462161 2152989
16865 2152989 2624098 2442372 2503022 2727847 2627152 2572710 2864135 2693440 2989291 2940003
16855 2940003 2751703 3206654 3206294 3232448 3091500 3410343 3102618 3246508 3307004 3221711
16845 3221711 3593962 3275264 3386031 3351600 3702624 3699491 3958298 4019972 3871375 3820522
16835 3820522 4050992 4008096 4146349 4388923 4119297 4292964 4601834 4589763 4187531 4686216
16825 4686216 4692354 4899796 5173454 4876186 5023455 4999205 5419077 5293290 5485601 5597588
16815 5597588 5848315 6119208 5982013 6134134 6122461 6474188 6346455 6696270 6659944 6730959
16805 6730959 7104914 6988763 7472382 7852401 7185424 7682896 8011090 8418998 8666664
16796 8666664 8477136 8912803 9053971 9160565 9528109 9899471 9874899 10164815 10277794 10927469
16786 10927469 10865489 11343454 11654236 11987759 12541100 12708499 13037513 13706058 13530975
16777 13530975 14247258 14505219 15376041 15752655 16101380 16646675 17502604 17669834 18815623
16768 18815623 19095320 19723022 20635734 21216137 21888871 22854380 23646315 24816680 25601850
16759 25601850 26800485 28085512 29362472 30592321 31918221 33598289 34326050 36074172
16751 36074172 38119419 39951109 41991098 43688576 46171805 48415881 51096616 53722684
16743 53722684 56427295 59886045 63003453 67010314 70502731 74909774 79547299 84244724
16735 84244724 89470011 95240732 100776519 107381591 113816832 120816339 128379466 135846022
16727 135846022 143939638 151950002 160320382 168701829 176307846 183811547 190801082 196960527
16719 196960527 201539040 205275048 207495143 207606457 207131121 204669413 200737156 195791722
16711 195791722 189636221 182689315 175053154 166845986 158865706 149712111 141790385 133788453
16703 133788453 125731869 118144510 111080595 104120675 97623089 91602926 85998967 81001688
16695 81001688 76203715 71702807 67634575 63318834 59839199 56409886 53402964 50201689
16687 50201689 47772561 45036379 43124013 40883730 38710085 36804939 35338080 33491727
16679 33491727 32243161 30216070 29225318 27913448 26842238 25629891 24477242 23202275
16671 23202275 22405257 21517265 20919634 20134337 19318877 18697168 17864054 17586857 16366775
16662 16366775 16235435 15332630 14940587 14576006 13756261 13439830 13143642 12767453 12165724
16653 12165724 11897241 11768746 11285724 10958158 10673971 10399214 10096841 9573114 9763801
16644 9763801 9160574 9270964 8848730 8466847 8270584 8140648 7965043 7805265 7408507
16635 7408507 7220269 7272462 6576760 6642234 6535965 6293555 6375446 6231182 6401658 5654004
16625 5654004 5657296 5590886 5558885 5148798 5302416 5284538 5076031 4945294 4794064 4608472
16615 4608472 4739589 4476167 4385430 4206881 4023348 4106717 3970856 3981043 4238051 3731115
16605 3731115 3841584 3754741 3633703 3316380 3593548 3644892 3701369 3422319 3550046 3187042
16595 3187042 3112270 3195451 3323034 2925280 3278764 2793422 2841929 2691295 2817321 2693130
16585 2693130 2673342 2726859 2809017 2660804 2271433 2426981 2462655 2326899 2122802 2479828
16575 2479828 2092078 2215653 2077523 2107010 2425666 2064579 2152928 1943995 2197673 1671554
16565 1671554 1820671 1976285 1862393 2095927 1567214 1761979 1513952 1647765 1632708 1689972
16555 1689972 1660411 1756919 2026396 1952846 1244792 1508896 1533991 1558350 1700896 1494778
16545 1494778 1025945 1355015 1353610 1409135 1609767 1108627 1485233 1574693 1473661 1508363
16535 1508363 1598005 1285500 1257274 1470043 1606656 1344327 1217325 1157668 1328934 1371223
16525 1371223 1017188 1270817 1074836 985606 808691 1062085 1059517 835841 1234839 934399
16515 934399 1040087 997771 1001937 1001849 923787 1227616 770689 534792 1003944 846272 920954
16504 920954 905968 845359 513588 807129 551272 893587 868949 890253 874436 891280 672247
16493 672247 861013 402155 885912 762232 742530 564042 726674 825177 875966 1042649
16483 1042649 653355 646834 719719 944196 589658 456042 674813 761921 688864 657344
16473 657344 510027 704676 698503 687959 695032 768983 533644 541312 696017 55260 411284
16462 411284 585260 674548 489949 716739 723308 834884 489273 826792 500170 481073
16452 481073 704672 516401 377138 328857 621392 249146 276883 598476 214672 262114
16442 262114 458050 412257 433338 448442 335713 444699 736789 373458 1017036 393592
16431 235033 422404 781933 507408 798116 549925 452942 473429 275160 502649 719285
16421 719285 287514 439885 458787 373285 332943 298850 502779 378029 540155 218288
16410 353583 336695 284473 389205 528664 381170 77411 250860 310680 335318 187282
16400 187282 275292 537900 260630 489199 123076 229472 294493 189822 353352 -1094
16389 303419 366141 478889 -25696 249604 202669 523793 261843 117477 275138 308286
16379 308286 283 640858 279339 358504 127665 382406 207885 331433 190993 314991
16369 314991 -154756 205149 325510 187370 492717 180268 276977 324414 -11752 217284
16358 200870 -44543 226472 495175 399484 98795 458273 259152 152795 530574 301282
16348 301282 324909 462285 221135 375724 267420 217825 79404 115244 585628 210823
16337 185578 362146 381307 113926 377557 317816 127550 307096 464092 73856 166912
16327 166912 303437 -141909 101375 167023 440988 211000 6559 334605 110158 -117 346049
16315 123507 117500 256674 100710 223925 267447 215878 4988 136486 252022 118187 -38256
16303 418490 -15159 160494 344957 17861 72943 281403 167863 346050 392393 -25607
16292 253731 -298859 -5129 281274 -27887 63060 137645 -92692 118327 253053 81742 235116
16281 235116 -54348 -70527 339147 217306 -22837 183768 -10155 182229 153334 -17312 -218331
16270 -218331 139329 280545 336744 143654 129499 -156 11194 -33330 60189 430168 105858
16258 -17911 -124457 146561 149204 402807 144828 142331 -132843 199797 155788 308724 136641
16246 50388 -2644 126434 84118 -169064 -57352 378144 -113089 293730 -315868 56157 28801
16235 28801 157602 -116876 165642 244563 459118 -14709 -38688 -100867 -119400 2109 125781
16224 125781 -387252 134418 152787 119825 317801 -61487 130016 -231849 -89689 -147742
16214 -147742 225445 242113 193964 -63465 391167 231668 31023 -212918 -48055 -85214 223582
16202 -78113 -105090 -48453 18285 92070 108271 346982 -162282 -46356 -279028 -82864 395363
16190 214008 -250530 -73907 107128 577026 266856 115342 -298330 54885 109624 -27015
16179 -198033 38211 147241 -25215 164251 -25749 24348 101239 123586 -95923 96733 -10618
16167 -61210 -101329 289316 -69988 5449 192581 181922 -40880 -214291 218754 192403 90389
16155 319957 -2480 129795 203452 49086 -17408 -71799 -387465 -253424 200305 86176 63316
16144 63316 -127291 135162 18704 -197262 -116607 283564 194373 201690 -27486 179835 232707
16133 232707 -62186 -94027 -287606 -55076 192362 289585 18100 -66085 -220473 86912 -176620
16121 -186241 223930 -317885 -141760 -187848 -249075 62820 218240 -251515 69401 -186254
16110 -268159 78151 181134 32503 100632 -180358 262729 -180523 12617 -103505 265280
16099 -303577 209153 -259043 -123834 -212065 103225 -233223 316493 65252 180095 5616
16088 -34741 68552 141695 -200874 173293 -68649 2855 174684 -76524 147561 -215688 186868
16076 -33320 -248979 128011 227718 -181446 123327 -166569 -111539 -178151 -36999 345581
16065 33678 33657 -62104 44832 -15889 -80102 -146568 389106 6915 -67743 -338990 35357 229435
16053 229435 86951 223320 125207 1011 12900 22745 -118226 100074 126190 -116720 79041
16041 -286575 86722 -70287 -379314 201594 -269086 -208708 -97731 284233 -106622 -7069 -22206
16030 -22206 58817 -22455 -70675 301301 -97826 -166404 51996 -222824 113872 -104481 50923
16018 117512 191954 -202573 -62222 188754 -269067 119448 137967 -27548 -45308 50873 -205485
16006 319261 67568 -113570 65109 108388 -8187 -86065 -10180 -138400 -351078 75460 213900
15995 213900 -144287 -12434 -107206 -54892 -116408 -4491 -167571 -139493 110254 2811 147535
15984 147535 110381 220422 418104 399418 80837 209516 -42318 -169158 -60762 80425 -34256
15972 -15727 -185943 -172706 -31511 53884 359598 25643 78267 34487 -35424 66338 71805
15961 71805 -219270 -65276 128557 -121944 -313062 54193 40826 375657 111319 115950 106027
15950 106027 -215392 -172894 251010 -62994 -348818 -404875 -172140 154781 59203 -377000
15939 -34556 -162573 -213270 -234355 -188469 -4906 -122420 -183944 117091 -19835 4215 2407 135763
15927 135763 -109933 -127562 -244565 -379523 181019 83464 -495931 164285 117720 248109
15917 248109 -73390 129926 -78100 -100778 127470 -300169 -253065 -221830 -290031 -263007 48522
15905 -212497 225337 58042 -52734 -52073 -30251 -280326 -53487 56374 116609 -150787 105411
15893 -133311 -91028 248356 158130 -234800 -237451 11361 -63851 103259 -332038 319848 -301802
15881 -61420 120378 78834 -114444 -56804 39642 158403 -45320 23012 118982 -12824 -32372
15870 -32372 -46871 -70039 -154318 102665 -88007 -8951 -213721 235115 120453 24227 -405902
15858 -80519 466297 174963 60754 63525 -82154 116059 -151177 169553 -226518 900 84748
15847 84748 -232078 86679 -9278 -196028 -29954 -255891 -127733 -153514 -177103 -579609 19303
15835 71479 -126451 296665 100231 170149 -494834 -135309 -38680 -128106 -62693 195284
15824 -181978 -142107 282470 -138966 88908 58038 130690 -60240 -138316 179362 -85021 47418
15812 -27635 26243 -97712 -107233 -238634 -216878 300089 320062 404287 317710 71930 -244628
15800 25805 49588 -253201 -43657 150054 82783 48155 71701 155995 -96487 326179 -57364
15788 -29602 250722 135736 34422 278445 -253327 99175 -326700 -346191 386825 -76580
15777 1380 -211904 436050 86957 -27679 -258835 -231984 -122458 -189670 -406009 -306931 -108723
15765 324687 179165 238425 -160721 130368 6916 -123719 171370 41431 -268581 202002
15754 123890 -11188 -240210 65736 35695 -40155 -193191 -22111 -107757 -233904 200913 37753
15742 4951 32405 -55886 286536 -54404 -277509 -31278 130823 51968 9092 52853 30550
15731 30550 77320 73516 16010 111963 -15655 -56485 -68771 -280475 100105 -300471 -211339
15720 -211339 22079 61499 -62263 92861 -43301 -5524 -28868 -9955 -26886 -85972 -51210 -108553
15708 -108553 -109086 70940 -213983 -239272 -360097 145410 -101617 -195012 189128 286352 -21356
15696 310775 -261469 -263238 -120359 -65159 -169897 -174851 165801 -35460 146699 -225741 299228
15684 -56827 -353475 105894 364872 -345385 -369024 -128588 -135223 -131212 111022 -345707 -135428
15672 -183595 285336 130018 -28651 34346 145128 252714 84149 15071 143261 58168
15661 51168 -263313 -37470 -309394 -29772 81910 64666 -264114 79923 -25947 56095 -361116
15649 62826 -110202 -116141 -446937 -249521 -270746 -37634 373704 273417 -7115 -384077 55199
15637 -123095 787 149948 -11927 24072 -206496 101969 71967 -237497 -298461 -258323 116873
15625 -35139 155496 -190759 41040 -277193 300044 -282058 256312 49144 -202471 128527
15614 -409844 -341005 -119551 242781 83120 59976 -32300 -188074 168194 -100883 48479
15603 177053 -607567 -141797 -344683 66831 76999 -143792 214430 398783 42095 -69164
15592 59494 -259953 -346783 -177418 171211 -235425 261775 -86800 -78812 130920 151858 213172
15581 213172 -262761 14036 -28655 -50514 121000 -185703 92867 3481 5931 -29803 -95629
15570 -95629 -330642 -33478 -86522 -130482 -99434 140868 -181792 329267 -6345 55198 439546
15559 439546 144533 268248 -28034 7936 191481 272241 -251396 -375861 50878 210564
15549 210564 -23232 18529 367279 274829 -9266 -159230 -13813 -128660 55403 -19974 166462
15537 -169869 45434 101424 -65340 370210 79266 -207098 -329142 43300 -61477 123392 295941
15526 295941 79698 9977 -127147 -195062 -147379 -31368 14317 25336 -22918 -20134 -74740 38104
15513 -12594 364870 12442 9188 -53549 -276197 -85426 122533 21412 -368552 290592 234863
15502 234863 -129363 44124 -10979 93683 -137866 -355284 -151896 481619 208953 16308
15491 -329344 72845 119884 -136628 202933 -55511 -17575 24993 177366 -191726 48549 -127047
15479 -282722 -144826 -501 -26431 -170851 103992 -122063 16284 -39780 97261 279303 87720
15467 3166 -62451 -67692 -406544 -59848 -351534 -94397 -10148 -112186 235508 -188030 -96362
15456 -96362 224431 156047 310495 258654 224931 269996 19427 -247087 -503591 -29758 -186735
15445 -186735 178059 -325101 121073 15294 32840 -284686 -26606 45171 -60207 -143681 58293
15433 213578 -226872 260652 193104 -334619 -114644 172075 134866 48436 -236769 19594
15422 -181619 103661 51664 -40114 221308 25235 1033 -52950 -302912 -88275 -95445 104023
15410 158047 182832 113991 -54529 -70363 354209 155386 488073 -147229 -194737 -6244 -404009
15399 -404009 -169717 -54801 -33846 253582 228612 267715 7294 -31080 89293 -292485 -165369
15388 -165369 49862 21804 -112039 -232437 128120 -89968 -93620 254272 -29769 67035 38248
15377 38248 28121 -146997 253503 39075 -183214 -176497 89741 -134543 -287970 -90335 108861
15365 -27930 254409 -61153 -152345 -248804 -8335 -149124 -93145 87191 -288993 -4837 -286838
15354 -286838 -44020 -16682 8586 62302 187576 -121069 -126917 -81031 27308 158981 -148807
15342 74680 119216 -75461 71767 -306599 -187756 -131121 154965 -182976 -10756 192586 -61315
15330 52471 -59551 -426348 -115468 -25856 -58787 17017 -164633 112406 -48261 -41914 135603
15318 48492 364369 309912 72161 -220382 257 -98610 -47262 -159917 -61622 -95160 -151882
15307 -151882 228302 265185 164813 -107786 171578 -68812 84264 117356 -50613 147746
15296 238882 574164 245424 -155638 -86952 102043 -29753 -312420 20248 203763 -143233
15285 -273951 108052 382978 -247010 99272 275271 -133078 261237 -166119 -103895 -437901
15275 -437901 225137 15783 171232 173788 -115118 -55562 -165304 94226 252183 -10779 -238139
15264 -238139 33378 598069 -160888 118581 -156847 332132 -175629 -134886 -88112 23073
15253 127194 480710 -88212 126799 468077 783288 1418987 1037191 1356027 1308575 437007
15242 47019 76987 255295 -97804 212255 206588 101676 181021 139127 289498 -50510 -216498
15231 -216498 18241 -341039 110474 433852 157616 -234108 -11303 -76907 -440180 -32604
15220 25387 93236 112064 311165 -44270 -24813 41872 125227 9512 113845 317355 267647
15209 267647 235964 -82255 147991 -98824 -97861 -14247 134112 22164 115307 128465 165881
15198 165881 311080 -73275 182401 418906 361941 -150138 -111417 -169020 212235 144238
15188 144238 90263 200559 -210194 94000 206500 147197 129445 279712 -50566 -136303 227063
15176 -92014 296805 -215622 139459 21749 -290959 218232 310975 9538 11899 143401 -61911
15164 203172 92719 -282900 178862 157088 19888 -121436 288707 191239 -30864 280171
15153 203553 58037 219058 261423 131287 72907 -98128 222811 96469 329474 -147370
15142 264668 247677 109943 181408 202303 96165 47264 19908 73030 140589 -148479 213304
15130 326947 74963 114284 -61513 141665 -173923 319921 355487 367237 307374 167135 -32467
15118 25920 13034 82636 -27219 53358 163679 -7831 37901 92063 32435 101939 83371 150669
15106 150669 -125734 268423 160205 -82505 95069 -23457 207647 263851 -22105 68947 67688
15095 67688 -12078 198459 54935 98031 369647 193344 196063 -194171 124986 168251 74663
15083 94500 -28632 50675 -91735 221055 62497 13464 130600 126113 -56351 212013 295211
15072 295211 406612 321864 75322 271628 141103 215697 134422 -28305 444666 384898 124466
15060 275446 367044 269317 147705 482820 -180348 445719 -27227 153828 256403 256049 -72751
15048 261841 170195 268908 243455 247705 212926 79573 -89049 353902 176516 211324 55670
15036 -51541 324644 124175 130972 169762 21886 222635 60027 127713 408427 119852 197054
15025 197054 94174 119827 145153 135884 183668 451541 143384 116483 56323 235296 249416
15014 249416 244661 25736 163817 -99530 -103555 141031 352963 409357 498197 109544 138747
15003 138747 91241 108486 226997 -205763 111052 535688 10149 199380 260220 315301
14993 315301 409384 203596 458925 194199 578941 49294 -132408 262797 146658 301902
14983 301902 -131797 265676 128802 40508 196839 205366 -29431 226841 342768 96151
14972 169415 270655 553429 305051 221697 55002 255493 298196 -106719 75207 53480
14962 53480 87646 -148135 272604 205797 255409 439940 268964 -90205 -22720 288549 49703
14950 246935 546161 637513 247272 287840 88334 154149 369252 -198887 196319 275069
14940 275069 473546 325092 442948 -17956 348633 74110 558666 201560 2748 431099
14930 431099 288614 444783 340637 431502 254749 -36369 191842 242607 -57398 458872
14919 681924 442110 331069 534683 250517 508610 43450 351032 290602 558518 491385
14909 491385 137019 579295 307126 120646 304274 113924 257330 363154 96710 247530
14899 247530 178109 195849 446378 101786 27156 165673 454477 442554 345882 169286
14888 219413 235998 195348 375812 251725 239652 350670 647207 280896 377100 392663
14878 392663 778852 278206 614560 240206 188126 168410 392305 247331 389663 421801
14868 421801 387574 443049 729045 349324 303865 521203 446556 256630 364038 294242
14858 294242 -92852 438309 109237 -29968 602156 237812 859098 208304 281780 329965
14848 329965 317120 755390 945947 370693 567153 458218 541455 368046 283192 399999
14838 399999 360707 556758 383524 -27145 638158 169291 474296 228292 297943 621789
14828 621789 404359 625616 503402 624789 458415 669150 432902 674097 421676 458382
14818 458382 343675 331131 490227 320290 583608 440145 435331 498324 383039 897002
14808 897002 526778 368687 661557 430143 538153 441177 396647 681096 610561 495515
14798 495515 256597 240798 732387 464956 491471 441944 243988 661554 623437 445525
14788 445525 407077 790324 353809 830169 593976 526681 304377 847014 591128 975781
14778 975781 457275 486946 777091 737601 391169 543903 592226 701917 621417 622662 686958
14767 686958 300711 334557 543952 599951 708702 441183 950602 524426 671530 486077
14757 486077 797266 712779 682030 884956 540057 710262 686619 572006 802205 839969
14747 839969 709388 950699 648584 710706 412821 322398 725654 730484 1095073 714347
14737 714347 1023019 636816 520504 674181 827911 945477 933978 807970 983343 663647
14727 663647 617956 848479 470463 881046 1015010 812687 532557 478255 698601 618624
14717 618624 906764 759553 933874 706958 1041587 847539 888833 915982 928723 1179266
14707 1179266 640836 452479 668503 775191 979801 755360 620066 788693 962993
14698 962993 1020520 719304 1155499 712789 643000 1330201 668469 927791 1104180 1120642
14688 1120642 852921 1072019 738222 1052563 1076046 1133276 1034147 1078215 1235118 914738
14678 914738 848616 638623 1124277 876999 1008389 996536 1424717 866840 1362564 1275040
14668 1275040 1201872 885150 789012 1191901 1173857 888910 999602 870361 1288111 1134389
14658 1134389 905413 1088923 1062796 1154810 1114122 1100709 1409663 1109090 1191698 1151875
14648 1151875 1100135 1147716 1187236 1147941 1265458 1345233 1224614 1332127 1349077 1247869
14638 1247869 1192900 1564600 1054278 1096447 961875 1413847 1341921 1266364 1319422 1059794
14628 1059794 1281695 1276959 1193759 1384450 1211931 1369106 1446578 1364058 1416765 1655753
14618 1655753 1630598 1441711 1350832 1309066 1327365 1471229 1651307 1924722 1495755 1391838
14608 1391838 1569519 1485489 1739969 1662562 1695807 1858456 1643472 1579600 1642588 1575910
14598 1575910 2042164 1760759 1580112 2093486 1738037 1648228 1691642 1785909 1615960 1857860
14588 1857860 1755525 2208296 1815283 1937893 2319982 1734686 1954986 2330718 2164091
14579 2164091 1936665 1999721 2449996 2444447 2321573 2072799 2279473 2542510 2122277 2470445
14569 2470445 2318378 2351652 2445832 2461355 2196863 2585017 2571044 2576236 2544149 2850651 2552542
14558 2552542 3037964 3306211 3214227 3466067 3855136 4065546 4295560 4806361 5595972 7447015
14548 7447015 11256550 20337400 40576050 49454374 23311454 9345126 5056824 3302948
14540 3302948 2349560 2478602 2192910 2238992 1927152 2276700 2069574 2176894 2170371 2325356
14530 2325356 2099961 2641800 2069478 2179712 2560515 2544390 2407485 2385453 2558231 2505673
14520 2505673 2704520 2699323 2639871 2817940 2530309 2645558 2645026 2659467 3015900 3062326 2772612
14509 2772612 2658719 3112388 3033808 2913193 3117182 2946656 2919002 3182461 3335552 3291054
14499 3291054 3161950 3221800 3399698 3344340 3337715 3362731 3291949 3690501 3296231 3780288
14489 3780288 3328635 3878420 4093299 3828708 3652826 3880317 3629283 4108011 4021930 4426312
14479 4426312 3883874 4273734 3983167 3864101 4281307 4324837 4554606 4556763 4410973 4589000
14469 4589000 4769873 4635612 4345033 4440424 4650801 4849099 4596902 4668790 4869246 5118372
14459 5118372 4760360 4926443 5335914 5236764 5139771 5293407 5547594 5453618 5814762 5266061
14449 5266061 5641282 5637222 5868672 5893696 5732770 6196095 5766254 6313878 6601739 6539297
14439 6539297 6178219 6267028 6506952 6557088 6724585 7194017 6977569 6945512 7031607 7027565
14429 7027565 7220340 7385077 7526659 7655409 8106716 7612293 8000960 8284804 7808260
14420 7808260 8083122 8182109 8550339 8895936 8721198 8858898 9087411 9151713 9549437 9521160
14410 9521160 9488845 9792234 9373015 9986004 10120849 10433749 10351585 10421846 10679236 10859166
14400 10859166 11144554 11353228 11680040 11705947 11424120 12191929 12189823 12410431 12656539 12710703
14390 12710703 13412688 13223141 13312729 13566226 14095748 14543845 14470650 14524328 14567355 15045491
14380 15045491 15377434 15829922 15908991 16098629 16963255 16830067 17227280 17424367 18122872
14371 18122872 18468598 18658668 19113126 19494103 19910780 20555375 20676006 21540725 21472511
14362 21472511 22452984 22510653 23116709 23376421 24096416 24319222 25140524 25871370 26425618
14353 26425618 26773496 27631472 28368700 28616629 29454429 30423115 30877553 31781153 32941141
14344 32941141 33544634 34551263 35072270 36392040 37276172 38063699 39778190 40534655 41775245
14335 41775245 42834346 44328251 45744964 47188349 48036920 50026888 51418999 53420685
14327 53420685 54644683 56500293 58423836 60188238 62338749 64980098 66953055 69419055
14319 69419055 71533084 74101243 77216050 80164130 82758137 86133089 89560677 93061838
14311 93061838 96644713 100932803 105285348 109312441 114072336 118930548 124094738 129756616
14303 129756616 135816242 142143979 148481051 155359596 162789283 170558088 178706273 187347762
14295 187347762 196694886 206386089 216525576 226990570 238632657 250415889 262706884
14288 262706884 275585421 288983246 302962828 317322448 331935616 347052615 362109328
14281 362109328 377241479 391868927 405932573 420064729 433385904 445187055 455619476
14274 455619476 464615164 470967133 473785338 473227339 471716676 468940854 464281903 458462690
14266 458462690 451286134 442770000 432180848 420900394 407534396 393046467 377997438
14259 377997438 362572489 346622903 330866458 315183172 300854485 286742900 272491772
14252 272491772 259442938 246169675 234362613 222718015 211816478 201359865 191604154
14245 191604154 182713694 174266444 165927537 158388718 150987272 144393862 137668425 132031928
14237 132031928 126095634 120601695 115290102 110511714 106096738 101903333 98457585 93883106
14229 93883106 90355223 86974257 83835345 80794036 77484564 74586947 72080078 69624086
14221 69624086 67281097 65336437 62763615 60515204 58863797 56748020 54803324 53700395
14213 53700395 52176630 50410400 48635212 47014510 45881806 44790408 43913693 42925560
14205 42925560 41388919 40005590 38841771 37572797 37018336 36330155 35230829 34266828
14197 34266828 33187969 32181211 31644373 30977077 30333088 29371700 28467984 27749968 26872254
14188 26872254 26725229 26092844 25328893 24810962 24163411 23619359 23302798 22645168 22688658
14179 22688658 21942890 21561776 20736155 20720403 20459607 19978908 19325841 18870358 18634888
14170 18634888 18256104 17572886 17496489 17287643 16879897 16498298 16224333 16101731 15457059
14161 15457059 15526763 15011194 14937728 14566663 14423905 14430867 13904801 13628871 13369869 13565262
14151 13565262 13078535 12550683 12644480 12099872 12046418 12092410 11592246 11573379 11562810 11323397
14141 11323397 11133385 11012972 10802442 10943826 10457003 10570176 10114599 10061691 10034302 9625910
14131 9625910 9676373 9433704 9234624 8973060 9501379 8891400 9106735 8358663 8502306 8198198
14121 8198198 8291303 8103181 8084102 8113162 8325480 8019265 7768584 7894708 7503538 7519321
14111 7519321 7132352 7489480 7144061 7121571 6812595 7072697 6834599 6544012 6673554 6215079
14101 6215079 6806433 6460189 6496112 6185650 6383940 6367197 5816867 5987295 5931323 5717763
14091 5717763 5798588 6052905 5650864 5524665 5349083 5614969 5494517 5613470 5154322 5145880
14081 5145880 5182777 5281938 5410276 5201377 5013706 5030948 4583714 5029573 4651383 4992526
14071 4992526 4648257 4305864 4583951 4825772 4541947 4098463 4208609 4343564 4408420 4310974
14061 4310974 4105249 4427587 4117417 4523227 4537560 4189397 4161247 4174108 4137878 4132518
14051 4132518 3666217 3949429 3743367 3780949 3850345 3274420 3493230 3745310 3706386 3332049
14041 3332049 3490789 3481853 3409542 3493682 3430753 3181187 3420630 3202540 3280226 3275671 3507658
14030 3507658 3058059 3257529 3108561 2759518 3128201 2941969 2965092 2895751 3194011 2975805
14020 2975805 2861725 2636592 2535892 2918308 3005788 2609774 2850660 2657384 2784769 2530659
14010 2530659 2866085 2727517 2425748 2239867 2334389 2333174 2597975 2343268 2487671 2587585
14000 2587585 2363160 2152653 2309043 2147752 2338498 2220335 2362307 2369551 2273293 2665433
13990 2665433 2676999 3394240 5726268 12847780 32971391 50583087 27475411 13957322
13982 13957322 9079090 6489805 5061235 4341388 3818042 3314737 3491806 3142683 3223563
13973 3223563 2858127 2680405 2672553 2551711 2469168 2381498 2424241 2723214 1989664 2484288
13963 2484288 2367891 2428894 2566165 2221600 1761599 2079855 2371999 1890700 2320755 2004888
13953 2004888 1863553 2413785 2415246 2071810 1933781 1820299 1950929 1820004 2006954 1920272
13943 1920272 2007564 1888502 2014566 1725505 1925699 1735988 1964771 1866162 1871816 1897006
13933 1897006 1704055 1928282 1900005 1785302 2074878 1630511 2116621 2074336 1588444 1477492
13923 1477492 1750651 1517965 1483240 1822454 1390855 1371604 1630090 1680941 1675567 2074026
13913 2074026 1778777 1576557 1489945 1133739 1673086 1250107 1262948 1661194 1682287 1474675
13903 1474675 1440701 1526364 1409487 1133906 1281752 1334772 1306797 1359922 1306506 999828
13893 999828 1327657 1393037 1519195 1475143 1496097 1308285 1497161 1413068 1234799 1123530
13883 1123530 1186870 1227020 1309982 1299612 1548324 1435646 1097653 1023255 1342650 1284724
13873 1284724 1017897 1091226 1315920 1270124 1617171 1358701 1125891 1116684 1084760 878824
13863 878824 1208412 1196553 954238 1162852 1170626 1381231 1178717 1267917 935282 1245664
13853 1245664 1106721 913630 1101082 1122955 1019923 1042070 984503 1004298 865410 1342573
13843 1342573 1002412 1480219 1038165 1099699 879706 912805 1118985 890593 1194692 1113268
13833 1113268 977680 819542 1186372 823093 968923 1155574 745299 1022296 1085637 810531
13823 810531 752881 865457 813711 882447 986076 1335141 1098586 792188 1049862 748521
13813 748521 1044826 999020 915727 526529 627494 841432 739740 904058 1111115 838715
13803 838715 785228 706351 964611 1018261 780100 1047156 835980 950458 883609 844285
13793 844285 955018 758005 1045388 587175 775685 526385 706868 1071348 761877 961574
13783 961574 639750 948174 992209 637784 883990 679883 942062 887506 795982 755409
13773 755409 575713 576360 614812 820444 1022743 589987 945063 868073 742901 469958
13763 469958 1135496 760743 843863 691699 943824 681555 827214 542801 543714 377198
13753 377198 595463 581580 588097 719136 789571 717067 660806 628452 784452 934549 470915
13742 470915 528728 849499 679829 696826 687182 497785 455996 508013 430763 705750 345096
13730 784380 617953 215289 719266 632194 717265 556459 747263 221554 561698 696120
13720 696120 605065 399398 478614 369921 624963 609530 606530 815283 478124 990053
13710 990053 419408 587153 586570 489353 299379 538956 89450 870267 838559 678691 441760
13699 441760 870952 568966 580379 611620 343276 492592 500479 562906 651797 488368 327384
13688 327384 750400 896386 474457 785108 584802 426061 422071 644757 645720 372078
13678 372078 233926 265388 451246 883257 494817 447582 486190 599387 845448 410634
13667 449137 701528 403311 443133 545637 418967 197210 416887 323906 403149 613222
13657 613222 441040 575362 539523 219278 448901 193402 252814 652782 362214 612988
13647 612988 343778 263371 478654 175166 479350 450744 233529 941381 537332 242511
13636 264452 279551 412281 252415 159296 618171 213523 474036 731631 564511 189993
13625 492187 589160 294257 357926 352293 287966 467402 640686 413608 610068 696537 357876
13614 357876 261128 448537 301074 98562 316173 274238 472602 408171 449373 81562 540246
13603 540246 488511 527392 357672 165132 682831 233700 358665 414077 559898 636114
13593 636114 386931 333967 607848 428545 500119 371374 212399 415273 204142 385340
13583 385340 404277 270560 202530 186923 196096 250119 388748 113525 370292 322527 223637
13572 223637 286919 548801 295634 -52362 308404 418453 152357 465707 95293 260215
13562 260215 125973 332131 -62494 469232 356981 307697 367303 618524 248973 475141
13552 475141 309406 289943 546640 425641 258699 235607 163952 630217 43430 7113 139438
13541 139438 202428 85859 643010 -26348 777272 315909 304318 196249 463650 360858
13531 360858 416484 65228 542264 314357 335995 418998 -75299 345585 200143 170488 170068
13520 170068 91758 309062 98019 317588 226392 298429 -6811 194699 218775 343097 288464
13509 288464 391427 368677 268915 175346 281887 539263 315491 211816 204521 304152 -117590
13497 403210 171729 241111 283584 289773 324915 457772 -11467 179549 408607 468532 314698
13486 314698 497679 167183 156768 361766 47521 23405 181923 70756 178759 202186
13476 202186 218077 181767 460954 87039 666298 -27357 427992 381433 376011 279069 109776
13464 156332 176281 183872 -63539 251470 -220341 229860 45053 315800 359683 467829 232986
13452 206200 17419 224657 182423 12863 199756 597542 299638 262309 344971 341771 204519
13441 204519 552385 172083 -21541 -10999 193060 -23315 436381 -239987 83246 101112
13431 101112 512147 185385 199447 281835 -80974 82426 374314 100990 299177 210489
13421 210489 88354 100792 168542 346921 450131 211410 124618 296132 303239 -17794 247828
13409 238817 320461 445202 271029 246251 215622 475169 412494 59130 352356 359635 421932
13398 421932 280062 -919 422276 476104 263815 -9266 464556 337842 115865 48715 21174
13386 286067 144765 195848 -84177 204094 69496 240149 135675 65353 557197 513585
13376 513585 258214 -72611 173170 18424 -98494 159457 172826 246325 279855 239947 80598
13364 261342 405875 473780 275872 185902 103623 -148592 -14919 493570 -14800 -56184 266907
13352 185441 129126 382107 274010 75385 734159 238603 331982 238092 468855 539121
13342 539121 470306 435723 280902 -25253 129610 152849 284242 615818 234429 403932
13332 403932 142593 -74648 291533 491555 289013 -115787 -85863 160862 185380 -129531
13321 301488 265859 121526 -8760 224628 170896 391319 456255 377717 -97637 397879 544826
13310 544826 -1001 251077 -11558 222251 345799 461720 186657 320722 263311 -35819
13299 87108 357530 170692 -239287 267548 249137 193794 225761 393733 178800 -9721 335384
13287 42402 370130 222656 -210529 119630 228465 32850 266236 -14087 -61801 48182
13276 91463 404954 188707 -129858 -89489 66063 260005 -290710 -150624 -159872 102626
13265 2143 4434 -49634 -219304 -216107 101761 267982 -132445 4022 -110261 212617 200091
13254 200091 138737 366427 413858 154565 669900 -42653 -160832 358032 530837 138608
13243 123845 98643 -149703 308977 213464 42116 106343 66800 179572 330332 189294
13233 189294 -42945 124010 146816 290114 203707 107688 -189273 -100571 149153 -22177 136203
13221 18900 278201 -89419 103387 75373 171634 417579 140052 252837 -72070 40160 -248725
13209 126459 371286 91378 231300 350268 192875 226886 -155545 -55215 99902 129008
13199 129008 -37895 77664 199787 -89935 70379 68894 59051 257721 241949 -369721 74403
13187 101356 269859 276251 149787 107514 -134068 155209 321572 183335 214426 13145
13176 -264760 101866 21079 -138294 -7915 333990 -37433 86347 153744 114028 54780 -46868
13164 186812 147070 342894 98986 -82885 124513 96336 -85052 34226 -202606 28171 207518
13153 207518 157582 -17390 -31228 339232 -12555 108499 40945 28051 -3918 203884 -25018
13141 101700 -128480 219448 190953 83187 234663 -269386 119856 274506 -143526 -71069
13130 -56958 442558 -381719 194158 174377 -160093 10625 15699 -49616 201025 227329 18438
13118 122453 243216 47431 243949 -102870 140658 255663 302604 -66840 155499 336706
13108 336706 20736 -116011 150721 -219083 111400 18709 -41434 187363 156274 258020
13098 258020 -214704 1798 158461 -1374 43246 259042 80917 9799 -118846 -29050 53264
13086 -294660 189183 -2266 163597 -234571 79728 42831 -6532 91198 -230500 165672 53297
13074 577665 -74848 309050 258512 -47157 -229314 101178 89385 300845 -46702 -135954 -42305
13062 324463 125492 194694 21540 98942 268646 209556 258006 270254 102047 99819 131032
13051 131032 -43095 329133 242920 -108495 179299 281741 -144336 135240 86434 -130202
13040 98634 282910 311463 44226 227955 132157 -15338 5119 -152689 110849 95072 139408
13029 139408 45264 195943 238814 322557 -242385 371254 65372 180796 80628 286298
13019 286298 293133 410692 33807 -23033 268206 365908 64703 86093 232675 -46302 174375
13007 85383 252225 530780 -60795 -71771 184815 -70141 100036 -27548 -245679 500847
12996 215507 -155653 -39186 -152436 156919 -407672 -206542 -42876 313076 3429 -144353
12985 15925 -206632 124394 -77896 323390 11922 4379 346630 -207755 136228 162103 34997
12973 339334 -183663 299951 -89620 343569 -5416 134018 15414 140267 106776 215812
12963 215812 259947 11279 95952 -65221 -52222 48951 -85106 235575 -379628 297831 -8185
12951 277709 -53487 -36641 -182878 245943 -50791 269572 269814 102710 -330211 -116994 83548
12939 -355513 183385 147594 71332 -134738 -23188 389285 271253 -99858 -239053 -8617 -185207
12928 -185207 206017 -153003 257448 130303 -160192 43371 58584 -186056 1011 41387
12918 41387 32481 -195269 176004 -146447 -45509 458424 -2401 19110 -99774 148216 155973
12907 155973 94197 -116518 -159463 -23204 78736 368817 -166811 -69469 -264925 70239 506667
12896 506667 -47963 -100689 -84566 113692 307832 -267005 -69031 93023 121193 53758 -97606
12884 196856 -33689 129079 -8527 212590 133702 3844 283012 -204130 -136297 144529 178896
12873 178896 -33767 -106093 13533 -67430 86342 157731 329871 31431 -84919 127276 21424
12861 53110 -85603 205226 -254901 -9936 86222 -38608 255920 33737 35194 -281377 -89414
12849 366660 -5150 65851 28420 354581 216573 343479 198476 -189164 391496 -143719
12838 -199427 133397 -15639 -115696 -54309 -72871 309217 81641 -10824 33529 87965 50421
12827 50421 22645 31293 406854 185792 119617 130143 292360 -19596 118569 3309 197520
12816 197520 4959 326573 -182523 12816 324170 116985 83199 34485 -224398 -148054 -13649
12804 -45967 -147921 -30357 307578 194847 -45638 -104996 -5116 262709 196467 -49678 186641
12792 67567 -65469 72514 -7934 128120 -105127 -169515 -17792 -111607 -194341 12907 -63012
12780 -184684 3780 -21569 -44413 -469097 -36952 21892 -9131 186266 -65967 -227391 59994
12768 -4112 113742 -163101 -50310 -35440 -88469 18755 -650 -123545 109112 219470 14715
12756 199991 -155156 387944 83062 78550 33949 -68181 -312959 -125455 119098 -99243 -89280
12745 -89280 419386 -93241 67428 145087 210295 56331 420738 224893 24977 56007 142448
12734 142448 281178 121604 -2386 301071 -19305 -78711 -92450 46451 151282 -6122 130214
12722 -400544 331414 147640 -77429 33567 85539 3047 231608 -108554 57981 158857 -367088
12710 -222008 238411 291925 287431 242943 162781 -127652 -224862 106668 -5614 43491 -18650
12698 294395 27351 105229 274776 184101 32163 73412 100707 152366 -11661 143290 119675
12687 119675 61576 359985 151872 231763 -109700 133482 -158300 98645 43577 201257
12677 201257 -144262 -47273 157304 277264 8125 137406 401549 -98472 101035 77171
12667 77171 102294 101414 17867 82079 247454 142397 91411 -132207 68191 21833 -160176
12655 167999 14924 -57175 -8384 82354 -114134 103585 -8452 216289 98361 110277 181207
12644 181207 131797 -3391 135667 278259 140659 -61299 102314 140652 38213 221280 21313
12632 320959 381215 99370 172893 323123 182605 259622 463619 408887 29942 -50110 150599
12620 232073 -25878 -214768 -164341 272869 26578 -107170 157394 -227257 45780 105248
12610 105248 128432 53135 -237003 333280 -80704 58120 108204 -210323 42111 -60832 242264
12598 -108139 -94489 83717 135083 28114 309311 -17118 79543 -9080 50105 96862 29339
12586 244417 67669 49396 -52881 49762 95807 319946 261446 -102814 31960 249213 -189103
12574 194341 50173 86555 53548 427481 234978 14584 172468 -75534 155031 32167 -194762
12562 326473 323103 23195 -103073 -555 247846 425296 3661 -82139 -242946 -201869 -75810
12550 93315 151572 -162093 14586 175591 -69161 -138349 -272981 -54056 -95634 -159235 -78328
12538 86439 -103040 123141 -93547 159380 -118507 -80538 211309 -63496 338193 6078 -137272
12526 106847 99114 144398 -91657 125955 46688 -257287 64675 255572 83992 30909 352068
12515 352068 1294 -8100 -202605 -267367 194520 -23962 -40480 165942 -56325 139164 112060
12504 112060 237957 -33527 -74412 303871 163077 3983 105949 -86440 -149669 157503 269534
12493 269534 -10785 246568 -137033 61450 -30661 63856 -81724 59302 -260003 -198558 -105352
12482 -105352 167489 -2027 359935 -163650 -128936 225913 -243553 -82628 99644 -389384
12471 188707 -218285 -140419 122495 30533 198384 89253 -260265 -260843 -173556 65201 138171
12460 138171 312955 -27007 -114772 123542 -148763 -53568 -21344 -171020 -332151 35693
12449 107012 150483 65227 -49150 -24552 3349 -54638 8745 -185424 -136914 28185 -2149 237879
12436 163824 -102375 9221 113486 190863 -214259 -230420 63166 41431 460163 50914 -108360
12424 -196992 287323 102247 108691 -5266 283293 -268130 2844 59820 119133 370532 82997
12412 -222783 183 -363883 80958 178357 164374 42053 -179731 117815 -200439 33174 -71677
12400 58471 228526 -269339 174282 34600 35203 115845 196595 37743 142641 -171883 -91044
12389 -91044 34520 25427 158877 38541 -202037 -186322 62512 -384079 -285985 190959 181269
12378 181269 -264161 172161 -210712 -68056 -39439 -146367 -89720 314861 -177035 126174
12367 127906 -1063 -84430 -194698 245855 -10158 -95840 152489 -119333 -105656 -6207 124804
12355 18250 -231501 -171507 25595 -110672 -279169 -34827 36025 -11548 6907 -12162 -27574
12344 -27574 -19462 -101722 -69242 7597 -188900 163241 156585 -15507 186040 173773 -15871 86343
12331 -262498 -249471 -212157 74362 -58080 143373 -10399 -108710 311605 64528 -51793 17428
12319 -81869 -173346 -60079 46785 -25951 33859 122970 3321 154124 71312 112078 -90141 -303472
12307 -303472 28564 197238 -258032 124878 219948 -201414 -117037 -119806 -48815 103506 -82329
12295 193899 93055 114953 22702 168450 -170994 -155009 -146554 270692 -261359 200691 -323473
12283 92423 329162 156973 377117 182147 210692 61828 37672 201699 337307 212753
12273 212753 462846 -87623 -64610 13279 195116 87383 -139960 -82885 348356 -299955
12262 104656 277052 -25862 -20770 -32597 325587 115470 -113810 464141 236887 243823 74188
12250 57288 -58232 105681 -35059 85681 256981 -189120 -75297 453452 4959 347590 -222267
12238 60102 11190 414161 -149897 427509 68378 59835 126751 289787 102758 -174957 150124
12226 395157 273305 262558 241756 271373 175973 133584 395451 83363 75780 81667 278233
12215 278233 40330 458012 130273 157034 321779 278018 -135384 -28886 -52178 43432 312678
12204 312678 -81723 302468 -116808 199693 360048 173472 267093 82392 -117210 153598
12193 201497 466714 375089 -29338 -40178 -105064 89134 206698 240739 171372 174471 27766
12181 -119838 93965 213909 -153885 -132045 157628 297969 171070 331714 99954 1582
12170 136804 202242 326013 294527 418030 -52160 186838 -62140 107947 -18333 295818
12159 35197 188810 191937 -79629 -3987 -105042 -309623 123920 430786 -197713 -239752 -206893
12148 -206893 317734 24906 -41204 -100958 -42971 -61170 -22355 119431 -202917 -60002 108668
12136 253745 -15506 30131 151875 172964 -263750 74484 -184507 -69934 233619 49765 -125990
12124 -201913 -283531 348588 61897 -94906 128400 154102 -149075 -79502 24369 -109763 107823
12112 245218 -116679 -175686 -33783 51611 -77686 79445 243757 87281 -68977 -179524 23723
12100 -95724 110895 90706 347622 132098 157874 -19930 -280099 -457207 -44467 -404762
12090 -404762 24057 -220818 21274 225721 -189778 128226 116475 39823 -68869 -40450 -224696
12079 -224696 122851 291091 347816 354487 1620368 1515118 586678 524495 104688 77555
12069 77555 -125056 66331 -153437 348863 172195 -14573 38457 216840 289335 -54201 53380
12057 26194 -1902 133045 317054 124009 -43692 -52968 230361 73011 -503358 255044 190644
12046 190644 238338 -163447 92851 -90331 -269031 -98755 97706 -382748 -63543 -175209 4407
12034 -309472 -392262 -274278 -93359 -279161 174300 530071 -86074 -79371 -78754 -57686 232293
12022 30313 -110420 -43310 -24260 -234439 -29388 -139063 -126444 -245604 -256318 151101 -68978
12010 126543 -9552 148004 71016 8836 -205649 18815 -80825 -74737 -219472 6303 133804
11999 133804 -84470 226235 9332 118636 -178113 196436 -163806 305595 229003 134599
11989 134599 -222325 14429 -441528 -309286 -234778 105595 -196604 84272 -199511 148587
11978 280746 -18905 63754 77071 441373 -224966 -141015 -2270 58869 5554 -114716 -295412
11967 -295412 320315 103594 -101571 -50768 -106013 -116739 13229 -172106 74040 81532 29663
11955 129216 -180787 -20518 -619860 226623 372637 -226473 134424 -63488 163792 -49222
11944 137446 -116874 -54765 568536 53885 -132176 -130160 127086 159501 -90936 -240623 28419
11932 -97169 20615 -531969 47429 148093 311169 -65737 -220824 -20541 -163293 -66581 -177644
11921 -177644 565612 -99101 -357005 -78116 -122827 -29438 34358 54904 117717 143772 -32339
11909 170269 89951 -382355 -105021 -12171 131323 128051 383818 -96911 -67802 -23970 88950
11897 226701 169164 -110127 -96358 -123762 7477 -190382 131988 -144902 -234077 233020 -13177
11885 44026 140553 -195908 -14004 75850 270841 -276395 125142 26151 46618 173140 -79205
11873 -212533 -108118 -30049 -10252 -208194 -152483 -19626 119100 110696 -238981 -220574 197307
11861 255922 -138624 192029 -62214 247492 55471 -87754 192859 -161313 130125 -26840
11850 116989 205912 10702 -45536 153686 -217867 276844 -45169 198055 170363 142808 -172177
11838 -22790 -222602 -109156 -116330 -156534 -217986 67942 47663 -237440 -290515 -41614 -88018
11827 -88018 -74172 -12327 35188 27404 39570 101195 184842 -67837 -18772 -25849 10849 -25817
11814 -112327 23370 -111422 175614 176124 35135 123717 376102 -242229 126278 -130404 175335
11802 442257 -99655 44815 38220 -156669 159067 -128377 164469 106423 -149696 -163459 73645
11790 123067 -99571 269938 -187714 -94831 25044 -221342 -210094 113207 10572 153478
11780 153478 -174955 -142578 -238133 -97380 -24856 334 -73588 -65132 93423 79829 121995 -29395
11767 -118307 135674 19738 3971 341732 -28858 -164046 383690 -206801 73816 37993 -117884
11755 -74237 203752 -253734 94565 47263 -41303 -44516 -108024 48796 -19365 -137743 183274
11743 41084 57751 -265226 67752 -362789 336338 -221437 130034 222597 -65027 330757
11732 211328 -173436 53730 -3253 513659 113466 54570 -428506 52649 -17519 -146676 364301
11720 -107452 -202414 -131170 -184214 -110583 -231649 342519 75635 207175 264300 156813 29892
11708 214271 -44586 83676 361971 39183 -157185 -120696 168104 99389 47641 54977 -57628
11696 436279 48077 236058 -132989 -212635 -68372 403874 -35400 58221 -125976 82847 207308
11685 207308 179274 36154 -148319 -234215 -71020 76058 -41367 80640 212495 76848 -302194
11673 -214184 218394 297935 -177715 90820 3021 -105180 48136 -381653 48817 119764 -204869
11661 -27356 140166 127224 -7239 -188324 430882 105082 73807 -138818 -14778 70393 13203
11649 10150 232214 50189 226118 16745 -170253 -60038 186249 -123115 -158448 195227
11638 30347 134555 94646 290647 -131216 238867 56832 -202067 -298196 96947 -7564 269546
11626 -59731 -186251 174593 -51731 278076 66145 290299 15848 -31027 -163150 -97014 -179169
11615 -179169 -133697 -485319 -56659 -22974 -77094 41398 61343 71163 -60872 136290 -92761
11603 267678 414968 65539 213209 -45988 -256647 -179501 166350 -49966 83679 34763 -61551
11591 -196247 -322925 298581 194643 -301421 161263 -95434 -18162 134688 366042 -182047
11580 301144 25915 55027 -258927 -167915 23918 84871 -32682 -33910 350592 20961 194310
11569 194310 -71703 313942 51606 -126535 425284 -92647 142475 41324 35228 87817 140285
11558 140285 14811 355910 3377 32716 -82388 -75107 -202508 -392798 253102 193398 -112685
11546 242707 -124119 -98681 34788 364669 168631 176221 1362 221871 389488 182522 37131
11534 -209057 -168450 6378 361720 208523 122569 66510 -4798 79641 32193 -121250 56453
11522 203060 215920 36911 261815 262382 331727 268537 60296 -18456 231479 71663 135716
11511 135716 194685 194095 182911 164223 -100808 -30232 -157724 46069 222499 67225 -163512
11499 70326 394512 166185 -78545 111793 49697 79643 62480 -43753 -45323 -123954 -57102
11487 52616 263772 150681 -91884 315610 472552 281016 -132800 -50156 295638 238789
11477 238789 371003 167734 100393 3325 183698 178838 138683 265835 253563 45305 324305
11466 324305 184543 -15077 -39089 227647 227133 135337 265485 198244 69338 -14780 138248
11454 -144615 -21390 236579 368035 144742 -156131 -28712 78634 105201 135833 18770 187242
11443 187242 213496 -251488 172961 234767 41241 126270 25911 -144604 -107498 364200 10701
11431 -77090 127513 -137678 -58267 -179940 1186 -16504 94073 -75543 288266 -20597 -284384
11420 -284384 203014 -171772 -225003 191459 149263 -80107 20897 319858 -325541 -104779
11409 79228 -83006 206314 103789 -245695 -109851 21671 149459 344068 159881 -156514
11398 -39782 29486 36095 94858 169597 409409 -100713 -301281 69609 117746 71319 55597
11387 55597 -256840 -420814 -20876 -254061 275532 189692 -214484 -50899 -171996 18989
11376 30079 297637 181458 -114057 -45695 316716 260418 -260120 -228630 251850 -168286
11365 -42687 -353397 -221979 75719 -108074 -381577 73726 -20001 137098 260031 -36554
11354 -67293 -175362 -330273 -93513 261402 323756 -151402 -151801 65080 244469 104608 -145172
11342 -284943 69331 31755 131623 -119492 104065 11693 -5393 -161210 -46121 -330847 101652
11330 -59147 -256850 36112 -262750 -147161 22624 -26025 -25372 374104 72856 237592 358933
11319 358933 53516 -81205 143189 114612 -92692 19674 151694 91439 -100790 159301 116631
11308 116631 -85605 -398009 82253 20411 -88214 193282 223942 34179 -255577 78127 -103378
11296 -364078 18220 77315 19752 -49326 -80601 -190187 77120 -137664 176405 86573 -78327
11284 -40267 84186 65440 -39058 -139600 -61698 -19878 -374441 -36458 -53472 -173184 -516955
11273 -516955 120673 -65808 -46701 -131253 156569 -259992 142816 29216 214117 311670
11263 311670 -16764 112179 1065 -347724 -100364 -272007 134756 219659 73862 -193930
11252 -308253 -255292 146103 276247 -31704 75921 30179 322892 -245564 -139200 83550
11241 27195 -264619 312696 -212562 420825 162955 -45604 -171958 -253482 210588 -111679
11230 64491 245829 79295 112058 65685 -62003 115650 -216516 -348526 -46639 -186077 -244894
11219 -244894 -56806 -138669 -177266 56 -80386 -1371 -75405 19493 -92231 -148755 -9504 96414
11206 204425 -215649 -54497 10116 -147664 26955 8035 -429559 -31149 -499002 -271544 -330363
11195 -330363 191639 -124833 -147329 -226871 -121779 -40981 -248680 21765 34096 41599 -100123
11183 -263849 -186444 237780 -248940 -331768 -110424 -42839 -299843 143932 -299288 -305488
11173 -305488 -314633 80065 63855 144358 43033 -20065 -126428 -75900 68059 -31856 -16369
11162 -16369 157076 376528 -213848 176075 220839 -3336 -251779 -251085 -51048 127628 -306575
11150 -63775 -145876 141071 -150445 -4022 -34462 268704 -163588 -136518 223376 -224099 -70282
11138 -248895 66421 -60413 148873 58423 -21892 228089 108746 325782 -98213 161171
11127 248981 -110673 -101789 124573 397392 -31849 310809 -79648 -262283 -82544 -91786 -392936
11116 -392936 -313988 -127929 202002 8895 112497 130996 -257299 46257 69528 229645 -39979
11104 212847 240333 393603 181920 348576 408245 243374 -157970 411443 84033 259839
11094 259839 319531 18763 230579 -61159 -41000 271579 234708 7868 296396 204747 139823
11083 139823 385973 -64857 23059 186650 255583 -43327 77967 552922 253430 84642 638513
11072 638513 535118 183603 336653 644241 456377 527397 294383 455069 283973 631680
11062 631680 489481 598510 446559 328957 738200 487194 453298 736189 503802 1029144
11052 1029144 560221 788091 842125 643558 834355 628625 669696 844687 736917 725686
11042 725686 571126 794825 525182 843763 581683 917793 388602 648826 714735 627063
11032 627063 860450 588099 767816 646350 856294 465981 703829 876319 961199 386248
11021 834099 449826 727004 813972 653264 658720 415148 732602 749211 445360 636375
11011 636375 490519 707089 534119 518221 407094 686180 513801 835170 614481 438492
11001 438492 507574 522986 894971 873529 424294 451029 740029 613089 867235 585250
10991 585250 543936 910509 738869 607922 1130470 548005 723946 835972 1031497 1377854
10981 1377854 1291584 1207366 1718363 1160871 1661489 1606946 2353950 2460136 2904944 2703016
10971 2703016 2525770 2439126 2553941 2504753 1988158 2024966 1777265 1745793 2010175 1984298
10961 1984298 1698593 1792765 1748826 2092256 1877697 1707879 1903357 1616261 1552437 960772
10951 960772 1262460 729546 666820 574454 633916 24779 503810 364725 91276 362751
10941 362751 -6247 306297 -244239 -141728 237320 92692 -66355 96198 -10747 120020 31312
10929 279063 33993 -41564 255603 -85799 -83982 37208 73742 130592 -371474 34533 216012
10918 216012 245348 88536 -204209 -8596 81669 -72829 -72442 198780 273247 -196536 -507060
10907 -507060 -199251 36042 -36544 -304012 -21190 -28806 68481 28999 -52140 332961 250413
10896 250413 -90549 28516 -175504 94186 216521 43816 -23842 121984 -92405 -77780 149269
10884 -115862 171179 -98586 -248106 -239270 150811 18836 12314 -166375 -103003 -69391 -48349
10873 -48349 -287507 -389800 -93749 -39244 216073 85272 171371 227730 -221174 -10523 -81028
10862 -81028 56975 -14969 49336 175451 -383924 65484 168821 2229 -191646 -226683 -351363
10851 -351363 287082 -141009 -91290 -158195 5864 3682 -126265 -287744 75097 189936 65242
10839 151742 -15376 86309 -452763 -31217 87856 196790 -29166 -219429 48126 -32596 215320
10827 301373 51321 -745 -142356 -189436 57628 -53699 -121703 -113877 68401 -286538 133536
10815 -114698 -104826 192575 967 11225 68152 121058 87536 -54134 -213983 53963 134664 -117744
10802 -42267 170732 -258161 -158022 89007 -81201 -77320 283546 2344 -80171 -26980 -7797
10790 -124338 -165872 -206653 185199 -253050 -339546 -347233 164949 -117261 307904 -98899 -30445
10778 149794 -10139 -144831 -40883 148950 -304138 -171853 227036 -49708 261121 -100627
10767 -117819 120741 -208994 -95766 60577 -32983 152720 294960 -57095 109660 -63818
10756 -433959 -24485 115515 -104267 9776 -161487 -19856 46670 -122952 -305428 -38035 105388
10744 -49537 71140 46073 -1440 196553 -126879 -49756 167027 8855 -181515 -170417 -257525
10733 -257525 -252943 248470 -295289 96099 -14810 -62105 -111136 -162140 163407 -26856 140036
10721 -93863 280818 72891 -373768 -138474 -105593 48934 -106696 -45570 214087 84477 -333877
10709 47728 -209822 -107674 -315418 -205195 -146530 -236816 308345 -114083 130368 114620
10699 114620 20280 -309797 110625 60700 161007 -121225 -5696 -134298 122877 68247
10689 68247 -10267 55630 -181478 -104544 195529 -252649 -117344 -69899 -133600 -91124 86177
10677 129488 -95303 294715 -110939 -143087 -105969 66757 -440140 -240474 134126 -364731
10666 -172862 86553 -83511 74308 206677 -133145 2494 98020 262207 300528 48566 -137102
10654 197057 -124761 154669 -256574 -206210 37296 -107180 215216 -220857 -226149 -241098
10644 -241098 -153355 193859 -42429 -28249 -385472 -334333 -214166 185029 -9249 -224999 48118
10632 -264388 -68246 -137656 -94548 262314 186252 -42271 -328409 -146402 81803 34869 -72385
10620 -59016 25074 -224459 -166659 -141684 -265598 -16537 57157 -96685 -64482 41897 -151044
10608 -71544 111036 -210473 74983 8269 25356 230199 119749 -420558 -129470 70205 -91621
10596 -237519 216809 -206125 -88204 -14255 -197717 -109333 305936 -51373 83599 211914
10586 211914 122841 -154774 26503 -9621 -221986 92620 146897 -1451 -155198 120061 63257
10575 63257 19898 102188 -21034 43767 -180385 45051 -248129 -185443 -338 25686 71763 66457
10563 66457 188391 -137262 -191340 162504 31593 31913 195149 -98866 6282 -249473 -162594
10552 -162594 -106552 -61726 -180177 -93735 -4330 322794 -162505 -60546 153138 -140042 -132529
10541 -132529 -37202 -51889 129674 37963 233481 -73777 157636 34843 -47587 -246192 114701
10529 -378878 76540 -223179 30763 143520 94436 -70576 24334 234138 -193238 93145 -218318
10517 101747 239392 -109168 -553087 241273 -22364 -197609 -268247 -54440 -101876 -37087
10506 -24525 83767 61180 -127240 73203 179235 59921 46756 -135219 26834 -2586 -38479
10495 -38479 17346 -77020 -233283 -49685 -74028 -88601 59628 108653 145851 -84098 112986
10483 1820 471620 431436 519512 530509 469828 664099 301718 -143838 -4522 -294034 256464
10471 -112000 67549 2783 449409 -174235 143648 -147289 -78019 -246432 -41189 -35518 241251
10459 -97582 -68018 -47597 -207564 17230 -293343 158981 -272498 363324 197025 -209209
10448 -325596 -148144 -338232 -120325 373656 -20816 63393 228764 -138244 -2348 -156671
10438 -156671 -172011 155532 65696 -235675 6213 366032 48489 2800 -103261 -95553 54938
10426 144196 154876 326774 -20953 -272065 197919 -44440 88647 -224797 -12414 -123966
10416 -123966 7702 -127084 71833 -114078 -13894 -121564 -111779 -62464 167042 -215900 -270093
10405 -270093 -179503 -149984 -135676 -170596 -45436 -53644 188914 -5647 188085 68408 34076
10393 213483 54978 312986 211516 416344 -110995 -5911 121669 146875 108741 -229229
10382 268486 -3348 -39741 137800 377401 327577 399983 450919 104331 503582 362426 104326
10370 517862 549534 475992 111081 474212 244695 545898 406804 174034 260384 109813
10359 334777 267172 -46007 -127496 223492 504584 114431 -43022 878272 314945 331891
10349 331891 528954 133544 218178 371087 67518 572451 323844 261107 127842 57086
10338 146079 149750 291221 -103796 177776 27508 432271 125973 151241 48730 233278
10328 233278 -8834 154901 75307 116655 293424 -130545 497636 79554 263703 358554 127109
10316 -233031 -20796 -123291 388344 -95983 -133796 -8825 488 174045 176360 -150319 199174
10304 277429 -132476 -115979 43937 50063 -444239 2172 249027 345561 248682 65660 -81606
10292 -175621 204858 44804 56942 -48306 88781 -116629 -158911 28737 -129499 98412 61236
10281 61236 -178064 17475 -180882 -266562 282544 209960 33555 232498 -130438 153779
10270 -42125 -114093 -92658 205434 43072 -192159 -143954 199194 182321 94491 397671 242523
10259 242523 538627 445510 514098 482805 -3782 14735 -173387 -279110 248877 -54275 -39564
10248 -39564 27574 12847 -406473 -154063 -156139 -84899 -83274 185096 123471 -110343 173363
10236 -106670 11187 83362 -145003 -249071 82955 97831 144162 -86 -159115 -24372 61878
10224 -496927 58823 -118093 -63639 -147757 -114813 -109328 -168595 -42526 -206231 -54005 90701
10212 37828 39388 -53360 -89171 -102717 -247190 -4781 -338686 -88166 324345 71851 13450
10200 356427 -281346 15956 -149062 -137465 266328 -296228 -194304 -96384 148237 87885
10190 87885 -273846 -105411 317371 227459 -249175 -225003 -105278 -312292 32106 -18964
10179 378863 22653 -111456 -146859 337199 114464 -129865 -4258 -30016 -4483 -212438 120838
10167 -154063 83962 -126981 -60202 -191669 17373 -60420 139197 -138633 -69256 42410 -35653
10155 -145428 146178 -201112 -86246 108840 19919 -103798 68476 -258540 -113679 263358
10144 -272646 -234326 19806 111429 -322520 1496 238149 163270 -92330 116666 -168811 -190710
10133 -190710 -383804 78870 98117 82545 -214060 35294 -91238 -71607 -173371 -119051 123518
10121 136544 -83292 -74900 181048 -157286 -221591 -297981 -90673 -108760 -82576 126524 -4679
10109 74389 -147484 135679 -127218 -108041 324231 -122524 254723 -201345 -39330 -354766
10099 -354766 -222498 -154724 94059 139921 -157420 -39655 211388 5255 95172 -262124 -50492
10087 -233782 112016 -33562 230571 -200822 46825 -191031 -232842 -96491 71811 -86192 -345048
10076 -345048 -239177 -67920 -188007 -8683 -187608 140418 102498 47680 -362849 -95328 -70914
10065 -70914 -19382 -387271 -155577 443710 -233851 1027 -99905 33421 -88296 -261338 189357
10053 -62864 -13454 12872 -195874 -195780 -203520 27348 -222748 -133587 -172682 -159458 -234171 240044
10040 -140504 232013 76448 194119 -3450 70074 -123705 -22502 -260908 -247060 -41122 61279
10028 -152709 48353 -241677 -206424 163297 -158224 124197 -17756 -10805 -7857 12372 -43077
10016 -268456 -336193 426548 -220837 157523 -86869 20204 40495 27340 288352 -48745 -127944
10005 -127944 -153942 -240992 -288117 -143414 -315829 -292862 26285 -173972 -70014 162304 -429166
9993 83949 203588 -167583 68373 14639 34961 -143923 108065 99040 300524 -82861 -236691
9982 -236691 -145635 164078 7323 93412 31288 -187441 966 -307015 -494276 -52478 -293790
9971 -293790 85916 -399438 -195184 -250494 26336 147311 168143 -3302 123071 -48929 166657
9959 -40148 -24486 -174369 67232 -76628 100578 20570 127724 -423180 -88028 -32806 -173435
9948 -173435 -128702 2611 -128171 -138133 -211207 -35623 -43216 -281103 -185749 167741 -75980 182182
9935 39439 -141196 -127335 -105281 216066 -121531 -37613 -114252 -376739 -139 -321132 -322118 58325
9922 -9777 33541 -127446 -344213 118601 -259396 -59542 22897 -368353 157633 -196467 180800
9910 -56626 -262140 -492837 -212231 -179730 88441 -187022 -1571 35470 -164395 -10042 2477
9898 -173173 108954 -392119 43216 220399 48601 330880 -397532 -2738 140744 -18012 -197205
9887 -197205 -76125 -81418 -212732 -152029 82912 -129559 -74686 -50290 -119534 -40784 -179131
9876 -179131 -206470 -70082 -437 -243258 93170 -8856 212133 46660 172861 150225 -71750 -34121
9863 -136444 -42329 -293515 -200546 -272163 -198926 10243 -331291 -266741 19956 -157076 98679
9851 -253761 -213379 -2103 89007 -303732 248816 179183 -214769 151711 -2361 -178482 -96058
9840 -96058 -126422 -237335 -148953 38866 166698 -325084 189105 -30033 -98474 637 135989
9829 135989 -379089 229310 165142 -101956 -269 101998 -392343 -374384 126817 91377 -172166
9817 -137816 168339 -205143 -203369 -141752 123627 -99970 -139216 -252235 278979 142514 -186511
9805 -12479 237528 338224 -194892 88632 -71505 -131581 -65240 137832 -147760 73037 126438
9794 126438 202195 -1371 -386037 -173487 50325 195391 -353704 338271 365576 -233115 -435554
9783 -435554 -29804 -107403 -145528 -186222 209997 -346950 -121540 -114521 153005 -50768 -127232
9772 -127232 -50666 -345441 -246136 -12513 -309120 352747 426906 2318 -290245 -12049 -200617
9761 -200617 10908 -186895 75337 55523 71601 -60617 60366 -56900 -62231 -53785 230035 -157516
9748 24943 -253887 -147653 -244959 255630 328788 35710 145311 144319 73218 -86870 -97783
9737 -97783 -224197 -46092 -142354 -35716 -11752 -145738 -100873 -79988 37932 -96475 -68879
9726 -68879 -353953 81835 180342 -173405 -56695 -160907 -148185 144852 -147347 -140429 -120437
9715 -120437 139776 -268524 -79000 -174555 -179618 -372464 -210540 -61106 57193 -230458 -170031
9704 -170031 41416 -62641 -191096 -133095 251827 -162548 -62432 -456701 -31591 210044 328501
9693 328501 -330756 42772 -50604 -120197 -72397 7595 5905 -309869 120235 141 113881 -104975
9680 -177781 -162276 -8516 -120061 140631 -202592 -219310 -434438 86312 51893 31147 253162
9669 253162 -248126 -149921 -7148 -113553 -47780 -210851 181132 5167 97242 -261135 -84681
9657 18787 1802 -60193 -249891 177804 -165804 -71932 -56987 34566 53422 -108345 -321467
9646 -321467 -302938 322776 -178241 330426 23456 -400918 11897 102916 54019 -84705 -247302
9635 -247302 57951 10345 -220675 -298021 -298793 -75482 -251541 215742 -105839 253076 -64127
9623 62682 -375934 -172472 -36508 -510241 -1805 -410916 -25581 -154604 -42666 4647 143478
9612 143478 -41114 120896 156928 -359032 -116854 189016 -116780 173170 -48594 -116145
9602 -116145 -47939 165411 -112913 176185 -169093 -109238 -48828 -24537 -266782 -87020 -200664
9591 -200664 2116 217170 -113040 97596 27701 -176732 188604 -292759 -189590 364846
9580 137699 61938 -99010 -200655 -205467 -52279 -291588 -15096 200675 117484 72902 109942
9569 109942 178108 -219718 -62756 304001 -15099 19567 -443556 60440 82813 -47365 98000
9557 -32195 -65954 161031 -221266 82177 -141301 -40320 213470 -117776 159827 -207134
9546 240674 10366 58022 -27718 -109865 72336 180995 121195 -170954 67854 -235792 18595
9534 61021 -16740 -39745 202881 -55876 -55837 -258539 -306673 -104246 -113235 65850 299251 -257404
9521 -183823 -73705 -103471 18792 68024 -92386 -347423 28802 134260 61865 -282955 158833
9509 4926 -184039 167162 -168537 -123684 241831 -357054 -121890 -285291 6913 130345 -86482
9497 -376836 -248165 -205681 121581 89016 -73564 -31860 -254430 221469 -160383 20896 200077
9486 200077 -181393 170466 -43591 -152102 70798 101933 154916 -63720 -343447 -80088 -21027
9474 -123414 -405840 -137993 -3576 -5861 154004 -15497 -384184 -500887 -260025 -86815 -16747
9462 118033 -291039 -345410 -99872 253926 109110 289869 -66069 -248446 -255256 -296070 -59956
9450 72993 -218562 -379582 -115428 208643 283950 84142 -324363 -83039 -147156 -488681 -170199
9438 -142734 -129417 138968 -318117 -117751 -214090 -90245 87793 -212216 -204175 5393 -45242
9426 -272340 35693 -53328 -263548 -212076 59259 -85619 -125249 -321793 -43852 -357372 81735
9414 117539 54857 66145 -209816 -274213 -94545 -589175 -29249 90553 24677 90248 -227489
9402 88136 -102484 -191529 -187844 319345 -107463 -69233 182388 -293068 -238497 -335330 -382900
9391 -382900 20264 -37535 -41774 -319671 278288 -40624 -76222 -56416 160688 463937 18589
9379 -243858 -174156 -214097 -179400 40580 -355240 -105427 124620 131145 78015 98378 -203990
9367 -84268 -351812 -144523 -117171 -231266 11667 204209 302303 -191093 -261576 -205932 52333
9355 -106953 66465 -126133 -50505 35566 -411107 -37534 276222 52393 8065 71386 -74109
9343 -2066 20669 187000 -270619 34167 -75230 -324115 194638 -303936 -241639 -170599 -464605
9332 -464605 116150 -170548 -81712 -158891 189533 19184 -57369 -150490 -224160 11235 78299
9321 78299 -204909 -70486 275535 -183858 -45673 -64943 -340833 98570 330135 80493 -56259
9309 23577 104252 -29123 -302389 -91077 72113 -425688 152367 55146 81836 280736 -116834
9297 35251 -55087 116358 -154990 -443947 7099 -129708 8976 67898 -211555 -225319 -312746
9286 -312746 -510218 -251257 10114 -604345 -64059 -56140 -21784 -58581 -32538 -897 -66609 -153843
9274 -153843 97016 -51072 -41626 -332899 -160355 -205010 -106386 -81248 -144970 -18792 -46911
9263 -46911 -212529 98052 -216089 7364 -37091 -84690 36209 -134570 285609 -232839 -282499
9252 -282499 -90349 95374 -264988 186914 483162 39061 -255179 -146536 113434 -46437
9241 317273 -20222 302657 -117966 -49150 -182749 -185279 125272 -22278 161318 -218885 102456
9229 -112085 90040 -148970 -66461 -133042 -15991 -267355 46049 110473 -142053 146649 -98031
9217 50987 44665 -18657 -236331 247630 134315 -30821 -157132 6565 123298 -86523 15969
9205 -116896 -69292 -140666 -363211 33681 3941 234626 -266467 171810 129627 -69533 -227459
9194 -227459 -230796 52598 187911 -95886 -130247 -482654 114458 120318 61475 62631 300694
9183 300694 177253 -91435 -333318 -19935 294145 111611 -61952 -63433 124555 82174 -13859
9171 113725 172680 -62874 -165505 -364800 247217 706 -32913 -126500 242859 -21548 -90908
9160 -90908 -22873 -198675 -122025 -3118 -411132 183410 -326940 229529 -167080 58587 24163
9148 -181943 100308 -101106 -129305 192949 -187176 -212411 238438 -101266 -259023 -60937
9137 23076 -71794 -287696 -286928 161035 -113656 90200 -166637 -308949 -178806 164283 -114433
9125 -267061 -127875 -382278 -182600 -91954 -214697 -143318 137241 175476 -112341 137142
9114 119320 -178332 -127991 -29488 -86048 7551 -216577 -66468 78772 19216 -10495 19118
9102 -50715 -136406 70490 -171914 -126517 -188604 139606 -40754 39719 23240 -133722 19209
9090 76175 -190897 127436 -206975 -59949 199669 73943 36268 -54664 201378 -48078 183174
9078 -102174 162845 216045 -274250 63414 -66749 -15929 30074 177820 -32351 -48979 -538354
9067 -538354 -194235 -193984 332213 -81653 -190433 -285902 -307375 185735 -292227 80630 -37408
9055 -469138 -164591 -480766 -140979 -57513 -29499 -100129 235218 -44669 -566793 131063
9044 -203625 -229583 -555543 -11636 -219913 191730 -227186 -59422 -170447 -80900 -83478 233808
9032 19362 146318 -31414 -114280 61099 -148482 -103266 -14550 -19972 80918 -77386 -10686 68719
9019 6464 -103018 162900 34482 12384 -90137 -30128 212202 -129433 44422 -22554 -55929
9008 -55929 -154881 -174070 -461105 -113420 40289 -190158 -48664 -23280 -135368 311962 171564
8997 171564 131649 54938 -38567 -344017 73955 -61740 -99417 227049 32903 -144180 -30369
8985 -134487 76394 66303 121972 787 24689 -350089 9538 98497 -40607 109027 225087 138524
8973 138524 -131423 141022 19135 -121569 -105977 16628 -56845 -237366 -6532 -90782 153837
8961 -134965 114969 -43835 22148 -368794 -233672 -80808 5713 -389918 -133377 -557753 -99915
8949 -128235 58716 3330 -8408 -336173 256488 5071 -124794 -81596 37454 -366833 -459044
8938 -459044 60972 -9071 -138318 227727 -84531 210035 -160887 -85848 -38008 -97880 108759
8926 217717 -79917 -5412 363258 1307845 5535541 2821813 623425 275219 146026 120608
8916 120608 -37229 86526 -224204 -264260 -127223 -228758 -100286 130501 -34870 -102237 -133594
8905 -133594 -86572 36228 43786 160541 -139017 -211763 -284458 -6106 -162765 -244029 81815
8893 -43501 -116398 333788 -89556 -239871 -41071 -165804 -25717 246928 31613 -47777 -7423
8881 -10183 -248152 185999 6405 -395600 -287424 -66362 107510 -461202 225348 -60841 7142
8869 137038 268423 -208037 61495 -227019 -364833 -87032 217107 173945 -227718 -269063
8859 -269063 -167734 -7325 -66355 143189 2289 -178825 -127616 72510 77833 30246 21936 -13235
8846 -67462 -318171 -162293 383975 -21090 -149962 7445 -46333 -133582 251240 -285547 254562
8834 82125 -175679 -176276 204760 -271369 -100355 -136650 -246718 -120131 -108985 153596 32785
8822 -229397 -19060 -68021 158014 -97153 -173532 -9478 120278 -301356 -204833 60347 138911
8811 138911 142832 -306971 -10740 -158551 -122466 227238 68072 363842 -32239 -15650 -17471
8800 -17471 -141136 43737 -54882 -123079 119750 -167918 81114 -72735 -66184 20851 164575
8789 164575 -49389 -114811 -134202 -150672 -87940 -274178 -108222 -216834 -126915 192469 13015
8777 47548 -291613 6004 -101681 -331270 208755 -273115 70018 -183311 -269045 105645 169336
8766 169336 277594 26417 76066 57277 -175353 -313830 -82986 -280458 30668 -258274 -59224
8754 -88665 -181629 -273087 163884 261371 -272942 -140116 -122231 -39308 246605 -145793 -141383
8743 -141383 -444176 -156600 -162165 -52982 -60375 39074 -87486 59470 -272946 234510 217282
8732 217282 9243 499857 -28458 43988 -99205 -214907 -129821 -58829 82347 -148592 186039
8720 -133258 -8120 5592 112487 105282 -93959 161584 -74491 -367833 66647 133814 224108 -98655
8707 212847 -181881 -280586 -171727 -68207 -159573 -27960 63172 -199422 -80989 134418 69906
8696 69906 -241762 95038 67729 -158265 172279 -166702 -61539 80328 -71160 193852 151157
8685 151157 16634 -335103 -311739 10007 134465 -345635 -33529 168330 27172 87492 244119
8674 244119 -49189 198231 -72712 -153753 -409972 -166888 -110885 83391 23501 -31243 -101143
8663 -101143 -229238 -195318 -426241 61251 -66592 -47366 35007 -254055 -191460 222800 325853
8652 325853 -216675 26545 -126694 -50776 -108149 -162754 -112509 -7003 25591 -86447 123022
8640 -244962 393472 -78998 55977 -251568 -55194 -537495 162982 117624 -293838 -118656
8629 323 -286929 111881 -145620 67968 -2123 17376 4830 -123815 136805 -428417 -22148
8617 26717 31707 -255882 28527 -361377 -8997 -138511 -47888 54762 -264372 -243061 -134636
8606 -134636 7342 -334191 -305537 -79518 -340216 327494 -139599 -64081 -256540 107856 284047
8595 284047 357944 -213046 22793 -22734 111845 -27556 25641 183196 87944 -129397 -85650
8584 -85650 96506 22733 -193356 84011 -65370 54176 -337446 257672 -52056 -500425 387015
8572 -226814 -14058 26428 -141600 92434 -311978 -130841 15690 -285359 285356 -12327 141664
8560 -57823 -162274 168498 -105012 -198641 140235 -219416 36364 119480 -210763 -525654
8550 -525654 256272 56475 27642 82556 -239593 -70075 -48597 -38626 46071 -157500 -275302
8539 -275302 -296953 -143075 13232 -9347 -84820 254064 -278648 -315509 -263082 -60115 -161348
8528 -161348 -39294 142591 -165624 -204120 40321 -48345 -7329 -90003 186115 -46059 -36844
8517 -36844 103965 -55597 -291556 -327026 332653 -25269 252833 -33118 -312532 119561 85115
8506 85115 -201323 -227375 -202759 286803 -199459 -5797 -63914 -148831 -202751 -304246 -183842
8495 -183842 -314828 -111110 -387650 43436 -172285 -13243 -64144 63558 -179198 -310965
8485 -310965 -127904 -30825 -129319 -27602 130148 -216638 268875 -118459 -203933 -76285 14632
8473 156128 -164117 -228971 -185870 103528 -246674 235941 -25912 257488 133867 28926
8462 187600 40044 10585 -205407 224157 48057 -108976 -95491 11827 -131081 -326922 7422
8450 211254 -7408 -50868 -291846 -259943 -198999 -106927 159264 210254 -170422 70324 184722
8439 184722 32014 -171412 -113900 117387 37404 -253204 -223008 -137212 -3360 -253494 -193257
8428 -193257 120797 -40361 -43955 -197009 34441 219063 25428 -182215 -95678 108695 -99258
8416 3248 -120521 35774 -71033 -40293 -166081 23125 45231 -152767 44949 -122180 -226142
8405 -226142 -101954 168995 110082 -264486 -212782 -58214 -186436 96619 -281630 68970 538914
8394 538914 67984 -350755 -109573 87454 -42717 136270 78723 221805 22787 247815 -14216
8382 -194820 745 -294054 -260097 -157619 -160861 151503 -232763 -11682 -278195 154819 153739
8371 153739 -70962 -192970 -47087 127440 -239589 99798 136409 -153125 -7991 68429 -33458
8359 9247 -463874 -116577 -157357 -74024 308804 -75852 52425 49104 58389 221898 -165571
8347 183868 -200631 5789 -44941 109437 -287260 86757 18052 20222 74746 85059 22949
8335 186966 19514 66703 -140396 -90524 -22153 -417817 37142 115756 -60489 217122 -120876
8323 -135309 -280129 -125057 -375263 203349 -108935 56146 94174 -114557 101172 -24859
8312 73213 326124 -282328 -16850 -314078 -51210 -71619 -446775 137589 -246254 -221945 360
8300 -116571 -79091 60112 39415 -40940 -77137 90949 167790 -187645 -149802 -131934 41677
8288 322861 -125237 -25548 23460 -81759 -125905 -409729 -89203 8872 118784 -285145 25342
8276 -321334 -100778 3544 151918 139849 -230217 -97271 -154604 2424 -4307 -129655 -209209
8265 -209209 -159673 -15604 206569 85484 96608 -25858 -64547 137192 153868 -290460 -270894
8254 -270894 386275 -2466 26521 -110139 -313684 -44253 224217 223739 -71719 -183967 -266970
8243 -266970 -103425 174440 -80759 79447 101348 -300838 -126474 -325444 -140163 -291679
8233 -291679 75956 299103 -49154 8131 -10677 183999 -311879 72760 130954 -98737 -374594
8222 -374594 -489286 -158673 -396965 -99985 -130354 -64862 41889 -81949 86056 -265796 -201352
8211 -201352 -205483 -262029 243448 -81453 -68027 167481 -41841 -236027 126952 -106447 -13476
8199 -142514 -339759 -207925 -71741 256340 91089 -56601 -234306 -82479 -47470 -24381 -77657
8188 -77657 -425439 110611 -45878 -11083 -59014 -109164 -9344 443538 139913 -150041 209329
8176 43370 -110376 68077 187795 -36754 69176 -43394 8456 42622 -182383 51749 -133279
8164 131507 -278171 444018 -190479 -241180 -78872 44718 -117431 -66079 -35604 167128 -38862
8152 -85072 -38603 143224 -87285 45953 29443 -235714 -74454 -346121 -411729 -186172 58929
8140 48266 37417 -15661 -75871 239165 -198539 85140 -112188 -395143 -56642 -152439 36110
8128 -229722 -229778 17800 -21117 90284 -209570 -232713 13463 78533 -279016 -243161 -244119 -53493
8115 -248254 260125 -121852 -48388 -122242 6901 4383 66789 106911 -174789 133642 55271
8103 -57805 -9347 81369 154345 -172689 -180079 -249466 83363 -135262 194860 -233893 -195685
8092 -195685 -111226 -27418 -22985 -173239 -319836 -215782 191120 74738 203544 -177099 312290
8080 -76980 15777 -131518 22449 130453 -325154 -27116 -369330 -100003 -77859 -177633 -197627
8069 -197627 -415289 -29940 -140068 -222191 15869 -199167 195380 94929 -43441 -95905 -85330
8058 -85330 -151736 95951 267647 10124 110366 -84619 50078 -285165 52427 -155827 283841
8046 155550 -43897 209708 268483 176287 46403 71332 5418 133588 36994 -120811 85711
8034 47222 -123575 -198009 -341827 183750 -32616 260813 -43287 -94355 64450 28892 87927
8023 87927 120994 -269894 -244044 -181895 -18746 -44526 609 -355821 -163595 201702 410667
8012 410667 309450 -182284 -312542 -53079 -111476 -111935 155597 -399071 41325 53317 173832
8001 173832 68632 5417 -44418 147884 46817 -234579 130438 -38109 41336 47049 299084
7990 299084 -12952 -191182 -99448 150263 -74798 -100423 -210081 92790 57424 72875 -67738
7978 -265324 153591 -301044 -51568 -24818 -103143 -145891 51877 -51239 105002 -57590 260319
7966 246288 14775 -225172 -19924 -20427 279375 19332 -108988 -272737 -55733 -56626 30917 -170395
7953 21425 -19156 111625 23049 83439 -281747 -17613 -394369 -76367 48346 -1829 -365406
7942 -365406 224350 33888 15330 -133174 -12301 -207924 98036 -244486 -154528 -177176 -144082
7931 -144082 235164 332439 431388 172125 -147816 -141502 -157883 219864 -29920 168782 -65419
7919 57342 -158582 275865 -7904 -554155 -176544 -165852 -249065 -209932 28266 187998 39731
7907 -139926 413031 -80084 -8705 60463 -131228 -162178 41667 -131692 -155875 -135321 -427753
7896 -427753 -170645 32984 80940 -49696 53667 146990 -197412 -49959 -151457 -135554 -38494
7884 -100015 -250677 -134692 -264031 -113053 92083 -351685 196769 241237 238135 127578
7874 127578 88037 180475 -151129 -174732 133207 -41315 60535 106117 -362977 -340068 -316531
7863 -316531 -228121 22399 -66004 -86940 -104219 24621 27838 149336 18648 26524 -270625 160419
7850 2271 -276131 118219 -164304 32242 71551 -131846 48761 -245698 -26078 -9556 16198
7838 1927 -75855 -93786 234299 -340855 2031 271613 -227262 -138036 -10042 -79636 41859
7826 -46920 -217718 -225235 -87841 181665 -2276 182356 -48154 -68305 -410661 122824 -96200
7814 -74702 -42118 186544 36023 72277 85316 -169220 -163999 -444039 76705 -45512 120576
7802 -81327 15764 -133535 -358864 82170 126467 -215606 25938 70854 -115263 40040 142973
7791 142973 -214459 -25757 -69218 -259804 -121605 -105436 -96762 305873 -274131 -407532 -217266
7780 -217266 -185283 136852 337034 -164055 80977 -420528 344988 -38229 -25804 -20327 -142386
7769 -142386 -194813 171820 -203421 304992 67798 170712 -167566 10196 -2741 -425546 -148935
7757 51078 133310 -208147 -158914 184993 -54429 -117653 88178 -57489 83471 6315 -84583 107420
7744 -404758 -36717 -120845 -107167 -54721 71090 -90757 -9849 -153894 38448 38868 296649 206160
7732 206160 -17337 -6811 140546 310423 55134 67061 180964 -256123 258141 143149 -434985
7720 -125483 -97096 -108053 -170451 -23764 -242651 -25096 -211500 115220 -158430 134850 -136033
7708 55343 -371609 -66622 -115884 123616 -81892 -67500 -44910 -36053 -39236 -26035 92294 -193808
7695 137520 -22142 47485 4591 -54439 216689 -152198 -142260 13720 222683 44491 85488
7684 85488 -4406 302492 212132 13852 -237545 196288 -67843 34570 234788 -78900 -17387
7672 91693 -103988 -9442 -325615 -106023 -190398 214490 168482 -30706 377643 -225382 64083
7660 83238 -358039 -132862 205857 -22763 -40227 -350095 -44599 -254406 -77370 -101975 -196571
7649 -196571 -214494 -87910 -135532 -76182 -75484 -327211 -244395 -343192 -138967 5873 -339926 -111510
7636 -74578 -80098 -1375 -93210 153591 168276 -211857 -143079 -159219 64551 134042 38417 -501887
7623 -103057 -93552 412382 72937 -202918 -6656 39333 -100975 -29565 -302204 -78456 -151229
7612 -151229 -82630 -209005 136299 102956 31387 -78908 -28890 40071 -339762 362625 -208465
7600 36572 51130 -200690 116731 -208575 -158293 -215317 -211863 135123 117307 -194880 33492
7588 -92714 -23399 134914 236369 -342080 -424836 51472 -297314 57348 -375366 -197752 262965
7576 185224 56223 -56003 -333692 102633 -84404 93354 -283631 -201008 423346 -218555 -243171
7565 -243171 190579 -213900 -55994 -231871 -165051 -72796 39760 -74230 -143225 -281402 238063
7553 -70508 -228577 -2920 -53253 -65339 -271071 268840 -38941 55850 58565 274791 -371381
7541 -281523 -141947 168746 -312873 -121722 -140324 -33663 -10359 10966 266492 -36937 185791
7529 41478 -340198 -91662 -206725 -106138 8155 246490 12737 14676 -91216 -263084 -197643
7518 -197643 -47248 164022 -278718 -121856 128601 339945 8829 -25481 237284 -109862
7507 -2200 33679 807 127904 -209243 173287 22745 333605 -311518 213108 66383 -134702
7495 252320 -30144 324243 40362 -55341 -22786 137129 18605 -158682 314887 14931 -20820
7483 -84318 -211462 102553 -34622 79909 -107460 -243723 -148949 318275 -106778 -5251 -495691
7472 -495691 -848 -115507 34509 28552 -168016 -94476 3509 204231 -171371 140698 -124024
7460 250126 96441 -159137 -37434 -14284 88341 -275708 -13041 -45889 -225631 -323526 -4921
7448 -165288 -31586 -90187 500035 -314566 -19438 -115033 -223396 371674 -253695 26276 -293417
7436 -155367 220121 -526754 -59602 -400502 68227 -47063 -181399 -65864 -100444 192951 -84836
7424 -144607 -33926 -401642 134990 -144625 219238 241 -256963 107617 -93100 -123466 -205980
7413 -205980 -190077 -192527 -71601 -57269 -255045 51041 -80052 -126133 -407247 91155 302 -27648
7400 -248510 5126 101150 240970 -106432 190055 -216737 -20164 -85408 261069 179950 34590
7388 37347 -74745 121848 163665 -141230 -262318 25441 -311008 -342998 -247730 -45772 -2462
7376 18928 325828 -123513 -169773 49663 -369729 -243696 19950 -11204 -2450 -193227 -37171
7364 -163230 -197472 13348 295556 272150 320579 -113640 -51741 -88251 164156 -105339 -87374
7353 -87374 -36053 8014 8477 -9509 134078 37937 -31754 106520 402196 21207 163332 -57612
7340 -301310 144931 -142284 42735 -131854 241004 -101350 150868 -85737 -143914 -73077
7330 -73077 -194199 59710 -78774 -3320 -356725 -162742 343946 59773 -81242 86227 265888
7319 265888 258442 -44356 -168824 -67012 -160507 -106331 92090 -117467 100952 -276366 373
7307 -136058 172481 202515 -153031 -6348 -231260 -314237 -81190 60170 194179 -100277 -52065
7296 -52065 -11805 -19447 -218508 14011 -240176 -134145 385678 -123764 -268161 -86956 136918
7284 44721 229128 243349 118592 -102852 169890 -60254 187317 -24554 -317248 -159078
7274 -159078 299388 -124866 -47602 -77051 274675 -66923 88311 74221 -94612 105588 -2524
7262 20590 -140745 14039 -194500 -32853 -50413 -223650 351579 -318767 74100 -345423 123231
7250 90453 -123759 33312 -3375 -179658 -107958 -347939 19268 -232831 -266923 163740 -175475
7238 -92160 14555 -26516 21457 73144 -210936 84983 -125254 -275069 162287 -191387 -13521
7226 -20321 37646 95414 18357 -57506 109915 -8380 -219865 45918 102472 -142665 -20870
7214 -71869 6127 323418 -107971 46585 262435 230520 259201 177204 159177 74535 -204378
7202 109290 -102068 -400327 -41084 -47122 87331 -145138 -112091 -157939 -59409 129582 -158868
7190 148411 49324 370004 -40812 -171267 -35258 -99445 -162727 -187519 -183218 172950 15373
7178 -142718 -279197 -2440 -204114 12064 168704 126418 -41509 -23485 225633 -213647 38849
7166 44216 -250113 -180096 72761 -32902 -69682 -72451 -78627 -1782 138363 107049 110753 247602
7154 247602 186156 -252293 -151696 -495479 37873 97925 -101557 -194685 -81238 -211808 -136240
7143 -136240 -129476 182415 43618 7213 -52087 194436 -72633 154804 -205514 -211982 -16073
7131 147646 21483 31936 -347178 -12694 106505 69652 151840 196968 289599 -61646 -133982
7120 -133982 -131219 -55815 -97523 208715 -168473 165297 77550 -98998 218899 399321 -324029
7108 -298137 -85206 -446802 -285048 60724 81076 232090 -109531 -203739 104854 319248
7098 319248 -57164 24678 -15224 -77514 20683 -112403 -70062 -114999 -77152 86687 46270
7087 46270 -88183 161460 -114755 -99581 21160 -244471 25946 -35242 182858 -302860 100291
7075 50775 -228521 -59835 -44037 67076 -94285 -240076 -221552 247784 -20487 -267889 133761
7063 -93689 -13865 120065 -190058 239082 96157 87428 -55910 -103897 -275860 -269538 -376697
7052 -376697 -28261 89559 23157 -244764 -65339 229165 62845 156798 7616 -297908 125973
7040 -209420 -255979 175603 -12218 138637 93276 -111420 143569 202064 31287 150471 26545
7028 173663 202033 -174057 407306 155113 295546 11821 121422 -157105 -306833 134344
7017 -162363 -71280 206514 228712 -92117 177368 68741 100914 -87696 -4612 -212550 -238451
7006 -238451 -95465 95680 -389311 47450 -418567 240156 481991 -266444 -18661 -185910
6996 -185910 50063 -355142 127214 -15107 155791 230007 -37770 -218957 -52650 -174526 238032
6984 154542 -129893 66575 -26286 223092 -86936 -391992 127702 -441097 -157811 -119608
6974 -119608 -6492 139606 230542 245703 -65850 116840 -232751 -33242 -9955 -204279 111596
6962 328353 51004 -59727 -169487 57928 231033 -55694 45704 -6005 -115820 -34541 -256093
6951 -256093 137002 -146321 -190961 -208558 -35729 -48066 144544 165997 14622 -188820 -293959
6940 -293959 210573 -239003 -162571 -239649 302407 -119884 -160376 -238398 -206058 11777 218638
6929 218638 294858 40065 -115178 135980 -34216 -43803 136071 -198398 -241380 165139 -77567
6917 12413 178781 -80518 -63911 -172250 90725 253038 272212 162318 -17634 -312931 -642784
6906 -642784 143205 52584 -98008 5627 -39310 -399928 300463 8606 -118188 103274 -188210
6894 -21409 -192841 -226820 -82832 25722 -211487 -303631 -216232 178760 -293598 4492 111200
6883 111200 121091 117184 -161064 -152679 -17201 251583 -107520 -123663 -25085 223144 -229174
6871 -290011 342397 36761 -56951 237077 -310618 -52761 -76767 -32798 290253 82026 -1594
6859 -416381 -269909 71855 -40858 163330 -308588 -255508 -214365 -51379 -241961 233343 -180102
6847 16328 -60259 -307528 -369157 6815 -97381 -151645 -273333 87645 -307277 -112353 54421
6835 30454 266901 -174361 -62498 150567 44031 431706 20009 -143280 78134 135495 -33261
6823 -185404 -224387 141836 177609 138171 200527 92675 113766 160881 39454 -28612 -191432
6812 -191432 144224 -21954 -90385 213058 -20819 -20427 259644 -341894 -388028 -80848 176465
6800 -9885 69015 -355235 94310 188058 183172 -196750 196001 29693 20220 348789 -21517 -125453
6788 -125453 -226508 -58165 -28359 -416714 92553 -10208 -6863 -382489 142450 -183342 36785
6776 -76315 34585 50654 -266394 263512 -75332 -162780 -290273 10769 393926 -50395 27532
6764 -3795 60798 -12267 -89896 -380356 302919 -57795 -39011 246757 -105319 -134719 130947
6752 -301675 187476 -94689 31884 -89689 -195482 -165525 177653 -127108 -279045 310546
6741 41095 -148852 -138459 98933 61409 4764 137482 146600 173631 176550 -54688 -87578 -32676
6728 -242829 -124326 -89884 -281136 -190031 230667 -301694 32479 192451 -229946 216077
6717 -46054 157245 -251546 183399 -141550 -86090 -179725 -194871 -391081 87018 147442 -185864
6705 124056 262103 132364 -70635 -19876 -76153 -142852 -52273 10005 65279 -7499 -200818
6694 -200818 -64461 -32933 -171056 -248600 -97343 209118 341908 24821 -26223 57033 279233
6683 279233 296004 -174455 275892 -122846 -108151 -302091 163689 -53709 115954 357624
6673 357624 12053 150798 -333261 -166801 -27689 -69666 -340479 159289 -69757 12106 -334357
6661 115814 10141 27929 258305 106045 -20444 -241760 -60231 -340646 -165398 108284
6650 -266990 -87555 -9524 270128 -105061 -32196 89946 -4312 13211 -113583 179199 63879
6638 -51210 -61883 148222 -262730 -336394 164387 -299640 -23770 128186 -110362 -15702 -21624
6627 -21624 -68195 -32324 -194914 -451376 -156927 183357 89313 82855 -21995 -75781 184461
6615 22577 96558 -18507 -81107 165189 118742 -174731 -102281 338251 -188712 66922 17506
6603 368577 120444 -61172 103363 122595 -12970 24809 -234162 -131010 -200525 -15525 -179472
6592 -179472 -180693 295763 133942 -309173 -359070 -140186 28875 -181616 -131659 51603 -5105
6580 -96219 -151196 249109 -329285 128858 57803 -348245 -342243 72140 -48077 254680 243554
6569 243554 -179978 42137 -224565 33404 148525 130585 -84771 -111944 -198147 133308 76676
6558 76676 44849 -264264 65581 -60036 -59618 80517 216407 328234 -70124 225982 2205 -161320
6545 -19040 277468 -163346 -132160 -309032 366618 17370 12717 89992 -118955 162073 -198419
6533 203521 93390 223408 186618 -65547 242525 -49660 -111752 -196043 -696 -143639 -133670 -4761
6520 30681 -283548 91580 161081 72969 23015 -129025 158552 -40630 -91047 -461669 257815
6508 -74777 -53433 -38154 -33424 19314 227486 49261 -210036 174030 -25456 -156682 32234
6496 -190343 -42675 -95787 -254541 -11092 -39633 92374 26826 -197335 190896 -173868 -230095
6485 -230095 -365137 -59916 -228277 95509 220354 56783 -20173 41505 26763 222759 -26299
6473 -233706 -105095 318285 31700 -13212 -51189 84445 -165185 -210038 -38880 153164 -51912
6461 -9390 -206162 110656 -71885 -112889 -204393 84567 136869 -249021 398 -183770 -189005 -158780
6449 -158780 -228902 -314048 110467 -151762 -49020 -14365 7918 10713 134633 -15090 170639
6437 -210367 91575 152901 -21259 55859 -69740 142997 -79814 11020 256512 178589 29960
6425 -168102 236954 15289 250992 224975 -77188 -247004 -39475 27445 69485 40881 -67169
6413 -107692 -344226 -377137 189441 153469 159413 -382036 20850 -169047 117654 105651 16688
6401 11819 -41659 78430 126332 175229 194150 26042 -3098 184445 256877 -3442 23515 -116941
6388 -136948 25326 155560 -194902 -207282 -128039 310918 -323178 147420 -192353 -81431
6377 22772 -347471 218439 37359 -45896 302461 -76965 -30640 280263 -196509 -233968 71424
6365 -250499 26688 263014 28297 -144148 17039 345210 -243899 135187 398334 -191313
6354 184343 61968 -334482 62498 -14902 -144127 172605 150472 -159099 63933 -132607 68240
6342 58593 111994 -188932 96608 -379486 -294990 -30188 -146937 85183 -91482 -106171 -119178
6331 -119178 410965 -217451 -107230 77428 154210 -758388 -170649 -178234 143945 -139622
6320 -61650 8710 136086 -255811 -77948 24188 91803 212028 -179766 -6033 -111057 -131009
6309 -131009 -71414 93810 -275007 -217807 42845 107229 -231859 379736 -90062 -130795 279693
6297 133063 -56343 -16360 -50374 99606 250688 24866 -151563 -216644 -307444 -100799 101905
6285 176779 -27621 -196884 -178824 -179786 6707 -159290 93888 128314 -18117 -335988 -104174
6273 192090 -515208 118157 32133 -161815 -217101 234938 -41141 90132 -147781 -446637
6263 -446637 146258 3574 224487 98604 74100 252678 25820 52735 50088 204598 -163693
6251 -263034 105624 -4396 127309 67694 152955 52506 285956 19233 -178201 82464 -176639
6239 10014 -189159 -293100 -145335 -248499 174964 301758 -175710 36385 199551 -237709
6228 107000 10895 -17207 78923 -128540 27638 45418 -275217 48750 362835 90821 113166
6217 113166 251481 204192 123331 -56829 -173703 -229715 -170765 229804 -130993 84316 -193872
6205 51534 289269 -206617 86848 -271322 119747 38524 51787 -21602 124951 -112335 -51346
6193 -46445 -100715 -105649 -50202 177930 105435 -353936 252132 46400 -131329 107967 194746
6182 194746 78312 -16227 -171445 -41459 -25533 -184140 -141647 -144390 57213 -284276 -68205
6170 -166781 -97639 -54054 126131 -67743 59733 -65338 -55330 -228933 137037 13733 -160029
6158 -163650 -130126 18635 -15073 -104048 -127455 -146051 52715 18347 354223 200849 55039
6146 -31606 79680 -98519 -75432 173180 23497 -219062 169151 61806 64314 -8814 56114 -59845
6133 44429 263616 -11197 165732 -138932 261530 -5674 -78214 222217 -28787 -209892 -263677
6122 -263677 160737 -14471 103645 3075 154113 -197469 -148120 -78953 -285544 24278 139442
6111 139442 71386 158072 -68293 12232 -60982 -23171 171424 40297 -64241 44761 -86260
6099 49785 257012 14779 344370 -22467 99256 331804 47778 67524 -55605 67155 -171096
6087 -39498 -150123 68273 27902 117773 -36965 -272082 -411296 -185828 -79583 140272 -128520
6075 12233 -394805 65268 134022 295760 94571 -30798 -151795 -4349 -9300 153805 -193486
6063 301180 148970 31881 -284547 -35353 65977 62501 16300 39081 136281 -121944 -166065
6052 -166065 -184493 335658 28878 89249 -109795 180892 -345865 222937 33689 80135 46047
6041 46047 -97470 167181 -93998 -125354 54700 -257231 -234440 87842 42895 -89460 -186954
6030 -186954 -132072 94232 177367 -399464 267058 -355710 -64965 -126999 216352 -225351 166681
6018 -116886 1553 -250254 376395 122798 -7763 375344 173504 -47954 -231029 -227273 -380350
6007 -380350 -132508 81094 -71319 -49064 -125621 -42336 -151254 -4757 199335 127593 -97130
5995 148302 -190933 219330 -6549 121300 -81606 -26160 -38984 8959 -46743 -93876 199533
5983 388134 89811 -72151 -140162 -133161 190998 -96328 -142691 47791 60277 110192 107726 -22549
5970 -54222 321901 -408678 -190706 4739 158844 86307 -15772 -387720 -173838 110886 94576
5959 94576 39524 -2930 209314 65958 50103 64482 187619 -175763 -98062 -138308 197456
5947 -175194 129165 -317241 -1173 49465 220024 -24560 90094 -139890 3934 -243938 183277
5935 159872 -372749 -331423 -165558 210404 -13173 300316 -148968 126336 -117886 288456
5924 -154352 -79639 -45825 28659 -13704 35407 -336621 -55382 76723 182992 -194780 222057
5912 -125316 -207271 -214580 -292941 197482 213864 190874 -122585 -144612 124393 -207310 -320912
5901 -320912 -80582 -42344 110278 165679 -10236 -47195 -190682 203880 192634 -11577 -225881
5890 -225881 9178 1763 -142598 -227540 -31816 231414 -210272 8949 66326 292399 89256
5878 -96241 -176648 13883 -114049 -136635 -120174 -292178 -111089 -275915 53444 -77612 94049
5866 -228171 155366 340640 -145381 -26282 -276152 -55893 -61929 130998 -238369 194492
5855 199272 125799 -147743 26158 -84078 -64117 61355 337301 6858 -1122 -341470 -20775
5843 -75501 139166 -55324 96877 -92589 84711 -240399 -87030 -23369 225819 320580 155099
5831 99791 124858 -19798 -76337 -379933 135170 -123916 189294 64557 -344541 152841 116949
5820 116949 -32964 44645 303279 194930 21749 -306414 -33924 126640 99835 30802 129098
5809 129098 -198958 -488632 -109366 83102 -304568 -227689 -35242 -188075 34410 -331853
5798 -122259 47883 72343 -87826 174453 -161095 179104 -35650 50643 78240 393576 -128180
5786 -218937 6394 190803 126535 -222027 222027 2784 289520 116505 -9096 181528 192871
5775 192871 160502 -39374 -83440 -203887 -128539 237658 -84514 38047 -238757 -70044 115032
5763 44510 -93191 -184591 147641 -300442 171747 -212945 -191067 -174196 -204492 -275316 15555
5751 -247008 -212796 125417 -1854 83731 -194922 -100927 24661 197655 -161418 183681 74146
5739 -43709 -335424 10287 -58344 32654 148460 -76234 -334983 -241875 -172095 -58782 6352
5727 -65182 78634 56250 332567 -4411 -276180 -232687 280997 -138569 28201 51106 265961
5716 265961 -36872 -10830 -299431 -99374 45158 -202641 -183844 153534 -190344 -240428 -135039
5705 -135039 33190 -163248 121244 182019 189829 -12674 -43008 172496 139766 126853 -2149
5693 -55581 82036 -16949 -69397 -245909 24716 -94290 33258 -46 154050 238115 172272 139596
5681 139596 -32864 -153222 -58715 27051 82760 -86858 -197662 49344 64099 173910 -23740
5669 -84118 124628 121116 97495 47852 197854 53333 -38630 -73415 -328769 129393 228175
5658 228175 -23653 52226 -237170 124778 -185555 374271 -101754 -328622 -85253 -10140
5647 49622 247097 56007 152308 -208460 57669 -3046 -242903 62809 -161894 -72404 -273250
5636 -273250 332974 -165486 11020 -182325 -222542 366033 278973 211539 -211612 208487
5625 87102 -347285 74399 -64312 -203281 119663 -53993 8870 -66215 -229880 14121 -241350
5613 173986 -175457 150470 206645 35590 -274092 -141362 -36425 260831 -36277 -107735 -160732
5602 -160732 88733 70680 -117664 -22356 211192 271432 254855 -161476 -232918 -111863 66882
5590 -289941 -34085 161533 -93043 -270985 143077 -146040 -220149 298471 -17626 756 -46804
5578 141826 -153745 -144082 -126276 -169904 -63665 323408 250109 -210331 -28783 -225057 105548
5566 143436 -88493 41642 -165204 -103573 21305 -104091 -150887 163558 132652 243229 446652
5555 446652 -278491 120611 109437 105584 301607 -25533 56190 228173 19450 112900 171858
5544 171858 -281313 98390 -108898 68378 -20199 35556 -225268 128667 -99270 -297582 74525
5532 238910 -213313 282247 225165 127472 2333 82511 167602 218417 145980 90568 -191921
5520 -189592 -80557 -109196 130264 78602 53457 30957 -11685 59009 249922 -195096 275625
5508 114475 16142 -29209 -292403 -2877 35631 -17955 -48754 195790 68440 110833 -312559
5496 -242519 27693 -219755 143575 41639 52394 227337 51438 18739 164015 -98224 -244067
5485 -244067 -300288 270642 -78632 183986 -81842 194633 344423 52701 -12133 112003 355716
5474 355716 -17358 -11415 -352429 224279 72387 -111047 52158 -232208 269107 -117405 44368
5462 142028 81824 45708 -225452 387720 -390339 -314382 133448 254477 -51291 15943 38746
5451 38746 -304131 37536 -168243 -110846 328136 484517 -9089 -80158 -209284 -80954 195416
5439 -446292 142891 77714 -49534 43559 47772 -12217 29481 127193 197387 120537 -407183
5427 -40622 -70261 -120908 27844 -211736 -140529 -117041 356491 -111593 -33308 -99909 85162
5415 -10360 474132 234242 -16011 68807 69445 -63957 72527 -47198 -281102 35241 -153487
5403 -42331 -113875 160811 4541 -6298 -20575 -307281 -178065 -150296 -137696 90507 247852
5392 247852 20423 259759 192712 -17709 -221038 114747 108285 101481 253949 475074 -152304
5380 -136697 120236 212115 -217370 175795 131842 -120982 67907 -227706 43735 -98779 305044
5368 128773 -88598 163991 209784 75649 -153819 333919 -126408 268580 -76303 76231 196606
5357 196606 -81171 -124720 63107 40326 -55246 30472 156924 -25573 310094 -91184 -142268
5346 -142268 29455 80269 195761 2374 197284 -248030 -86742 11151 -39421 -161172 -103309
5335 -103309 130522 60447 346176 91269 -230116 -33187 291837 -227330 57354 -193427
5324 -6669 -185773 69049 -294472 -123484 105199 209640 -188314 -380589 23528 -52004 -34761
5313 -34761 -50285 103010 50454 205249 -207669 65622 -429828 -8349 -173283 -179676 -93391
5302 -93391 72300 240020 109700 247928 43894 -162397 193773 271161 227730 -206492 -150968
5291 -150968 -50569 -212639 95059 -58258 -184434 51609 193513 -180941 98003 291648 197311
5280 197311 45655 189082 66418 63345 929 159421 -59048 -56277 23064 68396 -186750 -81658
5267 -55799 16714 -10777 255456 143106 -55345 -32494 -85997 -16535 104778 -60487 34817
5255 55915 -56002 -117753 -51282 231098 -319583 -6816 202776 -128455 -223951 56491 121937
5244 121937 -7381 -247026 292868 -131091 -42813 -112594 90893 47090 -56297 -276615 268833
5232 -210623 70690 248208 -29489 119490 29817 -51904 -291743 31304 -103735 137297 434530
5221 434530 97110 219216 131908 -50895 -49976 223902 186763 218776 72368 52854 8116 -74442
5208 -84705 135713 3958 16629 22122 32207 111292 49166 -1108 -285255 105916 183177 -224677
5195 -77429 -143104 -20797 92420 99860 -50056 -183443 31649 -126309 42992 -116149 9228 70157
5183 70157 17787 149456 -275500 -283254 -43868 -102706 -204166 -525997 244264 -198361 -208176
5172 -208176 164128 -92680 -20126 53185 -49214 -253720 -17283 14431 -107601 43969 -336949
5160 -185415 1166 80108 75177 -219871 56351 62370 -29381 320751 -226637 -418974 101806
5148 -15371 147539 -165924 -280798 -151 188990 -1522 -105705 285172 91840 -11205 114709
5136 12583 -239165 199947 -396601 -96254 134300 -77004 -28404 467961 53581 119315 -155151
5124 -111445 143158 -113561 -267539 109723 -224862 364671 19853 -14012 -134908 -116113
5114 -116113 -61042 -58342 -134149 43667 -132424 120893 -173930 -145653 -8373 -107098 -243671
5103 -243671 24326 -130629 222346 305841 61178 124606 -62842 -128667 -18582 159325 106688
5092 106688 -191242 153467 142877 -153986 -94665 -325918 -76526 -5947 263143 -70457 -3832
5080 199534 166269 -133363 138441 51380 -25414 249113 212955 110426 240399 255861 64363
5068 94517 -121371 -123770 -11147 -80298 -151693 -67893 -124042 -57065 -14052 163592 85865 -133121
5055 -179002 -170179 -100570 -62227 -68575 255749 -3420 -14403 141661 87807 360242 -297575
5043 -9728 -71456 199105 32312 219740 74585 81612 41079 218511 -359031 -64147 -146359
5032 -146359 -127697 76849 17428 -91021 -66304 -215610 34532 -37390 109932 -56708 -225250
5021 -225250 -25076 -73579 -334246 19552 -54808 137410 -63061 -40786 -57349 -211859 -101134
5009 62908 -144874 -107229 43556 -4184 -254427 83113 -43426 49358 357123 -69175 66691
4997 -32691 -57014 140520 84061 358686 -498378 -47735 -123970 147947 48004 152106 -32114
4985 103265 -25724 60814 -58693 -146489 172076 189684 22430 -164882 -304777 131130 -277144
4973 -340710 -84058 -21700 50529 164585 77598 -40781 -65098 -119762 112963 164713 530232
4962 530232 96772 -227548 -303808 -334780 -523160 100965 159832 39046 394610 -121169 165775
4950 147715 173301 15889 60644 137345 -65521 -29091 148519 293434 -306930 88562 -285182
4938 -154050 44376 85989 -161254 -39392 -33388 -444673 42127 -380034 63130 79791 231072
4927 231072 81796 -158945 -121899 -145152 125821 239283 265100 71191 -184269 142588 115174
4916 115174 -101349 -59006 107294 164965 -167576 238298 -123703 94240 -158395 17393
4905 -61823 24201 183673 40863 -106754 -118732 76680 -28655 -18039 -1147 -155449 -3618 -342728
4893 -342728 371540 77059 8627 80766 -143223 57338 -138760 243310 -257526 103870 -101173
4881 -71751 34393 95287 152943 112713 115031 63354 -239096 15068 48770 108487 -146105 -168084
4869 -168084 -329677 50782 -37292 46863 -131415 -154650 230867 -43140 -88705 -108198 -274133
4858 -274133 -215018 38650 144906 118296 -303761 77162 16229 107185 -10880 29593 -326593
4846 -144351 218302 -107142 -9821 133037 -16300 118258 219877 -188076 118200 -157674
4835 110349 -73849 -88693 108918 119087 -107842 -187322 355487 96711 13623 -125498 132533
4823 -40427 152875 42223 226639 137549 418297 -123813 -101059 189857 -45505 -29821 -135214
4812 -135214 -151475 139699 50528 159543 -94098 -77893 359019 -54277 112398 -35164 1024
4800 -254554 74200 132012 24296 -150640 18295 63419 140195 86120 144318 64891 34020
4789 34020 256789 85548 178508 -177097 -145607 -9578 293789 186860 76312 44142 -148888
4777 -41965 -123751 96425 1596 90705 -130821 315241 19301 -131217 108092 43612 334792
4766 334792 -52761 -193421 -3584 185970 -202791 28747 148018 73610 -20317 188750 -48955
4754 181756 -65277 -914 30331 79240 -94106 113726 -179192 13669 -4368 -180407 215127
4742 -39987 -6831 103390 -81667 -345161 31738 -17436 -643 233904 64775 209529 -49156 -25844
4730 -25844 -19398 96161 171472 163653 5900 -64509 341942 3196 3420 34782 143418 -350100
4717 17637 142044 -278144 -132964 -113586 274733 361605 85053 -55321 1320 69596 -113418
4705 132310 -133104 -81190 -86258 32209 6721 -253513 -2213 102359 -373002 -186905 139209
4693 -151138 73947 18364 -1606 113354 155903 -277755 90064 -195193 71740 46026 -105158
4681 26487 344095 -102547 -157204 -94201 -185041 -203799 1581 45776 202378 -42412 -188194
4670 -188194 -37248 -150055 -205424 -129205 -85743 117628 271344 113469 348094 248933 -75088
4658 -119073 -59334 59566 -64871 45136 32546 89505 42037 -58956 58606 140124 234800 135976
4646 135976 142054 11092 42496 102204 -62850 23475 232084 -82605 177470 -184576 -16896
4634 -160379 -172831 -295112 -43865 103240 97106 210761 -23860 92023 5666 221487 -210108
4622 -226890 309197 -202086 190130 56691 213243 -72435 87733 47414 -77162 -333314 358087
4610 -18604 446261 102366 159506 284247 76572 288055 -73754 -205858 244471 -156574
4599 -206560 126261 -36178 -186984 -196758 -99239 -272398 -122513 376065 -68794 145782 -290250
4587 -121710 112597 -279433 36232 78505 182179 100538 108098 -9350 34480 -107837 -46836
4575 -252892 -151582 -198604 133839 130510 260730 -121665 187095 -36465 241811 401418
4565 401418 27836 67058 259034 305076 -58567 -265688 138014 39658 -284517 247642 257303
4554 257303 264635 -7349 55475 -38327 326142 -179047 23871 -87044 298327 -323228 42158
4542 283667 -45845 -4770 246075 -190934 383597 192447 45415 -158495 -153419 -314251 278006
4530 128607 55509 78672 92350 3104 -195541 258150 -88427 9090 184953 311866 -67214
4518 183856 121569 171713 -34404 33558 41898 -170354 -14250 -23282 -264024 47152 233974
4507 233974 36081 7772 -335321 -43076 -197584 116616 129084 251321 -130310 -168724 29836
4495 -79939 -67919 80790 149145 220218 -72577 123005 -81221 83825 -419037 -381862 175017
$$ [...]
##END NTUPLES=NMR SPECTRUM
##END=
