
##TITLE=AC1323_SBUAH12152_6608618_oEfHGj1OAB
##JCAMPDX= 6.0         $$ Bruker NMR JCAMP-DX V2.0
##DATA TYPE= NMR SPECTRUM
##DATA CLASS= NTUPLES
##ORIGIN= BRUKER
##OWNER= Administrator
$$ 1.72 TOPSPIN		Version 2.1
$$ 2012-08-01 15:42:06.343 -0500  Administrator@TOPSPIN
$$ Compression mode = diff/dup
##.OBSERVE FREQUENCY= 400.02188249412
##.OBSERVE NUCLEUS= ^1H
##.ACQUISITION MODE= SIMULTANEOUS (DQD)
##.ACQUISITION SCHEME= undefined
##.AVERAGES= 8
##.DIGITISER RES= 22
##SPECTROMETER/DATA SYSTEM= spect
##.PULSE SEQUENCE= zg30
##.SOLVENT NAME= COFFEE_meoh
##.SHIFT REFERENCE= INTERNAL, COFFEE_meoh, 1, 14.98509
##AUDIT TRAIL= $$ (NUMBER, WHEN, WHO, WHERE, PROCESS, VERSION, WHAT)
$$ ##TITLE= Audit trail, TOPSPIN		Version 2.1
$$ ##JCAMPDX= 5.01
$$ ##ORIGIN= Bruker BioSpin GmbH
$$ ##OWNER= Administrator
$$ $$ C:\Bruker\TOPSPIN/data/COFFEE/nmr/AC1323_SBUAH12152_6608618_oEfHGj1OAB/10/pdata/1/auditp.txt
$$ ##AUDIT TRAIL=  $$ (NUMBER, WHEN, WHO, WHERE, PROCESS, VERSION, WHAT)
(   1,<2012-08-01 15:41:59.343 -0500>,<Administrator>,<TOPSPIN>,<go>,<TOPSPIN 2.1>,
      <created by zg
	started at 2012-08-01 15:40:52.921 -0500,
	POWCHK enabled, PULCHK disabled,
       configuration hash MD5:
       6B 1B 68 BB D9 2E 58 E2 7F 35 AD 54 07 DF 0E 41
       data hash MD5: 64K
       12 D1 33 CF C0 A4 32 30 F6 3E 0C 36 BF 0B 26 52>)
(   2,<2012-08-01 15:42:02.015 -0500>,<Administrator>,<TOPSPIN>,<proc1d>,<TOPSPIN 2.1>,
      <Start of raw data processing
       efp LB = 0 FT_mod = 6 PKNL = 1 PHC0 = 0 PHC1 = 0 SI = 32K 
       data hash MD5: 32K
       A8 7A A3 78 99 41 15 33 C9 D5 B3 55 F4 31 2C FE>)
(   3,<2012-08-01 15:42:02.406 -0500>,<Administrator>,<TOPSPIN>,<proc1d>,<TOPSPIN 2.1>,
      <pk PHC0 = 177.2864 PHC1 = 0 
       data hash MD5: 32K
       1A F9 66 15 E6 EB AD CB 4F 70 F4 5D F6 5C 68 56>)
(   4,<2012-08-01 15:42:02.515 -0500>,<Administrator>,<TOPSPIN>,<proc1d>,<TOPSPIN 2.1>,
      <abs ABSG = 1 
       data hash MD5: 32K
       9B F7 4D 68 E0 37 23 78 53 93 FC D7 67 95 68 EB>)
(   5,<2012-08-01 15:42:02.546 -0500>,<Administrator>,<TOPSPIN>,<proc1d>,<TOPSPIN 2.1>,
      <abs ABSG = 2 
       data hash MD5: 32K
       0B AD 10 C2 9C 9C AB B5 62 97 A4 C9 3B DC CE 55>)
(   6,<2012-08-01 15:42:02.593 -0500>,<Administrator>,<TOPSPIN>,<proc1d>,<TOPSPIN 2.1>,
      <abs ABSG = 3 
       data hash MD5: 32K
       13 94 E1 CF 76 90 D6 0A 69 E2 34 53 44 56 39 47>)
(   7,<2012-08-01 15:42:02.625 -0500>,<Administrator>,<TOPSPIN>,<proc1d>,<TOPSPIN 2.1>,
      <abs ABSG = 4 
       data hash MD5: 32K
       C1 C7 D2 82 5B 1A 85 3F A8 60 B7 B9 8F 59 B4 3C>)
(   8,<2012-08-01 15:42:02.656 -0500>,<Administrator>,<TOPSPIN>,<proc1d>,<TOPSPIN 2.1>,
      <abs ABSG = 5 
       data hash MD5: 32K
       30 C5 C9 41 FD 88 6A F5 C4 4F 69 9D AF C4 61 06>)
$$ ##END=
$$ 
$$ $$ hash MD5
$$ $$ 5D BB EC 6B 9B 3E FE E9 8A 7A 6D 8D 97 49 E2 A1
##$RELAX= 
##$RELAX= 
##$RELAX= 
##$RELAX= 
##$RELAX= 
##$RELAX= 
##$RELAX= 
$$ Bruker specific parameters
$$ --------------------------
$$ [...]
150 150 150 150 150 150 150 150
##$TP07= 0
##$TPNAME0= <>
##$TPNAME1= <>
##$TPNAME2= <>
##$TPNAME3= <>
##$TPNAME4= <>
##$TPNAME5= <>
##$TPNAME6= <>
##$TPNAME7= <>
##$TPOAL= (0..7)
0.5 0.5 0.5 0.5 0.5 0.5 0.5 0.5
##$TPOFFS= (0..7)
0 0 0 0 0 0 0 0
##$TUNHIN= 0
##$TUNHOUT= 0
##$TUNXOUT= 0
##$USERA1= <user>
##$USERA2= <user>
##$USERA3= <user>
##$USERA4= <user>
##$USERA5= <user>
##$V9= 5
##$VALIST= <valist>
##$VCLIST= <CCCCCCCCCCCCCCC>
##$VD= 0
##$VDLIST= <DDDDDDDDDDDDDDD>
##$VPLIST= <PPPPPPPPPPPPPPP>
##$VTLIST= <TTTTTTTTTTTTTTT>
##$WBST= 1024
##$WBSW= 4
##$XGAIN= (0..3)
0 0 0 0
##$XL= 0
##$YL= 0
##$YMAX_a= 472564
##$YMIN_a= -617379
##$ZGOPTNS= <>
##$ZL1= 120
##$ZL2= 120
##$ZL3= 120
##$ZL4= 120
##$ABSF1= 14.98509
##$ABSF2= -5.573092
##$ABSG= 5
##$ABSL= 3
##$ALPHA= 0
##$AQORDER= 0
##$ASSFAC= 0
##$ASSFACI= 0
##$ASSFACX= 0
##$ASSWID= 0
##$AUNMP= <proc_prof1d_extract_pilot.lims>
##$AXLEFT= 0
##$AXNAME= <>
##$AXNUC= <1H>
##$AXRIGHT= 0
##$AXTYPE= 0
##$AXUNIT= <>
##$AZFE= 0.1
##$AZFW= 0.1
##$BCFW= 0
##$BC_mod= 0
##$BYTORDP= 0
##$COROFFS= 0
##$CY= 15
##$DATMOD= 1
##$DC= 0
##$DFILT= <>
##$DTYPP= 0
##$F1P= 0
##$F2P= 0
##$FCOR= 0.5
##$FTSIZE= 32768
##$FT_mod= 6
##$GAMMA= 0
##$GB= 0
##$INTBC= 1
##$INTSCL= 1
##$ISEN= 128
##$LB= 0
##$LEV0= 0
##$LPBIN= 0
##$MAXI= 10000
##$MC2= 0
##$MEAN= 0
##$ME_mod= 0
##$MI= 0
##$NCOEF= 0
##$NC_proc= -8
##$NLEV= 6
##$NOISF1= 0
##$NOISF2= 0
##$NSP= 0
##$NTH_PI= 0
##$NZP= 0
##$OFFSET= 14.98509
##$PC= 1
##$PHC0= 177.2864
##$PHC1= 0
##$PH_mod= 1
##$PKNL= yes
##$PPARMOD= 0
##$PPDIAG= 0
##$PPIPTYP= 0
##$PPMPNUM= 2147483647
##$PPRESOL= 1
##$PSCAL= 4
##$PSIGN= 0
##$PYNMP= <proc.py>
##$REVERSE= no
##$SF= 400.02
##$SI= 32768
##$SIGF1= 0
##$SIGF2= 0
##$SINO= 400
##$SIOLD= 32768
##$SPECTYP= <>
##$SREGLST= <1H.CDCl3>
##$SSB= 0
##$STSI= 32768
##$STSR= 0
##$SW_p= 8223.68421052631
##$SYMM= 0
##$S_DEV= 0
##$TDeff= 65536
##$TDoff= 0
##$TI= <>
##$TILT= no
##$TM1= 0
##$TM2= 0
##$TOPLEV= 0
##$USERP1= <user>
##$USERP2= <user>
##$USERP3= <user>
##$USERP4= <user>
##$USERP5= <user>
##$WDW= 1
##$XDIM= 32768
##$YMAX_p= 461687142
##$YMIN_p= -648972
##$CURPLOT= <Network HP LaserJet P1505>
##$CURPRIN= <$Network HP LaserJet P1505>
##$DFORMAT= <normdp>
##$LAYOUT= <+/1D_H.xwp>
##$LFORMAT= <normlp>
##$PFORMAT= <normpl>
##$SURQMSG= 1
$$ End of Bruker specific parameters
$$ ---------------------------------
##NTUPLES= NMR SPECTRUM
##VAR_NAME=  FREQUENCY,     SPECTRUM/REAL,   SPECTRUM/IMAG
##SYMBOL=    X,             R,               I
##VAR_TYPE=  INDEPENDENT,   DEPENDENT,       DEPENDENT
##VAR_FORM=  AFFN,          ASDF,            ASDF
##VAR_DIM=   32768,         32768,           32768
##UNITS=     HZ,            ARBITRARY UNITS, ARBITRARY UNITS
##FACTOR=    0.250966925370066, 1,           1
##FIRST=     8223.43324360094, 82859,        133431
##LAST=      0,             195225,          -167689
##MIN=       0,             -648972,         0
##MAX=       8223.43324360094, 461687142,    0
$$ Real data points
##PAGE= N=1
##DATA TABLE= (X++(R..R)), XYDATA
$$ [...]
19466d66274E1837J12303b39566d3511A26070J09238a85236N7509c9685C1515
19455a66923D6409K3945c67738i2602j62531I847M3320i2775c5276A99b61785
19443D088b7966l45822a04328M1808k76514O0294K3654j7910L4550j62475J05580
19432b95341D6794k090g1847A04487c8610j64969c7687A45291m5131a44063A88200
19420d18005i9878j50519A09466E1659b12364A24625L9623a63668f3345k66063
19410c29408B79409g0015l0562q9460R1304D6345d6698c962l52702J75045o8205
19399b49824J15527E1695f0980K1896A4959J0109J78980q7106c92293C5517d3021
19387d5322p9000A78832J07252b26544L997A09662I364O3470a2645j19310n5451
$$ plain form
19466 -466274 51837 164140 -239566 -43511 126070 235308 -185236 -127727 -39685 31515
19455 -166923 46409 70354 -367738 -92602 -255133 9847 53167 -92775 -35276 199 -261785
19443 4088 -27966 -373788 -104328 -62520 -339034 -278740 -255086 -272996 -238446 -400921 -295341
19432 -295341 46794 44704 -71847 104487 -38610 -203579 -37687 145291 100160 -144063 188200
19420 -418005 -99878 -250397 109466 51659 -212364 124625 164248 -163668 -63345 -329408
19410 -329408 279409 -70015 -100577 -190037 -98733 46345 -46698 -3962 -356664 -181619 -249824
19399 -249824 -134297 51695 -60980 -39084 14959 25068 204048 116942 -392293 35517 -43021
19387 -45322 -124322 178832 286084 -226544 -222547 109662 9364 72834 -12645 -131955 -187406
19376a87406j43292A21328a19493I4917a56473a2867k05023k6117I1671b4362
19365E2277J35214a40057d6766B0500a3286j47190q4815L8661A2102a01036a7040
19353G1032Q5910a02372C37977g243B520K734a72246J3788G6078d4587k27945
19342b72532o2674B11025e49736J11898C041K16407a22680M4895l7954F1925A1655
19330E0381J95620F2855J61943e45289a68487K368A91617H9336e9607C3713K71203
19319C04916B4991e6568I3315c1522A35068d65090J55995B5145O907b39603e9839
19307b5831H0580K2242A6622b54397a13318C48283G4507b29518A56505b12014
19296A36429b02986A9440K54872a46632n3164k3609l6964A61414A9069K78747
$$ plain form
19376 -187406 -330698 121328 -119493 94917 -156473 -12867 -217890 -244007 91671 -24362
19365 52277 187491 -140057 -46766 20500 -13286 -160476 -245291 -206630 12102 -101036 -17040
19353 71032 156942 -102372 337977 -7243 2520 5254 -172246 -158458 76078 -44587 -272532
19342 -272532 -335206 211025 -549736 -437838 3041 219448 -122680 -77785 -115739 61925 11655
19330 50381 246001 62855 224798 -545289 -168487 -166119 191617 89336 -59607 33713 304916
19319 304916 24991 -56568 93315 -31522 135068 -465090 -309095 25145 32052 -239603 -59839
19307 -25831 80580 102822 16622 -254397 -113318 348283 74507 -229518 156505 -212014
19296 136429 -202986 19440 274312 -146632 -199796 -223405 -260369 161414 19069 297816
19286B97816b99908B41720d1561k08345K2449L7184b3113j30165C48854c6784
19275c190C058a99807a4319k4635C0529J79774c5075j69547i902l8115j17553
19264a65570M2710C45307c10933a30102B51422I2242A5595b14958Q1377e9744
19253E20942b30712h9335b4758g167l34082H6373Q036b03776P2784A18389m3829
19242G4560M6168d9854r4974B63264a4483j95845M5056k9187C0821K6539A9064
19230B3476b30983A48485i1215j28809D9539f3180j83355F7878a83455C2219b77505
19218b60499A01935n937a41570q2070k0230J18583L6412A21040c15912C0879i9075
19206B55429J58531a10121K202k03361B8915J01178b7647j33672j08791G961d9501
$$ plain form
19286 297816 -299908 241720 -41561 -249906 -227457 -190273 -23113 -153278 348854 -36784
19275 -3190 3058 -199807 -14319 -38954 30529 210303 -35075 -204622 -9902 -48017 -165570
19264 -165570 -122860 345307 -310933 -130102 251422 92242 15595 -214958 -133581 -59744
19253 520942 -230712 -89335 -24758 -7167 -341249 86373 94409 -203776 -130992 118389 74560
19242 74560 120728 -49854 -144828 263264 -14483 -210328 -165272 -194459 30821 57360 19064
19230 23476 -230983 148485 -91215 -220024 49539 -63180 -246535 67878 -183455 32219 -277505
19218 -260499 101935 95998 -141570 -223640 -243870 -125287 -88875 121040 -315912 30879 -99075
19206 255429 413960 -110121 -107919 -311280 28915 130093 -27647 -161319 -270110 7961 -49501
19194H9458f4595k09304A02987c48132B22043I7778a46216N00r4280l9339a29305
19182c13018K7837B3582f2088B00537K16889d030F4928B1295c7190l7211B08617
19170D6927K93288j42069b71088G915K8930b34927M3023j59322a10862j82425
19160b93287j82504B32742b59699c9929H7268b53481f0863B07483E0143b19852
19149a67624B34621d0032l9867o3579A77222a35475N7438B43612m0982R175D7000
19137a44784C0621a66757c6010B34240b06484E061a88924L303B01777E7317a21963
19125a59360A2105K01316C210f1233J9302j6972B66488E0040R9094a88599A1162
19113I7991e5096E7415g5539B61196f1651r7963r6676c1386r1373A3168O3172
$$ plain form
19194 89458 -64595 -273899 102987 -348132 222043 97778 -146216 -145716 -239996 -279335 -129305
19182 -313018 -285181 23582 -62088 200537 417426 -4030 64928 21295 -37190 -74401 208617
19170 46927 340215 198146 -271088 7915 36845 -234927 -191904 -351226 -110862 -293287
19160 -293287 -475791 232742 -259699 -39929 87268 -253481 -60863 207483 50143 -219852
19149 -167624 234621 -40032 -79899 -143478 177222 -135475 -78037 243612 202630 211805 47000
19137 -144784 30621 -166757 -36010 234240 -206484 5061 -188924 -185621 201777 57317 -121963
19125 -159360 12105 213421 3210 -61233 -41931 -58903 266488 50040 149134 -188599 11162
19113 97991 -55096 57415 -75539 261196 -61651 -159614 -256290 -31386 -122759 13168 76340
19102G6340a35399d5907l18533a5503B35729b2451l00886a04187B00875e4620
19091A53618i4725d6368D6812L748K6247a54946m0697H8541b55185c5399k975
19080c8374k08614A55278c22150A6768a26844B64556a15797j12746B30732e7066
19069A51766k2465B7580b05498l5095k8459j638B38679a16652j77157N9382K737
19058b31690K3525N5628N5419j0147I9907b8071m5606k05025A31811d0576B25569
19046e1006q4612A04259a14067M1356A44074e2559P27A95321a50461c7996k88875
19035c26871C07862D9456k4112M8663c0993q0426N537o5677f4388I6824f0219
19023E2893b7076l5114Q741C04285n2124h0402A65542a32897A27315b42414J19713
$$ plain form
19102 76340 -135399 -45907 -364440 -15503 235729 -22451 -323337 -104187 200875 -54620
19091 153618 -94725 -46368 46812 50560 76807 -154946 -195643 88541 -255185 -35399 -38374
19080 -38374 -246988 155278 -322150 16768 -126844 264556 -115797 -228543 230732 -57066
19069 151766 129301 27580 -205498 -240593 -269052 -270690 238679 -116652 -293809 -234427 -231690
19058 -231690 -208165 -152537 -97118 -107265 99907 -28071 -73677 -278702 131811 -40576 225569
19046 -51006 -135618 104259 -114067 -72711 144074 -52559 -51832 195321 -150461 -37996 -326871
19035 -326871 307862 49456 25344 74007 -30993 -111419 -105882 -171559 -64388 96824 -60219
19023 52893 -27076 -62190 -53449 304285 252161 -80402 165542 -132897 127315 -242414 -122701
19012a22701j67852E1590R1621a62713l1686R710m2921a4842B57235c7583j84246
19001b21829p3077h4161n0535L8195I8035p150n799c57049A93740b2646r8944
18990a21590M7935I4410a58109j62686a33757C71096b52448b507B0495f1955F9869
18978C5107J03638a89452h3704G2885P0214C0975J46744Q61520D03382A10286
18967f1164D88058D3691a31957b20D9531a31276b3383j98095A19071b14523A31195
18955B72792a51694B2092a95970A82760o6769d0686A48467m7279O157D5359L6672
18944H2031a23148G814K47129H8351I301J26211g3239l3437D3662a25881A49655
18932A14918a43833p6152H2293d1350l07098B54398n5775a4785A30975g8204L2576
$$ plain form
19012 -122701 -290553 51590 143211 -162713 -194399 -184689 -227610 -14842 257235 -37583 -221829
19001 -221829 -294906 -84161 -134696 -96501 98035 90885 85086 -357049 193740 -22646 -121590
18990 -121590 -73655 94410 -158109 -320795 -133757 371096 -252448 -2507 20495 -61955 69869
18978 35107 138745 -189452 -83704 72885 143099 30975 177719 1039239 403382 110286
18967 -61164 488058 43691 -131957 -220 49531 -131276 -23383 -221478 119071 -214523 131195
18955 272792 -151694 22092 -195970 182760 115991 -40686 148467 101188 107345 45359 82031
18944 82031 -123148 7814 254943 88351 9301 135512 -73239 -106676 43662 -125881 149655
18932 114918 -143833 -219985 82293 -41350 -348448 254398 198623 -14785 130975 -78204 -45628
18921d5628K0374n0155b2817k98A66009m0453a39351d7018A43598J10911B1031
18909A81677J59991K88103J5966k48507d7616A12006K31009c77337J31030O5404
18899a80903A75871c2466E7782b35330j41109A54216a01059G6625Q610a82285
18888b28104c2666C4165f4881j27464A24826g2910j98724k27N6087d9033A05970
18876e52160A28720c2558J5666k49891P6189p3722j07716h1840A33854a30380
18865d0187a6938E5091N3420c5423C4958a2130B55595a19314I4299L2583a96485
18853c9971N407G3954b8579A58463a23327M3210j0593A12860O6039i8965l69760
18842d68725d0504m2296o7026C32214A30385a42191j78120B64611b73841j54154
$$ plain form
18921 -45628 -25254 -75409 -22817 -23115 166009 125556 -139351 -47018 143598 254509 21031
18909 181677 341668 629771 645737 397230 -47616 112006 343015 -377337 -246307 -180903
18899 -180903 175871 -32466 57782 -235330 -376439 154216 -101059 76625 85235 -182285
18888 -228104 -32666 34165 -64881 -192345 124826 -72910 -271634 -271861 -215774 -49033 105970
18876 -552160 128720 -32558 -16892 -266783 -190594 -264316 -372032 -81840 133854 -130380
18865 -40187 -16938 55091 108511 -35423 34958 -12130 255595 -119314 94299 126882 -196485
18853 -39971 -34564 73954 -28579 158463 -123327 -80117 -90710 112860 178899 -98965 -468725
18842 -468725 -40504 -82800 -149826 332214 130385 -142191 -320311 264611 -273841 -427995
18832d27995J99541c3241j84912Q6183e1321B19244f9897F9547a31863C576R5361
18821I8937a33343f6454I116d07421C6404a74736H0123K28194A859g4498A53457
18809a97406B49695J19365C8852f6131B92906L6395b0694j10565A76157H6861
18798B18471I647c42007I9564f9804j95962B9993M6210b49275A36852a2156n5432
18787f7588j87211d3156B49213a7912F9063R1390c45976a31176p184L1525k26600
18776c33435a06591l04777J53133c7176D441a94421h4631A4362b59100d6692G5392
18764e8994p6544M9005a2875l73252O7966E881K0207P9390K9503a19612F8863
18752G550c84267a42909A63873l9309a61397N6018L7044K0528A481J6189c05399
$$ plain form
18832 -427995 -228454 -33241 -218153 -131970 -51321 219244 -69897 69547 -131863 3576 98937
18821 98937 -133343 -66454 9116 -407421 36404 -174736 80123 308317 1859 -74498 153457
18809 -197406 249695 369060 38852 -66131 292906 329301 -20694 -131259 176157 86861
18798 218471 9647 -342007 99564 -69804 -265766 29993 76203 -249275 136852 -12156 -67588
18787 -67588 -254799 -43156 249213 -17912 69063 160453 -345976 -131176 -138360 -106835 -333435
18776 -333435 -106591 -411368 -258235 -37176 4441 -194421 -84631 14362 -259100 -46692 75392
18764 -58994 -135538 -86533 -12875 -386127 -318161 5881 26088 105478 134981 -119612 68863
18752 7550 -384267 -142909 163873 124564 -161397 -105379 -68335 -47807 1481 17670 -305399
18740B1069E336K31183c11632b9594n5769A3042c69220B6499K6798a92719l1942
18729b24661B6306J13980d3970j883A42190a03909j40818a17281k6483b6575k58534
18718b85109g9572n9429f4445o2972B52910a10116j45814j62476J10142a967B74218
18706B98435c69149J77573M5704k14811a16739I4534b59442o6497A82200a25008
18695a91722L6745L034a2813A45649f3693k23294R3424k04271a93213M8879e3467
18683d2825A88209c22253G3705J54662b34815Q8220B11712j9420c91271a10741
18672E4067a73622D5159e3108r4169E259a09980A7816K54546b67841b1802r7495
18661a19297d4935k68678G0598b22662g6965j31838R9177j10145C4356d2301k09428
$$ plain form
18740 21069 5336 236519 -311632 -29594 -85363 13042 -369220 26499 53297 -192719 -224661
18729 -224661 26306 140286 -43970 -45853 142190 -103909 -244727 -117281 -143764 -26575 -285109
18718 -285109 -79572 -139001 -64445 -127417 252910 -110116 -255930 -418406 -308264 -1967 274218
18706 298435 -369149 -191576 -145872 -360683 -116739 94534 -259442 -325939 182200 -125008
18695 -191722 -154977 -151943 -12813 145649 -63693 -286987 -193563 -397834 -193213 -144334 -53467
18683 -42825 188209 -322253 73705 228367 -234815 -146595 211712 192292 -391271 -110741
18672 54067 -173622 45159 -53108 -147277 5259 -109980 17816 272362 -267841 -21802 -119297
18661 -119297 -44935 -313613 70598 -222662 -76965 -208803 -109626 -219771 34356 -42301 -251729
18650b51729A8512J38982H346c0442l069D21784c81707A29764b17012E3824a58691
18638b9712j36511e4634j14523k7711j29674d9711C1347O9086C2277b71428O9624
18627b01804k61787g8006C6982a08962j4673j24235J20025j41956J30884O8107
18617g0810b9072k4964A7021K2431K23502A27297b04825E9791Q6599D4235L5164
18606G9399l2440d9187B3031f5423q8260A19535P3516b97238J28478j76590G6365
18594d0609A00710D7038k1359a33491o8759C82450a75387D4262K19082a4479A31910
18582F3411m979a5809A68356a46695A18066J47791b08734d7911b3692A42161M8566
18571A90727J77438B0057a01193M840F0263j126c1464o8894l58455a88045A78140
$$ plain form
18650 -251729 18512 157494 8346 -30442 -33511 421784 -381707 129764 -217012 53824 -158691
18638 -29712 -166223 -54634 -169157 -196868 -326542 -49711 31347 100433 32277 -271428 -201804
18627 -201804 -463591 -78006 36982 -108962 -123635 -247870 -127845 -269801 -138917 -70810
18617 -70810 -29072 -54036 17021 39452 262954 127297 -204825 59791 146390 44235 79399
18606 79399 46959 -49187 23031 -65423 -153683 119535 193051 -297238 -168760 -345350 76365
18594 -40609 100710 47038 25679 -133491 -202250 382450 -175387 44262 263344 -14479 131910
18582 63411 58432 -15809 168356 -146695 118066 265857 -208734 -47911 -23692 142161 190727
18571 190727 368165 20057 -101193 -96353 60263 59137 -31464 -100358 -458813 -188045 178140
18559B9800d3409E9677a00546b0203j77957N5092H849b40756N2789A2070J42054
18548A54124a9485B02154f3861J2648I4918d302k33375R6520A9472b54770Q0213
18537a74557K0152G4023q538b18861k58133a28626A57344C9484L6397b10066L1737
18526a78329A54664D6292c3694r4277K7292k2939I8142h1029d970C2201g2635
18514a0294k52428C5136J56090i1586a789k62393A16040b45897H3146P1227b4469
18502B37836H4639C4405a52317d9312A02573a0090j1763B3833K37613e6406B84395
18490b41297q5195F7874N5805N2055a16082c3166C756a35076j3802e4526k41878
18479b96404b7176A23542a43653a0583A74685a65231b0447j95725R9214B4523
$$ plain form
18559 29800 -43409 59677 -100546 -20203 -198160 -143068 8849 -240756 -187967 12070 154124
18548 154124 -19485 202154 -63861 -51213 94918 -4302 -237677 -141157 19472 -254770 -174557
18537 -174557 -154405 74023 65485 -218861 -476994 -128626 157344 39484 75881 -210066 -178329
18526 -178329 154664 46292 -33694 -127971 -100679 -123618 98142 -81029 -4970 32201 -72635
18514 -10294 -262722 35136 191226 -91586 -1789 -264182 116040 -245897 83146 154373 -24469
18502 237836 84639 34405 -152317 -49312 102573 -10090 -21853 23833 261446 -56406 284395
18490 -241297 -326492 67874 123679 175734 -116082 -33166 3756 -135076 -148878 -54526 -296404
18479 -296404 -27176 123542 -143653 -10583 174685 -165231 -20447 -216172 -116958 24523
18468b39826b8226j11757j1182o3903J03199j64571b8309a2605j25598e6822j70699
18457b27521C5082J1285J0134K37760b83366e4740k8163D7034J1551B138b36347
18445B08400a25940l4944e4110j17615B50272c33086C8894a53340G081g2601q334
18434h0935k08507G1250K23208a33854M9596n65A3955b03068A57158b4019l67292
18423c91311D9561a16216B56489F9060K89194p5294a13353j17695F3159c06960
18412A57519i3715A20580d0378J8081C44868d4489A02444b48785A20498f2604
18401a78784a2049B83686L2656A42502Q7168a00402C25075b47703g9996J6062
18391f3934B23253A07897m4431J20998h9639K6173F7127J0263i3394B69158c17067
$$ plain form
18468 -239826 -28226 -139983 -151165 -215068 -111869 -276440 -28309 -12605 -138203 -56822 -227521
18457 -227521 35082 46367 56501 294261 -283366 -54740 -82903 47034 58585 2138 -236347
18445 208400 -125940 -160884 -54110 -171725 250272 -333086 38894 -153340 7081 -72601 -80935
18434 -80935 -289442 71250 294458 -133854 -84258 -84823 13955 -203068 157158 -24019 -391311
18423 -391311 49561 -116216 256489 69060 358254 282960 -113353 -231048 63159 -306960
18412 157519 -93715 120580 -40378 -22297 344868 -44489 102444 -248785 120498 -62604
18401 -178784 -12049 283686 316342 142502 229670 -100402 325075 -247703 -79996 -63934
18391 -63934 223253 107897 63466 184464 -89639 -63466 67127 77390 -93394 269158 -317067
18379b22259H1282F257a37064p177F890K21576b95719R9106O3968A54880L0540
18368A85420J33681F0994c6449j13834a1938o4182l639B92400h6368H8072d5061
18356b6929j85341b8769C2630J66037B5925K06349i3635o1745B3403a09168q9890
18345a99058A40271d56628G3554M8148a87898a3474m23350J79384B9174J02917
18335A32091N2618i1760B6698J14584A2496c23871J12966A05879J3952b12773
18324A22287b69352b1750j7714A4003J28784A8035J32464a16404k2305A89075
18313i1711a7387o3957B41622q8729a7448L161C4607b01871a7602j47202p1434
18302b36238h6844k78643C0737A0944i3439k4930b9902j94906m4154H7559l1053
$$ plain form
18379 -222259 81282 6257 -137064 -144241 6890 228466 -295719 -196613 -132645 154880 185420
18368 185420 319101 60994 -36449 -150283 -11938 -76120 -79759 292400 -86368 88072 -45061
18356 -26929 -212270 -28769 32630 198667 25925 232274 -93635 -155380 23403 -109168 -199058
18345 -199058 140271 -456628 73554 121702 -187898 -13474 -436824 -257440 29174 132091
18335 132091 184709 -91760 26698 141282 12496 -323871 -210905 105879 119831 -212773
18324 122287 -269352 -21750 -39464 14003 142787 18035 150499 -116404 -138709 189075
18313 -91711 -17387 -81344 241622 152893 -17448 -14287 34607 -201871 -17602 -164804 -236238
18302 -236238 -86844 -365487 30737 10944 -93439 -118369 -29902 -224808 -268962 87559 56506
18291E6506O2514g556l12841A88849a12473j33770I2580a98932C66054c50020
18280E4486a23036r9237P4728D2608b18368B338e545j40967j50600D7825h9751
18268a23922j54933a20738j2906F10277g0694G8530K09431D3863b40115b8416
18257a74720H0382b83937J26380k5548O7123K3467q808n7158e770l74704D7335
18245A05487R9760i0163j27210A0977P1323J12644E4527h2894j56701A86093a45640
18233e3534j35890d6061r5282B56817a43126d8703j49147K9451l0962O855A83170
18221b64430c7045A18768J93476A05373a01133A50760N4753d5435G282J81693
18211A88975J0671a02632a9671m7277j6533k05396b3556k67448A56384Q151i2009
$$ plain form
18291 56506 119020 -7556 -320397 188849 -112473 -246243 92580 -198932 366054 -350020
18280 54486 -123036 -222273 -147545 42608 -218368 2338 -5545 -146512 -297112 47825 -89751
18268 -123922 -278855 -120738 -133644 610277 -70694 78530 287961 43863 -240115 -28416
18257 -174720 80382 -283937 -157557 -183105 -115982 -92515 -101323 -158481 -5770 -380474 47335
18245 105487 205247 -90163 -217373 10977 82300 194944 54527 -82894 -239595 186093 -145640
18233 -53534 -189424 -46061 -141343 256817 -143126 -48703 -197850 -168399 -199361 -192506 183170
18221 -264430 -37045 118768 312244 105373 -101133 150760 205513 -45435 7282 188975
18211 188975 199646 -102632 -19671 -66948 -83481 -288877 -23556 -291004 156384 164535 -92009
18199B8847b05235a0372k19639H4101j6808a73609A33816n9604f3193l9062F5680
18187a29987C7862a30281d9922o8558j08111A58603J74301j63998J37528D4386
18176B4212b29039l4725e7667o9705j0121F8J13684J73934A34761a77031b942
18164b37074B57745p2811c7023l2841B18357b23682h8191B31235i9427G3340o286
18153F7054c42252A31267g4811B8219d1867j8375n5963A37572m5576J2080J38798
18142B42874m1672o8183l0298P991j3492e5200B83615A1424a57330N5425j04624
18131b06529P0918M3398A59686a66881A72793J38102c3880H2807a46969M5753
18121a01216C3007J9723K3434J37003C4667b33307L562H9930O8554c83763a03326
$$ plain form
18199 28847 -205235 -10372 -230011 84101 67293 -173609 133816 74212 -63193 -102255 65680
18187 -129987 37862 -130281 -49922 -118480 -226591 158603 332904 168906 306434 44386
18176 24212 -229039 -263764 -57667 -127372 -137493 68 113752 287686 134761 -177031 -2942
18164 -237074 257745 184934 -37023 -69864 218357 -223682 -88191 231235 -99427 73340 67054
18153 67054 -342252 131267 -74811 28219 -41867 -60242 -116205 137572 91996 104076 242874
18142 242874 201202 133019 102721 110712 97220 -55200 283615 11424 -157330 -101905 -206529
18131 -206529 -135611 -92213 159686 -166881 172793 310895 -33880 82807 -146969 -101216
18121 -101216 33007 52730 76164 213167 34667 -233307 -229745 89930 158484 -383763 -103326
18109A53572o8874b78558b1561j97854B16491c4591j1579n6038h21j56711B81062
18097a73119j05702B43201d806A14156c09708A06093J92321e9624A14940d56009
18086B88984G8463G931a128j70439B50822b42229A7777L4061h9384A7984a65451
18074c9011A94142b8676Q726B12125p4119a7935j98398h4739b4088m6171j55519
18063b25778b5035o9328L7079j09217A503K56288A5117a31162j28624B26858G1845
18051b1792F6430J60289a22848K9924d2697D1627g9015a8461q1366j46823J03522
18040a43128C1604H210b17566H7533K15421a60961e6708L753B97401g1385C22817
18028E7912k0321J29333J21380d7427D8006a06770c4363G3255J20807E7006a64393
$$ plain form
18109 153572 84698 -278558 -21561 -219415 216491 -34591 -46170 -102208 -821 -157532 281062
18097 -173119 -278821 243201 -4806 114156 -309708 106093 298414 -59624 114940 -456009
18086 288984 78463 7931 -1128 -171567 250822 -242229 17777 51838 -89384 17984 -165451
18074 -39011 194142 -28676 -19950 212125 138006 -17935 -216333 -84739 -24088 -70259 -225778
18063 -225778 -25035 -94363 -57284 -166501 1503 257791 15117 -131162 -259786 226858 71845
18051 -21792 66430 226719 -122848 -92924 -42697 41627 -79015 -18461 -99827 -246650 -143128
18040 -143128 31604 8210 -217566 87533 302954 -160961 -56708 -52955 297401 -71385 322817
18028 57912 37591 166924 288304 -47427 48006 -106770 -34363 73255 194062 57006 -164393
18016I6208d3694E8500c2392l3209L074b1556C29145h8046J6945J0790o176H422
18003a0485G5963K9319i3117A6626O6337K12775c2114C07868a50346d9765C07723
17991e1134j30914E9708N2715J14275c1355F8227k1415b08453E8999B804Q5572
17980H8376J24536J01521b49247A88415b66471R1444o1370F0117K51866B9624
17969c9347C11472C1903k144N8625i4084A21382b97228a9356D7707g8828k61113
17958c39941C9510b26194C68669D6841P4R016F973J59772A2657a16601j06794
17947b23395P1950K0229G0268L6670K0787e526m5447B49931a02552I5961J55763
17936B51724a72372B332c9033J8876E512J08955D0493J006a86399I928a48240
$$ plain form
18016 96208 -43694 58500 -32392 -65601 -62527 -21556 329145 -88046 -71101 -60311 -66487 8422
18003 -10485 75963 105282 -93117 16626 82963 295738 -32114 307868 -150346 -49765 307723
17991 -51134 -182048 59708 112423 226698 -31355 68227 46812 -208453 58999 2804 88376
17980 88376 212912 314433 -249247 188415 -266471 -175027 -236397 60117 311983 29624
17969 -39347 311472 31903 29759 88384 -94084 121382 -297228 -19356 47707 -78828 -339941
17958 -339941 39510 -226194 368669 46841 46915 55931 6973 166745 12657 -116601 -223395
17947 -223395 -151445 -131216 70268 106938 127725 -5526 -50973 249931 -102552 95961 251724
17936 251724 -172372 2332 -39033 -20157 5512 114467 40493 41499 -186399 9928 -148240
17924H5715M2844r888a62150g5757E4608M110i6638c6725r3565q0614E7363G479
17911a9848B40739e4883A8614K28897o9906a79527I1548k5106b49020B01878k8003
17900A73875a25235j12740p473F4338a24695E34J83127b54389A35471a12247j70846
17889b83093M9025O9508D6841c43586A54406a18660A02836a35724F0437h8149
17878b31178D94677a21082C16708A25027A3004J13538c7776A17593a00997A62740
17867E0163J49449a00171B903g2800e667E71195A9449f6200A31025l523C3581
17855B89629b74164m076n3993L9360e2687I8257m4273E697c1739B9377K08489
17844B37866G8446P7341F5450j5754A7433o599b09853A89734a78670I3126Q135
$$ plain form
17924 85715 128559 118671 -162150 -75757 54608 58718 -96638 -36725 -130290 -210904 57363 7479
17911 -19848 240739 -54883 18614 247511 177605 -179527 91548 66442 -249020 201878 173875
17900 173875 -125235 -237975 -245448 64338 -124695 534 183661 -254389 135471 -112247 -283093
17889 -283093 -234068 -164560 46841 -343586 154406 -118660 102836 -135724 60437 -88149
17878 -231178 494677 -121082 316708 125027 13004 126542 -37776 117593 -100997 162740
17867 50163 199612 -100171 2903 -72800 -5667 571195 19449 -66200 131025 127502 33581
17855 289629 -274164 -278240 -332233 -292873 -52687 98257 53984 5697 -31739 29377 237866
17844 237866 78446 155787 65450 49696 17433 10834 -209853 189734 -178670 93126 101261
17833A01261b79400A52960b02300A82399c9088A63711G7143J02858e1919G5427
17822H5495c0153A66719a69613l240h2402A2769P9424k9061b5983p7292j42999
17811b46274B52078a57364A71166m7701J21364b55156B08681A02031h2978j6449
17801i9427L0121m4143E1423J61580C2584A2373f033H784L99290F4355a64123
17789a46785E5913K23384f6076C6571J01701a63850D3678K60849j16714c1245
17778b56953A12632a6917A9313c2352C1664K6270j4621P5784c69818J48096A02487
17766A63153O0951J33817G306K09215i2332j75336c6078A37127J4467K3781a72231
17754C28260a05621H7129K508C162b0199A07256M1185J1966a8486H7729L2735
$$ plain form
17833 101261 -279400 152960 -202300 182399 -39088 163711 77143 180001 -51919 75427
17822 85495 -30153 166719 -169613 -172853 -82402 12769 92193 63132 -25983 -103275 -246274
17811 -246274 252078 -157364 171166 123465 244829 -255156 208681 102031 -82978 -99427
17801 -99427 -69306 -113449 51423 213003 32584 12373 -6033 8784 408074 64355 -164123
17789 -146785 55913 279297 -66076 36571 138272 -163850 43678 304527 187813 -31245
17778 -256953 112632 -16917 19313 -32352 31664 57934 43313 119097 -369818 -221722 102487
17766 163153 224104 357921 7306 216521 -92332 -267668 -36078 137127 151594 175375 -172231
17754 328260 -105621 87129 89637 3162 -20199 107256 148441 160407 -18486 87729 120464
17743A20464a74239D39442g2105L3337B77596d31114A15479D5833K38591a19206
17732b06779A40477J57453k3119j21510J5256J04181a7389B02758M4170b52274
17721e7954B44961J20104a5876n0452k91089g4509q7988F1090B4420J35695B4136
17709G3970K3278a66659C3314b58813A78893d604D24163d1100A58587k0597c9210
17697a09957j93071J40110B65366a60981A15926B114J66460n3690M48175C736
17686D7107b35009E22748b8496B26435n2083a92116A04335f5385a9064A11823
17675d1064B94543A47262G3422a09839A81595K43444C0741o644L33284H1344N5413
17664A36757J42588O4755a25343A08052m9323l408J32536g9266C39777A17275
$$ plain form
17743 120464 -174239 439442 -72105 -38768 277596 -431114 115479 45833 284424 -119206
17732 -206779 140477 297930 274811 153301 168557 272738 -17389 202758 246928 -252274
17721 -57954 244961 365065 -15876 -66328 -357417 -74509 -162497 61090 24420 160115 24136
17709 73970 97248 -166659 33314 -258813 178893 -4604 424163 -41100 158587 137990 -39210
17697 -109957 -303028 -162918 265366 -160981 115926 2114 168574 114884 563059 3736
17686 47107 -235009 522748 -28496 226435 174352 -192116 104335 -65385 -19064 111823
17675 -41064 294543 147262 73422 -109839 181595 425039 30741 24097 357381 81344 136757
17664 136757 279345 344100 -125343 108052 58729 55321 187857 -79266 339777 117275
17653A55825a19955p6433Q5515B32273a81704A47882J71663j05500p3879a11292
17642B12979K49201c3360M593A99115K05537j68198e3789C81678c7677A46105
17631B92779b3967A41125a57174A31721E4158k5875J85886j4554j7705C4262a15865
17619B0229K65377K0332c2677A05386E1668K33774n4436g4930C18595j16469K05011
17608D07137C6968J06195a1305D81702A56898J24792j0035A1041Q019J13631g5801
17596C90982D0920J45236a4835j71555g3799B43970j7672Q7802j35806n0492D1134
17584B16466J08984E7504O5733a53474B29053A2264J14994j3497g958H1304J34471
17573B15775i2231C63441p2538K55003j97561A40971c8829A63249a5618k43224
$$ plain form
17653 155825 -119955 -196388 -110873 232273 -181704 147882 319545 214045 140166 -111292
17642 212979 462180 -33360 -28767 199115 404652 236454 -53789 381678 -37677 146105
17631 292779 -23967 141125 -157174 131721 54158 28283 214169 199615 181910 34262 -115865
17619 20229 285606 305938 -32677 105386 51668 285442 231006 -74930 318595 202126 407137
17608 407137 36968 143163 -11305 481702 156898 281690 271655 11041 19060 132691 -75801
17596 390982 40920 186156 -14835 -186390 -73799 243970 226298 314100 178294 127802 41134
17584 216466 325450 57504 123237 -153474 229053 12264 127258 113761 -7958 81304 215775
17573 215775 -92231 363441 290903 545906 348345 140971 -38829 163249 -15618 -258842
17563b58842D23853P7249k46511a50173B39840o1678K47741A56762D0206M7360
17553H7566P2320B3561g5266B15927J1013m0901k7929i6709C8342K05537q7384
17542A56495K65372B09981G4061e9689D75153f0084l1066K4245B16200n3229K34822
17531C97793N9844J11743B38867K46875J65941M00690k71616K17148k6254J15316
17521A086967D53330K22857C11815L6623f5593D19809N7525j63170K87803j28199
17511D73768P9492O21905l67545L120R6582J48323C88560Q5052j44543q1603L96894
17500F44360r8879J32591l893B51643K67640k26757j18835J06979M5317F5286
17489C00405J35883B13007J01182r8913M173K24187l2580j39185o0737M655G3304
$$ plain form
17563 -258842 423853 501102 254591 -150173 239840 178162 425903 156762 40206 87566
17553 87566 159886 23561 -75266 215927 226940 186039 158110 -96709 38342 243879 156495
17542 156495 421867 209981 74061 -59689 475153 -60084 -91150 -66905 216200 162971 397793
17531 397793 457637 569380 238867 485742 651683 1052373 780757 997905 971651 1086967
17521 1086967 453330 676187 311815 348438 -65593 419809 477334 314164 601967 473768
17511 473768 553260 1175165 807620 810740 907322 1055645 388560 473612 329069 247466 644360
17500 644360 545481 678072 674179 251643 519283 292526 173691 280670 325987 65286
17489 300405 436288 213007 314189 215276 219449 443636 411056 271871 211134 215789 73304
17477B53028J41546d717B22568d6044l2878B9980b7678C43384O1747A69469K41186
17466D10655K154J41110B21728H4711J32964K41329r617B22750Q2859A27704R4973
17455B22677j01844J07007n5454J72865A41920K12250q2832K10786j76959j00277
17445B04888c0690B34346K21939q9732K50317A18750M66291B61641J68196Q1308
17435E11145j18783j86830J68883l2150j64598R6529P1664J26843k27368K28483
17425D73818p6528J30559A19961K06848r821P4376e5844D03957o9465j16967O5033
17414B82558B2436J31722P5573o7339P2440A01258A0787O29685k48948j04074
17404B87450j33801c4291B35237K4097n3666D6636J44253J07449j09593a00066
$$ plain form
17477 253028 394574 -4717 222568 -46044 -78922 29980 -27678 343384 405131 169469 410655
17466 410655 412809 553919 221728 84711 217675 459004 449387 222750 305609 127704 222677
17455 222677 120833 227840 172386 345251 141920 354170 271338 482124 305165 204888
17445 204888 -30690 234346 456285 366553 616870 118750 585041 261641 429837 511145
17435 511145 392362 205532 374415 342265 177667 274196 345860 472703 245335 473818
17425 473818 397290 527849 119961 326809 316988 391364 -55844 403957 334492 217525 282558
17414 282558 22436 154158 229731 162392 234832 101258 10787 640472 391524 287450
17404 287450 153649 -34291 235237 259334 205668 46636 190889 298338 188745 -100066
17393C83366j47118m8529J70811a11C84767j04028J02646A46593O6225K79668
17383D92486B25536J74515A32737E9808J07637J27265a8811A89983J28595e5045
17372D29074H7098L92951a22215C47745g9893k3704d9577H1694M98801i9958C14543
17360D13333c817C32679Q9233A52730J62581j5870R5949R1027J20123B76167A32735
17348E95864k55814l9077J12321B543L72098n1907A15356J70226m7523F9010k3212
17337D5798K77858n4918j077n4822N3876A07428K19290h8135O393A99272J1404
17326B10676m8223B6298J16978j0361K16929A38492J85819R1554j24682Q4724
17316C75907K3791A03968J94462A41994k6341L25438r6463J26599B25277J81550
$$ plain form
17393 383366 236248 187719 358530 -111 384767 280739 383385 146593 212818 492486
17383 492486 225536 400051 132737 59808 167445 294710 -18811 189983 318578 -55045
17372 429074 87098 480049 -122215 347745 -79893 -103597 -49577 81694 580495 -99958 314543
17360 413333 -3817 332679 421912 152730 315311 299441 395390 486417 606540 276167 132735
17348 595864 340050 300973 413294 2543 374641 322734 115356 285582 238059 69010 45798
17337 45798 323656 268738 267661 212839 266715 107428 326718 -88135 -81742 199272 210676
17326 210676 162453 26298 143276 132915 349844 138492 324311 415865 291183 375907
17316 375907 399698 103968 298430 141994 115653 441091 344628 471227 225277 406827
17306D06827A07064J58360R3860J22283j37313j37026J19138k9172a0912B89263
17295A61156K02109j54520J66260j13152K64119E1015M23712F2831K1773L19036
17285D03640A96789L32588p8138n9318K55928l05220g7782D15687A1531L86706
17275C98237j6381A60833L05372L8037o8282n8054N4059A19974P0023G1576J46788
17264B18364q3974J17939g6216D49934j38645q5828M7354l3813Q9301J80507j98209
17253C10601m6836J97100j40117m3590k8514k2387j1479K31864O6560A41029J1599
17242A52628N1933r2637L67413P0635j2762j16400j12443J04182J4860J76361
17232F03770B45434k7370K29026k16757J88971P8336Q3234k32105K38296j47736
$$ plain form
17306 406827 107064 265424 359284 481567 344254 207228 326366 297194 -10912 289263
17295 161156 363265 208745 375005 261853 525972 51015 474727 62831 84604 403640
17285 403640 196789 529377 451239 391921 647849 342629 -77782 415687 11531 398237
17275 398237 381856 160833 466205 504242 435960 377906 431965 119974 189997 71576 218364
17264 218364 134390 252329 -76216 449934 311289 225461 272815 239002 328303 508810 310601
17253 310601 263765 460865 320748 277158 248644 226257 214778 446642 513202 141029 152628
17242 152628 204561 111924 479337 549972 537210 420810 308367 412549 427409 603770
17232 603770 245434 218064 447090 230333 419304 497640 580874 348769 587065 439329
17222D39329A56768K40692J61350B19214J01587A26511J61200A16705J62836m2822
17212B36719L00756J25162P865p0128j56300J04043j39630j12191j16538L33876
17202E13634q8728N3860A05875K98979J0889k6373J37117A60666L03827j09128
17192C55365p23A30287M66267R0313r1910A62946K66986K50883k18497P4783j13390
17181D23711j49974M6835P6309j74718l047M86029k80112K05845O6525K38981
17171I36384l65583O7776j90575o5713j0829J99031r9248M8031j7139J54190l20650
17160C35675j7319n4384K11630n0118K25309B65641L09610K6670k22003K95029
17150F74947m0739B28608L58963j74733K88215C35833Q8288m2348K73219o5131
$$ plain form
17222 439329 156768 397460 558810 219214 320801 126511 287711 116705 279541 236719
17212 236719 537475 662637 670502 600374 444074 548117 408487 296296 179758 513634
17202 513634 424906 478766 105875 404854 415743 389370 526487 160666 464493 355365
17192 355365 354642 130287 596554 686867 594957 162946 429932 680815 462318 537101 423711
17181 423711 273737 320572 396881 222163 219116 705145 425033 630878 697403 936384
17171 936384 570801 638577 448002 382289 371460 570491 471243 519274 502135 656325 335675
17160 335675 318356 263972 475602 425484 650793 265641 575251 601921 379918 674947
17150 674947 634208 228608 587571 412838 701053 335833 424121 381773 654992 589861
17140E89861k19050M50579k92818A80245N01172j90419K47358j53869j84757J18276
17130E18006R387J2113J53812J4249k63911K67888l44883L2329l3811j287L61236
17119G25128K32020k86168k24634K67580j3313k06792j362L96759l51407J08164
17109F45975L09113r8412m11922J07313R4984k37624J06546K70204J17206p1407
17099H31976C44815J74789l0043Q6452j18360k7613Q8686M32095k88877L04544
17089I66488l20254j07034J37744M27794C84370L87374j21872R6009q7990n9610
17079E98281K29409L8168k77280L70459j0820k61940O0817Q8822J31212j66677
17069H00451C59423J64496M61614k24329j63894M0035O8804J26787j39873O5618
$$ plain form
17140 589861 370811 821390 528572 180245 681417 490998 738356 584487 399730 518006
17130 518006 527393 539506 693318 707567 443656 711544 366661 398990 365179 363892 725128
17119 725128 957148 670980 446346 713926 700613 493821 492459 889218 537811 645975
17109 645975 955088 856676 444754 552067 647051 409427 515973 786177 903383 831976
17099 831976 344815 519604 489561 576013 457653 430040 518726 950821 661944 966488
17089 966488 646234 539200 676944 1104738 384370 771744 649872 745881 657891 598281
17079 598281 827690 865858 588578 959037 948217 686277 747094 835916 967128 800451
17069 800451 359423 523919 985533 761204 597310 637345 706149 832936 693063 758681
17059G58681l7895q1509K54776L37153m94931k7568N9896j77626L01839j16646
17049G76170k24195N94973l31773N2922r4602J83240j37910N0489K44087l50256
17039G63145J61455K01571j90988m7201J58682l19003L81306j33345R129k76610
17029G08141M82839j90918l1923K4682j1878K79044j48262j90854J94657n0466
17019A065062K16874Q952k95017k56036L09604Q1239l5689l09180K83105j52347
17009I16567K22898j37103K0199J1456P2884J96910J02822j78659q0390O7591
16999A215175k21970L54766k38624J98775P6367K01731J2180m9532l17446J94532
16989A425954j84161Q6771k5308J6827M31415m10551n8774M10736k80085l36233
$$ plain form
17059 758681 720786 639277 894053 1231206 736275 708707 768603 590977 892816 776170
17049 776170 551975 1146948 815175 868097 773495 956735 818825 869314 1113401 763145
17039 763145 924600 1126171 935183 887982 1046664 727661 1108967 975622 984751 708141
17029 708141 1190980 1000062 968139 992821 980943 1259987 1111725 920871 1115528 1065062
17019 1065062 1281936 1290888 995871 739835 1049439 1130678 1094989 785809 1068914 916567
17009 916567 1139465 1002362 1022561 1034017 1106901 1303811 1406633 1227974 1147584 1215175
16999 1215175 993205 1347971 1109347 1308122 1384489 1586220 1598400 1548868 1231422 1425954
16989 1425954 1241793 1328564 1303256 1320083 1751498 1340947 1282173 1692909 1412824 1076591
16979A076591L05911M8948N1770o9796p9917l9332M5324J29512K45290k16402
16969A497899J03493J29511j53034L5105J41247j54650o9660O0048j7668j1551
16959A560740L17452J91549k95545k87304M47425r8418l6053p4461K33877N2017
16949B011279m29867L27027j26797R4948N9501k30558L47718l33064P6055j21207
16939A675035K89519J4525J44814K5863n10908L14894L71567k51826K59963k58726
16929B074720L6496p4567L93714l75810J16290K34747j84583K9865K6361J6266
16919B293499J16281J3605j37713j91937R3417M60501m11326K81114K01843j92958
16909B526326K12907k58358M73303m1499k72218K37878Q609o9085k9575p9042
$$ plain form
16979 1076591 1382502 1431450 1483220 1413424 1333507 1294175 1339499 1469011 1714301 1497899
16969 1497899 1601392 1730903 1577869 1612974 1754221 1599571 1529911 1589959 1572291 1560740
16959 1560740 1878192 2069741 1774196 1486892 1934317 1835899 1799846 1725385 1959262 2011279
16949 2011279 1581412 1908439 1781642 1876590 1936091 1705533 2053251 1720187 1796242 1675035
16939 1675035 1964554 1979079 2123893 2149756 1638848 1953742 2325309 2073483 2333446 2074720
16929 2074720 2111216 2036649 2430363 2054553 2170843 2405590 2221007 2250872 2277233 2293499
16919 2293499 2409780 2423385 2285672 2093735 2187152 2647653 2236327 2517441 2719284 2526326
16909 2526326 2739233 2480875 2954178 2912679 2640461 2878339 2886948 2817863 2788288 2709246
16899B709246M92411l39144l7921J70733O7668j18281r2844L57563j64883j44865
16889B899683K55331k6058J22416O5546M55635m15093L66447j38033l85075Q81524
16879D082323j87141k41686j31007R0447K40121L12862q4042l14365M36364r2044
16869D111832J08496j30477K853N77989M419r9417j13338l7539J63555j76535
16859D411838R4924k42332M25119J59769q7485K99934j31185J16936L72489p0802
16849E349205n5113n5511J62087J97062j08407R8619N31375j77615J82575Q2170
16839F206447K52189K1616J49708J54199L14348l58602K93880o7535L28538k39909
16829G054879L97662L5610K41965K10066J37690J8152M1025J17028K81732K53702
$$ plain form
16899 2709246 3201657 2862513 2824592 2995325 3062993 2944712 2851868 3209431 3044548 2899683
16889 2899683 3155014 3128956 3251372 3316918 3772553 3357460 3723907 3585874 3200799 4082323
16879 4082323 3895182 3653496 3522489 3612936 3853057 4165919 4081877 3767512 4203876 4111832
16869 4111832 4220328 4089851 4092704 4670693 4675112 4575695 4462357 4424818 4588373 4411838
16859 4411838 4506762 4264430 4689549 4849318 4761833 5061767 4930582 5047518 5420007 5349205
16849 5349205 5294092 5238581 5400668 5597730 5489323 5587942 6119317 5941702 6124277 6206447
16839 6206447 6458636 6480252 6629960 6784159 7098507 6739905 7033785 6966250 7294788 7054879
16829 7054879 7452541 7488151 7730116 7940182 8077872 8096024 8137049 8254077 8535809 8789511
16819H789511m9157O92158m18651N27552o4407K7380O77083k36237L36565L73793
16809A0655590K95467J87503K60480L16758K75488p2532L35923K99168O9238O18564
16799A3241647M01711k65180N21963L31585J09514P90631M32750R7529L64807
16790A6026957O39801N3979Q80970J05644L48890K86630R18880O53237K48938
16781B0163926M85857J029296L21760M62783O55509N99928Q44688K64125J025321
16772B5853193P87876N89631J408904P22579N54370J587874N10620R52373J289657
16763C4257077J038106J144527J435073J209960J394840J007855J729507J415132
16755D4632077J310798J738482K123955J252821K067827J972972J751123K083936
$$ plain form
16819 8789511 8740354 9432512 9013861 9541413 9477006 9504386 10181469 9945232 10281797 10655590
16809 10655590 10951057 11138560 11399040 11715798 11991286 11918754 12254677 12553845 12623083 13241647
16799 13241647 13643358 13378178 13900141 14231726 14341240 15131871 15564621 15662150 16026957
16790 16026957 16666758 16720737 17601707 17707351 18056241 18342871 19261751 19914988 20163926
16781 20163926 20649783 21679079 22000839 22463622 23119131 23719059 24563747 24827872 25853193
16772 25853193 26641069 27230700 28639604 29362183 29916553 31504427 32015047 32967420 34257077
16763 34257077 35295183 36439710 37874783 39084743 40479583 41487438 43216945 44632077
16755 44632077 45942875 47681357 49805312 51058133 53125960 55098932 56850055 58933991
16747E8933991K070276K465586K227684K228317K489329K161437K646311K543151
16739G7766082K492261K831037K442808K774881K399577K539182K923372K519844
16731I8689044K714249K107844K236527J965358J915199J784018J550786J126165
16723A14089190R62603R27869L69590J34652m80472k84824p91973j166101n41423
16714A13219111k134130j932339j445774k156698k227871k446467k452277k693591
16706I5729964k557477k775990k137603l168833k629077k605886k704470k687128
16698G4463500k493579k409666k437193k600640k073878k547764j574373k504809
16690E5821598j888116j722616j607319k098644j950880j241553j864883j280936
$$ plain form
16747 58933991 61004267 63469853 65697537 67925854 70415183 72576620 75222931 77766082
16739 77766082 80258343 83089380 85532188 88307069 90706646 93245828 96169200 98689044
16731 98689044 101403293 103511137 105747664 107713022 109628221 111412239 112963025 114089190
16723 114089190 115051793 115979662 116349252 116483904 116003432 115718608 114926635 113760534 113219111
16714 113219111 111084981 109152642 107706868 105550170 103322299 100875832 98423555 95729964
16706 95729964 93172487 90396497 88258894 85090061 82460984 79855098 77150628 74463500
16698 74463500 71969921 69560255 67123062 64522422 62448544 59900780 58326407 55821598
16690 55821598 53933482 52210866 50603547 48504903 46554023 45312470 43447587 42166651
16682D2166651j420160j142989j646916j240211j171910j343111j017886j397326
16674C1786142l44826j214664j308159n99692r89781q00539r35423n01277j077779
16665B4014002m01390n87235n29938o15004o76084q80616n57192q8673q83042
16656A8794828m30375n85708p52742K2141q60461J67681m51799p05326m20137
16647A4778102n28866J53442n41482n42953J12972j11115l70174p55888m42483
16638A1751555L33800n96143k95428k1578l51063j34735k98141k04649Q1973n51878
16628I713713l16153j00316R1770l20915M9995m11958r2108j24553k86793m02763
16618G799919K39504l75466j57751j57295j14429k31050r714M08933m60049j8067
$$ plain form
16682 42166651 40746491 39603502 37956586 36716375 35544465 34201354 33183468 31786142
16674 31786142 31441316 30226652 28918493 28318801 27329020 26528481 25593058 25091781 24014002
16665 24014002 23612612 23025377 22495439 21880435 21204351 20323735 19766543 19677870 18794828
16656 18794828 18364453 17778745 17026003 17048144 16187683 16355364 15903565 15198239 14778102
16647 14778102 14249236 14402678 13861196 13318243 13431215 13320100 12949926 12194038 11751555
16638 11751555 12085355 11489212 11193784 11172206 10821143 10686408 10388267 10183618 10265591 9713713
16628 9713713 9397560 9297244 9389014 9068099 9118094 8706136 8614028 8489475 8202682 7799919
16618 7799919 8039423 7663957 7506206 7348911 7234482 7003432 6993718 7402651 6942602 6924535
16608F924535n48050K8715R1644k58944L43702m36174L5407n74226K62131j95455
16598E673285j93949P1252j92415j39397J11259j80907n9465j97275J47314j77128
16588D862574l91364N3638J71469J0801k21070J4125j47796J83171k43077n26175
16578C766296N12407j49545k09958K55206l46197J75688j09384j02715k56293
16569C535505K01849R0287k99082J38044q6451j57972O7420j70439K6230k15922
16559C129469q8152P8652J6898k26753Q0079k7636J19004n0899j77437J27038
16549B980263r2976R1164n4215K3514j93785n49706M11796j00345L01158q8890
16539B727978j72497M7276k15024M687j95731M9641M55212j00114j81661R9848
$$ plain form
16608 6924535 6376485 6405200 6496844 6237900 6581602 6145428 6180835 5606609 5868740 5673285
16598 5673285 5479336 5550588 5358173 5218776 5330035 5149128 5089663 4892388 5039702 4862574
16588 4862574 4471210 4524848 4696317 4707118 4486048 4500173 4352377 4535548 4292471 3766296
16578 3766296 4278703 4129158 3919200 4174406 3828209 4003897 3894513 3791798 3535505
16569 3535505 3737354 3827641 3528559 3666603 3580152 3422180 3489600 3319161 3345391 3129469
16559 3129469 3041317 3119969 3136867 2910114 2990193 2962557 3081561 3030662 2853225 2980263
16549 2980263 2887287 2978451 2924236 2947750 2753965 2204259 2616055 2515710 2816868 2727978
16539 2727978 2555481 2602757 2387733 2392420 2196689 2246330 2701542 2601428 2419767 2519615
16529B519615j15367L0112j34689N0374k25702j94912Q7876K33731p6121m9238
16519B125679n0105k2208K71813o3702k07018k05595P6573J7640m7251p2251j57680
16508A665895L64942k83703K67291k71003Q5203l21813M56388l7090R3942k39322
16498A780730M41922o53352J01241j39261L53744l42655J08039j18640l6699l8673
16488A456396K87947R5534k53875q2832p4700L42529j98271k54292K66311k3345
16478A561402k41961r531J63420J18045n6779l08810J51821L31074l95608l18776
16468I94297L57715k19816K38328L5955j00518k32339K66689J03151p0055k92421
16458A080986M2516J8943M00893p16439N81958q7292J7020j72137M8083q8023
$$ plain form
16529 2519615 2404248 2434360 2299671 2350045 2124343 1929431 2017307 2251038 2174917 2125679
16519 2125679 2075574 2053366 2325179 2261477 2054459 1848864 1925437 1943077 1895826 1823575 1665895
16508 1665895 2030837 1747134 2014425 1743422 1828625 1506812 1963200 1926110 2020052 1780730
16498 1780730 2222652 1569300 1670541 1531280 1885024 1542369 1650408 1531768 1495069 1456396
16488 1456396 1744343 1839877 1586002 1503170 1428470 1770999 1572728 1318436 1584747 1561402
16478 1561402 1319441 1309910 1473330 1591375 1534596 1225786 1377607 1708681 1313073 994297
16468 994297 1352012 1132196 1370524 1406479 1305961 1073622 1340311 1443462 1373407 1080986
16458 1080986 1123502 1142445 1543338 826899 1408857 1321565 1338585 1166448 1214531 1126508
16448A126508J9095m7226o1291L15007r9112j78333p9273j78496J05727L02573
16438A225179l24207L1743O1548P2326J4696J47156m01383j20744L96453l748
16428A099019l93680M21K87743L7309J96710m89210L22279j44887L73285l09133
16418I79856M1428J77551l64319j13556j38692J93836K5674J11051o2450J30950
16408I81329k92811L26558k804j15380j24399K90284j51825K00926k88014J6866
16398H40730j3546Q345R7565q8446j45466K08798k25774n9272J25288M4434M9387
16387H42043l83434N10133j60083J4540J03009k95224K5676K36829O0036k74568
16377F78957J18231k30956m2581K25073j25929k34362K63367R9152R3086k28270
$$ plain form
16448 1126508 1145603 1098377 1037086 1352093 1252981 1074648 995375 816879 922606 1225179
16438 1225179 900972 932715 994263 1066589 1081285 1228441 827058 706314 1102767 1099019
16428 1099019 705339 705760 993503 1030812 1227522 738312 1060591 915704 1288989 979856
16418 979856 1021284 1198835 834516 720960 582268 776104 801778 912829 850379 981329
16408 981329 688518 1015076 1012272 896892 772493 1062777 910952 1111878 823864 840730
16398 840730 827184 835529 933094 844648 699182 907980 682206 622934 748222 792656 842043
16387 842043 458609 968742 808659 823199 926208 630984 656660 893489 953525 678957
16377 678957 797188 566232 523651 748724 622795 388433 651800 750952 844038 615768
16367F15768J56461C61877O35362m54106J98047k50348J47622M0786P2572r2443
16357F59369J22415P6764r0172l71340L9224K31213k63807J43227J42621Q6409
16347G75923J55521l01912j16584K17743k05878J5348O4082K5188K01572q2215
16337G48788l09281J92506k13851K52087J58379O7702k59802k88017K30765q397
16327E70879k74403A34492K77836K14834p311k90554P2151O9732j50066J23293
16317D44407k21832M6435J08649j9566L96098j43015L1504k38310J81969L3603
16307F19942j43223j23761J51074B32456J32558p8182J23432J46619K8357K29035
16297H14275k57578A03235M85655a00336B05180R5205M4120P5380N7278j50649
$$ plain form
16367 615768 772229 361877 997239 543133 741180 490832 638454 679240 751812 659369
16357 659369 781784 858548 768376 397036 436260 667473 403666 546893 689514 775923
16347 775923 931444 629532 512948 730691 524813 540161 604243 629431 831003 748788
16337 748788 439507 632013 418162 670249 828628 896330 636528 348511 579276 570879
16327 570879 296476 134492 412328 627162 619851 329297 401448 471180 321114 444407
16317 444407 222575 269010 377659 358093 754191 611176 642680 404370 586339 619942
16307 619942 476719 352958 504032 232456 365014 286832 410264 556883 585240 814275
16297 814275 556697 103235 588890 -100336 205180 300385 344505 419885 477163 326514
16287C26514L31855k15278L1329K17533j95305j56074J25234m8001J44896j12164
16277D50539j89160n4587o6120F5582K25090R9426J56818j45122j54552M40388
16267F87630C29711r5646o6182N24838C14264J71941q8510A85695n7720K56951
16257C84926j30680M0884A30101L93518A15230L83470B33110A07062M53456K4713
16247E85231j22060q5943n8458m8914K3068j35344J5915L92530k07161q0340R7710
16236C76234L02145A4830J81970J59471R0424K214e444D57190l8224R3652E2277
16224C31136m02r8172p7295K10781j05911J55141B04269O7896K8206M5314M528
16213C50213m7037F3227K69703J00144J9109J32180A92803K8787R1549I778K21064
$$ plain form
16287 326514 658369 443091 474420 691953 496648 340574 465808 417807 562703 450539
16277 450539 261379 206792 140672 65582 290672 390098 546916 401794 247242 687630
16267 687630 329711 234065 167883 692721 314264 486205 397695 185695 127975 384926
16257 384926 254246 295130 130101 523619 115230 498700 233110 107062 560518 585231
16247 585231 463171 377228 318770 269856 292924 157580 173495 566025 358864 278524 376234
16236 376234 678379 14830 196800 356271 446695 448909 -5444 457190 418966 512618 52277
16224 331136 330734 232562 155267 366048 260137 415278 204269 272165 300371 345685 350213
16213 350213 303176 63227 332930 433074 452183 584363 192803 221590 313139 9778 230842
16202B30842k0704G2471J08011F2257L89387g1922D58981r623k08856e0398C41879
16190D81971j62863A2781J38021K36795D9667K99900j45413K44037p1782A28229
16179C61178C5237j4140q155L30006I9480K55025j48042H5791K11110q3113i6308
16167d2941A67424J59649k7508m8761j16458L81743b57487B42478Q8744j23901
16157B07321J8143r4498C1906J92803k0463L6774F6980J29289K04515E853J79521
16146A85374K11453A69055m6089a41914O0489E87832B46617e4134E9656K01357
16136B61013j06000D600J17654J56292A34275M1459F5996e8013J423B75544j23729
16125A51815M6726G5580A1756N15435j05770j00407m7054o6143a41371D63964
$$ plain form
16202 230842 210138 72471 180482 62257 451644 -71922 458981 449358 240502 -50398 341879
16190 481971 319108 12781 150802 387597 49667 349567 204154 448191 376409 128229
16179 361178 35237 21097 12942 342948 99480 354505 206463 85791 296901 213788 -96308
16167 -42941 167424 327073 299565 250804 134346 516089 -257487 242478 331222 207321
16157 207321 225464 130966 31906 224709 204246 241020 66980 196269 400784 5853 185374
16146 185374 396827 169055 122966 -141914 -81425 587832 246617 -54134 59656 261013
16136 261013 155013 4600 122254 278546 134275 175734 65996 -58013 -56590 275544 151815
16125 151815 198541 75580 11756 527191 421421 321014 273960 207817 -141371 463964
16114C03624F4720Q9703j922f431H6216d525A3572a04165l943A43024b739n2282
16102e5021B8139n24g6368j81920P2904b8688B57682j06432c713j71490g8003
16090B64182d2621A86036p5129J84853p6944J73794r0636F645N25095k54198A18179
16078a15314B87913j31502j0496J02673H4106a82309I0140L2621P4897c7949r4508
16067a32457b0573j14059A19338b1553g594I8995g7159d276j27C94916F4460k5970
16055C8490a72107B31935a50943C20269B121L02407j18172L54508A31668b27067
16044C7399J73179G0055J8743J24606d6124A34621A1480a46226C47686j69856
16034A77830O6307o4657f015I4535l1778L61929c2073B26495H9819K52112A5371
$$ plain form
16114 303624 64720 154423 152501 -6431 86216 -4525 13572 -104165 -108108 143024 -2739 -55021
16102 -55021 28139 27615 -76368 -258288 -185384 -28688 257682 151250 -3713 -175203 -78003
16090 264182 -42621 186036 110907 295760 218816 392610 301974 6645 531740 277542 118179
16078 -115314 287913 156411 145915 248588 84106 -182309 90140 122761 197658 -37949 -132457
16067 -132457 -20573 -134632 119338 -21553 -7594 98995 -77159 -4276 -4403 394916 64460 38490
16055 38490 -172107 231935 -150943 320269 2121 304528 186356 540864 131668 -227067
16044 37399 210578 70055 88798 213404 -46124 134621 11480 -146226 347686 177830
16034 177830 244137 179480 -6015 94535 62757 424686 -32073 226495 89819 341931 15371
16022c4161q0835A05873k038J05950B2942h6957B03873A5110a83932D11625H6098
16010h161C28857f8075E1057J75152H9778J20364A05005k5531b20817B86199F2175
15998a37012D3623P1300L4338M9363C2704P1965A8550K46264a2310A55298m447
15987A50851M79491j27808M81710J66044n6219p7284D54833J38715j86435A25891
15976B63540b2723m8168j70237A53195G4089c43292a16655A0669f4979B82752
15965h4290C0547K39495a12574H1854e7700A25620n3268e1830n4642K8210p932
15954h6194n1582j5543D253a01303p9564g0526a7624j17148B6865Q6439e131A8598
15941A7496a62141A20737M0336h2049h038j18441A35413c0719Q414o7991A7808
$$ plain form
16022 -34161 -114996 105873 103835 209785 22942 -86957 203873 15110 -183932 411625 86098
16010 -8161 328857 -68075 51057 226209 89778 210142 105005 79474 -220817 286199 62175
15998 -137012 43623 114923 149261 198624 32704 104669 18550 264814 -12310 155298 150851
15987 150851 630342 502534 984244 1150288 1094069 1016785 454833 593548 407113 125891
15976 263540 -22723 -70891 -241128 153195 74089 -343292 -116655 10669 -64979 282752
15965 -84290 30547 270042 -112574 81854 -57700 125620 72352 -51830 -106472 -78262 -86194
15954 -86194 -137776 -153319 4253 -101303 -180867 -70526 -17624 -134772 26865 113304 -5131 18598
15941 17496 -162141 120737 161073 -82049 -8038 -126479 135413 -30719 -22305 -90296 17808
15929a02106j85061b5890A25688J05860M1880d8117H7750J23803P6574a96204
15918c3783j05845j61354J8403R0046O9226A47035a73648D6717b03836e5201n807
15907f1008H6434a5154j41343g5255L5208k52978i0311k0064j24252I3049B3576
15895A36617J21874a16849e5733k8010E3472A349J40568F6534k0536O743J70928
15884B23669e8380j32386A76843p4842f9174G6158a74788K831L2376H0030j6975
15873F3055d63759A09602b22686M4508g2291E1276J2800d9870I9140a41493j57828
15862b99321O9890A51132j7029C8703h7756m7952A40315F7692K67801b27497A19082
15850e2086F2476b06506q893C32691F7007c0703I4905e5192C50446a2449c822
$$ plain form
15929 -102106 -287167 -25890 125688 231548 273428 -48117 87750 211553 288127 -196204
15918 -33783 -139628 -300982 -282579 -192533 -123307 147035 -173648 46717 -203836 -55201 -61008
15907 -61008 86434 -15154 -156497 -75255 -40047 -293025 -90311 -110375 -234627 93049 23576
15895 136617 258491 -116849 -55733 -83743 53472 1349 141917 66534 45998 52741 223669
15884 223669 -58380 -190766 176843 102001 -69174 76158 -174788 -171957 -139581 80030 63055
15873 63055 -463759 109602 -222686 -178178 -72291 51276 64076 -49870 99140 -141493 -299321
15862 -299321 -229431 151132 134103 38703 -87756 -135708 140315 67692 335493 -227497 119082
15850 -52086 62476 -206506 -215399 332691 67007 -30703 94905 -55192 350446 -12449 -3822
15838A44502K0130J48764J15242A3347c14796B34847c16078A22171n0054j6837
15828E5280J28341b70959E9209h0685A31960j7455a56964A2990K4257d5208j09703
15817a54911g3074o2499d0991B42468a23416j42778h3789F9594b51852j83319
15807d35171a23475k377c5750j29766b0576A04016a7572j56200G7640b27823B6006
15795i8190r1940G6619A7629M4470P6912J9896i1081A72727b4471j91022O7352
15784a48141a5449o0187j2657l3626M9150b5962B92489b48657B00701b19769D9186
15772b70801A79199C797O1838J61325a41915D5186b56021J24421n0376E0618a41283
15760G6760b34705J00678C50138j53673K00044a97022O7033G6577e9717B8575
$$ plain form
15838 144502 164632 313396 428638 13347 -314796 234847 -316078 122171 72117 55280
15828 55280 183621 -270959 59209 -80685 131960 114505 -156964 12990 37247 -45208 -154911
15817 -154911 -73074 -135573 -40991 242468 -123416 -266194 -83789 69594 -251852 -435171
15807 -435171 -123475 -125852 -35750 -165516 -20576 104016 -17572 -173772 77640 -227823 26006
15795 -98190 -190130 76619 17629 62099 139011 158907 -91081 172727 -24471 -215493 -148141
15784 -148141 -15449 -75636 -88293 -121919 -72769 -25962 292489 -248657 200701 -219769 49186
15772 -270801 179199 3797 65635 226960 -141915 45186 -256021 -131600 -181976 50618 -141283
15760 76760 -234705 -134027 350138 196465 396509 -197022 -129989 76577 -59717 28575
15749b01364C07336K2536h6965A89538b97201B7936J82112C1448K20571j20557
15739A31462f4068B39844g8310K6503H2444b02496E4514a85791B137a16920B58986
15727c9192k42394B8265J3126a00053A77896a5481k59641A86068M8581a88721
15716A29696i8049H0483g0161j885A74528a7202A60539a86010A48552K33845d399
15704A1891O2989j2313a23110E4166b70323C0389J93560A2534M2845P3502j5959
15693A12922j7254J55468F6336k135J64488H638c18140J02057J00149L173k46749
15682c59510a44580f5747l1882I8963c78588H9892a943j14522A9248L79102l3857
15671C64493a09104F0527K9671a01935j05161A62967c51931A43081b4622F3066
$$ plain form
15749 -201364 307336 329872 -86965 189538 -297201 27936 210048 31448 252019 131462
15739 131462 -64068 239844 -78310 -51807 82444 -202496 54514 -185791 2137 -116920 258986
15727 -39192 -281586 28265 41391 -100053 177896 -15481 -275122 186068 234649 -188721
15716 129696 -98049 80483 -70161 -72046 174528 -17202 160539 -186010 148552 382397 -4399
15704 11891 74880 62567 -123110 54166 -270323 30389 223949 12534 55379 128881 112922
15693 112922 95668 251136 66336 64201 228689 8638 -318140 -216083 -115934 -112761 -359510
15682 -359510 -144580 -65747 -97629 98963 -378588 89892 -1943 -116465 19248 398350 364493
15671 364493 -109104 60527 90198 -101935 -207096 162967 -351931 143081 -24622 63066
15660I8701g1904A7891Q6369B2873c94223J33465O0552G3775f5140B21439a04768
15648d7243q466A16002h1750A76650D4092d7577A72524n6903K825D1008H472h8796
15635A03919D6210b22749J115m5455a1422j79339c8620k8238j13811m26734g3030
15623A15469c12350G2458k1086J54837a16173j7684k3800q4342a08122C9513r183
15612C0330b0470k7922B28874c89803g3558j81796J632b7547A1716b65774i7852
15600c18256J07716B52615d27203J84626i7147A29488J35461a36022c855k20617
15590b24472N8088D9540K8990g6737j9198c6637D5680b57138a25401B55684j10259
15579A45425a16762B69582a10648l6481c6225J7195C54644f0626G2099A4567L72067
$$ plain form
15660 98701 -71904 17891 104260 22873 -394223 -260758 -200206 73775 -65140 221439 -104768
15648 -47243 -55709 116002 -81750 176650 44092 -47577 172524 115621 118446 41008 8472 -88796
15635 103919 46210 -222749 -221634 -267089 -11422 -190761 -38620 -66858 -180669 -607403 -73030
15623 115469 -312350 72458 51372 206209 -116173 -133857 -157657 -241999 -108122 39513 30330
15612 30330 -20470 -48392 228874 -389803 -73558 -255354 -253722 -27547 11716 -265774 -97852
15600 -318256 -210540 252615 -427203 -242577 -97147 129488 264949 -136022 -3855 -224472
15590 -224472 -166384 49540 78530 -76737 -95935 -36637 45680 -257138 -125401 255684 145425
15579 145425 -116762 269582 -110648 -147129 -36225 -19030 354644 -60626 72099 14567 386634
15568C86634b99013A19055O09n2376h4574p847C9018a49774j88226A11859e7944
15556b273n8671D1296N1930B9086d5247j5618A08652A1389K48980a95072b4570
15544a73232j70431J05893I9786a25621N0654B73689c74800f7621A98682i161
15533h9206B00146K8106j10590d10398A32527b88969i3037D7760b5087A63272
15522b5519o490j36196A69022g2714A54830a66871E38273A34751J6101K12408
15512C63260A42773J36603a41256d9497A50911l4227E0008K96323A4959K18518
15502B33477l1307a7192B07925P8762J6175j24502N2637p7334L59204k16705G8975
15490B8823a65784B61289E0113a74099B76220K5471F2251J07058F7666M9920b17949
$$ plain form
15568 386634 -299013 119055 119664 67288 -84574 -92421 39018 -149774 -338000 111859 -57944
15556 -2273 -60944 41296 93226 29086 -45247 -60865 108652 11389 260369 -195072 -24570
15544 -173232 -343663 -237770 99786 -125621 -74967 273689 -374800 -67621 198682 -9161
15533 -89206 200146 228252 117662 -410398 132527 -288969 -93037 47760 -25087 163272
15522 -25519 -32009 -168205 169022 -72714 154830 -166871 538273 134751 150852 363260
15512 363260 142773 279376 -141256 -49497 150911 116684 50008 346331 14959 233477
15502 233477 202170 -17192 207925 286687 302862 178360 230997 153663 512867 296162 78975
15490 28823 -165784 261289 50113 -174099 276220 301691 62251 169309 67666 117586 -217949
15478c54650A5465R4783J31479A07694N33771N07408m29686k24608j60338a94664
15467h4872A98393b03723H7888K68872a17938C72903j02542c2935A102K60749
15457B61851e5536l1553J6757H2364a04037d6948B80811A4212K13520J35176A34675
15445A55908G0914M44800L77545o3739K18575M09657n30741K0722C66878j22918
15435B43960J19595A77138a43367A02582b37912a18617A07115P3525F6652c1696
15424h3584A43785d296A07300e6290l4208G4738h9262I7683l1797C2403g7635
15412A9165K59265f3174j18308C9647J02712k075k0019g2479j15220C79413D4661
15400a29075M5390F279K25290A01152k9130K367M6131J8511n9044b63110B90131
$$ plain form
15478 -354650 15465 110248 241727 107694 641465 1148873 719187 494579 334241 -194664
15467 -84872 198393 -203723 87888 356760 -117938 372903 270361 -32935 1102 261851
15457 261851 -55536 -87089 -70332 82364 -104037 -46948 280811 14212 227732 362908 134675
15445 155908 70914 515714 893259 829520 1048095 1457752 927011 947733 366878 243960
15435 243960 363555 177138 -143367 102582 -237912 -118617 107115 180640 66652 -31696
15424 -83584 143785 -4296 107300 -56290 -90498 74738 -89262 97683 65886 32403 -77635
15412 19165 278430 -63174 -181482 39647 142359 140284 120265 -72479 -187699 379413 44661
15400 -129075 -83685 6279 231569 101152 72022 74389 120520 139031 79987 -263110 290131
15388C98768g1062B18652a72522L5051o0994E6065J6952i6554G7395J67301J45589
15377C90285a32337I8944j2830J17425r6388Q4677K1473c6168D18507j76595K7328
15366B69240N2688a1888p0626A33170i2516B94746H1187K87988j77274G9225J70743
15355B49968b07998A95612q5884N5835J19061o7099b75019i5310A59968m453L76682
15344E32197B12124A02638K60466J0173l789A56079K79246J454D3055J19897m1202
15333A21750N0288a49100A13742e6940E10230k49187a1227B8488L70386j12590
15323B86284r6686J41769r8928Q126F5821b9815I5326R5397L804b3703D24480
15311h6264I224O12459C10477p9781Q9147G7203b81932F8903h9129E4197M5784
$$ plain form
15388 398768 -71062 218652 -172522 -137471 -198465 56065 73017 -96554 77395 244696 390285
15377 390285 -132337 98944 86114 203539 107151 191828 213301 -36168 418507 241912 269240
15366 269240 321928 -11888 -82514 133170 -92516 294746 81187 369175 191901 79225 249968
15355 249968 -207998 195612 109728 165563 284624 217525 -275019 -95310 159968 155515 532197
15344 532197 212124 102638 363104 373277 369488 156079 435325 436779 43055 162952 121750
15333 121750 172038 -149100 113742 -56940 510230 261043 -11227 28488 398874 286284
15323 286284 189598 331367 232439 240565 65821 -29815 95326 190723 194527 -23703 424480
15311 -86264 9224 621683 310477 230696 319843 77203 -281932 68903 -89129 54197 99981
15300I9981Q8412N845k7080n3714J26920n8486p332a5957A76569f6565j64682
15289b31247D16454i8956c587p7002H595b23693A32908E5528J18168c2357r0242
15278a22599r5442i200r4459B76951A2491a29704h173C77543p5232e8107D6733
15266a51668j57785A36029F5538a09882C48405a88435A1795Q4160C1188j3883
15256A7305N8293J05417g6995C8539A8344h3667A56666e8863J4920B03139a27277
15244E1061K29785K16659P3640J299206m82129R6206O74062F00041B33903k7986
15234B05917J0978p5172E1873a78365C1191L52946a53964G958a22383M6171B22002
15222b938m4957E8894e7167B59040B3028P4593K05605A15523l3038G927J49561
$$ plain form
15300 99981 188393 194238 167158 113444 240364 181878 174546 -15957 176569 -66565 -231247
15289 -231247 416454 -98956 -3587 -80589 8595 -223693 132908 55528 173696 -32357 -122599
15278 -122599 -218041 -9200 -103659 276951 12491 -129704 -8173 377543 302311 -58107 46733
15266 -151668 -309453 136029 65538 -109882 348405 -188435 11795 95955 31188 17305
15256 17305 75598 181015 -76995 38539 18344 -83667 156666 -58863 -43943 203139 -127277
15244 51061 280846 497505 571145 1870351 1388222 1484428 2158490 600041 233903 205917
15234 205917 216895 141723 51873 -178365 31191 384137 -153964 7958 -122383 -76212 222002
15222 -2938 -47895 58894 -57167 259040 23028 97621 303226 115523 82485 7927 157488
15211A57488M371F1217M9814b22205A78299G0503J04794g2562B07393a3999j10642
15200a24641K1221G4108c6323A07034l6734l3044L40430j39106r1147a65873A06426
15188h003A33048l4737b28634B36908J30288j41473E7299f3836A98925a02329
15177A20063d2272B76714b1159A26033a14603B1344o962c0632E7334R4313J63876
15166C15523a14560D8730h5281E7570J53696A6475J73200a96327c8002I1041a92143
15154A25803a37156H4405B3658K16229p2394a15173B92983A20844a7669B78191
15143B20730G9108K61594a46176A38385a05059A37890i054A16771J00249g080
15132c8649B61400H5537O159K0854D4368L04603D4925N09665k59914D4381K03176
$$ plain form
15211 157488 161859 61217 111031 -222205 178299 70503 175297 -72562 207393 -13999 -124641
15200 -124641 -103420 74108 -36323 107034 70300 37256 377686 238580 147433 -165873 106426
15188 -8003 133048 98311 -228634 236908 367196 225723 57299 -63836 198925 -102329
15177 120063 -42272 276714 -21159 126033 -114603 21344 14382 -30632 57334 151647 315523
15166 315523 -114560 48730 -85281 57570 211266 16475 189675 -196327 -38002 91041 -192143
15154 125803 -137156 84405 23658 239887 167493 -115173 292983 120844 -17669 278191
15143 220730 79108 340702 -146176 138385 -105059 137890 -9054 116771 217020 -7080
15132 -38649 261400 85537 91696 112550 44368 348971 44925 554590 294676 44381 247557
15121B47557l3462p9545K06935A16847J16133j01035O6293A5611e5717a0267l091
15110a3358j97126B82545b88793A44815L7457J26428c1661E31545j90228J55692
15100D97009r5963G0421J02329q4507R2613p1097l7124J11623F4790J48576i1270
15088F1218B8773a47192g812C68540b1137A63488L49480b99076D18681D1932L1510
15077G3442C5404a07698B27396D7523L71333j90129q9654L72094g9255c8999k93789
15066c32788E2968P6427h9704A77786J75806A28060K13833j36388p5558R1466
15056B21413F6185L55063j77989O18Q7395k1232N1416j4630K23343k57605K72539
15045E85103A08058K73640q3068J6416J5499j42680K1383a28673D84174A53920
$$ plain form
15121 247557 214095 134550 341485 116847 232980 131945 198238 15611 -55717 -10267 -13358
15110 -13358 -210484 282545 -288793 144815 182272 308700 -31661 531545 341317 497009
15100 497009 401046 70421 172750 88243 180856 109759 72635 184258 64790 213366 -91270
15088 61218 28773 -147192 -7812 368540 -21137 163488 512968 -299076 418681 41932 73442
15077 73442 35404 -107698 227396 47523 418856 228727 139073 511167 -79255 -38999 -332788
15066 -332788 52968 129395 -89704 177786 353592 128060 341893 205505 129947 221413
15056 221413 66185 421248 243259 243877 331272 310040 361456 346826 570169 312564 585103
15045 585103 108058 381698 298630 315046 330545 187865 209248 -128673 484174 153920
15034B58090J947J65816M39108k58831J29332J39262K59032B70849K72331j42588
15024D00592J87774j42698I9022K92091j913M55142k92387j9798j3707k40338
15014B78112O0067k778M23487j33611K3471l2744J2237k0825k26437r4634K34830
15003E21175p7872N9129p6687L07030B08399M59953k02089B03477K72256r3325
14993C82408J17378k38516M4755q5915M90146j50523k01584J47479O523N4090
14983E66241o0312L40285J86120j29533K84155E44136Q6491o0193j45904K49858
14973F74388l1080L60313l5347D01514J0094N6125l4510r6145r9353N1554M0377
14962C29656H9253L24244n2001j50304n5433M27344G1860e0828A27834b4288E06908
$$ plain form
15034 258090 260037 425853 864961 606130 735462 874724 1133756 270849 543180 400592
15024 400592 588366 445668 99022 391113 389200 844342 551955 532157 518450 278112
15014 278112 338179 335401 758888 625277 648748 616004 628241 607416 380979 286345 521175
15003 521175 443303 502432 425745 732775 208399 668352 466263 203477 475733 382408
14993 382408 499786 261270 306025 220110 710256 559733 358149 505628 512151 566241
14983 566241 505929 846214 1032334 902801 1186956 544136 630627 570434 424530 674388
14973 674388 643308 1003621 968274 401514 411608 467733 433223 337078 237725 289279 329656
14962 329656 89253 413497 361496 211192 155759 583103 71860 -50828 127834 -24288 506908
14950D22733j39677Q1335k3474J69073k44972R4058K31356K75304k06359K76426
14940I35803D33020K8814L28369l37724J92036j53527O0975K87717j01210J3065
14930G51535J49552K9068L7218M62037J34457J02131K79085k25448j04881n3152
14920A561602k02479K68257J73461L29048K71682l7766p39987k20054k47895m28751
14910G27118L79231n02264j73136L48989j35607B53032N48497l38700q348J12245
14900E66726A68496J52629K80568k08045j78182J29972p2347K94908j22451J25836
14890E71384k47138L62104k49480M12055C57804M22096j17300o0320J59945M996
14880G67221p0060L21441C08041O18657D60805j08012J15139J04182l1035j45171
$$ plain form
14950 422733 283056 364391 340917 509990 265018 359076 590432 865736 659377 935803
14940 935803 433020 461834 790203 452479 644515 490988 551963 839680 738470 751535
14930 751535 901087 930155 967373 1429410 1563867 1665998 1945083 1719635 1614754 1561602
14920 1561602 1359123 1627380 1800841 2129889 2401571 2363805 1623818 1403764 1155869 727118
14910 727118 1106349 604085 430949 779938 644331 253032 801529 462829 454481 566726
14900 566726 168496 321125 601693 393648 215466 345438 273091 567999 445548 571384
14890 571384 324246 686350 436870 848925 357804 779900 662600 602280 762225 767221
14880 767221 697161 1018602 308041 926698 460805 352793 467932 572114 541079 395908
14870C95908J33222B05844M72977J01244J59833B82134N51866k48216J22249N4129
14860G62162k54849J19587k26797A64302K51779K67380l23973o8950A15834N55869
14850F71703l33325M41622A26240L12823L67111m991M07434k67158L81313j20634
14840A202138J43562l93739J30472l37962K19181k37963l0770L7932m3817j45164
14830E43870K6727K8708j09645k15441N28441D00782J2245L43291k06225j97482
14820C52611N74578l58738J96427K41361l27535R4977K1060J80483m43597N7674
14810E89301k60674K11060K75538K58847k73507R2542N6728P7786j77281j69602
14800F80738j93040o28l3097O0347L00311l1594m0013l46832q6520Q3555M34170
$$ plain form
14870 395908 529130 205844 678821 780065 939898 282134 834000 585784 708033 762162
14860 762162 507313 626900 400103 164302 416081 683461 359488 290538 115834 671703
14850 671703 338378 780000 126240 439063 806174 801183 1208617 941459 1322772 1202138
14840 1202138 1345700 951961 1082433 744471 963652 725689 694919 732851 689034 543870
14830 543870 570597 599305 489660 274219 802660 400782 413027 756318 550093 352611
14820 352611 927189 568451 764878 1006239 678704 773681 794741 975224 531627 589301
14810 589301 328627 539687 815225 1074072 800565 893107 949835 1027621 850340 680738
14800 680738 487698 487070 453973 514320 814631 783037 743024 396192 309672 393227 827397
14789H27397A18033L12022K59928j73236K90164l30951N11832l35494L646j07677
14779E48267J50242r3675j25746M58792j31706J32079R7073l75782J5683o9402
14769F05825L47776l19634j70469L1127O3415K84286C89118K10610k411K05201
14759H02518j83755J94569k81184J4995J01123O3711j12064k8601j25817K11514
14749F57009J87509K43318l49610j25527M0297J36314O2926j92058j39152L13521
14739H34547k19065R9754l55046M00227j90654K90800L55924j95619q9758N20503
14729A451613j92929N82673J49685j95167k78771Q0487l55335k22199j32447M2294
14719I29904M7799j80648Q3604J19157k11045k83622M36648Q8131k62344O3663
$$ plain form
14789 827397 118033 430055 689983 516747 806911 475960 987792 652298 655944 548267
14779 548267 698509 604834 479088 937880 806174 938253 1035326 659544 675227 605825
14769 605825 953601 633967 463498 494625 558040 842326 389118 599728 597317 802518
14759 802518 618763 813332 532148 547143 648266 711977 599913 571312 445495 657009
14749 657009 844518 1087836 738226 612699 652996 789310 852236 660178 521026 834547
14739 834547 615482 715236 360190 760417 569763 860563 1216487 1020868 931110 1451613
14729 1451613 1258684 1841357 1991042 1795875 1517104 1597591 1242256 1020057 887610 929904
14719 929904 977703 797055 880659 999816 788771 505149 941797 1029928 767584 831247
14709H31247n6296K28921M29892m42373J33177j3787N59243J68417M5212k5k40472
14698A643156L63909o04528k84008q8951j60118J80795l30217K26088L01675n46919
14688G00882n4740q2804L40313J18066j93184R4776Q3601J11056j31311l02515
14678F84140K89659k00779K62942q9835M7826R8826C27357Q80169l50263J1157
14668H68420K26716k02640J46138j23132m911m8376Q9905N5365r0431j3683J68927
14657A072298K13276n43137M12684p3498K29215J40056j45696n654p5868l31264
14647H92412M66513j22213j49034K50316L8586l33432K27092l86534K83870K07537
14637A375113l00935j12922K00070K62433l89574K69897j34986J30024p6746L39954
$$ plain form
14709 831247 774951 1003872 1433764 991391 1124568 1110781 1670024 1838441 1883653 1883628 1643156
14698 1643156 2007065 1402537 1118529 1029578 869460 1050255 720038 946126 1247801 700882
14688 700882 646142 563338 903651 1021717 828533 923309 1006910 1117966 986655 684140
14678 684140 973799 773020 1035962 946127 993953 1092779 327357 1207526 857263 868420
14668 868420 1095136 892496 1038634 915502 910591 862215 952120 1007485 917054 903371 1072298
14657 1072298 1285574 742437 1155121 1081623 1310838 1450894 1305198 1299544 1223676 892412
14647 892412 1358925 1236712 1087678 1337994 1376580 1043148 1270240 883706 1167576 1375113
14637 1375113 1074178 961256 1161326 1423759 1034185 1304082 1169096 1299120 1222374 1562328
14627A562328l7886j88331p6707j03015J73040N1936j8089l11894k15838O79882
14617A515426m8479k86104j35504M92387m13017J89301K48305q0574l4746J8138
14607A465133k58087J95710k71462M75635o4635k70377J1909L62512o4879K7197
14597A608656l27831M12198q0990m9327l6904J00115P907j31252N09035k54447
14587A757160K41035m76608J52272L88519l48125Q2843M1022K12745l48497m2030
14577A660336M81981O8311k68003j67551K25491j8706J27153L15262o87663M07918
14567B144529J82208m60626N41475k69033L82931J13679j26671K73332k54776
14558B527048J49000R9900p1960L61602J89727J90372M48550M06285J013549J848356
$$ plain form
14627 1562328 1524442 1336111 1259404 1156389 1329429 1381365 1363276 1051382 835544 1515426
14617 1515426 1466947 1180843 1045339 1537726 1124709 1314010 1562315 1481741 1446995 1465133
14607 1465133 1207046 1402756 1131294 1606929 1542294 1271917 1283826 1646338 1581459 1608656
14597 1608656 1280825 1693023 1612033 1562706 1525802 1625917 1633824 1502572 2011607 1757160
14587 1757160 1998195 1521587 1673859 2062378 1714253 1797096 1838118 2050863 1702366 1660336
14577 1660336 2142317 2210628 1942625 1775074 2000565 1981859 2109012 2424274 1736611 2144529
14567 2144529 2326737 1866111 2407586 2138553 2521484 2635163 2508492 2781824 2527048
14558 2527048 2676048 2775948 2703988 3065590 3255317 3445689 3894239 4300524 5314073 7162429
14548G162429L299571P741369K1836611N048104A8920670H474699l893280j437444
14540C143975m97950j41712K50895K059302p2873j719159r28282K61755m48215
14531A907736M49877m83387K60298Q4147L08801m04902J598j50774J95661N2199
14521B221254n4189O8252M9626K128K69359M5353j65246M0937j31180J00655L77909
14510B824858m00597L36579j41179q1503L30593j25726J11991K13940k66728J03412
14500B905640j55196J76327r5967K23183J73411q4751n7868k9297K90459j66067
14490C179874J64914j25492K13257N0851N2024J7233k2485k69591n7280L67286
14480C570591K970M23762j88933J78107j16707R0951l23322K32129J36715k97676
$$ plain form
14548 7162429 10462000 18203369 40039980 45088084 18920670 8474699 4581419 3143975
14540 3143975 2646025 2504313 2755208 4814510 4741637 3022478 2094196 2355951 1907736
14531 1907736 2357613 1874226 2134524 2218671 2527472 2122570 2124168 1973394 2169055 2221254
14521 2221254 2167065 2235317 2284943 2287071 2556430 2601783 2436537 2477474 2346294 2446949 2824858
14510 2824858 2424261 2760840 2619661 2538158 2868751 2743025 2855016 3068956 2802228 2905640
14500 2905640 2750444 2926771 2830804 3053987 3227398 3142647 3084779 3055482 3345941 3179874
14490 3179874 3344788 3219296 3432553 3483404 3535428 3552661 3530176 3260585 3203305 3570591
14480 3570591 3573561 3997323 3808390 3986497 3869790 3960741 3637419 3869548 4006263 3708587
14470C708587L95133l87883N63739o2828J76432J50738o3590p6950l2638K05935
14460D576675j36689O78197k78284j09614J72234j85578L44207j04558M75897
14451E432487j84174j8684j833J72874m5565K46988p5840K9548p6243j11364O01901
14440E970095l70820M86586o5070M1615j4954L66424k04460O5621M89977j06571
14430F658443j33845K73326R283P697J98991R8769L34851p2709M54590L79779
14420H209175k74678K82899N756q127K91875r1618k06119K03028J17809K75013
14410H805013K39618j04058K02073J58876K14479M76697J84111k14768K20926
14401A0182967j34377L47850j9153L350N37114j03576K99997o0604K66461K72324
$$ plain form
14470 3708587 4103720 3715837 4279576 4216748 4393180 4543918 4480328 4403378 4370740 4576675
14460 4576675 4439986 5118183 4839899 4730285 4902519 4716941 5061148 4956590 5432487
14451 5432487 5248313 5229629 5227796 5400670 5355105 5602093 5526253 5555801 5479558 5368194 5970095
14440 5970095 5599275 6085861 6020791 6062406 6047452 6413876 6209416 6275037 6765014 6658443
14430 6658443 6524598 6797924 6807207 6814904 7013895 7112664 7447515 7374806 7829396 8209175
14420 8209175 7934497 8217396 8223152 8215025 8506900 8415282 8209163 8412191 8530000 8805013
14410 8805013 9044631 8940573 9142646 9301522 9516001 9992698 10176809 9962041 10182967
14401 10182967 10048590 10396440 10377287 10380637 10917751 10814175 11114172 11053568 11320029 11592353
14391A1592353j08955K50872M83560L08939L11700p7540K05433N88795M35728
14382A3990885J12397L04299L87513O1703l40100N74611K36589K23821N17518
14373A6069236L53861M6289O33076Q5445Q22540N7862N51320N44868M33541L92378
14363A9990416J92567J80552M37112N95103K87278P71621L18653M88351N68843
14354B3830496P82729L02250P63535M13812Q96979Q40785L42215O88372Q29061
14345B9690234P32502P56303R67673Q78232P23310O61683J157580Q36948J114736
14336C7519201J294699J167123R35983J344461J288013J396594R96903J900490
14328D7843467J511163J531179J668367J312401K223854K245621J902897K146614
$$ plain form
14391 11592353 11483398 11734270 12217830 12526769 12838469 12760929 12966362 13555157 13990885
14382 13990885 14103282 14407581 14795094 14856797 14516697 15091308 15327897 15551718 16069236
14373 16069236 16423097 16469386 17102462 17187907 18010447 18068309 18619629 19164497 19598038 19990416
14363 19990416 20182983 20363535 20800647 21395750 21683028 22454649 22773302 23261653 23830496
14354 23830496 24613225 24915475 25679010 26092822 26989801 27830586 28172801 28861173 29690234
14345 29690234 30422736 31179039 32146712 33024944 33748254 34409937 35567517 36404465 37519201
14336 37519201 38813900 39981023 40917006 42261467 43549480 44946074 45942977 47843467
14328 47843467 49354630 50885809 52554176 53866577 56090431 58336052 60238949 62385563
14320F2385563K170263K140307K789209K290877K640356K650956L124808L266374
14312H3458713L167216L781892L560069L921653M189546M566060M469072N261159
14304A16375380N505782N479465N871796O152278P039515O529533Q116512Q232366
14296A69302627Q336412Q874770R611146J0325432J0685316J1202252J1984065
14289B40322020J2200420J3309971J3471923J3959993J4901505J4736488J5528178
14282C38430498J5340618J5298623J5411961J4786262J3997476J3072955J2291241
14275D38629634J0345243P523965L446755J123303O18242o86415l683704m682650
14267D52634373o162781q848828r367532j0534756j1871591j3662070j4710502
$$ plain form
14320 62385563 64555826 66696133 69485342 71776219 74416575 77067531 80192339 83458713
14312 83458713 86625929 90407821 93967890 97889543 102079089 106645149 111114221 116375380
14304 116375380 121881162 127360627 133232423 139384701 146424216 152953749 161070261 169302627
14296 169302627 177639039 186513809 196124955 206450387 217135703 228337955 240322020
14289 240322020 252522440 265832411 279304334 293264327 308165832 322902320 338430498
14282 338430498 353771116 369069739 384481700 399267962 413265438 426338393 438629634
14275 438629634 448974877 456498842 459945597 461068900 461687142 461000727 457317023 452634373
14267 452634373 446471592 437622764 428255232 417720476 405848885 392186815 377476313
14260C77476313j5074029j5356167j5867836j6175606j5431327j4974458j4495897
14253B70100993j3462211j3371634j2536512j1649766j1299958j0164180q606381
14246A89010351r755519q863423p990078p786223p245471p105056o243680o614806
14238A27406095n203947n219734n074160n213896m006194m753519m093671l085138
14230I0755836l606526l863318l107120l316818k960088k670084k598914k544141
14222F6088827j919413k641349j671249k163961k114436j636000k028620j599593
14214E0314206q52100j453640j660824j491304j899523j145386q54260o77235
14206D0279934j018851j501383j339597o53201j179644q68312o06502r15043r29875
$$ plain form
14260 377476313 362402284 347046117 331178281 315002675 299571348 284596890 270100993
14253 270100993 256638782 243267148 230730636 219080870 207780912 197616732 189010351
14246 189010351 179254832 170391409 162401331 154615108 147369637 140264581 134020901 127406095
14238 127406095 122202148 116982414 111908254 106694358 102688164 97934645 93840974 90755836
14230 90755836 87149310 83285992 80178872 76862054 73901966 71231882 68632968 66088827
14222 66088827 64169414 61528065 59856816 57692855 55578419 53942419 51913799 50314206
14214 50314206 49462106 48008466 46347642 44856338 42956815 41811429 40957169 40279934
14206 40279934 39261083 37759700 36420103 35766902 34587258 33718946 33112444 32197401 31267526
14197C1267526j085860p27194n93654o17355m92672o57820p46860j103870j10475
14188B5131766r99231l44763m58039o67678k00285q47018n3889o97212n25886
14179B0337765p28586k6641j84768n51749m93946k86237n55233l79787J11411
14170A7242229p74922k21315Q5410o95284j33319l65486m68858q8714l6351k70697
14160A4272693k08418m00017n60816L1596j72917l55558O7933l01903p6072n26938
14150A1769583Q1699l18409j83218j25021K9454m92892o0773j6241m07510p6572
14140A0200100j03775k05094p3221m75690l6082J4918l73536J49580j60787P7980
14130I014393m56962j50953L0135k2432k92489K74341o45378K63568k41008K2515
$$ plain form
14197 31267526 30181666 29454472 28860818 28243463 27750791 27092971 26346111 25242241 25131766
14188 25131766 24132535 23787772 23329733 22662055 22461770 21614752 21560863 20863651 20337765
14179 20337765 19609179 19582538 19397770 18846021 18352075 18065838 17510605 17130818 17242229
14170 17242229 16467307 16245992 16331402 15636118 15502799 15137313 14668455 14579741 14543390 14272693
14160 14272693 14064275 13664258 13103442 13135038 12962121 12606563 12674496 12372593 12296521 11769583
14150 11769583 11851282 11532873 11349655 11224634 11254088 10761196 10700423 10684182 10276672 10200100
14140 10200100 10096325 9891231 9818010 9342320 9306238 9321156 8947620 9097200 8936413 9014393
14130 9014393 8557431 8406478 8436613 8414181 8121692 8396033 7750655 8014223 7773215 7795730
14120G795730l15442L22610n56368K98724n65916J12517l30221J88961k17063
14111F733532J61998j50583P9655l90050K2904L4333l12839L00091m11660J46147
14101F213528j48332j63518Q7417J42678k01941j05157k39241j37329q495k33885
14091E205725q9164N3463J45686l30621J96613l0496j05230j15701o0111j5985
14081D854179l58332N08057l46894k60866R5506j04856o2632n526P7327j04875
14071D291088m1363o8970j07872J02158p9230K80561m30079n7036J91433J60478
14061D241168j79621l01979P9240m8449L88448k00645l84736K82930J8936l43441
14051C551851K23374K933j57404r7867k11158M81658k98865J68249l43806o3702
$$ plain form
14120 7795730 7480288 7802898 7246530 7545254 6979338 7091855 6761634 6950595 6733532
14111 6733532 6895530 6744947 6824602 6434552 6457456 6491789 6178950 6479041 6067381 6213528
14101 6213528 6065196 5901678 5989095 6131773 5929832 5824675 5585434 5448105 5439610 5205725
14091 5205725 5116561 5170024 5315710 4985089 5181702 5151206 5045976 4930275 4870164 4854179
14081 4854179 4495847 5003904 4657010 4396144 4491650 4386794 4324162 4318636 4395963 4291088
14071 4291088 4249725 4180755 4072883 4175041 4095811 4376372 3946293 3889257 4080690 4241168
14061 4241168 4061547 3759568 3838808 3790359 4178807 3978162 3593426 3876356 3895292 3551851
14051 3551851 3775225 3778158 3620754 3522887 3311729 3793387 3494522 3662771 3318965 3255263
14041C255263N7024k60339L22415n80258L65037o9952n8854o0256j40243M45534
14031C275371l22516J56923l06844K01968n1569k21956K62974m72863L64004n94031
14021B291461K03286L17439r9002K9083l83427J5960R6679J96677j71157j23918
14011B373081L80037l10558k07493k76608J60284L00378j27804q4424q3887j60647
14001A962359J47073O83k18293J74441P2031j2147k82049o7756K95713J14302
13991B186357k06422M58924O35226K367245N094551J9129966J9761364k3106602
13983B6320609j2650642n099411k304445j066533j081646n55565m05081j1806
13975C145480r1208k00413k8389n0607k15796j54989k21752L16428j02768k47265
$$ plain form
14041 3255263 3312287 3051948 3374363 2794105 3159142 3089190 3030336 2970080 2829837 3275371
14031 3275371 2952855 3109778 2802934 3004902 2953333 2731377 2994351 2521488 2885492 2291461
14021 2291461 2494747 2812186 2713184 2742267 2358840 2374800 2471479 2668156 2496999 2373081
14011 2373081 2753118 2442560 2235067 1958459 2118743 2419121 2291317 2206893 2123006 1962359
14001 1962359 2109432 2110115 1891822 2066263 2138294 2126147 1844098 1776342 2072055 2186357
13991 2186357 1979935 2438859 3074085 5441330 10535881 29665847 49427211 26320609
13983 26320609 13669967 8570556 6266111 5199578 4117932 3562367 3157286 3145480
13975 3145480 3054272 2853859 2825470 2774863 2559067 2404078 2182326 2498754 2395986 2148721
13965B148721K48215M266l06968J41191k29723L98429n16137J85450R2185M6008
13955B211637l91597R3351j73537K62733J58745k70678j58791J25488Q207K63042
13945B128600j62824m64917L79728k30755J01046l3442Q3460k44259k70725N06419
13935A792331l56550k26932M47834j20406Q0653J43295j68210k0955l76379N01860
13925A696541l69087K25570K80767k57231q6109j44957L27060m48956M03450j89949
13915A437099J09721j01325j64433K17782k00091p2497k46419L99423p6161K35328
13905A538427j32604j85227J95063k16027O7035J16913n3565K13553l95278k6254
13895A122036k0800J91759r708K36256l06351q0253J40733K52199q435k35687
$$ plain form
13965 2148721 2396936 2401202 2094234 2235425 2005702 2404131 1887994 2073444 2165629 2211637
13955 2211637 1820040 1913391 1739854 2002587 2161332 1890654 1731863 1857351 1865558 2128600
13945 2128600 1965776 1500859 1880587 1649832 1750878 1717436 1800896 1556637 1285912 1792331
13935 1792331 1435781 1208849 1656683 1536277 1616930 1760225 1592015 1571060 1194681 1696541
13925 1696541 1327454 1553024 1833791 1576560 1490451 1345494 1672554 1223598 1627048 1437099
13915 1437099 1546820 1445495 1281062 1498844 1298753 1226256 979837 1379260 1303099 1538427
13905 1538427 1405823 1220596 1415659 1199632 1266667 1383580 1330015 1543568 1148290 1122036
13895 1122036 1101236 1292995 1283287 1519543 1213192 1132939 1273672 1525871 1517436 1281749
13885A281749j07612J11740l01410L41756o7698k43592L32586l04001j220K63925
13875A306223J29179k98684l3480K9454N8476k59138N54528k95471J05485j30082
13865A166490L3772j59964J08594k79834J79292j18252L07465j99834q1052K36257
13855A192934j21928k74314J85958J52979o4318j82575K28226l75029L69991k40173
13845H71751j21862j65491J56000K55959k86286K39810k18390N28049k07074j57685
13835H94781J94565J30078m80007O4217O0329J13006k31807k2524J31259j18992
13825G34905O4557o680j14798K96817j06594J63449k64787K38682j39524j13946
13815G52081N0920J17597j65655J6466L07992j43158N2658J11792l37450j77912
$$ plain form
13885 1281749 1174137 1285877 984467 1326223 1258525 1014933 1347519 1043518 1042298 1306223
13875 1306223 1435402 1136718 1103238 1132692 1191168 932030 1486558 1191087 1296572 1166490
13865 1166490 1200262 1040298 1148892 869058 1048350 930098 1237563 1037729 956677 1192934
13855 1192934 1071006 796692 982650 1135629 1071311 888736 1116962 741933 1111924 871751
13845 871751 749889 584398 740398 996357 710071 949881 731491 1259540 1052466 894781
13835 894781 1089346 1219424 739417 803634 863963 976969 745162 722638 853897 734905
13825 734905 799462 792782 677984 974801 868207 1031656 766869 1005551 866027 752081
13815 752081 803001 920598 754943 771409 1079401 936243 988901 1100693 763243 585331
13805E85331J10756N146j15234j0179L64108l15914j58387N81833k21592n0250
13795G75618M3016j8401q9754J50481k67855M76069j45083Q5385m31957J93699
13785G71218Q8268j16736k32415M80631k02498l01916J22237K91493k16657K54398
13775I38023K35093E28652M02836N8435m10619l1188k4837K75843k3040j51878
13765F24204p5376K4219K1152J32972l09318L15163j35067P1753k59862J57041
13755E66881n624k4371L70633j32327P0097q9145k02939N6377j05640B44702N32026
13744G76728l24460K01355J73843k83354j92203J51056K31501q6060j48698j29568
13734C70140O1998J50794K2211N2131J55236k2079L835r1431C01115K00074L93470
$$ plain form
13805 585331 696087 701233 585999 575820 939928 624014 465627 1047460 825868 775618
13795 775618 818634 800233 710479 860960 593105 1069174 924091 1009476 577519 771218
13785 771218 859486 742750 510335 990966 788468 486552 608789 900282 683625 938023
13775 938023 1173116 528652 931488 989923 579304 548116 523279 799122 776082 624204
13765 624204 548828 573047 594199 727171 417853 733016 597949 669702 409840 566881
13755 566881 561257 536886 907519 775192 845289 756144 553205 609582 503942 244702 776728
13744 776728 452268 653623 827466 544112 351909 502965 734466 648406 499708 370140
13734 370140 432138 582932 605143 657274 812510 790431 794266 702835 301115 501189 894659
13723H94659l36033j85542K26351o3561l9634J6492B43420J10423k6823N2278
13713C79298K72049K5531j40804q5413J77372O2601k31781j36882K09465J2914
13703E44350r129j1635N4621m8872R0572k21265p9278J99453J03644k68248j31256
13692B22957M26607k07565j36182K90182j68143K18288J96237C91648K84223o8522
13682F07349k24102D5113L73155P0513j68250K30169o1596K48336B12379M70422
13672F82801L6849j74786Q3581o2310L4727k84313r8536L5934L89309j24249j02243
13661D16764j79813J56394J42092j33756h298E52046j71019K3454P7332j44385
13651C37428r7959n5409K91583j28354n0556J23565j56301L98623B63673M45301
$$ plain form
13723 894659 558626 373084 599435 535874 496240 512732 243420 353843 327020 379298
13713 379298 651347 676878 536074 450661 628033 690634 458853 321971 531436 544350
13703 544350 535221 523586 578207 529335 619907 398642 319364 518817 622461 354213 222957
13692 222957 649564 441999 305817 595999 427856 646144 842381 391648 675871 607349
13682 607349 383247 45113 418268 488781 320531 550700 489104 737440 212379 682801
13672 682801 719650 544864 628445 566135 600862 316549 218013 253947 643256 519007 416764
13661 416764 236951 393345 535437 401681 -8298 552046 381027 404481 481813 337428
13651 337428 239469 184060 475643 347289 296733 420298 263997 662620 263673 708974
13641G08974l14686j16718j15677L70146B64034J87780j53197n0316J43603q2005
13631C09899h4648A91237l279J3648q0801i7351F4549N66248B89745K22903L22741
13620H35389d4345D0762K78658j16892J85669N2656j50302M5721K24275B01892
13609A94380A9306N40443j50790j06240k7888r3626J58925o6640Q8509r965j72736
13598A79298J40784K8831L4193A35605J64517j26098Q5389l2036N4274j5047p9558
13587A87046K62575j26791R5730J3920a04148F50263l06094K30558B19352J68019
13577C87371j0973A86980L28056j20205r9935L54560k46367J60825k50865b22
13566F55781B27485E5902L57187l7697N8447k02531N6657K00651J70021B55730
$$ plain form
13641 708974 394288 277570 161893 532039 264034 451814 298617 248301 391904 309899
13631 309899 -84648 191237 187958 201606 120805 -97351 64549 630797 289745 512648 835389
13620 835389 -44345 40762 319420 202528 388197 440853 290551 336272 560547 201892
13609 194380 19306 559749 408959 302719 274831 181205 340130 273490 361999 352034 179298
13598 179298 320082 348913 383106 135605 300122 174024 259413 227377 281651 266604 187046
13587 187046 449621 322830 418560 432480 -104148 650263 344169 574727 219352 387371
13577 387371 376398 186980 515036 394831 294896 649456 403089 563914 313049 -222
13566 655781 227485 55902 413089 375392 433839 231308 287965 488616 658637 255730
13555D28027l8374J18976G5020J89239m5990M67350c3212B74641K72152k34285
13545C12508L1920l2102P3573j11735P0248o5910P4055A35538C2204J49707K28118
13534D10029H2665P0692Q1873q6951L40990n9320a52023A98832O1931D2248K81786
13523C24034R8997j79791M38678j91612k07615H6790J88801f4206o3673A38285
13512A81972l2527J53090o3580P116M9956A12852R9294G9176O5134i5660A11277
13500A82950G9565j8251L93202A42917N9549Q6201m7532b3165m727B51030R2527
13489C43557j06534K41578k05339l8976j15989K28705H5512h3511C46898k0082
13479C26816C5559A2161J38934E8403J66719A4220K55006K46093c3393n0821D30349
$$ plain form
13555 428027 389653 508629 75020 264259 218269 685619 -33212 274641 546793 312508
13545 312508 344428 312326 385899 274164 344412 278502 352557 135538 32204 181911 410029
13534 410029 82665 153357 235230 148279 489269 429949 -152023 198832 260763 42248 324034
13523 324034 423031 243240 681918 490306 282691 86790 275591 -64206 -127879 138285
13512 181972 149445 302535 238955 246071 296027 112852 212146 79176 144310 -95660 111277
13500 182950 79565 61314 454516 142917 202466 288667 241135 -23165 -27892 251030 343557
13489 343557 237023 478601 273262 234286 118297 347002 85512 -83511 346898 326816
13479 326816 35559 12161 151095 58403 225122 14220 269226 515319 -33393 -84214 430349
13467A91647i8189B15229A9308J22377Q8758L7806l7705K41515J08869B29109
13456B70145G5782J87024m9786J97518n0309j30032c4781j67028B73232g6338
13445A2841K13573r1653k1153J55067h2827A40226M9607J70124C60K23024G5070
13433b34547A13831j4756P9688K37869l3439L93229A42262O7699K8699e3237j35520
13422a88757G0192K55803R0612H8191c2822A80157b6677A92016P4363G2737K27618
13411C00355q8988J40620b15380E5052J94695M4164p3089L74353B06741k7223
13401A79518o62i527A50375B1431H671N4915a00899D64670N9770B05653n1078
13390A54575m1282J03331I8599d5878D21660k09624a0428A72691p2614J84563
$$ plain form
13467 191647 -98189 215229 19308 141685 230443 268249 230544 472059 580928 229109
13456 270145 75782 262806 213020 410538 360229 230197 -34781 -201809 273232 -76338
13445 12841 226414 134761 113608 268675 -82827 140226 189833 359957 360 223384 75070
13433 -234547 113831 99075 178763 416632 383193 776422 142262 209961 238660 -53237 -188757
13422 -188757 70192 325995 416607 88191 -32822 180157 -26677 192016 266379 72737 300355
13411 300355 211367 351987 -215380 55052 249747 293911 220822 595175 206741 179518
13401 179518 178856 -9527 150375 21431 8671 63586 -100899 464670 524440 205653 154575
13390 154575 113293 216624 98599 -45878 421660 212036 -10428 172691 100077 284640
13380B84640N9391A60737J04953j15850a44123B01990G527J45773B9044M6403
13370G5447k8034M20174q6607n6100A30517A4259N53245n7134B02656K28218o7332
13359C63542j81169L7092R633J26111j51948o2802a58430C37085j53628a57760
13348B88785A03257C0817b06668A64122B9178L13284j67952J85056J68019k37328
13338B90257P6304P1685A91855L14665q0544A85446B7063K78656p1942J00311
13328C34088j56144o4422l7475M6519L4631R8361K10227b0757A20723m4555I595
13316a051j90B61409J0492j17844a09489A59270L71960r6751B12483a86610B73881
13304A00116J65504L0162D3718J10374o7625L14255j68653b6512B00585a86465
$$ plain form
13380 284640 344031 160737 265690 149840 -144123 201990 7527 153300 29044 75447
13370 75447 47413 467587 380980 324880 130517 14259 567504 510370 202656 430874 363542
13359 363542 182373 219465 229098 355209 203261 140459 -158430 337085 183457 -157760
13348 288785 103257 30817 -206668 164122 29178 342462 174510 359566 527585 290257
13338 290257 366561 438246 191855 506520 425976 185446 27063 305719 233777 334088
13328 334088 177944 113522 76047 122566 157197 255558 465785 -20757 120723 76168 9595
13316 -1051 -1241 261409 271901 154057 -109489 159270 531230 434479 212483 -186610 273881
13304 100116 265620 295782 43718 154092 86467 400722 232069 -26512 200585 -186465
13293A71010h1973A10323L38493A66066F8668I464a8145B85103f3590D5612a1477
13281D296O8565j0177h4834M0175J4069D08584j23363r7310j4969A3222c1322
13269F8270A2775d1736b081A78429A102K19109K91734A81983b55540C63928A06205
13257g2457B40842E7484a14809A81583I946J89300c56179A70503F1944b85825
13246D17711I7571J5238a98101A47098J40825D1345c5892C46952E2176a47455
13235h847D27138F0284M8402D7278a60727G4621g1850I4126N3731f8491J1775
13224e6716B28412D9716d449o3833k71403H8327b13317B44851j8683f3448r369
13213g2817m2364d3006D80308c2619A66762m2398h6095j47634A97335q5273k2577
$$ plain form
13293 171010 -81973 110323 448816 166066 68668 9464 -18145 285103 -63590 45612 -11477
13281 4296 72861 62684 -84834 -44659 -30590 408584 285221 187911 172942 13222 -31322
13269 68270 12775 -41736 -2081 178429 1102 220211 511945 181983 -255540 363928 106205
13257 -72457 240842 57484 -114809 181583 9946 199246 -356179 170503 61944 -285825
13246 417711 97571 112809 -198101 147098 287923 41345 -35892 346952 52176 -147455
13235 -8847 427138 60284 108686 47278 -160727 74621 -71850 94126 147857 -68491 -56716
13224 -56716 228412 49716 -4449 -68282 -339685 88327 -213317 244851 226168 -63448 -72817
13213 -72817 -115181 -43006 480308 -32619 166762 124364 -86095 -233729 197335 112062 89485
13202H9485j933L79172B20465i084C58486B0654M7197L55515j30172J24292a3625
13190b477B30830c7883A70283k8744b38773H0735J21532f85n2321j18709A7490
13178A15108e0036j2520C18343G156e9448b6865I6159m6292d51403B1905H275
13166A19392N995k4065K04638h6688I8915a63152C1611a2092G9507d663F3745
13154a35512I0692a60083A31489b51170r8037a61481j8762B42329b92223G9228
13143A83823O9047F1896K4623J20844A03050J2555n4011J0725J0002J27421L0166
13132B39908N1335E8048n67b20204B51117a6385l13767a5016B71946d441p2759
13121g7200C68743I6461k6741l1298a03477L0858j2239B26835g352C0172a86171
$$ plain form
13202 89485 87552 466724 220465 -9084 358486 20654 67851 423366 293194 417486 -13625
13190 -2477 230830 -37883 170283 141539 -238773 80735 202267 -685 -53006 -171715 17490
13178 115108 -50036 -62556 318343 7156 -59448 -26865 96159 49867 -451403 21905 8275
13166 119392 125387 101322 305960 -86688 98915 -163152 31611 -12092 79507 -4663 63745
13154 -135512 90692 -160083 131489 -251170 -349207 -161481 -180243 242329 -292223 79228
13143 183823 252870 61896 86519 207363 103050 115605 61594 72319 82321 209742 239908
13132 239908 291243 58048 57481 -220204 251117 -16385 -330152 -15016 271946 -4441 -77200
13121 -77200 368743 96461 69720 38422 -103477 -72619 -84858 226835 -7352 30172 -186171
13109D35711b07727N8064C07061a51737A12084K09262a21514J0500C05800c9570
13098B03572e7780A92617B7297J84056n0671d2773B12776A00894K36067a66962
13087a37741B96340E7757L37238g4673b5432A0897a57171a8939E0484M2820a64050
13075A31289a30293o4102M0827e4469C05440F8790L6424J17628F4552a9758r1981
13064a11739d5710B22388K7688b80126L913C2975F855b4857C6887g9192A89161
13052H3147b3212A01967L17275E1874K17685a19454j69294c0892A18761N4674
13042A73435k3275a1443m3881A8969K02894F168f0150n0203j44284A19612d338
13030D25399A76652a36231B842c8313A3862P2948l009a22201j45614A79528K78512
$$ plain form
13109 435711 -207727 -149663 307061 -151737 112084 321346 -121514 -111014 305800 -39570
13098 203572 -57780 192617 27297 211353 160682 -42773 212776 100894 336961 -166962
13087 -137741 296340 57757 394995 -74673 -25432 10897 -157171 -18939 50484 93304 -164050
13075 131289 -130293 -194395 -153568 -54469 305440 68790 105214 222842 64552 -19758 -111739
13064 -111739 -45710 222388 250076 -280126 -276213 32975 6855 -24857 36887 -79192 189161
13052 83147 -23212 101967 419242 51874 269559 -119454 -288748 -30892 118761 173435
13042 173435 150160 -11443 -55324 18969 221863 6168 -60150 -110353 -254637 119612 -4338
13030 425399 176652 -136231 2842 -38313 13862 86810 83801 -122201 -267815 179528 458040
13019D58040c60277J9838A35897E3344f6080A11652K35798A16147K18713k7977
13009C06883g9987B29273M23451B91496a01611A51133a49920B19892J25162G1601
12998c7484A42069i6862A74295p5719K5791f7158I275e8821a9572k27411A40910
12986b00563f4021E9156c3351j90540A33447a37985a1388A077a73952M7484C97991
12974A66462D6604a00994D0699b1813j9140B41637D5980N2829D0265K98634j23353
12963B15546a64212A6759f158p6277A9150L1187j5034a10995r2624g875j947H135
12950A79799A2825a78488Q817f9801C683R6711L363J13493B4246J28458a4427
12938a19712b7978a1457n7211c2595I9769N7210b52050A55347N5017f0355N516
$$ plain form
13019 458040 -360277 -340439 135897 53344 -66080 111652 347450 116147 334860 306883
13009 306883 -79987 229273 652724 291496 -101611 151133 -149920 219892 345054 71601
12998 -37484 142069 -96862 174295 98576 124367 -67158 9275 -58821 -19572 -246983 140910
12986 -200563 -64021 59156 -33351 -223891 133447 -137985 -11388 1077 -173952 -126468 397991
12974 166462 46604 -100994 40699 -21813 -40953 241637 45980 98809 40265 338899 215546
12963 215546 -164212 16759 -6158 -82435 19150 50337 35303 -110995 -203619 -7875 -9822 8135
12950 179799 12825 -178488 -169671 -69801 3683 100394 103757 217250 24246 152704 -14427
12938 -119712 -27978 -11457 -68668 -32595 99769 156979 -252050 155347 210364 -60355 -54839
12927e4839p6629l2588C60096c16104a46764B67548J1121I8391i2399j10296a7675
12915A80332b50174B67581G6945b378j24887A20448f117j38075A05376L38504
12905D43880a43344e854o1817h182A18564J65284A27225d21126F4537l1461a38566
12893h1376A82140R4897a14107A1203L51325A5229J78989p8538h6257n7333C6296
12881a05383L9370C2050c01153g0296B12833o1978o7649b5926B06765n4809c006
12869A92572g8328B23388P4912o6834F6001K69300A7938L0406f8093p844B06310
12857a60015A79274K31627b4332j63401a1993k21548d9389p5789g284A9060P2224
12846I1284L02775b27432j20003d4396o2871A20156a9432j64922f5569K1002D39046
$$ plain form
12927 -54839 -131468 -164056 360096 -316104 -146764 267548 278669 98391 -92399 -202695 -17675
12915 180332 -250174 267581 76945 -2378 -127265 120448 -6117 -144192 105376 443880
12905 443880 -143344 -5854 -67671 -8182 118564 283848 127225 -421126 64537 33076 -138566
12893 -81376 182140 277037 -114107 11203 362528 15229 194218 115680 -86257 -143590 36296
12881 -105383 -66013 32050 -301153 -70296 212833 150855 83206 -25926 206765 151956 -3006
12869 192572 -78328 223388 298300 231466 66001 335301 17938 48344 -68093 -75937 206310
12857 -160015 179274 410901 -24332 -187733 -11993 -233541 -49389 -125178 -7284 19060 91284
12846 91284 394059 -227432 -347435 -44396 -107267 120156 -19432 -184354 -65569 -44567 439046
12834d7762A68994a42497B2198b28224j2537g0474k34862E7977e2871E551a23553
12822B8853q424d3025B11070a26674M8154B2590a40571I9602c13120C65931A23644
12810g5290q6749A95601i1708r5219A53105D9350Q6377J28625h4546C1128f3175
12798H979J55863P2449a24287m9922H0002d9572j8073A63623a82883G3062a2672
12786F8777B9827a47391B26818f6595A56787p6741d8631B73996c6621A15350a6154
12774C4589i199G6880a45734B9058C759R4095i5715j57508b6139I9587J546J84334
12762B85467a4413j50989r770m6277f8055a3624m8597D7637H512a66245D7323
12750A9524J06602j5868b81597g8766C23526b03834b3969E039J56384R1824a54210
$$ plain form
12834 -47762 168994 -142497 22198 -228224 -240761 -70474 -305336 57977 -52871 5551 -123553
12822 28853 20429 -43025 211070 -126674 -78520 22590 -140571 99602 -313120 365931 123644
12810 -75290 -162039 195601 -91708 -186927 153105 49350 135727 264352 -84546 31128 -63175
12798 8979 164842 237291 -124287 -174209 80002 -49572 -67645 163623 -182883 73062 -12672
12786 68777 29827 -147391 226818 -66595 156787 80046 -48631 273996 -36621 115350 -16154
12774 34589 -9199 76880 -145734 29058 3759 97854 -95715 -253223 -26139 99587 101133 285467
12762 285467 -14413 -165402 -175172 -221449 -68055 -13624 -62221 47637 8512 -166245 47323
12750 19524 126126 110258 -281597 -78766 323526 -203834 -23969 5039 161423 253247 -154210
12738h2449H7674k1807g6896k46906G0825K95936j61999a09091C16767J02180
12728D18947d4931P071A74313i4413R282q3f740k2856k65710a6656o240l08203
12716c31099a52415k5241d5946A97731c9969J6477C62717C5279J87467J17265
12706C40011i0943B34074G2676N04932K0352a70056k5724a0685A96546A2690K00148
12695B12838N7481a37208A23494C886d88957e5624q2213A38421a40762j2376A7833
12683a74208c2314A26213K7143B7185C561M43452A8987K00765J79352e7320B8364
12671C3744d47922k1674A65804a28668j09332A96954C9588d02780e5052H8969
12660B6894a75454E9889J22705b54956f4774D44637F1378K14288a21880A03839
$$ plain form
12738 -82449 87674 65867 -76896 -323802 70825 366761 204762 -109091 316767 418947
12728 418947 -44931 -37860 174313 -94413 -85131 -85214 -6740 -29596 -295306 -16656 -22896 -331099
12716 -331099 -152415 -177656 -45946 197731 -39969 -23492 362717 35279 222746 340011
12706 340011 -90943 234074 72676 577608 597960 -170056 -195780 -10685 196546 12690 212838
12695 212838 270319 -137208 123494 3886 -488957 -55624 -137837 138421 -140762 -153138 17833
12683 -174208 -32314 126213 153356 27185 3561 447013 18987 219752 399104 -57320 28364
12671 33744 -447922 -469596 165804 -128668 -238000 196954 39588 -402780 -55052 88969
12660 26894 -175454 59889 182594 -254956 -64774 444637 61378 275666 -121880 103839
12649c0699l6988K022B60831c1402C95798d4447l9572A95956c0542k1135A22702
12637b15771a07323l849L6270b0778G9625E924J42771K9950J7362K37092B02613
12625c3017j3129j06645B17377IK56844q1076g3454n8220C82556k3174f6257n2640
12613a18897D0355K2991P5723m852n3614j7944a78933J0485C48401b6397B39738
12601c1858C4845a48198d4615F5297J7552a46725j16423a28051A83293F3393K5899
12590H9292k5883L5123k3278K89452b93155h291k13534h0333r397j45583f3010
12578A33988e841A00891D5873J50652a40998J1000A30954K21232A6039P8057a65284
12566C308a61709A23268J50216B2751b60687H1635e9860m6797F6231a99780e174
$$ plain form
12649 -30699 -67687 -65665 260831 -31402 395798 -44447 -84019 195956 -30542 -51677 122702
12637 -215771 -107323 -111172 -74902 -20778 79625 5924 148695 178645 196007 433099 202613
12625 -33017 -46146 -152791 217377 9 256853 175777 -73454 -131674 382556 359382 -66257 -118897
12613 -118897 40355 63346 139069 134217 80603 62659 -178933 -168448 348401 -26397 239738
12601 -31858 34845 -148198 -44615 65297 82849 -146725 -263148 -128051 183293 63393 89292
12590 89292 63409 98532 75254 364706 -293155 -8291 -221825 -80333 -89730 -235313 -63010
12578 133988 -5841 100891 45873 196525 -140998 -129998 130954 352186 16039 94096 -165284
12566 3308 -161709 123268 273484 22751 -260687 81635 -59860 -106657 66231 -199780 -5174
12554A99362H9807R472i5195j89340C72638A66256i455k6546A15420i1550A82067
12542d6212a2483j63888o6861B81286g3328j18191e2676j67857H6030O837f7877
12530G6195K25409b00652C6086l717J22933e0915A47593l3433b70714g4167C64450
12518b79978H2536a23498F0035L29228c660k93221B8199a09072d166D89455e8683
12506a28740B528K6618M00290A87625D0964L0279b9788j31231j12366D739O2895
12495F7634J62915c45537h8916p8947A17956J2970o2888a55938A4339K54644c6281
12483e6257j50813k40533F0208P7272A0940i2249n780A41189D6439h8570A80755
12471C845c01631e2242j23265m3125I2369j470d3031A67308G2606Q7345a49324
$$ plain form
12554 199362 89807 99279 -95195 -284535 372638 166256 -9455 -36001 115420 -91550 182067
12542 -46212 -12483 -176371 -243232 281286 -73328 -191519 -52676 -220533 86030 92867 -67877
12530 76195 301604 -200652 36086 32369 155302 -50915 147593 114160 -270714 -74167 364450
12518 -279978 82536 -123498 60035 389263 -3660 -296881 28199 -109072 -4166 489455 -58683
12506 -128740 2528 29146 429436 187625 40964 71243 -29788 -161019 -273385 4739 67634
12495 67634 230549 -345537 -88916 -167863 117956 130926 68038 -155938 14339 268983 -36281
12483 -56257 -207070 -447603 60208 137480 10940 -92249 -98029 141189 46439 -88570 180755
12471 3845 -301631 -52242 -175507 -218632 92369 90899 -43031 167308 72606 159951 -149324
12459g3894k6028H5198o114b99928B23690H9530C7634J00180a10172C582J31434
12448A35016m9966b40460A05019J93526A02243C4870b2421j25993A30692c72769
12437B8621K1072o652K5607A5494c25601A60542b73670B2685c0637I8287d40061
12425a282F5668R3936b45489P3133A24119D872h9633A62912d41050C1522J92252
12414B23774k6943K5099h4119k93484b1039k2560E2516i5405A89722l0498A4564
12402a8128A18393b23973A59529R8789g0350k3638G1865A6256b26432B1316J59982
12391A81298b41165C15455A39992D1922J27964G2531a38185B00211e3196B6116
12380F8505a86572Q0673l02487e3691A58357e1939H1819D0608A8338b09795B57631
$$ plain form
12459 -73894 -99922 85198 79084 -299928 223690 89530 37634 137814 -110172 3582 135016
12448 135016 85050 -240460 105019 298545 102243 34870 -22421 -148414 130692 -372769
12437 28621 49693 43041 68648 15494 -325601 160542 -273670 22685 -30637 98287 -440061
12425 -1282 65668 159604 -245489 -172356 124119 4872 -89633 162912 -441050 31522 223774
12414 223774 196831 221930 -84119 -377603 -21039 -43599 52516 -95405 189722 159224 14564
12402 -18128 118393 -223973 159529 258318 -70350 -93988 71865 16256 -226432 21316 181298
12391 181298 -241165 315455 139992 41922 169886 72531 -138185 200211 -53196 26116
12380 68505 -186572 -105899 -408386 -53691 158357 -51939 81819 40608 18338 -209795 257631
12368G8694K8572e8594A36018b19852M5688A92448K00453B3257a29758n0550h29
12356c19219A8515c27233A15014K8806b00207A91363d8692C06545j48092a55171
12345b5209j26209l3355D5243a07716m9305B54854a80869A63582D6775K2843P2779
12334A42397k9823E3415J1661L2755j3815M6152J16064M1994G4924K81011g4931
12322A28086K28118a00266B93828m1473A07636m8386M29003c0083A59450e1628
12311B34554a12407E7716B1043J95925Q7396a44742B31656Q2572G6518a34201
12300A57543K33070a32430A33837Q2435n2937M97q038l2840j650c0022m1971D69651
12287F12375A36873Q0724n8127i8985A14668k2071J31714h9301E18924k30833
$$ plain form
12368 78694 107266 -58594 136018 -219852 -174164 192448 392901 23257 -129758 -180308 -829
12356 -319219 18515 -327233 115014 143820 -200207 191363 -48692 306545 158453 -155171
12345 -25209 -151418 -184773 45243 -107716 -157021 254854 -180869 163582 46775 69618 142397
12334 142397 112574 53415 65076 97831 84016 130168 246232 288226 74924 355935 -74931
12322 128086 356204 -100266 293828 252355 107636 59250 488253 -30083 159450 -51628
12311 234554 -112407 57716 21043 216968 304364 -144742 231656 314228 76518 -134201
12300 157543 390613 -132430 133837 216272 163335 163832 155794 122954 121304 -30022 -71993 469651
12287 612375 136873 217597 159470 -98985 114668 92597 224311 -89301 518924 288091
12277B88091A34824I519C909M3591c33066D54588A44L26494d3629D74577b23101
12265G3769K2351J35036E4423c5098A16913K60115a96427B57659N7141A32877
12254B92832e9346b7867G3546R6691k7555M1217K11744m4671f9629j8242k61070
12243c48941B28897L495A0285J59014H2666e4445G5578h7205o6162k9973E1351
12231B02950h6021H0923R4319h0431B7814L26851e2258C89953j64008p5808L91240
12220E41377B63968P0920r2912C1291C707f7124A58237n2152L40635b24078J04434
12209a19644C96518N798j61790F0897K07090j7649N3928B4207J94432F4502J32362
12198A96864n5180B2929L42282j44519A1108c92919D7174j603J5499K84564A53145
$$ plain form
12277 288091 134824 9519 3909 47500 -333066 454588 144 326638 -43629 474577 -223101
12265 73769 96120 231156 54423 -35098 116913 377028 -196427 257659 314800 132877
12254 292832 -59346 -27867 73546 170237 142682 183899 395643 350972 -69629 -87871 -348941
12243 -348941 228897 232392 10285 169299 82666 -54445 75578 -87205 -153367 -183340 51351
12231 202950 -86021 80923 175242 -80431 27814 354665 -52258 389953 225945 150137 541377
12220 541377 263968 334888 241976 31291 3707 -67124 158237 106085 446720 -224078 -119644
12209 -119644 396518 402316 240526 60897 267987 250338 304266 24207 218639 64502 196864
12198 196864 141684 22929 365211 220692 11108 -392919 47174 45571 61070 345634 153145
12186A41615J52559b37111A22709J15453f0180B56753n4309J44370c3896j91939
12176b25835m3842B15084r6734C864J16685P9726K06724r5549b16626B35542N02280
12165G37822k55266R4822k57187L4785j05658A23004L7981a0151C11013k217r2210
12154B16586g177A3361J12766E8813d32083G636K58599Q7755a68580p9215J04783
12143a43012c1396E31399h5636c2968J650A70544P4048a00057A03139c6466F9946
12131C39173G0535J20351B9280J11896J07528c4491B17533l6991D0039b90627
12120B61808e2297A27755a03407j21949B1608J3519K30243a06748D8522b94093
12109B27346C6017f1081b4749A86093q9004b6611B74809j11113A6710C110P6987
$$ plain form
12186 141615 294174 -237111 122709 238162 -60180 256753 202444 346814 -33896 -225835
12176 -225835 -269677 215084 118350 3864 120549 200275 406999 311450 -216626 235542 737822
12165 737822 482556 577378 320191 354976 249318 123004 160985 -10151 311013 308796 216586
12154 216586 -7177 13361 126127 58813 -432083 7636 266235 353990 -168580 -247795 -143012
12143 -143012 -31396 531399 -85636 -32968 -31318 170544 244592 -100057 103139 -36466 69946
12131 339173 70535 190886 29280 141176 248704 -34491 217533 180542 40039 -290627
12120 261808 -52297 127755 -103407 -225356 21608 35127 265370 -106748 48522 -294093
12109 227346 36017 -61081 -24749 186093 97089 -26611 274809 163696 16710 3110 80097
12098H0097c14522b3650B14770a87159C86447B8487L5801c30186J22418f9763
12087F5234J31055o5540K44548A6703O7415j5649b4505B49391J75924A45483m6028
12076I9455J43576L4172a03338A74586M58453C2019h8005b6917H7177J13394J47418
12065C47989k6299J56772H9860P6364a09980a7690A04203a53019A44172b9471
12054H6760i8361A919O1140J99095c21872A06100A381c46915J68551F5063k7753
12043C7310a86607e4483A0283a66108D770J93239C4486Q26c6559A56482a70558
12031B09531n013E7790J15795B8599J37524L5142d7267I0309J53589l6842i6752
12019a06939m2368C72296G0624J91748N3930r7639a4310D64039j99823G4756M46049
$$ plain form
12098 80097 -314522 -23650 214770 -187159 386447 28487 64288 -330186 -207768 -69763
12087 65234 196289 130749 375297 16703 84118 68469 -24505 249391 425315 145483 99455
12076 99455 243031 277203 -103338 174586 633039 32019 -88005 -26917 87177 200571 347989
12065 347989 321690 478462 89860 166224 -109980 -17690 104203 -153019 144172 -29471
12054 86760 -98361 1919 63059 262154 -321872 106100 1381 -346915 -178364 65063 37310
12043 37310 -186607 -54483 10283 -166108 4770 198009 34486 35312 -36559 156482 -170558
12031 209531 204518 57790 173585 28599 166123 201265 -47267 90309 243898 207056 -96752
12019 -106939 -149307 372296 70624 262372 316302 218663 -14310 464039 264216 74756 520805
12008E20805F8133d4997j42516n2362D7359a80902d5254j54794B09694p7121R2858
11997B25431k5572B4170O3966b61303F754b45505J07214b282m0537A01825P6490
11986A78315L5509a87105B05708d4501k93313A78648q5654Q4916b63418c7669
11975a54492B07236a7544l1792a3608p0704K6519A92754e01133a19836j47638
11965b67474f6858A92263D774a51770k5264A26609a88266A32913f0483j06837
11955a67320D7359K3203i8860k19854g9429C12565a030B2158b62541J26011m0973
11944a77503a6363j11866C9571b7749j72083L7802A49047a22037D03662a23054
11933B08397r7146a19165k2097f504k25844G042h8463E3723h3458n8179C01968
$$ plain form
12008 520805 68133 -44997 -187513 -239875 47359 -180902 -45254 -200048 209694 132573 225431
11997 225431 199859 24170 88136 -261303 6754 -245505 -138291 -2282 -42819 101825 178315
11986 178315 213824 -187105 205708 -44501 -337814 178648 92994 177910 -263418 -37669
11975 -154492 207236 -17544 -49336 -13608 -84312 -57793 192754 -501133 -119836 -267474
11965 -267474 -66858 192263 4774 -151770 -177034 126609 -188266 132913 -60483 -167320
11955 -167320 47359 70562 -98860 -318714 -79429 312565 -1030 22158 -262541 -136530 -177503
11944 -177503 -16363 -128229 39571 -27749 -199832 -162030 149047 -122037 403662 -123054
11933 208397 111251 -119165 -141262 -6504 -232348 7042 -88463 53723 -83458 -141637 301968
11921A79849J15651h7754A0583f2694k10923A6888b00528n9432A63931G7405a34672
11909A69283h0549e099B39513a00361F04i0840H6867a85671A42991K28274E8876
11897E9538J02471e2863j40263f2027b7023A11286f4389A97078b67293d3078j83386
11886b26464a06676j09361K8571c2868k54543a32426O5559A57522D0755a40976
11875A17522M48574b3247C21032a11165E2734a62321j4289A37556F4650J6207
11865H0857c12713a15527B15329m5208e8630j34185g8137a6503A13991d3488F2378
11853a70294e1522F2838J1751O71a0927H3230C4782a52985A2252J46344g6014
11841B49112c30892I8374Q5697c1087C6322a80530k62389J95098m825B66497R3622
$$ plain form
11921 179849 295500 -87754 10583 -62694 -273617 16888 -200528 -259960 163931 77405 -134672
11909 169283 -80549 -5099 239513 -100361 604 -90840 86867 -185671 142991 371265 58876
11897 59538 162009 -52863 -193126 -62027 -27023 111286 -64389 197078 -267293 -43078 -226464
11886 -226464 -106676 -216037 -187466 -32868 -287411 -132426 -66867 157522 40755 -140976
11875 117522 566096 -23247 321032 -111165 52734 -162321 -176610 137556 64650 80857
11865 80857 -312713 -115527 215329 170121 -58630 -192815 -78137 -16503 113991 -43488 62378
11853 -170294 -51522 62838 74589 75260 -10927 83230 34782 -152985 12252 158596 -76014
11841 249112 -330892 98374 184071 -31087 36322 -180530 -442919 -247821 -252646 266497 360119
11830C60119a08520k94127B56758e69365I9674a10650L9519D5978O8213b33701
11819f4376I611P7866M5939a5489j06399o8980b2436o7569k25829I5307K50568
11808C45875G0219K70888I0288c28154a33139j27602B2336R5041a196E6706f4413
11796f3099o3971B7579a62230A59800J15045d5008j80179A06e01516D70843A00701
11784A45430F3285R1044J21107c61624A51326a18451J6963A6921N8452k1346A7609
11772A16789a32466k21447C3281a01099L822j39403Q7875L2829b1055j8015B40008
11760A33240d1193A37277b77134A90763F7069a14938A63502D2575h7026C0133
11749c71200J60486K2356A98423a4804l2628n2342d5856A29697a66057q2182C34431
$$ plain form
11830 360119 -108520 -402647 256758 -569365 99674 -110650 -71131 45978 114191 -233701
11819 -64376 9611 87477 133416 -15489 -121888 -190868 -22436 -90005 -315834 95307 345875
11808 345875 70219 341107 90288 -328154 -133139 -260741 22336 117377 -1196 56706 -64413
11796 -63099 -127070 27579 -162230 159800 274845 -45008 -225187 106 -501516 470843 100701
11784 145430 63285 154329 275436 -361624 151326 -118451 -101488 16921 75373 54027 17609
11772 116789 -132466 -353913 33281 -101099 -97277 -236680 -148805 -115976 -21055 -39070 240008
11760 133240 -41193 137277 -277134 190763 67069 -114938 163502 42575 -87026 30133
11749 -371200 -210714 -188358 198423 -14804 -47432 -99774 -45856 129697 -166057 -248239 334431
11737a67628C5480J61272H6390h1728A1161P3964C7979d6154q9010G8851e9444
11725A59271G662J675J56385g7287l29071H8632c01027J46496P0033A70558l1579
11714A38979E8943N6778R2489p5756F4880g1897K921l25280A90870I3635c0573
11702a55455E28266E3795a43272B32976q5223a1922o3094R814j29440B47305h3374
11690A57950L2659c20955f9679I527a7933P367D36434g7210j43338f7296r6678
11679a63974f4052o0379j81561g3066b4215E3375J7273K16163a82426I6258a0300
11667A14156f3996j62149c1456B29049A00179C6201i7175A46566D358b6023o1316
11656h7339C08883i5551m6786B79894b72378D1110L00882A09261j2125A8947M1679
$$ plain form
11737 -167628 35480 196752 86390 -81728 11161 85125 37979 -46154 -135164 78851 -59444
11725 159271 7662 9337 165722 -77287 -406358 88632 -301027 -154531 -84498 170558 138979
11714 138979 58943 115721 208210 132454 64880 -71897 -68976 -394256 190870 93635 -30573
11702 -155455 528266 53795 -143272 232976 147753 -11922 -75016 -65202 -194642 247305 -83374
11690 157950 190609 -320955 -69679 9527 -17933 -10566 436434 -77210 -220548 -67296 -163974
11679 -163974 -64052 -124431 -305992 -73066 -24215 53375 70648 286811 -182426 96258 -10300
11667 114156 -63996 -226145 -31456 229049 100179 36201 -97175 146566 4358 -26023 -87339
11656 -87339 308883 -95551 -142337 279894 -272378 41110 341992 109261 97136 18947 60626
11645F0626d1231H3272P597b08822a1592k9940A7040L15186b5084A15015e0129
11633A48187a55319E6153b97979D5299b07862n1128A45641A3743k673b01997B28837
11621A28459a56562C76805d0693j10980q1712d0540G6630f4384A13007h0402G3994
11609A43601J27334A08309b53237B68795e5625B00655J01807a167B10226H2228
11598B14929b87590B8485c2675A65044a36119A99079f3346k23222C59089c26999
11587G2838K00432I2833k9984M6009n675A1015d9827G263l341J805J93932r662
11575A89997i3557A21035D24b79363R1623B4209a29726d3797b491j95774B69613
11563g1631H5659N652B0827b28458g9743B21424l9909l1310d6432B0757R7848
$$ plain form
11645 60626 -41231 83272 90869 -208822 -11592 -41532 17040 332226 -25084 115015 -50129
11633 148187 -155319 56153 -297979 45299 -207862 -258990 145641 13743 11070 -201997 228837
11621 128459 -156562 376805 -40693 -151673 -233385 -40540 76630 -64384 113007 -80402 73994
11609 143601 270935 108309 -253237 268795 -55625 200655 302462 -1167 210226 82228
11598 214929 -287590 28485 -32675 165044 -136119 199079 -63346 -286568 359089 -326999
11587 72838 273270 92833 62849 108858 103183 11015 -49827 7263 3922 5727 199659 189997
11575 189997 -93557 121035 424 -279363 -187740 24209 -129726 -43797 -2491 -198265 269613
11563 -71631 85659 91311 20827 -228458 -79743 221424 181515 150205 -46432 20757 118605
11552A18605a0998k35330B06026l2551A6313N0934J38292J61593a00215b4460
11541a15888A98003h1034B027a77912C43267b27485C20312r9815G3875J8601h7042
11529B12249J88602b6394F3728J03302f8797l691F7623k2877J80231G1773C0534
11517B4951M8331a68509A38831a60634K1900C15732A16041J73753b38392C2366
11506A99318L0641I0705d021B36156J71738A33390K6512j0643b14390J03354B30380
11494B18817j04919d1745D70678A36022g4602C89252A36507a16638E1498j3462
11484C8036Q9694O1456b42790B72549m8507J77097m1946j25046H4002J02964a31354
11472D96592E4721L4080N0553J05910a7495M572C06309c5465J4560m2032B46864
$$ plain form
11552 118605 -10998 -246328 206026 173475 16313 67247 205539 367132 -100215 -24460
11541 -115888 198003 -81034 2027 -177912 343267 -227485 320312 220497 73875 92476 -87042
11529 212249 400851 -26394 63728 167030 -68797 -72488 67623 44746 224977 71773 30534
11517 24951 73282 -168509 138831 -160634 -138734 315732 116041 289794 -238392 32366
11506 199318 229959 90705 -4021 236156 407894 133390 159902 149259 -214390 -111036 230380
11494 218817 113898 -41745 470678 136022 -74602 389252 136507 -116638 51498 38036
11484 38036 127730 189186 -242790 272549 224042 401139 359193 234147 84002 186966 -131354
11472 496592 54721 88801 139354 245264 -17495 -12923 306309 -35465 -20905 -62937 246864
11460A56881O5327J17031A59400a04243j12029C31287a17275C2480L55273h1293
11449A78765l4945b69337A23201h4364B8643K01499h8108D30607i6577o7706B87096
11437B04225b61645h9276A31853N230D8636K59712B1785i2744C02784a02504B5039
11425a17425l6152M2420A30021c1572j74839F6796c3853k13525q4831I6726f4402
11413a65139C0606a60478e3890b5974m26707a60984M7716J8312k07548f5757C70086
11401d4535A48576a23295c6585C75027K5465M9016A13039N5420f6979j52476j83706
11390d03161A4004b8242A01851j5701R6640o8899e8995d973A12005J27502I8983
11378E5522a14526B55320F9634a59011A11601a083A69552b15848a00801d5530
$$ plain form
11460 156881 222208 339239 159400 -104243 -216272 331287 -117275 32480 387753 -81293
11449 178765 143820 -269337 123201 -84364 28643 230142 -88108 430607 -96577 -164283 287096
11437 204225 -261645 -89276 131853 137083 48636 308348 21785 -92744 302784 -102504 25039
11425 -117425 -153577 -111157 130021 -31572 -206411 66796 -33853 -247378 -332209 96726 -64402
11413 -165139 30606 -160478 -53890 -25974 -452681 -160984 -113268 -94956 -302504 -65757 370086
11401 -44535 148576 -123295 -36585 375027 400492 449508 113039 168459 -66979 -219455 -403161
11390 -403161 14004 -28242 101851 86150 182790 113891 -58995 -4973 112005 239507 98983
11378 55522 -114526 255320 69634 -159011 111601 -1083 169552 -215848 -100801 -45530
11367b24610A02662P1832a00369A08063d95424f9595B72372o1131g1560j99264
11357b70824e2061I3268f9058k55997C19694a63242e5770j6211j91003A53656
11346E9352A5676b05141a02197k1578B13169c34096G5570Q017b5936k5004j50226
11335b01166B12692a95468B17078e9106j62867J732i0760C74196a37352e775H1362
11323f0046A23483e1327B2184a42016N8870A24908f9695N013l0909B5432J08258
11312A33690j052A5593f1486I8261c9281l809A016d00155J51628p0410i9226n0626
11300a49852B87552e4403K1708j46495h3828H2385M7070f6529p4384L2990J9324
11289h8599B11177I1569e526B95978A08267J37833b65042c295j34107K1425A49144
$$ plain form
11367 -224610 102662 174494 -100369 108063 -495424 -69595 272372 211241 -71560 -270824
11357 -270824 -52061 93268 -69058 -325055 319694 -163242 -55770 -71981 -262984 153656
11346 59352 15676 -205141 -102197 -123775 213169 -334096 75570 83587 -25936 -50940 -201166
11335 -201166 212692 -195468 217078 -59106 -221973 -220241 -90760 374196 -137352 -5775 81362
11323 -60046 123483 -51327 22184 -142016 -83146 124908 -69695 -64682 -95591 25432 133690
11312 133690 132638 15593 -61486 98261 -39281 -43090 1016 -400155 -248527 -318937 -99226 -149852
11300 -149852 287552 -54403 -32695 -179190 -83828 82385 129455 -66529 -140913 -107923 -88599
11289 -88599 211177 91569 -5526 295978 108267 246100 -265042 -3295 -137402 -115977 149144
11277A83106b4953r5209j29984G7615h4715j59775B69490b25609A06425h5575
11266a98020j07036A25603A7099E434J43173B5095p280b10947P7171E4863K03107
11255B57970B970a29815H4890a06375j385k6261l547k1043g0665j02739b9659
11243c18k61782G46a08486C4906J75885J31158E8654b72998j51022A61313D1903
11231e2550A93802J57295A26557b50462f0681b8237B08960D3481M18371a47308
11220B67798a7576p3817o8175H0883j1834A3678K15466C0963a69212G4717B9081
11208B20964a8156k57928B13927b47334a19479k13035C6292K8151g6943k01730
11198b78673M4574I4667c46794J58243g6966c4112G9451j228a18872j51660o1689
$$ plain form
11277 183106 -24953 -120162 -250146 77615 -84715 -244490 269490 -225609 106425 -85575
11266 -198020 -305056 125603 17099 5434 148607 25095 17815 -210947 -133776 54863 257970
11255 257970 2970 -129815 84890 -106375 -107760 -134021 -137568 -158611 -70665 -173404 -29659
11243 -318 -262100 746 -108486 34906 210791 341949 58654 -272998 -424020 161313 41903
11231 -52550 193802 351097 126557 -250462 -60681 -28237 208960 43481 461852 -147308
11220 267798 -17576 -91393 -159568 80883 69049 13678 229144 30963 -169212 74717 29081
11208 220964 -18156 -276084 213927 -247334 -119479 -332514 36292 64443 -76943 -278673
11198 -278673 -234099 94667 -346794 -188551 -76966 -34112 79451 78223 -118872 -270532 -332221
11187c32221f8389B9604a80825j70591D9274b1730j34721j01232a14526L2012
11177h2514r073K3623A05186a22642A7460b4900e629k06578i3607k18432R7705
11166b14334k31948G5598i9918A72451a94922j74384d9233k67015Q4211a13063
11155a00203b060D77867a37712A59346a51199l5B63040c88146I82b66706B5497
11143c78827J1881a57944r6671d8983l76184C2109j0093K39581C7210c51388A09252
11131B78371q5043A3552K612a10411A85024h8951C30818h7995A56970c1456j85864
11120b17320B04594r1986B3257K03217b15021A1858a8707j97685I9597b19731
11109b13612A3206K27959j12311B6154P3341c0230A68675o529p1409l5149b48314
$$ plain form
11187 -332221 -68389 29604 -180825 -351416 49274 -21730 -156451 -257683 -114526 -82514
11177 -82514 -91587 -67964 105186 -122642 17460 -24900 -5629 -212207 -93607 -312039 -214334
11166 -214334 -446282 75598 -99918 172451 -194922 -369306 -49233 -316248 -232037 -113063
11155 -100203 -2060 477867 -137712 159346 -151199 -151234 263040 -388146 982 -266706 25497
11143 -378827 -366946 -157944 -254615 -48983 -425167 32109 22016 261597 37210 -351388 109252
11131 278371 193328 13552 16164 -110411 185024 -88951 330818 -87995 156970 -31456 -217320
11120 -217320 204594 112608 23257 226474 -215021 11858 -18707 -216392 99597 -219731
11109 -213612 13206 241165 128854 26154 99495 -30230 168675 162146 90737 55588 -248314
11097E5730a4192H281L4513K32859j18331j2856K42851G8865K42436c8869B03980
11085g7109A16690f3514B92695f8771A64428K36849H4152a48091A23119K97836
11075D20955n4406k0316R7928A71908J14813K22184A17064K1357J95398e5241
11064C31039r4984F1200R8933m9095L77479k01646m9073J01376k5264A52707J42775
11053B95482L5798O20680D30413A86091J29534J58880J87676k51610J68187J2516
11043E91274J7025j39508J55621k75030O02420l09172J07820l43739R2663j594
11033D97780j50053L08709k59990L94662j93681j49477K09477J7981k1997k0109
11023F33302J27521j75416k59557L56547K67283D34475j14307N02632j92905k87744
$$ plain form
11097 55730 -14192 8281 42794 275653 157322 144466 387317 78865 321301 -38869 203980
11085 -77109 116690 -63514 292695 -68771 164428 401277 84152 -148091 123119 420955
11075 420955 366549 346233 444161 171908 286721 508905 117064 138421 333819 -55241
11064 331039 236055 61200 160133 111038 488517 286871 237798 339174 313910 152707 295482
11053 295482 331280 951960 430413 186091 315625 474505 662181 410571 578758 591274
11043 591274 608299 468791 624412 349382 951802 642630 750450 406711 499374 497780
11033 497780 347727 656436 396446 791108 597427 447950 657427 675408 653411 633302
11023 633302 760823 585407 325850 682397 949680 434475 320168 822800 629895 342151
11013C42151K85942R3122j98311q7787q6273K20043K34525j02102j05194m7045
11003E49071j22128j01280J6499K05224B41044N24335p2053k64681J48993N3246
10993F30884j07755J87168J56003B01588O34052R3682D48673P0557J30879r8440
10983E51669K90123k21477J61360j33776K68103K28468j89629K38308R3516P7027
10973A363692J54390q1504J49314K18711L11570K85003N4538j69565k0584j75941
10963B089624l31546j91419J28772k32464j46405K92900k30654L0007J73270l3959
10953A548126P6834L5533j62462k13330k29803J50178m45458K51194m75671M2812
10943E77953Q2624l22100j9034L33896B02875J74745g631B28262k5582P0514A18932
$$ plain form
11013 342151 628093 721215 522904 435117 348844 568887 803412 701310 596116 549071
11003 549071 426943 325663 342162 547386 241044 765379 693326 428645 577638 630884
10993 630884 523129 710297 866300 201588 835640 929322 448673 519230 650109 551669
10983 551669 841792 620315 781675 647899 916002 1144470 954841 1193149 1286665 1363692
10973 1363692 1518082 1436578 1585892 1804603 2116173 2401176 2455714 2286149 2265565 2089624
10963 2089624 1758078 1566659 1695431 1462967 1316562 1609462 1378808 1408815 1582085 1548126
10953 1548126 1624960 1660493 1498031 1284701 1054898 1205076 759618 1010812 535141 577953
10943 577953 660577 338477 319443 653339 202875 377620 -7631 228262 202680 273194 118932
10931C2174a7333r236D11029a57125L9434e7276j40067B898J32956J79133b3196
10919c8489B50274n8237D5383A6541g3820K7566C0432d8641C0533J12914a18534
10907a70638k2823B2026c191A97277c43148B64979j1128o4499A8187c77979B01671
10895A41427C8890f2759C9722K23959F8152K90132H2355a59823j49880A90216
10884I0425J2875a26963L7361l2247B47510I0020K16816h9494H6140N497O8595
10873A60232D5275b0493H2358h8969A81378D1752b56302j11636a51047P3539k8256
10862a05764A93076a28454m725c6402o8498I3885a97187k7032i7993A93717a22152
10850f379m0954J0960A61984a28039A48892b07621P4808O4190l8374D0167a56591
$$ plain form
10931 32174 -17333 -26569 411029 -157125 -117691 -57276 -197343 2898 135854 314987 -23196
10919 -38489 250274 192037 45383 16541 -73820 -46254 30432 -48641 30533 143447 -118534
10907 -170638 -193461 22026 -3191 197277 -343148 264979 253851 189352 18187 -377979 201671
10895 141427 38890 -62759 39722 263681 68152 358284 82355 -159823 -309703 190216
10884 90425 103300 -126963 -89602 -121849 247510 90020 306836 -89494 86140 91637 160232
10873 160232 45275 -20493 82358 -88969 181378 41752 -256302 -367938 -151047 -77508 -105764
10862 -105764 193076 -128454 -133179 -36402 -104900 93885 -197187 -224219 -97993 193717 -122152
10850 -6379 -47333 -36373 161984 -128039 148892 -207621 -132813 -68623 -106997 40167 -156591
10838b3340m8954P066B38782a8594C8018J2254K9695i8283A03594l6301a53954
10826B641O952b17131B57027a61453A58561G127M105J33198m0937K2013a44243
10814a07050k19860I8361a70308A55128a23009M2183I8841O1937g8119k21441
10804b99560a47105A2056c52273A72142c41726D30272a75901f9750J2625A6596
10793b97219H9330e5478E7149J90171c69741a61142l15989K07432Q6680M8894
10783a34125b9127C58608A26435c0402I144a03521J3904m770L2926A18075e6307
10771h4087B42611H3947R7988b5502A14433f5444K1317k21606A24068l8558k3572
10760F1938e0683j2992o4116B7421b15159A96a80389b5520n16749d9758j8825
$$ plain form
10838 -23340 -72294 -65228 238782 -18594 38018 50272 79967 -98283 103594 67293 -153954
10826 2641 9593 -217131 257027 -161453 158561 7127 11232 144430 103493 125506 -144243
10814 -107050 -326910 98361 -170308 155128 -123009 -80826 98841 160778 -78119 -299560
10804 -299560 -147105 12056 -352273 172142 -341726 430272 -175901 -69750 -57125 16596
10793 -297219 89330 -55478 57149 247320 -369741 -161142 -477131 -269699 -183019 -134125
10783 -134125 -29127 358608 126435 -30402 9144 -103521 -89617 -94387 -61461 118075 -56307
10771 -84087 242611 83947 181935 -25502 114433 -65444 -44127 -265733 124068 85510 61938
10760 61938 -50683 -63675 -127791 27421 -215159 196 -180389 -25520 -542269 -49758 -68583
10749f8583D7182h9562J6844b4212k23795A36192J57488G497i1098l5593d181
10737a68609G3356c2115I659K12381d2837A73362F1138Q1413e2556A28267b10488
10725c5833j60443F7230K69140A9532a41004B08269d8108A63378b26611A77347
10714C6100K3663a32190A0118K92747d95443a89286j03183f5295A87568q9682
10704I7886b00217C6621b41511k8284c1157A7826a77030C5605K28228a5212A05662
10692A92285b61390l6750H2322a33080N6261n5089j47248M6351f7168F0213d8826
10680a87008F8607b12211Q5375C63280G522a6525j98415G0925h5919p7977q494
10669a72390H0797d5627j48339d6138j52284c7086j66750e958j54499A27694b37293
$$ plain form
10749 -68583 47182 -89562 -72718 -24212 -248007 136192 293680 7497 -91098 -126691 -4181
10737 -168609 73356 -32115 9659 222040 -42837 173362 61138 142551 -52556 128267 -210488
10725 -35833 -196276 67230 336370 19532 -141004 208269 -48108 163378 -226611 177347
10714 36100 59763 -132190 10118 302865 -495443 -189286 -292469 -65295 187568 97886
10704 97886 -200217 36621 -241511 -269795 -31157 17826 -177030 35605 263833 -15212 105662
10692 192285 -261390 -298140 82322 -133080 -76819 -131908 -279156 -232805 -67168 60213 -48826
10680 -187008 68607 -212211 -126836 363280 7522 -16525 -214940 70925 -85919 -163896 -172390
10669 -172390 80797 -45627 -193966 -46138 -198422 -37086 -203836 -5958 -160457 127694 -237293
10657A36536a32309f4938G3263a0562k58145B34091a7578e660p2845b1468I9786
10645d5794c026r0519B79409G6106e7432A3433i4784B09953d14738A30692b4252
10633d1709k53982a39071m9807A21360b68608H4929Q8835k5682f3197B52678C9678
10621D1003O3894c61291A38908K71222b26024R9586C22202f2793A20198D5233
10610c23026Q9561G6235c4745k0930j55862C2705a5037j71560d4875H3996e8723
10598B2309b99721J156A22986a00713j1336l8763P2803A61001N4908b04547i7860
10586A15694a83851C25386A2962a37138b3069A1088J11824a83902A40099b11839
10575H379J5999b82347J38389A62264d1067I8923a6811m7243G7569d23510a55154
$$ plain form
10657 136536 -132309 -64938 73263 -10562 -268707 234091 -17578 -5660 -78505 -21468 99786
10645 -45794 -3026 -93545 279409 76106 -57432 13433 -94784 209953 -414738 130692 -24252
10633 -41709 -295691 -139071 -188878 121360 -268608 84929 173764 148082 -63197 252678 39678
10621 41003 104897 -361291 138908 410130 -226024 -126438 322202 -62793 120198 45233
10610 -323026 -233465 76235 -34745 -55675 -211537 32705 -15037 -186597 -44875 83996 -58723
10598 22309 -299721 -298565 122986 -100713 -112049 -150812 -78009 161001 215909 -204547 -97860
10586 115694 -183851 325386 12962 -137138 -23069 11088 122912 -183902 140099 -211839
10575 8379 24378 -282347 -143958 162264 -41067 98923 -16811 -64054 77569 -423510 -155154
10563C68694f5645o5057B45412b64003B33331a0691A16998c5398E2813g7980k0127
10552i8107F0149K48235a76714Q2560l0381j38647B27203O0453j14422l2488a09127
10540i8054A47305K13288a89126j55644a39206l03489b20790a7376l0994n7975
10530a06345k17809a34361H2602h421D5052f9907A83761D3010M20230a90049p525
10519a97574j0741A19921A1766a44630g0002o4455K6730J7511j84427A69064N567
10508A74631g7828c2803l28079A67608a19385a9047m5150c1427o7738d7321k3988
10497g1309d288l8488n1413A12248c54574g0569B23216G0883d20182A37551a93684
10485b77593A57472b65969G9115J9732J86969o0345a52806C9749J47914K12345
$$ plain form
10563 368694 -65645 -130702 245412 -264003 233331 -10691 116998 -35398 52813 -77980 -98107
10552 -98107 60149 308384 -176714 -94154 -124535 -263182 227203 287656 173234 140746 -109127
10540 -98054 147305 360593 -189126 -344770 -139206 -442695 -220790 -17376 -48370 -106345
10530 -106345 -324154 -134361 82602 -8421 45052 -69907 183761 43010 463240 -190049 -197574
10519 -197574 -208315 119921 11766 -144630 -70002 -134457 -107727 -90216 -274643 169064 174631
10508 174631 -77828 -32803 -360882 167608 -119385 -19047 -64197 -31427 -99165 -47321 -71309
10497 -71309 -4288 -42776 -94189 112248 -354574 -70569 223216 70883 -420182 137551 -193684
10485 -277593 157472 -265969 79115 98847 285816 225471 -152806 39749 187663 400008
10475D00008l5112o9654L00777B93317n7001C0472K97130B0734J02983k6857a56113
10463C38410B7843H368e1603A79895b511j9037A07813B9331c19613b6890j64860
10452a91750F4409b21837k33597B7797J7851a60099d8421A54854a08803L801A3992
10440a89167f0414A00191P5965a91961A39073a80229I3501K7093h4156K5173A45946
10428b73085a8878A84182b41290A43536D1229C209J39495E3731K16801A29148
10417i1390b8597j12648A56315D4334a87896A46639a79099f6099A406a25937C6578
10405b99302R7975R4990M2522B3984a31411a1539r3236B06747A733e15277a15002
10393I5551a32216H7075b49510a6287A74479C7317b88107D83322A65093G8504
$$ plain form
10475 400008 364896 295242 596019 293317 236316 30472 327602 20734 123717 96860 -156113
10463 338410 27843 8368 -51603 179895 -2511 -21548 107813 29331 -319613 -26890 -191750
10452 -191750 64409 -221837 -455434 27797 45648 -160099 -48421 154854 -108803 -105002 13992
10440 -189167 -60414 100191 176156 -191961 139073 -180229 93501 120594 -84156 -58983 145946
10428 -273085 -18878 184182 -241290 143536 41229 3209 142704 53731 270532 129148
10417 -91390 -28597 -141245 156315 44334 -187896 146639 -179099 -66099 1406 -125937 36578
10405 -299302 -201327 -106337 -63815 23984 -131411 -11539 -104775 206747 1733 -515277 -115002
10393 95551 -132216 87075 -249510 -16287 174479 37317 -288107 483322 165093 78504
10382A94866q4199d0218I6646a35919B75000N0079j39087k8824M6109E3577J73567
10371B27144k5889p8148O8300K50363A32715J84070P5018n2052d2016C10458K47805
10360E58263j61821O4442D6573J20353b00179e6329G5383B8760c15082A81103
10349C04129J58360p0641o2415j25724I0922L30314o304A78014L11134j08231
10339C80917J46656B34126K99949k34013b8829B0601K43066b29006A81659G2896
10328A7618J39916b31240C43428B7083a01087e155B89281b28456A94088J59406
10318C53494H0465h53B76942A24735J28195n4584q1254b63807J0816C4715K8750
10307F3465a65390G8176k7587c63891F7164K26182d8986k07181b1937G7857a34420
$$ plain form
10382 194866 110667 -40218 96646 -135919 275000 325079 185992 157168 203277 53577 227144
10371 227144 201255 123107 191407 441770 132715 316785 391803 339751 -42016 310458 558263
10360 558263 396442 460884 46573 166926 -200179 -56329 75383 28760 -315082 181103
10349 304129 462489 391848 329433 203709 90922 421236 414932 178014 489148 380917
10339 380917 527573 234126 534075 300062 -28829 20601 263667 -229006 181659 72896
10328 17618 157534 -231240 343428 27083 -101087 -5155 289281 -228456 194088 353494
10318 353494 80465 -853 276942 124735 252930 198346 117092 -263807 -252991 34715 63465
10307 63465 -165390 78176 50589 -363891 67164 293346 -48986 -256167 -21937 77857 -134420
10295a38892o0794l8371i5965A44302b42313f1554q9188E1920a54185A58899h7548
10283i215j22983B38628I818a13890K37k1396j27958B61943d9265p7610L7300
10272h9575J1958l42572J93679M0590n7150p9013B37882h8969o2439B89023a23212
10260e991I1075j0738j7617a50488k6392B52304b85912A82721L32606A2327J45003
10249A57330m5734J97609A12413J01009k3764J3770a24064a4739j39784B0621
10238B40160a49210b7251p1037j53878A10426J68685H2323a44124l4376C1160
10227D5892J32877a16696j88661j04250B79414A3040a13076k37085e7123r4766
10217a51889N4333n3267j58805F5568H786a60609A05259e40752d675I9886k8199
$$ plain form
10295 -138892 -199686 -238057 -95965 144302 -242313 -61554 -150742 51920 -154185 158899 -87548
10283 -9215 -132198 238628 9818 -113890 -113653 -135049 -263007 261943 -49265 -126875 -89575
10272 -89575 -77617 -420189 -226510 -185920 -243070 -322083 237882 -88969 -151408 289023 -123212
10260 -5991 91075 80337 62720 -150488 -176880 252304 -285912 182721 515327 12327 157330
10249 157330 111596 309205 112413 213422 189658 203428 -124064 -14739 -154523 20621
10238 240160 -149210 -27251 -98288 -252166 110426 279111 82323 -144124 -178500 31160
10227 45892 178769 -116696 -305357 -409607 279414 13040 -113076 -350161 -57123 -151889
10217 -151889 -97556 -150823 -309628 65568 8786 -160609 105259 -540752 -4675 99886 71687
10206G1687J54777e5164k93174A75244c4967B61955m5642K8108J75618c19939
10195D7101a64344O3578j96796h7545A82553b50688M4451J02380L1533G126N4376
10184F1502k8466A4153c65736B032P7602b43127d3764n8586n7659j76827D2461
10172E6405h9000M1181A21318O1289H838b06442R8128j24441l638I1193e63138
10160B56223A06574d5225j77261B66473F5465d9809k23154D4713K05924a65363
10149a09751c657l42350F6571h3412a7004B17065C555c02000D9478a22498N2785
10138f9713l37776a85379k40901a49379p8913A11560i1334c3388p0018p3823j32239
10127c09468E9867a93251F4454a05915c9828q9203N1603m9995G333O5776a59996
$$ plain form
10206 71687 226464 -55164 -348338 175244 -34967 261955 216313 244421 420039 -319939
10195 47101 -164344 -100766 -297562 -87545 182553 -250688 -206237 -103857 -72324 7126 61502
10184 61502 33036 14153 -365736 2032 79634 -243127 -43764 -102350 -160009 -336836 42461
10172 56405 -89000 -47819 121318 182607 8838 -206442 -108314 -232755 -236393 91193 -563138
10160 256223 106574 -45225 -222486 266473 65465 -49809 -272963 44713 250637 -165363
10149 -109751 -3657 -346007 66571 -83412 -17004 217065 3555 -302000 49478 -122498 -69713
10138 -69713 -407489 -185379 -426280 -149379 -228292 111560 -91334 -33388 -103406 -177229 -309468
10127 -309468 59867 -193251 64454 -105915 -39828 -129031 -77428 -127423 7333 73109 -159996
10115A33263F2998b15264q9126H0716k7939M6423A0586f6000F5082l712a25538
10103C34121o0382b40215j22795O369B6072g2145j22874B2344b56019O0073A15895
10091B06954b55766a10499e4112j90227C7336K3727a37763B87938a57438P5924
10081h1514k33924i5628A38123h6286d161l8601n1110C4379J66983H1001a21983
10069a52696a1800j43114A23197k9952J08178q0198a17258c2949k71883C43824
10058c60056a55329A43260Q2570n8215a71516c4028I4833c3036l8827B1515g7888
10046C30814i8213k04926a05866A80171a59672o0500c8256N929k40804A86496
10035A19648c16695A63288b19504F0322d31159i7890j2092L8023J7376n1865n26724
$$ plain form
10115 133263 62998 -215264 -304390 80716 52777 99200 10586 -66000 65082 61370 -125538
10103 334121 273739 -240215 -363010 -356641 26072 -72145 -195019 22344 -256019 -195946 115895
10091 206954 -255766 -110499 -54112 -244339 37336 61063 -137763 287938 -157438 -81514
10081 -81514 -315438 -95628 138123 -86286 -4161 -42762 -93872 34379 201362 81001 -121983
10069 -152696 -11800 -154914 123197 93245 201423 121225 -117258 -32949 -304832 343824
10058 -360056 -155329 143260 225830 167615 -171516 -34028 94833 -33036 -71863 21515 -77888
10046 330814 -98213 -303139 -105866 180171 -159672 -220172 -38256 -32327 -273131 186496
10035 119648 -316695 163288 -219504 60322 -431159 -97890 -109982 -71959 -54583 -106448 -633172
10024f33172C77240b12862A7656b03755N8398k09293a15347A7679a02135H7655
10013d30233a8310k47772q689G263a13249A73639b231k68881B40369b71386J27500
10002a43886J7341k11523q1731a0814j90031j09888a14739j35982J10097I9699
9991h3443m1188d4787A62739a82157j66537J61838b529j39666B67244a24854A7755
9979I6100b70167a08246M4077n5290e3121k9683k371C453a18127N4637o345J8790
9967e1045q2514e3900j30013D9387K96a06889k26452F4337J30323b724n5325k73450
9955c31499G1340b45194A14178a90273E268b5058n0976q2404j71142J29703m9349
9944b49226a22550A55312b04450j8427g3855r6580p5744J7960R2732A86043b2161
$$ plain form
10024 -633172 377240 -212862 17656 -203755 -145357 -354650 -115347 17679 -102135 87655
10013 -430233 -18310 -266082 -274771 7263 -113249 173639 -2231 -271112 240369 -271386 -143886
10002 -143886 -126545 -338068 -419799 -10814 -200845 -310733 -114739 -250721 -140624 99699
9991 -83443 -124631 -44787 162739 -182157 -348694 -186856 -2529 -142195 267244 -124854 17755
9979 96100 -270167 -108246 -64169 -119459 -53121 -82804 -85175 3453 -118127 -63490 -69835 -51045
9967 -51045 -133559 -53900 -183913 49387 49683 -106889 -333341 64337 194660 -2724 -58049 -331499
9955 -331499 71340 -245194 114178 -190273 5268 -25058 -76034 -158438 -329580 -199877 -249226
9944 -249226 -122550 155312 -204450 -222877 -73855 -170435 -246179 -228219 -135487 186043 -22161
9932a62798k9718g085B15539B3807a6230l39187B9713b17821O6763M0326a5733
9920C72372b19552a096D1692b537j51754g4856I2746a74501o2152R3586G8994
9908a02289m9523j36734B61679d4469o7661a884k9498j83144j89866h3175b8404
9896b57885g0457j64169A58751a00958F3862a05260n2237O8884M2026A65991b60848
9884a63735r1956A26236d13868a56318K1058j9217k20434A29580a00979G7408
9873a55016O9812e162o6962o9173A9817K99054b31960n0458e9464D8882l123b5751
9860a03077E3409a76843K4849B27418K3138b64740a12041L4088C0815e0552j46784
9849a97336k4169k51103a55441A25044N348A0923g496r5895K036F3970J9669b98621
$$ plain form
9932 -162798 -192516 -7085 215539 23807 -16230 -355417 29713 -217821 -151058 -110732 -15733
9920 372372 -219552 -1096 41692 -2537 -154291 -74856 92746 -174501 -236653 -143067 78994
9908 -102289 -151812 -288546 261679 -44469 -112130 -1884 -31382 -214526 -404392 -83175 -28404
9896 -257885 -70457 -234626 158751 -100958 63862 -105260 -157497 -88613 -46587 165991 -260848
9884 -163735 -255691 126236 -413868 -156318 -135260 -154477 -374911 129580 -100979 77408
9873 -155016 -85204 -5162 -72124 -141297 19817 318871 -231960 -282418 -59464 48882 45759 -25751
9860 -103077 53409 -176843 -151994 227418 250556 -264740 -112041 -77953 30815 -50552 -197336
9849 -197336 -221505 -472608 -155441 125044 130392 10923 -7496 -103391 -101355 63970 83639 -298621
9836C5817K1079e2013A29712J03598d6876a8855I2598B1133h3526j00757k0999
9825b05282f8300a9512k01765G4002A0559d19089A05631k5349d7674A67997c919
9813B5142a7039E8730B313e861D0316b95078M9233k41871b9964A80016m8618i1705
9800F6399R0805b53536C38807b69178J13203r4241j7436J1720b1762A81219q7371
9789I3848m3563b04429o8753B58774f0474d7k64552I2384I597Q1690a90985Q2338
9777a08647B4578a01346J2744k13393J50888I722J54188K85936j97735h5853n2460
9766a38313E3218a72361k27592h1084n1855J5502d8576E8942k0944a62793e9579
9754A10845J30205j01718H497J17235h2834j49742L7867c16C7075N2584b40458
$$ plain form
9836 35817 56896 -52013 129712 233310 -46876 -18855 92598 21133 -83526 -184283 -205282
9825 -205282 -68300 -19512 -221277 74002 10559 -419089 105631 80282 -47674 167997 -3919
9813 25142 -17039 58730 2313 -5861 40316 -295078 -245845 -487716 -29964 180016 131398 -91705
9800 66399 157204 -253536 338807 -269178 -155975 -250216 -267652 -255932 -21762 181219 93848
9789 93848 50285 -204429 -273182 258774 -60474 -47 -264599 92384 9597 91287 -190985 -108647
9777 -108647 24578 -101346 -88602 -301995 -151107 9722 163910 449846 252111 -85853 -138313
9766 -138313 53218 -172361 -399953 -81084 -132939 -117437 -48576 58942 37998 -162793 -59579
9754 110845 241050 139332 8497 125732 -82834 -232576 -194709 -316 37075 89659 -240458
9742B50741g4539n2138b2515D9722H952b58401G9219e1736k21544J18755f7363
9730C3419h4886j70069i1616j23675M8264d8758j6105E1861d0609A4437O4454
9719G8891l0251B1534O0602a70019j29035h4890k42935a51961j5869A48552J53067
9708C01619F7469a2193A97a98064j51053J68160c489A1208a34310B1020b14429
9696a58139j26947E7689c5343A30094c32710c5646l9036K5276o0560m0232B21302
9684i0065l4565G4812a39916B7442a62977N5057G7707k1660d8196a5572p4564
9673i0136B39217c565I0384P9977b64993A79370C0440a30908K3122L3351B10027
9661b47660h6153k31005J23193c8632l3447p3705P563b8622b159k05794p4019
$$ plain form
9742 250741 -74539 -126677 -22515 49722 8952 -258401 79219 -51736 -273280 -154525 -67363
9730 33419 -84886 -254955 -91616 -215291 -167027 -48758 -64863 51861 -40609 14437 78891
9719 78891 48640 21534 82136 -170019 -299054 -84890 -327825 -151961 -167830 148552 301619
9708 301619 67469 -12193 197 -198064 -349117 -180957 -3489 11208 -134310 21020 -214429
9696 -158139 -285086 57689 -35343 130094 -332710 -35646 -74682 -49406 -109966 -150198 221302
9684 -90065 -124630 74812 -139916 27442 -162977 -107920 77707 56047 -48196 -15572 -90136
9673 -90136 239217 -3565 90384 170361 -264993 179370 30440 -130908 -107786 -74435 210027
9661 -247660 -86153 -317158 -193965 -38632 -72079 -145784 -138221 -28622 -2159 -207953 -281972
9650b81972a35027j46818a19341J6771B8319i6715c376j75708Q3427B12074c37782
9638F7728e4127m1718e310p618r7466C1161a12517A02112b03106M1486m37006
9627e98626b84059B7342N446I404a79712a9338j59304M6596o0425q7298J7615
9616b62154A70417a30534A54681b29296j41964A51972a91068d2983m6524A02458
9605a94432a4015j92750B7680A1932a61800a5977j1852j31569j94018B63900c0031
9593a217k39987d3344B28682b01039g3582K9739B53763a8795j79074A06720C4837
9581c17391G1629f5680q6707j88538a18804B6589c09091d6028I6492b57632a21069
9569a6888C0654a09177B23711r6832b4443j55545Q1326C23213A18146b3115A95120
$$ plain form
9650 -281972 -135027 -281845 -119341 -102570 28319 -96715 -3376 -179084 -95657 212074 -337782
9638 67728 -54127 -95845 -5310 -12928 -110394 31161 -112517 102112 -203106 -161620 -598626
9627 -598626 -284059 27342 32788 9404 -179712 -19338 -178642 -132046 -192471 -279769 -262154
9616 -262154 170417 -130534 154681 -229296 -371260 151972 -191068 -42983 -89507 102458
9605 -194432 -14015 -206765 27680 11932 -161800 -15977 -27829 -159398 -353416 263900 -30031
9593 -1217 -241204 -43344 228682 -201039 -73582 -43843 253763 -18795 -197869 106720 34837
9581 -317391 71629 -65680 -152387 -340925 -118804 26589 -309091 -46028 96492 -257632 -121069
9569 -16888 30654 -109177 223711 126879 -24443 -179988 -98662 323213 118146 -23115 195120
9557a6713H8188b33676G3983Q0600K0940c1524E2145a97816A71747b14986f5462
9545B7190N8844c18208J56430C834Q8853a86224n4864a5859j22645A84546J12121
9534B96667a02983M8704J7825m3584K9758r4188A57404c17759Q7427O9598F8759
9522a39404l23020a56086m4307A66011J0163a88407h2965q1042o9830f4729j57610
9511b22339D1472N018c88954f1747H5740c166B2837K82345A6184a6450k73793
9500b90243A17451a28146m2723q9810a03569k30792B08203a34263B3989f1985
9489A73117c7802j35393i817k46050J11650n0164m1577E4065N6671k0829a94204
9477g848A7862a96920A9358b8726H1362a10373c261m4776C5984d39172a31247
$$ plain form
9557 -16713 88188 -233676 73983 154583 175523 -31524 52145 -197816 171747 -214986 -65462
9545 27190 86034 -318208 -161778 3834 92687 -186224 -241088 -15859 -138504 184546 296667
9534 296667 -102983 -54279 -36454 -80038 -50280 -144468 157404 -317759 -230332 -160734 68759
9522 -139404 -462424 -156086 -200393 166011 176174 -188407 -82965 -164007 -233837 -64729 -222339
9511 -222339 41472 46490 -388954 -61747 85740 -3166 22837 305182 16184 -16450 -290243
9500 -290243 117451 -128146 -170869 -260679 -103569 -334361 208203 -134263 23989 -61985
9489 173117 -37802 -173195 -9817 -255867 -144217 -194381 -235958 54065 110736 89907 -194204
9477 -7848 17862 -196920 19358 -28726 81362 -110373 -3261 -48037 35984 -439172 -131247
9465d286A52946e4369l07406A50400l2881a38050a2398j45944p1054C43574a28509
9453c20030b2749l8252B3969M5227a09856I2201J03484H165b5562A43304a26366
9441A39518b53357o4678A3077c87951E3652c0371A32496c44158A17953a6930A01339
9429a11479m9918K6165O2718H7587J60707r8769o9406N6122b47799i7492k981
9418a00473H3987l3601P09d57058a15943l8900p2023A52195a81218j01680J09417
9407a73481F0908b12334Q5819k39790d5313j30036B6700c000k39679J21236M0755
9396h0688M432j22948H5361d2051A57830o2347J90408A34841n1053a27540A91020
9384a85467o882l1763g2602G9769a3810j15948k11271e5052A32055b4921H6979
$$ plain form
9465 -4286 152946 -54369 -361775 150400 117519 -138050 -12398 -158342 -229396 343574 -128509
9453 -320030 -22749 -61001 23969 69196 -109856 92201 195685 8165 -25562 143304 -126366
9441 139518 -253357 -318035 13077 -387951 53652 -30371 132496 -344158 117953 -16930 101339
9429 -111479 -161397 -135232 -72514 87587 248294 149525 80119 136241 -247799 -97492 -100473
9418 -100473 83987 50386 51095 -457058 -115943 -154843 -226866 152195 -181218 -282898 -173481
9407 -173481 60908 -212334 -126515 -366305 -45313 -175349 26700 -3000 -242679 -121443 -80688
9396 -80688 -76256 -199204 85361 -42051 157830 95483 285891 134841 83788 -127540 191020
9384 -185467 -192349 -224112 -72602 79769 -13810 -129758 -341029 -55052 132055 -24921 86979
9372a43009l4213Q5532c8370j08362I5830f6554b1325k82315J15544c4339l0423
9361f4762n8449E1224c84021i1940D5473b91006h9050r8290A44561a55353B89900
9349a55945E5794a00112B97565c31628d2667A52208J79709A17028l015C7276b62676
9337c35448b3024A90692a61195o2610o7560d627j54136l69105I5116a34539C0063
9325a05235F9379B9530e8980r8942A06958b85946j79674F241d4666A27603b27838
9313a44083A29233c15405I1257d45087g6715E055c5412C76567A75643d24385C67487
9301A39481J411a84442C9727L16344a9942j05729I8069b55366f4937n6185F9006
9289a808o6914K8715B0512M119c4950j66202F9921g7472A06044f0117a3283p4449
$$ plain form
9372 -143009 -177222 -91690 -38370 -146732 95830 -66554 -21325 -303640 -188096 -34339 -64762
9361 -64762 -123211 51224 -384021 -91940 45473 -291006 -89050 -187340 144561 -155353 289900
9349 -155945 55794 -100112 297565 -331628 -42667 152208 331917 117028 114013 37276 -262676
9337 -335448 -23024 190692 -161195 -223805 -291365 -4627 -158763 -527868 95116 -134539 30063
9325 -105235 69379 29530 -58980 -157922 106958 -285946 -465620 6241 -44666 127603 -227838
9313 -144083 129233 -315405 91257 -445087 -76715 5055 -35412 376567 175643 -424385 367487
9301 139481 140892 -184442 39727 356071 -19942 -125671 98069 -255366 -64937 -121122 69006
9289 -1808 -68722 -40007 20512 24631 -34950 -201152 69921 -77472 106044 -60117 -13283 -87732
9277h7732j72343A3860J33139a07410A33820K5539b2440O555k1661E5796h5028
9265i1689A03177e0353o6902j00645c076F5639M8703a00239j14285G0317b0526
9253F0352P3939c49088P6555L6863B50388E3375b23882J9393D1426a74309a1691
9241d0387q7365k17762A20359J05791A07326f3247q2167B4500b18298h8114d946
9229B21783a06052J1957B15285K110c44003m9832a56174O4210A91433a58561j31801
9218b90362I9556i8815A18440D3091P9569i4564k5056l7202l31331A7425K77713
9207B95138a0342k21004A36173h6711j03589B64352h2318k9042L2517E8574a29536
9195c95958F3688j0607b09571M4266G845a43168N2897m1989A32300D2043O7460
$$ plain form
9277 -87732 -260075 13860 146999 -107410 133820 159359 -22440 -15885 -37546 55796 -85028
9265 -91689 103177 -50353 -117255 -217900 -3076 65639 114342 -100239 -214524 70317 -20526
9253 60352 134291 -349088 -272533 -235670 250388 53375 -223882 -204489 41426 -174309 -11691
9241 -40387 -127752 -345514 120359 226150 107326 -63247 -145414 24500 -218298 -88114 -4946
9229 221783 -106052 -94095 215285 217395 -344003 -393835 -156174 -91964 191433 -158561 -290362
9218 -290362 99556 -98815 118440 43091 122660 -94564 -119620 -156822 -488153 17425 295138
9207 295138 -10342 -231346 136173 -86711 -190300 264352 -82318 -111360 -78843 58574 -129536
9195 -395958 63688 53081 -209571 -165305 7845 -143168 -90271 -132260 132300 42043 109503
9184A09503a31102H9746f1780j2869A61437h5874j32601F4449B1835o477c33613
9172b33001q678D6684Q2668a94146j94425a66730q323f8083j2962K8848C46483
9160G7318g7694j17289k2224B38502n2158c03955D3869J05973a72927g5317q8478
9149a63795A36131i8659Q9G103e2127p3666F5637j9011L0474C6753a70267a0602
9136a5514j12219e0556k97788N4695K0002M7055A2362d9923m6718j37728B06226
9124a47728B33949m9371b11661B3448a546D1215c35010A24809g5179B6446a71571
9112A0143J17949d12319C6476p783B746a64121K1953o6181L1548A57821b48938
9100F5518R2801a80078r459B15629d8975r4146I8174a64886A30474a75613E0605
$$ plain form
9184 109503 -131102 89746 -61780 -74649 161437 -85874 -218475 64449 21835 15358 -333613
9172 -233001 -241679 46684 129352 -194146 -388571 -166730 -175053 -68083 -81045 -52197 346483
9160 77318 -77694 -194983 -217207 238502 186344 -303955 43869 149842 -172927 -75317 -163795
9149 -163795 136131 -98659 -98570 7103 -52127 -125793 65637 46626 77100 36753 -170267 -10602
9136 -15514 -127733 -50556 -348344 -293649 -273647 -226592 12362 -49923 -96641 -234369 206226
9124 -147728 233949 184578 -211661 23448 -1546 41215 -335010 124809 -75179 26446 -171571
9112 10143 128092 -412319 36476 28693 2746 -164121 -142168 -208349 -176801 157821 -248938
9100 65518 158319 -180078 -189537 215629 -48975 -143121 98174 -164886 130474 -175613 50605
9088A01315m7752c749B30005m9804E0783N6727j2424L15670g474A06591a57110
9076b50111Q7619c3414k22803n6549C2615a90864j7331B12855a80782B639O8749
9065G1388J40989j01742c81791A16367B2865a08897k61306I4349a89344O0731
9055a28613e1437j2809k44015a9509l87595J00540i5536o5585A26437B9528e4878
9043A84976a69845l44400a55887d0132A7587J86794a76666a6469j02410o9767
9033a88646F6879K30522c80418F5099j3687g1743F3003a06537n3733B26592b50560
9021a01513A32879c05239k6156k5907B00278a05615m309H2032e8610K442B55256
9009i7985H1411a50533B41660b22562p344A37142l4752L0939J1973a48752b9412
$$ plain form
9088 101315 53563 -3749 230005 180201 50783 107510 95086 410756 -7474 106591 -157110
9076 -250111 -162492 -33414 -256217 -312766 32615 -190864 -208195 212855 -180782 2639 71388
9065 71388 212377 110635 -381791 116367 22865 -108897 -370203 94349 -189344 -128613
9055 -128613 -51437 -64246 -308261 -19509 -407104 -306564 -95536 -161121 126437 29528 -54878
9043 184976 -169845 -514245 -155887 -40132 17587 204381 -176666 -16469 -118879 -188646
9033 -188646 66879 297401 -380418 65099 51412 -71743 63003 -106537 -160270 226592 -250560
9021 -101513 132879 -305239 -331395 -357302 200278 -105615 -109924 82032 -58610 -56168 255256
9009 -97985 81411 -150533 241660 -222562 -229906 137142 102390 133329 145302 -148752 -29412
8997b7031l96990a12756d8121k530A11956l3241i4349A52499b6193G6250a34759
8985g9937B37138C9295d9048n1279m4636j8942A7950d2109m6774j23263j08910
8974c21056Q9635B42220M8383A3240J0700J47813C540J85682J17867a05758G2986
8962a45470k32063C38994a32169B1208J3928j3681L46599f5371k40116a24603
8951i6161J8049P454A13589m3143B2329l236P8513J51579B0626b4053E5548g1425
8938c1563B2966J50632D5261J56690B9520i9818C26926e2410n4235H7662e8469
8926E5474b10260l09918E0878K37611N24535J73738L451968J2251664E590590
8916B123549A008272B38151A1657h124B41349D1096a02696b8894r748J6919F12573
$$ plain form
8997 -27031 -424021 -112756 -48121 -50651 111956 78715 -94349 152499 -26193 76250 -134759
8985 -79937 237138 39295 -49048 -100327 -144963 -163905 17950 -42109 -88883 -212146 -321056
8974 -321056 -231421 242220 290603 13240 23940 171753 3540 189222 307089 -105758 72986
8962 -145470 -377533 338994 -132169 21208 35136 21455 368054 -65371 -305487 -124603
8951 -96161 -78112 -70658 113589 70446 22329 19093 97606 249185 20626 -24053 55548 -71425
8938 -31563 22966 173598 45261 201951 29520 -99818 326926 -52410 -106645 87662 -58469
8926 55474 -210260 -520178 50878 288489 813024 986762 4438730 16690394 5590590
8916 2123549 1008272 238151 11657 -8124 241349 41096 -102696 -28894 -38642 -21723 612573
8904C15192j32216c38479a62517B69195a1687A87420c12104M7378B9638K94514
8894C24152a73702b381G6676a7651G9605a9773A01290c08367f9965A79274b31066
8882A71194a91900M8862e556j56454k2701E0283d4999l1185k10943a20112B02535
8870d20585C51573h8913F9917K61416A09706a9789j25346A21444b78164D26897
8859D87689F6579l0666E0J46913d22755J08489A01969a26988B8737Q0569j7750
8848I1556d09138F808f6321l04676a19323J2185b1835A8151a18337e3459n7531
8837a10990A85659e17464G7002J16996H8623c12207A12401a8448B4607K06867
$$ plain form
8904 315192 182976 -338479 -162517 269195 -11687 187420 -312104 -264726 29638 324152
8894 324152 -173702 -2381 76676 -17651 79605 -19773 101290 -308367 -69965 179274 -231066
8882 171194 -191900 -143038 -5556 -162010 -184711 50283 -44999 -76184 -287127 -120112 202535
8870 -420585 351573 -88913 69917 331333 109706 -19789 -145135 121444 -278164 426897
8859 487689 66579 35913 50 146963 -422755 -314266 101969 -126988 28737 109306 91556
8848 91556 -409138 6808 -66321 -370997 -119323 -107138 -21835 18151 -118337 -53459 -110990
8837 -110990 185659 -517464 77002 193998 88623 -312207 112401 -18448 24607 231474
$$ [...]
##END NTUPLES=NMR SPECTRUM
##END=
