
##TITLE=AC1323_SBUAH12152_6608618_oEfHGj1OAB
##JCAMPDX= 6.0         $$ Bruker NMR JCAMP-DX V2.0
##DATA TYPE= NMR SPECTRUM
##DATA CLASS= NTUPLES
##ORIGIN= BRUKER
##OWNER= Administrator
$$ 1.72 TOPSPIN		Version 2.1
$$ 2012-08-01 15:55:09.859 -0500  Administrator@TOPSPIN
$$ Compression mode = diff/dup
##.OBSERVE FREQUENCY= 400.02188249412
##.OBSERVE NUCLEUS= ^1H
##.ACQUISITION MODE= SIMULTANEOUS (DQD)
##.ACQUISITION SCHEME= undefined
##.AVERAGES= 64
##.DIGITISER RES= 22
##SPECTROMETER/DATA SYSTEM= spect
##.PULSE SEQUENCE= noesygpps1d.comp
##.SOLVENT NAME= COFFEE_meoh
##.SHIFT REFERENCE= INTERNAL, COFFEE_meoh, 1, 14.96243
##AUDIT TRAIL= $$ (NUMBER, WHEN, WHO, WHERE, PROCESS, VERSION, WHAT)
$$ ##TITLE= Audit trail, TOPSPIN		Version 2.1
$$ ##JCAMPDX= 5.01
$$ ##ORIGIN= Bruker BioSpin GmbH
$$ ##OWNER= Administrator
$$ $$ C:\Bruker\TOPSPIN/data/COFFEE/nmr/AC1323_SBUAH12152_6608618_oEfHGj1OAB/12/pdata/1/auditp.txt
$$ ##AUDIT TRAIL=  $$ (NUMBER, WHEN, WHO, WHERE, PROCESS, VERSION, WHAT)
(   1,<2012-08-01 15:55:05.218 -0500>,<Administrator>,<TOPSPIN>,<go>,<TOPSPIN 2.1>,
      <created by zg
	started at 2012-08-01 15:43:35.015 -0500,
	POWCHK enabled, PULCHK disabled,
       configuration hash MD5:
       6B 1B 68 BB D9 2E 58 E2 7F 35 AD 54 07 DF 0E 41
       data hash MD5: 64K
       DB 01 E4 64 C0 D7 D9 B4 20 14 F0 D4 F5 96 16 48>)
(   2,<2012-08-01 15:55:07.906 -0500>,<Administrator>,<TOPSPIN>,<proc1d>,<TOPSPIN 2.1>,
      <Start of raw data processing
       efp LB = 0.3 FT_mod = 6 PKNL = 1 PHC0 = 0 PHC1 = 0 SI = 128K 
       data hash MD5: 128K
       F0 28 74 A1 62 85 BB F9 86 78 1A C8 18 56 AA 3A>)
(   3,<2012-08-01 15:55:09.093 -0500>,<Administrator>,<TOPSPIN>,<proc1d>,<TOPSPIN 2.1>,
      <pk PHC0 = -0.4833984 PHC1 = 0 
       data hash MD5: 128K
       94 31 5F 2A 4C 3E 2A 56 4B D9 59 20 45 26 63 FE>)
(   4,<2012-08-01 15:55:09.359 -0500>,<Administrator>,<TOPSPIN>,<proc1d>,<TOPSPIN 2.1>,
      <abs ABSG = 1 
       data hash MD5: 128K
       E2 92 84 97 7A 94 6A EC 98 E5 03 0F FF BF 4D 23>)
(   5,<2012-08-01 15:55:09.437 -0500>,<Administrator>,<TOPSPIN>,<proc1d>,<TOPSPIN 2.1>,
      <abs ABSG = 2 
       data hash MD5: 128K
       5B F5 99 20 49 26 69 67 CB 3B 60 71 D9 8E F5 AA>)
(   6,<2012-08-01 15:55:09.484 -0500>,<Administrator>,<TOPSPIN>,<proc1d>,<TOPSPIN 2.1>,
      <abs ABSG = 3 
       data hash MD5: 128K
       2D BB 5E 73 7D 0E D9 0D B0 E8 DC 5C C3 CE 6B 05>)
(   7,<2012-08-01 15:55:09.546 -0500>,<Administrator>,<TOPSPIN>,<proc1d>,<TOPSPIN 2.1>,
      <abs ABSG = 4 
       data hash MD5: 128K
       5E 86 1C 85 BB 52 AA 80 DD EF 95 8C 94 BA 04 7A>)
(   8,<2012-08-01 15:55:09.593 -0500>,<Administrator>,<TOPSPIN>,<proc1d>,<TOPSPIN 2.1>,
      <abs ABSG = 5 
       data hash MD5: 128K
       81 03 0A 9B 59 F3 5F 02 ED 16 32 B4 92 13 43 B0>)
$$ ##END=
$$ 
$$ $$ hash MD5
$$ $$ C6 19 08 C1 0B 4D 6A 8A 61 FD D3 A5 9D F8 CF 3A
##$RELAX= 
##$RELAX= 
##$RELAX= 
##$RELAX= 
##$RELAX= 
##$RELAX= 
##$RELAX= 
##$RELAX= 
$$ Bruker specific parameters
$$ [...]
##$TP07= 0
##$TPNAME0= <>
##$TPNAME1= <>
##$TPNAME2= <>
##$TPNAME3= <>
##$TPNAME4= <>
##$TPNAME5= <>
##$TPNAME6= <>
##$TPNAME7= <>
##$TPOAL= (0..7)
0.5 0.5 0.5 0.5 0.5 0.5 0.5 0.5
##$TPOFFS= (0..7)
0 0 0 0 0 0 0 0
##$TUNHIN= 0
##$TUNHOUT= 0
##$TUNXOUT= 0
##$USERA1= <user>
##$USERA2= <user>
##$USERA3= <user>
##$USERA4= <user>
##$USERA5= <user>
##$V9= 5
##$VALIST= <valist>
##$VCLIST= <CCCCCCCCCCCCCCC>
##$VD= 0
##$VDLIST= <DDDDDDDDDDDDDDD>
##$VPLIST= <PPPPPPPPPPPPPPP>
##$VTLIST= <TTTTTTTTTTTTTTT>
##$WBST= 1024
##$WBSW= 4
##$XGAIN= (0..3)
0 0 0 0
##$XL= 0
##$YL= 0
##$YMAX_a= 16089811
##$YMIN_a= -9415573
##$ZGOPTNS= <>
##$ZL1= 120
##$ZL2= 120
##$ZL3= 120
##$ZL4= 120
##$ABSF1= 14.96243
##$ABSF2= -5.595752
##$ABSG= 5
##$ABSL= 3
##$ALPHA= 0
##$AQORDER= 0
##$ASSFAC= 0
##$ASSFACI= 0
##$ASSFACX= 0
##$ASSWID= 0
##$AUNMP= <proc_prof1d_extract.lims>
##$AXLEFT= 0
##$AXNAME= <>
##$AXNUC= <1H>
##$AXRIGHT= 0
##$AXTYPE= 0
##$AXUNIT= <>
##$AZFE= 0.1
##$AZFW= 0.1
##$BCFW= 0
##$BC_mod= 0
##$BYTORDP= 0
##$COROFFS= 0
##$CY= 15
##$DATMOD= 1
##$DC= 0
##$DFILT= <>
##$DTYPP= 0
##$F1P= 0
##$F2P= 0
##$FCOR= 0.5
##$FTSIZE= 131072
##$FT_mod= 6
##$GAMMA= 0
##$GB= 0
##$INTBC= 1
##$INTSCL= 1
##$ISEN= 128
##$LB= 0.3
##$LEV0= 0
##$LPBIN= 0
##$MAXI= 10000
##$MC2= 0
##$MEAN= 0
##$ME_mod= 0
##$MI= 0
##$NCOEF= 0
##$NC_proc= -2
##$NLEV= 6
##$NOISF1= 0
##$NOISF2= 0
##$NSP= 0
##$NTH_PI= 0
##$NZP= 0
##$OFFSET= 14.96243
##$PC= 1
##$PHC0= -0.4833984
##$PHC1= 0
##$PH_mod= 1
##$PKNL= yes
##$PPARMOD= 0
##$PPDIAG= 0
##$PPIPTYP= 0
##$PPMPNUM= 2147483647
##$PPRESOL= 1
##$PSCAL= 4
##$PSIGN= 0
##$PYNMP= <proc.py>
##$REVERSE= no
##$SF= 400.020009063235
##$SI= 131072
##$SIGF1= 0
##$SIGF2= 0
##$SINO= 400
##$SIOLD= 131072
##$SPECTYP= <>
##$SREGLST= <1H.CDCl3>
##$SSB= 0
##$STSI= 131072
##$STSR= 0
##$SW_p= 8223.68421052631
##$SYMM= 0
##$S_DEV= 0
##$TDeff= 65536
##$TDoff= 0
##$TI= <>
##$TILT= no
##$TM1= 0
##$TM2= 0
##$TOPLEV= 0
##$USERP1= <user>
##$USERP2= <user>
##$USERP3= <user>
##$USERP4= <user>
##$USERP5= <user>
##$WDW= 1
##$XDIM= 131072
##$YMAX_p= 424973869
##$YMIN_p= -16489
##$CURPLOT= <Network HP LaserJet P1505>
##$CURPRIN= <$Network HP LaserJet P1505>
##$DFORMAT= <normdp>
##$LAYOUT= <+/1D_H.xwp>
##$LFORMAT= <normlp>
##$PFORMAT= <normpl>
##$SURQMSG= 1
$$ End of Bruker specific parameters
$$ ---------------------------------
##NTUPLES= NMR SPECTRUM
##VAR_NAME=  FREQUENCY,     SPECTRUM/REAL,   SPECTRUM/IMAG
##SYMBOL=    X,             R,               I
##VAR_TYPE=  INDEPENDENT,   DEPENDENT,       DEPENDENT
##VAR_FORM=  AFFN,          ASDF,            ASDF
##VAR_DIM=   131072,        131072,          131072
##UNITS=     HZ,            ARBITRARY UNITS, ARBITRARY UNITS
##FACTOR=    0.0627417313425164, 1,          1
##FIRST=     8223.62146879497, 624,          -58333
##LAST=      0,             1981,            -58903
##MIN=       0,             -16489,          0
##MAX=       8223.62146879497, 424973869,    0
$$ Real data points
##PAGE= N=1
##DATA TABLE= (X++(R..R)), XYDATA
$$ [...]
63207A139623J1180N645o78p446j4249k0650k6235l0772l4130l6028l6235l5124
63195I14901l3664l2406l0837k8143k4410k0515j7056j3870j0621p257l840l51
63183F91931L131O406R303J1732J3622J5138J6683J8380J9679K0047J9810J9674
63171H65536J9662J9308J8793J8922J9758K0296J9821J8718J7371J5203J1624
63160A065012P269L247m28m670r760j4819j8959k2167k4825k6986k8356k8698
63148H95860k8059k6814k5573k4672k3809k2425k0427j8264j6294j4495j2763
63137F62265j1187r828q608p464o400n359m347l666l626l948l873l081k092j488
63123E87298j066j77J290K700L414L388L029K758K797L149L636M072M457M906
$$ y = [1139623, 1150803, 1156448, 1155770, 1148324, 1134075, 1113425, 1087190, 1056418, 1022288, 986260, 950025, 914901, 881237, 848831, 817994, 789851, 765441, 744926, 727870, 714000, 703379, 696122, 692282, 691931, 695062, 701468, 710771, 722503, 736125, 751263, 767946, 786326, 806005, 826052, 845862, 865536, 885198, 904506, 923299, 942221, 961979, 982275, 1002096, 1020814, 1038185, 1053388, 1065012, 1072281, 1075528, 1075100, 1070430, 1060670, 1045851, 1026892, 1004725, 979900, 952914, 924558, 895860, 867801, 840987, 815414, 790742, 766933, 744508, 724081, 705817, 689523, 675028, 662265, 651078, 641250, 632642, 625178, 618778, 613419, 609072, 605406, 601780, 597832, 593959, 590878, 588786, 587298, 586232, 586055, 587345, 590045, 593459, 596847, 599876, 602634, 605431, 608580, 612216, 616288, 620745, 625651]
63109F25651N409N830O136O442O675O520N915N384N563O439P300P432O654N251
63095G12601L727K583K020J765J431J076J042J278J335J109R56R02M21n62j083
63080G30601k98J303K574L191L628L973L901L721M340N952P714Q985R993J0934
63066H00512J1434J1448J1790J3045J4714J6149J7699K0050K2952K5564K7751
63055I93108L0114L2931L5911L8936M2170M5435M8249N0591N2977N5560N7780
63044A483762N9072N9396N8954N7811N6104N4184N2378N0848M9827M9595N0150
63033B082081N1047N1774N2062N1805N0865M8950M5546M0148L2668K3502J2923
63022B543371Q06j2701k6577l9592n1228o1364o9340p4280p6293p6462p5492p3126
$$ y = [625651, 631060, 636890, 643026, 649468, 656143, 662663, 668578, 673962, 679525, 685964, 693264, 700696, 707350, 712601, 716328, 718911, 720931, 722696, 724127, 725203, 726245, 727523, 728858, 729967, 730923, 731825, 732246, 731684, 730601, 730303, 731606, 734180, 737371, 740999, 744972, 748873, 752594, 756934, 762886, 770600, 779585, 789578, 800512, 811946, 823394, 835184, 848229, 862943, 879092, 896791, 916841, 939793, 965357, 993108, 1023222, 1056153, 1092064, 1131000, 1173170, 1218605, 1266854, 1317445, 1370422, 1425982, 1483762, 1542834, 1602230, 1661184, 1718995, 1775099, 1829283, 1881661, 1932509, 1982336, 2031931, 2082081, 2133128, 2184902, 2236964, 2288769, 2339634, 2388584, 2434130, 2474278, 2506946, 2530448, 2543371, 2544177, 2531476, 2504899, 2465307, 2414079, 2352715, 2283375, 2209095, 2132802, 2056340, 1980848, 1907722]
63010A907722o9073o3706n7497n0570m3237l6272l0058k3950j7106r580k162M560
62998A509071J0449J5504J9860K3861K7717L1122L3602L5113L6020L6591L6792
62987A815702L6463L5589L4425L3356L2301L0372K6672K1463J5861J0192L468
62976B095864n058j4669k4212l3523m2873n1552n8250o2703o5830o8199o9284
62965A599711o8596o6599o4139o1484n8365n4514m9931m4988m0411l6687l3438
62954A020559k9854k5925k2600k0473j8991j7268j5186j3132j1185r279p894p744
62942H21028q729r757r851r092q227p706p405p184p195p537p884p822p458p256
62928G07925p235o806n700m619m419m973n417n429n523n977o218n637m518l647
$$ y = [1907722, 1838649, 1774943, 1717446, 1666876, 1623639, 1587367, 1557309, 1533359, 1516253, 1506673, 1504511, 1509071, 1519520, 1535024, 1554884, 1578745, 1606462, 1637584, 1671186, 1706299, 1742319, 1778910, 1815702, 1852165, 1887754, 1922179, 1955535, 1987836, 2018208, 2044880, 2066343, 2082204, 2092396, 2095864, 2090806, 2076137, 2051925, 2018402, 1975529, 1923977, 1865727, 1803024, 1737194, 1668995, 1599711, 1531115, 1464516, 1400377, 1338893, 1280528, 1226014, 1176083, 1131095, 1090684, 1053997, 1020559, 990705, 964780, 942180, 921707, 902716, 885448, 870262, 857130, 845945, 836666, 828772, 821028, 812299, 802542, 792691, 783599, 775372, 767666, 760261, 753077, 745882, 738345, 730461, 722639, 715181, 707925, 700690, 693884, 688184, 683565, 679146, 674173, 668756, 663327, 657804, 651827, 645609, 639972, 635454, 631807]
62914F31807l362l397l461l551l816m298m864n191m999m324l428k396j133J38
62900E83725P86N10j68m48j72J41k9p88j886k884l396l413l350l528l843m066
62884E57191m262m563m734m377l496k514j799j398j182r90o90l34j47j95k61k44
62868E26005l49o09n72L8P10P66M04L26N41L64k70n14O5O45K33j001k074k476
62850E22232k474k374k162j824j562j538j656j628j187l37N16Q33M93j28o62j073
62834E05469j321j145m81K21M80L67K03N1j69k63m0J92k6n27o78l35o1k56o06
62815E01075o72n77p23j112j316j044m47J18M55O54R86J666K678L772M639N087
62799E15239N142N073N228N768O658P908R566J1433J3057J4314J5613J7232J8773
$$ y = [631807, 628445, 625048, 621587, 618036, 614220, 609922, 605058, 599867, 594868, 590544, 587116, 584720, 583587, 583725, 584511, 585021, 584853, 584405, 584233, 584374, 584345, 583557, 581671, 578787, 575391, 571978, 568628, 565100, 561257, 557191, 552929, 548366, 543632, 539255, 535759, 533245, 531446, 530048, 528866, 527876, 527186, 526852, 526705, 526510, 526249, 526005, 525656, 525047, 524475, 524513, 525223, 525989, 526393, 526719, 527260, 527624, 527354, 526840, 526905, 527550, 527783, 526782, 524708, 522232, 519758, 517384, 515222, 513398, 511836, 510298, 508642, 507014, 505827, 505490, 506006, 506839, 507332, 507204, 506542, 505469, 504148, 503003, 502522, 502743, 503223, 503590, 503793, 503844, 503675, 503412, 503372, 503564, 503538, 503011, 502333, 501998, 501937, 501681, 501075, 500403, 499826, 499103, 497991, 496675, 495631, 495184, 495302, 495757, 496411, 497397, 499063, 501741, 505513, 510152, 515239, 520381, 525454, 530682, 536450, 543108, 551016, 560582, 572015, 585072, 599386, 614999, 632231, 651004]
62786F51004J9744K0510K1996K4562K7678L0778L3841L7165M1090M6021N2064
62775A006453N8483O4203O9157P4372Q0470Q6701R1912R5805R8474R9344R7401
62764A922775R2279Q4396P4227O2005M8009L2533J5767j746j8776l4190m7914
62753B229365o0387p1350p9961q6042r0238r2837r3436r1967q9146q5524q1012
62742A307465p5777p0699o6234o1675n6328n0791m6122m2268l8360l4247l0674
62731G34290k8029k5905k3996k2447k1086j9137j6216j3014j0595r357q920q615
62719E26973p844o421m784l523k549j222N10J803K096K041K672M178O054Q056
62705E28040J0265J2541J4683J6997J9909K3080K5716K7786L0191L3502L7318
$$ y = [651004, 670748, 691258, 713254, 737816, 765494, 796272, 830113, 867278, 908368, 954389, 1006453, 1064936, 1129139, 1198296, 1272668, 1353138, 1439839, 1531751, 1627556, 1726030, 1825374, 1922775, 2015054, 2099450, 2173677, 2235682, 2283691, 2316224, 2331991, 2330245, 2311469, 2277279, 2229365, 2168978, 2097628, 2017667, 1931625, 1841387, 1748550, 1655114, 1563147, 1474001, 1388477, 1307465, 1231688, 1160989, 1094755, 1033080, 976752, 925961, 879839, 837571, 799211, 764964, 734290, 706261, 680356, 656360, 633913, 612827, 593690, 577474, 564460, 553865, 544508, 535588, 526973, 519129, 512708, 507924, 504401, 501852, 500630, 501140, 502943, 505039, 507080, 509752, 513930, 519984, 528040, 538305, 550846, 565529, 582526, 602435, 625515, 651231, 679017, 709208, 742710, 780028]
62694G80028M1164M5246M9810N4419N8530O2334O6302P0074P2486P2666P0568
62683A443627O6397O0149N1901M2151L1492K0139P950n039j8226l0559m1124m9650
62671A579208n6426o1670o5239o7063o7508o7043o5734o3440o0393n7146n3963
62660H93583n0617m6822m2609l8297l4364l1267k8987k6832k4147k1236j9105
62649E29300j8135j7577j6505j4858j3172j1757j0552r532q775q251p857p567
62637C84762p342p026o587o240o099n943n524m921m328l707l012k436k156j996
62623C17445j776j662j764j701j125m56l63o10k51R42K035K222J869J852K422
62608C19079L246M088M937N718O395P189Q216R125R612J0101J1354J3392J5440
$$ y = [780028, 821192, 866438, 916248, 970667, 1029197, 1091531, 1157833, 1227907, 1300393, 1373059, 1443627, 1510024, 1570173, 1622074, 1664225, 1695717, 1715856, 1723806, 1718767, 1700541, 1669982, 1628858, 1579208, 1522782, 1461112, 1395873, 1328810, 1261302, 1194259, 1128525, 1065085, 1004692, 947546, 893583, 842966, 796144, 753535, 715238, 680874, 649607, 620620, 593788, 569641, 548405, 529300, 511165, 493588, 477083, 462225, 449053, 437296, 426744, 417212, 408437, 400186, 392329, 384762, 377420, 370394, 363807, 357567, 351468, 345525, 340001, 335080, 330752, 327045, 324033, 321597, 319441, 317445, 315669, 314007, 312243, 310542, 309417, 308961, 308598, 307988, 307737, 308679, 310714, 312936, 314805, 316657, 319079, 322325, 326413, 331350, 337068, 343463, 350652, 358868, 367993, 377605, 387706, 399060, 412452, 427892]
62595D27892J7058J8781K1385K4882K8643L2174L5402L8401M1246M4105M7099
62584G77068M9958N2061N2837N1940M9066M4055L7301K9712K1896J3675M787m218
62572A180138j2334j9224k5366l0991l5580l8732m0841m2418m3186m2508m0444
62561H08514l7741l4925l2014k9111k6612k4664k2927k1061j9169j7628j6743
62550E25919j6572j6804j6822j6244j5317j4438j3427j1863r985q599p991p645
62538C70212p122o482n645m187k221p13k97m44l37N0M35J098K344L583L992L810
62522C58076L999M756N413N809O687Q445J0447J1997J3268J4842J6903J9348K2136
62509E02126K5116K7944L0511L3093L5722L7913L9291M0044M0303L9551L7178
$$ y = [427892, 444950, 463731, 485116, 509998, 538641, 570815, 606217, 644618, 685864, 729969, 777068, 827026, 879087, 931924, 983864, 1032930, 1076985, 1114286, 1143998, 1165894, 1179569, 1184356, 1180138, 1167804, 1148580, 1123214, 1092223, 1056643, 1017911, 977070, 934652, 891466, 848958, 808514, 770773, 735848, 703834, 674723, 648111, 623447, 600520, 579459, 560290, 542662, 525919, 509347, 492543, 475721, 459477, 444160, 429722, 416295, 404432, 394447, 385848, 377857, 370212, 363090, 356608, 350963, 346776, 344555, 343842, 343545, 343101, 342764, 342814, 343249, 344347, 346691, 350274, 354266, 358076, 362075, 366831, 372244, 378053, 384740, 393185, 403632, 415629, 428897, 443739, 460642, 479990, 502126, 527242, 555186, 585697, 618790, 654512, 692425, 731716, 771760, 812063, 851614, 888792]
62498H88792L3260K8222K2076J4700O700p83p246j3192j9140k4710k9047l1817
62486H67815l3402l4258l4440l3791l2368l0502k8482k6370k4199k2096k0045
62475E47862j7709j4880j2038j0004q894p936o482m781l367k167q06N35J324J615
62461D62272K046K725K960K435K029K765M318N379N485N698P129R348J0866J0983
62447E36438J0484J0408J0667J0311Q820O573M063J206k331o386j0231j3113j4723
62434E52186j5249j5200j5091j5109j5083j4796j4197j3228j1729r781p905o563
62422C98255n581m489l301k484k107j587n43O50J563K489L889N367N960N592N466
62407D09139O603Q481R674R595Q963Q624Q498P950O756N191L467J574l09j721
$$ y = [888792, 922052, 950274, 972350, 987050, 993750, 992967, 985721, 972529, 953389, 928679, 899632, 867815, 834413, 800155, 765715, 731924, 699556, 669054, 640572, 614202, 590003, 567907, 547862, 530153, 515273, 503235, 493231, 484337, 476401, 469919, 465138, 461771, 459604, 458798, 459333, 460657, 462272, 464318, 467043, 470003, 472438, 474467, 477232, 481550, 486929, 492414, 498112, 505241, 514589, 525455, 536438, 546922, 557330, 567997, 578308, 587128, 593701, 597764, 598970, 596639, 590253, 580022, 566909, 552186, 536937, 521737, 506646, 491537, 476454, 461658, 447461, 434233, 422504, 412723, 404818, 398255, 392674, 388185, 384884, 382400, 380293, 378706, 378163, 378813, 380376, 382865, 386754, 392121, 398081, 403673, 409139, 415742, 424223, 433897, 443492, 452455, 461079, 469577, 477527, 484283, 489474, 492941, 494515, 494206, 492485]
62393D92485k458k914l630m635n492n911o002n953n720n194m445l616k734j784
62379D31997q42R2J351L354N989Q574J0619J2442J4680J7354J9837K1827K3916
62366E71190K6900L0782L4888L8767M2524M6170M9161N1019N2069N3078N4046
62355A050594N3805N1073M5639L8321K9912K0699J1013J733o141j2282j7084k1059
62343A246223k4538k7883l1458l5145l8253m0142m0797m0483l9156l6570l2923
62332H58875k9013k5683k3340k1971k1339k1077k0783k0176j9157j7761j6192
62321F22383j4744j3432j1834r667p377n799n106m569l537k310j714k110l086
62308E37098l948m251m038l814m181n246o515p419p819p819p390o477n296m162
$$ y = [492485, 490027, 487113, 483483, 478848, 473356, 467445, 461443, 455490, 449770, 444576, 440131, 436515, 433781, 431997, 431155, 431247, 432598, 435952, 441941, 450515, 461134, 473576, 488256, 505610, 525447, 547274, 571190, 598090, 628872, 663760, 702527, 745051, 791221, 840382, 891401, 943470, 996548, 1050594, 1104399, 1155472, 1201111, 1239432, 1269344, 1290043, 1301056, 1302789, 1296648, 1284366, 1267282, 1246223, 1221685, 1193802, 1162344, 1127199, 1088946, 1048804, 1008007, 967524, 928368, 891798, 858875, 829862, 804179, 780839, 758868, 737529, 716452, 695669, 675493, 656336, 638575, 622383, 607639, 594207, 582373, 572706, 565329, 559530, 554424, 549855, 546318, 544008, 542294, 540184, 537098, 533150, 528899, 524861, 521047, 516866, 511620, 505105, 497686, 489867, 482048, 474658, 468181, 462885, 458723]
62294D58723l160k265j610j289r64j26J200K450L313M107N181O325P068P343P549
62279D93845Q048Q861R758J0494J0923J1130J1404J1990J2809J3522J3947J4358
62267F31089J5301J7072J9401K1673K3577K5475K8029L1451L5258L8877M2272
62256I29475M5746M9038N1005N0408M6997M1554L4895K7259J8773J0091K066n082
62244A302225j1759j8145k3851k8612l2758l6629l9842m1660m1941m1257m0061
62233I45710l8167l5210l1384k7507k4344k1905j9491j6543j3368j0789r063p644
62221F90295o161n101m989n414n499n101m812m845m770m370l980l734l262k460
62207F25797j845j653j222O0J722K903L648M721O192P171P122O746P140Q527J0216
$$ y = [458723, 455563, 453298, 451688, 450399, 449435, 449309, 450509, 452959, 456272, 460379, 465560, 471885, 478953, 486296, 493845, 501893, 510754, 520512, 531006, 541929, 553059, 564463, 576453, 589262, 602784, 616731, 631089, 646390, 663462, 682863, 704536, 728113, 753588, 781617, 813068, 848326, 887203, 929475, 975221, 1024259, 1075264, 1125672, 1172669, 1214223, 1249118, 1276377, 1295150, 1305241, 1307307, 1302225, 1290466, 1272321, 1248470, 1219858, 1187100, 1150471, 1110629, 1068969, 1027028, 985771, 945710, 907543, 872333, 840949, 813442, 789098, 767193, 747702, 731159, 717791, 707002, 697939, 690295, 684134, 679033, 674044, 668630, 663131, 658030, 653218, 648373, 643603, 639233, 635253, 631519, 628257, 625797, 623952, 622299, 621077, 621137, 622859, 625762, 629410, 634131, 640323, 647494, 654616, 661362, 668502, 677029, 687245]
62192F87245J1558J2619J3860J5493J7236J8647J9501J9697J8981J7182J4828
62181H66847J3010J2227J1758J0679R253Q671R486J1019J2504J4136J6558J9766
62169A015914K3133K6325K9647L3338L6887L9259L9768L8538L6050L2357K7101
62158A378317K0424J3581Q150M607K092m78l418o498r566j2603j5446j7828j9503
62145A341831k0155j9450j7553j5283j3390j1828j0228q808q197q372q467p913
62133A192187p185p007p234o998n740l694j493L31J519K235L101M765P244R810
62119A181841J1673J2671J3328J4250J5487J6490J6785J6722J7221J8666K0375
62108A355509K1574K2494K3926K5860K7434K8241K8913L0022L1236L2122L3109
$$ y = [687245, 698803, 711422, 725282, 740775, 758011, 776658, 796159, 815856, 834837, 852019, 866847, 879857, 892084, 903842, 914521, 923774, 932445, 941931, 952950, 965454, 979590, 996148, 1015914, 1039047, 1065372, 1095019, 1128357, 1165244, 1204503, 1244271, 1282809, 1318859, 1351216, 1378317, 1398741, 1412322, 1420472, 1425079, 1427171, 1426693, 1423275, 1416777, 1407211, 1394608, 1379162, 1361334, 1341831, 1321676, 1302226, 1284673, 1269390, 1256000, 1244172, 1233944, 1225136, 1216939, 1208567, 1200100, 1192187, 1185002, 1177995, 1170761, 1163763, 1158023, 1154329, 1152836, 1153167, 1154686, 1156921, 1160022, 1164787, 1172031, 1181841, 1193514, 1206185, 1219513, 1233763, 1249250, 1265740, 1282525, 1299247, 1316468, 1335134, 1355509, 1377083, 1399577, 1423503, 1449363, 1476797, 1505038, 1533951, 1563973, 1595209, 1627331, 1660440]
62097A660440L4816L6878L8404L9392M0730M2771M4928M6874M9134N1842N3744
62086B139953N3318N0550M6916M3817M1747M0920M1768M4329M7508M9457M8796
62075B649079M5520M0793L6055L2280K9931K9285L0471L3219L6935M1131M5527
62064C050226M9656N2782N4422N4656N3639N1220M7483M3270L9659L6959L4752
62053C568724L2755L0997K9196K6688K3318J9861J7206J5411J3933J2483J1331
62042C801903J0850J1055J1578J1908J1711J1107J0538J0305J0186R610Q185O070
62030C925006L830J881N6k161m857p380r023r897j0716j1799j2775j3290j3560
62017C835315j3913j4165j3830j2785j1410j0059q659o953n050l491k560j656
$$ y = [1660440, 1695256, 1732134, 1770538, 1809930, 1850660, 1893431, 1938359, 1985233, 2034367, 2086209, 2139953, 2193271, 2243821, 2290737, 2334554, 2376301, 2417221, 2458989, 2503318, 2550826, 2600283, 2649079, 2694599, 2735392, 2771447, 2803727, 2833658, 2862943, 2893414, 2926633, 2963568, 3004699, 3050226, 3099882, 3152664, 3207086, 3261742, 3315381, 3366601, 3414084, 3457354, 3497013, 3533972, 3568724, 3601479, 3632476, 3661672, 3688360, 3711678, 3731539, 3748745, 3764156, 3778089, 3790572, 3801903, 3812753, 3823808, 3835386, 3847294, 3859005, 3870112, 3880650, 3890955, 3901141, 3910751, 3918936, 3925006, 3928836, 3930717, 3930773, 3928612, 3923755, 3916375, 3907352, 3897455, 3886739, 3874940, 3862165, 3848875, 3835315, 3821402, 3807237, 3793407, 3780622, 3769212, 3759153, 3750494, 3743541, 3738491, 3735000, 3732440, 3730784]
62005C730784K62L324O339Q181R176J0451J2181J3425J3676J3592J3719J3484
61993C848594J2047R511O565L449J4l580o950j0041j2905j5136j6255j6607j7227
61980C781479j8782k1182k4087k7159k9901l1836l2981l3727l4237l4489l4721
61969C458377l5262l5938l6313l6489l6912l7339l6894l5371l3754l2999l2972
61958C068134l2959l2498l1337k9273k6712k4823k4313k4395k3640k1619j9107
61947B777458j6925j5319j4210j3328j2129j0218p972o156m968l961k866j789
61935B667617n37J528M559P726J0124J1848J3745J6300J9206K1928K4401K7173
61923B825618L0997L6246M2625M9518N6708O4636P3980Q5195R8529J14195J32271
$$ y = [3730784, 3731046, 3734370, 3740709, 3748890, 3758066, 3768517, 3780698, 3794123, 3807799, 3821391, 3835110, 3848594, 3860641, 3870152, 3876717, 3880166, 3880180, 3876600, 3869650, 3859609, 3846704, 3831568, 3815313, 3798706, 3781479, 3762697, 3741515, 3717428, 3690269, 3660368, 3628532, 3595551, 3561824, 3527587, 3493098, 3458377, 3423115, 3387177, 3350864, 3314375, 3277463, 3240124, 3203230, 3167859, 3134105, 3101106, 3068134, 3035175, 3002677, 2971340, 2942067, 2915355, 2890532, 2866219, 2841824, 2818184, 2796565, 2777458, 2760533, 2745214, 2731004, 2717676, 2705547, 2695329, 2687357, 2681201, 2676233, 2672272, 2669406, 2667617, 2667080, 2668608, 2673167, 2680893, 2691017, 2702865, 2716610, 2732910, 2752116, 2774044, 2798445, 2825618, 2856615, 2892861, 2935486, 2985004, 3041712, 3106348, 3180328, 3265523, 3364052, 3478247, 3610518]
61912C610518J52675J75487K01263K30765K64467L02541L45401L93992M49297
61903F126406N11439N79073O49453P18667P81332Q29565Q52308Q36606P71327
61894A2656176O51633M81812K75021N0485j70578l69184n31911o52391p30591
61885A1660472p70726p79205p63352p30480o86943o37446n85194n32578m81574
61876E692974m33629l89555l49684l14001k82098k53306k27140k03478j82311
61867C057772j63570j47343j33774j22391j11892j01166r0412q0690p2443o5049
61857A969042n7960n1535m6360m2173l8095l3696k9374k5722k2877k0551j8395
61846A582304j6232j4153j2375j0972r758q574p602p035o576n544l680j631l78
$$ y = [3610518, 3763193, 3938680, 4139943, 4370708, 4635175, 4937716, 5283117, 5677109, 6126406, 6637845, 7216918, 7866371, 8585038, 9366370, 10195935, 11048243, 11884849, 12656176, 13307809, 13789621, 14064642, 14115127, 13944549, 13575365, 13043454, 12391063, 11660472, 10889746, 10110541, 9347189, 8616709, 7929766, 7292320, 6707126, 6174548, 5692974, 5259345, 4869790, 4520106, 4206105, 3924007, 3670701, 3443561, 3240083, 3057772, 2894202, 2746859, 2613085, 2490694, 2378802, 2277636, 2187224, 2106534, 2034091, 1969042, 1911082, 1859547, 1813187, 1771014, 1732919, 1699223, 1669849, 1644127, 1621250, 1600699, 1582304, 1566072, 1551919, 1539544, 1528572, 1518814, 1510240, 1502638, 1495603, 1489027, 1483483, 1479803, 1478172, 1477794]
61833A477794k95q34j099n96M88J550K075J998J704J681K106K742L195L305L339
61818A499153L786M910O510Q141R640J1360J3730J6672J9548K1928K4152K6956
61806A666486L0536L4313L7762M1158M5185N0018N5181O0321O5666P1599P8113
61795B236338Q4946R2011R9464J07573J16782J27674J40523J54923J70323J87044
61785C517601K06467K30023K58112K90202L25862L65573M10675M62595N22225
61776F589335N89952O66294P52257Q48734R55400J070187J189383J307130J413766
61767A5382438J494331J529193J497236J380777J171113Q73347N08165J08586
61759B3945186k87507o45635r40748j160012j302507j376045j392550j364632
$$ y = [1477794, 1477499, 1476665, 1475566, 1474970, 1475458, 1477008, 1479083, 1481081, 1482785, 1484466, 1486572, 1489314, 1492509, 1495814, 1499153, 1502939, 1507849, 1514359, 1522500, 1532140, 1543500, 1557230, 1573902, 1593450, 1615378, 1639530, 1666486, 1697022, 1731335, 1769097, 1810255, 1855440, 1905458, 1960639, 2020960, 2086626, 2158225, 2236338, 2321284, 2413295, 2512759, 2620332, 2737114, 2864788, 3005311, 3160234, 3330557, 3517601, 3724068, 3954091, 4212203, 4502405, 4828267, 5193840, 5604515, 6067110, 6589335, 7179287, 7845581, 8597838, 9446572, 10401972, 11472159, 12661542, 13968672, 15382438, 16876769, 18405962, 19903198, 21283975, 22455088, 23328435, 23836600, 23945186, 23657679, 23012044, 22071296, 20911284, 19608777, 18232732, 16840182, 15475550]
61751A5475550j304563j224111j133348j039129r45295q54345p68536o89531o17973
61742F898719n53775m96453m45077l98658l56956l20352k88632k60473k34683
61733C543660k11276j90685j72446j55558j39861j26014j14101j03181r2528q2596
61723B155414p4300o7828o2506n7562n2677m8050m4065m0803l7749l4294l0494
61712A605086k7014k4382k2604k1485k0787k0026j8762j7245j6226j5948j5966
61701A384641j6130j6883j8214j9161j9094j8746j9030j9493j9004j7617j6525
61690A184744j6264j6203j5863j5634j5714j5439j4318j2888j1905j1232j0266
61679A029018q990p840o871n760m476l342k494j877j595j786k106j963j341q31
$$ y = [15475550, 14170987, 12946876, 11813528, 10774399, 9829104, 8974759, 8206223, 7516692, 6898719, 6344944, 5848491, 5403414, 5004756, 4647800, 4327448, 4038816, 3778343, 3543660, 3332384, 3141699, 2969253, 2813695, 2673834, 2547820, 2433719, 2330538, 2238010, 2155414, 2081114, 2013286, 1950780, 1893218, 1840541, 1792491, 1748426, 1707623, 1669874, 1635580, 1605086, 1578072, 1553690, 1531086, 1509601, 1488814, 1468788, 1450026, 1432781, 1416555, 1400607, 1384641, 1368511, 1351628, 1333414, 1314253, 1295159, 1276413, 1257383, 1237890, 1218886, 1201269, 1184744, 1168480, 1152277, 1136414, 1120780, 1105066, 1089627, 1075309, 1062421, 1050516, 1039284, 1029018, 1020028, 1012188, 1005317, 999557, 995081, 991739, 989245, 987368, 985773, 983987, 981881, 979918, 978577, 977746]
61665I77746p88r41j032j310k007k732k944k759k828l449m214m687m893n007m871
61650I33284m237l325k752k864l424l997m385m599m649m541m263l679k617j239
61636H82713j40K47J69K62Q90K039L594N251O344O375N806N688O315O782O233
61621I38568M974L950L490L247L058L138L447L467K833J665K10j444l066m176
61607I63361m624m905n553o412o983p284p865q820r424r015p923p122p097p461
61593H62873p578p178o308n129l947l103k541j739l31J411L029M538O188P832
61579H48017R047R919J1068J2808J4764J6562J8384K0496K2672K4523K6109K7779
61567A062148K9622L1459L3241L4934L6145L6314L5352L3749L2009L0299K8657
$$ y = [977746, 976958, 976017, 974985, 973675, 971668, 968936, 965992, 963233, 960405, 956956, 952742, 948055, 943162, 938155, 933284, 929047, 925722, 922970, 920106, 916682, 912685, 908300, 903701, 899052, 894511, 890248, 886569, 883952, 882713, 882573, 882820, 882989, 883251, 884141, 886180, 889774, 895025, 901369, 907744, 913550, 919238, 925553, 932335, 938568, 943542, 947492, 950982, 954229, 957287, 960425, 963872, 967339, 970172, 971837, 972047, 970603, 967537, 963361, 958737, 953832, 948279, 941867, 934884, 927600, 919735, 910915, 901491, 892476, 884553, 877431, 870334, 862873, 855295, 848117, 841809, 836680, 832733, 829630, 827089, 825350, 825019, 826430, 829459, 833997, 840185, 848017, 857064, 866983, 878051, 890859, 905623, 922185, 940569, 961065, 983737, 1008260, 1034369, 1062148, 1091770, 1123229, 1156470, 1191404, 1227549, 1263863, 1299215, 1332964, 1364973, 1395272, 1423929]
61556A423929K7176K5809K4300K2491K0553J8828J7506J6415J4991J2559Q872
61545A633429M469K52l351o629j0032j3593j6930j9535k0968k1068k0164j8920
61533A486960j7802j6747j5378j3448j1078q740o975n911m945l154j60L578P376
61520A393576J0986J4620J8634K3428K9336L6273M3611N0732N7678O5079P3552
61509A817505Q3482R5177J08787J23982J40116J56930J74845J94309K15084K36265
61499C346482K56779K75291K89616K96631K93100K76767K46985K04900J53339
61490E639890R6279L7867j8315o9296j12614j46757j71718j88568j98346k01633
61480D666789j99203j92508j83070j71711j58726j44486j29456j13907r8098q2648
$$ y = [1423929, 1451105, 1476914, 1501214, 1523705, 1544258, 1563086, 1580592, 1597007, 1611998, 1624557, 1633429, 1637898, 1638150, 1634799, 1628170, 1618138, 1604545, 1587615, 1568080, 1547112, 1526044, 1505880, 1486960, 1469158, 1452411, 1437033, 1423585, 1412507, 1403767, 1396792, 1390881, 1385936, 1382782, 1382622, 1386200, 1393576, 1404562, 1419182, 1437816, 1461244, 1490580, 1526853, 1570464, 1621196, 1678874, 1743953, 1817505, 1900987, 1996164, 2104951, 2228933, 2369049, 2525979, 2700824, 2895133, 3110217, 3346482, 3603261, 3878552, 4168168, 4464799, 4757899, 5034666, 5281651, 5486551, 5639890, 5736169, 5774036, 5755721, 5686425, 5573811, 5427054, 5255336, 5066768, 4868422, 4666789, 4467586, 4275078, 4092008, 3920297, 3761571, 3617085, 3487629, 3373722, 3275624, 3192976]
61470C192976o8151n4459m0907k7336j4408k761P689J7375K6404L4516M1436M6953
61458C159327N0902N3292N4422N4602N3910N2244M9547M5984M2084L8762L6886
61447C691962L6678L7711L9475M1744M4381M7239N0241N3195N5486N6410N5967
61436D210489N4698N2611M8891M3043L5706K7762J9212R613p93j1116k0747k9483
61424D439886l6990m2873m7249n0512n2500n2580n0629m7315m3267l8591l3253
61413C944127k7410k1163j4615q286k937J207M462O843P810P185N518L143m37
61400C905447n580j1416j6455j9977k2092k2724k1278j7407j1432l794N524J6836
61388C775652L0284M5703O2765Q1209J00973J22128J44586J67962J91875K16203
$$ y = [3192976, 3124825, 3070366, 3029459, 3002123, 2987715, 2984954, 2992643, 3010018, 3036422, 3070938, 3112374, 3159327, 3210229, 3263521, 3317943, 3372545, 3426455, 3478699, 3528246, 3574230, 3616314, 3655076, 3691962, 3728640, 3766351, 3805826, 3847570, 3891951, 3939190, 3989431, 4042626, 4098112, 4154522, 4210489, 4265187, 4317798, 4366689, 4409732, 4445438, 4473200, 4492412, 4502025, 4501232, 4490116, 4469369, 4439886, 4402896, 4360023, 4312774, 4262262, 4209762, 4157182, 4106553, 4059238, 4015971, 3977380, 3944127, 3916717, 3895554, 3880939, 3872653, 3869716, 3870923, 3875385, 3882228, 3890038, 3897223, 3902741, 3905884, 3905447, 3899867, 3888451, 3871996, 3852019, 3829927, 3807203, 3785925, 3768518, 3757086, 3753292, 3758816, 3775652, 3805936, 3851639, 3914404, 3995613, 4096586, 4218714, 4363300, 4531262, 4723137, 4939340]
61378D939340K40788K64911K87059L05144L16713L19178L10244K88473K53722
61369G525572K07443J52694R3612L4494k1015p0441j12964j49532j81816k10528
61359G267519k34886k53826k67210k75494k78829k77278k71594k63032k52407
61350D892963k40019k26409k12398j98251j83484j67800j51676j35785j20338
61341C256803j05344r1048p7663o4970n2510m0153k8139j6803o362L188J2146
61330B789145K0790K8875L5740M1162M5712M9857N3067N4348N3616N1926N0274
61319C274512M8569M6063M2511L8460L4544L0842K7194K3959K1991K1638K2022
61308C632305K1668J9839J6830J3056Q403K746l453r632j5918k2806l0187l7270
$$ y = [4939340, 5180128, 5445039, 5732098, 6037242, 6353955, 6673133, 6983377, 7271850, 7525572, 7733015, 7885709, 7979321, 8013815, 7992800, 7922359, 7809395, 7659863, 7478047, 7267519, 7032633, 6778807, 6511597, 6236103, 5957274, 5679996, 5408402, 5145370, 4892963, 4652944, 4426535, 4214137, 4015886, 3832402, 3664602, 3512926, 3377141, 3256803, 3151459, 3060411, 2982748, 2917778, 2865268, 2825115, 2796976, 2780173, 2773811, 2776999, 2789145, 2809935, 2838810, 2874550, 2915712, 2961424, 3011281, 3064348, 3118696, 3172312, 3224238, 3274512, 3323081, 3369144, 3411655, 3450115, 3484659, 3515501, 3542695, 3566654, 3588645, 3610283, 3632305, 3653973, 3673812, 3690642, 3703698, 3712101, 3714847, 3711394, 3701762, 3685844, 3663038, 3632851, 3595581]
61296C595581m3536m9126n4117n8029o0536o2179o3719o4930o4765o2701n9331
61285B952612n5367n0684m4877l8303l1910k6135k0664j5312j0591p101m883l737
61273B643048l780n222p754j0656j3383j5735j7558j8682j9078j8654j7031j3920
61261B481595r765n472j361L175Q798J5483K2893L1091M0462N1172O3084P5997
61249B777152Q9628J03384J16450J28144J37934J45121J48499J46343J36768J18484
61239D047907R1518N7277J7939k3968o5384j02763j33034j54738j68098j74191
61229C392465j74306j69890j62472j53258j42944j31944j20668j09482r8683q8558
61219B040260p9353p1084o3495n6366m9743m3779l8426l3433k8628k4110k0074
$$ y = [3595581, 3552045, 3502919, 3448802, 3390773, 3330237, 3268058, 3204339, 3139409, 3074644, 3011943, 2952612, 2897245, 2846561, 2801684, 2763381, 2731471, 2705336, 2684672, 2669360, 2658769, 2651668, 2646785, 2643048, 2639268, 2634046, 2626292, 2615636, 2602253, 2586518, 2568960, 2550278, 2531200, 2512546, 2495515, 2481595, 2471830, 2466358, 2464997, 2468172, 2476970, 2492453, 2515346, 2546437, 2586899, 2638071, 2701155, 2777152, 2866780, 2970164, 3086614, 3214758, 3352692, 3497813, 3646312, 3792655, 3929423, 4047907, 4139425, 4196702, 4214641, 4190673, 4125289, 4022526, 3889492, 3734754, 3566656, 3392465, 3218159, 3048269, 2885797, 2732539, 2589595, 2457651, 2336983, 2227501, 2128818, 2040260, 1960907, 1889823, 1826328, 1769962, 1720219, 1676440, 1638014, 1604581, 1575953, 1551843, 1531769]
61208A531769j6501j3081r476n578j469K773O966J0672J3395J5078J6218J7249
61196A568015J8023J7994J6834J4616J1566P919M101O43k173m593p110r880j2507
61183A623448j4422j5442j5934j6404j7102j8060j9282k0685k1886k2418k2177
61172A419636k1526k0899k0567k0733k1540k2881k4440k5963k7299k8239k8665
61161A156884k8836k9075k9178k8653k7585k6586k5698k4092k1303j8046j5330
61150H82502j3460j2520j3001j4959j7111j7989j7737j7636j8023j7922j6791
61139G05353j5254j3742j1692q734n730l739k665j665m83M64R85J417K147L262
61125F49924M633O015P211Q261R178R556R054Q347Q751J0482J2125J2441J1931
$$ y = [1531769, 1515268, 1502187, 1492711, 1487133, 1485664, 1488437, 1495403, 1506075, 1519470, 1534548, 1550766, 1568015, 1586038, 1604032, 1620866, 1635482, 1647048, 1654967, 1659068, 1659711, 1657538, 1652945, 1645835, 1635955, 1623448, 1609026, 1593584, 1577650, 1561246, 1544144, 1526084, 1506802, 1486117, 1464231, 1441813, 1419636, 1398110, 1377211, 1356644, 1335911, 1314371, 1291490, 1267050, 1241087, 1213788, 1185549, 1156884, 1128048, 1098973, 1069795, 1041142, 1013557, 986971, 961273, 937181, 915878, 897832, 882502, 869042, 856522, 843521, 828562, 811451, 793462, 775725, 758089, 740066, 722144, 705353, 690099, 676357, 664665, 655931, 650201, 646462, 643797, 642132, 641649, 642113, 643098, 644515, 646662, 649924, 654557, 660572, 667783, 676044, 685222, 694778, 703832, 712179, 720930, 731412, 743537, 755978, 767909]
61112G67909J1848J2418J3068J3775J4910J5925J5611J3789J1602R818P857M975
61100I13505J538j489l782n740p714r677j1402j2595j3024j2828j2485j2318j2214
61087G99775j2003j1794j1721j1576j1022j0001q794p800p347p494p878p960p518
61074F76867o786o100n619n307m890l896k208n83l0n27r78p28l93p88j601j850
61058F34583j270n36l11p15j563k504l018k814k230j765j281k83J170K458L324
61043F23245M098M944N568N962O678Q024R556J0782J1775J2613J2867J2277J1493
61030G39882J1382J1844J2038J1610J0944J0295R432Q275P225O661O576O820P227
61017H60211P396P056O756P598R869J2550J4503J5687J6724J7884J9153K0857
$$ y = [767909, 779757, 792175, 805243, 819018, 833928, 849853, 865464, 879253, 890855, 900673, 908530, 913505, 915043, 913554, 909772, 904032, 896318, 886641, 875239, 862644, 849620, 836792, 824307, 811989, 799775, 787772, 775978, 764257, 752681, 741659, 731658, 722864, 715064, 707717, 700223, 692345, 684385, 676867, 670081, 663981, 658362, 653055, 648165, 644269, 642061, 641478, 641448, 640921, 639943, 639215, 638822, 638034, 636433, 634583, 633313, 632777, 632466, 631751, 630188, 627684, 624666, 621852, 619622, 617857, 616576, 616293, 617463, 619921, 623245, 627343, 632287, 637855, 643817, 650495, 658519, 668075, 678857, 690632, 703245, 716112, 728389, 739882, 751264, 763108, 775146, 786756, 797700, 807995, 817427, 825702, 832927, 839588, 846164, 852984, 860211, 867607, 874663, 881419, 889017, 898886, 911436, 925939, 941626, 958350, 976234, 995387, 1016244]
61005A016244K3393K6538K9742L3061L7144M2187M7490N2133N5710N8378O0746
60994A482766O3719O8045P3827Q0894Q9567J00459J13386J27071J40201J52499
60984B492434J64858J79231J98466K25359K61268L06158L60264M25057N02841
60975E115936N97309P15607Q68821J070390J336623J686571K125020K601507K978058
60966A9095842L062405K718540J979376J057472K32940k87903m34384k44224J75168
60957B7355232O49327R47886Q64886L38614m95158j377802k073052k469171k581957
60948B1158805k493711k293180k047205j796419j560139j344253j149488r76267
60940G498143q25149o95708n86519m96016m22794l65196l20802k86396k58560
$$ y = [1016244, 1039637, 1066175, 1095917, 1128978, 1166122, 1208309, 1255799, 1307932, 1363642, 1422020, 1482766, 1546485, 1614530, 1688357, 1769251, 1858818, 1959277, 2072663, 2199734, 2339935, 2492434, 2657292, 2836523, 3034989, 3260348, 3521616, 3827774, 4188038, 4613095, 5115936, 5713245, 6428852, 7297673, 8368063, 9704686, 11391257, 13516277, 16117784, 19095842, 22158247, 24876787, 26856163, 27913635, 28146575, 27858672, 27424288, 27180064, 27355232, 28004559, 28952445, 29817331, 30155945, 29660787, 28282985, 26209933, 23740762, 21158805, 18665094, 16371914, 14324709, 12528290, 10968151, 9623898, 8474410, 7498143, 6672994, 5977286, 5390767, 4894751, 4471957, 4106761, 3785959, 3499563, 3241003]
60931C241003k34609k13099j93610j76041j60000j44716j29573j14839j01609
60922A772907r0861q2679p6614p2351o9559o7346o4642o1120n7175n3028m8490
60911A029042m3665l9146l5223l1509k7701k4232k1769k0400j9586j8638j7082
60900G30091j4912j2702j1083r973q724p133n709m750l744k109J4K064L686M684
60886F59700M915M658M581M891N049M809M768N239N377M376K998K593K955K526
60872G19435P83r59j533j484j975l117m258n238o400p664q415q331p680o814n841
60857F50509m826l896l103k393j808j416j092n07O03K230M130N973P483Q670R836
60842F70393J1318J3122J4908J6188J6603J6055J4786J3255J1872J0764R859R146
$$ y = [3241003, 3006394, 2793295, 2599685, 2423644, 2263644, 2118928, 1989355, 1874516, 1772907, 1682046, 1599367, 1522753, 1450402, 1380843, 1313497, 1248855, 1187735, 1130560, 1077532, 1029042, 985377, 946231, 911008, 879499, 851798, 827566, 805797, 785397, 765811, 747173, 730091, 715179, 702477, 691394, 681421, 672697, 665564, 659855, 655105, 651361, 649252, 649266, 651330, 655016, 659700, 664615, 669273, 673854, 678745, 683794, 688603, 693371, 698610, 703987, 708363, 711361, 713954, 716909, 719435, 720218, 719259, 717726, 716242, 714267, 711150, 706892, 701654, 695254, 687590, 679175, 670844, 663164, 656350, 650509, 645683, 641787, 638684, 636291, 634483, 633067, 631975, 631468, 632071, 634301, 638431, 644404, 651887, 660557, 670393, 681711, 694833, 709741, 725929, 742532, 758587, 773373, 786628, 798500, 809264, 819123, 828269]
60830H28269Q786Q931R419R754R461Q544P435O479N568M429L120K004J346J105
60816I14650J091J040N82n24k018l241l855m242n042o371p718q578r064r802j1211
60801H45697j2900j3937j3810j3015j2448j2358j2216j1580j0620r642q465o661
60789G08045m245j771K12J526K278K745L397M727O803Q997J0435J0778J0556J0597
60775G75080J1201J1945J2314J2317J2376J2690J2984J2840J2073J0783R228P763
60763I13594O650N840N111M503M348M731N141M941M101L146K452J941J533J500
60749I69532K134L206M079M365M238M071L906L398K234N13j232k378k710k696
60735I92660l185m637o640q244q836q573q032p624p404p227o920o392n712n040
$$ y = [828269, 837055, 845986, 855405, 865159, 874620, 883164, 890599, 897078, 902646, 907075, 910195, 912199, 913545, 914650, 915741, 916781, 917363, 916839, 914821, 911580, 907725, 903483, 898441, 892070, 884352, 875774, 866710, 856908, 845697, 832797, 818860, 805050, 792035, 779587, 767229, 755013, 743433, 732813, 723171, 714706, 708045, 703800, 702029, 702241, 703767, 706045, 708790, 712187, 716914, 723717, 732714, 743149, 753927, 764483, 775080, 786281, 798226, 810540, 822857, 835233, 847923, 860907, 873747, 885820, 896603, 905831, 913594, 920244, 926084, 931195, 935698, 940046, 944777, 949918, 954859, 958960, 962106, 964558, 966499, 968032, 969532, 971666, 974872, 978951, 983316, 987554, 991625, 995531, 998929, 1001163, 1001676, 1000444, 998066, 995356, 992660, 989475, 984838, 978198, 969954, 961118, 952545, 944513, 936889, 929485, 922258, 915338, 908946, 903234, 898194]
60721H98194m412l686k737j658o62J05N82P02L95l53j506k929m367n638o820q038
60705H57172q993r074q100o608n198l930k658j540o83L25J888L556M430M396M243
60690H29226M386M168K790L72k304m719o798q458r525j0029j0320j0805j1654
60677G66330j2608j3102j2777j1926j1109j0375r210p427n558m149l085j960o85
60664F62359O10J868K868L056K235J040K54j93q61j656j840j194m31j50j8N82
60648F68529J615K532L043L297L366L012K082Q97M2j79J5K58N11J044J908K777
60632F94749L420M048M893N748O379P223R054J1858J4576J6214J6829J7161J7592
60619H29744J7942J8045J8072J8162J8010J7034J4973J2198R354O792M490K542
$$ y = [898194, 893782, 890096, 887359, 885701, 885039, 885144, 885726, 886428, 886823, 886470, 884964, 882035, 877668, 872030, 865210, 857172, 848179, 839105, 831005, 824397, 819199, 815269, 812611, 811071, 810388, 810713, 812601, 816157, 820587, 824983, 829226, 833612, 837780, 840570, 840942, 838638, 833919, 827121, 818663, 809138, 799109, 788789, 777984, 766330, 753722, 740620, 727843, 715917, 704808, 694433, 685223, 677796, 672238, 668089, 665004, 663044, 662359, 662969, 664837, 667705, 670761, 672996, 674036, 674290, 674097, 673236, 671580, 669740, 668546, 668115, 667965, 667947, 668529, 670144, 672676, 675719, 679016, 682382, 685394, 687476, 688373, 688415, 688236, 688251, 688509, 689020, 690064, 691972, 694749, 698169, 702217, 707110, 712858, 719237, 726460, 735514, 747372, 761948, 778162, 794991, 812152, 829744, 847686, 865731, 883803, 901965, 919975, 937009, 951982, 964180, 973534, 980326, 984816, 987358]
60607I87358J347R68O48n15k388l907m526m986o346q656j1059j2890j4134j4889
60593I06025j5018j4438j3391j2165j0782r070o999m852l140k263k131k128j733
60580H07915j179j273k391l916m841m785m165l461k607j265N03K016K633K466
60566G85650K393L168M627N849O189N872N448M935L873K232P02j51o36j444k578
60551H26129l283k985j880m74J004K555M129N713P457R511J1859J4528J7722K1582
60537I13567K6048L1145L7028M3248M8233N0050M7732M1583L2367K0733P538n819
60525A293453j7715k6871l2639l5096l4940l2981k9552k4687j8793j2794p395
60514A019990k676J512N129Q094J0466J2134J2751J2351J1665J1463J1793J2410
$$ y = [987358, 988705, 989673, 990321, 989806, 987418, 983511, 978985, 973999, 967653, 958997, 947938, 935048, 920914, 906025, 891007, 876569, 863178, 851013, 840231, 831161, 824162, 819310, 816170, 813907, 811776, 809648, 807915, 806736, 805463, 803072, 799156, 794315, 789530, 785365, 781904, 779297, 778032, 778535, 780551, 783184, 785650, 788043, 791211, 795838, 801687, 807876, 813748, 819196, 824131, 828004, 830236, 830938, 830787, 830151, 828707, 826129, 822846, 819861, 817981, 817507, 818511, 821066, 825195, 830908, 838365, 847876, 859735, 874263, 891985, 913567, 939615, 970760, 1007788, 1051036, 1099269, 1149319, 1197051, 1238634, 1271001, 1291734, 1299272, 1293453, 1275738, 1248867, 1216228, 1181132, 1146192, 1113211, 1083659, 1058972, 1040179, 1027385, 1019990, 1017314, 1018826, 1023955, 1032049, 1042515, 1054649, 1067400, 1079751, 1091416, 1102879, 1114672, 1127082]
60502A127082J3746J6751K1738K7902L4286M0921M8726N8467P0110Q3208R7579
60491A640516J13375J30477J48209J66010J84378K04820K28956K57998K92857
60482C367596L33522L77078M16276M40776M40644M09375L45041K50241J31951
60473F512500J103j28877k44576l35402l95748m25714m30067m15951l90390l58685
60463C388193l24226k89367k56109k25798j98562j73772j51224j31385j14377
60454A523373r9480q6115p4640o5487n8065n1352m5263m0470l6994l3916l0624
60443I00967k7480k4985k3041k1308j9760j8530j7661j7190j6965j6313j4609
60432F83125j2322j0727j0200r622p976n793m308l804l535k924k035j157n94o66
$$ y = [1127082, 1140828, 1157579, 1179317, 1207219, 1241505, 1282426, 1331152, 1389619, 1459729, 1542937, 1640516, 1753891, 1884368, 2032577, 2198587, 2382965, 2587785, 2816741, 3074739, 3367596, 3701118, 4078196, 4494472, 4935248, 5375892, 5785267, 6130308, 6380549, 6512500, 6513603, 6384726, 6140150, 5804748, 5409000, 4983286, 4553219, 4137268, 3746878, 3388193, 3063967, 2774600, 2518491, 2292693, 2094131, 1920359, 1769135, 1637750, 1523373, 1423893, 1337778, 1263138, 1197651, 1139586, 1088234, 1042971, 1002501, 965507, 931591, 900967, 873487, 848502, 825461, 804153, 784393, 765863, 748202, 731012, 714047, 697734, 683125, 670803, 660076, 649876, 640254, 632278, 626485, 622177, 618373, 614838, 611914, 609879, 608722, 608128, 607462]
60418F07462j225j383l33J607L302L988L735K999K365K429L177L672L063J879
60404F36737J507K396L544L901L497L002K894L363M446N834O916P315P094O442
60390F98888N603N001M898M794L946K508J407R26L61o29j318j198j089j971l388
60375G18739m020l481k556j835j116j88N95Q32N79K27J54N60J298J931K263K625
60359G16607L277L810L734L396L580M363N120N600O158O867P309P534Q337J0015
60345G95707J1629J2149J1787J1478J1484J1264J0521R553Q547P292N783M582
60333I11776M235M684N501O456P642R275J1657J5066J9303K3322K5724K5767K3718
60320A094126K0139J5105Q453N46p585j4876k0661k4489k6053k5529k3711k1429
$$ y = [607462, 606237, 604854, 604521, 606128, 609430, 613418, 617153, 620152, 622517, 624946, 628123, 631795, 634858, 636737, 638244, 640640, 644184, 648085, 651582, 654584, 657478, 660841, 665287, 671121, 678037, 685352, 692446, 698888, 704491, 709492, 714390, 719184, 723130, 725638, 727045, 727971, 728332, 727703, 726385, 725187, 724098, 722127, 718739, 714719, 711238, 708682, 706847, 705731, 705543, 706138, 706970, 707549, 707776, 707930, 708490, 709788, 711719, 713982, 716607, 719884, 723694, 727428, 730824, 734404, 738767, 743887, 749487, 755645, 762512, 769821, 777355, 785692, 795707, 807336, 819485, 831272, 842750, 854234, 865498, 876019, 885572, 894119, 901411, 907194, 911776, 916011, 920695, 926196, 932652, 940294, 949569, 961226, 976292, 995595, 1018917, 1044641, 1070408, 1094126, 1114265, 1129370, 1137823, 1138369, 1130784, 1115908, 1095247, 1070758, 1044705, 1019176, 995465, 974036]
60308I74036j9016j6504j4036j1741r589p714o626o541o730o130m577k867j557
60295H60408l19J305L092M469N220N556N630N339M480L048J475M66L23M60N6r13
60279I00095j705j961k107k444k472j603m9J529K916M371O009P648R096J0319
60265I29642J1418J2736J4674J7092J9275K0852K2424K4793K7888L1020L3941
60254A165755L7041M0698M5030N0129N5913O1779O7214P2708P9380Q7555R6440
60243A859642J05340J14299J23188J30927J36292J38991J39273J36890J31225
60234C016067J22355J11279R8943Q5518P0805N4976L8645K2357O305r337k3927
60223C593986l6384m5918n2646n7177n9610n9315n5839m9702m1905l2940k2651
$$ y = [974036, 955020, 938516, 924480, 912739, 903150, 895436, 888810, 882269, 875539, 869409, 864832, 861965, 860408, 860089, 861394, 864486, 868955, 874175, 879731, 885361, 890700, 895180, 898228, 899703, 900169, 900492, 900952, 901008, 900095, 898390, 896429, 894322, 891878, 889406, 887803, 887754, 889283, 892199, 896570, 902579, 910227, 919323, 929642, 941060, 953796, 968470, 985562, 1004837, 1025689, 1048113, 1072906, 1100794, 1131814, 1165755, 1202796, 1243494, 1288524, 1338653, 1394566, 1456345, 1523559, 1596267, 1675647, 1763202, 1859642, 1964982, 2079281, 2202469, 2333396, 2469688, 2608679, 2747952, 2884842, 3016067, 3138422, 3249701, 3348644, 3434162, 3504967, 3559943, 3598588, 3620945, 3627250, 3617913, 3593986, 3557602, 3511684, 3459038, 3401861, 3342251, 3282936, 3227097, 3177395, 3135490, 3102550, 3079899]
60212C079899j0890K196J6337L1208M6235O0806P4821Q8618J02184J14758J25462
60201C731634J33934J39938J42665J41036J34729J24410J10870R4404P5304N4467
60191D883391L2991J1318j0770l3181n4911p4447r0605j02919j11454j16326j17404
60180D215683j14437j07589r7686q5680p1964n6519l9590k1856l917J3957L1523
60169C661925M8455O4568P9547R2244J00900J04466J03254R8038Q9103P6847O2535
60158D581882M7475L1758J4843k703j9034l2702m3440n1010n4319n2496m6251
60147D374003l7321k6727j4185Q84J8299L7155N6590P6397R6982J18767J41734
60136D842578J65716J90958K17968K46705K76315L05817L34578L61946L86826
$$ y = [3079899, 3069009, 3071205, 3087542, 3118750, 3164985, 3225791, 3300612, 3389230, 3491414, 3606172, 3731634, 3865568, 4005506, 4148171, 4289207, 4423936, 4548346, 4659216, 4753620, 4828924, 4883391, 4916382, 4927700, 4916930, 4883749, 4828838, 4754391, 4663786, 4560867, 4449413, 4333087, 4215683, 4101246, 3993657, 3895971, 3810291, 3738327, 3681808, 3642218, 3620362, 3616445, 3630402, 3661925, 3710380, 3774948, 3854495, 3946739, 4047639, 4152105, 4255359, 4353397, 4442500, 4519347, 4581882, 4629357, 4661115, 4675958, 4673255, 4654221, 4621519, 4578079, 4527069, 4472750, 4420254, 4374003, 4336682, 4309955, 4295770, 4296654, 4314953, 4352108, 4408698, 4485095, 4582077, 4700844, 4842578, 5008294, 5199252, 5417220, 5663925, 5940240, 6246057, 6580635, 6942581, 7329407]
60127G329407M08011M24492M35031M37870M31552M16020L92362L61549L23830
60118A0960124K79446K29404J75280J18393N9370j558o3833j26046j85995k41251
60108A1203334k89611l29232l58726l77432l85495l83500l72162l52456l25807
60099H028913k93896k58318k20504j81595j42213j02513o2821k3950J3290M8516
60089F804909Q1161J09666J31924J46516J53067J51430J41407J23553R9705P2184
60079H015522M2693J2317j7912m7003p4415r9932j23155j43627j61481j77303
60069G225704j90988k01309k07132k08796k07650k04298j98078j88455j76106
60060E442892j62073j46431j28639j08954q8540o8086m7141k5152k504J9946M1853
$$ y = [7329407, 7737418, 8161910, 8596941, 9034811, 9466363, 9882383, 10274745, 10636294, 10960124, 11239570, 11468974, 11644254, 11762647, 11822017, 11820459, 11756626, 11630580, 11444585, 11203334, 10913723, 10584491, 10225765, 9848333, 9462838, 9079338, 8707176, 8354720, 8028913, 7735017, 7476699, 7256195, 7074600, 6932387, 6829874, 6767053, 6743103, 6756393, 6804909, 6886070, 6995736, 7127660, 7274176, 7427243, 7578673, 7720080, 7843633, 7943338, 8015522, 8058215, 8070532, 8052620, 8005617, 7931202, 7831270, 7708115, 7564488, 7403007, 7225704, 7034716, 6833407, 6626275, 6417479, 6209829, 6005531, 5807453, 5618998, 5442892, 5280819, 5134388, 5005749, 4896795, 4808255, 4740169, 4693028, 4667876, 4665372, 4685318, 4727171]
60049D727171O3342Q4273J04086J22060J37294J48489J54412J54532J48964J37942
60039E982565J21772J01238P7529N1598K3837n461l5547o5114r2625j16862j37301
60028E905629j53821j65917j72534j73176j68875j61446j51885j40018j25697
60019D492260j09616r2693p5261n7294l9022k0762k327J6966L7616N9453Q1818
60008D291138J04145J26325J48413J69920J89490K05457K16500K21543K19466
59999E892397K09694J93071J71436J46053J17156Q5190N1634J7926j5675m9277
59989F819605q1814j11265j36284j56485j71207j79211j80151j75485j67016j55217
59979E305470j39765j21234j01121q0275n8467l5780j3262Q329K9486N0615P0490
$$ y = [4727171, 4790513, 4874786, 4978872, 5100932, 5238226, 5386715, 5541127, 5695659, 5844623, 5982565, 6104337, 6205575, 6283104, 6334702, 6358539, 6353078, 6317531, 6252417, 6159792, 6042930, 5905629, 5751808, 5585891, 5413357, 5240181, 5071306, 4909860, 4757975, 4617957, 4492260, 4382644, 4289951, 4214690, 4157396, 4118374, 4097612, 4095285, 4112251, 4149867, 4209320, 4291138, 4395283, 4521608, 4670021, 4839941, 5029431, 5234888, 5451388, 5672931, 5892397, 6102091, 6295162, 6466598, 6612651, 6729807, 6814997, 6866631, 6884557, 6868882, 6819605, 6737791, 6626526, 6490242, 6333757, 6162550, 5983339, 5803188, 5627703, 5460687, 5305470, 5165705, 5044471, 4943350, 4863075, 4804608, 4768828, 4755566, 4763895, 4793381, 4843996, 4914486]
59968D914486Q7288J00845J12493J22506J29158J30941J28435J23033J14841J03297
59958F067323Q9227P4692O0654M6248L0751J5187J409r470j7064k0829k0048j4472
59946F303608m338J0051K8492N0933P7577J08588J43414J80881K20340K62109
59936G381655L06256L51501L95898M37916M75851N06467N25438N29237N15744
59927A1425963M83095M29273L53797K59443J51885L7959p5500j82053k76068l53398
59917A2254396m11801m50997m72461m78737m72460m55883m31142m00435l65563
59908H314917l27591k87292k45840k04540j63981j23874q3858m4164n303L2598
59898F861072O9784J06159J40750J72050J98740K19860K34215K39899K34719K17104
$$ y = [4914486, 5001774, 5102619, 5215112, 5337618, 5466776, 5597717, 5726152, 5849185, 5964026, 6067323, 6156550, 6231242, 6291896, 6338144, 6368895, 6384082, 6385491, 6376021, 6358957, 6338128, 6318080, 6303608, 6299270, 6309321, 6337813, 6388746, 6466323, 6574911, 6718325, 6899206, 7119546, 7381655, 7687911, 8039412, 8435310, 8873226, 9349077, 9855544, 10380982, 10910219, 11425963, 11909058, 12338331, 12692128, 12951571, 13103456, 13141415, 13065915, 12883862, 12607794, 12254396, 11842595, 11391598, 10919137, 10440400, 9967940, 9512057, 9080915, 8680480, 8314917, 7987326, 7700034, 7454194, 7249654, 7085673, 6961799, 6877941, 6833777, 6828474, 6861072, 6930856, 7037015, 7177765, 7349815, 7548555, 7768415, 8002630, 8242529, 8477248, 8694352]
59888H694352J86626J43922R0635K9480l5990j02021j65092k21980k69904l07049
59878H042979l32879l47929l53310l50433l40802l25745l06415k84064k60053
59869E141349k35446k10791j86538j63363j41790j21834j03409q7035p3693o3952
59859C753498n7608n4121n2991n3632n5281n7202n8677n8705n6199n0809m3349
59848C154924l5110k6897j8916j1377m857k39J498l46n658j3442k2530l2228m1933
59835B942889n0329n5706n7239n5584n2026m7391m1976l6046k9933k3737j7223
59824B475699j0042k013O638J5272K3350L1117L9374M8262N6641O3099O7365P0301
59812B885063P2723P4783P6296P6950P6009P2401O5408N5074M1963K7028J1924
$$ y = [8694352, 8880978, 9024900, 9115535, 9145015, 9109025, 9007004, 8841912, 8619932, 8350028, 8042979, 7710100, 7362171, 7008861, 6658428, 6317626, 5991881, 5685466, 5401402, 5141349, 4905903, 4695112, 4508574, 4345211, 4203421, 4081587, 3978178, 3891143, 3817450, 3753498, 3695890, 3641769, 3588778, 3535146, 3479865, 3422663, 3363986, 3305281, 3249082, 3198273, 3154924, 3119814, 3092917, 3074001, 3062624, 3057767, 3057528, 3059026, 3058680, 3053022, 3039580, 3017050, 2984822, 2942889, 2892560, 2836854, 2779615, 2724031, 2672005, 2624614, 2582638, 2546592, 2516659, 2492922, 2475699, 2465657, 2463644, 2470282, 2485554, 2508904, 2540021, 2579395, 2627657, 2684298, 2747397, 2814762, 2885063, 2957786, 3032569, 3108865, 3185815, 3261824, 3334225, 3399633, 3454707, 3496670, 3523698, 3535622]
59801C535622j251j1026j7266k0537k1184j9214j4737q016P21J1143K2789L5551
59789C492595M9980O6594Q5165J05251J27305J52515J81491K13930K49816K90100
59779E014742L35434L84365M33009M75603N04218N08385M77285M04966K94915
59770H832922J60055J8251j13231k21416k99281l46077l66221l66538l53254l30720
59760F614490l02044k69976k36838k04113j72604j42957j15618r0515o7222m5530
59750D967073k5536p090J0500K8007M5680O3296Q0693R8047J15683J33831J52705
59739E662889J72685J94304K17952K43664K71310L00896L32717L67167M04503
59730H168087M44698M87353N31726N76880O21601O63873P00349P26880P39927
$$ y = [3535622, 3534371, 3523345, 3506079, 3485542, 3464358, 3445144, 3430407, 3422391, 3423112, 3434255, 3457044, 3492595, 3542575, 3609169, 3694334, 3799585, 3926890, 4079405, 4260896, 4474826, 4724642, 5014742, 5350176, 5734541, 6167550, 6643153, 7147371, 7655756, 8133041, 8538007, 8832922, 8992977, 9011228, 8897997, 8676581, 8377300, 8031223, 7665002, 7298464, 6945210, 6614490, 6312446, 6042470, 5805632, 5601519, 5428915, 5285958, 5170340, 5079825, 5012603, 4967073, 4941537, 4934447, 4944947, 4972954, 5018634, 5081930, 5162623, 5260670, 5376353, 5510184, 5662889, 5835574, 6029878, 6247830, 6491494, 6762804, 7063700, 7396417, 7763584, 8168087, 8612785, 9100138, 9631864, 10208744, 10830345, 11494218, 12194567, 12921447, 13661374]
59721A3661374P37559P19336O86053O40281N86968N32750M84265M46861M24331
59712A8919778M18841M30658M58091M98101N47000O00619O54033P01326P35858
59703B3964305P51181P42311P06507O43191N53719M41818L14021J78973M5684
59694B8341710p7809j84708k69552l28865l61706l69251l53749l17814k64286
59685B5813970j96159j16183k6418P1835J77715K90460M09449N34209O63762P95593
59675B8418233R25354J047475J155216J239479J288149J287852J227113J098659
59667C7687530R00616O38198L25461j5465l58501o78549r54909j173203j326505
59658C5044673j414919j443471j420015j354473j258575j145074j027204r18996
$$ y = [13661374, 14398933, 15118269, 15804322, 16444603, 17031571, 17564321, 18048586, 18495447, 18919778, 19338619, 19769277, 20227368, 20725469, 21272469, 21873088, 22527121, 23228447, 23964305, 24715486, 25457797, 26164304, 26807495, 27361214, 27803032, 28117053, 28296026, 28341710, 28263901, 28079193, 27809641, 27480776, 27119070, 26749819, 26396070, 26078256, 25813970, 25617811, 25501628, 25475210, 25547045, 25724760, 26015220, 26424669, 26958878, 27622640, 28418233, 29343587, 30391062, 31546278, 32785757, 34073906, 35361758, 36588871, 37687530, 38588146, 39226344, 39551805, 39536340, 39177839, 38499290, 37544381, 36371178, 35044673, 33629754, 32186283, 30766268, 29411795, 28153220, 27008146, 25980942, 25061946]
59650B5061946q34886p86962p81018q13982q74021r43445j004094j043244j056338
59641A6923956j044869j012581r63861r04109q39064p72998p08056o45377n85890
59632I447151n30098m78086m30135l86671l47555l12168k80233k51699k25701
59623F204805k00738j76300j53385j32940j14663r7882q2777p0019n9854n2293
59613E063954m7668m6278m7839n1885n8244o6528p5652q4583r3140j01294j08041
59602D282802j11859j12185j09773j05680j00547r4698q8196q0807p2456o3736
59592C342865n5396m7405l9138l0461k1931j3928o262J136P736J2930J6675J9425
59580C186246K1687K3672K5130K5512K4671K3300K2274K1757K1477K1809K3819
$$ y = [25061946, 24227060, 23440098, 22659080, 21845098, 20971077, 20027632, 19023538, 17980294, 16923956, 15879087, 14866506, 13902645, 12998536, 12159472, 11386474, 10678418, 10033041, 9447151, 8917053, 8438967, 8008832, 7622161, 7274606, 6962438, 6682205, 6430506, 6204805, 6004067, 5827767, 5674382, 5541442, 5426779, 5328897, 5246120, 5176101, 5116247, 5063954, 5016286, 4970008, 4922169, 4870284, 4812040, 4745512, 4669860, 4585277, 4492137, 4390843, 4282802, 4170943, 4058758, 3948985, 3843305, 3742758, 3648060, 3559864, 3479057, 3406601, 3342865, 3287469, 3240064, 3200926, 3170465, 3148534, 3134606, 3128344, 3129480, 3137216, 3150146, 3166821, 3186246, 3207933, 3231605, 3256735, 3282247, 3306918, 3330218, 3352492, 3374249, 3395726, 3417535, 3441354]
59569C441354K8037L3904M0681M8322N7067O6690P6643Q6643R6814J07526J19356
59558D203037J32872J48161J64809J82509K01386K21511K42429K63403K83748
59549F043865L02677L19232L32737L42934L49321L50859L46902L38122L25821
59540I052470L10638K92713K73058K53695K35780K18118J98273J75263J50942
59531A1160950J28813J11875J01629R8568J02728J13293J27964J43236J55475
59522A2244531J61582J58848J44852J17978P8011K6167l5211j02976j73652k44006
59512A2376124l11069l71657m22434m61025m86917n00984n04390m98320m84399
59503H334929m64553m40262m12417l81952l50166l18207k86654k55960k26981
$$ y = [3441354, 3469391, 3503295, 3543976, 3592298, 3649365, 3716055, 3792698, 3879341, 3976155, 4083681, 4203037, 4335909, 4484070, 4648879, 4831388, 5032774, 5254285, 5496714, 5760117, 6043865, 6346542, 6665774, 6998511, 7341445, 7690766, 8041625, 8388527, 8726649, 9052470, 9363108, 9655821, 9928879, 10182574, 10418354, 10636472, 10834745, 11010008, 11160950, 11289763, 11401638, 11503267, 11601835, 11704563, 11817856, 11945820, 12089056, 12244531, 12406113, 12564961, 12709813, 12827791, 12905802, 12931969, 12896758, 12793782, 12620130, 12376124, 12065055, 11693398, 11270964, 10809939, 10323022, 9822038, 9317648, 8819328, 8334929, 7870376, 7430114, 7017697, 6635745, 6285579, 5967372, 5680718, 5424758, 5197777]
59494E197777k00603j76864j54841j33606j13111r3943p6315n9648m3222k6941
59484D118683j1043M653K0710L7222N3662O9892Q6780J05319J25392J46050J66820
59473D924140J88080K10134K32499K54244K74497K92249L06029L14074L14664
59464G310610L06057K86530K55093K12306J60151J01038L7149k9199r4900j56227
59454H388608k09900k53976k87830l11585l25843l31786l31013l24975l14592
59445E697108l00490k83462k64572k44956k25594k07118j89683j73088j57085
59436C651060j41542j26479j12190r9296q8179p8323o8708n9043n0001m2024l4558
59425B750717k7002j9767j3551q046k376L370Q143J1613J4745J8345K1991K5137
$$ y = [5197777, 4997174, 4820310, 4665469, 4531863, 4418752, 4324809, 4248494, 4188846, 4145624, 4118683, 4107640, 4112293, 4133003, 4170225, 4223887, 4293779, 4380559, 4485878, 4611270, 4757320, 4924140, 5112220, 5322354, 5554853, 5809097, 6083594, 6375843, 6681872, 6995946, 7310610, 7616667, 7903197, 8158290, 8370596, 8530747, 8631785, 8668934, 8639735, 8544835, 8388608, 8178708, 7924732, 7636902, 7325317, 6999474, 6667688, 6336675, 6011700, 5697108, 5396618, 5113156, 4848584, 4603628, 4378034, 4170916, 3981233, 3808145, 3651060, 3509518, 3383039, 3270849, 3171553, 3083374, 3005051, 2936343, 2877300, 2827299, 2785275, 2750717, 2723715, 2703948, 2690397, 2682351, 2679975, 2683345, 2691488, 2703101, 2717846, 2736191, 2758182, 2783319]
59413B783319K8541L3608M0329M6528M9289M7048M0691L3221K8272K8278L3413
59402C192537M2131N2918O5663Q1324J00007J19373J35533J46229J53232J61242
59392D250189J74388J94059K19642K50268K85344L24275L66554M11988M60243
59383F936950N10021N58935O03951O41755O68939O82532O80622O62749O30020
59374A2576474N85153N32048M74753M16616L60240L07688K60137K17426J78318
59365A5908853J41145J03997O4538K0414k9781q5915j46511k09038k69915l24708
59355A5173079l69009l99528m14749m15145m03201l83192l60261l38923l22054
59346A1767017l11219l07651l12271l24480l41496l59576l75886l88865l97268
$$ y = [2783319, 2811860, 2845468, 2885797, 2932325, 2981614, 3028662, 3069353, 3102574, 3130846, 3159124, 3192537, 3234668, 3287586, 3353249, 3434573, 3534580, 3653953, 3789486, 3935715, 4088947, 4250189, 4424577, 4618636, 4838278, 5088546, 5373890, 5698165, 6064719, 6476707, 6936950, 7446971, 8005906, 8609857, 9251612, 9920551, 10603083, 11283705, 11946454, 12576474, 13161627, 13693675, 14168428, 14585044, 14945284, 15252972, 15513109, 15730535, 15908853, 16049998, 16153995, 16218533, 16238947, 16209166, 16123251, 15976740, 15767702, 15497787, 15173079, 14804070, 14404542, 13989793, 13574648, 13171447, 12788255, 12427994, 12089071, 11767017, 11455798, 11148147, 10835876, 10511396, 10169900, 9810324, 9434438, 9045573, 8648305]
59337H648305l99878l96306l87242l73540l55699l34539l11583k88100k64319
59328E537099k40217k16552j94343j73617j53613j34068j15622r8871q3766o9971
59318D056459n7291m5572l4699k4683j5397o229L428J3374K2946L2139M1664N1754
59306D037893O1661P0776P9400Q7949R5909J02239J06499J08875J09406J07784
59296D968391J03853R7730Q9479P9247O7780N6268M5548L5871K7610K1684J8902
59285E612363J9256K2246K7740L6028M7145O0498P5228R0456J05127J18019J28237
59274F342343J35416J39109J38303J31959J19991J03244Q2443N7585K8506m193
59264G274706l8777p2617j02642j26065j41124j47402j45641j37493j25137j10389
$$ y = [8648305, 8248427, 7852121, 7464879, 7091339, 6735640, 6401101, 6089518, 5801418, 5537099, 5296882, 5080330, 4885987, 4712370, 4558757, 4424689, 4309067, 4210196, 4126430, 4056459, 3999168, 3953596, 3918897, 3894214, 3878817, 3872588, 3876016, 3889390, 3912336, 3944475, 3986139, 4037893, 4099554, 4170330, 4249730, 4337679, 4433588, 4535827, 4642326, 4751201, 4860607, 4968391, 5072244, 5169974, 5259453, 5338700, 5406480, 5462748, 5508296, 5544167, 5571777, 5593461, 5612363, 5631619, 5653865, 5681605, 5717633, 5764778, 5825276, 5900504, 5990960, 6096087, 6214106, 6342343, 6477759, 6616868, 6755171, 6887130, 7007121, 7110365, 7192808, 7250393, 7278899, 7274706, 7235929, 7163312, 7060670, 6934605, 6793481, 6646079, 6500438, 6362945, 6237808, 6127419]
59254F127419r3875p5458n5641l6093j8472l247J0006K1557L1197L8593M3530
59243E989516M6152M7380M8665N0850N3694N7094O2218P0753Q3447J00361J22061
59232F732191J49283J81539K17229K55336K95618L36597L74466M04792M24387
59223I371438M30839M21248L92903L45093K79475J98742J05866M544j00438k03734
59213A1245976l00035l84346m52455n01820n32131n45066n43444n30283n08140
59204F948256m79117m45379m09403l73413l38809l06214k75918k48014k22347
59195C849642j98731j77135j57526j39814j24196j11176j00741r1846q3345p5287
59185B589845o8613o3581n9182n4380m9246m4444m0091l5720l1113k6610k2564
$$ y = [6127419, 6033544, 5958086, 5902445, 5866352, 5847880, 5844633, 5854639, 5876196, 5907393, 5945986, 5989516, 6035668, 6083048, 6131713, 6182563, 6236257, 6293351, 6355569, 6426322, 6509769, 6610130, 6732191, 6881474, 7063013, 7280242, 7535578, 7831196, 8167793, 8542259, 8947051, 9371438, 9802277, 10223525, 10616428, 10961521, 11240996, 11439738, 11545604, 11550148, 11449710, 11245976, 10945941, 10561595, 10109140, 9607320, 9075189, 8530123, 7986679, 7456396, 6948256, 6469139, 6023760, 5614357, 5240944, 4902135, 4595921, 4320003, 4071989, 3849642, 3650911, 3473776, 3316250, 3176436, 3052240, 2941064, 2840323, 2748477, 2665132, 2589845, 2521232, 2457651, 2398469, 2344089, 2294843, 2250399, 2210308, 2174588, 2143475, 2116865, 2094301]
59174B094301j8860j5090j0963o505j974K375O555J0817J5233J9474K3264K6920
59162B145547L1031L5568L9813M3379M6854N0954N5480N9748O3850O8697P4636
59151B715557Q0847Q6415R1408R6355J01260J05700J09520J12725J14868J15179
59141C729834J13204J08809J01807R2297Q1164O9390N6920M3075K8186J3939J839
59130D440464p839j5189j9764k1134j9622j5722r311j65J1230K4187L8868N5908
59118D461911P5131R5427J15950J36811J58425J80712K02995K24319K43622K59751
59108F155054K71294K76259K72247K57285K30479J91939J42810Q6084K6796k9682
59098G880565p9794j21905j54776j77206j89311j93111j91189j85364j77080j68200
$$ y = [2094301, 2075441, 2060351, 2049388, 2042883, 2040909, 2043284, 2049839, 2060656, 2075889, 2095363, 2118627, 2145547, 2176578, 2212146, 2251959, 2295338, 2342192, 2393146, 2448626, 2508374, 2572224, 2640921, 2715557, 2796404, 2882819, 2974227, 3070582, 3171842, 3277542, 3387062, 3499787, 3614655, 3729834, 3843038, 3951847, 4053654, 4145951, 4227115, 4296505, 4353425, 4396500, 4424686, 4438625, 4440464, 4432625, 4417436, 4397672, 4376538, 4356916, 4341194, 4331883, 4331718, 4342948, 4367135, 4406003, 4461911, 4537042, 4632469, 4748419, 4885230, 5043655, 5224367, 5427362, 5651681, 5895303, 6155054, 6426348, 6702607, 6974854, 7232139, 7462618, 7654557, 7797367, 7883451, 7910247, 7880565, 7800771, 7678866, 7524090, 7346884, 7157573, 6964462, 6773273, 6587909, 6410829, 6242629]
59088F242629j60568j55009j51493j50034j50824j53557j57266j61046j64524
59079D838308j67568j69918j71379j72018j71843j70311j66612j60586j53141
59070C334932j45481j38048j30522j22686j14799j06954r8709q9869q1201p3804
59060B232859o7800o2319n6689n1076m5853m1038l6717l3521l2114l2389l3563
59049A739780l4960l6491l8338m0392m1974m2168m0526l7532l4182l1047k7976
59038A334194k4719k1493j8657j6172j3736j1262q895o585m014j040J986M477
59026A214084O050O703O707O414O082N704M990L675J984O91M34R51J281R46O04
59011A267300J209K714M172N046N797O971Q286R056R157R050Q977Q709Q039P132
$$ y = [6242629, 6082061, 5927052, 5775559, 5625525, 5474701, 5321144, 5163878, 5002832, 4838308, 4670740, 4500822, 4329443, 4157425, 3985582, 3815271, 3648659, 3488073, 3334932, 3189451, 3051403, 2920881, 2798195, 2683396, 2576442, 2477733, 2387864, 2306663, 2232859, 2165059, 2102740, 2046051, 1994975, 1949122, 1908084, 1871367, 1837846, 1805732, 1773343, 1739780, 1704820, 1668329, 1629991, 1589599, 1547625, 1505457, 1464931, 1427399, 1393217, 1362170, 1334194, 1309475, 1287982, 1269325, 1253153, 1239417, 1228155, 1219260, 1212675, 1208661, 1207621, 1209607, 1214084, 1220134, 1226837, 1233544, 1239958, 1246040, 1251744, 1256734, 1260409, 1262393, 1263084, 1263518, 1264469, 1265750, 1266696, 1267300, 1268509, 1271223, 1275395, 1280441, 1286238, 1293209, 1301495, 1310551, 1319708, 1328758, 1337735, 1346444, 1354483, 1361615]
58997A361615O276N624N293N411N938O640P425Q449R752J0972J1689J1941J2129
58984A469154J2500J3011J3655J4509J5429J6056J6364J6750J7364J7776J7772
58973A640340J8100J9720K2499K5421K8059L0955L4289L7143L8714L9519M0567
58962A975326M1867M2613M2514M2048M1496M0690L9706L9014L8761L8829L9701
58951B422565M2436M7298N3159N8768O4064O9726P6072Q3007R0553R8747J07354
58940C213749J16351J26327J37655J49618J61356J73525J87895K05068K23767
58931D695311K42944K63638K87724L15419L45294L76687M10890M49490M92408
58922G879805N38282N86259O36505O89076P42997P96418Q46901Q91177R25086
$$ y = [1361615, 1367891, 1373515, 1378808, 1384219, 1390157, 1396797, 1404222, 1412671, 1422423, 1433395, 1445084, 1457025, 1469154, 1481654, 1494665, 1508320, 1522829, 1538258, 1554314, 1570678, 1587428, 1604792, 1622568, 1640340, 1658440, 1678160, 1700659, 1726080, 1754139, 1785094, 1819383, 1856526, 1895240, 1934759, 1975326, 2017193, 2059806, 2102320, 2144368, 2185864, 2226554, 2266260, 2305274, 2344035, 2382864, 2422565, 2465001, 2512299, 2565458, 2624226, 2688290, 2758016, 2834088, 2917095, 3007648, 3106395, 3213749, 3330100, 3456427, 3594082, 3743700, 3905056, 4078581, 4266476, 4471544, 4695311, 4938255, 5201893, 5489617, 5805036, 6150330, 6527017, 6937907, 7387397, 7879805, 8418087, 9004346, 9640851, 10329927, 11072924, 11869342, 12716243, 13607420, 14532506]
58913A4532506R44065R43454R18337Q63994P77512O59214N12558L43340J59557
58904B0654537k8694k10748l77790n23803o44822p38367q04116q44250q62306
58895A5619641q61757q45851q18072p81803p39504o92777o43314n93320n44825
58886I098418m98835m55355m14276l76148l42079l12809k88008k66722k48410
58877E895776k33089k20397k09058j97665j85728j73626j61796j50343j39134
58868D224940j27965j16726j05745r5732q7077p9382p2072o5161n8964n3338m7790
58857C314988m2229l6919l1730k6093j9857j3579p764k260L335R270J5771K3066
58845C185999L0942L8763M6332N4202O2722P1312P9284Q7030R5578J05207J15292
$$ y = [14532506, 15476571, 16420025, 17338362, 18202356, 18979868, 19639082, 20151640, 20494980, 20654537, 20625843, 20415095, 20037305, 19513502, 18868680, 18130313, 17326197, 16481947, 15619641, 14757884, 13912033, 13093961, 12312158, 11572654, 10879877, 10236563, 9643243, 9098418, 8599583, 8144228, 7729952, 7353804, 7011725, 6698916, 6410908, 6144186, 5895776, 5662687, 5442290, 5233232, 5035567, 4849839, 4676213, 4514417, 4364074, 4224940, 4096975, 3980249, 3874504, 3778772, 3691695, 3612313, 3540241, 3475080, 3416116, 3362778, 3314988, 3272759, 3235840, 3204110, 3178017, 3158160, 3144581, 3136817, 3134557, 3137892, 3147162, 3162933, 3185999, 3216941, 3255704, 3302036, 3356238, 3418960, 3490272, 3569556, 3656586, 3752164, 3857371, 3972663]
58834C972663J25480J36251J48142J61174J75342J91024K08480K27492K48038
58825E594086K70877K96838L25805L57096L90751M27779M68996N14197N62626
58816I209051O13677O66670P20204P72077Q19621Q59755Q88685R01808Q94007
58807A6345555Q60292P96794P01876N76724M25200K53570P0400j14075k89651
58798A9626685m48020n83500o92660p74017q28174q57629q65954q56988q34515
58789A2885228q02118p63009p19880o74981o30042n86169n43990n03885m65942
58780G195212m29861l95395l62905l33090l06032k81077k57894k37141k19630
58771D372187k05169j92747j81515j71025j60671j49809j38607j28176j19293
$$ y = [3972663, 4098143, 4234394, 4382536, 4543710, 4719052, 4910076, 5118556, 5346048, 5594086, 5864963, 6161801, 6487606, 6844702, 7235453, 7663232, 8132228, 8646425, 9209051, 9822728, 10489398, 11209602, 11981679, 12801300, 13661055, 14549740, 15451548, 16345555, 17205847, 18002641, 18704517, 19281241, 19706441, 19960011, 20030411, 19916336, 19626685, 19178665, 18595165, 17902505, 17128488, 16300314, 15442685, 14576731, 13719743, 12885228, 12083110, 11320101, 10600221, 9925240, 9295198, 8709029, 8165039, 7661154, 7195212, 6765351, 6369956, 6007051, 5673961, 5367929, 5086852, 4828958, 4591817, 4372187, 4167018, 3974271, 3792756, 3621731, 3461060, 3311251, 3172644, 3044468, 2925175]
58762B925175j11420j03335r4590q5796p7607p0009o2718n5825m9664m4279l9493
58751B130439l5408l2368l0364k8777k6996k4973k3000k1189j9419j7693j6097
58740A854155j4569j2979j1415j0138r249q727q702r355j0460j1470j2130j2795
58728A722166j3946j5692j7917k0595k3711k6981k9930l2283l4197l5994l7637
58717A433283l8447l7598l5116l2171k9944k8409k6695k4503k2450k0923j9423
58706A117604j7487j5587j4447j3885j3063j1644j0162r311r317r919j0554j0665
58694I71563j0219r820r888r957r232p791o546o081o136o404p131q568j0305j1637
58680H51848j2293j2394j1914j0650q721o627m749l023j291J75Q52O37J17m8J41
$$ y = [2925175, 2813755, 2710420, 2615830, 2530034, 2452427, 2382418, 2319700, 2263875, 2214211, 2169932, 2130439, 2095031, 2062663, 2032299, 2003522, 1976526, 1951553, 1928553, 1907364, 1887945, 1870252, 1854155, 1839586, 1826607, 1815192, 1805054, 1795805, 1787078, 1778376, 1769021, 1758561, 1747091, 1734961, 1722166, 1708220, 1692528, 1674611, 1654016, 1630305, 1603324, 1573394, 1541111, 1506914, 1470920, 1433283, 1394836, 1357238, 1322122, 1289951, 1260007, 1231598, 1204903, 1180400, 1157950, 1137027, 1117604, 1100117, 1084530, 1070083, 1056198, 1043135, 1031491, 1021329, 1012018, 1002701, 992782, 982228, 971563, 961344, 951524, 941636, 931679, 922447, 914656, 908110, 902029, 895893, 889489, 882358, 873790, 863485, 851848, 839555, 827161, 815247, 804597, 795876, 789249, 784500, 781477, 780186, 780361, 781213, 781850, 781967, 781919, 782060]
58665G82060K67M35J475L847O623Q070P309N011K554Q72J39P4J83J33K16J298
58649H20566L863P236J0207J2331J4195J6316J8307J9457J9756J9892K0435K1556
58637A004117K3432K6312L0011L3861L7528M1472M6212N1595N7278O3597P1341
58626A486756Q0758R1398J02883J15276J28748J43510J60097J78979J99658K20743
58616B908806K41038K59995K76767K89353K94879K90184K72133K38629J90323
58607E262107J30930O5269k489o8288j27203j74688k08906k30881k42490k45244
58597D158117k40851k31589k19394k05259j89849j74006j58339j42973j28207
58588B467650j14873j03506r3586q4083p4594o5559n7561n0773m4936l9603l4527
$$ y = [782060, 782327, 782762, 784237, 788084, 794707, 802777, 810086, 815097, 817651, 818523, 818662, 818736, 818919, 819052, 819268, 820566, 824429, 831665, 841872, 854203, 868398, 884714, 903021, 922478, 942234, 962126, 982561, 1004117, 1027549, 1053861, 1083872, 1117733, 1155261, 1196733, 1242945, 1294540, 1351818, 1415415, 1486756, 1567514, 1658912, 1761795, 1877071, 2005819, 2149329, 2309426, 2488405, 2688063, 2908806, 3149844, 3409839, 3686606, 3975959, 4270838, 4561022, 4833155, 5071784, 5262107, 5393037, 5458306, 5455817, 5387529, 5260326, 5085638, 4876732, 4645851, 4403361, 4158117, 3917266, 3685677, 3466283, 3261024, 3071175, 2897169, 2738830, 2595857, 2467650, 2352777, 2249271, 2155685, 2071602, 1997008, 1931449, 1873888, 1823115, 1778179, 1738576, 1704049]
58577A704049k9980k6603k4749k4123k4203k4881k6478k9189l2589l5681l7453
58566A388120l7533l6303l4347l1937k9224k6696k4971k4205k4000k3937k3831
58555A071136k3489k2632k1174j9278j7094j4731j2487j0768r663q942q459q193
58543H94226p881p096n843m621l765l069k271j483q94m44m1J82j0q00k354m548
58527H49288o689q029q840j0284j2841j5463j6810j6801j6226j5330j3771j1794
58515F96410j0397j0005r820q922p489o311n572m786l793l099l037l124k695j789
58501F15571r41k92N02J410J759J193L66J69O12R83R60Q55Q76P62L05k86p35r21
58483F23148o67J56J227J929K153K468L268M254N025N645O273O718O846P034P573
$$ y = [1704049, 1674069, 1647466, 1622717, 1598594, 1574391, 1549510, 1523032, 1493843, 1461254, 1425573, 1388120, 1350587, 1314284, 1279937, 1248000, 1218776, 1192080, 1167109, 1142904, 1118904, 1094967, 1071136, 1047647, 1025015, 1003841, 984563, 967469, 952738, 940251, 929483, 919820, 910878, 902419, 894226, 886345, 879249, 873406, 868785, 865020, 861951, 859680, 858197, 857303, 856859, 856818, 857000, 856990, 856190, 853836, 849288, 842599, 834570, 825730, 815446, 802605, 787142, 770332, 753531, 737305, 721975, 708204, 696410, 686013, 676008, 666188, 657266, 649777, 643466, 637894, 633108, 629315, 626216, 623179, 620055, 617360, 615571, 614630, 614338, 614840, 616250, 618009, 619202, 619568, 619737, 620349, 621332, 622292, 623147, 624023, 624785, 625090, 624804, 624069, 623148, 622481, 622637, 623864, 625793, 627946, 630414, 633682, 637936, 642961, 648606, 654879, 661597, 668443, 675477, 683050]
58468F83050Q003P623O475N119L589J315j772m724o547p280p737q456r244r777
58454F59637j0172j0766j1516j1923j1596j0654r445q135o808n715n056m596l927
58441E49328l091k459k029j351k75P39J290J521J668J606J205P54O38Q39J199
58426E51582J794K677L516L972M244M788N620O356O821P185P537P813Q173Q970
58412F31048J0148J1025J0907R874Q698P995P538O598M912L102J885J142K49r09
58398G14212j866k508l308m307m654l746k286j454j455j514j125n44j53L1J84
58383F85507N21J320K667M163N325O143O825P113O493N151M088L974M405M608
58369G48303M492M580N041N338M928M044L465L522L655L152K166J478J411J505
$$ y = [683050, 691053, 698676, 705151, 710270, 713859, 715174, 713402, 708678, 702131, 694851, 687114, 678658, 669414, 659637, 649465, 638699, 627183, 615260, 603664, 593010, 583565, 575430, 568622, 562907, 557851, 553255, 549328, 546237, 543778, 541749, 540398, 540123, 540862, 542152, 543673, 545341, 546947, 548152, 548906, 549544, 550383, 551582, 553376, 556053, 559569, 563541, 567785, 572573, 578193, 584549, 591370, 598555, 606092, 613905, 622078, 631048, 641196, 652221, 663128, 673002, 681700, 689695, 697233, 703831, 708743, 711845, 713730, 714872, 715121, 714212, 712346, 709838, 706530, 702223, 697569, 693823, 691537, 690083, 688628, 687114, 685989, 685445, 685292, 685323, 685507, 686028, 687348, 690015, 694178, 699503, 705646, 712471, 719584, 726077, 731228, 735316, 739290, 743695, 748303, 752795, 757375, 762416, 767754, 772682, 776726, 780191, 783713, 787368, 790520, 792686, 794164, 795575, 797080]
58355G97080J389J320J567J850J910K079K606K880K192J047P93J797K912L088
58341H24510K800L363N162P154Q096P899P607Q194R548J0763J1263J1250J1066
58328I28675J0657R987R481R533R866R863R378Q693P976P300P020P428Q188Q682
58314A052727Q941R507J0382J0823J0406R680R490R976J0559J0612J0049R456
58302A172608R623J0684J1888J2524J2899J3748J5003J5900J6320J7096J8702
58291A326995K0376K0960K0131J8513J7085J6722J7746J9492K0804K1291K1771
58280A541886K3126K5129K6792K7545K7714K7999K8824L0023L1063L1693L2358
58269A854152L3643L5387L6967L8372M0216M2561M4535M5514M5900M6295M6649
$$ y = [797080, 798469, 799789, 801356, 803206, 805116, 807195, 809801, 812681, 814873, 815920, 816713, 818510, 821422, 824510, 827310, 830673, 835835, 842989, 851085, 858984, 866591, 874785, 884333, 895096, 906359, 917609, 928675, 939332, 949319, 958800, 968333, 978199, 988062, 997440, 1006133, 1014109, 1021409, 1028429, 1035857, 1044045, 1052727, 1061668, 1071175, 1081557, 1092380, 1102786, 1112466, 1121956, 1131932, 1142491, 1153103, 1163152, 1172608, 1182231, 1192915, 1204803, 1217327, 1230226, 1243974, 1258977, 1274877, 1291197, 1308293, 1326995, 1347371, 1368331, 1388462, 1406975, 1424060, 1440782, 1458528, 1478020, 1498824, 1520115, 1541886, 1565012, 1590141, 1616933, 1644478, 1672192, 1700191, 1729015, 1759038, 1790101, 1821794, 1854152, 1887795, 1923182, 1960149, 1998521, 2038737, 2081298, 2125833, 2171347, 2217247, 2263542, 2310191]
58258B310191M6936M7943N0488N4314N8529O2847O7536P2364P6496P9557Q2060
58247C009261Q4669Q7484R0183R2551R4806R7469J00908J04943J09295J14429
58237C985998J21239J29665J38463J46888J55697J65748J76608J87626J99524
58228E407456K13408K28864K44726K61325K80247L01943L25426L50399L77840
58219G991634M08214M41158M77392N18967N66988O20983O81107P48817Q24863
58210A3280123R09388J005075J117502J251607J411282J603961J841726K136642
58202B4557306K499859K946103L490484M137244M883262N742144O756743P982211
58194F2995356R478027J1339946J3726996J6837484K0888609K6136255L2745774
$$ y = [2310191, 2357127, 2405070, 2455558, 2509872, 2568401, 2631248, 2698784, 2771148, 2847644, 2927201, 3009261, 3093930, 3181414, 3271597, 3364148, 3458954, 3556423, 3657331, 3762274, 3871569, 3985998, 4107237, 4236902, 4375365, 4522253, 4677950, 4843698, 5020306, 5207932, 5407456, 5620864, 5849728, 6094454, 6355779, 6636026, 6937969, 7263395, 7613794, 7991634, 8399848, 8841006, 9318398, 9837365, 10404353, 11025336, 11706443, 12455260, 13280123, 14189511, 15194586, 16312088, 17563695, 18974977, 20578938, 22420664, 24557306, 27057165, 30003268, 33493752, 37630996, 42514258, 48256402, 55013145, 62995356, 72473383, 83813329, 97540325, 114377809, 135266418, 161402673, 194148447]
58187A94148447M0265197M6935809M9689958M5468394L3256032J5210032m232239
58180D20741630k0653632l1598705l6946521l7992427l6331286l3255147k9631812
58173A94332100k5963033k2484108j9289237j6429974j3936236j1798613r977123
58166G4453776q431024p126925o027442n092655m292202l602586k995046k438948
58158C4446948j914460j408061q96398l45942K77415J013729J901919K901167
58150C5976317L776764M109583L526047K001262n0932k012178l416662m135200
58142C9775001m298992m116592l758078l335608k915632k526557k172474j854010
58134A4797058j576538j342153j144771r76850q34964p16525o16818n32480m63759
$$ y = [194148447, 234413644, 281349453, 331039411, 376507805, 409763837, 424973869, 420741630, 400087998, 368489293, 331542772, 293550345, 257219059, 223963912, 194332100, 168369067, 145884959, 126595722, 110165748, 96229512, 84430899, 74453776, 66022752, 58895827, 52868385, 47775730, 43483528, 39880942, 36885896, 34446948, 32532488, 31124427, 30228029, 29882087, 30159502, 31173231, 33075150, 35976317, 39753081, 43862664, 47388711, 49389973, 49339041, 47326863, 43910201, 39775001, 35476009, 31359417, 27601339, 24265731, 21350099, 18823542, 16651068, 14797058, 13220520, 11878367, 10733596, 9756746, 8921782, 8205257, 7588439, 7055959, 6592200]
58125F592200m10301l68006l32672l03742k81743k64395k48013k31011k13741
58116C938576j96252j78464j61344j45923j31853j18464j06348r6661q9835q6094
58106B627338q5867q8217r0077q8892q5153q0844p6383p0964o5065o0398n7489
58095A777989n5088n2227m9351m7111m5262m3166m0575l7662l4817l2486l0687
58084A309557k8953k7186k6083k6021k6122k5347k4067k3395k3355k2962k1936
58073A034130k0989k0301j9011j6705j4330j2997j2629j2360j1675j0637r440
58062H73056q318p653p679q119q436q481q706r622j1083j2214j2268j1499j0779
58049G48199j0414r769q416o928o113n902n602m917m020k981j768o48J20Q07J823
$$ y = [6592200, 6181899, 5813893, 5481221, 5177479, 4895736, 4631341, 4383328, 4152317, 3938576, 3742324, 3563860, 3402516, 3256593, 3124740, 3006276, 2899928, 2803267, 2713432, 2627338, 2541471, 2453254, 2363177, 2274285, 2189132, 2108288, 2031905, 1960941, 1895876, 1835478, 1777989, 1722901, 1670674, 1621323, 1574212, 1528950, 1485784, 1445209, 1407547, 1372730, 1340244, 1309557, 1280604, 1253418, 1227335, 1201314, 1175192, 1149845, 1125778, 1102383, 1079028, 1056066, 1034130, 1013141, 992840, 973829, 957124, 942794, 929797, 917168, 904808, 893133, 882496, 873056, 864738, 857085, 849406, 841287, 832851, 824370, 815664, 806042, 794959, 782745, 770477, 758978, 748199, 737785, 728016, 719600, 712672, 706559, 700657, 695055, 690138, 686118, 683137, 681369, 680721, 680841, 681648, 683471]
58034F83471K910L519L758M152M489L861K054O0j207j911k638l321l467l043k621
58019F90066k772l597m752n689o037n913n694n506n239n043n346o163o862o926
58005F14527o671o789p389p824p417o154m710l892m028m768n496n819n583m663
57991E33324l085j275K22J282K168K991L630M182M941N756O032N578M956M615
57977E75317M212L341K372J949J862J230k69j967l138l795m324m878n432o103
57963E60377o942p635p728p192o494o064n863n550n013m598m751n455o170o323
57949D74599n755m590k958j054O65J765K353K940L731M381M635M735M893M718
57935D95058L749K262J015J96p59k200l750m981o009p066p937q331q317p987o981
$$ y = [683471, 686381, 689900, 693658, 697810, 702299, 706160, 708214, 708274, 707067, 705156, 702518, 699197, 695730, 692687, 690066, 687294, 683697, 678945, 673256, 667219, 661306, 655612, 650106, 644867, 639824, 634478, 628315, 621453, 614527, 607856, 601067, 593678, 585854, 578437, 572283, 567573, 563681, 559653, 554885, 549389, 543570, 537987, 533324, 530239, 528964, 529186, 530468, 532636, 535627, 539257, 543439, 548380, 554136, 560168, 565746, 570702, 575317, 579529, 582870, 585242, 587191, 589053, 590283, 590014, 588047, 584909, 581114, 576790, 571912, 566480, 560377, 553435, 545800, 538072, 530880, 524386, 518322, 512459, 506909, 501896, 497298, 492547, 487092, 480922, 474599, 468844, 464254, 461296, 460242, 460907, 462672, 465025, 467965, 471696, 476077, 480712, 485447, 490340, 495058, 498807, 501069, 502084, 502280, 501521, 499321, 495571, 490590, 484581, 477515, 469578, 461247, 452930, 444943, 437962]
57920D37962n143l231k250k068j538j15J456K353K846L780N336O925P931Q198
57906D62442P977P726P758P766O990N171K988J245J9r49j478j277q21j060k183
57891E02314l391l979m098m234m486m751n109n740o530p107p122o491n514m781
57877D28981m648m782m514l652k584j547l52J031K142K748L375M617O146P006
57863D33967O847O269N923N775N483N098M951N022M822L951K520Q51r76k970m751
57848D82782n708n810n891o693p796q080p150n799m983m840m987n184n293m998
57834C99570m095k920k086j890k258l040l962m529m547m538n111n952o160n610
57820C42872n279n913p009p553p268o610n903n182m641m575m783m637l928l184
$$ y = [437962, 432819, 429588, 427338, 425270, 423732, 423617, 425073, 427426, 430272, 434052, 439388, 446313, 454244, 462442, 470419, 478145, 485903, 493669, 500659, 505830, 508818, 510063, 510082, 509133, 507655, 506378, 505557, 504497, 502314, 498923, 494944, 490846, 486612, 482126, 477375, 472266, 466526, 459996, 452889, 445767, 439276, 433762, 428981, 424333, 419551, 415037, 411385, 408801, 407254, 406902, 407933, 410075, 412823, 416198, 420815, 426961, 433967, 440814, 447083, 453006, 458781, 464264, 469362, 474313, 479335, 484157, 488108, 490628, 491479, 490503, 487533, 482782, 477074, 471264, 465373, 458680, 450884, 442804, 435654, 429855, 424872, 420032, 415045, 409861, 404568, 399570, 395475, 392555, 390469, 388579, 386321, 383281, 379319, 374790, 370243, 365705, 360594, 354642, 348482, 342872, 337593, 331680, 324671, 317118, 309850, 303240, 297337, 292155, 287514, 282939, 278156, 273519, 269591, 266407]
57806B66407k894k803k322j339k80N16J092J519J703J666J841K738M400O401Q373
57791B87018J0203J1567J1649R920P122M898M118M062L621K816K475K687K472
57778C64628J209m03j330j571j946k848l841m418m562m492m350m278m371m340
57764C23087l613k066m06M60L41k82r81j691k235k006n23J704L288L285K265J728
57748C22355K411L601M253M332M560N137N485N288N043N247N575N368M658M096
57734C87409M009L988L517K679K067K158K890L756M302M619N295O806R020J1388
57720D53903J3461J5044J6070J6604J6996J7697J8831K0057K0922K1321K1666
57709F52572K2679K4885K8101L1539L4632L7643M1175M5287M9589N4160N9760
$$ y = [266407, 263513, 260710, 258388, 257049, 256769, 257285, 258377, 259896, 261599, 263265, 265106, 267844, 272244, 278645, 287018, 297221, 308788, 320437, 330357, 337479, 342377, 346495, 350557, 354178, 356994, 359469, 362156, 364628, 365837, 365434, 364104, 362533, 360587, 357739, 353898, 349480, 344918, 340426, 336076, 331798, 327427, 323087, 319474, 317408, 317002, 317462, 317803, 317521, 316540, 314849, 312614, 310608, 310085, 311789, 315077, 318362, 320627, 322355, 324766, 328367, 332620, 336952, 341512, 346649, 352134, 357422, 362465, 367712, 373287, 378655, 383313, 387409, 391418, 395406, 398923, 401602, 403669, 405827, 408717, 412473, 416775, 421394, 426689, 433495, 442515, 453903, 467364, 482408, 498478, 515082, 532078, 549775, 568606, 588663, 609585, 630906, 652572, 675251, 700136, 728237, 759776, 794408, 832051, 873226, 918513, 968102, 1022262, 1082022]
57698A082022O6851P4954Q3447R2579J03211J15711J29749J45134J62267J81463
57688B237388K02235K23583K44648K64571K81626K92836K94718K84414K60301
57679D586320K22183J71621J12406N0215q835n9757r9173j24792j35123j29958
57669D585107j11220q3754n5850l8497m1787o9376j15138j65764k07771k33410
57659C462540k41672k35740k20187j99498j77308j55887j36099j17840j00684
57650A877625q4454o9479n6233m4680l4316k4905j6686r540k520N227J3511K1735
57638A575285L0129L9402M9476N9656P0139Q2134R6105J11122J26550J43230J61899
57627B545127J81378J99590K15756K29977K40812K44822K38896K21818J93313
$$ y = [1082022, 1148873, 1223827, 1307274, 1399853, 1503064, 1618775, 1748524, 1893658, 2055925, 2237388, 2439623, 2663206, 2907854, 3172425, 3454051, 3746887, 4041605, 4326019, 4586320, 4808503, 4980124, 5092530, 5142745, 5133910, 5074153, 4974980, 4850188, 4715065, 4585107, 4473887, 4390133, 4334283, 4295786, 4253999, 4184623, 4069485, 3903721, 3695950, 3462540, 3220868, 2985128, 2764941, 2565443, 2388135, 2232248, 2096149, 1978309, 1877625, 1793171, 1723692, 1667459, 1622779, 1588463, 1563558, 1546872, 1537332, 1534812, 1540039, 1553550, 1575285, 1605414, 1644816, 1694292, 1753948, 1824087, 1906221, 2002326, 2113448, 2239998, 2383228, 2545127, 2726505, 2926095, 3141851, 3371828, 3612640, 3857462, 4096358, 4318176, 4511489]
57618D511489J53171J02416M4553j5442p3010j24517j66917j98364k19143k30947
57608C783289k35217k32799k25004k13803k00724j86321j71090j56125j42335
57599B019871j29657j17665j06584r6933q8520q0577p2920o6158o0579n5508n0261
57588A094509m5175m1085l7994l5025l1659k8381k5795k3719k1638j9677j8436
57577G65925j7873j7038j5190j2739j0685r400q368p114n827m897m112k807p95
57564F49080J263K629L420M385N921P661R099J0143J0968J1704J2592J4004J5950
57551G58819J7892J9636K1954K5666L0247L4250L7252M0542M5540N2219N9648
57540A143665O7492P6289Q6458R7673J09238J20757J32457J45099J59216J74199
$$ y = [4511489, 4664660, 4767076, 4811629, 4796187, 4723177, 4598660, 4431743, 4233379, 4014236, 3783289, 3548072, 3315273, 3090269, 2876466, 2675742, 2489421, 2318331, 2162206, 2019871, 1890214, 1772549, 1665965, 1569032, 1480512, 1399935, 1327015, 1260857, 1200278, 1144770, 1094509, 1049334, 1008249, 970255, 935230, 903571, 875190, 849395, 825676, 804038, 784361, 765925, 748052, 731014, 715824, 703085, 692400, 683000, 674632, 667518, 661691, 656794, 652682, 649875, 649080, 650343, 652972, 656392, 660777, 666698, 674359, 683458, 693601, 704569, 716273, 728865, 742869, 758819, 776711, 796347, 818301, 843967, 874214, 908464, 945716, 986258, 1031798, 1084017, 1143665, 1211157, 1287446, 1373904, 1471577, 1580815, 1701572, 1834029, 1979128, 2138344, 2312543]
57530B312543J88202J99166K05539K05720J97531J79164J50579J13349O9406K0868
57520C842067k8833p4967j13573j43290j64817j79037j86300j87108j82655j74454
57510B407033j63843j51909j39411j26683j13874j01497r0368q0795p2158o3665
57500A302830n5407m8156m2139l6516l0318k3594j7231j1924p609l840k39L390
57488A029247P033J0557J4127J8465K4171L0724L6833M2091M7701N5040O4044
57477A380033P3615Q3292R3712J05530J18661J32720J47425J62174J75658J86274
57467B659094J92575J92933J85145J67043J37733R8328N1701J743m7397r2014
57457C546884j29367j57890j77188j87948j91598j89749j83805j74994j64457
$$ y = [2312543, 2500745, 2699911, 2905450, 3111170, 3308701, 3487865, 3638444, 3751793, 3821199, 3842067, 3813234, 3738267, 3624694, 3481404, 3316587, 3137550, 2951250, 2764142, 2581487, 2407033, 2243190, 2091281, 1951870, 1825187, 1711313, 1609816, 1519448, 1438653, 1366495, 1302830, 1247423, 1199267, 1157128, 1120612, 1090294, 1066700, 1049469, 1037545, 1029936, 1026096, 1025857, 1029247, 1036280, 1046837, 1060964, 1079429, 1103600, 1134324, 1171157, 1213248, 1260949, 1315989, 1380033, 1453648, 1536940, 1630652, 1736182, 1854843, 1987563, 2134988, 2297162, 2472820, 2659094, 2851669, 3044602, 3229747, 3396790, 3534523, 3632851, 3684552, 3686295, 3638898, 3546884, 3417517, 3259627, 3082439, 2894491, 2702893, 2513144, 2329339, 2154345, 1989888]
57448A989888j53058j41120j28669j16116j04412r4332q5715p7727o9881o2529
57438I56329n6188n0766m5811m1274l7465l4320l1351k8468k6213k4815k3494
57427E56164k1342j8542j6062j4366j3087j1933j1154j0902j0864j0780j0758
57416D06374j0732j0161q809p418o927p240p373o675n328l699j881j32R04Q58
57402C31761K09k44k19O2N35J328K169K339J520L61j60K05Q62J193J184J202J398
57385C45705J571J484J224J173J625K375K834K601J891J289J147J355J588J586
57371C69448J292R59J079J862K793L014K359J697J989L169M235M366L703L035
57357D05000K876L043L051K810K735L156L842M238M057L467K825K561L069M325
$$ y = [1989888, 1836830, 1695710, 1567041, 1450925, 1346513, 1252181, 1166466, 1088739, 1018858, 956329, 900141, 849375, 803564, 762290, 724825, 690505, 659154, 630686, 604473, 579658, 556164, 534822, 516280, 500218, 485852, 472765, 460832, 449678, 438776, 427912, 417132, 406374, 395642, 385481, 376672, 369254, 362327, 355087, 347714, 341039, 335711, 332012, 330131, 329999, 330903, 331761, 331970, 331726, 331507, 331569, 332104, 333432, 335601, 337940, 339460, 339821, 339661, 339866, 340728, 341921, 343105, 344307, 345705, 347276, 348760, 349984, 351157, 352782, 355157, 357991, 360592, 362483, 363772, 364919, 366274, 367862, 369448, 370740, 371699, 372778, 374640, 377433, 380447, 382806, 384503, 386492, 389661, 393896, 398262, 401965, 405000, 407876, 410919, 413970, 416780, 419515, 422671, 426513, 430751, 434808, 438275, 441100, 443661, 446730, 451055]
57343D51055N600O056N625M947M437L992L710M162N490O777O923N941M909M768
57329E24392N519O485O992O852O430O249O380O457O327O355O831P439P696P629
57315F18033P730Q404R685J1227J2361J2507J1841J1204J1108J1331J1676J2475
57303G49582J3792J4864J5144J5239J5972J6981J7388J7497J8522K0649K2633
57292I38263K3592K4087K5010K6347K7649K8907L0359L1996L3720L5498L6934
57281A262362L7329L6566L5376L4193L2262K8564K3199J7216J1353N601j64n750
57269A518107j0849j5239j8677k0978k2197k2587k2333k1494k0106j8193j5785
57258A309669j3073j0447q227o449m943l480j766L89K737M574N332N133M691M707
$$ y = [451055, 456655, 462711, 468336, 473283, 477720, 481712, 485422, 489584, 495074, 501851, 508774, 514715, 519624, 524392, 529911, 536396, 543388, 550240, 556670, 562919, 569299, 575756, 582083, 588438, 595269, 602708, 610404, 618033, 625763, 634167, 643852, 655079, 667440, 679947, 691788, 702992, 714100, 725431, 737107, 749582, 763374, 778238, 793382, 808621, 824593, 841574, 858962, 876459, 894981, 915630, 938263, 961855, 985942, 1010952, 1037299, 1064948, 1093855, 1124214, 1156210, 1189930, 1225428, 1262362, 1299691, 1336257, 1371633, 1405826, 1438088, 1466652, 1489851, 1507067, 1518420, 1524021, 1523857, 1518107, 1507258, 1492019, 1473342, 1452364, 1430167, 1407580, 1385247, 1363753, 1343647, 1325454, 1309669, 1296596, 1286149, 1277922, 1271473, 1266530, 1263050, 1261284, 1261673, 1264410, 1268984, 1274316, 1279449, 1284140, 1288847]
57244A288847N398O412P251P776Q316R116R851J0013R652R338R443R821J0207
57231A401441J0488J0547J0276R852R652R828J0246J0821J1518J2019J1999J1773
57219A530460J2047J2894J3548J3527J3318J3586J4184J4491J4359J4226J4455
57208A681095J4988J5494J5669J5437J5050J4820J4751J4650J4573J4796J5308
57197A846631J5850J6529J7733J9249K0129J9842J9033J8602J8576J8461J8331
57186B048966J8802K0040K1447K2333K2504K2175K1747K1727K2502K3927K5281
57175B291451K5727K4960K3346K1537J9927J8568J7533J7017J6924J6712J5996
57164B509698J5041J4294J3770J3352J3302J3796J4248J3896J2836J1633J0143
$$ y = [1288847, 1294245, 1300657, 1307908, 1315684, 1324000, 1333116, 1342967, 1352980, 1362632, 1371970, 1381413, 1391234, 1401441, 1411929, 1422476, 1432752, 1442604, 1452256, 1462084, 1472330, 1483151, 1494669, 1506688, 1518687, 1530460, 1542507, 1555401, 1568949, 1582476, 1595794, 1609380, 1623564, 1638055, 1652414, 1666640, 1681095, 1696083, 1711577, 1727246, 1742683, 1757733, 1772553, 1787304, 1801954, 1816527, 1831323, 1846631, 1862481, 1879010, 1896743, 1915992, 1936121, 1955963, 1974996, 1993598, 2012174, 2030635, 2048966, 2067768, 2087808, 2109255, 2131588, 2154092, 2176267, 2198014, 2219741, 2242243, 2266170, 2291451, 2317178, 2342138, 2365484, 2387021, 2406948, 2425516, 2443049, 2460066, 2476990, 2493702, 2509698, 2524739, 2539033, 2552803, 2566155, 2579457, 2593253, 2607501, 2621397, 2634233, 2645866, 2656009]
57153B656009P802N067L286K935L046K750K292K021J537N18n49j168j627k305
57139B681614k981l538m555o441q620j0271j1198j1313j0027p148l769j256L46
57126B600843K086M602P590J0458J2780J4320J5143J5584J5749J5405J4568J3744
57114B742872J3297J3166J3482J4766J7192K0526K5083L1870M1486N3916O9902
57103C057558R1439J20489J58424K07104K69014L45490M36050N39971O56909P85415
57093F667863R22840J067690J219993J378085J536611J688149J824058J933115
57085A8238404K002665K021540J976671J847424J617112J303304R70676O94597
57077C0672393N01678L50625J75004n9388l37498o19734q71687j076469j233956
$$ y = [2656009, 2663811, 2668878, 2672164, 2675099, 2678145, 2680895, 2683187, 2685208, 2686745, 2687263, 2686714, 2685546, 2683919, 2681614, 2678633, 2675095, 2670540, 2664099, 2655479, 2645208, 2634010, 2622697, 2612670, 2605522, 2601753, 2600497, 2600843, 2602929, 2607531, 2615121, 2625579, 2638359, 2652679, 2667822, 2683406, 2699155, 2714560, 2729128, 2742872, 2756169, 2769335, 2782817, 2797583, 2814775, 2835301, 2860384, 2892254, 2933740, 2987656, 3057558, 3148997, 3269486, 3427910, 3635014, 3904028, 4249518, 4685568, 5225539, 5882448, 6667863, 7590703, 8658393, 9878386, 11256471, 12793082, 14481231, 16305289, 18238404, 20241069, 22262609, 24239280, 26086704, 27703816, 29007120, 29977796, 30672393, 31174071, 31524696, 31699700, 31640312, 31302814, 30683080, 29811393, 28734924, 27500968]
57068B7500968j354456j448351j517625j557262j563337j536732j480435j398065
57060A5644705j296184j184613j072539r65653q67110p78798p00746o31290n69052
57051G578720n13889m65694m23607l86673l54118l24809k97644k72660k50683
57042D288943k31806k15270k00702j88311j77958j69200j62094j56688j51861
57033B635053j46003j38761j30896j22534j13076j02792r2957q4162p5856o7759
57023A560257o0399n3942m7851m2005l6919l2548k8254k4163k1176j9169j6761
57012A177070j3446j0474q770p421n231k447K49L397Q006J3970K0735K8980M0350
56999A244968N5959P6606J03802J37686J71992J92320J82519J35789O1134k0778
$$ y = [27500968, 26146512, 24698161, 23180536, 21623274, 20059937, 18523205, 17042770, 15644705, 14348521, 13163908, 12091369, 11125716, 10258606, 9479808, 8779062, 8147772, 7578720, 7064831, 6599137, 6175530, 5788857, 5434739, 5109930, 4812286, 4539626, 4288943, 4057137, 3841867, 3641165, 3452854, 3274896, 3105696, 2943602, 2786914, 2635053, 2489050, 2350289, 2219393, 2096859, 1983783, 1880991, 1788034, 1703872, 1628016, 1560257, 1499858, 1445916, 1398065, 1356060, 1319141, 1286593, 1258339, 1234176, 1213000, 1193831, 1177070, 1163624, 1153150, 1144380, 1136959, 1131728, 1129281, 1129530, 1132927, 1140933, 1154903, 1175638, 1204618, 1244968, 1300927, 1377533, 1481335, 1619021, 1791013, 1983333, 2165852, 2301641, 2362775, 2341997]
56989B341997q9203j33127j52861j54870j46061j31421j14420r7787q3825p4121
56979A164301o8824o6324o4295o1368n7530n3035m7620m1121l4141k7635k2144
56968F20264j7615j3658r723n468j185K505N548Q637J2364J6653K1207K5782K9440
56955F94751L0134K5931J6790M918o583j5313k0360k2193k1911k0452j8408j6350
56943F30954j4779j3590j2008r440o158k853K93L762Q015J2951J8138K3454K9184
56930F67923L5001L8705L6764K7205J1980m209j7521k6859l2514l4616l3590l0939
56918F37330k8189k5505k2253j8595j5435j3089j1092r369q472q410q247p356
56906D61318o266n650n190m125k493j001R7J147K217K894L124L525M486N637O671
$$ y = [2341997, 2252794, 2119667, 1966806, 1811936, 1665875, 1534454, 1420034, 1322247, 1238422, 1164301, 1095477, 1029153, 964858, 903490, 845960, 792925, 745305, 704184, 670043, 642408, 620264, 602649, 588991, 579268, 573800, 572615, 575120, 580668, 589305, 601669, 618322, 639529, 665311, 694751, 724885, 750816, 767606, 772524, 765941, 750628, 730268, 708075, 686164, 665712, 647304, 630954, 616175, 602585, 590577, 581137, 574979, 572126, 572419, 576181, 584196, 597147, 615285, 638739, 667923, 702924, 741629, 778393, 805598, 817578, 813369, 795848, 768989, 736475, 701859, 668269, 637330, 609141, 583636, 561383, 542788, 527353, 514264, 503172, 493803, 485331, 476921, 468674, 461318, 455052, 449402, 444212, 440087, 437594, 436593, 436690, 437837, 440054, 442948, 446072, 449597, 454083, 459720, 466391]
56891D66391Q126J0690J4169J7890K1904K6666L1306L3179K9883K1442J0202r80
56879F90868j0071j6116j9184k0121j9807j8409j5673j1777p539l708m06K722
56867E50779O184J0440J5773K2247K9913L9014M9727O1525P2555P9334P7397O3625
56855A078513L9159R876j6896l6599m8570n4019n4144n0165m3749l6444k8970
56844G57992k1414j3781o036K044J0784K0539L1784M5085O0872P9400J00240J20714
56832A188223J34635J33989J13526P4666K5345k3690o3224q8421r9504j00214
56822A295331r5002q6874p7206o6701n6012m5580l5427k5258j4767l946O989J8155
56810H13702L0432M4956O1874P9316R3127R7498Q7125O0717K3254j5945m8360
$$ y = [466391, 474517, 485207, 499376, 517266, 539170, 565836, 597142, 630321, 660204, 681646, 691848, 690868, 680797, 664681, 645497, 625376, 605569, 587160, 571487, 559710, 552171, 548463, 548057, 550779, 556963, 567403, 583176, 605423, 635336, 674350, 724077, 785602, 858157, 937491, 1014888, 1078513, 1117672, 1127548, 1110652, 1074053, 1025483, 971464, 917320, 867155, 823406, 786962, 757992, 736578, 722797, 716761, 718805, 729589, 750128, 781912, 826997, 887869, 967269, 1067509, 1188223, 1322858, 1456847, 1570373, 1645039, 1670384, 1646694, 1583470, 1495049, 1395545, 1295331, 1200329, 1113455, 1036249, 969548, 913536, 867956, 832529, 807271, 792504, 788558, 795547, 813702, 844134, 889090, 950964, 1030280, 1123407, 1220905, 1308030, 1368747, 1392001, 1376056, 1327696]
56799A327696o9943q0804q2993p9280p2591o4969n6874m8190l9553l1980k5521
56788F74998j9207j2295m884K773J0797J9420K8599L7820M5574M9087M5446L3656
56776I11784J5525n394k5303m0876m9832n1946m9333m5041m0924l6997l2624k7893
56764E21146k3630k0392j7888j5482j3034j0969r628q868q357p933p458o654n411
56751C65442m111l283k986k852k671k561k511k225j619j148j271j761j936j573
56737C32934j258j625k487l040k867k371k099k035j837j532j491j765j910j580
56723C05037r20k76J75L46J52k45m30k59j34m84j130j573j689j759j922j940j641
56706B91308j189p93m30J5L86K55o26j913k831k856k225j597j281j079q72r05
$$ y = [1327696, 1257753, 1176949, 1093956, 1014676, 942085, 877116, 820242, 772052, 732499, 700519, 674998, 655791, 643496, 638612, 641385, 652182, 671602, 700201, 738021, 783595, 832682, 878128, 911784, 927309, 921915, 896612, 855736, 805904, 753958, 704625, 659584, 618660, 581663, 549039, 521146, 497516, 477124, 459236, 443754, 430720, 419751, 410123, 401255, 392898, 384965, 377507, 370853, 365442, 361331, 358048, 355062, 352210, 349539, 346978, 344467, 342242, 340623, 339475, 338204, 336443, 334507, 332934, 331676, 330051, 327564, 324524, 321657, 319286, 317187, 315152, 313315, 311783, 310292, 308527, 306617, 305037, 304117, 303841, 304016, 304362, 304514, 304269, 303839, 303580, 303446, 302962, 301832, 300259, 298570, 296811, 294889, 292949, 291308, 290119, 289326, 288896, 288911, 289297, 289552, 288926, 287013, 284182, 281326, 279101, 277504, 276223, 275144, 274272, 273367]
56690B73367j340j877k150k184k100j682p11M41J090J097J012J288J805K233K478
56675B72767K622K724K813K847K596J953J366J601K745L865L964L053J955J286
56661C08157R86O79Q3r56k357l718m609n050n392n696n653n216m881n011n261
56646B56105n100m620m278m030l367k260j394j194j168o69J75P61R98J352K015
56631B33326K618K775K527K076J559J258J592K524L198K674J006o55j243r16p99
56616B53520j643k945l631l429l193l746m825n458n131m162l027j858p04J26L28
56601B10222Q2m3L25R61J383J456J506J739J815J345O42M66R48J332J042N05M25
56584B26151P48R28Q75J016J472J884J993J941J945K115K518L018L147K669K148
$$ y = [273367, 272027, 270150, 268000, 265816, 263716, 262034, 261323, 261764, 262854, 263951, 264963, 266251, 268056, 270289, 272767, 275389, 278113, 280926, 283773, 286369, 288322, 289688, 291289, 294034, 297899, 301863, 304916, 306871, 308157, 309143, 309822, 309905, 308949, 306592, 302874, 298265, 293215, 287823, 282127, 276474, 271258, 266377, 261366, 256105, 251005, 246385, 242107, 238077, 234710, 232450, 231056, 229862, 228694, 228025, 228200, 228961, 229959, 231311, 233326, 235944, 238719, 241246, 243322, 244881, 246139, 247731, 250255, 253453, 256127, 257133, 256478, 255235, 254319, 253520, 251877, 248932, 245301, 241872, 238679, 234933, 230108, 224650, 219519, 215357, 212330, 210472, 209768, 209894, 210222, 210304, 210261, 210586, 211547, 212930, 214386, 215892, 217631, 219446, 220791, 221433, 221899, 222847, 224179, 225221, 225726, 226151, 226899, 227827, 228702, 229718, 231190, 233074, 235067, 237008, 238953, 241068, 243586, 246604, 249751, 252420, 254568]
56569B54568K404L422M412M885N078N328N674O184P034Q054Q857R454J0176J0860
56555C46390J0861J0087R257Q887Q625P964O948N820M540L082J621P7j878m040
56541D18241n522n903n877o283p086p840q437q787q413p211o062n826o133n965
56527C22896n154m436m221m207m089l881l575l133k804k868l152l326l526m036
56513B70488m504m292l546l149l456l752l233k013q87m42n85p21l20M74R67Q18
56497B41847O11J029J760J765O56p25j212l96J139K335K456J748J230J538K205
56482B57986K411K110J867J851J766J643J949K789L599L810L333K375J269N29
56468B89287N30J067J601J991K478L081L556L938M508N121N192M544L765L481
$$ y = [254568, 256972, 260394, 264806, 269691, 274769, 280097, 285771, 291955, 298989, 307043, 315900, 325354, 335530, 346390, 357251, 367338, 376595, 385482, 394107, 402071, 409019, 414839, 419379, 422461, 424082, 424159, 422281, 418241, 412719, 406816, 400939, 394656, 387570, 379730, 371293, 362506, 354093, 346882, 340820, 334994, 328861, 322896, 317742, 313306, 309085, 304878, 300789, 296908, 293333, 290200, 287396, 284528, 281376, 278050, 274524, 270488, 265984, 261692, 258146, 254997, 251541, 247789, 244556, 242543, 241656, 241214, 240629, 239908, 239588, 240062, 241029, 241847, 242458, 243487, 245247, 247012, 247668, 246943, 245731, 245335, 246474, 248809, 251265, 253013, 254243, 255781, 257986, 260397, 262507, 264374, 266225, 267991, 269634, 271583, 274372, 277971, 281781, 285114, 287489, 288758, 289287, 289817, 290884, 292485, 294476, 296954, 300035, 303591, 307529, 312037, 317158, 322350, 326894, 330659, 334140]
56454C34140L664L812L513K767K015J799K062K021J176J96J20R09J573J703J886
56439C63356K497L015K840K081J131J63o69j134j359j752k315k662k933l817n263
56424C53179o072n416m050l312l514l949m009l538k545j376p95j220k058k395
56410C08930k086j568r69j67N54O57J31n57j184j794k143j861j209r03j111j275
56394B93445j161j274j940k545k293j288k74M27J170K214L189L556L282K769K270
56379C01547J676R16K81J55N08R88J465K185L228M180M573M429M065L571K791
56364C36558J810J023P13P74R43J081J107R39O00K44n3l98p09m75P53K534L668
56347C51112L409K334J680J931K503K773K885L305M005M526M617M500M614N347
$$ y = [334140, 337804, 341616, 345129, 347896, 349911, 351710, 353772, 355793, 356969, 357165, 357285, 358194, 359767, 361470, 363356, 365853, 368868, 371708, 373789, 374920, 375083, 374414, 373280, 371921, 370169, 367854, 365192, 362259, 358442, 353179, 347107, 341691, 337641, 334329, 330815, 326866, 322857, 319319, 316774, 315398, 314603, 313383, 311325, 308930, 306844, 305276, 304307, 304140, 304694, 305351, 305482, 304925, 303741, 301947, 299804, 297943, 296734, 295831, 294720, 293445, 292284, 291010, 289070, 286525, 284232, 282944, 282670, 283097, 284267, 286481, 289670, 293226, 296508, 299277, 301547, 303223, 304139, 304420, 304575, 305083, 306071, 307536, 309721, 312949, 317129, 321702, 326131, 330196, 333767, 336558, 338368, 339391, 340104, 340878, 341821, 342902, 344009, 344948, 345548, 345792, 345739, 345341, 344632, 344157, 344910, 347444, 351112, 354521, 356855, 358535, 360466, 362969, 365742, 368627, 371932, 375937, 380463, 385080, 389580, 394194, 399541]
56333C99541O823Q620R841R852Q949Q043P733P955Q364Q734Q986R121R156Q992
56319E20710Q461P650O895O262N363M046K809K012J139m60k402l702m182m540
56305E50061n090n404n249m872m151k565m15R73R24M23O81J506J955J994K474
56290E33245L796N491P002Q157Q971R651J0697J2393J4262J5576J6257J6787J7419
56277F79704J8131J9263K1333K4216K7198L0060L3410L7628M2036M5670M8566
56266A027215N1834N6586O3095P0972P9770Q9352R9796J11162J23350J36157J49322
56255B058611J62501J75194J86765J96480K03609K07634K08310K05349J98013
56246C802466J85287J66629J42495J14183Q3433N2077K1743o402l1493n2703o9447
$$ y = [399541, 406364, 414984, 424825, 434677, 443626, 451669, 459402, 467357, 475721, 484455, 493441, 502562, 511718, 520710, 529171, 536821, 543716, 549978, 555341, 559387, 562196, 564208, 565347, 564887, 562485, 558783, 554601, 550061, 544971, 539567, 534318, 529446, 525295, 522730, 522315, 523288, 524212, 524635, 525316, 526822, 528777, 530771, 533245, 537041, 542532, 549534, 557691, 566662, 576313, 587010, 599403, 613665, 629241, 645498, 662285, 679704, 697835, 717098, 738431, 762647, 789845, 819905, 853315, 890943, 932979, 978649, 1027215, 1079049, 1135635, 1198730, 1269702, 1349472, 1438824, 1538620, 1649782, 1773132, 1909289, 2058611, 2221112, 2396306, 2583071, 2779551, 2983160, 3190794, 3399104, 3604453, 3802466, 3987753, 4154382, 4296877, 4411060, 4494493, 4546570, 4568313, 4561911, 4530418, 4477715, 4408268]
56235D408268q1932r0997r7283j00903j02071j01551j00243r8718r7503r7271
56225C439796r8335j00414j03265j07090j11684j15725j17766j17787j16970j16049
56215B334711j14688j12561j09990j07171j03469r8206r1723q5042p8669p2280
56205A360912o5596n9073n3490m9101m5386m1573l7295l2795k8615k5156k2448
56194I00384k0218j8165j6194j4374j2665j0850q841o910n374m155k904j526j71
56181G78037J259L118N347P264Q324Q767R167R678J0084J0356J0657J0918J0801
56168H83777J0080Q772P013N107L599K820K390J540M3j580k740l356l568l353
56154I10544k702j922j327p73J54J524L005M536O591R515J2887J5982J8752K1948
$$ y = [4408268, 4326336, 4235339, 4138056, 4037153, 3935082, 3833531, 3733288, 3634570, 3537067, 3439796, 3341461, 3241047, 3137782, 3030692, 2919008, 2803283, 2685517, 2567730, 2450760, 2334711, 2220023, 2107462, 1997472, 1890301, 1786832, 1688626, 1596903, 1511861, 1433192, 1360912, 1295316, 1236243, 1182753, 1133652, 1088266, 1046693, 1009398, 976603, 947988, 922832, 900384, 880166, 862001, 845807, 831433, 818768, 807918, 799077, 792167, 786793, 782638, 779734, 778208, 778037, 779296, 782414, 787761, 795025, 803349, 812116, 821283, 830961, 841045, 851401, 862058, 872976, 883777, 893857, 902629, 909642, 914749, 918348, 921168, 923558, 925098, 925141, 923561, 920821, 917465, 913897, 910544, 907842, 905920, 904593, 903820, 903974, 905498, 908503, 913039, 919630, 929145, 942032, 958014, 976766, 998714]
56140I98714K6222L1535L7646M4750N3324O3580P5340Q8211J01580J14422J25279
56129A760603J32384J33878J28619J17350J02929Q8939P7978P1011O7458O5188
56119B746337O0943N2026L8012K0783L287j1404k0816k4508k5132k7093l3539
56108B778896m4767n9202p4935r0059j02616j10964j14240j12434j06511r8339
56098A864829q9746q1415p3145o5023n7617n1070m4969l9231l4241k9993k5943
56087A272436k1991j8646j5986j3368j0520p987o099m413k655j272n48K5R64K126
56073A172066L270M499N716O540P128Q165R584J0398J0284J0206J0842J1628J2124
56060A282450J2989J4570J5756J5507J4572J4392J5089J5833J6432J7224J8045
$$ y = [998714, 1024936, 1056471, 1094117, 1138867, 1192191, 1255771, 1331111, 1419322, 1520902, 1635324, 1760603, 1892987, 2026865, 2155484, 2272834, 2375763, 2464702, 2542680, 2613691, 2681149, 2746337, 2807280, 2859306, 2897318, 2918101, 2921388, 2909984, 2889168, 2864660, 2839528, 2812435, 2778896, 2734129, 2674927, 2599992, 2509933, 2407317, 2296353, 2182113, 2069679, 1963168, 1864829, 1775083, 1693668, 1620523, 1555500, 1497883, 1446813, 1401844, 1362613, 1328372, 1298379, 1272436, 1250445, 1231799, 1215813, 1202445, 1191925, 1183938, 1177839, 1173426, 1170771, 1169499, 1168951, 1168976, 1169940, 1172066, 1175336, 1179835, 1185551, 1192091, 1199219, 1207384, 1216968, 1227366, 1237650, 1247856, 1258698, 1270326, 1282450, 1295439, 1310009, 1325765, 1341272, 1355844, 1370236, 1385325, 1401158, 1417590, 1434814, 1452859]
56049A452859J8557J9133K0240K1425K2072K2561K3555K4669K5136K5288K6106
56038A701601K7608K8851K9352K9440K9461K9666L0555L2435L4879L7384M0109
56027B051341M3184M5935M7755M9045N0437N1641N2080N1943N1669N1196N0677
56016B596903N1079N3028N5999N9562O4262P0127P5626P9599Q2851Q6396Q9553
56005C364985R1592R3718R7332J01658J05410J09494J15519J22854J29819J36882
55995D469263J45776J56211J66345J75897J86042J96702K06775K16615K27684
55986F147310K40251K53873K69321K87482L07544L29004L53883L83819M16877
55977H989364M51092M89003N34381N86633O43564P07296P81535Q65369R56947
$$ y = [1452859, 1471416, 1490549, 1510789, 1532214, 1554286, 1576847, 1600402, 1625071, 1650207, 1675495, 1701601, 1729209, 1758060, 1787412, 1816852, 1846313, 1875979, 1906534, 1938969, 1973848, 2011232, 2051341, 2094525, 2140460, 2188215, 2237260, 2287697, 2339338, 2391418, 2443361, 2495030, 2546226, 2596903, 2647982, 2701010, 2757009, 2816571, 2880833, 2950960, 3026586, 3106185, 3189036, 3275432, 3364985, 3456577, 3550295, 3647627, 3749285, 3854695, 3964189, 4079708, 4202562, 4332381, 4469263, 4615039, 4771250, 4937595, 5113492, 5299534, 5496236, 5703011, 5919626, 6147310, 6387561, 6641434, 6910755, 7198237, 7505781, 7834785, 8188668, 8572487, 8989364, 9440456, 9929459, 10463840, 11050473, 11694037, 12401333, 13182868, 14048237, 15005184]
55968A5005184J061488J188135J340834J521035J737952K006864K339494K746423
55960B8947409L244762L848617M555924N365336O306797P436223Q807292J0486157
55952G8998517J2600567J5338337J8902034K3524131K9466157L6676641M4049571
55945B59555955M8973452M8102906L9309023K3398434M059094j4040268k7502178
55938C81856418l5240953l8029501l7407383l4843352l1404379k7737967k4170705
55931A53022178k0843206j7824434j5157638j2854608j0893730r239187p855963
55924E8353412o708319n757469m967388m308662l755255l283222k875201k522155
55916B4175741k218117j955642j727579j529907j360103j214339j087991r77592
$$ y = [15005184, 16066672, 17254807, 18595641, 20116676, 21854628, 23861492, 26200986, 28947409, 32192171, 36040788, 40596712, 45962048, 52268845, 59705068, 68512360, 78998517, 91599084, 106937421, 125839455, 149363586, 178829743, 215506384, 259555955, 308529407, 356632313, 395941336, 419339770, 423398864, 409358596, 381856418, 346615465, 308585964, 271178581, 236335229, 204930850, 177192883, 153022178, 132178972, 114354538, 99196900, 86342292, 75448562, 66209375, 58353412, 51645093, 45887624, 40920236, 36611574, 32856319, 29573097, 26697896, 24175741, 21957624, 20001982, 18274403, 16744496, 15384393, 14170054, 13082063, 12104471]
55908A2104471q80758p95303p19756o53694n96342n45748n00307m60006m24892
55899F527665l93357l63343l34589l08189k84445k62537k42010k23131k05876
55890C910188j89865j75290j62755j52097j42336j32866j23770j15054j06603
55881B609552r8793r2081q5959p9474p2888o7575o4013o1101n7879n4820n2772
55870A822197n1604n0572m9316m7805m5931m3781m1794m0062l7982l5012l1395
55859A346943k7653k3831j9681j5171j0494n796j203L040O528Q330O922J373p096
55846A262211j5412k0988k3360k3558k2707k1636k1000k0995k1330k1925k3231
55835A026069k5373k7491k8470k8197k7560k7335k7347k6674k4647k1727j9267
$$ y = [12104471, 11223713, 10428410, 9708654, 9054960, 8458618, 7912870, 7412563, 6952557, 6527665, 6134308, 5770965, 5436376, 5128187, 4843742, 4581205, 4339195, 4116064, 3910188, 3720323, 3545033, 3382278, 3230181, 3087845, 2954979, 2831209, 2716155, 2609552, 2510759, 2418678, 2332719, 2253245, 2180357, 2112782, 2048769, 1987668, 1929789, 1874969, 1822197, 1770593, 1720021, 1670705, 1622900, 1576969, 1533188, 1491394, 1451332, 1413350, 1378338, 1346943, 1319290, 1295459, 1275778, 1260607, 1250113, 1244317, 1243114, 1246154, 1252682, 1261012, 1267934, 1269307, 1262211, 1246799, 1225811, 1202451, 1178893, 1156186, 1134550, 1113550, 1092555, 1071225, 1049300, 1026069, 1000696, 973205, 944735, 916538, 888978, 861643, 834296, 807622, 782975, 761248, 741981]
55824G41981j8156j7868j7337j6442j5917j5967j5948j5451j4714j3716j1878
55813E68587r136o413m502l192j902n93N67J702K843L524L286K258Q73m96j457
55798E55949j808k122l367n624p884r478j0834j2375j3608j3941j3661j3296j2795
55785D35156j2021j1370j1065j0474q996p016n215l411j143J056J933Q59j819
55772C66474n463r287j2163j3199j2635j1490j0465r602q744p681o120m210k857
55759B52558k851l795m520m473m092m006m365m849m883m014k536j406j179j381
55745B04208j389j390j806k339k429k271k473k941l009k560k110j832j261q8J364
55730A77674K539K985K456J136l31j481k506l591m265m082l573l624m120m093
$$ y = [741981, 723825, 705957, 688620, 672178, 656261, 640294, 624346, 608895, 594181, 580465, 568587, 559451, 553038, 548536, 545344, 543442, 542849, 543416, 545118, 547961, 551485, 554771, 557029, 557902, 557406, 555949, 554141, 552019, 548652, 543028, 535144, 525666, 514832, 502457, 488849, 474908, 461247, 447951, 435156, 423135, 411765, 400700, 390226, 381230, 374214, 368999, 365588, 364445, 365501, 367434, 368293, 366474, 361011, 351724, 339561, 326362, 313727, 302237, 291772, 282170, 273426, 265745, 259625, 255415, 252558, 249707, 245912, 241392, 236919, 232827, 228821, 224456, 219607, 214724, 210710, 208174, 206768, 205589, 204208, 202819, 201429, 199623, 197284, 194855, 192584, 190111, 187170, 184161, 181601, 179491, 177659, 176398, 176310, 177674, 180213, 183198, 185654, 186790, 186459, 184978, 182472, 178881, 174616, 170534, 166961, 163337, 159217, 155124]
55716A55124l183k019j192o15r1L06N77J001J803L028M688O597Q227R216R866
55701A93333J0494J0585R358P051M838L490K869K656K679K553J825O57l60j153
55687B50875k180l476m454m805m788m493l563j964k48J158K313L220L528L083
55673B34206K184J140N5q40j281j384j421j201m57L13L62jL07J337J838J180L50
55656B36687M13J012J194Q76N68L75L0n41j443l062n384p560q778r148r169q945
55640A87125q541q424q735q698p664o283n671n822n835n459n269n429n364m703
55626I5228l687k544j323m90p13j806k627k512k051k033k258j982j089j70L94
55611G0337P80J216J515J274L42r21j819j861j232o98q25j391j668j279o13l79
$$ y = [155124, 151941, 149922, 148730, 148115, 148024, 148330, 148907, 149908, 151711, 154739, 159427, 166024, 174251, 183467, 193333, 203827, 214412, 223770, 230821, 235659, 239149, 242018, 244674, 247353, 249906, 251731, 252388, 252028, 250875, 248695, 245219, 240765, 235960, 231172, 226679, 223116, 221152, 220904, 222062, 224375, 227595, 231123, 234206, 236390, 237530, 237585, 236745, 235464, 234080, 232659, 231458, 231001, 231314, 231676, 231675, 231982, 233319, 235157, 236337, 236687, 237100, 238112, 239306, 240182, 240750, 241125, 241155, 240614, 239171, 236109, 230725, 223165, 214387, 205239, 196070, 187125, 178584, 170160, 161425, 152727, 145063, 138780, 133109, 127287, 121452, 115993, 110724, 105295, 99931, 95228, 91541, 88997, 87674, 87184, 86471, 84665, 82038, 79526, 77475, 75442, 73184, 71202, 70113, 69943, 70337, 71117, 72333, 73848, 75122, 75464, 74543, 72724, 70863, 69631, 68933, 68108, 66717, 65049, 63770, 63157, 62778]
55595F2778q29j532j874j637j059m04K32P71J028R23O45M11J86j88n99o54j67
55578E8031N21Q39O30L12L23N55N85M23O34J555K753L545L854M060M215L952L204
55561H9991K435J910J279K07r52j505j315r29q67j058j059o57j10J60J7l73q57
55544H6317j370j623j159l7R51J195J107J425J934J754Q92N44J502L027L788L379
55528A03626K368J337N01j15o68j521k777l980m654m937n304n780n877n273m253
55513F2693l490l462m010m396m013l075k282j804j181k56M33N38M79O69Q38O82
55497C8363N25N86J83j390l533m897n010m533m035l533l208l422B293i87j514
55482b501M69e79G81R52Q08R82J292J512J515J435J468J427R83L51J60N01P49
$$ y = [62778, 61949, 60417, 58543, 56906, 55847, 55443, 55675, 56446, 57474, 58397, 59042, 59453, 59639, 59451, 58852, 58198, 58031, 58552, 59391, 60021, 60333, 60656, 61211, 61796, 62219, 62853, 64408, 67161, 70706, 74560, 78620, 82835, 86787, 89991, 92426, 94336, 95615, 95822, 94870, 93365, 92050, 91121, 90254, 89196, 88137, 87480, 87370, 87530, 87547, 87174, 86317, 84947, 83324, 82165, 82128, 83079, 84274, 85381, 86806, 88740, 90494, 91386, 91930, 93432, 96459, 100247, 103626, 105994, 107331, 107832, 107717, 107049, 105528, 102751, 98771, 94117, 89180, 83876, 78096, 72219, 66946, 62693, 59203, 55741, 51731, 47335, 43322, 40247, 37965, 36161, 34980, 34724, 35157, 35695, 36174, 36843, 37681, 38363, 38888, 39474, 39657, 38267, 34734, 29837, 24827, 20294, 16259, 12726, 9518, 6096, 2293, -987, -2501, -2032, -579, 781, 1733, 2541, 3523, 4815, 6327, 7842, 9277, 10745, 12172, 13155, 13506, 13666, 14167, 14916]
55465A4916O03N87J107J637J526J041R40J268J380R90N01K63J34o8k05q2J73K90
55447B7001K16J93M37P72O39l51j784k640k304j157qP48J133J183R70P70P12M58
55429B6988k22p85m94M45J019P71K48m3l41q81j195q51l63n16j113j195m91J40
55411B1121o8p82j095o04L61J285J914K309K712L209L468L016J904P74R7l88j110
55394C8123j885k119j659r48l68N6K57j9o80j064p31k26m70j465k151j727o57
55377B2267n1l15q27q52l68J11J83j71p49j275j466j198o47j37J39J93O4k39o32
55358A4030r13q49k46R20K237K839K108M30j022j420r63l38J29N37R34J201J281
55341B0895J186Q74L96P1J97N66O21Q9p57j472j851j918j778j548j266q05l3Q79
$$ y = [14916, 15519, 16106, 17213, 18850, 20376, 21417, 22357, 23625, 25005, 25995, 26496, 26759, 26893, 26825, 26620, 26538, 26711, 27001, 27217, 27410, 27847, 28619, 29258, 28907, 27123, 24483, 22179, 21022, 21014, 21762, 22895, 24078, 25048, 25818, 26530, 26988, 26766, 25981, 25487, 25932, 26951, 27722, 27970, 27927, 27586, 26705, 25510, 24659, 24296, 23780, 22667, 21472, 20981, 21121, 21053, 20271, 19176, 18572, 18933, 20218, 22132, 24441, 27153, 30362, 33830, 36846, 38750, 39524, 39621, 39233, 38123, 36238, 34119, 32460, 31512, 31144, 31200, 31457, 31438, 30758, 29694, 28963, 28737, 28267, 26802, 24651, 22924, 22267, 22216, 21901, 21074, 20222, 19854, 19965, 20148, 19977, 19228, 17953, 16487, 15289, 14642, 14505, 14644, 14837, 14901, 14662, 14030, 13117, 12268, 12022, 12942, 15179, 18018, 20126, 20556, 19534, 18114, 17151, 16813, 16942, 17479, 18413, 19614, 20895, 22081, 22955, 23351, 23422, 23619, 24185, 24806, 24895, 24138, 22666, 20815, 18897, 17119, 15571, 14305, 13500, 13467, 14346]
55323A4346J446J319O42m0k45J0K09q4o24o74J2P58P99K80nK76O84P81O52N89
55303B1131O61Q08R78R86N44l23j134j373q99L4R82J515J458J035N54P7l73n09
55285B6152j10M89Q24J045J533J917J373J04n54J8P05J79j280k380k591k362k002
55268B3060j314l42M32P38P19M97Q3k42o2N51J054J124Q66L81l10r23j045p53
55250B4514n58o04m49J28O26M90p4l37L0N40M34m06j154q39M13J268P38n31j052
55231B3177l61O84J322J647J800J401L42o14p34k99m4j6K28O36O19M2n40o68m72
55212B8150k20J04N24Q29Q72P95P26N41J59j62j44P0J32O2J91N13N53N5n87q27
55192C2336o89o13p25o77j89N39J086J186Q13J83k90l46k98o70j391j736j332
$$ y = [14346, 15792, 17111, 17753, 17713, 17468, 17478, 17687, 17603, 16979, 16305, 16317, 17075, 17874, 18154, 18149, 18425, 19109, 19890, 20542, 21131, 21792, 22600, 23578, 24564, 25108, 24785, 23651, 22278, 21379, 21413, 22395, 23910, 25368, 26403, 26957, 27034, 26661, 26152, 26042, 26531, 27355, 28400, 29933, 31850, 33223, 33327, 32773, 32791, 33496, 33675, 32395, 30015, 27424, 25062, 23060, 21746, 21404, 21836, 22574, 23293, 23790, 23873, 23631, 23569, 24120, 25174, 26298, 27164, 27545, 27235, 26312, 25267, 24514, 23956, 23352, 22903, 23031, 23657, 24147, 24073, 23736, 23766, 24306, 24740, 24334, 23180, 22341, 22754, 24022, 24760, 24229, 23177, 22816, 23500, 24822, 26469, 28269, 29670, 30012, 29398, 28664, 28365, 28321, 28305, 28533, 29169, 29788, 29830, 29290, 28622, 28150, 27930, 28034, 28558, 29387, 30259, 31054, 31780, 32321, 32480, 32318, 32174, 32244, 32376, 32438, 32629, 33142, 33695, 33750, 33163, 32336, 31647, 31034, 30309, 29632, 29443, 29982, 31068, 32254, 33067, 33250, 32960, 32614, 32316, 31646, 30255, 28519, 27187]
55175B7187p16n60p50p56n32m34m87l35J37O69J101J425J444R08L5o12q34q54
55157B6036p34k91K95M73J13k43k38j73l73n80m51j74j27k69k75k4L82Q00R20
55138B5067L87n91j158p95oM74P00J061J207M15r97j590m72J591L125L495L129
55121C5042K612K089J501R77P17O45L74l03r95j050m01K74M32L41M56N80K78j62
55103D3407QP16R61K99l27K05J637K657K437J278kp99q67l31L05N61M52L66M65
55084E3428N83N98N75M90K51L3J56N52P51O31O47J017J140L95q02j333p49L33
55066E8696J170J578J560Q84l85j473j549p03K12O31P06O98M69j95j111j764j770
55049E7654j121j93M31K88m92j163j043k07N73O32L1n55m96K57J186J658J416
$$ y = [27187, 26471, 25911, 25161, 24405, 23873, 23439, 22952, 22617, 22754, 23423, 24524, 25949, 27393, 28301, 28336, 27724, 26890, 26036, 25302, 25011, 25306, 25779, 25892, 25649, 25411, 25238, 24865, 24285, 23834, 23660, 23533, 23264, 22989, 22965, 23347, 24147, 25067, 25454, 24863, 23705, 22910, 22904, 23378, 24078, 25139, 26346, 26761, 25764, 24174, 23702, 25293, 28418, 31913, 35042, 37654, 39743, 41244, 42221, 42938, 43583, 43957, 43654, 42659, 41609, 41208, 41482, 41914, 42255, 42711, 43291, 43569, 43407, 43415, 44131, 45092, 45391, 45064, 45269, 46906, 49563, 52000, 53278, 53276, 52477, 51610, 51279, 51584, 52145, 52597, 52963, 53428, 54011, 54609, 55184, 55674, 55925, 55958, 56114, 56666, 57417, 58048, 58695, 59712, 60852, 61247, 60445, 59112, 58363, 58696, 59866, 61444, 63004, 63888, 63503, 62030, 60481, 59778, 59990, 60621, 61327, 62025, 62494, 62299, 61188, 59424, 57654, 56533, 56340, 56771, 57059, 56567, 55404, 54361, 54154, 54727, 55359, 55390, 54835, 54339, 54596, 55782, 57440, 58856]
55032E8856O77j48p59r89p56j31N12O92K60m10p90p09m05j28O6J54P2p3kL46O47
55011E6982P05Q39J301J577R47l13r90m82L97N44n3o19p55o50m42j48l7l94q91
54992E7518q86l08K63M37L45J60n1P9R15J951K030Q48n09r86q07o88n29J76J105
54973F1063J296N48k32k34M43J279J960K252J897J123Q42J782L531M837M988M577
54957I1952M749N843P044P463P310P702R370J1971J4603J6497J6977J5425J1943
54944B28849P738M110J083k373o724j1044j3952j4863j4150j2546j0827r623r062
54931A36616q666p912o851n916n279m701m012l389l039k798k247j184J26J229
54917H1977J953K555L356M304N020N268N366N980P512R674J1727J3123J3855J4094
$$ y = [58856, 59533, 59385, 58626, 57637, 56881, 56750, 57262, 57954, 58214, 57804, 57014, 56305, 55900, 55772, 55838, 55992, 56064, 55991, 55989, 56335, 56982, 57687, 58526, 59827, 61404, 62351, 62038, 61048, 60566, 60963, 61507, 61454, 60835, 60080, 59430, 58988, 58840, 58803, 58409, 57518, 56632, 56324, 56587, 57024, 57369, 57529, 57478, 57557, 58472, 60423, 62453, 63301, 62792, 61806, 60999, 60311, 59782, 59958, 61063, 62359, 62907, 62675, 62441, 62884, 64163, 66123, 68375, 70272, 71395, 72237, 74019, 77550, 82387, 87375, 91952, 96701, 102544, 109588, 117051, 124361, 132063, 141433, 153404, 168007, 184504, 201481, 216906, 228849, 236587, 240697, 241780, 239407, 232683, 221639, 207687, 192824, 178674, 166128, 155301, 145678, 136616, 127950, 120038, 113187, 107271, 101992, 97291, 93279, 89890, 86851, 84053, 81806, 80622, 80748, 81977, 83930, 86485, 89841, 94145, 99165, 104433, 109799, 115779, 123291, 132965, 144692, 157815, 171670, 185764]
54903A85764J3672J2118R262N538J544k415o230r570j1927j2994j2885j1992j0809
54890A49076r797r201q884q518p888o977n865m680l586k656j839j166q20q14q38
54875G5547o64n13o89r85r36o19o69j388k239k460j885r58k69j84o39j124j048
54858E8278l96K60M18J51k02m51n14l06L6O2m87j283j805j869j557q81L8P26P69
54839E0987L70L4j42l64m93j60M80Q06P10P88J293J560J062M29O67J673K362K154
54821F4216J547J132P72J79l37j89O41J545J960J799J357J046J158J606J930J833
54805H2195J676K203L671N536O979P656P908Q445R761J1668J3365J4122J3924
54792A89109J3302J2530J1293R156O100K471j310m769p437r156j0177j0702j0585
$$ y = [185764, 199436, 211554, 220816, 226354, 227898, 225483, 219253, 209683, 197756, 184762, 171877, 159885, 149076, 139279, 130078, 121194, 112676, 104788, 97811, 91946, 87266, 83680, 81024, 79185, 78019, 77199, 76385, 75547, 74883, 74370, 73681, 72696, 71760, 71141, 70472, 69084, 66845, 64385, 62500, 61542, 61273, 61089, 60450, 59326, 58278, 57882, 58142, 58560, 58711, 58509, 58058, 57544, 57238, 57274, 57336, 56849, 55566, 53761, 51892, 50335, 49454, 49492, 50218, 50987, 51357, 51391, 51249, 50885, 50392, 50232, 50712, 51518, 52228, 53016, 54309, 55869, 56931, 57360, 58027, 59700, 62062, 64216, 65763, 66895, 67667, 67846, 67509, 67320, 67961, 69506, 71466, 73265, 74622, 75668, 76826, 78432, 80362, 82195, 83871, 86074, 89745, 95281, 102260, 109916, 117824, 126269, 136030, 147698, 161063, 175185, 189109, 202411, 214941, 226234, 235390, 241490, 243961, 242651, 237882, 230445, 221289, 211112, 200410, 189825]
54779A89825r736q607p820p407o889o097n416n003m365l012j270j9L20J44J37
54764A24785O08J392K143K672L126L867N062O490P819R004J0253J1711J3403J5269
54750B17604J6940J7608J6565J4056J1162Q699O495L909O13l306p549j1442j3995
54737B77359j4736j4311j3697j3032j1863j0471r882j0381j0829j0071q419p071
54725A42596o503o077n063l456j885j115j484k399k683j843p19l60o47p53n93
54710A07016p42j124r31j57M9q98k003k066j319p16l47L72J331J686J188N62M37
54693A02338O28O82N01K06j26l51k62Q1L36K89K5l28p24j012r87o18pP95J617
54674A03083J964J553R01Q62J526K230K632L025L455L428K893K696L415M348M472
$$ y = [189825, 180089, 171482, 163662, 156255, 149366, 143269, 137853, 132850, 128485, 125473, 124203, 124184, 124504, 124648, 124785, 125393, 126785, 128928, 131600, 134726, 138593, 143655, 150145, 157964, 166968, 177221, 188932, 202335, 217604, 234544, 252152, 268717, 282773, 293935, 302634, 309129, 313038, 313651, 310345, 302796, 291354, 277359, 262623, 248312, 234615, 221583, 209720, 199249, 189367, 178986, 168157, 158086, 149667, 142596, 136093, 130016, 124953, 121497, 119612, 118497, 117013, 114614, 111931, 110088, 109369, 109009, 108362, 107609, 107016, 106274, 105150, 104219, 104062, 104111, 103213, 101210, 99144, 97825, 97109, 96762, 97134, 98465, 100151, 101339, 101901, 102338, 102966, 103648, 104149, 104355, 104229, 103878, 103616, 103697, 104033, 104322, 104347, 104019, 103295, 102283, 101296, 100678, 100671, 101466, 103083, 105047, 106600, 107501, 108363, 109889, 112119, 114751, 117776, 121231, 124659, 127552, 130248, 133663, 138011, 142483]
54659A42483L897L495L415K994K061J370J437J805J894J884K195K581K486K077
54645A76074K214L336M917O118O635O696O741P308Q846J1159J3192J3850J2968
54632B80054J1142Q707N454J432k578n847q514j1145j3678j5293j5270j3694j1398
54619B09372r507q754q835q618p427n985n438n629n240l675j929j070p43M4J233
54604A37799J805J399Q69R84J356J099J10q78j351j581k085k897l565l741l460
54589A25863l001k685k775l242l581l214k278j629j745k070j845j235r82j215
54575I4366j441j593k138k947l027j923n04K26L86N66N80j22j163j442o39L57
54559G9542O54K43m33j034j289r84l32J14J42O5R8J2l12n06j84N10J120J404J423
$$ y = [142483, 146380, 149875, 153290, 156284, 158345, 159715, 161152, 162957, 164851, 166735, 168930, 171511, 173997, 176074, 178288, 181624, 186541, 192659, 199294, 205990, 212731, 220039, 228885, 240044, 253236, 267086, 280054, 291196, 299903, 305357, 306789, 304211, 298364, 289850, 278705, 265027, 249734, 234464, 220770, 209372, 199865, 191111, 182276, 173658, 166231, 160246, 154808, 149179, 143939, 140264, 138335, 137265, 136522, 136566, 137799, 139604, 141003, 141872, 142856, 144212, 145311, 145421, 144543, 143192, 141611, 139526, 136629, 133064, 129323, 125863, 122862, 120177, 117402, 114160, 110579, 107365, 105087, 103458, 101713, 99643, 97798, 96563, 95581, 94366, 92925, 91332, 89194, 86247, 83220, 81297, 80793, 81019, 81405, 81971, 82551, 82429, 81266, 79824, 79185, 79542, 80196, 80439, 80006, 78972, 77683, 76699, 76367, 76481, 76623, 76688, 76786, 76798, 76486, 75980, 75796, 76306, 77426, 78830, 80253]
54540H0253J364J447J694J752J332Q91J323K741M125M637M688N177O167P007P379
54525A31977P443P119O136M750L566K524Q44j712m226n733o301o551o605o204
54511A27027n451m772m280l777l294l064l034k913k709k653k569j966q76oK29
54496H5892K37M20M72R5k01K59J108J295O08m9J6M18N00L01K02K15J83L13Q85
54477I3169J668K208K567L169L962M335M001L372K880K397J714J105R76J151R94
54462A29668J87r12j763k132k097j918j967k525l346l654k859j277J01N34P6p48
54446A05368j508j980k015j644j236j292j999l079m026m337l691k228o62K28L75
54431G6274M37Q53J259J077M66J87N96J206J351R42L82K2l5J93N81Q13O18J59
$$ y = [80253, 81617, 83064, 84758, 86510, 87842, 88733, 90056, 92797, 96922, 101559, 106247, 111424, 117591, 124598, 131977, 139420, 146539, 152675, 157425, 160991, 163515, 164359, 162647, 158421, 152688, 146387, 139836, 133231, 127027, 121576, 116804, 112524, 108747, 105453, 102389, 99355, 96442, 93733, 91080, 88511, 86545, 85669, 85663, 85892, 86129, 86549, 87021, 87116, 86915, 87174, 88282, 89577, 90185, 90136, 90152, 90570, 91070, 91371, 91573, 91788, 91971, 92284, 93169, 94837, 97045, 99612, 102781, 106743, 111078, 115079, 118451, 121331, 123728, 125442, 126547, 127523, 128674, 129668, 129855, 128943, 127180, 125048, 122951, 121033, 119066, 116541, 113195, 109541, 106682, 105405, 105506, 106040, 106116, 105368, 103860, 101880, 99865, 98221, 96985, 95693, 93694, 90615, 86589, 82252, 78561, 76333, 75671, 75899, 76274, 76711, 77564, 78823, 79900, 80366, 80553, 81149, 82355, 83706, 84648, 85030, 85052, 85017, 85210, 85791, 86604, 87222, 87381]
54413H7381m3K68P24Q44O89P80J268J657J535J228J433K249L032L216K983K910
54397A12154L162L339L018K329J820J837K098K046J548J076J030J162R43K19p12
54382A37069j586k281k581k398k149k423l092l318k672j699j132j068j271j739
54368A07660k483l100l119k585j857j116m84k73m66m16L21J052O83o99j830j881
54352H9407j313q90o68k48N19J501K463K999K812K281K252K887L305K804J874
54337A11985J459J730K210K685L165L270K525J237K35l13j031k134k922k882k523
54322A18696k545k751k553k166k401l299l897l546k771k399k469k501k441k580
54308H0377k821k678k073j472j160q88m54n9J25K41L33J50l15n64l95l79r65j552
$$ y = [87381, 87338, 87606, 88330, 89174, 89863, 90643, 91911, 93568, 95103, 96331, 97764, 100013, 103045, 106261, 109244, 112154, 115316, 118655, 121673, 124002, 125822, 127659, 129757, 131803, 133351, 134427, 135457, 136619, 137562, 137781, 137069, 135483, 133202, 130621, 128223, 126074, 123651, 120559, 117241, 114569, 112870, 111738, 110670, 109399, 107660, 105177, 102077, 98958, 96373, 94516, 93400, 92916, 92643, 92177, 91761, 92082, 93134, 93817, 93118, 91288, 89407, 88094, 87204, 86536, 86288, 86807, 88308, 90771, 93770, 96582, 98863, 101115, 104002, 107307, 110111, 111985, 113444, 115174, 117384, 120069, 123234, 126504, 129029, 130266, 130501, 130188, 129157, 127023, 124101, 121219, 118696, 116151, 113400, 110847, 108681, 106280, 102981, 99084, 95538, 92767, 90368, 87899, 85398, 82957, 80377, 77556, 74878, 72805, 71333, 70173, 69285, 68831, 68772, 68897, 69138, 69471, 69621, 69306, 68742, 68347, 67968, 67003, 65451]
54290F5451j265l05L19K93K81O78J017Q72N25L65K37j03m73n72l85M4P29J322
54272F9030J181L45j70L98J414J650R07J24R8P46J531J996J852J102J73m34o13
54255H1330n43k84Q4J79k75q60q80l19J38J11q0j12j43l78o37o84n62l52O2O44
54235G6439R70O40j73r31j329j437j375j087n14J90P11Q37O87N30L93N4m71o83
54217G3451j91O24R97P59M57M63M91J58m35r18j060p30J34J154J497O85o59j363
54199G5514r58j04K87K6l17j58M64R71R21M95K26K87K90j62r74j678j918j689
54181G1523j210p21l21L3L25L82J14k66n18p16r73r38j50J035J564R64m2n68o27
54162F8890o88p24m27OQ9q4RL99N74M20L96O45O88L64L00Q77J382R38j32o70k81
$$ y = [65451, 64186, 63881, 64200, 64493, 64774, 65452, 66469, 67341, 67866, 68231, 68468, 68365, 67892, 67320, 66935, 66979, 67708, 69030, 70211, 70556, 70386, 70784, 72198, 73848, 74755, 74879, 74977, 75723, 77254, 79250, 81102, 82204, 82377, 81943, 81330, 80787, 80503, 80587, 80766, 80491, 79631, 78751, 78432, 78570, 78681, 78601, 78489, 78346, 77968, 77331, 76647, 76085, 75733, 75795, 76439, 77409, 78049, 77876, 76945, 75616, 74179, 72804, 71717, 71203, 71393, 72104, 72941, 73628, 74158, 74551, 74605, 74134, 73451, 73260, 73884, 74881, 75640, 76097, 76560, 77051, 77209, 76774, 75856, 74796, 74066, 74200, 75354, 76851, 77536, 76877, 75514, 74556, 74452, 74739, 74765, 74448, 74290, 74754, 75725, 76646, 77141, 77367, 77654, 77944, 77782, 76808, 75130, 73212, 71523, 70313, 69592, 69271, 69304, 69629, 70011, 70125, 69859, 69341, 68625, 67652, 66714, 66564, 67599, 69163, 70127, 70085, 69517, 68890, 68202, 67478, 67051, 67057, 67146, 67062, 67071, 67470, 68044, 68464, 68860, 69505, 70193, 70557, 70857, 71734, 73116, 74054, 73922, 73252, 72971]
54141G2971L17M85M60O14O32L1q55j118m41M22N17l18j459k220k322j870j185
54124F4661o21l36j44K02O19P08K26n91j249j438j207q23m35J8O17J091R83K71
54106F2552k88O4J057J605J126K18k24r9O8j4k03l67n16n38k52J89L28o9p21j091
54086F2825p59L45J712K375J669kj453j884j503j024q67r66j019p17MP73R78M08
54068F0895m76r89q04j25N58P99N60K78L58N98M91Q5O0P50J587J865J642J427
54050F9559J298R69N33N25J146J894K167J877J329Q61P37J118J799K194J861J131
54034I0998R29J843L450M674M843M279L788L779M038M270M469M648M589M144L578
54019A48319L288L204K808J838P56L68J015K163K792K256Q30n48j140r57n58m07
$$ y = [72971, 73288, 73773, 74233, 74847, 75479, 75510, 74655, 73537, 73096, 73518, 74035, 73717, 72258, 70038, 67716, 65846, 64661, 64040, 63704, 63560, 63762, 64381, 65089, 65315, 64724, 63475, 62037, 60830, 60007, 59572, 59590, 60207, 61298, 62281, 62552, 62264, 62328, 63385, 64990, 66116, 66334, 66110, 66011, 66079, 66065, 65862, 65495, 64979, 64441, 64189, 64378, 64706, 64637, 63916, 62825, 62066, 62411, 64123, 66498, 68167, 68165, 66712, 64828, 63325, 62301, 61434, 60468, 59449, 58732, 58736, 59509, 60487, 60895, 60419, 59430, 58626, 58501, 59059, 59858, 60418, 60696, 61054, 61652, 62143, 62228, 62288, 63038, 64625, 66490, 68132, 69559, 70857, 71826, 72359, 72884, 74030, 75924, 78091, 79968, 81297, 82158, 82895, 84013, 85812, 88006, 89867, 90998, 91927, 93770, 97220, 101894, 106737, 111016, 114804, 118583, 122621, 126891, 131360, 136008, 140597, 144741, 148319, 151607, 154811, 157619, 159457, 160213, 160581, 161596, 163759, 166551, 168807, 169637, 169089, 167949, 166992, 166434, 166027]
54003A66027n10n73m88n56j148k079k546k063j228j092j847k684k984k924k666
53988A40639j796k20J005O97q39k042j953j104n35o84j399k387l232l415k776
53973A19959j775j054q48r11q29l43M45J118J350J194Q29K42n58j202j302r50
53957A15365m05M64J737K670K246P12l52J10J462K414K569K404K330K464K906
53942A39096L575M084M264M538N275O114O455O305O100N958N692N272M758L887
53928B11373K415O52q17j877k791l547l824l543k906j976p71L75J090J525K067
53913A97445K640K865K824K945L213L270L304L938N027N534M967M128L910M040
53899B50050L673K665J557O47j91r87j561j921k275k673k936k998l058l369l948
$$ y = [166027, 165517, 164944, 164456, 163900, 162752, 160673, 158127, 156064, 154836, 153744, 151897, 149213, 146229, 143305, 140639, 138843, 138623, 139628, 140325, 139486, 137444, 135491, 134387, 133852, 133168, 131769, 129382, 126150, 122735, 119959, 118184, 117130, 116282, 115371, 114542, 114199, 114644, 115762, 117112, 118306, 119135, 119377, 118819, 117617, 116315, 115365, 114960, 115424, 117161, 119831, 122077, 122789, 122437, 122547, 124009, 126423, 128992, 131396, 133726, 136190, 139096, 142671, 146755, 151019, 155557, 160832, 166946, 173401, 179706, 185806, 191764, 197456, 202728, 207486, 211373, 213788, 214440, 213623, 211746, 208955, 205408, 201584, 198041, 195135, 193159, 192388, 192763, 193853, 195378, 197445, 200085, 202950, 205774, 208719, 211932, 215202, 218506, 222444, 227471, 233005, 237972, 242100, 246010, 250050, 253723, 256388, 257945, 258592, 258401, 257414, 255853, 253932, 251657, 248984, 246048, 243050, 239992, 236623, 232675]
53884B32675m513m713m630m856n648o187n433l773k950l881n409n804m908l855
53870A66115l286k900k575k777l592m320m378m028l788l679l416l009k696k531
53856A19140k322j973j634j570j862k163j871q22K24K25r68k354k827k238j251
53841I5734n49l30l90l70l9M87Q41P39J86n76j127j027k79M07L02l18l93N01J482
53822I5281J564Q94L17R1j11k48J36R34J318Q99M06P02J577K075J707R17M01M50
53804A09310R38J570K062K276K257K094J913J974K533L411M036M147M167M482
53790A47170M701M239L370K915K962K662J560L16k60k52j85r1K79P27P85M85K85
53773A71668L18K05l51j250k197k880l005k585k139k164k520k731k710k727k757
$$ y = [232675, 228162, 223449, 218819, 213963, 208315, 202128, 196695, 192922, 189972, 186091, 180682, 174878, 169970, 166115, 162829, 159929, 157354, 154577, 150985, 146665, 142287, 138259, 134471, 130792, 127376, 124367, 121671, 119140, 116818, 114845, 113211, 111641, 109779, 107616, 105745, 104923, 105147, 105372, 104404, 102050, 99223, 96985, 95734, 95185, 94855, 94465, 94095, 94056, 94543, 95384, 96123, 96309, 95733, 94606, 93579, 93300, 93707, 94009, 93691, 93298, 93799, 95281, 96845, 97739, 98056, 98147, 98036, 97788, 97924, 98858, 100176, 101075, 101481, 102183, 103760, 105835, 107542, 108459, 108860, 109310, 110248, 111818, 113880, 116156, 118413, 120507, 122420, 124394, 126927, 130338, 134374, 138521, 142688, 147170, 151871, 156110, 159480, 162395, 165357, 168019, 169579, 169895, 169635, 169383, 169198, 169107, 169386, 170113, 170898, 171383, 171668, 171986, 172191, 171840, 170590, 168393, 165513, 162508, 159923, 157784, 155620, 153100, 150369, 147659, 144932, 142175]
53758A42175k491j930j380q47j24N11M45k77q79r59r25r80n81M84J293Q61m36
53741A33960j360j329p21%O01O73j29j348j984j643r46n49l89j22K16L40K30J45
53723A25645K83O49J123J486J546J341J191J392J809J890J167j35j121j082l10
53708A36874K61K51J94N89J084J025L86l27p71q39l20Q52K152K863K954K963L062
53691A53253K821K041J196Q46R50J078R80P98Q46J234J634J616J337J550K484
53676A74664L179K643J398R19J624K361K133J291O63M13L42N78J165J559J279
53661A96211P12N42O84M94j56p69j074j328j705j970j883j527j074n96k24k27
53645A86110p91j774k717l020k349j068o9J14r5J14R29J762K020J623Q88K04q8
$$ y = [142175, 139684, 137754, 136374, 135527, 135403, 135914, 136359, 136082, 135203, 134244, 133319, 132339, 131758, 132242, 133535, 134396, 133960, 132600, 131271, 130550, 130550, 131151, 131824, 131695, 130347, 128363, 126720, 125774, 125225, 124836, 124714, 124930, 125270, 125500, 125645, 125928, 126577, 127700, 129186, 130732, 132073, 133264, 134656, 136465, 138355, 139522, 139387, 138266, 137184, 136874, 137135, 137386, 137580, 138169, 139253, 140278, 140664, 140337, 139566, 138727, 138407, 139259, 141411, 144274, 147228, 150191, 153253, 156074, 158115, 159311, 160157, 161107, 162185, 163165, 163963, 164809, 166043, 167677, 169293, 170630, 172180, 174664, 177843, 180486, 181884, 182803, 184427, 186788, 188921, 190212, 190875, 191288, 191630, 192208, 193373, 194932, 196211, 196923, 197465, 198149, 198643, 198487, 197718, 196644, 195316, 193611, 191641, 189758, 188231, 187157, 186561, 186337, 186110, 185319, 183545, 180828, 177808, 175459, 174391, 174322, 174436, 174341, 174455, 175384, 177146, 179166, 180789, 181677, 181881, 181793]
53628A81793J15N59Q24P86O96Q20J105J228R69N49O05J553K915L567K992J932
53612B03008J472J739J980J742J428J638K452L460M153M152L480K688K460K912
53598B38764L564M037M381M642M531L888L143K886L120L295L087K841L080L742
53584B89001M119L642K644K084K332K573J813L79k76N80J944K383J877J556J841
53569C18492J866R48k15m50K95R95R85N95L62L21K85L52O69J079J298J279J127
53552C30283R20Q23J159J983K836L280L454L705L876L537K786K238K201K401K581
53537C68063K864L281L516L347K998K752K548K171J662J324J583K773M729O484
53523D10095O899N842M419L864M506N857P190Q003Q427R290J1086J2859J3028
$$ y = [181793, 181908, 182467, 183291, 184077, 184773, 185593, 186698, 187926, 188895, 189444, 190049, 191602, 194517, 198084, 201076, 203008, 204480, 206219, 208199, 209941, 211369, 213007, 215459, 218919, 223072, 227224, 230704, 233392, 235852, 238764, 242328, 246365, 250746, 255388, 259919, 263807, 266950, 269836, 272956, 276251, 279338, 282179, 285259, 289001, 293120, 296762, 299406, 301490, 303822, 306395, 308208, 308587, 308311, 308891, 310835, 313218, 315095, 316651, 318492, 320358, 321306, 321091, 320641, 320936, 321931, 322916, 323511, 323873, 324194, 324479, 324831, 325500, 326579, 327877, 329156, 330283, 331203, 332026, 333185, 335168, 338004, 341284, 344738, 348443, 352319, 355856, 358642, 360880, 363081, 365482, 368063, 370927, 374208, 377724, 381071, 384069, 386821, 389369, 391540, 393202, 394526, 396109, 398882, 403611, 410095, 416994, 422836, 427255, 431119, 435625, 441482, 448672, 456675, 465102, 474392, 485478, 498337, 511365]
53510E11365J1563J0314J0655J1872J2706J3311J4485J5876J6528J6718J7621
53499F63014J9257K0324K0300K0252K1143K2520K3426K3584K3206K2490K1850
53488I01366K1835K2275K2255K1437K0646K0700K1318K1732K1639K1075K0069
53477A136347J9063J8885J9601K0092J9541J8661J8516J8807J8423J7258J6270
53466A341464J5892J5492J4489J3031J1427R802Q394P401O349M467J942q6j135
53453A448929k157m155o710q692r958j1403j3397j5032j5300j4552j4190j5057
53441A318326j6590j7737j8325j9023k0142k1059k1074k0358j9674j9452j9606
53430A105286j9901k0062j9699j8577j6937j5116j3043j0603q248o657n837n220
$$ y = [511365, 522928, 533242, 543897, 555769, 568475, 581786, 596271, 612147, 628675, 645393, 663014, 682271, 702595, 722895, 743147, 764290, 786810, 810236, 833820, 857026, 879516, 901366, 923201, 945476, 967731, 989168, 1009814, 1030514, 1051832, 1073564, 1095203, 1116278, 1136347, 1155410, 1174295, 1193896, 1213988, 1233529, 1252190, 1270706, 1289513, 1307936, 1325194, 1341464, 1357356, 1372848, 1387337, 1400368, 1411795, 1421597, 1429991, 1437392, 1443741, 1448208, 1450150, 1450064, 1448929, 1446772, 1442617, 1435907, 1427215, 1417257, 1405854, 1392457, 1377425, 1362125, 1347573, 1333383, 1318326, 1301736, 1283999, 1265674, 1246651, 1226509, 1205450, 1184376, 1164018, 1144344, 1124892, 1105286, 1085385, 1065323, 1045624, 1027047, 1010110, 994994, 981951, 971348, 963100, 956443, 950606, 945386]
53418I45386m625m419m595m398l264j556K9J329K586L876N097O249P373Q465R665
53403I67198J1208J2937J4278J5029J5766J7032J8557J9850K1131K2985K5308
53392A161279K7394K8986L0483L2046L3354L4401L5793L7766L9598M0616M1300
53381A543016M2645M4724M6625M7730M8320M8760M8836M8224M7166M6175M5339
53370B057560M4394M3257M2026M0492L8178L4995L1410K7820K4085K0023J6032
53359B420272J2681R759O233J421m112r075j2817j5860j9075k2656k6048k8751
53347B311972l0826l2525l3835l4741l5702l7367l9613m1368m1686m0722l9354
53336A904233l8149l7100l6189l5596l5272l4824l4025l3123l2385l1641l0530
$$ y = [945386, 940761, 936342, 931747, 927349, 924085, 922529, 922558, 923887, 926473, 930349, 935446, 941695, 949068, 957533, 967198, 978406, 991343, 1005621, 1020650, 1036416, 1053448, 1072005, 1091855, 1112986, 1135971, 1161279, 1188673, 1217659, 1248142, 1280188, 1313542, 1347943, 1383736, 1421502, 1461100, 1501716, 1543016, 1585661, 1630385, 1677010, 1724740, 1773060, 1821820, 1870656, 1918880, 1966046, 2012221, 2057560, 2101954, 2145211, 2187237, 2227729, 2265907, 2300902, 2332312, 2360132, 2384217, 2404240, 2420272, 2432953, 2442712, 2448945, 2450366, 2446254, 2437179, 2424362, 2408502, 2389427, 2366771, 2340723, 2311972, 2281146, 2248621, 2214786, 2180045, 2144343, 2106976, 2067363, 2025995, 1984309, 1943587, 1904233, 1866084, 1828984, 1792795, 1757199, 1721927, 1687103, 1653078, 1619955, 1587570, 1555929, 1525399]
53325A525399k9010k7354k5845k4582k3551k2635k1627k0366j8744j6632j4034
53314A281019j1505j0090j0470j2208j4103j5224j5454j5081j4269j2990j1274
53303A138351r435q049p573p751p547o019l359p73P88J534K256L205L934M214
53289A103776M587N774P765R833J1424J2672J3991J5517J7163J8974K0997K2846
53277A265319K3816K3609K2684K1775K1231K0952K0656K0034J8869J7271J5662
53266A491878J4271J2777J0721Q070N221K562L81j076j832k469l693n623p789
53253A523399r748j1308j2355j2962j3744j5338j7417j8830j9122j9147j9741
53242A353687k0466k0468k0037k0305k1443k2207k1497j9695j8008j7104j6763
$$ y = [1525399, 1496389, 1469035, 1443190, 1418608, 1395057, 1372422, 1350795, 1330429, 1311685, 1295053, 1281019, 1269514, 1259424, 1248954, 1236746, 1222643, 1207419, 1191965, 1176884, 1162615, 1149625, 1138351, 1128916, 1120867, 1113294, 1105543, 1097996, 1091977, 1088618, 1087845, 1088633, 1090167, 1092423, 1095628, 1099562, 1103776, 1108363, 1114137, 1121902, 1131735, 1143159, 1155831, 1169822, 1185339, 1202502, 1221476, 1242473, 1265319, 1289135, 1312744, 1335428, 1357203, 1378434, 1399386, 1420042, 1440076, 1458945, 1476216, 1491878, 1506149, 1518926, 1529647, 1537717, 1542938, 1545500, 1545881, 1544805, 1542973, 1540504, 1536811, 1531188, 1523399, 1513651, 1502343, 1489988, 1477026, 1463282, 1447944, 1430527, 1411697, 1392575, 1373428, 1353687, 1333221, 1312753, 1292716, 1272411, 1250968, 1228761, 1207264, 1187569, 1169561, 1152457, 1135694]
53231A135694j6507j6090j5544j5090j4919j4879j4628j4120j3746j3741j3771
53220I72659j3374j2537j1520j0380r069p836p086o792o532o148n968o295p020
53207H62102p936r112j0578j1967j2824j3198j3609j4352j5073j5181j4546j3642
53195G10084j3080j3020j3048j2629j1712j0829j0535j0835j1321j1808j2530
53184E78737j3541j4320j4253j3449j2628j2216j1934j1455j1073j1329j2131
53173D40408j2721j2550j1786j0885r994r020q103p569p424p181o376n187m340
53160C27272m294m722m907m627m375m662n344n853n849n398m702l979l549l585
53146B61426l791l668l204k803k577k175j505j041j073j232j150j194j828k628
$$ y = [1135694, 1119187, 1103097, 1087553, 1072463, 1057544, 1042665, 1028037, 1013917, 1000171, 986430, 972659, 959285, 946748, 935228, 924848, 915779, 907943, 900857, 894065, 887533, 881385, 875417, 869122, 862102, 854166, 845054, 834476, 822509, 809685, 796487, 782878, 768526, 753453, 738272, 723726, 710084, 697004, 683984, 670936, 658307, 646595, 635766, 625231, 614396, 603075, 591267, 578737, 565196, 550876, 536623, 523174, 510546, 498330, 486396, 474941, 463868, 452539, 440408, 427687, 415137, 403351, 392466, 382472, 373452, 365349, 357780, 350356, 343175, 336799, 331612, 327272, 322978, 318256, 313349, 308722, 304347, 299685, 294341, 288488, 282639, 277241, 272539, 268560, 265011, 261426, 257635, 253967, 250763, 247960, 245383, 243208, 241703, 240662, 239589, 238357, 237207, 236013, 234185, 231557]
53132B31557k647j654l58N51R86J069Q66O61Q68J445J901K086K403K971L181K538
53116B48424J434N55o2q33j846k834l711m513m961m704m025l650l798l895l492
53101B08089k936k905l525m269m562m270l719l346l275l164k636j828j275j304
53087A65075j725k150k343k224j867j570j602j726j355m35K63N6p41j263j243
53072A45150j138j196j068n18L2K7m36q27r64j118j425j619j471j128p77l17L41
53055A31548Q60P87K35j39K1L11J89k60m85k86o5k67q49j412j568j121j81P45
53037A28063R84L48n51r03o14l21m79p25l95N13J235J085K46m48l68L57J019R61
53019A30007J12r34j387r50j14L67K79Q4K05M32K31m38r19n66M77J403J608J236
$$ y = [231557, 228910, 227256, 226898, 227449, 228435, 229504, 230370, 231031, 231899, 233344, 235245, 237331, 239734, 242705, 245886, 248424, 249858, 250413, 250351, 249518, 247672, 244838, 241127, 236614, 231653, 226949, 222924, 219274, 215476, 211581, 208089, 205153, 202248, 198723, 194454, 189892, 185622, 181903, 178557, 175282, 172118, 169482, 167654, 166379, 165075, 163350, 161200, 158857, 156633, 154766, 153196, 151594, 149868, 148513, 148078, 148341, 148397, 147656, 146393, 145150, 144012, 142816, 141748, 141230, 141262, 141289, 140853, 140026, 139062, 137944, 136519, 134900, 133429, 132301, 131524, 131207, 131548, 132408, 133195, 133430, 133291, 133312, 133623, 133812, 133552, 133067, 132781, 132716, 132449, 131600, 130188, 128620, 127499, 127318, 128063, 129047, 129395, 128844, 127941, 127327, 127006, 126527, 125802, 125407, 125920, 127155, 128240, 128486, 128038, 127670, 128027, 129046, 130007, 130119, 129185, 127798, 126848, 126734, 127101, 127380, 127464, 127669, 128101, 128332, 127894, 126975, 126409, 126886, 128289, 129897, 131133]
53001A31133Q44O88N71L83L42N95Q12N86R3r6J64M09K94P2J12L23L97L45L98O57
52981A39122J138J949L015L834L984L759L792M181M466M415M257M040L447K386
52967A87785J239K56p63j864k580k566k181j919j636r10M7N12K15l93q18r72q73
52950A72579m10L24Q04N36l39j115j180o09n1m4m27n68k02K23J64l33q12r71p61
52931A66808j49O97J190R21L32L10R42J355R52J82k07j40N8L67Q37J018M09n93
52913A75289r42l50K09j79j081j275l85P15J099R14Q93J222J373J020N78N88R58
52896A80646J137R61Q56J172J676J871J622J212Q38L77k45o03p1J310K506K474
52880A97739J367L67K14M76M53K20J39k9o90j374j097J31J175J373J340J768K268
$$ y = [131133, 131977, 132665, 133236, 133619, 133961, 134556, 135368, 135954, 136047, 135951, 136115, 136524, 136818, 136890, 137002, 137325, 137722, 138067, 138465, 139122, 140260, 142209, 145224, 149058, 153042, 156801, 160593, 164774, 169240, 173655, 177912, 181952, 185399, 187785, 189024, 189280, 188517, 186653, 184073, 181507, 179326, 177407, 175771, 174861, 174908, 175420, 175635, 175242, 174424, 173452, 172579, 172169, 172493, 173297, 173833, 173494, 172379, 171199, 170590, 170539, 170495, 170068, 169500, 169298, 169521, 169685, 169352, 168540, 167569, 166808, 166659, 167356, 168546, 169467, 169799, 170109, 171051, 172406, 173358, 173540, 173333, 173193, 173251, 173618, 174455, 175473, 175882, 175289, 174347, 173997, 174206, 174027, 172946, 171671, 171286, 172001, 173100, 174014, 174907, 176129, 177502, 178522, 179100, 179688, 180646, 181783, 182744, 183600, 184772, 186448, 188319, 189941, 191153, 191991, 192368, 192123, 191520, 191449, 192759, 195265, 197739, 199106, 199473, 199687, 200163, 200616, 200836, 200975, 200946, 200256, 198882, 197785, 197916, 199091, 200464, 201804, 203572, 205840]
52863B05840K102J367P46N09N46R84J968L052L569L462L161K873K585K583L049
52848B38396L360K667J212J59k9r2o11j126j068p27o33o33l50l1j95p58j200j438
52830B36903j869k582l136l149k689k104j694j588j662j738j877k303k872k994
52816B04646k429j731j523j648j567j212r62r32r59j082j507k148k708l058l078
52801A78102k341o66J147J875J195q8j143j752j888j541j115j212j756k015j720
52786A65082j454j567j552r90l87m16r34j370j629j885j908j411p59o00q82r99
52770A46339p77o34p58q03n15j33j1k33p84j644k582l112k898k107j296j040j470
52753A25542k052k103j621j288j391j287n03J42m58j925k645j948r68r31j525
$$ y = [205840, 207942, 209309, 210055, 210564, 211110, 212094, 214062, 217114, 220683, 224145, 227306, 230179, 232764, 235347, 238396, 241756, 244423, 245635, 245794, 245765, 245673, 245062, 243936, 242868, 242141, 241508, 240875, 240525, 240494, 240299, 239541, 238341, 236903, 235034, 232452, 229316, 226167, 223478, 221374, 219680, 218092, 216430, 214692, 212815, 210512, 207640, 204646, 202217, 200486, 198963, 197315, 195748, 194536, 193574, 192642, 191683, 190601, 189094, 186946, 184238, 181180, 178102, 175761, 175095, 176242, 178117, 179312, 179224, 178081, 176329, 174441, 172900, 171785, 170573, 168817, 166802, 165082, 163628, 162061, 160509, 159519, 159132, 158716, 157782, 156412, 154783, 152898, 150990, 149579, 148820, 148220, 147338, 146339, 145562, 144928, 144170, 143367, 142852, 142719, 142708, 142475, 141691, 140047, 137465, 134353, 131455, 129348, 128052, 127012, 125542, 123490, 121387, 119766, 118478, 117087, 115800, 115297, 115439, 114981, 113056, 110411, 108463, 107495, 106564, 105039]
52738A05039j612q96j25L6m00j065j585j567q13L80J321J497R67K33j36R6O66
52721A02036R73O05l08j185j442r44j26L80M09L39M32M01O8O1J130K885L966L687
52703A13367K722J922J260M28k58l47j18k27p07j004r00p99j054j529j863j791
52687A09102j284o67m96r66j595j817j655j472j346j231j361j878k272j940j151
52672H7971p15p90q18o77q45j289j185k18P21P39J47k44l86p19j136j030l18M12
52654G9620P03N88K30k33m74k03L92Q18Q73O48J09p55j442j303m89R3l5l40j85
52635G8615L34Q39J351J970K332K044J406J006P47k8j337k254k054j175o37q48
52619H2311j393j765j840j671j237n57J54N88O51N51O05R50J373J505J184N80
$$ y = [105039, 103427, 102531, 102406, 102442, 102042, 100977, 99392, 97825, 97012, 97392, 98713, 100210, 101177, 101410, 101274, 101370, 102036, 103009, 103614, 103306, 102121, 100679, 99735, 99609, 99989, 100398, 100737, 101169, 101570, 101638, 101699, 102829, 105714, 109680, 113367, 116089, 118011, 119271, 119699, 119441, 119094, 118976, 118749, 118042, 117038, 116138, 115339, 114285, 112756, 110893, 109102, 107818, 107151, 106655, 105689, 104094, 102277, 100622, 99150, 97804, 96573, 95212, 93334, 91062, 89122, 87971, 87256, 86466, 85648, 84971, 84126, 82837, 81652, 81434, 82155, 82894, 83041, 82797, 82411, 81692, 80556, 79526, 79208, 79620, 80323, 80911, 81141, 80908, 80434, 80231, 80623, 81441, 82314, 82962, 83071, 82316, 80874, 79571, 79082, 79175, 79140, 78800, 78615, 78949, 79788, 81139, 83109, 85441, 87485, 88891, 89897, 90644, 90616, 89279, 87025, 84971, 83796, 83159, 82311, 80918, 79153, 77313, 75642, 74405, 73848, 74002, 74590, 75241, 75792, 76397, 77347, 78720, 80225, 81409, 81989]
52603H1989j2m06n24l55j9K95N27P51R31R12Q19J076J710J954J101l84j223q48
52585H8294P2P28J108J498J720J479J010P54O64M11J06J47M95P50Q85J302K021
52568A03444K432K032R22m34j464j489k05J649K749K648K173K076K068J645J125
52553A21371J093J339J264R97J153J696J923J654J492J702J690R96J14j91M2J69
52537A38504o2j88K82J230K059K265J865J278Q64O73O13O56O43K40o27j425j565
52520A47305j120n86p6N90J158J071M29P9L75O05P5p86j016l68N50J087R83L39
52502A50694l82n74j78O8m35j293j670j385q36k13M87Q30K83p71j229o96L4J93
52484A42927N3K39O65P69M47J48J62L43M65N95R00J351J630J467J018P89R69J070
$$ y = [81989, 81977, 81571, 81047, 80692, 80673, 80968, 81495, 82246, 83177, 84089, 84908, 85984, 87694, 89648, 90749, 90365, 89142, 88294, 88366, 89094, 90202, 91700, 93420, 94899, 95909, 96663, 97327, 97738, 97844, 97991, 98486, 99236, 100121, 101423, 103444, 105876, 107908, 108830, 108396, 106932, 105443, 105238, 106887, 109636, 112284, 114457, 116533, 118601, 120246, 121371, 122464, 123803, 125067, 126064, 127217, 128913, 130836, 132490, 133982, 135684, 137374, 138370, 138484, 138293, 138335, 138504, 138442, 138254, 138536, 139766, 141825, 144090, 145955, 147233, 148097, 148770, 149383, 150039, 150682, 150922, 150295, 148870, 147305, 146185, 145599, 145523, 146113, 147271, 148342, 148771, 148850, 149225, 149830, 149905, 149119, 148103, 147735, 148285, 149372, 150355, 150694, 150312, 149738, 149560, 149628, 149193, 147900, 146230, 144845, 144009, 143796, 144283, 145113, 145396, 144625, 143396, 142700, 142734, 142927, 142980, 143219, 143884, 144653, 145100, 145248, 145410, 145753, 146218, 146813, 147713, 149064, 150694, 152161, 153179, 153968, 154937, 156007]
52466A56007O11l5m8N90R72N78K0K8L78L59n9k74m0K77L63L06K49K08L48R87K067
52445A63892K966L069K387J466P97M60K12j11l72k85J81O80Q34N56L2m67o14k17
52427A75466M53P34K67n47j028r89p49n96n66o70q81j001q93q32j245k038k545
52410A62340k240j289l31N5k49p99r11l82J51l0p58j202j039q07r24r63k89R34
52392A51267J886J958J249L03l07k67K66Q46J224J480J642J450Q73M70P62J346
52376A66448J212L2j266j493n04P01J125P61M35Q06J718K559L025L298L555L581
52360A85993L128K374J821J779K141K598K940L119L168L096K852K454K120K147
52346B21730K547K930K907K557K362K685L353L774L452K491J567J289J609J992
$$ y = [156007, 156618, 156583, 156535, 157125, 158097, 158675, 158695, 158723, 159101, 159460, 159401, 159127, 159087, 159364, 159727, 160033, 160282, 160490, 160838, 161825, 163892, 166858, 169927, 172314, 173780, 174577, 175037, 175249, 175138, 174766, 174481, 174662, 175342, 176176, 176732, 176764, 176297, 175683, 175466, 175919, 176653, 176920, 176373, 175345, 174356, 173607, 173011, 172445, 171775, 170894, 169893, 169000, 168168, 166923, 164885, 162340, 160100, 158811, 158480, 158535, 158286, 157487, 156576, 156194, 156345, 156315, 155557, 154355, 153316, 152509, 151585, 150622, 150333, 151267, 153153, 155111, 156360, 156663, 156356, 156089, 156355, 157201, 158425, 159905, 161547, 162997, 163870, 164340, 165102, 166448, 167660, 167692, 166426, 164933, 164429, 165130, 166255, 167016, 167451, 168257, 169975, 172534, 175559, 178857, 182412, 185993, 189121, 191495, 193316, 195095, 197236, 199834, 202774, 205893, 209061, 212157, 215009, 217463, 219583, 221730, 224277, 227207, 230114, 232671, 235033, 237718, 241071, 244845, 248297, 250788, 252355, 253644, 255253, 257245]
52332B57245K077J998J989K102K346K824L407L629L211K559K354K759L299L478
52318B95277L284L034L062L468M049M406M334M037L854L868M079M695N884P254
52304C54585Q065Q087P862P957Q346Q822R613J1052J2844J4173J4660J4740J4924
52291D95730J5127J5069J5021J5585J6772J7814J8121J7941J7849J7957J8070
52280F81056J8291J8850J9426J9300J8328J7210J6531J6024J5187J4142J3413
52269H67758J3071J2603J1547R902P952O097M716L896L269K434J471O96K5j018
52255I44419k568m072m799m493l444k242j460j327j529j546j186n69L06J590L147
52240I20227M512N484O374P418Q328Q784R145J0132J1860J3551J4356J4199J3666
$$ y = [257245, 259322, 261320, 263309, 265411, 267757, 270581, 273988, 277617, 280828, 283387, 285741, 288500, 291799, 295277, 298561, 301595, 304657, 308125, 312174, 316580, 320914, 324951, 328805, 332673, 336752, 341447, 347331, 354585, 362650, 370737, 378599, 386556, 394902, 403724, 413337, 424389, 437233, 451406, 466066, 480806, 495730, 510857, 525926, 540947, 556532, 573304, 591118, 609239, 627180, 645029, 662986, 681056, 699347, 718197, 737623, 756923, 775251, 792461, 808992, 825016, 840203, 854345, 867758, 880829, 893432, 904979, 914881, 922833, 928930, 933646, 937542, 940811, 943245, 944716, 945412, 945437, 944419, 941851, 937779, 932980, 928487, 925043, 922801, 921341, 920014, 918485, 916939, 915753, 915184, 915490, 917080, 920227, 924739, 930223, 936597, 944015, 952343, 961127, 970272, 980404, 992264, 1005815, 1020171, 1034370, 1048036]
52227A048036J3219J2738J1921J0924J0287J0229J0212R484P923O040M265K619
52215A157897J053l27j521k737l980m890n301n683o663q225r784j0894j1583j2035
52201A075327j2352j2653j3055j3448j3546j3210j2551j1698j0706r741r048q611
52189I34708q040p035n802m818m371m349m419m239l714l166l043l259l136k335
52175H72982j505j537k278k683k311j927k329l197l667l566l373l262k975k602
52161H35770k702l419m133m199l633k851k185j840j903k062j815j179q60j352
52147H01637k347l316m173m895n001m111k728j832j830k404l162l885m325m419
52133G53209m551m951m989l943k302j455j949k877l298l330l457l560l257k629
$$ y = [1048036, 1061255, 1073993, 1085914, 1096838, 1107125, 1117354, 1127566, 1137050, 1144973, 1151013, 1155278, 1157897, 1158950, 1158623, 1157102, 1154365, 1150385, 1145495, 1140194, 1134511, 1127848, 1119623, 1109839, 1098945, 1087362, 1075327, 1062975, 1050322, 1037267, 1023819, 1010273, 997063, 984512, 972814, 962108, 952367, 943319, 934708, 926668, 919633, 913831, 909013, 904642, 900293, 895874, 891635, 887921, 884755, 881712, 878453, 875317, 872982, 871477, 869940, 867662, 864979, 862668, 860741, 858412, 855215, 851548, 847982, 844609, 841347, 838372, 835770, 833068, 829649, 825516, 821317, 817684, 814833, 812648, 810808, 808905, 806843, 805028, 803849, 802989, 801637, 799290, 795974, 791801, 786906, 781905, 777794, 775066, 773234, 771404, 769000, 765838, 761953, 757628, 753209, 748658, 743707, 738718, 734775, 732473, 731018, 729069, 726192, 722894, 719564, 716107, 712547, 709290, 706661]
52119G06661k008j482j155j491k658l834l838k431n37Q12J367J596K128L244M651
52104G01025N782O451P057P992R116J0068J0832J1643J2610J3738J5102J6659
52092H28075J8111J9329K0578K1962K2962K3157K3108K3698K4686K4769K3387
52081A073822K1594K0677K0470J9720J7871J5786J4584J4315J4012J2795J0600
$$ y = [706661, 704653, 703171, 702016, 700525, 697867, 694033, 690195, 687764, 687227, 688039, 689406, 691002, 693130, 696374, 701025, 706807, 713258, 720315, 728307, 737423, 747491, 758323, 769966, 782576, 796314, 811416, 828075, 846186, 865515, 886093, 908055, 931017, 954174, 977282, 1000980, 1025666, 1050435, 1073822, 1095416, 1116093, 1136563, 1156283, 1174154, 1189940, 1204524, 1218839, 1232851, 1245646, 1256246]
$$ [...]
##END NTUPLES=NMR SPECTRUM
##END=
