
##TITLE=AC1324_UGAAH12153_6535724_wPBb3waUKT
##JCAMPDX= 6.0         $$ Bruker NMR JCAMP-DX V2.0
##DATA TYPE= NMR SPECTRUM
##DATA CLASS= NTUPLES
##ORIGIN= BRUKER
##OWNER= Administrator
$$ 1.72 TOPSPIN		Version 2.1
$$ 2012-07-17 23:49:00.546 -0500  Administrator@TOPSPIN
$$ Compression mode = diff/dup
##.OBSERVE FREQUENCY= 400.02188249412
##.OBSERVE NUCLEUS= ^1H
##.ACQUISITION MODE= SIMULTANEOUS (DQD)
##.ACQUISITION SCHEME= undefined
##.AVERAGES= 8
##.DIGITISER RES= 22
##SPECTROMETER/DATA SYSTEM= spect
##.PULSE SEQUENCE= zg30
##.SOLVENT NAME= COFFEE_meoh
##.SHIFT REFERENCE= INTERNAL, COFFEE_meoh, 1, 14.98509
##AUDIT TRAIL= $$ (NUMBER, WHEN, WHO, WHERE, PROCESS, VERSION, WHAT)
$$ ##TITLE= Audit trail, TOPSPIN		Version 2.1
$$ ##JCAMPDX= 5.01
$$ ##ORIGIN= Bruker BioSpin GmbH
$$ ##OWNER= Administrator
$$ $$ C:\Bruker\TOPSPIN/data/COFFEE/nmr/AC1324_UGAAH12153_6535724_wPBb3waUKT/10/pdata/1/auditp.txt
$$ ##AUDIT TRAIL=  $$ (NUMBER, WHEN, WHO, WHERE, PROCESS, VERSION, WHAT)
(   1,<2012-07-17 23:48:53.671 -0500>,<Administrator>,<TOPSPIN>,<go>,<TOPSPIN 2.1>,
      <created by zg
	started at 2012-07-17 23:47:47.109 -0500,
	POWCHK enabled, PULCHK disabled,
       configuration hash MD5:
       6B 1B 68 BB D9 2E 58 E2 7F 35 AD 54 07 DF 0E 41
       data hash MD5: 64K
       FC 6D 5F 4C AC 9C C9 41 06 27 DA 2A 0F DA D2 9A>)
(   2,<2012-07-17 23:48:56.375 -0500>,<Administrator>,<TOPSPIN>,<proc1d>,<TOPSPIN 2.1>,
      <Start of raw data processing
       efp LB = 0 FT_mod = 6 PKNL = 1 PHC0 = 0 PHC1 = 0 SI = 32K 
       data hash MD5: 32K
       BC 92 EA 31 17 20 06 71 3F 70 83 6B 1D 00 CF 9A>)
(   3,<2012-07-17 23:48:56.765 -0500>,<Administrator>,<TOPSPIN>,<proc1d>,<TOPSPIN 2.1>,
      <pk PHC0 = 177.8741 PHC1 = 0 
       data hash MD5: 32K
       F7 7C 2E E7 1B A5 4F 09 49 D5 0A EA 49 92 90 7B>)
(   4,<2012-07-17 23:48:56.875 -0500>,<Administrator>,<TOPSPIN>,<proc1d>,<TOPSPIN 2.1>,
      <abs ABSG = 1 
       data hash MD5: 32K
       2B 0F A2 68 9B 42 49 AF B5 7B 62 3A AD 97 4D 4A>)
(   5,<2012-07-17 23:48:56.921 -0500>,<Administrator>,<TOPSPIN>,<proc1d>,<TOPSPIN 2.1>,
      <abs ABSG = 2 
       data hash MD5: 32K
       90 A1 E6 F8 04 95 34 2C DF 95 7A 48 14 65 5F D7>)
(   6,<2012-07-17 23:48:56.953 -0500>,<Administrator>,<TOPSPIN>,<proc1d>,<TOPSPIN 2.1>,
      <abs ABSG = 3 
       data hash MD5: 32K
       CC 17 28 3D 6F 27 33 4E 43 BE AD DD E1 D1 59 1E>)
(   7,<2012-07-17 23:48:56.984 -0500>,<Administrator>,<TOPSPIN>,<proc1d>,<TOPSPIN 2.1>,
      <abs ABSG = 4 
       data hash MD5: 32K
       AC 83 3C 3B 22 E0 C7 A9 D9 64 DD 3D DE 9E 50 ED>)
(   8,<2012-07-17 23:48:57.015 -0500>,<Administrator>,<TOPSPIN>,<proc1d>,<TOPSPIN 2.1>,
      <abs ABSG = 5 
       data hash MD5: 32K
       30 69 07 1B 23 77 F9 73 5F 00 83 1A 31 90 75 58>)
$$ ##END=
$$ 
$$ $$ hash MD5
$$ $$ 2A DE 0D 10 0A C4 77 CD 27 1B A0 70 F8 CF 1D DB
##$RELAX= 
##$RELAX= 
##$RELAX= 
##$RELAX= 
##$RELAX= 
##$RELAX= 
##$RELAX= 
$$ Bruker specific parameters
$$ --------------------------
$$ [...]
150 150 150 150 150 150 150 150
##$TP07= 0
##$TPNAME0= <>
##$TPNAME1= <>
##$TPNAME2= <>
##$TPNAME3= <>
##$TPNAME4= <>
##$TPNAME5= <>
##$TPNAME6= <>
##$TPNAME7= <>
##$TPOAL= (0..7)
0.5 0.5 0.5 0.5 0.5 0.5 0.5 0.5
##$TPOFFS= (0..7)
0 0 0 0 0 0 0 0
##$TUNHIN= 0
##$TUNHOUT= 0
##$TUNXOUT= 0
##$USERA1= <user>
##$USERA2= <user>
##$USERA3= <user>
##$USERA4= <user>
##$USERA5= <user>
##$V9= 5
##$VALIST= <valist>
##$VCLIST= <CCCCCCCCCCCCCCC>
##$VD= 0
##$VDLIST= <DDDDDDDDDDDDDDD>
##$VPLIST= <PPPPPPPPPPPPPPP>
##$VTLIST= <TTTTTTTTTTTTTTT>
##$WBST= 2048
##$WBSW= 25
##$XGAIN= (0..3)
0 0 0 0
##$XL= 0
##$YL= 0
##$YMAX_a= 502490
##$YMIN_a= -641919
##$ZGOPTNS= <>
##$ZL1= 120
##$ZL2= 120
##$ZL3= 120
##$ZL4= 120
##$ABSF1= 14.98509
##$ABSF2= -5.573092
##$ABSG= 5
##$ABSL= 3
##$ALPHA= 0
##$AQORDER= 0
##$ASSFAC= 0
##$ASSFACI= 0
##$ASSFACX= 0
##$ASSWID= 0
##$AUNMP= <proc_prof1d_extract_pilot.lims>
##$AXLEFT= 0
##$AXNAME= <>
##$AXNUC= <1H>
##$AXRIGHT= 0
##$AXTYPE= 0
##$AXUNIT= <>
##$AZFE= 0.1
##$AZFW= 0.1
##$BCFW= 0
##$BC_mod= 0
##$BYTORDP= 0
##$COROFFS= 0
##$CY= 15
##$DATMOD= 1
##$DC= 0
##$DFILT= <>
##$DTYPP= 0
##$F1P= 0
##$F2P= 0
##$FCOR= 0.5
##$FTSIZE= 32768
##$FT_mod= 6
##$GAMMA= 0
##$GB= 0
##$INTBC= 1
##$INTSCL= 1
##$ISEN= 128
##$LB= 0
##$LEV0= 0
##$LPBIN= 0
##$MAXI= 10000
##$MC2= 0
##$MEAN= 0
##$ME_mod= 0
##$MI= 0
##$NCOEF= 0
##$NC_proc= -8
##$NLEV= 6
##$NOISF1= 0
##$NOISF2= 0
##$NSP= 0
##$NTH_PI= 0
##$NZP= 0
##$OFFSET= 14.98509
##$PC= 1
##$PHC0= 177.8741
##$PHC1= 0
##$PH_mod= 1
##$PKNL= yes
##$PPARMOD= 0
##$PPDIAG= 0
##$PPIPTYP= 0
##$PPMPNUM= 2147483647
##$PPRESOL= 1
##$PSCAL= 4
##$PSIGN= 0
##$PYNMP= <proc.py>
##$REVERSE= no
##$SF= 400.02
##$SI= 32768
##$SIGF1= 0
##$SIGF2= 0
##$SINO= 400
##$SIOLD= 32768
##$SPECTYP= <>
##$SREGLST= <1H.CDCl3>
##$SSB= 0
##$STSI= 32768
##$STSR= 0
##$SW_p= 8223.68421052631
##$SYMM= 0
##$S_DEV= 0
##$TDeff= 65536
##$TDoff= 0
##$TI= <>
##$TILT= no
##$TM1= 0
##$TM2= 0
##$TOPLEV= 0
##$USERP1= <user>
##$USERP2= <user>
##$USERP3= <user>
##$USERP4= <user>
##$USERP5= <user>
##$WDW= 1
##$XDIM= 32768
##$YMAX_p= 473881025
##$YMIN_p= -659798
##$CURPLOT= <Network HP LaserJet P1505>
##$CURPRIN= <$Network HP LaserJet P1505>
##$DFORMAT= <normdp>
##$LAYOUT= <+/1D_H.xwp>
##$LFORMAT= <normlp>
##$PFORMAT= <normpl>
##$SURQMSG= 1
$$ End of Bruker specific parameters
$$ ---------------------------------
##NTUPLES= NMR SPECTRUM
##VAR_NAME=  FREQUENCY,     SPECTRUM/REAL,   SPECTRUM/IMAG
##SYMBOL=    X,             R,               I
##VAR_TYPE=  INDEPENDENT,   DEPENDENT,       DEPENDENT
##VAR_FORM=  AFFN,          ASDF,            ASDF
##VAR_DIM=   32768,         32768,           32768
##UNITS=     HZ,            ARBITRARY UNITS, ARBITRARY UNITS
##FACTOR=    0.250966925370066, 1,           1
##FIRST=     8223.43324360094, -60987,       -156247
##LAST=      0,             -27285,          -12452
##MIN=       0,             -659798,         0
##MAX=       8223.43324360094, 473881025,    0
$$ Real data points
##PAGE= N=1
##DATA TABLE= (X++(R..R)), XYDATA
$$ [...]
19561A8545d9879q8190e9792k54018C66808b33911M8572n9650I6920b49680M0887
$$ 18545 -49879 -138069 -59792 -313810 366808 -233911 -185339 -244989 96920 -249680 -208793
19550b08793f8313I443a27278q9252f4624r3711B92318a20278a7278G8170C7517
$$ -208793 -68313 9443 -127278 -216530 -64624 -158335 292318 -120278 -17278 78170 37517
19538A79688g5909l1022A23424K33968d17578C979g157k18747R1779o5611b5204
$$ 179688 -75909 -106931 123424 357392 -417578 3979 -7157 -225904 -134125 -199736 -25204
19526H8553a97636g2183k20456f594n4023A23309A5591b90623A71697b10222B74318
$$ 88553 -197636 -72183 -292639 -6594 -60617 123309 15591 -290623 171697 -210222 274318
19514b31908n5234b0898j64654N7558N1780j78545J07528Q26L8122K4482k0050
$$ -231908 -287142 -20898 -185552 -127994 -76214 -254759 -147231 -146405 -108283 -83801 -103851
19503a03851A0186N4204b53676B09852g6710J0743o9493e139l09315h1590j48910
$$ -103851 10186 64390 -253676 209852 -76710 -65967 -135460 -5139 -314454 -81590 -230500
19492b30500b7664n92288a30769I2802i4568j27771j5523H379e3738o9790m2047
$$ -230500 -27664 -619952 -130769 92802 -94568 -222339 -237862 8379 -53738 -123528 -165575
19481a65575g9452J651b3514k1249p2320B74689j33124l998a88520L9866k59844
$$ -165575 -79452 -77801 -23514 -44763 -117083 274689 141565 137567 -188520 -148654 -408498
19470d08498A7454b17271J1640G014c9443q3929j63427A4599a58814B1346J86383
$$ -408498 17454 -217271 -205631 7014 -39443 -123372 -286799 14599 -158814 21346 207729
19459B07729a07558D4049a49176B77130a10960b6611G0455c5412l42477J32583
$$ 207729 -107558 44049 -149176 277130 -110960 -26611 70455 -35412 -377889 -245306
19449b45306e2637G5924k4154b04064e7651B10811q7996c05128d8439n3602o3971
$$ -245306 -52637 75924 51770 -204064 -57651 210811 122815 -305128 -48439 -102041 -166012
19438a66012A77118h9012J2443K4462F3390a62293A38465g5709A33279b79972
$$ -166012 177118 -89012 -76569 -52107 63390 -162293 138465 -75709 133279 -279972
19427B72952h5330D2478a13953A21372b48616a5419o8433c3943F2680a59377B07949
$$ 272952 -85330 42478 -113953 121372 -248616 -15419 -83852 -33943 62680 -159377 207949
19415a55460M8822q2196o2541B44187a52304N9798H5100c7453D44222b9156A52248
$$ -155460 -106638 -188834 -251375 244187 -152304 -92506 85100 -37453 444222 -29156 152248
19403F7619f770k18934l3751R0729B3455c90966J75726h2150E7590a39871r2951
$$ 67619 -6770 -225704 -259455 -168726 23455 -390966 -215240 -82150 57590 -139871 -232822
19392b32822B53223g25A63941a06459j25178B72872b13694H0543k7394K01573
$$ -232822 253223 -725 163941 -106459 -231637 272872 -213694 80543 53149 254722
19382B54722b6920B13179a01373H8580a06170p4624L1870G0335K10776a5810C39458
$$ 254722 -26920 213179 -101373 88580 -106170 -180794 -148924 70335 281111 -15810 339458
19370D7838d26800d1602J2362B3940b13913e6970k43676a28187J3689A0557a62506
$$ 47838 -426800 -41602 -29240 23940 -213913 -56970 -300646 -128187 -114498 10557 -162506
19358A01202B7176J52611B7206b91772C19841c61645a30950G7484a58164O1418
$$ 101202 27176 179787 27206 -291772 319841 -361645 -130950 77484 -158164 -96746
19348i6746A35171Q6775b79643k5970Q0922E6603K19360j10605a04422l465B8689
$$ -96746 135171 221946 -279643 -305613 -224691 56603 275963 165358 -104422 -107887 28689
19336E0305P4360a18124o7562k8486A966a15692A68755c14751L0041H7091b02432
$$ 50305 124665 -118124 -185686 -214172 1966 -115692 168755 -314751 -284710 87091 -202432
19324a00788M5684J6121n2504A10428b64090o62A56485k6863f0095n9885A38852
$$ -100788 -55104 -38983 -91487 110428 -264090 -264752 156485 129622 -60095 -119980 138852
19312a62170A17421i768B21037J02964e7266j92551b19o2651A00686k4294a31052
$$ -162170 117421 -9768 221037 324001 -57266 -249817 -219 -62870 100686 76392 -131052
19300E7862k5635a77785A16402C8010M8641P9595P2772j16692b60355A78025b06178
$$ 57862 32227 -177785 116402 38010 86651 166246 239018 122326 -260355 178025 -206178
19288E5876b63051j88873A28239A5771h0969l89052a93155f5680A64451A5204
$$ 55876 -263051 -451924 128239 15771 -80969 -470021 -193155 -65680 164451 15204
19277g6427J0626j18471J0859j7981j17585d0022l85773a23923j27379a20825
$$ -76427 -65801 -184272 -173413 -191394 -308979 -40022 -425795 -123923 -251302 -120825
19266b97044B78836a85315j4352A9122J42422i8105l01616a21945k36534a22862
$$ -297044 278836 -185315 -199667 19122 161544 -98105 -399721 -121945 -358479 -122862
19255a32668k8970N3851b3458j81133j60324A55479b25650l9776E737b21058f5879
$$ -132668 -161638 -107787 -23458 -204591 -364915 155479 -225650 -265426 5737 -221058 -65879
19243B85200A35643a44108A18840l2108a24559e1802E117a69720A06558k8907
$$ 285200 135643 -144108 118840 86732 -124559 -51802 5117 -169720 106558 77651
19233G7651k930a57729o5331D1242P8166C0522R3783E9284P3763c31661a65778
$$ 77651 74721 -157729 -223060 41242 119408 30522 124305 59284 133047 -331661 -165778
19221e6980o8708B8348J76276N4273h635j08376C9016c9826j75959L7809I1637
$$ -56980 -125688 28348 204624 258897 -8635 -117011 39016 -39826 -215785 -177976 91637
19209b18371h514j43834B716h1055N159D4810a6203m15064J97327a2540j72514
$$ -218371 -8514 -152348 2716 -81055 -75896 44810 -16203 -431267 -233940 -12540 -185054
19198a85054B03334a05205E5622b56341d4788k75917C52943g3061l09573a9632
$$ -185054 203334 -105205 55622 -256341 -44788 -320705 352943 -73061 -382634 -19632
19187B67431b04156M209p8859B97227B8452a57398c0063j18591n0320A79799b84789
$$ 267431 -204156 -199947 -278806 297227 28452 -157398 -30063 -148654 -198974 179799 -284789
19175e2644C27538I3415b89225B96024b4027A67037c8183j96810P7459B2303c12421
$$ -52644 327538 93415 -289225 296024 -24027 167037 -38183 -234993 -157534 22303 -312421
19163c82055d2805l75412J81040n7794B72678b53556B5849b61659h9220A68057
$$ -382055 -42805 -418217 -237177 -294971 272678 -253556 25849 -261659 -89220 168057
19152a68776B8881A04a18999m0301K3696m1535A10041A9202J83254B4105a55359
$$ -168776 28881 104 -118999 -159300 -135604 -177139 110041 19202 202456 24105 -155359
19140c314j08550j31772R0480C13579b710j11883B91639c05354g3857r7090b3862
$$ -3314 -111864 -243636 -153156 313579 -2710 -114593 291639 -305354 -73857 -170947 -23862
19128a66836a5296m3890J4877A83330a32358c037E1094J23259b20964G5709c13612
$$ -166836 -15296 -59186 -44309 183330 -132358 -3037 51094 174353 -220964 75709 -313612
19116b9529A51262b7304k55226L9075j45083H9324P2097d9723j26517j83825O8791
$$ -29529 151262 -27304 -282530 -243455 -388538 89324 161421 -49723 -176240 -360065 -291274
19105b91274P7701A22489a23957A79883H4374a81852N7167d3387j68170A15191
$$ -291274 -213573 122489 -123957 179883 84374 -181852 -124685 -43387 -211557 115191
19094D63421a54720B73646g7286A83289a41834B15627a26462l5593C88311E6893
$$ 463421 -154720 273646 -77286 183289 -141834 215627 -126462 -162055 388311 56893
19083a02737A4784a34397E7287K1616a78794A36548b18179C763b4173k0351A28087
$$ -102737 14784 -134397 57287 78903 -178794 136548 -218179 3763 -24173 -44524 128087
19071a00495b6801B3432d104k81331A00557b63488A33174C1752J6979A0755J5099
$$ -100495 -26801 23432 -4104 -285435 100557 -263488 133174 31752 48731 10755 25854
19060B5854J7602b75893C79372j36096b03448D6112K30486d8075B1276a02869
$$ 25854 43456 -275893 379372 243276 -203448 46112 276598 -48075 21276 -102869
19049A27856l3067b9398k5844C0565b3291j87814C3000f2055B66711b8664A24041
$$ 127856 94789 -29398 -55242 30565 -23291 -211105 33000 -62055 266711 -28664 124041
19037F1952b134j81884C217a38245B13409c2195j27958a0818A46437J08468j561
$$ 61952 -2134 -184018 3217 -138245 213409 -32195 -160153 -10818 146437 254905 253344
19026B53344a17418c7062A56272J79179N8918j37107m8244C6772c4950a7205M103
$$ 253344 -117418 -37062 156272 335451 394369 257262 209018 36772 -34950 -17205 -13102
19015a3102G4009O6855A3652P6918a18991j29951C52112c09408A14820b167q6528
$$ -13102 74009 140864 13652 90570 -118991 -248942 352112 -309408 114820 -2167 -88695
19004h8695N844j01611a1803K91A99926J8320a84537A57608O9228J0685a07376
$$ -88695 -82851 -184462 -11803 -11512 199926 218246 -184537 157608 226836 237521 -107376
18992C37073b50017B00241P1451a62j98887B16036a14075o258k62605c0100j91890
$$ 337073 -250017 200241 271692 -162 -199049 216036 -114075 -120333 -382938 -30100 -221990
18981b21990A208f8965e559A55418A4520i3571c3168A14540J00316r8770a333
$$ -221990 1208 -68965 -5559 155418 14520 -93571 -33168 114540 214856 116086 -1333
18969A89594N44I679P8828e8300j22253K8236k8205G9860a22524P081A30570b32080
$$ 189594 190138 9679 88507 -58300 -180553 -152317 -180522 79860 -122524 -115443 130570 -232080
18956D5915K5503a42879j04842O5923O0139A51346a48203G8572a59880e7271j36842
$$ 45915 71418 -142879 -247721 -181798 -121659 151346 -148203 78572 -159880 -57271 -194113
18945a94113q7196g1542a9186j46504K7837A60701b19334B90004a72091j18979
$$ -194113 -281309 -71542 -19186 -165690 -137853 160701 -219334 290004 -172091 -291070
18935b91070B0316J43335p8037J13383p8395a00374A4322a09085H9062A1941f9119
$$ -291070 20316 163651 85614 198997 120602 -100374 14322 -109085 89062 11941 -69119
18923h4858o5771j20045A18628d1019j41121d5577B9179Q4410a10120n3969A18191
$$ -84858 -150629 -270674 118628 -41019 -182140 -45577 29179 113589 -110120 -164089 118191
18911h7596L4317D6427a86230q7982F0236b47982O2420O5949q1338A9094g0883
$$ -87596 -53279 46427 -186230 -274212 60236 -247982 -185562 -119613 -200951 19094 -70883
18899B60825A7975K54735A6638a26954H8980a47143M2712K0784L381k50765A512
$$ 260825 17975 272710 16638 -126954 88980 -147143 -104431 -83647 -80266 -331031 1512
18887c41296A30539a93466A96647c08822Q7937P2614L6932a9637A18531K8827
$$ -341296 130539 -193466 196647 -308822 -220885 -148271 -111339 -19637 118531 147358
18877A47358M0053O0694K9251b42045c1328n2896B7680N0892J59018c57352f2228
$$ 147358 187411 248105 277356 -242045 -31328 -84224 27680 78572 237590 -357352 -62228
18865d88329a05190j3532A03142a33478K9550j19948A93021D2451j3329J51598
$$ -488329 -105190 -118722 103142 -133478 -103928 -223876 193021 42451 29122 180720
18855A80720c75382A17058C4537J11212M8168a26838A77224O7345a8955j2707
$$ 180720 -375382 117058 34537 145749 193917 -126838 177224 244569 -18955 -31662
18845c1662l6941A8884f6914q6172A45692a67949C2461J21469c7G7755K20722
$$ -31662 -68603 18884 -66914 -153086 145692 -167949 32461 153930 -37 77755 298477
18834B98477a55239B03716j01313m2544L4545Q2643d19442a12112l08445A00227
$$ 298477 -155239 203716 102403 59859 94404 177047 -419442 -112112 -420557 100227
18823f7127A67131o4844J16920A09321J22669b16737e3380p56j1202j4564A81363
$$ -67127 167131 102287 219207 109321 231990 -216737 -53380 -54136 -65338 -79902 181363
18811A36939L6329f8414A93436f0656o4642L6179A82880d11457d8606k4718B59803
$$ 136939 173268 -68414 193436 -60656 -125298 -89119 182880 -411457 -48606 -73324 259803
18799b11725D8241k490d70740c9669p9773A03856a63024E5586g1493k56755a6784
$$ -211725 48241 45751 -470740 -39669 -119442 103856 -163024 55586 -71493 -328248 -16784
18787b53539b3118H3899L545a09797j0025B64294b30985J12207d7215Q707k45964
$$ -253539 -23118 83899 87444 -109797 -119822 264294 -230985 -118778 -47215 -38508 -284472
18776b84472A86355q5035N117f9876k4995O593L1609B4325J3007J22211J81822
$$ -284472 186355 101320 106437 -69876 -94871 -88278 -56669 24325 37332 159543 341365
18765C41365e990D4409b8163N761n8004L8925D14261c35182a4594j5305j93577
$$ 341365 -5990 44409 -28163 -22402 -80406 -41481 414261 -335182 -14594 -29899 -223476
18754b23476d78q9875D293a20444r9287E4250c35489C665a30808j84934a5852
$$ -223476 -478 -90353 4293 -120444 -219731 54250 -335489 3665 -130808 -315742 -15852
18742B78166F0008a10071n7605B67358b27970l52475b02968Q6809m0656C5285
$$ 278166 60008 -110071 -167676 267358 -227970 -580445 -202968 -116159 -156815 35285
18731A03917b75243A01910C7829e1363j58127A75865I04J43873F7425d24281a85595
$$ 103917 -275243 101910 37829 -51363 -209490 175865 904 144777 67425 -424281 -185595
18719B6517L08996L42506a62431c2962G8293i4192j1960B34160a30401F1112b36230
$$ 26517 335513 678019 -162431 -32962 78293 -94192 -106152 234160 -130401 61112 -236230
18707a88252K0110c1423j23090j57480a8462j4084m9898F6712b35290N8908c4230
$$ -188252 -168142 -31423 -154513 -311993 -18462 -32546 -82444 66712 -235290 -176382 -34230
18695a16848r600B82484b64063h5855k53057A9721d9028K2186k59549a34199A27229
$$ -116848 -126448 282484 -264063 -85855 -338912 19721 -49028 -26842 -286391 -134199 127229
18683h6545k16336a38860A19985D561L25886b14698b3421b27l5191n4859d2236
$$ -86545 -302881 -138860 119985 4561 330447 -214698 -23421 -227 -35418 -90277 -42236
18671E6419a10485J1831A55015L9783H6172B4198b33112D6903f6320C4361e1768
$$ 56419 -110485 -98654 155015 194798 86172 24198 -233112 46903 -66320 34361 -51768
18659b10923I1944a14765o0172g7282A14960L2679J5513a58233j41028c8379F7169
$$ -210923 91944 -114765 -174937 -77282 114960 147639 163152 -158233 -299261 -38379 67169
18647a15189F8372J74818K6792b81674c5443o5m56130a86180b7665E7839p280
$$ -115189 68372 243190 269982 -281674 -35443 -35508 -491638 -186180 -27665 57839 50559
18636E0559b31673j40973B19289b94788a5198I320b32803g3330k08442f7514K2462
$$ 50559 -231673 -372646 219289 -294788 -15198 9320 -232803 -73330 -281772 -67514 -45052
18625d5052n5433A18171b71694a3919j06412n0536f0146G9252b81427P8395A01926
$$ -45052 -100485 118171 -271694 -13919 -120331 -170867 -60146 79252 -281427 -203032 101926
18613A55946F0151a83564A90697a44105k9759q8172d6636A28251e491n48447C2265
$$ 155946 60151 -183564 190697 -144105 -173864 -262036 -46636 128251 -5491 -553938 32265
18601b03484D5003a07078K5579A83382k1890a69678r8472A45299c13672a27066
$$ -203484 45003 -107078 -81499 183382 161492 -169678 -268150 145299 -313672 -127066
18590B4960g428j04623j95883g435l00844g9536a7785G392a31535A14845d2899
$$ 24960 -7428 -112051 -307934 -7435 -308279 -79536 -17785 7392 -131535 114845 -42899
18578E6586a58659b9002F9168a56479p4824A18482g1509j68637N1209B11757D9100
$$ 56586 -158659 -29002 69168 -156479 -231303 118482 -71509 -240146 -188937 211757 49100
18566A56256A4792a59960B20298e6763p3572k23142i0126c9567j91204Q6136C9009
$$ 156256 14792 -159960 220298 -56763 -130335 -353477 -90126 -39567 -230771 -144635 39009
18554A60351E5346g9736D3010a15745M4123j63922B0617c4138p1615M494b4475
$$ 160351 55346 -79736 43010 -115745 -71622 -235544 20617 -34138 -105753 -101259 -24475
18542a22629n1066I3254g9768B6015J1311b1351o4023r7451g736F3690a51912
$$ -122629 -173695 93254 -79768 26015 37326 -21351 -85374 -182825 -7736 63690 -151912
18530C0990J12118K22815e9748n5500A94263b87065f9795A19578c62132C25917
$$ 30990 143108 365923 -59748 -115248 194263 -287065 -69795 119578 -362132 325917
18519b75325C3954a16135j51651H4542B8358e9316l6581k18361B71184a73202
$$ -275325 33954 -116135 -267786 84542 28358 -59316 -95897 -314258 271184 -173202
18508a54559b1337m1887j56399C85943j8714A1902J11271a76250l51191a65339
$$ -154559 -21337 -63224 -219623 385943 367229 11902 123173 -176250 -527441 -165339
18497a65293C47628A24710K58355G4240a19444b5018I8907i8631l30197g9708
$$ -165293 347628 124710 383065 74240 -119444 -25018 98907 -98631 -428828 -79708
18486B1464a50687c2459Q802k07443A44069d230j95351i3810k1971L6487K6014
$$ 21464 -150687 -32459 -23657 -231100 144069 -4230 -199581 -93810 -115781 -79294 -53280
18475e3280l70182A15917C3013b08118B66792l8737b30161D55688F4594a65349
$$ -53280 -423462 115917 33013 -208118 266792 228055 -230161 455688 64594 -165349
18464c85188E0183b86681A79846a14791m1216B17394b06566r2884P1655k13481
$$ -385188 50183 -286681 179846 -114791 -156007 217394 -206566 -299450 -227795 -441276
18454d41276A8802a72616A4207J10557Q6821a27419c1858k21206A7385a48758
$$ -441276 18802 -172616 14207 124764 211585 -127419 -31858 -253064 17385 -148758
18443a26434G3634L6387h3882k1365p5107O2444j46852j75785a0785l0393A08235
$$ -126434 73634 110021 -83882 -105247 -180354 -117910 -264762 -440547 -10785 -41178 108235
18431b70620j30742A3601K1776a52537E9585J96590g0244j01226O6762E2845a66336
$$ -270620 -401362 13601 35377 -152537 59585 256175 -70244 -171470 -104708 52845 -166336
18419h0169p7275A21306E4117a2701k41982A38925a13908K7809j05310a414j1271
$$ -80169 -157444 121306 54117 -12701 -254683 138925 -113908 -86099 -191409 -1414 -12685
18408a2685A60859E3014o349Q1324C7646f0473J9185p8870h958j87603F9844K43957
$$ -12685 160859 53014 46665 127989 37646 -60473 -41288 -120158 -8958 -196561 69844 313801
18396C13801E7953K91850c85343A5416d93050g0125L4944q0863j47752G5211a05456
$$ 313801 57953 349803 -385343 15416 -493050 -70125 -35181 -116044 -263796 75211 -105456
18384B7807I73a02148l1519l4267k55898e9811K6266D9508a71664f6272M205A50616
$$ 27807 973 -102148 -133667 -167934 -423832 -59811 -33545 49508 -171664 -66272 -62067 150616
18371B39764g9719A559J39818b99783A18198h594G7496K21282h3830A79817E5966
$$ 239764 -79719 1559 141377 -299783 118198 -8594 77496 298778 -83830 179817 55966
18359a05797a5779j70657A39037a34136J698I313c24722B94158E7748h5353q1551
$$ -105797 -15779 -186436 139037 -134136 -132438 9313 -324722 294158 57748 -85353 -166904
18348a66904j65334B0482g2017j24433d0875j68392o8876C23425a72879A053J93381
$$ -166904 -332238 20482 -72017 -196450 -40875 -209267 -278143 323425 -172879 1053 194434
18337A94434b70606f218E081J19907a01657f841A2307a48431a7576A34894i5234
$$ 194434 -270606 -6218 5081 124988 -101657 -6841 12307 -148431 -17576 134894 -95234
18325c6266B99830B7984b76142f2855B49289f1170j4408A0538g2576l8749A50044
$$ -36266 299830 27984 -276142 -62855 249289 -61170 -75578 10538 -72576 -111325 150044
18313c22423A7133K45242a82145M8991C9785a4529G6370c895j44507A6169b03898
$$ -322423 17133 262375 -182145 -133154 39785 -14529 76370 -3895 -148402 16169 -203898
18301c36991C5725J81160R0310m6260R8039a395j70725B27672a4303k27434F0
$$ -336991 35725 216885 307195 260935 358974 -1395 -172120 227672 -14303 -241737 60
18289A53566b75206d9839A45531a11231C789K05621F4805b62434A17892g0218
$$ 153566 -275206 -49839 145531 -111231 3789 209410 64805 -262434 117892 -70218
18278b85345P91C2754a62316A83502n6385a5414l90505d2508k59673A2105M5725
$$ -285345 -284554 32754 -162316 183502 127117 -15414 -405919 -42508 -302181 12105 57830
18267E7830a23778d5237C02421L6736b06141A3918L42297D3810b83106B1113a39669
$$ 57830 -123778 -45237 302421 339157 -206141 13918 356215 43810 -283106 21113 -139669
18255a0773k22167J03088E4597a76707g9999m6069A80181f3555F6361f7206I7731
$$ -10773 -232940 -129852 54597 -176707 -79999 -126068 180181 -63555 66361 -67206 97731
18243a99473d2162B02549b53689g4656j07986f9258A64731F6337g3329p6640m7791
$$ -199473 -42162 202549 -253689 -74656 -182642 -69258 164731 66337 -73329 -149969 -197760
18232a97760l3249n2996G729K487Q4894c63132a36277e5999j06975g9924A65087
$$ -197760 -231009 -284005 7729 10216 95110 -363132 -136277 -55999 -162974 -79924 165087
18220A04336g2772A36534I785J42307c0789I4510N7125n4319a80591f5129k01157
$$ 104336 -72772 136534 9785 152092 -30789 94510 151635 97316 -180591 -65129 -266286
18209b66286d5625A79829c96203a89159m292K8820A74971g181k79318E6718b6066
$$ -266286 -45625 179829 -396203 -189159 -193451 -164631 174971 -7181 -286499 56718 -26066
18197b84143J41634O3759b0001I2003a24893l27596C51617i1860B0642e2457o2533
$$ -284143 -142509 -78750 -20001 92003 -124893 -452489 351617 -91860 20642 -52457 -114990
18186a14990a4635j27965F1396b55713A78866b38713J14649A4634J24599k3989
$$ -114990 -14635 -142600 61396 -255713 178866 -238713 -124064 14634 139233 115244
18176A15244m0243Q8145k3423H403a22338G8241f1365B13664j0919d6115A49805
$$ 115244 75001 163146 139723 8403 -122338 78241 -61365 213664 202745 -46115 149805
18164A62045h5664I8941c34026a19644A38236b14614l0489A60145a93197f9855
$$ 162045 -85664 98941 -334026 -119644 138236 -214614 -245103 160145 -193197 -69855
18153a55703C9854N9175P924n2374R7490n6819a41056a201j87445B28619n8658
$$ -155703 39854 99029 106953 54579 152069 95250 -141056 -1201 -188646 228619 169961
18142A69961h4451A04902b8993A25900b65071A30758A6331Q9080J80633A14517
$$ 169961 -84451 104902 -28993 125900 -265071 130758 16331 105411 286044 114517
18131A67658f4272j24721j3388g423A70830J97985H198L6458P5652d71515b25903
$$ 167658 -64272 -188993 -202381 -7423 170830 368815 8198 44656 120308 -471515 -225903
18119C609a36583B02418g887j24683J4512c2481D8019P3904J81807a72282b5851
$$ 3609 -136583 202418 -7887 -132570 -118058 -32481 48019 121923 303730 -172282 -25851
18107b1224j24993B34975d2463E6004K7885L20037b94574f3083K7157H7271o682
$$ -21224 -146217 234975 -42463 56004 83889 403926 -294574 -63083 -35926 87271 80589
18096H0589J01831b03917b6438j3836j12850e900j15877M0335k13134d1124l23788
$$ 80589 182420 -203917 -26438 -40274 -153124 -5900 -121777 -81442 -294576 -41124 -364912
18085c64912M4400d3025m84731A3280i5678q9840r4818e6972A24282P7325d1918
$$ -364912 -320512 -43025 -527756 13280 -95678 -185518 -280336 -56972 124282 201607 -41918
18073d4422B10131b07742d1838A43570b76211C0043J34404E1980J16299F4170
$$ -44422 210131 -207742 -41838 143570 -276211 30043 164447 51980 168279 64170
18062a47402H7296a62779b0121A63321F798c64970D56868a38877e3973D30246
$$ -147402 87296 -162779 -20121 163321 6798 -364970 456868 -138877 -53973 430246
18051b31852A84359p2659D5860N7036f6955n2432A35974J2956B8642b07616B15
$$ -231852 184359 111700 45860 102896 -66955 -119387 135974 148930 28642 -207616 215
18039A44408F4963J1312J09420A9963F424a92310M7502a8393A87857b8147A57146
$$ 144408 64963 76275 185695 19963 6424 -192310 -144808 -18393 187857 -28147 157146
18027B72610c81064a81234p209A91336K0791b40745c9588j92701J01376E2014
$$ 272610 -381064 -181234 -188443 191336 212127 -240745 -39588 -232289 -130913 52014
18016I3783b37194j16177J46816H877a17108q4099A31334c4154o8615B96747d33445
$$ 93783 -237194 -353371 -206555 8877 -117108 -201207 131334 -34154 -102769 296747 -433445
18004e1782B31273d2064E3334b71687k7825A22621b53266i4988E9517c0199j24057
$$ -51782 231273 -42064 53334 -271687 -299512 122621 -253266 -94988 59517 -30199 -154256
17993a54256D0954K9684K24629D3191a44917H7409M6169A2536i5649n3980L093
$$ -154256 40954 70638 295267 43191 -144917 87409 133578 12536 -95649 -149629 -146536
17982a46536C8490R311K29100A37289a30355A81144b26651F1049h231J695p0513
$$ -146536 38490 47801 276901 137289 -130355 181144 -226651 61049 -8231 -6536 -77049
17971g7049K8897l62801c8500m2208b1204k33158P7121P1492B54053g8230B98394
$$ -77049 -48152 -410953 -38500 -80708 -21204 -254362 -177241 -105749 254053 -78230 298394
17959A8545a14614d7803D0764J87946b99963B6830m891O1427b13269M4274n8498
$$ 18545 -114614 -47803 40764 228710 -299963 26830 21939 83366 -213269 -168995 -227493
17948b27493g2163K6554C22023E9970e5387j66783N8705h0365A30986m006B4646
$$ -227493 -72163 -45609 322023 59970 -55387 -222170 -163465 -80365 130986 126980 24646
17936A72197A614P870K30490I2925J35417c3247F6921k8513N901a08764B3244
$$ 172197 1614 9484 239974 92925 228342 -33247 66921 38408 44309 -108764 23244
17924E8879b71949A98031a53221d9831O190k61743i716D9492c1968q92A95541
$$ 58879 -271949 198031 -153221 -49831 -43641 -305384 -9716 49492 -31968 -32860 195541
17912a81221B84204E2554J19547c0575q957q0790C62495B8253h0656o2015j98950
$$ -181221 284204 52554 172101 -30575 -39532 -120322 362495 28253 -80656 -142671 -341621
17901c41621J63332A44201o4533b40520e4270q9220f293j54555l08041E9315B8225
$$ -341621 -178289 144201 79668 -240520 -54270 -143490 -6293 -160848 -468889 59315 28225
17889A66428n5860a72134k2654A97916G6858l3946c01005b1954j01966a7150L922
$$ 166428 110568 -172134 -194788 197916 76858 42912 -301005 -21954 -123920 -17150 -13228
17878a3228E9434k7507n378d1102a692n4007B37121E2798L22555a29941B90823
$$ -13228 59434 31927 26549 -41102 -1692 -55699 237121 52798 375353 -129941 290823
17866C9404J39285a39597j6218A04823K14867b7894l13269D59947c61153B02866
$$ 39404 178689 -139597 -155815 104823 319690 -27894 -341163 459947 -361153 202866
17855d5136A95442b43973R5660j99627D715g7855h529A5756a54945j07921I619
$$ -45136 195442 -243973 -148313 -347940 4715 -77855 -8529 15756 -154945 -262866 9619
17843f4158a0203A2078a66739k54114I4151b49097I9610P3322j9881E7472f3650
$$ -64158 -10203 12078 -166739 -420853 94151 -249097 99610 172932 153051 57472 -63650
17831g8711j72757k58486B30156a13805c6189j32821L0588B3487b67280A17959
$$ -78711 -251468 -509954 230156 -113805 -36189 -169010 -138422 23487 -267280 117959
17820B1629e0784F10200A55749p6094a74046C29232a23172A5020b22392Q0133
$$ 21629 -50784 610200 155749 79655 -174046 329232 -123172 15020 -222392 -142259
17810a42259A3336f7380a4854F0090d13791j6093e6349l23021A95135n6532C267
$$ -142259 13336 -67380 -14854 60090 -413791 -429884 -56349 -379370 195135 138603 3267
17798f9019A373J69655c81827B38674J21741D0649P217J70278a05835c9984l546
$$ -69019 1373 171028 -381827 238674 360415 40649 47866 218144 -105835 -39984 -43530
17787d3530B03828m2716g4450A114a30633j86065G9387B084K10202p0046b4126
$$ -43530 203828 161112 -74450 1114 -130633 -316698 79387 2084 212286 142240 -24126
17775a0407j4059p0506c1625j60363d2881A76194D9366b9302m3804F2098c37837
$$ -10407 -24466 -94972 -31625 -191988 -42881 176194 49366 -29302 -73106 62098 -337837
17763C51542n2291j3575C2046i2760I28a23369B29781K69592e8123F8851i175
$$ 351542 299251 285676 32046 -92760 928 -123369 229781 499373 -58123 68851 -9175
17751D94370B17283a87403h4783L5494A63049h0910A998J23914b32011D5129P189
$$ 494370 217283 -187403 -84783 -49289 163049 -80910 1998 125912 -232011 45129 52318
17740E2318J04182K972g1898j13180Q2950G722L7931a00725n3355A1418f1359
$$ 52318 156500 159472 -71898 -185078 -102128 7722 45653 -100725 -154080 11418 -61359
17728C8829P3428B475J00a15530B3170J99718E0728k2054J77722r7505a6280l48422
$$ 38829 112257 2475 2575 -115530 23170 222888 50728 28674 206396 108891 -16280 -364702
17716c64702d9104a3971j90462n7093B59653j27393A5431O5043b4952j01092L3613
$$ -364702 -49104 -13971 -204433 -261526 259653 132260 15431 80474 -24952 -126044 -92431
17705i2431G2478P0313o8168b41594a4591r895A6180g3165A41111j3972E5431
$$ -92431 72478 142791 74623 -241594 -14591 -24486 16180 -73165 141111 127139 55431
17693a51189E7748J27907M8643a48450K8340A80356e2501H0553J43982e5521k63517
$$ -151189 57748 185655 234298 -148450 -120110 180356 -52501 80553 224535 -55521 -319038
17682c19038a46292B89709J8307j318a10542E6810d6389H0280b4184H7595a52887
$$ -319038 -146292 289709 308016 306698 -110542 56810 -46389 80280 -24184 87595 -152887
17670A40218o7190g2074D3462K44772a20557I4635e3101j04009r3520A8049i3686
$$ 140218 73028 -72074 43462 288234 -120557 94635 -53101 -157110 -250630 18049 -93686
17658a52040a1641A16154J55022j10340B1978c2553E5716b77346g8565b1447B39532
$$ -152040 -11641 116154 271176 160836 21978 -32553 55716 -277346 -78565 -21447 239532
17646c83880N2804E8725a22489B36023n7440i811G0993K04086A35988d6197j800
$$ -383880 -331076 58725 -122489 236023 178583 -9811 70993 275079 135988 -46197 -47997
17635d7997j71831G8899j6721k6527f4917B7590J1232c13948a40057m1479O1644
$$ -47997 -219828 78899 62178 35651 -64917 27590 38822 -313948 -140057 -181536 -119892
17624a19892B83952e4656A07979J05320B2118a20026j5445r6374A62627J38027
$$ -119892 283952 -54656 107979 213299 22118 -120026 -135471 -231845 162627 300654
17614C00654A00930c9160A15595a16165A16050J80473c31996G0886Q9566e6670
$$ 300654 100930 -39160 115595 -116165 116050 296523 -331996 70886 160452 -56670
17603i3869A64374G9709h8161D95907A0000a92781A48941M9342a72109l3027h7753
$$ -93869 164374 79709 -88161 495907 10000 -192781 148941 198283 -172109 -205136 -87753
17591D36992L7159a0223j31285j56476A61224o101f9734A8508M7547a59919D04988
$$ 436992 474151 -10223 -141508 -297984 161224 155123 -69734 18508 66055 -159919 404988
17579B60255a55614d8146F9025B6948J45090b50945D5183b14053I237N08442j89427
$$ 260255 -155614 -48146 69025 26948 172038 -250945 45183 -214053 9237 517679 328252
17568C28252a01212B97935q1921b81967B42854i6625Q141A85782C9822a53183
$$ 328252 -101212 297935 216014 -281967 242854 -96625 -88484 185782 39822 -153183
17557D9464K21256d6087J6537A43480k7653a721k06412D5261A4286i1556A10911
$$ 49464 270720 -46087 -29550 143480 115827 -1721 -208133 45261 14286 -91556 110911
17545G1372b6225A87824k0200J08168d32470a0013b057A07879b87849E1400h1982
$$ 71372 -26225 187824 167624 275792 -432470 -10013 -2057 107879 -287849 51400 -81982
17533D9914k4135d1234B394O2401J5345J5330k9379a48595D16082A51972N7917
$$ 49914 25779 -41234 2394 64795 80140 95470 66091 -148595 416082 151972 209889
17522B09889N9690a60268F9880Q9458G0508a68014e6494J7038B62841b0008B98330
$$ 209889 269579 -160268 69880 159338 70508 -168014 -56494 -39456 262841 -20008 298330
17510h1451E7402J28078J00876A12366a36863A51603c27390A09690m0159O5791
$$ -81451 57402 185480 286356 112366 -136863 151603 -327390 109690 69531 135322
17500A35322H914L88320a41330D0396J39785b64978A09602L88603k30859a62950
$$ 135322 8914 397234 -141330 40396 180181 -264978 109602 498205 267346 -162950
17489D82685h9656j5408A72404l0387n1441g3282j63855C06859G4005a28471N0208
$$ 482685 -89656 -105064 172404 142017 90576 -73282 -237137 306859 74005 -128471 -78263
17478g8263H7287M1494F1313M06549b3720A50093J80463I6725J16133p5932M2226
$$ -78263 87287 128781 61313 467862 -23720 150093 330556 96725 212858 136926 179152
17467A79152r58L09369b5420o3111d635B52230K53183C809K29407p8010a43802
$$ 179152 178194 487563 -25420 -88531 -4635 252230 505413 3809 233216 155206 -143802
17455B15838C1781b236A64579f9515A95375L68692B22091J92816j89271j06368
$$ 215838 31781 -2236 164579 -69515 195375 564067 222091 414907 225636 119268
17445A19268a05069A50589h8654A65161K03951d1987D5845J67240L9862I1883
$$ 119268 -105069 150589 -88654 165161 369112 -41987 45845 213085 252947 91883
17434c343B61587K3374J20907j78273n5458K25101Q5584B26237K17168G8054J16612
$$ -3343 261587 284961 405868 227595 172137 397238 482822 226237 443405 78054 194666
17423A94666M9568l2002J03604J6931j6599j18911G3438J03039b63422D25237
$$ 194666 244234 212232 315836 332767 316168 197257 73438 176477 -263422 425237
17412D56519A48088L3873J1930a57937B52022O950q9736J59613l1665J30345g3697
$$ 456519 148088 181961 193891 -157937 252022 258972 169236 328849 297184 427529 -73697
17400D24409j45936M7506A7616a6218q7002c0185C37490j62145J7458K34831D5954
$$ 424409 278473 325979 17616 -16218 -103220 -30185 337490 175345 192803 427634 45954
17388A90691O6902g358B21794a59134p676B88864j8633o5684O0740b9630B52832
$$ 190691 257593 -7358 221794 -159134 -166810 288864 270231 204547 265287 -29630 252832
17376A03140L23919A97986m4086h5539A2271P5432K21853a807C64222A53820i478
$$ 103140 427059 197986 153900 -85539 12271 87703 309556 -1807 364222 153820 -9478
17364A73407C019a07708A97525q2797m3967Q9801j1668K78140j60374F0071J07515
$$ 173407 3019 -107708 197525 114728 70761 160562 148894 427034 266660 60071 167586
17353A67586M7185M3664q460J71576J8453I4463k6469e4805B18795a14173c8826
$$ 167586 214771 258435 249975 421551 440004 94463 67994 -54805 218795 -114173 -38826
17341A03504F506N2270a6813B42736M1755J4556j09026j4935L8645B8085J05448
$$ 103504 6506 58776 -16813 242736 284491 299047 190021 175086 213731 28085 133533
17330A33533a85363A36560J23082G8710K35377A27519P559O2867n2044o7359l4398
$$ 133533 -185363 136560 259642 78710 314087 127519 135078 197945 145901 78542 44144
17319D4144A7007J66693a18335M3641H0276J0511R7381m1501P90O8937M4493j2991
$$ 44144 17007 183700 -118335 -74694 80276 90787 188168 146667 147457 216394 260887 247896
17307B47896n5213l2832Q2852H775O72L26860e6888B54571q4900h4050B39064
$$ 247896 192683 159851 242703 8775 9447 336307 -56888 254571 169671 -84050 239064
17295A65120a12016B91708A38151K0163a0304A31773K3922C4565K31424J29211
$$ 165120 -112016 291708 138151 158314 -10304 131773 155695 34565 265989 395200
17285C95200a20934A95643H2111R6552J02539j30000K76748b51985H1921J40320
$$ 395200 -120934 195643 82111 178663 281202 151202 427950 -251985 81921 222241
17275B22241n6933O701L7450F7689J9998A5961L41669a71056A52430a69085C71794
$$ 222241 165308 172009 209459 67689 87687 15961 357630 -171056 152430 -169085 371794
17263a7378o584B13970K53092r2710R3962A13536K9689J25791P0092A67805n4846
$$ -17378 -23962 213970 467062 374352 468314 113536 143225 269016 339108 167805 112959
17252A12959M8062p4131D2018i2126J9093D13935A74762d2874D0110J68760a86120
$$ 112959 161021 86890 42018 -92126 -73033 413935 174762 -42874 40110 208870 -186120
17240A81973K61199E841L11768j04954o1010K08940j45362J8847R4196K990K101
$$ 181973 443172 5841 317609 212655 151645 360585 215223 234070 328266 331256 333357
17229C33357k1965D5730O8610b5711H6366J12183n8519a83808C06418d5772C13129
$$ 333357 311392 45730 114340 -25711 86366 198549 140030 -183808 306418 -45772 313129
17217d7180B60308a2041C54931o0474k8004J10752D0992L65822A32871L21337
$$ -47180 260308 -12041 354931 294457 266453 377205 40992 406814 132871 454208
17207D54208A41258A1723J16614l7840k2014k8671M37273j83146k163o2020J7417
$$ 454208 141258 11723 128337 90497 68483 39812 477085 293939 291776 229756 247173
17196B47173o7622F0994K85989C2993j3929M10313A08385J60988J37969p7850
$$ 247173 179551 60994 346983 32993 19064 429377 108385 269373 407342 329492
17186C29492C0270Q6478Q0957q9591K84137j07270J51802A46025c0210I0902N135
$$ 329492 30270 116748 197705 108114 392251 284981 436783 146025 -30210 90902 96037
17175I6037J61893E9420k2339L21741M6653n2223n1963N196P3506C3008K66128
$$ 96037 257930 59420 37081 358822 405475 353252 301289 306485 379991 33008 299136
17164B99136d0160A12080J57486G2886M4087K22875K53880E338K44962P0776P2783
$$ 299136 -40160 112080 269566 72886 116973 339848 593728 5338 250300 321076 393859
17153C93859j3887j41150o8780J09999n9807J52397q9155J82604q4357D6081L74761
$$ 393859 379972 238822 170042 280041 220234 372631 283476 466080 381723 46081 420842
17142D20842j29302K04848j90660K34773k36967J9761N1636P6544j04833Q4975
$$ 420842 291540 496388 305728 540501 303534 323295 374931 451475 346642 431617
17132D31617j20307j06060K82826j23877A71093J90980j10071l3015J52092h2505
$$ 431617 311310 205250 488076 364199 171093 362073 252002 218987 371079 -82505
17121D06304j07471K23867j42254k9973j42514J730J11967J92023k50694h1762
$$ 406304 298833 522700 380446 350473 207959 209689 321656 513679 262985 -81762
17110A96540J36585M2588A23670J75961b7528C51312J1454A09022K42085p6116
$$ 196540 333125 375713 123670 299631 -27528 351312 362766 109022 351107 274991
17100B74991K46883B24316l4853M32925k97381J2049M476j06152K35200J84971
$$ 274991 521874 224316 189463 622388 325007 337056 341532 235380 470580 655551
17090F55551k63412A15920J41791p1726N13085k21621J39673J77351l55316j36248
$$ 655551 392139 115920 257711 185985 699070 477449 617122 794473 439157 302909
17080C02909J52719J22439l425k47022J87727n0505J617j71476J66351L0039P1298
$$ 302909 455628 578067 574642 327620 515347 464842 466459 294983 461334 491373 562671
17069E62671j18962J04472j15407L0753j02778J00648K35839k59355K1647M5085
$$ 562671 443709 548181 432774 463527 360749 461397 697236 437881 459528 504613
17059E04613r4207j60321M91520l03591L5989K12113C00720K55524B69515L92656
$$ 504613 410406 250085 741605 438014 474003 686116 300720 556244 269515 662171
17049F62171B35494O12031A73977M89221q7627N9751k89136J95536q8003k1438
$$ 662171 235494 847525 173977 663198 575571 635322 346186 541722 453719 432281
17039D32281R524j4963j46546L35213P3229l24509M4266K05644r2919P2903j48526
$$ 432281 441805 426842 280296 615509 688738 364229 408495 614139 521220 594123 445597
17028D45597P4654O2072K82087k84640K68666j21193k59219k0279J67786J24828
$$ 445597 520251 582323 864410 579770 848436 727243 468024 447745 615531 740359
17018G40359k00837J32512R0204j95333k54687J26139L73496j29062L5757C38431
$$ 740359 539522 672034 762238 566905 312218 438357 811853 682791 718548 338431
17007F67347K12663l6523j09384r6785j00895L75810k61385j48891K10829k80770
$$ 667347 880010 843487 734103 637318 536423 912233 650848 501957 712786 432016
16997D32016O08274l59450M3986j17335M51473l30099o0478o8718j24363J74621
$$ 432016 1040290 680840 724826 607491 1058964 728865 668387 599669 475306 649927
16987F49927L73298l61698J27271p7766P7196r1300J57616j03227O3163k22626
$$ 649927 1023225 661527 788798 711032 788228 696928 854544 751317 814480 591854
16977E91854J16673J16245j17801P7304o8016q3157K50863K49059q2396k86099
$$ 591854 708527 824772 706971 784275 716259 633102 883965 1133024 1050628 764529
16967G64529L06673j2233j1331m18043L02881M49690m19593k06426M12726J55416
$$ 764529 1071202 1058969 1047638 629595 932476 1382166 962573 756147 1168873 1324289
16957A324289l19331J95622l00816j69260L71676j1329M889R0743k07572K59616
$$ 1324289 1004958 1200580 899764 730504 1102180 1090851 1095740 1186483 978911 1238527
16947A238527k74416o0469M25130l92925J882M4092k11242M97845j35434L3443
$$ 1238527 964111 903642 1328772 935847 937729 981821 770579 1268424 1132990 1166433
16937A166433O8679k39517M14265k72698O650Q6847L6163J36881k09122O2555
$$ 1166433 1235112 995595 1409860 1137162 1143812 1230659 1266822 1403703 1194581 1257136
16927A257136j46872L08259j88540L48475k62679P0088l8877J86779k4343k7281
$$ 1257136 1110264 1418523 1229983 1578458 1315779 1385867 1346990 1533769 1509426 1482145
16917A482145j38568p5439J64670j564l1983L41963r8354l01490K48784k89502
$$ 1482145 1343577 1268138 1432808 1431244 1399261 1741224 1642870 1341380 1590164 1300662
16907A300662K85754N8626l3934K8384j70772K44352M6845p6633L47980l00431
$$ 1300662 1586416 1645042 1611108 1639492 1468720 1713072 1759917 1683284 2031264 1730833
16897A730833n3044J24937j44303L54173o4168n9670J3850P3982k35582M12152
$$ 1730833 1677789 1802726 1658423 2012596 1948428 1888758 1902608 1976590 1741008 2153160
16887B153160j95648J42602J482l64964K06001j79344M13911P2172K13764j12542
$$ 2153160 1957512 2100114 2101596 1736632 1942633 1763289 2177200 2249372 2463136 2350594
16877B350594m48432L43245J71599m12460M74560N6588k31329r7094M06919o502
$$ 2350594 1902162 2245407 2417006 2004546 2479106 2535694 2304365 2207271 2614190 2607688
16867B607688J68109j14828R8122j94876m8785J48994j93204P37501n62228L48718
$$ 2607688 2775797 2660969 2759091 2564215 2515430 2664424 2471220 3208721 2646493 2995211
16857B995211l52069K25467K04346J0898J37921l03488L22494l1430J30718j1661
$$ 2995211 2643142 2868609 3072955 3083853 3221774 2918286 3240780 3209350 3340068 3328407
16847C328407k36210M81071k7044l36615K84257J95550j25529j0213L12585p6908
$$ 3328407 3092197 3573268 3546224 3209609 3493866 3689416 3563887 3553674 3866259 3789351
16837C789351K53923k1970J01880k0848L44122Q955l91930K24055J84427L23489
$$ 3789351 4043274 4021304 4123184 4102336 4446458 4455413 4063483 4287538 4471965 4795454
16827D795454l66948N21055j27687p6582N58577j72695l2418Q4103O0377K42743
$$ 4795454 4428506 4949561 4821874 4745292 5303869 5131174 5098756 5182859 5243236 5485979
16817E485979K58978o7123M01339k46900J55075K22717Q8720K56530l45505O54124
$$ 5485979 5744957 5677834 6079173 5832273 5987348 6210065 6298785 6555315 6209810 6863934
16807F863934K90263l81537L01050R6517L89664o6354J63569K96169L94298Q4390
$$ 6863934 7154197 6772660 7073710 7170227 7559891 7493537 7657106 7953275 8347573 8431963
16797H431963J52282r522N70111J29296J60966M31312P4717R5037K24979K55168
$$ 8431963 8584245 8574723 9144834 9274130 9435096 9866408 9941125 10036162 10261141 10516309
16787A0516309M83246J63039N08168L14561J61479N02319P9986O44328J47387
$$ 10516309 10999555 11162594 11670762 11985323 12146802 12649121 12729107 13373435 13520822
16778A3520822P44311K81998M91316M81732L36712Q31515M21557L21350M43589
$$ 13520822 14265133 14547131 15038447 15520179 15856891 16688406 17109963 17431313 17874902
16769A7874902J169349L15545P16877J043684M16008R96924O79638J277719N67338
$$ 17874902 19044251 19359796 20076673 21120357 21536365 22533289 23212927 24490646 25057984
16760B5057984J125240J001730J509547P87168J514517J483459J295578J256778
$$ 25057984 26183224 27184954 28694501 29481669 30996186 32479645 33775223 35032001
16752C5032001J698737J877498J892091K048496J766285K871318K115204K227315
$$ 35032001 36730738 38608236 40500327 42548823 44315108 47186426 49301630 51528945
16744E1528945K906601K995364L212424L588270L310198M453408M123820M433088
$$ 51528945 54435546 57430910 60643334 64231604 67541802 71995210 76119030 80552118
16736H0552118M718290N141990N814418N853602O415783O749831P031675P209274
$$ 80552118 85270408 90412398 96226816 102080418 108496201 115246032 122277707 129486981
16728A29486981Q049776P726517Q175029Q132924P793778P513136P084673O464761
$$ 129486981 137536757 145263274 153438303 161571227 169365005 176878141 183962814 190427575
16720A90427575N925202L745016L506217J731448L89126j483851k768798l958477
$$ 190427575 196352777 200097793 203604010 205335458 205724584 204240733 201471935 197513458
16712A97513458n269215o146615o730504p401711q243231q312995q093165p975819
$$ 197513458 192244243 186097628 179367124 171965413 163722182 155409187 147316022 139340203
16704A39340203q077103p632009p542956o809794o696627o429535n559793n723490
$$ 139340203 131263100 123631091 116088135 109278341 102581714 96152179 90592386 84868896
16696H4868896m684401m868243m554255m137823l557559l753553l323123k865922
$$ 84868896 80184495 75316252 70761997 66624174 63066615 59313062 55989939 53124017
16688E3124017k801172k624733k292632k609537k231723j896377j891453j962739
$$ 53124017 50322845 47698112 45405480 42795943 40564220 38667843 36776390 34813651
16680C4813651j429600j527319j223406j480629j371250j318863o52138j325860
$$ 34813651 33384051 31856732 30633326 29152697 27781447 26462584 25810446 24484586
16672B4484586o79261j562107m90426r39192r27044l62680q65361p74173n83898
$$ 24484586 23805325 22243218 21752792 20813600 19886556 19523876 18658515 17884342 17300444
16663A7300444n34923n58303o45596k15116j037006l72742p05179L5041m00445
$$ 17300444 16765521 16207218 15561622 15346506 14309500 13936758 13231579 13266620 12866175
16654A2866175n28838j44623n87813k92690n79096M6322l71069k74937p95637
$$ 12866175 12337337 12192714 11604901 11312211 10733115 10779437 10408368 10133431 9337794
16645I337794Q4334l60782n7623l78850k0215l2998l58886n13653J8134o3350
$$ 9337794 9422128 9061346 9003723 8624873 8604658 8571660 8212774 7699121 7717255 7653905
16635G653905k91743k68893J65488k43369m31185l41998j3350Q0992k3253m35924
$$ 7653905 7362162 7093269 7258757 7015388 6584203 6242205 6228855 6309847 6286594 5850670
16625E850670l9540l0503m29418L6886K1766j30430R586j60620l08900l22172
$$ 5850670 5811130 5780627 5351209 5388095 5409861 5279431 5289017 5128397 4819497 4497325
16615D497325M3030J97113l48288K61500j72114k70580l10271k45856L64094j26010
$$ 4497325 4540355 4737468 4389180 4650680 4478566 4207986 3897715 3651859 4015953 3889943
16605C889943m6507J92335l90980J89169p4065l49540L22558l61429r3479K59059
$$ 3889943 3843436 4035771 3644791 3833960 3759895 3410355 3732913 3371484 3278005 3537064
16595C537064j70338k08875R3870k68712k9463J04761m20614K01533q2480k6081
$$ 3537064 3366726 3157851 3251721 2983009 2953546 3058307 2637693 2839226 2756746 2730665
16585B730665P5418k38756l28877L50292J17108k49022L7660j16528J32668m4109
$$ 2730665 2806083 2567327 2238450 2588742 2705850 2456828 2494488 2377960 2510628 2466519
16575B466519j03212j03547j25166l65561M32624K48172j06465k52766J43774
$$ 2466519 2363307 2259760 2134594 1769033 2201657 2449829 2343364 2090598 2234372
16566B234372J03245n05841J81292r8781k06708L16512m81860L13909J27572j64983
$$ 2234372 2337617 1831776 2013068 1914287 1707579 2024091 1542231 1856140 1983712 1818729
16556A818729l58810M87076l03021J63771j33390l797r4365r624K4116j3087j32075
$$ 1818729 1459919 1946995 1643974 1807745 1674355 1670558 1576193 1566569 1590685 1577598 1445523
16545A445523J51389j14099j06642K27911k62938K75161j37810m32656n4612N73546
$$ 1445523 1596912 1482813 1376171 1604082 1341144 1616305 1478495 1045839 991227 1564773
16535A564773K9498k86287J81355k35741k08113l02088R61286m07392Q593m4714
$$ 1564773 1594271 1307984 1489339 1253598 1045485 743397 1704683 1297291 1305884 1261170
16525A261170k90773J03194K03427J21787m55702j05487N95411k02572j08497
$$ 1261170 970397 1073591 1277018 1398805 943103 837616 1433027 1230455 1121958
16516A121958q5000J0023j15910k97747P26779j88270j99140q8355K08350k18811
$$ 1121958 1036958 1046981 931071 633324 1360103 1171833 972693 884338 1092688 873877
16506H73877j15096q5624N51934E19368M96262k9254o4973j25103r7263N9654
$$ 873877 758781 673157 1225091 519368 1015630 986376 921403 796300 699037 758691
16496G58691k10963L85588j99009p0171K55790k20596L76032k55888O4834m633
$$ 758691 547728 933316 734307 664136 919926 699330 1075362 819474 884308 879675
16486H79675p2829l869k04686J61874o1137q6717K04699K2007J20253l12495J53176
$$ 879675 806846 802977 598291 760165 699028 612311 817010 839017 959270 646775 799951
16475G99951q7017o0474K0739J88479j70883K04374j55227j12750p85C11359N49527
$$ 799951 712934 652460 673199 861678 690795 895169 739942 627192 626407 311359 860886
16464H60886j16629k36575j40775O18580k57531j80556J48163J38150k04522J43610
$$ 860886 744257 507682 366907 985487 727956 547400 695563 833713 629191 772801
16454G72801B84840L6928M48310l53050M29938j32809q3986J2212j02984l1807
$$ 772801 284840 321768 770078 417028 846966 714157 630171 642383 539399 507592
16444E07592K67476B92167L48464j13222N8598B85888K20791j64997Q358J6387
$$ 507592 775068 292167 640631 527409 586007 285888 506679 341682 350040 366427
16434C66427I0367N85456k80079L30616n9104l33340N6471q5216N17657l90868
$$ 366427 90367 675823 395744 726360 667256 333916 390387 305171 822828 431960
16424D31960O9413j62718o6554m468J17549L3483k964K76835k48209r875Q1816
$$ 431960 501373 338655 272101 267633 385182 418665 415701 692536 444327 434452 516268
16413E16268B30853J00873k9721J20650j88404R7660L05976k63063L12526B88168
$$ 516268 230853 331726 302005 422655 234251 331911 637887 374824 687350 288168
16402D60877P8516j26578j5771K60323k19112Q2233j62456K76423B42429J96221
$$ 460877 539393 412815 397044 657367 438255 520488 358032 634455 242429 438650
16392D38650O287P7030p9795j76153O2275O2722J51432p729q5388G1254L34279
$$ 438650 444937 521967 442172 266019 328294 391016 542448 534719 449331 71254 405533
16381D05533K6232j87199G6126c6306D93396B25627K09596j94873J54509j61982
$$ 405533 431765 244566 76126 -36306 493396 225627 435223 240350 394859 232877
16371B32877j13651J11740L45702j57131J01324A25866J92894J04229q2909J09850
$$ 232877 119226 230966 576668 419537 520861 125866 318760 422989 340080 449930
16361D49930B0508g073D13245m9042A05927a26305A10209j8111K09697c8656j71038
$$ 449930 20508 -7073 413245 364203 105927 -126305 110209 92098 301795 -38656 -209694
16350b09694A39695n3540K37680D6927N7978K35071J2167j07729a4688E8102J50438
$$ -209694 139695 86155 323835 46927 104905 339976 352143 244414 -14688 58102 208540
16339B08540q3713a65316C05692p7496J95537Q6199A29332j3511R1528k6703J15629
$$ 208540 124827 -165316 305692 228196 423733 509932 129332 115821 207349 180646 296275
16328B96275A37576Q081j0508a7873A71841l4944O3105K45796b5143D28915j97671
$$ 296275 137576 145657 135149 -17873 171841 136897 200002 445798 -25143 428915 231244
16317B31244q2784Q0966M7160a16476A37198e4953A57520O6350N6666j10429A1272
$$ 231244 148460 229426 276586 -116476 137198 -54953 157520 223870 280536 170107 11272
16305A52579a86355e01B28035h0055G2349H678g7285A22779Q2837a4188E8107
$$ 152579 -186355 -501 228035 -80055 72349 8678 -77285 122779 205616 -14188 58107
16293A61317Q6900o6949G7142J79592J28191E4429e209A21789b84670a06848c7855
$$ 161317 248217 181268 77142 256734 384925 54429 -5209 121789 -284670 -106848 -37855
16281c5502C99235j00708A10252b8961A32017m4315M0175A4896L82760g4682a2899
$$ -35502 399235 298527 110252 -28961 132017 87702 127877 14896 397656 -74682 -12899
16269a94422B08696G6551L7076K3691i2764B07501G1397J09106C4193r264K95236
$$ -194422 208696 76551 113627 137318 -92764 207501 71397 180503 34193 24929 320165
16258C20165b5725D765b87477D8951b63254C79099a09027A26615D1383L26531
$$ 320165 -25725 4765 -287477 48951 -263254 379099 -109027 126615 41383 367914
16248C67914b20269h6835C77298l6628F1017d621D67391A47318o6663e8831n2177
$$ 367914 -220269 -86835 377298 340670 61017 -4621 467391 147318 80655 -58831 -111008
16237a11008A62902c3084D4843h1806c4635B10206k061b6725j10853A91356a3840
$$ -111008 162902 -33084 44843 -81806 -34635 210206 208145 -26725 -137578 191356 -13840
16225C7548P1657n2971L58242A10728L7215P2369c5734C13129j42654I46P2001
$$ 37548 109205 56234 414476 110728 147943 220312 -35734 313129 170475 946 72947
16214G2947K7466D050J0212g7496C28572h8708C55179d00199A72588c525I6745
$$ 72947 100413 4050 14262 -77496 328572 -88708 355179 -400199 172588 -3525 96745
16202C04069A01821D8908J79439k0711F408a23214a0234k2346e857A90290C9305
$$ 304069 101821 48908 228347 207636 6408 -123214 -10234 -32580 -5857 190290 39305
16190a16340E7529G791A679K09202d1063k8515A70109A8306J66472q5752b27011
$$ -116340 57529 7791 1679 210881 -41063 -69578 170109 18306 184778 99026 -227011
16178A65302h6640B38562A14264J76718F1917a02114g106A11922A5455J07012
$$ 165302 -86640 238562 114264 290982 61917 -102114 -7106 111922 15455 122467
16168A22467c8177A78954a66216B30667M6352b4178k3828l43503a12623k13555
$$ 122467 -38177 178954 -166216 230667 277019 -24178 -48006 -391509 -112623 -326178
16158c26178G8757O1954g3124k0825l566G5778d392A62593c06150E2018J5867
$$ -326178 78757 140711 -73124 -93949 -97515 75778 -4392 162593 -306150 52018 67885
16147F7885a55704D3622N4178C9783b57551A30681B124a22765D1693a52573J1414
$$ 67885 -155704 43622 97800 39783 -257551 130681 2124 -122765 41693 -152573 -141159
16136a41159A02966b5911B44439I9146J38825a93164M9771G2245b46486B21549
$$ -141159 102966 -25911 244439 99146 237971 -193164 -143393 72245 -246486 221549
16125a28117f4023q5075g1406A95995i1817h307j00756A11209b37990A31279a52707
$$ -128117 -64023 -149098 -71406 195995 -91817 -8307 -109063 111209 -237990 131279 -152707
16113I8509J08247n9715a57845D818L5707J23968F6411B3541K79938a9920n046
$$ 98509 206756 147041 -157845 4818 40525 164493 66411 23541 303479 -19920 -24966
16102b4966D45204H5659g7486A3011J95825a15258A19461c5116A65784D9795i9341
$$ -24966 445204 85659 -77486 13011 208836 -115258 119461 -35116 165784 49795 -99341
16090a94399i0115j08187h7541A56635E4979j0848a7560k20194A53551b52150
$$ -194399 -90115 -198302 -87541 156635 54979 44131 -17560 -237754 153551 -252150
16079A71861C1306c8777m4924l38740A79452a26764d878r8368k8172j18970i2035
$$ 171861 31306 -38777 -83701 -422441 179452 -126764 -4878 -103246 -131418 -250388 -92035
16067A36217A7309k925a45773k6367B22439b88969c1494j36222j89644B50263
$$ 136217 17309 14384 -145773 -172140 222439 -288969 -31494 -167716 -357360 250263
16056c0967n04187G8682d04017C71563a36789p861c2837C07760A13189l5274a62666
$$ -30967 -535154 78682 -404017 371563 -136789 -144650 -32837 307760 113189 77915 -162666
16044I0834f3836f825A37150P0002b20170Q4821j82801J13539E8272a03147D6696
$$ 90834 -63836 -6825 137150 207152 -220170 -135349 -318150 -204611 58272 -103147 46696
16032D3521a95400K8931j84068d5457A5116J33283b86302c1086j58224d56H5515
$$ 43521 -195400 -166469 -350537 -45457 15116 148399 -286302 -31086 -189310 -456 85515
16020e4001J6541A4744l382c411E6124A7799b97766C78233C4749i7815p217a2966
$$ -54001 -37460 14744 11362 -3411 56124 17799 -297766 378233 34749 -97815 -105032 -12966
16007d5484D183J54714a24589m0784o9881A36160J48071F3923b10269D0739b08045
$$ -45484 4183 158897 -124589 -165373 -235254 136160 284231 63923 -210269 40739 -208045
15995A47441F5669a5330H1866a10648q5325D2746C414i3478A88120D3397N3957
$$ 147441 65669 -15330 81866 -110648 -195973 42746 3414 -93478 188120 43397 97354
15984I7354M9910J16095R7988K5835o0044a25653L7971o6995D06034B0850a21045
$$ 97354 147264 263359 361347 387182 327138 -125653 -87682 -154677 406034 20850 -121045
15972a31703r0388J07819k54133a66818g701j52244D0433J18677l6419a83889
$$ -131703 -222091 -114272 -368405 -166818 -7701 -159945 40433 159110 122691 -183889
15961a07074n8925j38104A11651g8513J9301m9718a2943A8777J60317a88300A59994
$$ -107074 -165999 -304103 111651 -78513 -59212 -108930 -12943 18777 179094 -188300 159994
15949h8770n7693F0715A2688a50835J4417B74202b42370I7003b9686j69915A44698
$$ -88770 -146463 60715 12688 -150835 -136418 274202 -242370 97003 -29686 -199601 144698
15937A6186a40315B83869d3321n1238j54416A0867d17919B125R0701b15975f0843
$$ 16186 -140315 283869 -43321 -94559 -248975 10867 -417919 2125 92826 -215975 -60843
15925b46041B11678c90936i3575l8281j19774g3360i732n3989k0699A85604l9955
$$ -246041 211678 -390936 -93575 -131856 -251630 -73360 -9732 -63721 -84420 185604 145649
15914A45649a25983B12089Q9124d1099k71718J13287m3760a1511k9064k15876
$$ 145649 -125983 212089 301213 -41099 -312817 -199530 -243290 -11511 -40575 -256451
15904b56451e0349D0701K18287e410A24998l2909b10644h107A3106M4422J47387
$$ -256451 -50349 40701 258988 -5410 124998 92089 -210644 -8107 13106 57528 204915
15893B04915h4373D8425b393m2043a2807B00928b85481A42704b05321C57964o6024
$$ 204915 -84373 48425 -2393 -44436 -12807 200928 -285481 142704 -205321 357964 291940
15882B91940a35321L4437d1453l43526A97940b63285i2679b9891A75016b91030
$$ 291940 -135321 -100884 -41453 -384979 197940 -263285 -92679 -29891 175016 -291030
15871c61912J12032A29070d6913A53472J46704c77965d8269J1352j88222n947
$$ -361912 -249880 129070 -46913 153472 300176 -377965 -48269 -36917 -225139 -231086
15861b31086a3172A11175c7041l76368A91421J21217c91401B90425A36709b4143
$$ -231086 -13172 111175 -37041 -413409 191421 312638 -391401 290425 136709 -24143
15850b94099a13119H3191a24064j11591A6668K68625a90563f0510A36177F4393
$$ -294099 -113119 83191 -124064 -235655 16668 285293 -190563 -60510 136177 64393
15839I0520J50385G8436J05169q3443b23431A34260m1564B0889O00a99969B79266
$$ 90520 240905 78436 183605 100162 -223431 134260 92696 20889 21489 -199969 279266
15827a26211N9109j07665B57097c69884D6655j4634b37279E9015J79545c94738
$$ -126211 -67102 -174767 257097 -369884 46655 32021 -237279 59015 238560 -394738
15816a98172I9545c57724P4899H0591e1610l7283H9981a17599e6240F8016d6470
$$ -198172 99545 -357724 -282825 80591 -51610 -88893 89981 -117599 -56240 68016 -46470
15804a68792A17058b86660C8657b1740k7862k23645R2480J5245A74815P1435k5918
$$ -168792 117058 -286660 38657 -21740 -49602 -273247 -180767 -165522 174815 246250 220332
15793B20332E188a66945A0136b12625A99893a68486O0001I6291K361f9069G9116
$$ 220332 5188 -166945 10136 -212625 199893 -168486 -108485 96291 98652 -69069 79116
15781i9958B8231b80685j00466b5925F4238M6166J9639a56440L9988N3683B6847
$$ -99958 28231 -280685 -381151 -25925 64238 110404 130043 -156440 -116452 -62769 26847
15769B0602I608J85184A7830Q6551b98216a27268j51412I0527a87594A63391g0347
$$ 20602 9608 194792 17830 104381 -298216 -127268 -278680 90527 -187594 163391 -70347
15757H9614j3586d2460B67386b59103A17440a51123O8447I2490a30335e4508A01702
$$ 89614 76028 -42460 267386 -259103 117440 -151123 -82676 92490 -130335 -54508 101702
15745b59455i2038A9809c49197h5718A73929D8436J66271d2598l55784E4424A5702
$$ -259455 -92038 19809 -349197 -85718 173929 48436 214707 -42598 -398382 54424 15702
15733D21441d5199j35292G1373J00622B2068K9789c3220A40557i4596B2027a77536
$$ 421441 -45199 -180491 71373 171995 22068 51857 -33220 140557 -94596 22027 -177536
15721a49358K3180C8460a44457e8263K7595k55985h6096F2846g7117p6507A12155
$$ -149358 -126178 38460 -144457 -58263 -30668 -286653 -86096 62846 -77117 -153624 112155
15709A10348K89149a85790A21326a92353K6060h2397j77188A28462f8324j81571
$$ 110348 399497 -185790 121326 -192353 -166293 -82397 -259585 128462 -68324 -249895
15699b49895p9880A03583c9080B68833A29185n8225J36647j5661K1914a61678
$$ -249895 -329775 103583 -39080 268833 129185 70960 207607 191946 213860 -161678
15688C44869A66671d02608A54098b10097g5830N18B54349c7904A40190o9283B1411
$$ 344869 166671 -402608 154098 -210097 -75830 -75312 254349 -37904 140190 70907 21411
15676c11489a35783k4749c5319A36605D1193d7495A33216L95778b76280J36630
$$ -311489 -135783 -160532 -35319 136605 41193 -47495 133216 528994 -276280 -139650
15666a39650B66634b1026C74639c47704a45332j4663j04802A85705a42190j83710
$$ -139650 266634 -21026 374639 -347704 -145332 -159995 -264797 185705 -142190 -325900
15656c25900E4441a2662j62571A84904e48k97266J43665k7605B07467l5146n8037
$$ -325900 54441 -12662 -175233 184904 -548 -297814 -154149 -181754 207467 172321 114284
15645A14284R6839J22958o8851e4255k90576i3301E8589a86509A1781g1949k87164
$$ 114284 211123 334081 265230 -54255 -344831 -93301 58589 -186509 11781 -71949 -359113
15634c59113A28844N0580c3530J1227k18103m19392A317J20978a71763A11323
$$ -359113 128844 179424 -33530 -22303 -240406 -659798 1317 122295 -171763 111323
15623c0359l27709a01727j74635d2828G6158K30931G514b20885m5330r3420p5997
$$ -30359 -358068 -101727 -276362 -42828 76158 307089 7514 -220885 -266215 -359635 -435632
15612d35632g2633j87409C87233c5760A01950a37205B22197n6969i1458p5963
$$ -435632 -72633 -260042 387233 -35760 101950 -137205 222197 165228 -91458 -167421
15602a67421N0961K7514C0641a01379B54a40047p805C00962A29295m509N273h4282
$$ -167421 -116460 -88946 30641 -101379 254 -140047 -147852 300962 129295 124786 130059 -84282
15589D2587A8130a28270j3550n1580g3108B6483i0738A41733K34110I0988d4513
$$ 42587 18130 -128270 -141820 -193400 -73108 26483 -90738 141733 375843 90988 -44513
15577I488K676K02573G2075a65157B369K42970j22394c28056B18694b08134R6505
$$ 9488 12164 214737 72075 -165157 2369 245339 122945 -328056 218694 -208134 -111629
15566a11629l6875j37527b8987j76430B76623A37567k4920d8010j261m6914b0619
$$ -111629 -148504 -286031 -28987 -205417 276623 137567 112647 -48010 -49271 -96185 -20619
15554D6955h6933j46700f7638C0075F512a06080j85900O4107H6064a83490I4688
$$ 46955 -86933 -233633 -67638 30075 6512 -106080 -291980 -227873 86064 -183490 94688
15542b51573J25747b2586q3979a0471A00417J1679J86059i7065k3929A39746a37043
$$ -251573 -125826 -22586 -106565 -10471 100417 112096 298155 -97065 -120994 139746 -137043
15530b21347a1912j85456A63850a07248R142A09140b17689e8696G8693J62514
$$ -221347 -11912 -197368 163850 -107248 -98106 109140 -217689 -58696 78693 241207
15520B41207A1565c9619G8428P939g369j92347f9585j26910c5127o5468A20175
$$ 241207 11565 -39619 78428 86367 -7369 -199716 -69585 -196495 -35127 -100595 120175
15508H4169B0781K81806h768G928a73475A49558f5707A71285b4933j24888c3751
$$ 84169 20781 302587 -8768 7928 -173475 149558 -65707 171285 -24933 -149821 -33751
15496c1630l88035h2367C9355J11258f1917C25680B8568K08802A17547a01081
$$ -31630 -419665 -82367 39355 150613 -61917 325680 28568 237370 117547 -101081
15485d517l54549B28055c02622j35214B27951D8388d3122G3094e2338k68700H2412
$$ -4517 -359066 228055 -302622 -437836 227951 48388 -43122 73094 -52338 -321038 82412
15473C45800o9885a46738P2621A23507K08038f1315j19739m0047i5614B3019K1089
$$ 345800 275915 -146738 -74117 123507 331545 -61315 -181054 -221101 -95614 23019 44108
15462D4108k0792f9629K773D1928a40995C30635A06357c88256a77970F7947a56419
$$ 44108 23316 -69629 -66856 41928 -140995 330635 106357 -388256 -177970 67947 -156419
15450b58872f8973m5367F678K3965a08192B77918j04821J82990B6707J68964c6793
$$ -258872 -68973 -114340 6678 30643 -108192 277918 173097 356087 26707 195671 -36793
15438f0920H0325L38613g178H6959J38461i3714A5990K1569g4146k431A76072
$$ -60920 80325 418938 -7178 86959 225420 -93714 15990 37559 -74146 -76577 176072
15426H387f1681n8753D2025J0876e2833b2726j9936k01342b4786r7344J0215B08166
$$ 8387 -61681 -120434 42025 52901 -52833 -22726 -42662 -244004 -24786 -122130 -111915 208166
15413a2714m2634C8427e326A96799p0859l797a14399A10801K3442b8182j02999
$$ -12714 -55348 38427 -5326 196799 125940 122143 -114399 110801 134243 -28182 -131181
15402a31181k4825K4662B20660D447a03128b7506E6989K24151b56016A40401F2659
$$ -131181 -156006 -131344 220660 4447 -103128 -27506 56989 281140 -256016 140401 62659
15390i5947E9192a86147k33859B76162D1840b1615B01469c09399A21235A7160
$$ -95947 59192 -186147 -420006 276162 41840 -21615 201469 -309399 121235 17160
15379b03811D08042b08918j90691a21504A54996D5555a15715F2090a520H5117
$$ -203811 408042 -208918 -399609 -121504 154996 45555 -115715 62090 -1520 85117
15368c1963B10300N4650b7664j63899j07739e70A39708P3007A3611K6170K52123
$$ -31963 210300 264950 -27664 -191563 -299302 -570 139708 212715 13611 39781 291904
15357B91904o2116K10598H34i8214k10063J36566A20008m4522a3088G8749a92967
$$ 291904 229788 440386 834 -98214 -308277 -171711 120008 75486 -13088 78749 -192967
15345B54549H3803L8874g0038B03836J66634a51703N3897P969J948H1796f3065
$$ 254549 83803 122677 -70038 203836 370470 -151703 -97806 -89837 -87889 81796 -63065
15333B99276d4448E841R076a15303d6240B0099c61996h0830K2338I4839J26661
$$ 299276 -44448 5841 14917 -115303 -46240 20099 -361996 -80830 -58492 94839 221500
15322B21500a86140A68001B9182i7140m2763a3764I38a1926o1742b5578j76394
$$ 221500 -186140 168001 29182 -97140 -139903 -13764 938 -11926 -73668 -25578 -201972
15311b01972C0007b16341k8185A84321b33894b3611C9628M8169C1404K96522D7065
$$ -201972 30007 -216341 -244526 184321 -233894 -23611 39628 87797 31404 327926 47065
15299B90438A13108e1328m3798G3444a72285f92m7643C01102D8175K24740B0389
$$ 290438 113108 -51328 -95126 73444 -172285 -692 -48335 301102 48175 272915 20389
15287I742J35391a83072j2476B78566b07865A01722a54609M3236B0946K2045J43803
$$ 9742 145133 -183072 -195548 278566 -207865 101722 -154609 -111373 20946 42991 186794
15276A86794G436R5933e5094C51099j15324a44976N4242n1427B69070m815E0544
$$ 186794 7436 103369 -55094 351099 235775 -144976 -90734 -142161 269070 264255 50544
15264B40223b54455h3526I486K18505C8031M6127a59635G7278f0517A31793P0045
$$ 240223 -254455 -83526 9486 227991 38031 84158 -159635 77278 -60517 131793 201838
15253B01838K62433R3084A46112K0318N76718P21358m16396J11183K11736F78207
$$ 201838 464271 557355 146112 166430 743148 1464506 1048110 1159293 1371029 678207
15242D53311j85808M29477A06933K33475G0638P4860Q1005m9579n9366a59445
$$ 453311 267503 696980 106933 340408 70638 145498 226503 176924 117558 -159445
15231B923L6710a2836C33643C2870c17307C15813C4596K4678K35047i5935c8926
$$ 2923 39633 -12836 333643 32870 -317307 315813 34596 59274 294321 -95935 -38926
15219A03258O0426N642H2773e7078j59971f4791L2069j75658B8880L38124l92
$$ 103258 163684 169326 82773 -57078 -217049 -64791 -32722 -208380 28880 367004 366612
15208C66612A44587d7068F0680J66009J93893D0639e8053B98712a01132C77053
$$ 366612 144587 -47068 60680 226689 420582 40639 -58053 298712 -101132 377053
15197B18039E7889c4914r780k79157a08000k2298A13206g4688A4254F520J47683
$$ 218039 57889 -34914 -44694 -323851 -108000 -130298 113206 -74688 14254 6520 154203
15186A54203b2934k3848A72140H2589l9149B433b21588A12490Q7L4823J1713B7088
$$ 154203 -22934 -46782 172140 82589 43440 2433 -221588 112490 112577 147400 159113 27088
15173a24282M8362A98677q6071E4759P2964P9330I0925M4681a46968B90194G2831
$$ -124282 -75920 198677 112606 54759 127723 207053 90925 135606 -146968 290194 72831
15161C05896j41378b2247B64662M3800A46727g1903K1617j57740A43997a2224
$$ 305896 164518 -22247 264662 308462 146727 -71903 -50286 -208026 143997 -12224
15150C9095r557P6134a9758C85738D4309J97767I0132b3391j46846E015O5904
$$ 39095 29538 105672 -19758 385738 44309 242076 90132 -23391 -170237 5015 70919
15139G0919J09908a2373C36995a56198A13484C2964M15056A26487J33450r9373
$$ 70919 180827 -12373 336995 -156198 113484 32964 448020 126487 259937 160564
15129A60564J8555J1716p0844g1369L2254B13020J9496g041D57622q5930N4407
$$ 160564 179119 190835 119991 -71369 -39115 213020 232516 -7041 457622 371692 426099
15118D26099e3135p0980I5511K30314F409K39858a58348A57363L47193B31572
$$ 426099 -53135 -124115 95511 325825 6409 246267 -158348 157363 504556 231572
15107a11268C8464a78399A50323R5801P8574a2804o6861E23327q4846A34176d1704
$$ -111268 38464 -178399 150323 246124 324698 -12804 -79665 523327 438481 134176 -41704
15095C83145b24806J0570B37736a01166B2158a74565B43789j08660L4089A7957
$$ 383145 -224806 -214236 237736 -101166 22158 -174565 243789 135129 169218 17957
15084D07209A70196J47408J83250A41983D9208K21072n9058A00572J32443I3190
$$ 407209 170196 317604 500854 141983 49208 270280 211222 100572 233015 93190
15073C37188I892K17258Q8276D9744h9979G4364L36694A02260R2734G9032L04249
$$ 337188 9892 227150 315426 49744 -89979 74364 411058 102260 194994 79032 383281
15062C83281A55246a24650J9986k6310j24729C25847A62019J86853b18839F0598
$$ 383281 155246 -124650 -104664 -130974 -255703 325847 162019 348872 -218839 60598
15051E3525O5978c2737B45803F0174J46308j4025O3994j3857H7652J55236M554
$$ 53525 119503 -32737 245803 60174 206482 192457 256451 242594 87652 242888 247442
15040B47442K49132A11501l0170B7812b9046A02337L4403J65503K8837M6027A10880
$$ 247442 496574 111501 81331 27812 -29046 102337 136740 302243 331080 377107 110880
15028E3008J11190E2784M9495K24147o6438I1015L02355B093K62579c1888A44274
$$ 53008 164198 52784 102279 326426 259988 91015 393370 2093 264672 -31888 144274
15016C0611d6327m13153A88352J6734E950J77210a43994C75583m0539c1300C85139
$$ 30611 -46327 -459480 188352 205086 5950 183160 -143994 375583 335044 -31300 385139
15004A72505e2517A82834K10742J10016j66106I6951D1196J60745B7272Q0356
$$ 172505 -52517 182834 393576 503592 337486 96951 41196 201941 27272 107628
14994A07628K73547B8157g278C38641j28381K3023e1317D7009K04256J3798J31268
$$ 107628 381175 28157 -7278 338641 210260 233283 -51317 47009 251265 265063 396331
14983C96331A65602J85821L972R508r1786l568J8916J68823k11606e9721K3889
$$ 396331 165602 351423 355395 364903 273117 269549 288465 457288 245682 -59721 -35832
14972c5832m4238A02927K12197J10833A29776j6974M0784K33652k681n0780A57086
$$ -35832 -80070 102927 315124 425957 129776 112802 153586 387238 384557 333777 157086
14960B67584l9554o2999o8458L95082j15421Q583n1697K29770k21649J75388A01318
$$ 267584 228030 165031 96573 491655 376234 384817 333120 562890 341241 516629 101318
14948E08142k31720L52280E1692M1655c8130F62772j51282k32359E1546J52745
$$ 508142 276422 628702 51692 93347 -38130 662772 511490 279131 51546 204291
14938B04291K62065A19996L3325o6458K47396O2593n7258j09803J28455J99697
$$ 204291 466356 119996 153321 86863 334259 396852 339594 229791 358246 557943
14928E57943A44984j133K1953K17539H7668M39018a98710C89940K16298m2752
$$ 557943 144984 143851 165804 383343 87668 526686 -198710 389940 606238 563486
14918E63486k18396D0131M04626Q4970A11624C8265K02819J95820A58152J21068
$$ 563486 345090 40131 444757 529727 111624 38265 241084 436904 158152 279220
14908B79220J42782A63176P9849j20554M73309k52498e0810B7276M11926D5704
$$ 279220 422002 163176 243025 122471 595780 343282 -50810 27276 439202 45704
14897D74138B17704O0963K48376E4102k306K05114k5659L17447B32832r5181L62477
$$ 474138 217704 278667 527043 54102 51796 256910 231251 548698 232832 137651 500128
14886E00128q0288l600F6083J55845J11283j31170J92181j8643j62124J57949
$$ 500128 419840 416240 66083 221928 333211 202041 394222 375579 213455 371404
14876C71404A67912o2295a715C26092J5810H3500K54342L82771A40161K88928
$$ 371404 167912 105617 -1715 326092 341902 83500 337842 720613 140161 429089
14866D29089J89134A16650L14552p4330J5146j01670L28786j1839J55302B48708
$$ 429089 618223 116650 431202 356872 372018 270348 599134 587295 742597 248708
14855D41400J51692N2234k34119K18857B94231K08128k46545L09792q4860n7674
$$ 441400 593092 645326 411207 630064 294231 502359 255814 565606 480746 423072
14845D23072j35964j18690O4185k1832K68386j39704m6050J71117K44438K7236
$$ 423072 287108 168418 232603 210771 479157 339453 293403 464520 708958 736194
14835G36194l61893J60627o1056N2606j6243o5982k01328N56126j30839j91780
$$ 736194 374301 534928 473872 526478 510235 444253 242925 799051 668212 476432
14825D76432k6232L00836B46892p506K48093M2871j647J14227J06749C69744J83744
$$ 476432 450200 751036 246892 239386 487479 530350 528703 642930 749679 369744 553488
14814E53488j7459k61092K78861J72084j18230K29824B33567L04863O8794o7730
$$ 553488 536029 274937 553798 725882 607652 837476 233567 538430 607224 539494
14804E39494l6009j10411j4587L40151j27120j05341J09236k45647L25765B93427
$$ 539494 503485 393074 378487 718638 591518 486177 595413 349766 675531 293427
14793D78147K24176C43229L19421J75085l74287K39512k26654k9653K71261B24678
$$ 478147 702323 343229 662650 837735 463448 702960 476306 446653 717914 224678
14782G63774C40400L92411k88746j49164N96462k31831C29028J05176o257j56097
$$ 763774 340400 732811 444065 294901 891363 659532 329028 434204 427947 271850
14772B71850K12814K80636K21822l03279m7399K03961j22171L6430q8509k43788
$$ 271850 484664 765300 987122 683843 636444 840405 718234 754664 666155 422367
14762D22367l140L17834L7156q5291k94974J67296L66905j61977j59863k61788
$$ 422367 419227 737061 774217 688926 393952 561248 928153 766176 606313 344525
14752C44525L71319j63721r9187M33940l51529K85980k71659q4285N60575k67106
$$ 344525 715844 552123 452936 886876 535347 821327 549668 465383 1025958 758852
14742G58852J58888j63181j0562j11147M46255l67801j22838K52906Q5785m49730
$$ 758852 917740 754559 743997 632850 1079105 711304 588466 841372 927157 477427
14732D77427K14636J50769K4960k62423J43718M0095L0707j86038K89211k86397
$$ 477427 692063 842832 867792 605369 749087 789182 819889 633851 923062 636665
14722F36665M80635l26862O1903R9955n8077J28184l01163q9292M19287O3914
$$ 636665 1117300 790438 852341 952296 894219 1022403 721240 631948 1051235 1115149
14712A115149m70397J81236j59773M54R5470n6583L57699j95774K1816k25486
$$ 1115149 644752 825988 666215 666669 762139 705556 1063255 867481 889297 663811
14702F63811M6345j08996L15385J74601l23777o0420J64771j46705j9234J57612
$$ 663811 710156 601160 916545 1091146 767369 706949 871720 725015 705781 863393
14692H63393r7177K82203k25095L13377k47916J18399q7343l10125K27532J09477
$$ 863393 766216 1048419 823324 1136701 888785 1007184 919841 609716 837248 946725
14682I46725R213J7481J99956j81717J5862Q1444l8623q8660O3100O8487k75044
$$ 946725 955938 973419 1173375 991658 1007520 1088964 1050341 961681 1024781 1093268 818224
14671H18224K76645K73741k37842k91792K18016r8152K52712M3892k91913K42621
$$ 818224 1094869 1368610 1130768 838976 1056992 958840 1211552 1255444 963531 1206152
14661A206152l99541K44994L0460j38869K93815j68419K51724l83656J26232J58050
$$ 1206152 806611 1051605 1082065 943196 1237011 1068592 1320316 936660 1062892 1220942
14651A220942r6621K6757R3386m0067k38644J08065R644P9087j43558K03537K63982
$$ 1220942 1124321 1151078 1244464 1204397 965753 1073818 1083462 1162549 1018991 1222528 1486510
14640A486510n9844M8838j77941j1797k17377L72771q0854P3208j69914Q5797
$$ 1486510 1426666 1475504 1297563 1285766 1068389 1441160 1360306 1433514 1263600 1349397
14630A349397J91201j80806N192l0758j3903j53270j65307Q55843m13148J8337
$$ 1349397 1540598 1359792 1364984 1334226 1320323 1167053 1001746 1857589 1444441 1462778
14620A462778j88035J67724R2780j43269J12750R1614j98071M99357p87353L70946
$$ 1462778 1274743 1442467 1535247 1391978 1504728 1596342 1398271 1897628 1110275 1481221
14610A481221j74384K05249J73502L7102k10256K97986j24486l04276O98883j03503
$$ 1481221 1306837 1512086 1685588 1722690 1512434 1810420 1685934 1381658 2080541 1977038
14600A977038k79667k09214O5102o3986p2228J91222j4537J5441l84J23809j30789
$$ 1977038 1697371 1488157 1553259 1489273 1417045 1608267 1593730 1609171 1608787 1732596 1601807
14589A601807L92638K18504o00670L17277J7694j83590M7270j27323K84002J7325
$$ 1601807 1994445 2212949 1612279 1929556 1947250 1763660 1810930 1683607 1967609 1984934
14579A984934P9630L5204K09077m29583J66182r8129M32448n1564l70271N74951
$$ 1984934 2064564 2099768 2308845 1879262 2045444 1947315 2379763 2328199 1957928 2532879
14569B532879q6125j75502j54425K28939j46554K07583M68260m82673O10518m09433
$$ 2532879 2446754 2271252 2116827 2345766 2199212 2406795 2875055 2392382 3002900 2593467
14559B593467J33313K93715J38605K22258k76221K23064P62107J92335J77432
$$ 2593467 2726780 3020495 3159100 3381358 3105137 3328201 4090308 4282643 4460075
14550D460075J130585J540335L571207Q658467K1422269R596414B3339400I780670
$$ 4460075 5590660 7130995 10702202 19360669 40782938 50379352 23339400 9780670
14541D788240j370984m54516n11182j57383K30605o32141K32319j42911K42337
$$ 4788240 3417256 2962740 2451558 2294175 2524780 1892639 2124958 1982047 2224384
14532B224384k94676j26249O55735j09651k63398K51467j73965R7761K94541j11848
$$ 2224384 1929708 1803459 2459194 2349543 2086145 2337612 2163647 2261408 2555949 2444101
14522B444101l0867L9385L81159L8947k70774l84813N22449m9193Q7970J55354
$$ 2444101 2413234 2452619 2833778 2872725 2601951 2217138 2739587 2690394 2778364 2933718
14512B933718P4016j77185K22331m4522K75234l08964K57566j52748k11094K43041
$$ 2933718 3007734 2830549 3052880 3008358 3283592 2974628 3232194 3079446 2868352 3111393
14502C111393k42017M59741k69346R0617K97439N6544k44897M91447m11081m5463
$$ 3111393 2869376 3329117 3059771 3150388 3447827 3504371 3259474 3750921 3339840 3294377
14492C294377N58392k52947M37489n06009J89750l3205K21160k5625n5805k0719
$$ 3294377 3852769 3599822 4037311 3531302 3721052 3687847 3909007 3883382 3827577 3806858
14482C806858J51424J5226k52741M06946o0476K10399p743Q6436K38771m34527
$$ 3806858 3958282 3973508 3720767 4127713 4067237 4277636 4269893 4356329 4595100 4160573
14472D160573J57489N99140k91452k2977O7648j4069J22705J93199k44477K40424
$$ 4160573 4318062 4917202 4625750 4602773 4670421 4656352 4779057 4972256 4727779 4968203
14462D968203j28100J83051J70157l87129K23193L8272M07545j07152R9303J29227
$$ 4968203 4840103 5023154 5193311 4806182 5029375 5067647 5475192 5368040 5467343 5596570
14452E596570L780j70663q3256M15656L15535k23297Q2184k45950M84186J1328
$$ 5596570 5600350 5429687 5346431 5762087 6077622 5854325 5936509 5690559 6174745 6186073
14442F186073J9359K03066o1496K34916k30623J36103L04578K48052j49310L24090
$$ 6186073 6205432 6408498 6347002 6581918 6351295 6487398 6791976 7040028 6890718 7214808
14432G214808L6642j7639r322m09914O64634J03993o1839L60864m78142O55049
$$ 7214808 7251450 7233811 7224489 6814575 7479209 7583202 7521363 7882227 7404085 8059134
14422H059134n6948N8105R6151K57524k61353P04573M0110J14756J50629Q8416
$$ 8059134 8002186 8060291 8156442 8413966 8152613 8857186 8897296 9012052 9162681 9251097
14412I251097J1480k11087L35056K85292J01781L58702j06592K09801L14449j79288
$$ 9251097 9262577 9051490 9386546 9671838 9773619 10132321 10025729 10235530 10549979 10370691
14402A0370691P09005k01338J58575J55227O5774M63890k35238L74229M51358
$$ 10370691 11079696 10878358 11036933 11192160 11257934 11721824 11486586 11860815 12312173
14393A2312173j45973L91051K15073J33814M62585J40389k80173M21729N17572
$$ 12312173 12166200 12557251 12772324 12906138 13368723 13509112 13228939 13650668 14168240
14384A4168240Q4015L66258J05950O46660J97962K49119L54820p0200M62886O67799
$$ 14168240 14252255 14618513 14724463 15371123 15569085 15818204 16173024 16102824 16565710 17233509
14374A7233509N4341O03233K57303L18221L5492Q68981M21645J43359O21060J96075
$$ 17233509 17287850 17891083 18148386 18466607 18502099 19371080 19792725 19936084 20557144 20753219
14364B0753219L38598P46332J92409N50739O83016J69335N19437Q36664L07962
$$ 20753219 21091817 21838149 22030558 22581297 23264313 23433648 23953085 24789749 25097711
14355B5097711P08068M66132Q19276M70041R36670L33279Q22827J043958N54311
$$ 25097711 25805779 26271911 27091187 27561228 28497898 28831177 29654004 30697962 31252273
14346C1252273Q01372Q86195Q55346J037636M61467J218052J030095J066018J026306
$$ 31252273 32053645 32939840 33795186 34832822 35294289 36512341 37542436 38608454 39634760
14337C9634760J185094Q00418J468633R72102J499468J644365R19461J648772
$$ 39634760 40819854 41620272 43088905 44061007 45560475 47204840 48124301 49773073
14329D9773073J677268J554434J902692J778948J546123K128225K191328K051961
$$ 49773073 51450341 53004775 54907467 56686415 58232538 60360763 62552091 64604052
14321F4604052K185546K214367K524626K475169K865616K762605L332313L048447
$$ 64604052 66789598 69003965 71528591 74003760 76869376 79631981 82964294 86012741
14313H6012741L571818L296785L711316L663501M553242M263892M497903N101964
$$ 86012741 89584559 92881344 96592660 100256161 104809403 109073295 113571198 118673162
14305A18673162N278318N611051N579317O416469O514713O839967P322024P930104
$$ 118673162 123951480 129562531 135141848 141558317 148073030 154912997 162235021 170165125
14297A70165125Q109677Q503082R401475R830008J0124880J1019336J1314420
$$ 170165125 178274802 186777884 196179359 206009367 216134247 227153583 238468003
14290B38468003J1884167J2698326J3204291J3313968J4394759J4254174J4854541
$$ 238468003 250352170 263050496 276254787 289568755 303963514 318217688 333072229
14283C33072229J4958788J5129294J5207019J4816975J4413613J3830541J3194849
$$ 333072229 348031017 363160311 378367330 393184305 407597918 421428459 434623308
14276D34623308J1790869J0440127Q023786O124168K878767m08367k528453k630562
$$ 434623308 446414177 456854304 464878090 471002258 473881025 473472658 470944205 468313643
14268D68313643l634524o951168p965350r235380j0904925j1742458j2941850
$$ 468313643 464679119 457727951 449762601 440527221 429622296 417879838 404937988
14261D04937988j4023412j4907535j5429812j5673449j5603915j5525392j4396906
$$ 404937988 390914576 376007041 360577229 344903780 329299865 313774473 299377567
14254B99377567j3780802j4177494j3427449j2653145j2206564j1248797j1001418
$$ 299377567 285596765 271419271 257991822 245338677 233132113 221883316 210881898
14247B10881898j0100811r986594q913552q438506p991899p663589p266729o907395
$$ 210881898 200781087 190794493 181880941 173442435 165450536 157786947 150520218 143612823
14239A43612823o550085n630522n475276n473243n132756n134618m269931m240142
$$ 143612823 137062738 131432216 125956940 120483697 115350941 110216323 105946392 101706250
14231A01706250l981648l472922l901311l726087l323311l031012k942274k688225
$$ 101706250 97724602 94251680 90350369 86624282 83300971 80269959 77327685 74639460
14223G4639460k787983k510752k344082k013608k440496k308099j684936k024730
$$ 74639460 71851477 69340725 66996643 64983035 62542539 60234440 58549504 56524774
14215E6524774j725484j601562j094884j965168j519493j603093j467594q46826
$$ 56524774 54799290 53197728 52102844 50137676 48618183 47015090 45547496 44700670
14207D4700670j146856q95149j668837j175970j350637o26972j069219k92428
$$ 44700670 43553814 42658665 40989828 39813858 38463221 37836249 36767030 36474602
14199C6474602j197504r51121j520996m61917q59118q21527o96406m06683j133296
$$ 36474602 35277098 34325977 32804981 32343064 31483946 30662419 29966013 29559330 28426034
14190B8426034n97429p34567k63398j123833l53469n38281o28333m27822m04961
$$ 28426034 27828605 27094038 26830640 25706807 25353338 24815057 24186724 23758902 23353941
14181B3353941q46377n78113m02886k14788m91368l51863k88121n60869m55231
$$ 23353941 22507564 21929451 21526565 21311777 20820409 20468546 20180425 19619556 19164325
14172A9164325j68594l76363m14686j78995o86233k28025j64779l52997j13079
$$ 19164325 18995731 18619368 18204682 18025687 17339454 17111429 16946650 16593653 16480574
14163A6480574m09154l96139l08924m29376R056j94526k56846j83172k51634j60620
$$ 16480574 16071420 15675281 15366357 14936981 14946037 14751511 14494665 14311493 14059859 13899239
14153A3899239n01313k09628k08050j23099o95351J08077m15513K27823k24418
$$ 13899239 13397926 13188298 12980248 12857149 12161798 12269875 11854362 12082185 11857767
14144A1857767O7934o63363j01978j35272p4710N0060k89045m57475R0231q0319
$$ 11857767 11925701 11262338 11160360 11025088 10950378 11000438 10711393 10253918 10344149 10263830
14134A0263830m07631O1221l48363l03623K17026k88566m6327j11363J03295k94080
$$ 10263830 9856199 9917420 9569057 9265434 9482460 9193894 9147567 9036204 9139499 8845419
14124H845419j97377j63281r3323M2088j70652n5138k54935j52382j88369l4039
$$ 8845419 8648042 8484761 8391438 8433526 8262874 8207736 7952801 7800419 7612050 7578011
14114G578011r8437j79515K45099l77699J74737m75534J4631O0115j92910n9660
$$ 7578011 7479574 7300059 7545158 7167459 7342196 6866662 6881293 6941408 6748498 6688838
14104F688838K75086q37830L64672j8438n6807J05595m05857Q53J7265j72395
$$ 6688838 6963924 6126094 6490766 6472328 6415521 6521116 6115259 6116112 6133377 5960982
14094E960982r3619L54765k18429k59579j79980K8715j0886k8194m2046j28787
$$ 5960982 5867363 6222128 6003699 5744120 5564140 5592855 5581969 5553775 5511729 5382942
14084E382942M6350n62733M60328l36894J4735J48181k20408M58059l15004k66938
$$ 5382942 5429292 4866559 5326887 4989993 5004728 5152909 4932501 5390560 5075556 4808618
14074D808618p3510p8657n2048J58082j92823P4617j22682J78189k85204p9049
$$ 4808618 4735108 4656451 4604403 4762485 4569662 4644279 4521597 4699786 4414582 4335533
14064D335533J70495J784k74460R3553j06877J63740K06440n05711p0767J92972
$$ 4335533 4506028 4507812 4233352 4326905 4220028 4383768 4590208 4084497 4013730 4206702
14054D206702j24923j86017J75818p8303J53462j49634j84672k8457M9889N0498
$$ 4206702 4081779 3895762 4071580 3993277 4146739 3997105 3812433 3783976 3833865 3884363
14044C884363l50472P0356j52280K3013k86251M9645K34723J00481k79309j19910
$$ 3884363 3533891 3604247 3451967 3474980 3188729 3238374 3473097 3573578 3294269 3174359
14034C174359o1430K55389m7778r9013K5918K23499P0636l77014j57633J62109
$$ 3174359 3112929 3368318 3320540 3221527 3247445 3470944 3541580 3164566 3006933 3169042
14024C169042k76982j04374R2174j12055J21331J8126l34074m1988M56529l60454
$$ 3169042 2892060 2787686 2879860 2767805 2889136 2907262 2573188 2531200 2987729 2627275
14014B627275K67073k19189j17491K57819o1060m01685K22287Q2767j7377J02266
$$ 2627275 2894348 2675159 2557668 2815487 2754427 2352742 2575029 2657796 2640419 2742685
14004B742685n35125L47628n00860N09696Q3176l98199M6409j60906J46992K57681
$$ 2742685 2207560 2555188 2054328 2564024 2647200 2249001 2295410 2134504 2281496 2539177
13994B539177m89450r1857L88308K15905J19421R71446J905283O257348K0301575
$$ 2539177 2049727 1957870 2346178 2562083 2681504 3652950 5558233 11815581 32117156
13985C2117156J8741077k3650789j2863738n726914k419510j162661o83752l24054
$$ 32117156 50858233 27207444 14343706 8616792 6197282 5034621 4350869 4026815
13977D026815l11399o77523j0802K31465r9552l03908l42482L29650l75761M32109
$$ 4026815 3715416 3037893 3027091 3258556 3159004 2855096 2512614 2842264 2466503 2898612
13967B898612l92347O6197Q2611j71477m47286O9419M27707K13747l63212R3730
$$ 2898612 2506265 2572462 2655073 2483596 2036310 2105729 2533436 2747183 2383971 2477701
13957B477701l34297q1871L6834k07976K87889o4228n6372J09476J69422q2357
$$ 2477701 2143404 2061533 2098367 1890391 2178280 2114052 2057680 2167156 2336578 2254221
13947B254221j99845P5706m09751L51375m41187K76916o5371k46772J48545J80141
$$ 2254221 2054376 2130082 1720331 2071706 1630519 1907435 1842064 1595292 1743837 1923978
13937A923978j92953N114J91942L8984k90435K63851j33280m60055L03374K30262
$$ 1923978 1731025 1736139 1928081 1967065 1676630 1940481 1807201 1347146 1650520 1880782
13927A880782r2088n7715M6987j73724K69632j86327J8584j32258L9776J61755
$$ 1880782 1788694 1730979 1777966 1604242 1873874 1687547 1706131 1573873 1613649 1775404
13917A775404j98951j65999J58068p9012J81009l03589R1548k5359K79665j31448
$$ 1775404 1576453 1410454 1568522 1489510 1670519 1366930 1458478 1433119 1712784 1581336
13907A581336j90730j25981Q8865L63650k75274J2115M4936p1504L8036j55347
$$ 1581336 1390606 1264625 1353490 1717140 1441866 1453981 1498917 1427413 1465449 1310102
13897A310102L1524m6412L60750l66728K99344k08888p1065L8953j35195J02008
$$ 1310102 1341626 1295214 1655964 1289236 1588580 1379692 1308627 1347580 1212385 1314393
13887A314393M47128j90252j8998o56666L64054l57093M82823r3760l4684j8307
$$ 1314393 1761521 1571269 1552271 895605 1259659 902566 1385389 1291629 1256945 1238638
13877A238638k5157K36506l0158l67370K00933J87381j87271j65283J72601K51782
$$ 1238638 1213481 1449987 1419829 1052459 1253392 1440773 1253502 1088219 1260820 1512602
13867A512602n11571J9486J19028J02335J0226J1496M5130j72935Q8075j7790
$$ 1512602 1001031 1020517 1139545 1241880 1252106 1263602 1308732 1135797 1223872 1206082
13857A206082M69249n51569J16797j16104k45329R0974J11395k43499K21670n511
$$ 1206082 1675331 1123762 1240559 1124455 879126 970100 1081495 837996 1059666 1054155
13847A054155j42591J9141j00500J99419L19922j75422p8450N4125P8309J87391
$$ 1054155 911564 930705 830205 1029624 1349546 1174124 1095674 1149799 1228108 1415499
13837A415499l28974J3641k55299l907L9017J2389J97262j25505J47932j50731
$$ 1415499 1086525 1100166 844867 840960 879977 892366 1089628 964123 1112055 961324
13827I61324r5535k81448r6352P31459N4949E74779R6768K70141j24981J24232
$$ 961324 865789 584341 487989 1219448 1274397 574779 671547 941688 816707 940939
13817I40939k0724p392p3399k40914J62680M39880l05585L18656l23411k7448
$$ 940939 920215 912823 839424 598510 761190 1201070 895485 1214141 890730 863282
13807H63282j09945K32156j96885K44129l14466K16726l1168m3178J23194j01622
$$ 863282 753337 985493 788608 1032737 718271 934997 903829 860651 983845 882223
13797H82223l1164m3133J81296J06292l72937L57829D62540N30538k22037K98117
$$ 882223 851059 807926 989222 1095514 722577 1080406 462540 993078 771041 1069158
13787A069158j89731j47875J04431J5431l80359J52408J37869K807k1140k56271
$$ 1069158 879427 731552 835983 851414 471055 623463 761332 764139 742999 486728
13777D86728J75693J6729l11390N21560j71201M3107m6494K7112n7373k62110
$$ 486728 662421 679150 367760 889320 718119 761226 714732 741844 684471 422361
13767D22361N22200j06022k11858K06195m3740k21777M36757l49781J47119k13667
$$ 422361 944561 838539 626681 832876 789136 567359 1004116 654335 801454 587787
13757E87787M544L19978l26576M25294j06463k39688j74843A08057L40334K64219
$$ 587787 592331 912309 585733 1011027 904564 664876 490033 108057 448391 712610
13747G12610j65771K32905k3912p7358j21406L57106l98216k4963L17722k1342
$$ 712610 546839 779744 755832 678474 557068 914174 515958 490995 808717 787375
13737G87375j93226L7839j08396j48912L56472M5502C66568J68860K00685k78671
$$ 787375 594149 631988 523592 374680 731152 776654 366568 535428 736113 457442
13727D57442L91440C95963J92799j94411L07964k5307k11278O4389P3125m6552
$$ 457442 848882 395963 588762 394351 702315 677008 465730 530119 603244 556692
13717E56692K50868l75884K08914J15001k53578K83057K8828l23521M44672l90790
$$ 556692 807560 431676 640590 755591 502013 785070 813898 490377 935049 544259
13707E44259J29301A55505M36960B95401J14808L29609J15464p0119B76651L24752
$$ 544259 673560 155505 592465 295401 410209 739818 855282 785163 276651 601403
13697F01403L8853n8426q9647K21349B37220M19991P3658j81573K11169j70134
$$ 601403 640256 581830 492183 713532 237220 657211 730869 549296 760465 590331
13687E90331P3802m7916k23578J79251K34936j86231J85266k06844j51773L13160
$$ 590331 664133 616217 392639 571890 806826 620595 805861 599017 447244 760404
13677G60404L2859j56539k90016M00444j06983J70008B68059L69167j73412j23385
$$ 760404 793263 636724 346708 747152 640169 810177 268059 637226 463814 340429
13667C40429P0376q7025L57286k59298J00592j60013r7317M6440J83775p3432
$$ 340429 410805 323780 681066 421768 522360 362347 265030 311470 495245 421813
13657D21813j19635J87358P6178q4996K2548j17449J56562j64972A52752K1844
$$ 421813 302178 489536 565714 480718 503266 385817 542379 377407 152752 174596
13647A74596M20877k15049P2379L00586B56683J95020K15548B50815M13522j64042
$$ 174596 595473 380424 452803 753389 256683 451703 667251 250815 664337 500295
13637E00295N5567j19602j12328J82158B02553L51081j59619m8581L13626k19952
$$ 500295 555862 436260 323932 506090 202553 553634 394015 345434 659060 439108
13627D39108P9723j15919R0149q4416I5678K41379K56759A26080L64146j53497
$$ 439108 518831 402912 493061 408645 95678 337057 593816 126080 490226 336729
13617C36729L45388j49278M6907A32702Q0417J16103K30260N0191j45254p9641
$$ 336729 682117 532839 579746 132702 213119 329222 559482 609673 464419 384778
13607C84778k0874J21051j17335K92463C04822P0732J58216J15013B87543J88233
$$ 384778 363904 484955 367620 660083 304822 375554 533770 648783 287543 475776
13597D75776j35968K84830J87456j94292p141D7227K89848j31083K78885L243
$$ 475776 339808 624638 812094 617802 610661 47227 337075 205992 484877 488120
13587D88120k04182K9844k4107J5574K68912B73512A17389L56713k03843M68490
$$ 488120 283938 313782 289675 305249 574161 273512 117389 474102 270259 738749
13577G38749l65615a5752D29282K65165q8166j94706K9993m7682J80178B78600
$$ 738749 373134 -15752 429282 694447 606281 411575 441568 393886 574064 278600
13566C27053j23794J38984K1791A71778N1637J18283j35859q6155O0023m6584
$$ 327053 203259 342243 364034 171778 223415 341698 205839 119684 179707 133123
13556A33123J78027F9242M31469r0047j03378j22507J40222J39368j03606K9767
$$ 133123 311150 69242 500711 410664 307286 184779 325001 464369 360763 390530
13546C90530J40938j34288j74836M1957J42230Q629j42587J96065j24935A54118
$$ 390530 531468 397180 222344 264301 406531 415160 272573 468638 343703 154118
13535D32076K15988n7195B45327b889A06975M91764j37795o2260j56425P6316
$$ 432076 648064 590869 245327 -2889 106975 598739 460944 398684 242259 318575
13525C18575J29713B09585O7887B6793M16364p3126A78671M77784k38452j37369
$$ 318575 448288 209585 277472 26793 443157 370031 178671 656455 418003 280634
13515B80634C9299L27835P2578r891j08242F9301F758L10572K23839h4593B84967
$$ 280634 39299 367134 439712 429821 321579 69301 6758 317330 541169 -84593 284967
13503A58254p148K19496r8145M8483J88139k22190M1419N2057A75946Q0536M41179
$$ 158254 151106 370602 272457 320940 509079 286889 328308 380365 175946 256482 697661
13492F97661l34863B6389M08202A44459L5701L72989e3681B26582L5289k8588
$$ 697661 362798 26389 434591 144459 180160 553149 -53681 226582 261871 233283
13482B33283J81434j01500K8773R0891E9834b10755b3972A00856K05784m9140
$$ 233283 414717 313217 341990 432881 59834 -210755 -23972 100856 306640 257500
13472B57500L4738o4042J21932H9129c6212B23973o2289a44309A07767K69725
$$ 257500 292238 228196 350128 89129 -36212 223973 161684 -144309 107767 377492
13462C77492j52939j07245n7272K57466M9562j41788b16693B09032K8268K73591
$$ 377492 224553 117308 60036 317502 367064 225276 -216693 209032 237300 510891
13452E10891j64704A59809J00349I7811a67846P8950C14846E816K05839J9135
$$ 510891 346187 159809 260158 97811 -167846 -88896 314846 5816 211655 230790
13442B30790O7244O0941k076P4397A62009K42605j64156J04991H6277g0121B26277
$$ 230790 298034 358975 356899 431296 162009 404614 240458 345449 86277 -70121 226277
13430B3302K34262K5145A004K17434J3527A00012h7960G73443B10347K03216F4600
$$ 23302 257564 282709 1004 218438 231965 100012 -87960 773443 210347 413563 64600
13418F6365k2364a20628D22326A18682J04416K0709K45505K41616a47172B71649
$$ 66365 44001 -120628 422326 118682 223098 243807 489312 730928 -147172 271649
13407a60723C34284l4528J26564E3672K48772J8241b9586C08756o1432J78411
$$ -160723 334284 299756 426320 53672 302444 320685 -29586 308756 247324 425735
13397D25735A59056K83281j36865O5639k0174E0516J33363J09351A23251l2568
$$ 425735 159056 442337 305472 371111 350937 50516 183879 293230 123251 90683
13387I0683K8648K54872k5834j06053L8166j29610L12862j87199d879B23105F1956
$$ 90683 119331 374203 348369 242316 280482 150872 463734 276535 -4879 223105 61956
13375E17487B29782K8374F6643a15628C51273j9438i4833D68796j75467A8516
$$ 517487 229782 258156 66643 -115628 351273 331835 -94833 468796 293329 18516
13364A69991J58929k5386K33360L1484B25034H1375P5516K57532F2136L26516
$$ 169991 328920 303534 536894 568378 225034 81375 156891 414423 62136 388652
13354C88652E4024J82642K68137A09920J45994j08606K22638E4508K85370O8284
$$ 388652 54024 236666 504803 109920 255914 147308 369946 54508 339878 408162
13344D08162j75385J05164r571H5523M12085j09225A27096K65952q8866f0363
$$ 408162 232777 337941 328370 85523 497608 388383 127096 393048 304182 -60363
13333a56827A1923K29726K3253F6129K13964o7788J12141F5087J62102K64778
$$ -156827 11923 241649 264902 66129 280093 212305 324446 65087 227189 491967
13323D91967A21494K95825j85550L6428n2857a45416C77525h1421B85021j30332
$$ 491967 121494 417319 231769 268197 215340 -145416 377525 -81421 285021 154689
13313A54689J65093J64625j41783o8250B7989a95694A87943M9410j8414J18174
$$ 154689 319782 484407 342624 274374 27989 -195694 187943 237353 218939 337113
13303C37113j24288P4530j40433N6558C7349L06300o9841A09306c7190A69568
$$ 337113 212825 287355 146922 203480 37349 343649 273808 109306 -37190 169568
13292F3707K9649Q0058a2592F1867K65830I6481i2987A71067l1762K18557J00337
$$ 63707 93356 173414 -12592 61867 327697 96481 -92987 171067 139305 357862 458199
13281D58199B26215j07440a71393C16230a14651A63767L19463A73525G8232J4476
$$ 458199 226215 118775 -171393 316230 -114651 163767 483230 173525 78232 92708
13271I2708Q5877l5919M51939a6278k6045B90797f7483A95158J32531l6778j43865
$$ 92708 178585 142666 594605 -16278 -42323 290797 -67483 195158 327689 290911 147046
13260A47046K15847m7386F4567J11541m8977k1738J43413A03759j6968L57934
$$ 147046 362893 315507 64567 176108 127131 105393 248806 103759 86791 444725
13250D44725A91609O8138d7260C7418R2577a77797B72097G5666O9454E7048A6634
$$ 444725 191609 259747 -47260 37418 129995 -177797 272097 75666 145120 57048 16634
13238H8314J01291R2917b99922A17593P5058J8397M8067E0242c41600b1302j659
$$ 88314 189605 282522 -299922 117593 192651 211048 259115 50242 -341600 -21302 -22961
13227b2961G5557J76841o8448j8037o8611C1413J01177J26817c5322C07560p3020
$$ -22961 75557 252398 183950 165913 97302 31413 132590 259407 -35322 307560 234540
13216B34540F5217K51492h8250l0087A40589c1941B48281o9458P8247A15160K90110
$$ 234540 65217 316709 -88250 -118337 140589 -31941 248281 178823 257070 115160 405270
13205D05270A58007A105J04867J00601a3229I2044k1112a4482k48297e1463C39363
$$ 405270 158007 1105 105972 206573 -13229 92044 70932 -14482 -262779 -51463 339363
13193C35018H3318K61460j29609o7004P9135p2856K1497N5052a5544k04376C12693
$$ 335018 83318 344778 215169 148165 227300 154444 175941 230993 -15544 -219920 312693
13181A6601J78750b12957B63209d8562C16238H8027D2343M1092a05013b0581B12461
$$ 16601 195351 -212957 263209 -48562 316238 88027 42343 83435 -105013 -20581 212461
13169a33059E9419J42613q9048L2707a85070C938P478b5626A411O6414J86773
$$ -133059 59419 202032 112984 145691 -185070 3938 11416 -25626 1411 67825 254598
13158B54598C3009J67480G6583C0994J8373a06169A84961E4931K24418e5642j03096
$$ 254598 33009 200489 76583 30994 49367 -106169 184961 54931 279349 -55642 -158738
13147a58738r17b4887C2095J36650a32258N3924H9159e5644o0434B15307a28642
$$ -158738 -159655 -24887 32095 168745 -132258 -78334 89159 -55644 -116078 215307 -128642
13135a9332D04423A10413K56437p722E5277j1843K89874o5327I8228b30645g7451
$$ -19332 404423 110413 366850 359128 55277 43434 333308 267981 98228 -230645 -77451
13123D68642B19508K11614h0547A75520o788b62439B91049L8513j24818c5005
$$ 468642 219508 431122 -80547 175520 168732 -262439 291049 329562 204744 -35005
13112f825D453P3415i9546h895B25835b781B03933F7611K2296a03304B24875b7984
$$ -6825 4453 77868 -99546 -8895 225835 -2781 203933 67611 89907 -103304 224875 -27984
13099a14543D6746J9992M1386K7664L69163a0848A13585l0785f4k17368H9575
$$ -114543 46746 66738 108124 135788 504951 -10848 113585 82800 -64 -217432 89575
13087a68741F1876b08528A48160n7815a10151E1949R8136J36386b35403h409m8293
$$ -168741 61876 -208528 148160 90345 -110151 51949 150085 286471 -235403 -8409 -56702
13076e6702A4607J76578J18179J26135B15142P5404E5687J56553o7398G1986K94124
$$ -56702 14607 191185 309364 435499 215142 290546 55687 212240 144842 71986 366110
13065C66110J580j34440J27545j71684K8166D5157N0896a17742B21251q9298O8059
$$ 366110 367690 233250 360795 189111 217277 45157 96053 -117742 221251 131953 200012
13054B00012L1723N9343J07357j88676J51252H2743J79386d3825C86877D7949
$$ 200012 231735 291078 398435 209759 361011 82743 262129 -43825 386877 47949
13043b3193A27961N9551J33322m8144H2714J08723e5907j42379A71902j1388o5831
$$ -23193 127961 187512 320834 272690 82714 191437 -55907 -198286 171902 160514 94683
13032I4683J7864d5782B40286J38595b47452A74877R9948J27675F7399J47054
$$ 94683 112547 -45782 240286 378881 -247452 174877 274825 402500 67399 214453
13022B14453J30588A01140C5042L1719M30846b24645C01734b08747B19459g9242
$$ 214453 345041 101140 35042 66761 497607 -224645 301734 -208747 219459 -79242
13011B0571J58003F1317K44071b4845j24705C53569a840j54120C60871A54554
$$ 20571 178574 61317 305388 -24845 -149550 353569 -1840 -155960 360871 154554
13000A61417b4715A26490e7217C8466b20602j29787A75493h1674C46354l6013
$$ 161417 -24715 126490 -57217 38466 -220602 -350389 175493 -81674 346354 310341
12990C10341h2211r8722d1696Q005A58148F1955O1813j6501e6390A69643b5076
$$ 310341 -82211 -180933 -41696 -33691 158148 61955 123768 107267 -56390 169643 -25076
12978a83917Q0172B1355L25647I1625K4877k4719c5162B54903G8661a71750A54039
$$ -183917 -103745 21355 347002 91625 116502 91783 -35162 254903 78661 -171750 154039
12966B52747d6301k19969G3783h5759q4374A48043i7973G1982g5736j6334A09926
$$ 252747 -46301 -266270 73783 -85759 -170133 148043 -97973 71982 -75736 -92070 109926
12954C6403K9659R9932Q0902R5630n8362g4864B69360a83514c982B02592j0674
$$ 36403 66062 165994 246896 342526 284164 -74864 269360 -183514 -3982 202592 191918
12943A91918q2045K32896H3389l0945B1605K20555r7578b98275Q7044B06833G3520
$$ 191918 109873 342769 83389 52444 21605 242160 144582 -298275 -211231 206833 73520
12931G6481a59670B49475m0103q6328L3400N9953i6916B40632G175J55178P612
$$ 76481 -159670 249475 209372 123044 156444 216397 -96916 240632 7175 162353 169965
12920A69965L6089c78080b3284q0157L0669E3094b64900a25975B55796G8820b4942
$$ 169965 206054 -378080 -23284 -103441 -72772 53094 -264900 -125975 255796 78820 -24942
12908G7251g4403k44908g4558A19140J0728K54416a55609A26671h4636D5763c51503
$$ 77251 -74403 -319311 -74558 119140 129868 384284 -155609 126671 -84636 45763 -351503
12896a23962K6449r0044h4364A80944a22681A98728b6936r4341B70401j32134
$$ -123962 -97513 -187557 -84364 180944 -122681 198728 -26936 -121277 270401 138267
12886A38267K49523E4218K1193L18794j63071O5165f5080A21754J55341g7332
$$ 138267 387790 54218 75411 394205 231134 296299 -65080 121754 277095 -77332
12875a06017b468E80887b18056A3336L4966d5972A18960N9864j8407a93417A92274
$$ -106017 -2468 580887 -218056 13336 48302 -45972 118960 178824 160417 -193417 192274
12863g7584C33201j62115D6723f6276D07759b18958B49208a16239I6231J71735
$$ -77584 333201 171086 46723 -66276 407759 -218958 249208 -116239 96231 267966
12853B67966a61944F041K3550J10992J78096A8500a1983A44921a27586A65515
$$ 267966 -161944 6041 29591 140583 318679 18500 -11983 144921 -127586 165515
12842H7388a43979k5245I0154P729O2146J20517f8824E3413a76218a1799A50948
$$ 87388 -143979 -169224 90154 97883 160029 280546 -68824 53413 -176218 -11799 150948
12830B03674c39029P0950G3475h4219k8709B5804L4379K23748J13855f0441j60995
$$ 203674 -339029 -268079 73475 -84219 -112928 25804 60183 283931 397786 -60441 -221436
12819b21436b0419H0212A750J70463h0864C32657G4978l7423f2643B57099j13548
$$ -221436 -20419 80212 1750 172213 -80864 332657 74978 37555 -62643 257099 143551
12808A43551m313c49236B07821R9111H7982A3950g9715l8538D59828a02958a7941
$$ 143551 139238 -349236 207821 306932 87982 13950 -79715 -118253 459828 -102958 -17941
12796e5216o0036l0299B4829d9188B26810Q3871g1389C82866A0154a58470g0064
$$ -55216 -115252 -145551 24829 -49188 226810 310681 -71389 382866 10154 -158470 -70064
12784B08701b92158A53852L2945c48309a51763E0710j8672J38218P6881d6716
$$ 208701 -292158 153852 186797 -348309 -151763 50710 32038 170256 247137 -46716
12773B913J58961h0233a3060H9575c76892B2366e1616n2239j14211O7939A61399
$$ 2913 161874 -80233 -13060 89575 -376892 22366 -51616 -103855 -218066 -150127 161399
12761a3704k6197I075P06C147g2478L0476D1522M4877b02914d374A35266a82162
$$ -13704 -39901 9075 9781 3147 -72478 -42002 41522 86399 -202914 -4374 135266 -182162
12748h4994E8699b00681d1244B93069a64600M1544A54908g0841C02123c8219n2333
$$ -84994 58699 -200681 -41244 293069 -164600 -123056 154908 -70841 302123 -38219 -90552
12737i0552D73413j67011G2263h1486c2936A76581J24905A45006n9876A4312K27536
$$ -90552 473413 306402 72263 -81486 -32936 176581 301486 145006 85130 14312 241848
12726B41848j00088o5691L2352a01763A35606b44023a8415E5547J23659f3732
$$ 241848 141760 76069 108421 -101763 135606 -244023 -18415 55547 179206 -63732
12715c0204k95883J24188D13931G6283B9343K46908J03740M0581j71365M53381
$$ -30204 -326087 -201899 413931 76283 29343 276251 379991 420572 249207 702588
12705G02588A2743K56993K11042B21392p4292b73304c5343J152k96942B38225
$$ 702588 12743 269736 480778 221392 147100 -273304 -35343 -34191 -331133 238225
12694E3514J60103G980b5644B10598l8370b760n1198l61921a92093B82863B6313
$$ 53514 213617 7980 -25644 210598 172228 -2760 -53958 -415879 -192093 282863 26313
12682a4739I2819a09258M7961A28689K26326q1575a27135C75892o0846e5953I0075
$$ -14739 92819 -109258 -61297 128689 355015 273440 -127135 375892 315046 -55953 90075
12670g21A71445b2564G1274f4336K0956B34939c50107h2556L4510D66578k25539
$$ -721 171445 -22564 71274 -64336 -43380 234939 -350107 -82556 -48046 466578 241039
12659B41039A16930K14767H9843Q5858J00152a88044H7594Q996i4618B57339J63951
$$ 241039 116930 331697 89843 175701 275853 -188044 87594 96590 -94618 257339 421290
12648D21290F0824a91841k0449B06192b33132A82311G3963J59833a9462A26124
$$ 421290 60824 -191841 -212290 206192 -233132 182311 73963 233796 -19462 126124
12637a82101B21379q0203a50119A98780c6947B39492P3366a04282E8215M55915
$$ -182101 221379 141176 -150119 198780 -36947 239492 312858 -104282 58215 514130
12627E14130j70408p5753J17611b19016D05990K892A42904k4710m6843a09337
$$ 514130 343722 267969 385580 -219016 405990 408882 142904 118194 71351 -109337
12616g1844B73133A13121h9113B77239A08840J481b27199A82044o919a97848J7231
$$ -71844 273133 113121 -89113 277239 108840 110321 -227199 182044 175125 -197848 -180617
12605a80617A42170a42100C8228c04419A74408G7151g655A65067F8431B4374b06985
$$ -180617 142170 -142100 38228 -304419 174408 77151 -7655 165067 68431 24374 -206985
12593i6756C3881J18267J87893J18804B14201l9662o221a07187R858A01725a75607
$$ -96756 33881 152148 340041 458845 214201 174539 168318 -107187 -97329 101725 -175607
12581A52101P5981b01882H4214r651J08842H9339c10194N9642H8282k9125Q2157
$$ 152101 228082 -201882 84214 74563 183405 89339 -310194 -250552 88282 59157 141314
12570A41314l669o6888J7142m435b46901h9003j43892R6109A65130h8947b9913
$$ 141314 137645 70757 87899 83464 -246901 -89003 -232895 -136786 165130 -88947 -29913
12558A10024A4177J103J48425N9962n4885a08230f964j7479j15031n2325B63251
$$ 110024 14177 15280 163705 223667 168782 -108230 -6964 -24443 -139474 -191799 263251
12546H0044a29123k17470e4007a6244k96493J02290A33753a74801f5371B08044
$$ 80044 -129123 -346593 -54007 -16244 -312737 -210447 133753 -174801 -65371 208044
12535a02137c6069l5257C90101a0619A43401M1332E9838b6117G2328N1681o205
$$ -102137 -36069 -71326 390101 -10619 143401 184733 59838 -26117 72328 124009 117804
12524A17804c6940o8549A33654a37791A30890Q4454c31397E3591J39698G1794
$$ 117804 -36940 -105489 133654 -137791 130890 215344 -331397 53591 193289 71794
12513g5617A30739a5755A2802J08937N2284A4907a20234M9409A39360R2525N0245
$$ -75617 130739 -15755 12802 121739 174023 14907 -120234 -70825 139360 231885 282130
12502B82130B0350J41198f8681F4554a34751B96916b1336A28216A0078J48770
$$ 282130 20350 161548 -68681 64554 -134751 296916 -21336 128216 10078 158848
12492A58848K81492j89472i2741p2416n0249N8837c7429p4051B01473q2842J26613
$$ 158848 440340 250868 -92741 -165157 -215406 -156569 -37429 -111480 201473 118631 245244
12481B45244E3890b90397I3554B5896a13228C38485A32904e7234C1074O5119g0647
$$ 245244 53890 -290397 93554 25896 -113228 338485 132904 -57234 31074 96193 -70647
12469b11681f3755I5857b76438H7477l9643K09572Q9082q4187i1849o2198j4860
$$ -211681 -63755 95857 -276438 87477 47834 257406 346488 262301 -91849 -154047 -168907
12458a68907C0421b13445E0667J6J9099E426d443A74466j4092D6406f3149l13184
$$ -168907 30421 -213445 50667 50683 69782 5426 -4443 174466 160374 46406 -63149 -376333
12446c76333e114A87088a19049d2343k92173A38432M2323a05751F2352g8664k00872
$$ -376333 -5114 187088 -119049 -42343 -334516 138432 180755 -105751 62352 -78664 -279536
12435b79536A37892k822a36663j29078N9785b1346k77561a20201N976j70499C36397
$$ -279536 137892 135070 -136663 -265741 -205956 -21346 -298907 -120201 -114225 -284724 336397
12423I7824b18286D5836J92383g9271F7362Q8009a22499d7918B33874L153a85292
$$ 97824 -218286 45836 238219 -79271 67362 155371 -122499 -47918 233874 237027 -185292
12411A32845K7102d5290m0194B08757D5123g887A8860c98413F4927K6324a33134
$$ 132845 159947 -45290 -85484 208757 45123 -7887 18860 -398413 64927 91251 -133134
12399B50548a91303A71947o6638d7192G4088O4243a91012D5762K01090b43105
$$ 250548 -191303 171947 105309 -47192 74088 138331 -191012 45762 246852 -243105
12388D0699M4854a12169C7036K07615e7924A50446a03005B4841d04972d4957A1829
$$ 40699 85553 -112169 37036 244651 -57924 150446 -103005 24841 -404972 -44957 11829
12376a04682K3376J5166q8924O0453B25975n8951o8162d0388A68761b92590H6070
$$ -104682 -81306 -66140 -155064 -94611 225975 167024 98862 -40388 168761 -292590 86070
12364a32397C03700A9699a27927A26451K5208P6894a03724l3457G4695a38488
$$ -132397 303700 19699 -127927 126451 151659 228553 -103724 -137181 74695 -138488
12353A26562e3175B32077A2515q84a67588d1260l37255B31659i589j67875c1753
$$ 126562 -53175 232077 12515 11631 -167588 -41260 -378515 231659 -9589 -177464 -31753
12341a91643g0948C2679b6332I7357b11122B5644c3032i381E214a67502Q1430
$$ -191643 -70948 32679 -26332 97357 -211122 25644 -33032 -9381 5214 -167502 -86072
12330h6072i44k52583R8059B7419b38380A41999a61685A2691b29047N2201F2678
$$ -86072 -944 -253527 -155468 27419 -238380 141999 -161685 12691 -229047 -176846 62678
12318I7960a39510l6444E3675R9000e1295o1799c1720j92227C43659c20046k8006
$$ 97960 -139510 -175954 53675 152675 -51295 -113094 -31720 -223947 343659 -320046 -348052
12307c48052J68240c585r1767B1194J7103K36653o3664K04054H3507b980j96652
$$ -348052 -179812 -3585 -95352 21194 38297 274950 211286 415340 83507 -2980 -199632
12296a99632R5551j57077B3143K78363b486G1776O1184e5756A76720a0177C90910
$$ -199632 -104081 -261158 23143 301506 -2486 71776 132960 -55756 176720 -10177 390910
12284B63572d9534F7831L7626a3626j06443A50091C2774J68346f6426H3016N68893
$$ 263572 -49534 67831 105457 -13626 -120069 150091 32774 201120 -66426 83016 651909
12273F51909B73112k1181G8798F715N4821J78762h3594E0782J8480g3683a7512
$$ 651909 273112 251931 78798 6715 61536 240298 -83594 50782 69262 -73683 -17512
12261D0133K37638E2023L17196J07624J9951A22166a79709f8612B73507j8847
$$ 40133 277771 52023 369219 476843 496794 122166 -179709 -68612 273507 254660
12251B54660G0816P432K4894b31119B52090J08639E4031c13191b9825B53843e5534
$$ 254660 70816 78248 103142 -231119 252090 360729 54031 -313191 -29825 253843 -55534
12239A48132F945J22486R8349F1987Q4066P1006q976q8595M0556f229A89941N3458
$$ 148132 6945 129431 227780 61987 146053 217059 208083 119488 160044 -6229 189941 243399
12227B43399d561j34385B23141B8865L4407K05822a41753D61801j71262C8429
$$ 243399 -4561 -138946 223141 28865 63272 269094 -141753 461801 290539 38429
12216A95313h9o4466C05589N0488j24868M6778a74210B70054j5978H6887J44010
$$ 195313 -89 -64555 305589 356077 231209 277987 -174210 270054 254076 86887 230897
12205B30897m7955K63113I7465L12358B2745m462K40305B4249J95223L10308k57238
$$ 230897 182942 446055 97465 409823 22745 18283 258588 24249 219472 529780 272542
12194B72542h3303B35775A12188j1530C5111K72770a22713B99623A17775J93724
$$ 272542 -83303 235775 112188 100658 35111 307881 -122713 299623 117775 311499
12184C11499P8345A70372J26344K98844E6624b8890E5607L3802k7623e4458A45065
$$ 311499 389844 170372 296716 595560 56624 -28890 55607 89409 61786 -54458 145065
12172g4297H607O8829L5773J49155N638A0807Q5204D5196m381f7243A54283E4646
$$ -74297 8607 77436 113209 262364 268002 10807 96011 45196 40815 -67243 154283 54646
12159b10481d6870k2378k7134F4159K4389J03208B7273J67664a05135B7770f7791
$$ -210481 -46870 -69248 -96382 64159 88548 191756 27273 194937 -105135 27770 -67791
12147I2939J21770n3503G8012a04444a9543A87995C4510b56822A83527O4445l6344
$$ 92939 214709 161206 78012 -104444 -19543 187995 34510 -256822 183527 247972 211628
12136B11628F0508a98214A89367N09822A98981A5374K49884b62939A01009B266
$$ 211628 60508 -198214 189367 699189 198981 15374 265258 -262939 101009 2266
12125D32885a41763H7908K85281a59039k29577e0768K3034A67953b26608B63323
$$ 432885 -141763 87908 373189 -159039 -388616 -50768 -27734 167953 -226608 263323
12114A9979c7434k08604P1245f814r0500H4351K51533I7108i4428p393E096f4932
$$ 19979 -37434 -246038 -174793 -6814 -97314 84351 335884 97108 -94428 -101821 5096 -64932
12101C21555a85641F8482b77430d2865j92885e5539C01092D4218r80b33372I9627
$$ 321555 -185641 68482 -277430 -42865 -235750 -55539 301092 44218 43238 -233372 99627
12089H0345L1290C0767K46913j22429c0258I3747K3509K6751b91032A852Q0595
$$ 80345 111635 30767 277680 155251 -30258 93747 117256 144007 -291032 1852 82447
12078H2447L61921k20259g729j13711E26896J792968I79592D5599j0089L7678
$$ 82447 444368 224109 -7729 -121440 526896 2319864 979592 45599 35510 73188
12068G3188A9362a5598B07910a22524I5103A8263b3175k13111e068F0660b952
$$ 73188 19362 -15598 207910 -122524 95103 18263 -23175 -236286 -5068 60660 -2952
12056F080L96513b4312B641J30944b33355D089J75625g2652r6801B00485B7738
$$ 6080 402593 -24312 2641 133585 -233355 4089 179714 -72652 -169453 200485 27738
12044A2827a92476Q2982B43244p7841e6804l3901l5972F8366O2656L30835a54058
$$ 12827 -192476 -109494 243244 165403 -56804 -90705 -126677 68366 131022 461857 -154058
12032b13284L591p0907C7697a67954g7260a2448A58227A9006K18207K398o1075
$$ -213284 -209693 -280600 37697 -167954 -77260 -12448 158227 19006 237213 239611 178536
12021A78536k013g5834m1901I731d2598l0854o7272B7329b68328A84922H6719
$$ 178536 176523 -75834 -117735 9731 -42598 -73452 -140724 27329 -268328 184922 86719
12009A18677b6462j69554n050B7696K93273A00689B9498b4076l33549i0563q6693
$$ 118677 -26462 -196016 -201066 27696 320969 100689 29498 -24076 -357625 -90563 -177256
11998a77256E2543J50096N1655B9767a40367F3873L0698K89722j35056b80801
$$ -177256 52543 202639 254294 29767 -140367 63873 94571 384293 249237 -280801
11987c40317a55239H2142f4273A20480g7250F4031a50494A27619d985E9417A3701
$$ -340317 -155239 82142 -64273 120480 -77250 64031 -150494 127619 -4985 59417 13701
11975C49828A37840a81876B83561j34527c16033a21467d7388A10003f1668F9482
$$ 349828 137840 -181876 283561 149034 -316033 -121467 -47388 110003 -61668 69482
11964c7831C45759b56152A44956m255o9155B2264b99051E1266b67105B72240j22374
$$ -37831 345759 -256152 144956 140701 71546 22264 -299051 51266 -267105 272240 149866
11953A49866J79674f4439p330D18066b02499D9264h0264I2124b50448O5952C7030
$$ 149866 329540 -64439 -71769 418066 -202499 49264 -80264 92124 -250448 -184496 37030
11941B75121E7891B533a55055k18885a55038O473A59163K4614Q7453a06531G1656
$$ 275121 57891 2533 -155055 -373940 -155038 -148565 159163 183777 271230 -106531 71656
11929f8957a8010j88581d3311A87488p6363a50653A84584H932d30737a02064n9041
$$ -68957 -18010 -206591 -43311 187488 111125 -150653 184584 8932 -430737 -102064 -161105
11918a61105k153e807j94588B12571F250L21135b09676c823D6252K1532b42661
$$ -161105 -163258 -5807 -200395 212571 6250 327385 -209676 -3823 46252 67784 -242661
11906a26476B88310A07119b61425A49064a42104H4062a81738A18026f8349m4653
$$ -126476 288310 107119 -261425 149064 -142104 84062 -181738 118026 -68349 -113002
11896a13002M1756H7480a8500j81777j45346A02180l9003o642b84542F94d7636
$$ -113002 -71246 87480 -18500 -200277 -345623 102180 63177 56535 -284542 694 -47636
11884H8500J34307C3055K12457a910G9110i2298C042a68777j15658M6408B67048
$$ 88500 222807 33055 245512 -1910 79110 -92298 3042 -168777 -284435 -238027 267048
11872f1365B09638c55996A5678a1382n37330A12819m9476J31629a34654q203A37316
$$ -61365 209638 -355996 15678 -11382 -548712 112819 63343 194972 -134654 -142857 137316
11860c551A6455a51230A11291m9209b4109A8953a48169E1634d79146J55044a10356
$$ -3551 16455 -151230 111291 62082 -24109 18953 -148169 51634 -479146 -324102 -110356
11848I2824c1196F0216a06078r6492C23564A2609M847h8592A54471C0547b19034
$$ 92824 -31196 60216 -106078 -202570 323564 12609 17456 -88592 154471 30547 -219034
11836B56763I5555k9727a4964j69666M1959q676m8050A02695g5200o3231j09414
$$ 256763 95555 65828 -14964 -184630 -142671 -151347 -199397 102695 -75200 -138431 -247845
11825b47845A01123b28816B56493i1332D0432K86517D1993b42446K9830J01533
$$ -247845 101123 -228816 256493 -91332 40432 326949 41993 -242446 -212616 -111083
11815a11083A39864D3716P702b57316L1706G5672a59757O6611A41069a27025D5940
$$ -111083 139864 43716 51418 -257316 -225610 75672 -159757 -93146 141069 -127025 45940
11803i2482I4482c66857a61136c7259E2662b9259k54580A55323E3815b10901K961
$$ -92482 94482 -366857 -161136 -37259 52662 -29259 -283839 155323 53815 -210901 -207940
11792b07940B01618j00383L760J5460f4473A76306a23518A13072d16908F2167
$$ -207940 201618 101235 104995 120455 -64473 176306 -123518 113072 -416908 62167
11781a89653M6983c9716j94227i2392C78526E2338A0067J10155k8188L1246a21920
$$ -189653 -142670 -39716 -233943 -92392 378526 52338 10067 120222 92034 123280 -121920
11769F6449R4793F6001Q4457a53290P777j63868B9865f6995I0876h4704H7822
$$ 66449 161242 66001 150458 -153290 -145513 -309381 29865 -66995 90876 -84704 87822
11757I224g6492L4847B03236J46031a82143B47386a13255M12A11170J5550b2296
$$ 9224 -76492 -41645 203236 349267 -182143 247386 -113255 -112843 111170 126720 -22296
11745a93901P6321M4273B32743P0857A26086g8255B93885I5485c34234I6941J6566
$$ -193901 -117580 -73307 232743 303600 126086 -78255 293885 95485 -334234 96941 113507
11734A13507J59841a67103K6582d9065D7295a17255D10348d09697c6573j05925
$$ 113507 273348 -167103 -140521 -49065 47295 -117255 410348 -409697 -36573 -142498
11724a42498C49429F562g3962m5709N2240G6624a53544C39254E4091d1395j14169
$$ -142498 349429 6562 -73962 -119671 -67431 76624 -153544 339254 54091 -41395 -155564
11713a55564E52541A59466h5794A52197j1585o9035d4638A74519a04468B82009
$$ -155564 552541 159466 -85794 152197 140612 71577 -44638 174519 -104468 282009
11702D5892b62046b671j7707l7819C2099J01099n4326a02628C0472J47718o8838
$$ 45892 -262046 -2671 -20378 -58197 32099 133198 78872 -102628 30472 178190 109352
11691A09352h2701L8028a0938E33042h284q2113k28540A21681m6526L00963A78108
$$ 109352 -82701 -44673 -10938 533042 -8284 -90397 -318937 121681 75155 376118 178108
11679A09811b01116p587D93830i5256j77280i7465e650A80080J3743b00320A75596
$$ 109811 -201116 -208703 493830 -95256 -272536 -97465 -5650 180080 193823 -200320 175596
11667B9298a36074c2947J0423K984A44106F1241K517k1196J60096a25809A14505
$$ 29298 -136074 -32947 -22524 -19540 144106 61241 63758 42562 202658 -125809 114505
11655G9856e1664A43255Q554F8935J93326r812R4263g1653j60670A08120a84772
$$ 79856 -51664 143255 151809 68935 262261 252449 346712 -71653 -232323 108120 -184772
11643a76205A44707I156d718C7109e0549A66274b47074C73141a71499e796r0204
$$ -176205 144707 9156 -4718 37109 -50549 166274 -247074 373141 -171499 -5796 -96000
11632i6000C8566b91773F6406A4553b46513A11811O029a74825K2558d3577C9554
$$ -96000 38566 -291773 66406 14553 -246513 111811 117840 -174825 -152267 -43577 39554
11620A18964e0888C62478H0361g1789A09524d0174A34039K37696l2331J16498
$$ 118964 -50888 362478 80361 -71789 109524 -40174 134039 371735 339404 455902
11610D55902C4813b21142B44497c3631I0342b8409q5360L5325C3372l936L55457
$$ 455902 34813 -221142 244497 -33631 90342 -28409 -113769 -78444 33372 29436 384893
11599C84893j76238r8764I443b361F5300a92146A82019a09500A79876l7952m8674
$$ 384893 208655 109891 9443 -2361 65300 -192146 182019 -109500 179876 141924 93250
11588I3250L17466A06429L46863j97716j0898L7876g367k0616A91213a68002n7972
$$ 93250 410716 106429 453292 255576 244678 282554 -7367 -27983 191213 -168002 -225974
11577b25974J09090e3327o7828A75518q1469A8938K69378b04156D13200C8357
$$ -225974 -116884 -53327 -121155 175518 94049 18938 288316 -204156 413200 38357
11566a78431O1058C7956R6384b76441B14039O2043h9400A60295L53557A01700
$$ -178431 -117373 37956 134340 -276441 214039 276082 -89400 160295 513852 101700
11555A53220c21526O7129f8875B84377j0256A23867a32095e2797E00811B14942
$$ 153220 -321526 -254397 -68875 284377 274121 123867 -132095 -52797 500811 214942
11544H6269J58802b06543h9798b2560G7268L24071c6416r953C34944A30277J31791
$$ 86269 245071 -206543 -89798 -22560 77268 401339 -36416 -46369 334944 130277 262068
11533B62068d8548D51271B03628K29666d6868A4330a95397B87580a06151K1228
$$ 262068 -48548 451271 203628 433294 -46868 14330 -195397 287580 -106151 -84923
11523h4923A29192I808K0783J9595a51197j445F1757A5879P3590L75119i5553
$$ -84923 129192 9808 30591 50186 -151197 -152642 61757 15879 89469 464588 -95553
11511B53421l3592n9240K46811g8154C5693K31940O6090C4996d8789A09059c28466
$$ 253421 219829 160589 407400 -78154 35693 267633 333723 34996 -48789 109059 -328466
11499D06737A2184b26518E0162D020J71654f7267i804B10451K6836H1157O2913
$$ 406737 12184 -226518 50162 4020 175674 -67267 -9804 210451 237287 81157 144070
11488A44070M8726P1323G9675b71245B16800q7750e6302C7430J86486P9943K2935
$$ 144070 192796 264119 79675 -271245 216800 129050 -56302 37430 223916 303859 326794
11477C26794A14367M19058A19413g473C83208A13109L048n971j0569L03648j09896
$$ 326794 114367 533425 119413 -7473 383208 113109 116157 110186 99617 403265 293369
11466B93369g705j49073B37123e9857j49174A97320b0417G844K5966i4756A04224
$$ 293369 -7705 -156778 237123 -59857 -209031 197320 -20417 7844 33810 -94756 104224
11454b13008c8690I83P4257O8940K1892H789b7439k34730A70115a8395j9409H4485
$$ -213008 -38690 983 75240 144180 166072 8789 -27439 -262169 170115 -18395 -37804 84485
11441i4348C51L80974D6762J27114a6482n9993B87416D3335K45843k3664r2849
$$ -94348 351 381325 46762 173876 -16482 -76475 287416 43335 289178 265514 172665
11430A72665g7467o3799F67360A7757K00339g6320j17630E9275h9946C5572Q314
$$ 172665 -77467 -141266 667360 17757 218096 -76320 -193950 59275 -89946 35572 43886
11419D3886a68228A33734K06648C8492c4823A27582a14197j9242A28961E0106
$$ 43886 -168228 133734 340382 38492 -34823 127582 -114197 -133439 128961 50106
11408a26960C98585i8288a1937A29438a26238B3823R5858R2164n1475o4611D1747
$$ -126960 398585 -98288 -11937 129438 -126238 23823 119681 211845 160370 95759 41747
11396a70532c5015E8969J49955n1822b53440R0858A5693P00e3505i67j7595p0422
$$ -170532 -35015 58969 208924 157102 -253440 -162582 15693 16393 -53505 -967 -18562 -88984
11384h8984A48575e3915D1220b54241B04464D8507J62834b01218c3330J2734E8225
$$ -88984 148575 -53915 41220 -254241 204464 48507 211341 -201218 -33330 -20596 58225
11372a83250B87241a5330k740A58208J69776A36040a58139o1840l3355H0238M32446
$$ -183250 287241 -15330 -18070 158208 327984 136040 -158139 -219979 -253334 80238 512684
11361E12684c9224A9503J95269A6983c23757a17678A07105k3274a20167A86997
$$ 512684 -39224 19503 214772 16983 -323757 -117678 107105 83831 -120167 186997
11350D9922J32007d31881a23888B75474a54057N4592C06979A09813J43110F1307
$$ 49922 181929 -431881 -123888 275474 -154057 -99465 306979 109813 252923 61307
11339b72911e4434D1856J15597b9480E31360j14117f187D8051b21094g3817a6958
$$ -272911 -54434 41856 157453 -29480 531360 417243 -6187 48051 -221094 -73817 -16958
11327a1995I2488M3905O6997o1256d573m0258h458r0443A30642e9750A49801R007
$$ -11995 92488 136393 203390 142134 -4573 -44831 -8458 -98901 130642 -59750 149801 158808
11315A58808J05314c87321f7507a7474C2865e8455o0978b4617B9305a10305C0791
$$ 158808 264122 -387321 -67507 -17474 32865 -58455 -119433 -24617 29305 -110305 30791
11303C9165a01794L4418c3092F6591J8837b61856D55025c14771c269j72624B58668
$$ 39165 -101794 -67376 -33092 66591 85428 -261856 455025 -314771 -3269 -175893 258668
11291c58836B28436r2467a3762A16249N7181c33207a46219A30236A0246j121b5009
$$ -358836 228436 135969 -13762 116249 173430 -333207 -146219 130236 10246 9125 -25009
11279B0934i9630m6818r7846G31a80640r5784Q1023j71491a58423M8841j6165
$$ 20934 -99630 -146448 -244294 731 -180640 -276424 -195401 -366892 -158423 -109582 -125747
11268a25747a2107F9574d5367A30823J47576A7259b4856A20672M7084b58726A31163
$$ -125747 -12107 69574 -45367 130823 278399 17259 -24856 120672 167756 -258726 131163
11256e0387j23785k52250A56398D3821b54615J15828a7605G3906i8267n1795C7774
$$ -50387 -174172 -426422 156398 43821 -254615 -138787 -17605 73906 -98267 -150062 37774
11244b030m2367A36000a54169m806j2396b5746k1025p783G9167a87758d1089r7936
$$ -2030 -44397 136000 -154169 -158975 -171371 -25746 -46771 -54554 79167 -187758 -41089 -139025
11232a39025j08951D84966f0499r4805j45101a4407C3678b95566B4623a67150
$$ -139025 -247976 484966 -60499 -155304 -300405 -14407 33678 -295566 24623 -167150
11221h5314A07647L2812J94388E9988J12206J67325f4351j5000r5358A07015b71326
$$ -85314 107647 140459 334847 59988 172194 339519 -64351 -79351 -174709 107015 -271326
11209G2425b69277A8746b39703B96005J51048A10235M3387e9819D0057i0695k00552
$$ 72425 -269277 18746 -239703 296005 447053 110235 153622 -59819 40057 -90695 -291247
11198b91247h6396G3482k8814j015i46k9502C5900i2577L2254A23794j5404r600
$$ -291247 -86396 73482 44668 43653 -946 -30448 35900 -92577 -60323 123794 108390 98790
11186I8790e8328A62045a09977L0796G9615l6729N3565e1160j38069b2376p8701
$$ 98790 -58328 162045 -109977 -79181 79615 42886 96451 -51160 -189229 -22376 -101077
11175a01077j2855A6164l097n117R7857c50667G54J23099a21303A84785i7791
$$ -101077 -113932 16164 13067 7950 105807 -350667 754 123853 -121303 184785 -97791
11163b75057E1088a82804j87239H9576a34086d0827I8623J06445E2483b25098
$$ -275057 51088 -182804 -370043 89576 -134086 -40827 98623 205068 52483 -225098
11152b19816B39950a90051C06757a2677k3823A38283D3225c70918f7472A18449
$$ -219816 239950 -190051 306757 -12677 -36500 138283 43225 -370918 -67472 118449
11141b00584A5160a87635k09251a34382G9906a0737C82115A81633E6570L27210
$$ -200584 15160 -187635 -396886 -134382 79906 -10737 382115 181633 56570 383780
11131C83780A04732R1977Q2660J04191E2010f5235G3696a73510B69337A19879
$$ 383780 104732 196709 279369 383560 52010 -65235 73696 -173510 269337 119879
11120C50268b3102B62043h3047B00023F512J87195b67539B4085d8468a7648k3535
$$ 350268 -23102 262043 -83047 200023 6512 193707 -267539 24085 -48468 -17648 -41183
11109d1183l81240A77317L2158j6667B2755O2411c0538A63089P3549e1457A40567
$$ -41183 -422423 177317 209475 192808 22755 85166 -30538 163089 236638 -51457 140567
11097a93627C34289C716L18251q8739A08522c4149C59909A15699B3586N7136b4678
$$ -193627 334289 3716 321967 233228 108522 -34149 359909 115699 23586 80722 -24678
11085A38583e6684C40995E4106L97380A08666J7546P5845J56022m6187Q8631j47249
$$ 138583 -56684 340995 54106 451486 108666 126212 202057 358079 311892 400523 253274
11074B53274r0734K462J8844M745M265J47250K38227B57795R0678K91411j73168
$$ 253274 162540 165002 183846 188591 192856 340106 578333 257795 348473 639884 466716
11063D66716n402m1904J74950j55729J70196L3893r6154j15587L99371D12988
$$ 466716 461314 419410 594360 438631 608827 642720 546566 430979 830350 412988
11052D40438L73476j36952j3824m1631O9066m0546L8286J16795j54012k56106
$$ 440438 813914 676962 663138 621507 690573 650027 688313 805108 651096 394990
11042C94990K56851m1659J59894j33775J03844j22692R4661l17158L58804j09409
$$ 394990 651841 610182 770076 636301 740145 617453 712114 394956 753760 644351
11032F44351k11427K83724q2380r988J42673K22189l51100j70463R5779K6490
$$ 644351 432924 716648 634268 624280 766953 989142 638042 467579 563358 589848
11022E89848K08909m4229j78490r1401K53327k98642K45767L1136k16643J41254
$$ 589848 798757 754528 576038 484637 737964 439322 685089 716225 499582 640836
11012F40836A73612N11072p1571J07287J35166k68712j08956O8492O2149o5648
$$ 640836 173612 684684 613113 720400 855566 586854 477898 546390 608539 542891
11002E42891M2858K06269j99187K16564Q5876l51073J47062j32627K23895C42774
$$ 542891 585749 792018 592831 809395 895271 544198 691260 558633 782528 342774
10991G13944l9777k32824M17124j024N4673l50695N50129N9520k32526J15318
$$ 713944 674167 441343 858467 857443 912116 561421 1111550 1171070 938544 1053862
10981A053862j20125L91050q0767J24453K26151J07110O30884K71964k8670P5140
$$ 1053862 933737 1324787 1244020 1368473 1594624 1701734 2332618 2604582 2575912 2651052
10971B651052O7591l25374N8354m6981j96321r3274l76830M1569l90550L56877
$$ 2651052 2718643 2393269 2451623 2404642 2208321 2115047 1738217 1779786 1389236 1746113
10961A746113l45740K95359l63933J93547K09590K21373k63562n1339n9281n45684
$$ 1746113 1400373 1695732 1331799 1525346 1734936 1956309 1692747 1641408 1582127 1036443
10951A036443J00995m3777m13303O1245C22270p7885K17841G5182K94871r9231
$$ 1036443 1137438 1093661 680358 741603 322270 244385 462226 75182 370053 270822
10941B70822j5571A02556f2101C92870A28946E4322R6025Q4482b0412H616g5192
$$ 270822 255251 102556 -62101 392870 128946 54322 150347 234829 -20412 8616 -75192
10929E5131L76035F3336b24292G5450J9436a36602K963b521l899A61675N1234
$$ 55131 431166 63336 -224292 75450 94886 -136602 -133639 -2521 -6420 161675 212909
10918B12909K55251d1064F9805a4993A48652d88720B08934e97A78805k3521a59891
$$ 212909 468160 -41064 69805 -14993 148652 -488720 208934 -597 178805 155284 -159891
10906f575l027k63623G676R9639b2761l02235B77709o7448L72173a30309E3431
$$ -6575 -9602 -273225 7676 107315 -22761 -324996 277709 210261 582434 -130309 53431
10894b50750l40173I0239c8461B53233j23771m4841J05130B0526a03650j6722
$$ -250750 -590923 90239 -38461 253233 129462 84621 189751 20526 -103650 -120372
10884a20372J1889J5700K955j03974C29857j11395i8217K8085A20365m4395a7051
$$ -120372 -108483 -92783 -89828 -193802 329857 218462 -98217 -70132 120365 75970 -17051
10872A87912d4577A1512J64012q6064K70925d10291c7150B24006j0362E8004d1596
$$ 187912 -44577 11512 175524 89460 360385 -410291 -37150 224006 213644 58004 -41596
10860b29258e9272r9594F4513J8738K44187a1844G9946i4862L3260A87774i9081
$$ -229258 -59272 -158866 64513 83251 327438 -11844 79946 -94862 -61602 187774 -99081
10848I0128g4140j00686n8019B42117a19878j42514C0380a04476A15320b501k09958
$$ 90128 -74140 -174826 -232845 242117 -119878 -262392 30380 -104476 115320 -2501 -212459
10837b12459e835B50920a91074C1164a81006B0865L14368g3155l3869j76972j18971
$$ -212459 -5835 250920 -191074 31164 -181006 20865 335233 -73155 -107024 -283996 -402967
10826d02967J23651g0063C8452h744j37617B00216q1746G063a29881c7001H9559
$$ -402967 -279316 -70063 38452 -8744 -146361 200216 118470 7063 -129881 -37001 89559
10814b29400e5751k68592E2557m309d5991A51452c72268a1465G7711a13448A18310
$$ -229400 -55751 -324343 52557 48248 -45991 151452 -372268 -11465 77711 -113448 118310
10802b13485E2960b21008C15789f6331j80341A69777b20799e8832m9333c1278
$$ -213485 52960 -221008 315789 -66331 -246672 169777 -220799 -58832 -108165 -31278
10791b15204c9589j75903e5397J0667F7475J06750A607a49784d9573p0237E0231
$$ -215204 -39589 -215492 -55397 -44730 67475 174225 1607 -149784 -49573 -119810 50231
10779e0904b3237l79620C6048b93780c309C07142g787B2092b52335B16868a75023
$$ -50904 -23237 -402857 36048 -293780 -3309 307142 -7787 22092 -252335 216868 -175023
10767f2028b5144A66713a52291L2495B8519Q0504D5996e1580E9713g5477A55290
$$ -62028 -25144 166713 -152291 -119796 28519 109023 45996 -51580 59713 -75477 155290
10755c1018A16924a29086p2871A92944h7359m1590A7296Q2571a25090p1819h2583
$$ -31018 116924 -129086 -201957 192944 -87359 -128949 17296 99867 -125090 -196909 -82583
10743d23j20568B5697M29630b0188B06352e7901l8134B52939g4453j07621I3048
$$ -423 -120991 25697 455327 -20188 206352 -57901 -96035 252939 -74453 -182074 93048
10731b08022A84552b74309j25384D2428B58b29036c3051l1710H2164b9050k0196
$$ -208022 184552 -274309 -399693 42428 258 -229036 -33051 -64761 82164 -29050 -49246
10720d9246c939G51J31873J22477b7616k07615C2832a21946B36743b95209b5788
$$ -49246 -3939 751 132624 255101 -27616 -235231 32832 -121946 236743 -295209 -25788
10708e7232n3082d4781k54270h082F5582i1047j20241Q7573A12835K15143d54
$$ -57232 -110314 -44781 -299051 -8082 65582 -91047 -211288 -123715 112835 327978 -454
10696f6414A39511J79433a1628k11607N9564F4005g4982B62675g4136N819j19412
$$ -66414 139511 318944 -11628 -223235 -163671 64005 -74982 262675 -74136 -68317 -187729
10685a87729i0112C6695J65818i3335H1740J92341c17349B64367a54723L1655
$$ -187729 -90112 36695 202513 -93335 81740 274081 -317349 264367 -154723 -123068
10675a23068F0987b10145H7400J62743d60310b17749F6872a11202k13174m1622
$$ -123068 60987 -210145 87400 250143 -460310 -217749 66872 -111202 -324376 -365998
10665c65998Q6053H2612O5476D439c5133k7094j78088g1218B10292b19530N3905
$$ -365998 -279945 82612 148088 4439 -35133 -62227 -240315 -71218 210292 -219530 -165625
10654a65625m5627c1222H6097j0454f5838i322H2891d1335E6339d6621j73252
$$ -165625 -211252 -31222 86097 75643 -65838 -9322 82891 -41335 56339 -46621 -219873
10643b19873a0310j71682r1460f5765j37037K2946I9099h4448m8560o8768H5854
$$ -219873 -10310 -181992 -273452 -65765 -202802 -179856 99099 -84448 -133008 -201776 85854
10631h4427k01809c2628k0708B487c90274h2289a9328E6289b74894n8144A9273
$$ -84427 -286236 -32628 -53336 2487 -390274 -82289 -19328 56289 -274894 -333038 19273
10619A47380q996d77918a03198n3536E5319b0612r2280j4656b198r6444P083K8827
$$ 147380 138384 -477918 -103198 -156734 55319 -20612 -112892 -127548 -2198 -98642 -91559 -62732
10607f2732A11124l1664a16174H8635b94510A53236a11327k77846A7150J37719
$$ -62732 111124 79460 -116174 88635 -294510 153236 -111327 -389173 17150 154869
10597A54869b27828o5812b9075j05989e2718p9088K2431n1878a1124E6161a75465
$$ 154869 -227828 -293640 -29075 -135064 -52718 -131806 -109375 -161253 -11124 56161 -175465
10585c2626k33369P5906e3079G6490J58090J34169a14808F2759a11217A14483
$$ -32626 -265995 -190089 -53079 76490 234580 368749 -114808 62759 -111217 114483
10574f1553j57384g8915r6536A55284C9350a69016h2069B87120c20806B14083
$$ -61553 -218937 -78915 -175451 155284 39350 -169016 -82069 287120 -320806 214083
10563A8796c60266a19532j0613k1671B05805a0091G9581M7399P4089i8323C2467
$$ 18796 -360266 -119532 -130145 -151816 205805 -10091 79581 126980 201069 -98323 32467
10551B12902a78656g674o1239A88979J95908d3639A69203a24725A61808J3955
$$ 212902 -178656 -7674 -68913 188979 384887 -43639 169203 -124725 161808 175763
10541A75763J12745D818d9257B5229a34202A06099a01518I5637j4328a25248q6858
$$ 175763 288508 4818 -49257 25229 -134202 106099 -101518 95637 81309 -125248 -212106
10530b12106I9247b14276g0385A96960a59826c6410k05976L6408B9890J94697
$$ -212106 99247 -214276 -70385 196960 -159826 -36410 -242386 -205978 29890 224587
10520B24587I0672Q0588l9476B3012o367a07148c6303l39592A02381a24918D0866
$$ 224587 90672 171260 131784 23012 16645 -107148 -36303 -375895 102381 -124918 40866
10508a47351j34208F0493O721j0976J23382F2244c72956E0925K55617a03119p1671
$$ -147351 -281559 60493 67214 56238 179620 62244 -372956 50925 306542 -103119 -174790
10497a74790D1591h0835C9984F531J5457L8743K06014P3133a11153D6407L27535
$$ -174790 41591 -80835 39984 6531 21988 60731 266745 339878 -111153 46407 373942
10486C73942a40679a4487A21678L4834P34792j81496j34139R00j60682R6478b73447
$$ 373942 -140679 -14487 121678 156512 891304 709808 575669 576569 415887 512365 -273447
10474B8791O3683b0021B20944a11590d4206j54069A21142A3190a21205H4296L71908
$$ 28791 92474 -20021 220944 -111590 -44206 -198275 121142 13190 -121205 84296 456204
10463D56204c13899D1560d6754j00650n1825c8648k11490A53934J34953h361j54295
$$ 456204 -313899 41560 -46754 -147404 -199229 -38648 -250138 153934 288887 -8361 -162656
10452a62656l4516m2937j7472N525j70190f139j30010r6967E7877J30517k3608
$$ -162656 -197172 -240109 -257581 -252056 -422246 -6139 -136149 -233116 57877 188394 164786
10441A64786n8103J77217o1477H5529B272c34347C02560B2579L55460a64067e8563
$$ 164786 106683 283900 222423 85529 2272 -334347 302560 22579 378039 -164067 -58563
10429E4127i7102o1840A13627B1133d10114A29347B3162b03217A84891i2338C6941
$$ 54127 -97102 -158942 113627 21133 -410114 129347 23162 -203217 184891 -92338 36941
10417C29546a0082A36704d67753B05349b09906A97719b04908a8391m43623A73621
$$ 329546 -10082 136704 -467753 205349 -209906 197719 -204908 -18391 -462014 173621
10406D3296L01282E9564O9757a80412A4184b07477d1757p5429B01677e9801j63941
$$ 43296 344578 59564 129321 -180412 14184 -207477 -41757 -117186 201677 -59801 -223742
10395b23742G2407b01761Q1207C05154E4893J63183p5786J15259I1811a29753
$$ -223742 72407 -201761 -120554 305154 54893 218076 142290 257549 91811 -129753
10384A16258K4844b45955q9757C23978a847A07661B3321L07368M9329b32413A48044
$$ 116258 141102 -245955 -335712 323978 -1847 107661 23321 330689 380018 -232413 148044
10372A28555h1268K2074B46360P9609G9143L44304A81849K32544l7556A56079
$$ 128555 -81268 -59194 246360 325969 79143 423447 181849 414393 376837 156079
10361a18360B19434J32792Q5493A27722K2158J7011R0554L3584p7646l0539M31502
$$ -118360 219434 352226 437719 127722 149880 166891 257445 291029 213383 182844 614346
10350F14346l1466A66701K91533A42005J72622j32174K08872o1194J35966B06187
$$ 614346 582880 166701 458234 142005 314627 182453 391325 330131 466097 206187
10339A64899k3907K7183j8368K8991L6734j1115E5479B2018L85294j33901I5447
$$ 164899 140992 168175 149807 178798 215532 204417 55479 22018 407312 273411 95447
10327B45611E1865J0584a6427B05375c4872I5770k8545a17279G4273j0611b14162
$$ 245611 51865 62449 -16427 205375 -34872 95770 67225 -117279 74273 63662 -214162
10315D58957q4067f3527k40409A83165B8677h3561m2129H7411j9215l0851j7824
$$ 458957 374890 -63527 -303936 183165 28677 -83561 -125690 87411 68196 37345 19521
10304A9521a76242B11914e5538A00304L24767e5095q8579j31215J07538N1145
$$ 19521 -176242 211914 -55538 100304 425071 -55095 -143674 -274889 -167351 -116206
10294a16206B09286i636j67799J0337H0426J47509b58181G0103L8536a7042H3027
$$ -116206 209286 -9636 -177435 -167098 80426 227935 -258181 70103 108639 -17042 83027
10282c27575C5750i7795K679C0141g8442C1577c33798A75583C9226O0501D8841
$$ -327575 35750 -97795 -95116 30141 -78442 31577 -333798 175583 39226 99727 48841
10270a10649q2380B6085f8494C49313I9215D7950h5574k22264A97676h1813A31051
$$ -110649 -193029 26085 -68494 349313 99215 47950 -85574 -307838 197676 -81813 131051
10258C653J88221J20654j51242c4909C3665Q5369c53317B57894b63402b4722l8007
$$ 3653 191874 312528 161286 -34909 33665 119034 -353317 257894 -263402 -24722 -62729
10247f2729j20169F3958B8572a69371A19376i6228A77958q5903c8957A23889f2541
$$ -62729 -182898 63958 28572 -169371 119376 -96228 177958 92055 -38957 123889 -62541
10235c19389A82678M6377f1151k09725f1661j65175i8479G6200O292a55514O3077
$$ -319389 182678 229055 -61151 -270876 -61661 -226836 -98479 76200 82492 -155514 -92437
10224i2437k95393h2871j45805j1621D56596E9240b67704d5253k79109a02920
$$ -92437 -387830 -82871 -228676 -240297 456596 59240 -267704 -45253 -324362 -102920
10213B8495a07563j7575A23685c15973a04831A84923h8539K0969A22374J15586
$$ 28495 -107563 -125138 123685 -315973 -104831 184923 -88539 -67570 122374 237960
10203B37960i4380m30d4062I0521b15966A72138G762j484a12926D3705b62575
$$ 237960 -94380 -94810 -44062 90521 -215966 172138 7762 6278 -112926 43705 -262575
10191F3961b05996e5880l9328r2629F5516c94320a42106e4205B3640b52843e5542
$$ 63961 -205996 -55880 -95208 -187837 65516 -394320 -142106 -54205 23640 -252843 -55542
10179d3442g487j55974j77053a62474m65885A09858B4793I765g6896j68858A22470
$$ -43442 -7487 -163461 -340514 -162474 -628359 109858 24793 9765 -76896 -245754 122470
10167a92449b295m60233A82219B8568K2704N4153b8133o0915K5158k9086p7476
$$ -192449 -2295 -462528 182219 28568 51272 105425 -28133 -89048 -63890 -92976 -170452
10156a70452k04199J47322B36813j00819j8926p3b90613A8632d5401j32090K3646
$$ -170452 -374651 -227329 236813 135994 117068 116995 -290613 18632 -45401 -177491 -153845
10145a53845b3151j89150A92902H870a22776D1003e2103l1213o0415c9100j62545
$$ -153845 -23151 -212301 192902 8870 -122776 41003 -52103 -83316 -143731 -39100 -201645
10134b01645D67618e2248B50434h7923A592h8029E0598B957a16348k25760h9005
$$ -201645 467618 -52248 250434 -87923 1592 -88029 50598 2957 -116348 -342108 -89005
10122b28894d5133k27963L4491C5671a54781A71013a72102D2293J297d46685H7234
$$ -228894 -45133 -273096 -238605 35671 -154781 171013 -172102 42293 43590 -446685 87234
10110a02040j31016d4748j1626B4951K7275h5905A48957o7486h6585D2834J29982
$$ -102040 -233056 -44748 -56374 24951 52226 -85905 148957 81471 -86585 42834 172816
10099A72816f8107h891o8324G6617j9831d0289o4757l0856k09206C3134a33289
$$ 172816 -68107 -8891 -77215 76617 56786 -40289 -105046 -135902 -345108 33134 -133289
10087a17988A7081N3124a99958k21961a05091n2080j18498J31288a7016G7550
$$ -117988 17081 70205 -199958 -421919 -105091 -157171 -275669 -144381 -17016 77550
10076c57348J56979B5606a90096A88760C0588J56306I452a15187K4635F5079R8714
$$ -357348 -200369 25606 -190096 188760 30588 186894 9452 -115187 -90552 65079 163793
10065A63793a77223C38886b82081B54953j17516P8068H3283c99709J81800o0704
$$ 163793 -177223 338886 -282081 254953 137437 215505 83283 -399709 -217909 -278613
10055b78613A85b12822k6507M9888A24614a33016O1607b0642k53019o4128a24130
$$ -278613 185 -212822 -239329 -189441 124614 -133016 -71409 -20642 -273661 -337789 -124130
10043c22707j28349A9096b0262k03034c7021C6832b14751A36266a09167B63985
$$ -322707 -451056 19096 -20262 -223296 -37021 36832 -214751 136266 -109167 263985
10032E7735f5044j13814h4326n1431M5800n2018J967j01548G3761d29055C6358
$$ 57735 -65044 -178858 -84326 -135757 -89957 -141975 -140008 -241556 73761 -429055 36358
10020b2325l3800N822j19150A20025b18022A54474F2197a92822p5714E9131b10578
$$ -22325 -56125 -50303 -169453 120025 -218022 154474 62197 -192822 -268536 59131 -210578
10008b11339F4436c2664A15140m2193h906A09990O4043a51108c4893k01812H3243
$$ -211339 64436 -32664 115140 72947 -8906 109990 174033 -151108 -34893 -236705 83243
9996C19187a55789j25346j2503D9707b64496D6377a99303G440J4635f44q0226
$$ 319187 -155789 -281135 -293638 49707 -264496 46377 -199303 7440 22075 -644 -80870
9985h0870c0904P917l48941A09014J71912C278c9073D3871c9372j22825r4434
$$ -80870 -30904 -22987 -371928 109014 280926 3278 -39073 43871 -39372 -162197 -256631
9974b56631O1816f8254m6802e749k9355j37082P0110n7569a335l5668J3618q8898
$$ -256631 -194815 -68254 -115056 -5749 -35104 -172186 -102076 -159645 -1335 -37003 -23385 -112283
9962a12283l29617a27523N7702n7767p3373E2303a97982f7910m04925b05449M2013
$$ -112283 -441900 -127523 -69821 -127588 -200961 52303 -197982 -67910 -472835 -205449 -163436
9951a63436j10114d2918c431j38921q6421I9148d6840G3706K8541d21268a45748
$$ -163436 -273550 -42918 -3431 -142352 -228773 99148 -46840 73706 102247 -421268 -145748
9939H7832D796a18791E7283a37314q8981k5642p9856a25050j7937m15688K10667
$$ 87832 4796 -118791 57283 -137314 -226295 -251937 -331793 -125050 -142987 -558675 -348008
9928c48008a8424k20015k5851A87107d06713a2158D63554A02359D8779a87999
$$ -348008 -18424 -238439 -264290 187107 -406713 -12158 463554 102359 48779 -187999
9917f4112C7589J21842b17991b0449i380k87844J47160p213N3278A28300M5654
$$ -64112 37589 159431 -217991 -20449 -9380 -297224 -150064 -157277 -103999 128300 173954
9906A73954b29368A1839J77793p6794f0520q5605q7807g7225k42343h4292A33149
$$ 173954 -229368 11839 189632 112838 -60520 -146125 -233932 -77225 -319568 -84292 133149
9894c41332g0928k67902J35103A18030b43304B86500A8477R1321a6807k90220
$$ -341332 -70928 -338830 -203727 118030 -243304 286500 18477 109798 -16807 -307027
9884c07027N7367G8690b76264D5601b93694f8229n6304a1076j74966C6656i8854
$$ -307027 -249660 78690 -276264 45601 -293694 -68229 -124533 -11076 -186042 36656 -98854
9872c48903L1843g8832B09731a32765c7048k3847p9981j49332B80569o1886o7129
$$ -348903 -317060 -78832 209731 -132765 -37048 -60895 -140876 -290208 280569 218683 151554
9861A51554D3058a54644A13631a05630d6092A35470a26944k9847D0952a59810
$$ 151554 43058 -154644 113631 -105630 -46092 135470 -126944 -156791 40952 -159810
9850a37202q0423A72584b97507j74585a08125A27322a17466J1217j03406B28711
$$ -137202 -217625 172584 -297507 -472092 -108125 127322 -117466 -106249 -209655 228711
9839A07850P4073b13273i5451k7384A75765p3251L5406J74626c1259A88214M6966
$$ 107850 181923 -213273 -95451 -122835 175765 102514 137920 312546 -31259 188214 235180
9828B35180d01892c1534A44098b35223b4095q450j18739j52633h1624o7992J1382
$$ 235180 -401892 -31534 144098 -235223 -24095 -32545 -151284 -303917 -81624 -149616 -138234
9817a38234k27002J43849P0554o4139E0405N141J66514J07163b66501R7317H8543
$$ -138234 -365236 -221387 -150833 -214972 50405 55546 222060 329223 -266501 -169184 88543
9805A1387h9328a8805F0262g5003m64750K28844C48088a14356m0958G8498M9219
$$ 11387 -89328 -18805 60262 -75003 -539753 -310909 348088 -114356 -155314 78498 127717
9794A27717L5832m8649R9056a53900A16106b56843a8300j61503K2617A84274b27064
$$ 127717 163549 114900 213956 -153900 116106 -256843 -18300 -179803 -157186 184274 -227064
9782B65861H2763a59626g8717A1349J79494d54793J50620O2860m3606B48300K1203
$$ 265861 82763 -159626 -78717 11349 190843 -454793 -304173 -241313 -284919 248300 269503
9771B69503a84457k10034H5047N7961P6714d22493a45156P18J9396b6123m2921
$$ 269503 -184457 -394491 85047 143008 219722 -422493 -145156 -144438 -125042 -26123 -69044
9760f9044A29167a25255D6940a87476J6016p6681l16180h9750r9114f8234k41488
$$ -69044 129167 -125255 46940 -187476 -171460 -248141 -564321 -89750 -188864 -68234 -309722
9749c09722M8679a28048k33228J24448A83973F1263k3576a50130O1902C8530b21369
$$ -309722 -261043 -128048 -361276 -236828 183973 61263 37687 -150130 -88228 38530 -221369
9737G1673a66905K8838C1021a79136A0209c14315b9684j41436E7289c07905A09390
$$ 71673 -166905 -138067 31021 -179136 10209 -314315 -29684 -171120 57289 -307905 109390
9725G6671l2254Q4742b82463G272i8427j02572A58859n7026b07368f7295k79984
$$ 76671 44417 129159 -282463 7272 -98427 -200999 158859 101833 -207368 -67295 -347279
9714c47279N7664j70598a03856c530E9637b06951A42516K8617a91091G0300R8299
$$ -347279 -289615 -460213 -103856 -3530 59637 -206951 142516 171133 -191091 70300 168599
9703A68599o4489h3813l4967k66005J71114B22753a33049J4274L8367c9023D1180
$$ 168599 104110 -83813 -118780 -384785 -213671 222753 -133049 -118775 -80408 -39023 41180
9691B4713O318b32300A70345b0417D9327O6593a2024j11119C40057C9362N2973
$$ 24713 31031 -232300 170345 -20417 49327 115920 -12024 -123143 340057 39362 92335
9680I2335b21813j63626N5069h8479E3695a8703l17172a60543A00577i6878D1179
$$ 92335 -221813 -385439 -330370 -88479 53695 -18703 -335875 -160543 100577 -96878 41179
9668g473m58982A19460P5403g1263o7233r22A77441a21421B08557l9863a63934
$$ -7473 -466455 119460 194863 -71263 -138496 -139418 177441 -121421 208557 168694 -163934
9656G8257d6512a2774B87544c30344M5176d9346k0294p8485E0905c18444g1452
$$ 78257 -46512 -12774 287544 -330344 -285168 -49346 -69640 -148125 50905 -318444 -71452
9644c24220a8860p3939n1268j84042J18663i1876F3386c92426J95714n369A73276
$$ -324220 -18860 -92799 -144067 -328109 -209446 -91876 63386 -392426 -196712 -202081 173276
9632D6345K13449q0498j2106M821J1875b87619a3090I9676a18652B2728i4932
$$ 46345 259794 179296 167190 172011 183886 -287619 -13090 99676 -118652 22728 -94932
9620H9775l2258a92885G90L4690c1690A82051c0434m1531A073a35048C3440h7961
$$ 89775 57517 -192885 790 35480 -31690 182051 -30434 -71965 1073 -135048 33440 -87961
9607A64120c82095a27097j43632G3918a03136n7607A5500O3212f9548I8121g5816
$$ 164120 -382095 -127097 -270729 73918 -103136 -160743 15500 78712 -69548 98121 -75816
9595D7480e7495n1906r8125j44396A57279a25903q4864p8955j32870a45834I9239
$$ 47480 -57495 -109401 -207526 -351922 157279 -125903 -210767 -289722 -422592 -145834 99239
9583b37752r8174A26240O9935I2602m4812d1730j04344A56080b37280C1915c8289
$$ -237752 -335926 126240 196175 92602 47790 -41730 -146074 156080 -237280 31915 -38289
9571A51081d8222B76279k7918a9498j16228M3650J9041A3159n173c53340e9543
$$ 151081 -48222 276279 248361 -19498 -135726 -92076 -73035 13159 7986 -353340 -59543
9559A10303b06783k95850i9626m1231J21A65983c5265C6439d0224A19175a03003
$$ 110303 -206783 -502633 -99626 -140857 -140736 165983 -35265 36439 -40224 119175 -103003
9547F9405K9294C6489b27346G6967a11783k6400j05485A55764a49665j0312A61866
$$ 69405 98699 36489 -227346 76967 -111783 -138183 -243668 155764 -149665 -159977 161866
9535C10054a86164K6485B77316e9290k5965K6231r8276c1594B68143a43919k37757
$$ 310054 -186164 -159679 277316 -59290 -85255 -59024 -157300 -31594 268143 -143919 -381676
9524c81676h9513l21755a87140l51984b23018i8074L1383A74493b82652E5988
$$ -381676 -89513 -411268 -187140 -539124 -223018 -98074 -66691 174493 -282652 55988
9513C7607e8093j1367j71969I1292b28659B76891a30443I2865b92898B7504M1906
$$ 37607 -58093 -69460 -241429 91292 -228659 276891 -130443 92865 -292898 27504 69410
9502F9410H863e1259A08966a64223F1600K57861a81352b2609n0412I8201a36602
$$ 69410 8863 -51259 108966 -164223 61600 319461 -181352 -22609 -73021 98201 -136602
9490B08119J47923F3268c44489b5715A3831c74177C29543d22910D7540g8808K8693
$$ 208119 356042 63268 -344489 -25715 13831 -374177 329543 -422910 47540 -78808 -50115
9479e0115l1290j67409a1749D0576b72293a03700K3166G1078A3518e486p5324
$$ -50115 -81405 -248814 -11749 40576 -272293 -103700 -80534 71078 13518 -5486 -80810
9468h0810j21138k41496a42330k21403D6161N8429h7659F8202C459c2046k94247
$$ -80810 -201948 -443444 -142330 -363733 46161 104590 -87659 68202 3459 -32046 -326293
9457c26293a44180L5921j9053I2584e931B84455a34729j13722i2187k43899J55741
$$ -326293 -144180 -108259 -127312 92584 -5931 284455 -134729 -248451 -92187 -336086 -180345
9446a80345p6229a16428B6960J07649a63536A83925E4020K40068F694i2184j45631
$$ -180345 -256574 -116428 26960 134609 -163536 183925 54020 294088 6694 -92184 -237815
9435b37815E7741b44814E4224e5042J8627m62860b05453j9199C0053a46451C2802
$$ -237815 57741 -244814 54224 -55042 -36415 -499275 -205453 -224652 30053 -146451 32802
9423b16704N3345F8357g7279j5259D8038a61074c7393k25992O0661K3199P2898
$$ -216704 -163359 68357 -77279 -92538 48038 -161074 -37393 -263385 -202724 -179525 -106627
9412a06627A69295B7831L31894D2094a19257q0033B76465A06173e3524o3357l6072
$$ -106627 169295 27831 359725 42094 -119257 -199290 276465 106173 -53524 -116881 -152953
9401a52953e6589l91894A60053e1834C75243i1379l6980d6584A9215a83650j18470
$$ -152953 -56589 -448483 160053 -51834 375243 -91379 -128359 -46584 19215 -183650 -302120
9390c02120j32659J88159a7473o9517B3361J0375Q2045J92021A00273a40908B16438
$$ -302120 -434779 -246620 -17473 -86990 23361 33736 115781 307802 100273 -140908 216438
9378D0951i8808A37897a8862k20253B3540C303Q7732B7412M4356b31132O5776
$$ 40951 -98808 137897 -18862 -239115 23540 3303 91035 27412 71768 -231132 -165356
9367a65356I0083a50562a1828q1926j78070L3705j97589E9803c5769A79714g1831
$$ -165356 90083 -150562 -11828 -93754 -271824 -238119 -435708 59803 -35769 179714 -71831
9355b40651K3010i2776d1239J9296l3236q0499K2515B8823R2141R9582C6993c05067
$$ -240651 -217641 -92776 -41239 -21943 -55179 -135678 -113163 28823 120964 220546 36993 -305067
9342c4099j55367C3114L6754b00683I8616c0065D9417J67560e0365p1306K7637
$$ -34099 -189466 33114 69868 -200683 98616 -30065 49417 216977 -50365 -121671 -94034
9331i4034r3463j5346m0451i8915k02119p9315D7518j5378i1488k90415K9528
$$ -94034 -187497 -202843 -243294 -98915 -301034 -380349 47518 32140 -91488 -381903 -352375
9320c52375A41338a52117j00139J15567J465C5084a93458N3697E1016j8552J02966
$$ -352375 141338 -152117 -252256 -136689 -135224 35084 -193458 -139761 51016 32464 135430
9309A35430c02741B61618j6374b68339A69840n5954B0767b07484L7108P2983k09083
$$ 135430 -302741 261618 245244 -268339 169840 113886 20767 -207484 -170376 -97393 -306476
9298c06476J39869k00D0100b52333B57791i6903A4459h6k72808a2048l04015e3987
$$ -306476 -166607 -166807 40100 -252333 257791 -96903 14459 -86 -272894 -12048 -316063 -53987
9285f6783C10634C652J92173b7504H1542M2132f4137a6180j02738K860L0376A06304
$$ -66783 310634 3652 195825 -27504 81542 123674 -64137 -16180 -118918 -116058 -85682 106304
9272a69898f3918B18660G8982a18711c765A1783h3769B04541a6606a788G7445
$$ -169898 -63918 218660 78982 -118711 -3765 11783 -83769 204541 -16606 -1788 77445
9260c25129A22987a18414B66601i8303A19112J17360a73519E3067R4395a39502
$$ -325129 122987 -118414 266601 -98303 119112 236472 -173519 53067 147462 -139502
9249b39535k01808e9356E1353a00532J5164A26589a38739g285k30672P2365q8078
$$ -239535 -441343 -59356 51353 -100532 -85368 126589 -138739 -7285 -237957 -165592 -253670
9238b53670G0196Q669b00514a9009j92510A98799i6136A02591a08267j37822b6137
$$ -253670 70196 78865 -200514 -19009 -211519 198799 -96136 102591 -108267 -246089 -26137
9226a37060k68311a03837j20169B13281b06534J3355A47756f9198n8105b8370
$$ -137060 -405371 -103837 -224006 213281 -206534 -193179 147756 -69198 -127303 -28370
9215E288a79190I4890b98976B7996N9b19996B68883E6502R159f6654A04966C0511
$$ 5288 -179190 94890 -298976 27996 28055 -219996 268883 56502 65661 -66654 104966 30511
9202B00366k1412b65564B08955c16632k40495K69267a26777A6942J19026C3756
$$ 200366 178954 -265564 208955 -316632 -557127 -287860 -126777 16942 135968 33756
9191a13513K5821j27134D4510g6835P103B62537a32681l71696a36456d7952l3264
$$ -113513 -87692 -214826 44510 -76835 -69732 262537 -132681 -504377 -136456 -47952 -81216
9180h1216e921j55876f4060o9919M0677L6702p7107D2907r554a87442B6999J69229
$$ -81216 -5921 -161797 -64060 -133979 -93302 -56600 -133707 42907 33353 -187442 26999 196228
9168A96228j3434a35866A00108c3458k21128J0616M0087j29874J5015B38108e0459
$$ 196228 182794 -135866 100108 -33458 -254586 -243970 -203883 -333757 -318742 238108 -50459
9156b14140i4839m34961a67106j6649b4903C67626g2610l52379M1853A92666R8738
$$ -214140 -94839 -529800 -167106 -183755 -24903 367626 -72610 -424989 -383136 192666 291404
9145B91404j34026a46063p1872b9372A81346c4124D804M2463b31670d0154A25260
$$ 291404 157378 -146063 -217935 -29372 181346 -34124 4804 47267 -231670 -40154 125260
9133C5870a19821j40056Q3136A72246a35481A20016C7880a86988k45761b6461
$$ 35870 -119821 -259877 -176741 172246 -135481 120016 37880 -186988 -432749 -26461
9122c23458d0350a8480k5020C3761J01799d72646C67614c0296k26964j32270a75159
$$ -323458 -40350 -18480 -43500 33761 135560 -472646 367614 -30296 -257260 -389530 -175159
9110i5749A87174a80150B22135d8811l82341e657A12719a9723A81473L2747e685
$$ -95749 187174 -180150 222135 -48811 -431152 -5657 112719 -19723 181473 214220 -5685
9098b99375B877b55167a334I1729a14459M4722o8688B05437b10557D5901K02814
$$ -299375 2877 -255167 -1334 91729 -114459 -69737 -138425 205437 -210557 45901 248715
9087B48715q9867G660a16381A43509e4601A55550g9605o3939q5510f9432A0872
$$ 248715 158848 7660 -116381 143509 -54601 155550 -79605 -143544 -229054 -69432 10872
9075a93385B8716g5147A92020f6289j28610I1782h6334j31144C56395a41124m7687
$$ -193385 28716 -75147 192020 -66289 -194899 91782 -86334 -217478 356395 -141124 -188811
9064a88811j55050J51105A80808l0683a74310A7265P8869c73685B93113E5746
$$ -188811 -343861 -192756 180808 150125 -174310 17265 96134 -373685 293113 55746
9053c12765a05258m8243H5693a09011B07733a21465b3905E0175N8433b3157j07520
$$ -312765 -105258 -153501 85693 -109011 207733 -121465 -23905 50175 108608 -23157 -130677
9042a30677n3170B8639L62151f9774j05574g3896I7478b11292l0660P2458C0577
$$ -130677 -183847 28639 390790 -69774 -175348 -73896 97478 -211292 -241952 -169494 30577
9030H9266g5742l3943j05605g5095j77750J20970O5218G3931J45998I9501N6389
$$ 89266 -75742 -109685 -215290 -75095 -252845 -131875 -66657 73931 219929 99501 155890
9019A55890n7079O6351b5253l7188K9179C95232a82446B03361c03514p1971A4602
$$ 155890 98811 165162 -25253 -62441 -33262 395232 -182446 203361 -303514 -375485 14602
9007C7585a3885r0133M870C15436C7017b19821K3568f2994G6178a18967j14132
$$ 37585 -13885 -104018 -99148 315436 37017 -219821 -196253 -62994 76178 -118967 -233099
8996b33099k80920A08371D3906a88236I2620c0028A53794A4612c48066a50802
$$ -233099 -514019 108371 43906 -188236 92620 -30028 153794 14612 -348066 -150802
8985b35091k38894D4075a49977A97494g0291j74182I1668J02932h3655a9295A33954
$$ -235091 -473985 44075 -149977 197494 -70291 -244473 91668 194600 -83655 -19295 133954
8973b5606k08188q2462A76729C018a09169D9090b40364A0037b00827O5176A89710
$$ -25606 -233794 -316256 176729 3018 -109169 49090 -240364 10037 -200827 -135651 189710
8961b36707A11876b79867B2189a26882k0321k8418k1493k52236B38651A08630
$$ -236707 111876 -279867 22189 -126882 -147203 -175621 -197114 -449350 238651 108630
8950d69921h9805j08365B07703I7287C4154a51249g4955n6760A3980Q8711i7345
$$ -469921 -89805 -198170 207703 97287 34154 -151249 -74955 -131715 13980 102691 -97345
8938c69104a42780E465i5326C24521a0197o2672g911C2437a2621p4842A23653
$$ -369104 -142780 5465 -95326 324521 -10197 -72869 -7911 32437 -12621 -87463 123653
8926A55038J30609q0969A1509J118496M462365k445110H19991l21721B07921J18793
$$ 155038 285647 204678 11509 1130005 5592370 3147260 819991 498270 207921 326714
8916C26714h2312F2525a11088H525b41736B07369F9731L28483A98288E0225J65742
$$ 326714 -82312 62525 -111088 8525 -241736 207369 69731 398214 198288 50225 215967
8905B15967j00101O8493l2463B7955b85912A9421g5720p2391j07770R327G5837
$$ 215967 115866 184359 151896 27955 -285912 19421 -75720 -148111 -255881 -246554 75837
8893b45906N7136j87653a48242I6573b1476B56564a79710a4050D892K72847e5233
$$ -245906 -188770 -376423 -148242 96573 -21476 256564 -179710 -14050 4892 277739 -55233
8881b9244g137m68600B50860A1688J90285f6692I550b27189l819i0207m16650
$$ -29244 -7137 -475737 250860 11688 201973 -66692 9550 -227189 -231008 -90207 -506857
$$ [...]
##END NTUPLES=NMR SPECTRUM
##END=
