
##TITLE=AC1324_UGAAH12153_6535724_wPBb3waUKT
##JCAMPDX= 6.0         $$ Bruker NMR JCAMP-DX V2.0
##DATA TYPE= NMR SPECTRUM
##DATA CLASS= NTUPLES
##ORIGIN= BRUKER
##OWNER= Administrator
$$ 1.72 TOPSPIN		Version 2.1
$$ 2012-12-11 18:50:41.070 -0500  Administrator@X
$$ Compression mode = diff/dup
##.OBSERVE FREQUENCY= 400.02188249412
##.OBSERVE NUCLEUS= ^1H
##.ACQUISITION MODE= SIMULTANEOUS (DQD)
##.ACQUISITION SCHEME= undefined
##.AVERAGES= 8
##.DIGITISER RES= 22
##SPECTROMETER/DATA SYSTEM= spect
##.PULSE SEQUENCE= zg30
##.SOLVENT NAME= COFFEE_meoh
##.SHIFT REFERENCE= INTERNAL, COFFEE_meoh, 1, 14.98509
##AUDIT TRAIL= $$ (NUMBER, WHEN, WHO, WHERE, PROCESS, VERSION, WHAT)
$$ ##TITLE= Audit trail, TOPSPIN		Version 2.1
$$ ##JCAMPDX= 5.01
$$ ##ORIGIN= Bruker BioSpin GmbH
$$ ##OWNER= Administrator
$$ $$ E:\/data/COFFEE/nmr/AC1324_UGAAH12153_6535724_wPBb3waUKT/20/pdata/1/auditp.txt
$$ ##AUDIT TRAIL=  $$ (NUMBER, WHEN, WHO, WHERE, PROCESS, VERSION, WHAT)
(   1,<2012-12-11 18:50:32.913 -0500>,<Administrator>,<X>,<go>,<TOPSPIN 2.1>,
      <created by zg
	started at 2012-12-11 18:49:26.788 -0500,
	POWCHK enabled, PULCHK disabled,
       configuration hash MD5:
       86 BA 57 50 F2 9D 5C 9B 26 00 A9 28 5F 66 2E 89
       data hash MD5: 64K
       85 05 80 7E A6 21 01 5B C5 BB 46 81 2A 56 19 F4>)
(   2,<2012-12-11 18:50:36.038 -0500>,<Administrator>,<X>,<proc1d>,<TOPSPIN 2.1>,
      <Start of raw data processing
       efp LB = 0 FT_mod = 6 PKNL = 1 PHC0 = 0 PHC1 = 0 SI = 32K 
       data hash MD5: 32K
       8D B5 E2 00 58 18 C4 2F 02 D5 4F 48 9E 7A 92 A5>)
(   3,<2012-12-11 18:50:36.507 -0500>,<Administrator>,<X>,<proc1d>,<TOPSPIN 2.1>,
      <pk PHC0 = 96.05896 PHC1 = 0 
       data hash MD5: 32K
       60 1E 0A 8D 3D 28 74 CA 27 CB 48 55 7C 0A 76 6B>)
(   4,<2012-12-11 18:50:36.741 -0500>,<Administrator>,<X>,<proc1d>,<TOPSPIN 2.1>,
      <abs ABSG = 1 
       data hash MD5: 32K
       93 A1 0A 03 50 44 0C 9A 71 6E 93 50 0F EB 46 51>)
(   5,<2012-12-11 18:50:36.882 -0500>,<Administrator>,<X>,<proc1d>,<TOPSPIN 2.1>,
      <abs ABSG = 2 
       data hash MD5: 32K
       27 39 B8 A8 E4 C6 8E 9B 08 A4 6E A0 AF 8A B4 82>)
(   6,<2012-12-11 18:50:37.038 -0500>,<Administrator>,<X>,<proc1d>,<TOPSPIN 2.1>,
      <abs ABSG = 3 
       data hash MD5: 32K
       47 3A 67 77 59 2A 12 50 99 AD FB F7 97 13 A4 9E>)
(   7,<2012-12-11 18:50:37.179 -0500>,<Administrator>,<X>,<proc1d>,<TOPSPIN 2.1>,
      <abs ABSG = 4 
       data hash MD5: 32K
       74 E2 F2 00 49 DB 07 67 7C FB 8B 53 F2 7F 8D BF>)
(   8,<2012-12-11 18:50:37.351 -0500>,<Administrator>,<X>,<proc1d>,<TOPSPIN 2.1>,
      <abs ABSG = 5 
       data hash MD5: 32K
       96 40 F1 E9 54 8A 1C 61 D9 AD 6E 3F DC 37 CC D6>)
$$ ##END=
$$ 
$$ $$ hash MD5
$$ $$ 15 17 AE 4B C4 E3 BD 8F 52 57 D2 24 2B A8 51 BC
##$RELAX= 
##$RELAX= 
##$RELAX= 
##$RELAX= 
##$RELAX= 
##$RELAX= 
##$RELAX= 
##$RELAX= 
$$ Bruker specific parameters
$$ --------------------------
##$DU= <E:\>
##$EXPNO= 20
$$ [...]
##$TP= (0..7)
150 150 150 150 150 150 150 150
##$TP07= 0
##$TPNAME0= <>
##$TPNAME1= <>
##$TPNAME2= <>
##$TPNAME3= <>
##$TPNAME4= <>
##$TPNAME5= <>
##$TPNAME6= <>
##$TPNAME7= <>
##$TPOAL= (0..7)
0.5 0.5 0.5 0.5 0.5 0.5 0.5 0.5
##$TPOFFS= (0..7)
0 0 0 0 0 0 0 0
##$TUNHIN= 0
##$TUNHOUT= 0
##$TUNXOUT= 0
##$USERA1= <user>
##$USERA2= <user>
##$USERA3= <user>
##$USERA4= <user>
##$USERA5= <user>
##$V9= 5
##$VALIST= <valist>
##$VCLIST= <CCCCCCCCCCCCCCC>
##$VD= 0
##$VDLIST= <DDDDDDDDDDDDDDD>
##$VPLIST= <PPPPPPPPPPPPPPP>
##$VTLIST= <TTTTTTTTTTTTTTT>
##$WBST= 2048
##$WBSW= 25
##$XGAIN= (0..3)
0 0 0 0
##$XL= 0
##$YL= 0
##$YMAX_a= 676053
##$YMIN_a= -574852
##$ZGOPTNS= <>
##$ZL1= 120
##$ZL2= 120
##$ZL3= 120
##$ZL4= 120
##$ABSF1= 14.98509
##$ABSF2= -5.573092
##$ABSG= 5
##$ABSL= 3
##$ALPHA= 0
##$AQORDER= 0
##$ASSFAC= 0
##$ASSFACI= 0
##$ASSFACX= 0
##$ASSWID= 0
##$AUNMP= <proc_prof1d_extract_pilot.lims>
##$AXLEFT= 0
##$AXNAME= <>
##$AXNUC= <1H>
##$AXRIGHT= 0
##$AXTYPE= 0
##$AXUNIT= <>
##$AZFE= 0.1
##$AZFW= 0.1
##$BCFW= 0
##$BC_mod= 0
##$BYTORDP= 0
##$COROFFS= 0
##$CY= 15
##$DATMOD= 1
##$DC= 0
##$DFILT= <>
##$DTYPP= 0
##$F1P= 0
##$F2P= 0
##$FCOR= 0.5
##$FTSIZE= 32768
##$FT_mod= 6
##$GAMMA= 0
##$GB= 0
##$INTBC= 1
##$INTSCL= 1
##$ISEN= 128
##$LB= 0
##$LEV0= 0
##$LPBIN= 0
##$MAXI= 10000
##$MC2= 0
##$MEAN= 0
##$ME_mod= 0
##$MI= 0
##$NCOEF= 0
##$NC_proc= -8
##$NLEV= 6
##$NOISF1= 0
##$NOISF2= 0
##$NSP= 0
##$NTH_PI= 0
##$NZP= 0
##$OFFSET= 14.98509
##$PC= 1
##$PHC0= 96.05896
##$PHC1= 0
##$PH_mod= 1
##$PKNL= yes
##$PPARMOD= 0
##$PPDIAG= 0
##$PPIPTYP= 0
##$PPMPNUM= 2147483647
##$PPRESOL= 1
##$PSCAL= 4
##$PSIGN= 0
##$PYNMP= <proc.py>
##$REVERSE= no
##$SF= 400.02
##$SI= 32768
##$SIGF1= 0
##$SIGF2= 0
##$SINO= 400
##$SIOLD= 32768
##$SPECTYP= <>
##$SREGLST= <1H.CDCl3>
##$SSB= 0
##$STSI= 32768
##$STSR= 0
##$SW_p= 8223.68421052631
##$SYMM= 0
##$S_DEV= 0
##$TDeff= 65536
##$TDoff= 0
##$TI= <>
##$TILT= no
##$TM1= 0
##$TM2= 0
##$TOPLEV= 0
##$USERP1= <user>
##$USERP2= <user>
##$USERP3= <user>
##$USERP4= <user>
##$USERP5= <user>
##$WDW= 1
##$XDIM= 32768
##$YMAX_p= 482289687
##$YMIN_p= -920954
##$CURPLOT= <Network HP LaserJet P1505>
##$CURPRIN= <$Network HP LaserJet P1505>
##$DFORMAT= <normdp>
##$LAYOUT= <+/1D_H.xwp>
##$LFORMAT= <normlp>
##$PFORMAT= <normpl>
##$SURQMSG= 1
$$ End of Bruker specific parameters
$$ ---------------------------------
##NTUPLES= NMR SPECTRUM
##VAR_NAME=  FREQUENCY,     SPECTRUM/REAL,   SPECTRUM/IMAG
##SYMBOL=    X,             R,               I
##VAR_TYPE=  INDEPENDENT,   DEPENDENT,       DEPENDENT
##VAR_FORM=  AFFN,          ASDF,            ASDF
##VAR_DIM=   32768,         32768,           32768
##UNITS=     HZ,            ARBITRARY UNITS, ARBITRARY UNITS
##FACTOR=    0.250966925370066, 1,           1
##FIRST=     8223.43324360094, -5454,        41138
##LAST=      0,             -123672,         20994
##MIN=       0,             -920954,         0
##MAX=       8223.43324360094, 482289687,    0
$$ Real data points
##PAGE= N=1
##DATA TABLE= (X++(R..R)), XYDATA
$$ [...]
19541h0496m290C6383b763k51345a5176q4996k66855N5994Q0371i3705q5050C7821
19528d10382H642a32200n6939B57025b64652a25216N5464q1855A72659c39899
19517h0503A33489b36215a03516j8788e2633m7181d1491j76590h9965C69841A26245
19505B17278H0503b9091A0329a47175N9460B02387a50443e5299f139j34953q9173
19494b30265j52327A42744e49328a10680l6935A17398a19175E53362A72930c02960
19483h9378c3404j49449D6578c71234B0260M3818a41961H1982a10453n3833l9147
19472b03433r5049B6439a01474C7218a32856j51336i6320K5053k82941h7513l2796
19461a20309b3520l71077a30827A99504a56863j27059d1398A15727d00721C45739
$$ y = [-80496, -84786, 36383, -2763, -254108, -15176, -100172, -367027, -311033, -230662, -93705, -178755, 37821, -410382, 8642, -132200, -189139, 257025, -264652, -125216, -69752, -151607, 172659, -339899, -80503, 133489, -236215, -103516, -122304, -52633, -99814, -41491, -218081, -89965, 369841, 126245, 217278, 80503, -29091, 10329, -147175, -87715, 202387, -150443, -55299, -6139, -141092, -230265, -382592, 142744, -549328, -110680, -147615, 117398, -119175, 553362, 172930, -302960, -89378, -33404, -182853, 46578, -371234, 20260, 64078, -141961, 81982, -110453, -164286, -203433, -298482, 26439, -101474, 37218, -132856, -284192, -96320, -71267, -354208, -87513, -120309, -23520, -394597, -130827, 199504, -156863, -283922, -41398, 115727, -400721, 345739]
19450b71178P4675e4836A68212b03992P6672A85730a4200B43656C1402a95031
19439a28685p3300q1107J11252h946j56504k53389h4981G0412P2946K1337a46709
19427b38683C1021b07705r3896e5228B9085M0051N3994Q7432i2880M3956A71724
19415b74951A16667e0616r8041f3527A11616h0288j28684A28680i4539K0206l23664
19404c97997A0345c01537D0976J50674a08042n00401B10445c06613R6860J6437
19394a93316D590c8863q5700J7842c1789B0761c18106A40272B1864Q9426a70580
19382F279c7577m8650A04161J3633c81115J89625I5444a45333k9422e4178n7661
19371a11839p9361B98505I8895b21172q1678C35684b60963d5086A16402a59402
$$ y = [-271178, -196503, -54836, 168212, -203992, -127320, 185730, -14200, 243656, 31402, -195031, -128685, -201985, -283092, -171840, -8946, -165450, -418839, -84981, 70412, 143358, 164695, -146709, -238683, 31021, -207705, -301601, -55228, 29085, 69136, 123130, 210562, -92880, -48924, 171724, -274951, 116667, -50616, -148657, -63527, 111616, -80288, -208972, 128680, -94539, -74333, -397997, 10345, -301537, 40976, 191650, -108042, -608443, 210445, -306613, -209753, -193316, 4590, -38863, -124563, -106721, -31789, 20761, -318106, 140272, 21864, 111290, -170580, 6279, -37577, -86227, 104161, 117794, -381115, -191490, 95444, -145333, -174755, -54178, -111839, -191200, 298505, 98895, -221172, -302850, 335684, -260963, -45086, 116402, -159402]
19360A00486b68649N4162G3562c4614B33214a08592B88438I398J36529c40832
19349G2116c9716k27541F0738J17789c49011A53590e5667l0019J7694D13677a9814
19337b45679G1476a04896q9342f4950j41349A50460N4238C3054N9136c77940A22201
19325A30645p689l9644a43789O5975F4731a27822B82497c61955h9711j63342J1460
19314b41593A45684m7639a49576j12321b0251k07910p6136d8674k55753a32206
19303D7451e7928j25612h2979G3456b55219M4386M0803f1647k58201B5498K21192
19292B46690a89069B3456b3342o2114j95279h2217o8504A86789a39817A38379
19281A35188b71559Q8906e9837A84669A7047b85871i7786B58884b69959c616j04602
$$ y = [100486, -268649, -214487, 73562, -34614, 233214, -108592, 288438, 9398, 145927, -340832, 72116, -39716, -267257, 60738, 178527, -349011, 153590, -55667, -85686, -67992, 413677, -19814, -245679, 71476, -104896, -194238, -64950, -206299, 150460, 204698, 33054, 92190, -377940, 122201, 130645, 122956, 83312, -143789, -77814, 64731, -127822, 282497, -361955, -89711, -253053, -241593, 145684, 98045, -149576, -261897, -20251, -228161, -304297, -48674, -304427, -132206, 47451, -57928, -183540, -82979, 73456, -255219, -210833, -170030, -61647, -319848, 25498, 246690, -189069, 23456, -23342, -85456, -280735, -82217, -150721, 186789, -139817, 138379, 135188, -271559, -182653, -59837, 184669, 17047, -285871, -97786, 258884, -269959, -3616, -108218]
19270a08218F3113c20547C4932b67205h055j8944j7861F7913j2583c39014a00225
19258a69883j92223e9875G1895L8905b23915A4844K05016r4477l2175a58062N6363
19247a01699q5275a2720k50805d8743A73266l061E853a38709A38733a49621M1759
19236a07862k35488f3069k67533I3171b50553j07856Q0215J29014j02922D9064
19225A37249f27418G5699J47502a32935d3407I0898q236a84694A34922O3087A2131
19213A20678c62100A26805c3918j04180D4773a12384l5225B76388a16588o490
19203a23078E8249h5999A50045a46557j83636g7040k41782h3257j33902p331A63005
19191a74437P9279H7749g073k12328g2470C76532C6518h7858k07252N3856B8465
$$ y = [-108218, 63113, -320547, 34932, -267205, -8055, -26999, -44860, 67913, 55330, -339014, -100225, -169883, -362106, -59875, 71895, 110800, -223915, 14844, 219860, 125383, 93208, -158062, -101699, -186974, -12720, -263525, -48743, 173266, 170205, 5853, -138709, 138733, -149621, -107862, -343350, -63069, -330602, 93171, -250553, -358409, -278194, -149180, -252102, 49064, 137249, -627418, 75699, 223201, -132935, -43407, 90898, 82662, -184694, 134922, 198009, 12131, 120678, -362100, 126805, -33918, -138098, 44773, -112384, -147609, 276388, -116588, -123078, 58249, -85999, 150045, -146557, -330193, -77040, -318822, -83257, -217159, -224490, 163005, -174437, -95158, 87749, -7073, -219401, -72470, 376532, 36518, -87858, -295110, -241254, 28465]
19179b13622B8232c10983G186b42400f6247B4929h5297a1131D75033b87109b6090
19167b83528F2537b70725d8011E2996e26173h7464A16253E7378a73363M2265j22026
19156b53124o3059b5578m0171B83c2147q229o8866a7816A54362a83295c7865C67995
19143A93693f9180l5774A04368g4731k9487B4583a84406L1022d0695A61446f6733
19131b1651B4305i5389A03198a90725A49923c03616K3735A14999b66472h2977
19120A2402R7442E3810b9428I7662h3853B36963i0140q3057a3019C06424a88133
19108h9007r4818B27229b36408a15132j10355h9304I3456a4556A58290p8296h1608
19096a8739l08591J19180r178B71699a85816C29546a96472m327j89533J25814
$$ y = [-213622, 28232, -310983, 7186, -242400, -66247, 24929, -85297, -11131, 475033, -287109, -26090, -283528, 62537, -270725, -48011, 52996, -526173, -87464, 116253, 57378, -173363, -131098, -253124, -316183, -25578, -65749, 283, -32147, -40376, -109242, -17816, 154362, -183295, -37865, 367995, 193693, -69180, -104954, 104368, -74731, -104218, 24583, -184406, -153384, -40695, 161446, -66733, -21651, 24305, -95389, 103198, -190725, 149923, -303616, -279881, 114999, -266472, -82977, 12402, 109844, 53810, -29428, 97662, -83853, 236963, -90140, -173197, -13019, 306424, -188133, -89007, -183825, 227229, -236408, -115132, -225487, -89304, 93456, -14556, 158290, 79994, -81608, -18739, -327330, -208150, -217328, 271699, -185816, 329546, -196472, -200799, -390332, -264518]
19086b64518e9600l21924a52493F8963Q718c2452B7170j3289f8023E0521J06460
19075A56981f0751l17268M1932e2085j20169j47556g2845e290A71855b76512B49595
19063a18063A70727I734J81507J3655a22612j62119A38702g6220G1787r700a41955
19051a87362p2326a07662b8665M357p9083l13129d4330A2990K39399G5850j678
19040G4172b8046A45649J93995g2229G68N9896b26888C21188C7624a50219D24984
19028G0797l3594J48346a65489C971J36513F9437B4777f290j2887j84162E0472
19016D85326A22406a90724A3048J96187K19153g5488o0106f027l32131K2953A79985
19004C09061A35938c12815G6184i5034A7382b28854A65048h7380o1704B0272a33123
$$ y = [-264518, -59600, -381524, -152493, 68963, 77681, -32452, 27170, 13881, -68023, 50521, 156981, -60751, -378019, -336087, -52085, -172254, -319810, -72845, -5290, 171855, -276512, 249595, -118063, 170727, 9734, 191241, 204896, -122612, -284731, 138702, -76220, 71787, 62087, -141955, -187362, -259688, -107662, -28665, -24308, -103391, -416520, -44330, 12990, 252389, 75850, 74172, -28046, 145649, 339644, -72229, 768, 60664, -226888, 321188, 37624, -150219, 424984, 70797, 37203, 185549, -165489, 3971, 140484, 69437, 24777, -6290, -19177, -203339, 50472, 485326, 122406, -190724, 13048, 209235, 428388, -75488, -135594, -6027, -338158, -315205, 179985, 309061, 135938, -312815, 76184, -95034, 17382, -228854, 165048, -87380, -149084, 20272, -133123]
18992B0127a26763j82492J17888j06967b5316E0945i8081C3586k430N905K16910
18981B53971m3117I0544D2339a17047F5302B4871d6211k07438c5559H3679J48740
18970B32419h7832p8560B29492c6096o8103F9413b51385O5907B68804b02680o1798
18959b64478h6885j57497c9073j47068A93129c09453a21616A36336f7896A91770
18948A48857a0107A69958F3070a67474k18388B8243d5671J407k09700g9121K3731
18937e5390j50797D3882a00381f397G0634L3132a10021C3583d43603a2406r0020
18926a02426C8259L3913P4074a39722H2704M4046b54198i7875L9562l9398M882
18915i2829M5124K3519j3266j22781B1833L655J38051N199a05098b6231B95214
$$ y = [20127, -126763, -309255, -191367, -298334, -25316, 50945, -98081, 33586, 31156, 37061, 253971, 210854, 90544, 42339, -117047, 65302, 24871, -46211, -253649, -35559, 83679, 232419, -87832, -166392, 229492, -36096, -104199, 69413, -251385, -185478, 268804, -202680, -264478, -86885, -244382, -39073, -186141, 193129, -309453, -121616, 136336, -67896, 191770, 148857, -10107, 169958, 63070, -167474, -385862, 28243, -45671, -44264, -253964, -79121, -55390, -206187, 43882, -100381, -6397, 70634, 103766, -110021, 33583, -443603, -12406, -102426, 38259, 72172, 146246, -139722, 82704, 126750, -254198, -97875, -58313, -97711, -92829, -47705, -24186, -37452, -160233, 21833, 25488, 163539, 168738, -105098, -26231, 295214]
18903d75642h4733G5063a79905j51117J10272h5756a9472A15402a60556e5414
18892D04827j63088I6154h63E1185e7177o8773j94898m3872J59494R4345A43460
18880E5140J09552G3584h2479g542A11917m1264J77259a73570F5136b10752C060
18868f1652H3049J31207e20711A06908e6914q6527A8526K00036a4555k17195N4086
18857a77664g8509l5925q2058l5328a4792A69257e5622m620k59569A10473P439
18846A17912c50331A99758K515a01631A49339a51254P517A33063c54695B3616
18835A82558d9957D0220K50607a13552B5493a73103j9168R3089m2549j58969h7775
18823a54189C5901b07988n3707D32575A54826F1968Q202d1154k18629c8083q9336
$$ y = [-475642, -84733, 75063, -179905, -331022, -220750, -85756, -19472, 115402, -160556, -55414, 404827, 241739, 96154, -863, 51185, -57177, -125950, -320848, -364720, -205226, -110881, 143460, 55140, 164692, 73584, -82479, -7542, 111917, 70653, 247912, -173570, 65136, -210752, 3060, -61652, 83049, 214256, -520711, 106908, -56914, -143441, 18526, 218562, -14555, -231750, -177664, -78509, -114434, -196492, -231820, -14792, 169257, -55622, -60242, -319811, 110473, 117912, -350331, 199758, 202273, -101631, 149339, -151254, -143737, 133063, -354695, 23616, 182558, -49957, 40220, 290827, -113552, 25493, -173103, -192271, -99182, -141731, -300700, -87775, -154189, 35901, -207988, -261695, 432575, 154826, 61968, 70170, -41154, -259783, -38083, -127419]
18812a27419B00449O1751A918J29398M0535A9658Q6507n0411b88378L1997l7888
18801b94269J03713A09129c98164A66987C5867b00711C6690g0881k89410A85470
18790a75811C21409b22833L4476e6606q4636l6806f6181P47L0796l87270A06047
18778b72297O3539D2817c61690B6849L2891g8396b0437k38425C6962J16548B0759
18766A74575I008d01302I8800K8733c62162a32133l49117d4448k2193B2309a79850
18754A96867J8420a43033G0875N9923b01225A16417E0087q414h6735A521R2404
18743I3925d86561i1208H7661j756h169D4033N4447a78888A47652b307H8397j186
18731H7211b7904n0713r4515M1971e4490a1976l8568o6571A039i1184r5710o6578
$$ y = [-127419, 200449, 262200, 1918, 131316, 171851, 19658, 106165, 55754, -288378, -256381, -294269, -190556, 109129, -398164, 166987, 35867, -200711, 36690, -70881, -360291, 185470, -175811, 321409, -222833, -188357, -56606, -141242, -178048, -66181, -65434, -34638, -421908, 106047, -272297, -208758, 42817, -361690, 26849, 59740, -78396, -20437, -258862, 36962, 153510, 20759, 174575, 9008, -401302, 98800, 127533, -362162, -132133, -481250, -44448, -66641, 22309, -179850, 196867, 215287, -143033, 70875, 130798, -201225, 116417, 50087, 41673, -86735, 1521, 93925, -486561, -91208, 87661, 85905, -8169, 44033, 98480, -178888, 147652, -2307, 88397, 87211, -27904, -78617, -173132, -131161, -54490, -11976, -50544, -117115, 1039, -91184, -186894, -253472]
18719b53472d8125C7684b2169j01280L0251d5032l16113A2563J93129F056L07882
18708C13938c20313B09786P5743b07279C03643f5232C39338c2094m7000c5089
18697a35A16993D8832B3718A501h1567K830C7437a42211p2440P0483J6634j63462
18685b90996A4206a63716g7025k1572a4607j63722m3549C958b66476C57816A31783
18673B10218R1546b75823i0745k2476G1381K3533e2503j07501f822j94655j59606
18662c61083g8272r2993A61669a07247C65222b50353a16155B62279b2678A96061
18651A83876A0214a06464k079j78460b9553p1931b2546B77692b89185c6338k32390
18640b68728e4397D0060L9535a24599o8913l44554b06043o7566j672C9017c1457
$$ y = [-253472, -48125, 37684, -22169, -123449, -93198, -45032, -361145, 12563, 205692, 6056, 313938, -320313, 209786, 285529, -207279, 303643, -65232, 339338, -32094, -79094, -35089, -135, 116993, 48832, 23718, 1501, -81567, -78737, 37437, -142211, -214651, -144168, -127534, -290996, 14206, -163716, -77025, -98597, -14607, -178329, -221878, 3958, -266476, 357816, 131783, 210218, 301764, -275823, -90745, -113221, 71381, 94914, -52503, -160004, -6822, -201477, -361083, -78272, -171265, 161669, -107247, 365222, -250353, -116155, 262279, -22678, 196061, 183876, 10214, -106464, -108543, -287003, -29553, -101484, -22546, 277692, -289185, -36338, -268728, -54397, 40060, 79595, -124599, -193512, -538066, -206043, -273609, -275281, 39017, -31457]
18628A35496b31128A65393b18988n7502K3429e6351J6662D0716J4095c8805A17861
18616b42388B5292a80081h5757j56177L2052j95156A52422A3923M8718K0828c62596
18604C5747b58540L5914d5742n29387a08705j40218j02574e9389C3362a58760
18593B93114b31439B15314I8845J09602E9876c8372j32866l1735J00833A14441
18582b46053A55398c7304A50580B3045J26282a96365C35972b86496J29806k68509
18572d25199a34211a5167I2350c48883B34603b72679J07479p182A54258M6567
18562B00825a93213I2144b40809c05k67420e6240j28731M6771A1547L9812b42380
18550a82323j06174A66895G1056g6380n5733C24797j32900a97952r2685D5713
$$ y = [135496, -231128, 165393, -218988, -276490, -253061, -56351, -39689, 40716, 54811, -38805, 117861, -242388, 25292, -180081, -85757, -241934, -209882, -405038, 152422, 13923, 62641, 83469, -362596, 35747, -258540, -222626, -45742, -575129, -108705, -248923, -351497, -59389, 33362, -158760, 293114, -231439, 215314, 98845, 208447, 59876, -38372, -171238, -202973, -102140, 114441, -246053, 155398, -37304, 150580, 23045, 149327, -196365, 335972, -286496, -156690, -425199, -134211, -15167, 92350, -348883, 234603, -272679, -165200, -172382, 154258, 200825, -193213, 92144, -240809, -305, -267725, -56240, -184971, -138200, 11547, 51359, -242380, -182323, -288497, 166895, 71056, -76380, -132113, 324797, 191897, -197952, -290637, 45713]
18539e50626a851j12098q4418i1598B12290G2227J04820J62627b2308j16921D5866
18527B908a64173L0766B13625k4715K97353a16220n7429A20977b54474A32739
18516C22939a25526B70417a10004K8946H5046q273c17890C0495a6939A78885b11665
18504a96102l5749b8493E5356J43012j6137H2369a95451j04132g4039n5281A29313
18492d3647j84081J12130C74735b20371n9318a19285j41885i142B80677j05879
18482A74798a0486k67502a25821A36214L4987Q8337a19628A22360a4902l20018
18472c34920J9930A5826a06490A03228B3631a29562j8385B3144a15803l1140e6090
18460B38951H426b04812e3826a0399F2129c22620a60334A665Q4316j9383i3942
$$ y = [-550626, -1851, -113949, -198367, -91598, 212290, 72227, 177047, 339674, -22308, -139229, 45866, 2908, -164173, -133407, 213625, 188910, 486263, -116220, -173649, 120977, -254474, 132739, 322939, -125526, 270417, -110004, -81058, 85046, 76773, -317890, 30495, -16939, 178885, -211665, -196102, -231851, -28493, 55356, 198368, 182231, 82369, -195451, -299583, -74039, -129320, 129313, -43647, -227728, -115598, 374735, -220371, -279689, -119285, -261170, -9142, 280677, 174798, -10486, -277988, -125821, 136214, 171201, 259538, -119628, 122360, -14902, -334920, -314990, 15826, -106490, 103228, 23631, -129562, -147947, 23144, -115803, -146943, -56090, 238951, 8426, -204812, -53826, -10399, 62129, -322620, -160334, 1665, 85981, 66598, -93942]
18448a04018H6133K08707b66620A66677c40449A75465a65236C9478a53549A34001
18437B61990b0828q1949A82528k9576a86281a9454B36417e26368K31480J00980
18427a93908q60j76499C2892a52524B7181J25790d56563J43235A46321J4835a95020
18415b5940j75489R3148J5800A56954J6532B3588K131J48244P9774j25658g4217
18403A86291f6530m2799j501c9642C7018a79459q9893a17407k827k0735D9831
18391A92145h2232A90735b90888A29940a88667h1826B81041d8581C196a26355
18380e2121k27544J17546J4149j21508h9529A07862e4800J8556j61068j57651
18370c54963B3904g2742A3151K09603m5193a49754A07699h4916A79466F5128k3366
$$ y = [-104018, 86133, 294840, -266620, 166677, -340449, 175465, -165236, 39478, -153549, 134001, 261990, -20828, -102777, 182528, 152952, -186281, -19454, 236417, -526368, -294888, -193908, -194768, -371267, 32892, -152524, 27181, 152971, -456563, -313328, 146321, 161156, -195020, -25940, -201429, -108281, -92481, 156954, 173486, 23588, 25719, 173963, 253737, 128079, -74217, 186291, -66530, -109329, -110830, -39642, 37018, -179459, -269352, -117407, -120234, -140969, 49831, 192145, -82232, 190735, -290888, 129940, -188667, -81826, 281041, -48581, 3196, -126355, -52121, -279665, -162119, -147970, -269478, -89529, 107862, -54800, -36244, -197312, -354963, 23904, -72742, 13151, 222754, 177561, -149754, 107699, -84916, 179466, 65128, 41762]
18359D1762e2198B45098C9056a34244a1460j30283A05028a93958e187r5617j1202
18348a12006j02924g8921A21576h8903B23090E2275b19582J05250A99633k6917
18338A72716b88574d2838n2318j19418a4696E4886a07480D4904a59917C7333J31192
18327A68525E1968a72401A64981p7358a7696I2638a12640A9629J1452J88091J47602
18316C66774I417d13671J1822C68658a27192E3773J95892f8577B31825o2646K28175
18305C97354C4611a82066A82927h4486K1598j07074B61461r4780d5309j23833
18295a69142B74556i8660m5207n2480A93738f0938G5329C6984E92J7733a77200
18283A66595e8465j26839m9281B05351D2661b71900B89754e5245k3682j02841
$$ y = [41762, -52198, 245098, 39056, -134244, -11460, -141743, 105028, -193958, -5187, -100804, -112006, -214930, -78921, 121576, -88903, 223090, 52275, -219582, -114332, 199633, 172716, -288574, -42838, -95156, -214574, -14696, 54886, -107480, 44904, -159917, 37333, 168525, 51968, -172401, 164981, 87623, -17696, 92638, -112640, 19629, 31081, 219172, 366774, 9417, -413671, -401849, 368658, -127192, 53773, 249665, -68577, 231825, 169179, 397354, 34611, -182066, 182927, -84486, -62888, -169962, 261461, 166681, -45309, -169142, 274556, -98660, -143867, -196347, 193738, -60938, 75329, 36984, 592, 18325, -177200, 166595, -58465, -185304, -234585, 205351, 42661, -271900, 289754, -55245, -78927, -181768]
18273a81768A76046F4102a62159J0928B43341G3404a94916e8798k11698A65878
18262b39839f217E980J51916c42076L146a23856A59347E2354g1618q8704N7242
18251a03080d4362j04932c4747j40304B33930H2760K4053b25137J00183j01103
18241b26057i2726B5263P2034J4500b7872A67657h4192a9379k42470B76511b98199
18229A70844M5565P7299C064c0064A4645a95204d8363r1367j06812a16886k40372
18218c57258J23074B25778a47497p1977b1206N603B20507E2851J52584f7201k84856
18207c52057H0635i9380K5607A98004j9506p2718a16443F4274b41577G5856J73551
18196B49407a30992O5228j31954a9852C5303g5522j64052A63454a63663j37784
$$ y = [-181768, 176046, 64102, -162159, -151231, 243341, 73404, -194916, -58798, -270496, 165878, -239839, -6217, 5980, 157896, -342076, -338930, -123856, 159347, 52354, -71618, -160322, -103080, -44362, -149294, -34747, -175051, 233930, 82760, 106813, -225137, -124954, -226057, -92726, 25263, 97297, 111797, -27872, 167657, -84192, -19379, -261849, 276511, -298199, 170844, 216409, 293708, 3064, -30064, 14645, -195204, -48363, -139730, -246542, -116886, -357258, -234184, 225778, -147497, -219474, -21206, -15603, 220507, 52851, 205435, -67201, -352057, 80635, -99380, -73773, 198004, 178498, 105780, -116443, 64274, -241577, 75856, 249407, -130992, -65764, -197718, -19852, 35303, -75522, -239574, 163454, -163663, -301447]
18186c01447a8042j56917g6945j81854J03739A15120N2056a85990f5526B89093
18175b8964m5440q0886A7465a64532A16293m7116l3364J27902a79587E5J32998
18164A33053f9194A75163b33287B05951o3069a43685B37841g7416A50088O3186
18154B13274b72455J06857B23088j08018B1523N06930a83525C91731g6649B18667
18143A90688B2330b38509I3593B4824F89b76514c7726l7304H0869e2024E297a5411
18130c96945M9017J28042C2391f2103k8058A05385g4655b5471I608K48104A8457
18118a90038A68027a90536k32678b1549j09420d2471j47127m5704Q4880e1859
18107A12342a96717L9044A28790J20665C97K62551e0946E4531a85910A79198f1448
$$ y = [-301447, -18042, -174959, -76945, -258799, -155060, 115120, 167176, -185990, -65526, 289093, -28964, -74404, -155290, 17465, -164532, 116293, 69177, 35813, 163715, -179587, 55, 133053, -69194, 175163, -233287, 205951, 142882, -143685, 237841, -77416, 150088, 213274, -272455, -165598, 223088, 115070, 21523, 528453, -183525, 391731, -76649, 218667, 190688, 22330, -238509, 93593, 24824, 689, -276514, -37726, -75030, 80869, -52024, 5297, -15411, -396945, -347928, -219886, 32391, -62103, -90161, 105385, -74655, -25471, 9608, 257712, 18457, -190038, 168027, -190536, -423214, -21549, -130969, -42471, -189598, -235302, -150422, -51859, 112342, -196717, -157673, 128790, 249455, 397, 262948, -50946, 54531, -185910, 179198, -61448]
18095B40569c36213e9058l1605j72445P4437O009k01378c6910E4101a8023q0149
18084i8172A1004g8652B01125q8920A3790P395b38891k33789H1144Q1130C5393
18072i1938o4634G3970b0119j9256B22093c4489B10068F5528K01998a54599f1742
18060b94093A05578p689b10089a9650o3041B38378f5355J5604J9245B75401B5027
18048c61296a32211L5172K8733r2633A9927L7793B5175a65168a6422B39341i2876
18036B13519a73011d3492m34617H2434L4896L302b67140d5106k90791G6993N5599
18025A32592C0662e6511Q90D9233e4367j12297k5231A2462J56776i5690A62383
18013d08682a22332A12583D7136L2944k6307J12495c44359A39793F7215b7242
$$ y = [240569, -336213, -59058, -90663, -263108, -188671, -182662, -384040, -36910, 54101, -18023, -98172, 11004, -78652, 201125, 112205, 13790, 21185, -238891, -472680, 81144, 162274, 35393, -91938, -156572, 73970, -20119, -39375, 222093, -34489, 210068, 65528, 267526, -154599, -61742, -294093, 105578, 97889, -210089, -19650, -82691, 238378, -65355, -49751, -30506, 275401, 25027, -361296, -132211, -97039, -68306, -160939, 19927, 57720, 25175, -165168, -16422, 239341, -92876, 213519, -173011, -43492, -478109, 82434, 117330, 120632, -267140, -45106, -335897, 76993, 132592, 30662, -56511, -55621, 49233, -54367, -166664, -191895, 12462, 169238, -95690, 162383, -408682, -122332, 112583, 47136, 80080, 53773, 166268, -344359, 139793, 67215, -27242]
18002d4724j01918F9135Q6426M4568L7291b54948B02205h4771A14695a65304N4629
17991a10675c1249o0932k19103C9498j5778a57944M2812B07823n0967b54242i7604
17979a27617O991k95250F1045e0884G1121j2122c18057A45093a33478dC1709M8364
17967H0073a22481A62708B2557b07030j0814K0537d9990C87864A8095b77012Q5649
17956a91363b0463A79358q6327b92665J10739F0580K5152C3606d2252A92283A6396
17944a28499B24323c43717a50800A9034a0969q974o1167O679C344f8325k98362
17933c66687J61149H1500L18312a19992q0153A34057a35593I2832A5081f7071
17922i327k77685a06059F3343K80335H0843d4725F2374a77375A0739a7731A14881
$$ y = [-44724, -146642, 69135, 155561, 200129, 237420, -254948, 202205, -84771, 114695, -165304, -110675, -31249, -92181, -311284, 39498, 23720, -157944, -115132, 207823, 156856, -254242, -97604, -127617, -120626, -415876, 61045, -50884, 71121, 58999, -318057, 145093, -133478, -4, 31709, 80073, -122481, 162708, 22557, -207030, -217844, -197307, -49990, 387864, 18095, -277012, -191363, -20463, 179358, 93031, -292665, -181926, 60580, 85732, 33606, -42252, 192283, 16396, -128499, 224323, -343717, -150800, 19034, -10969, -19943, -81110, -74431, 3344, -68325, -366687, -205538, 81500, 399812, -119992, -200145, 134057, -135593, 92832, 15081, -67071, -9327, -287012, -106059, 63343, 343678, 80843, -44725, 62374, -177375, 10739, -17731, 114881]
17910h7541G5116e5957A79375i036A72368F2061c8051A83152a63140B62476b08048
17898B64152B1265M7802Q7986C2489a67109c8427I73c687k83572E3459K10049
17887B63508A10375d08208A13287k656a86234B07572q7617b3175A86936h8884
17876B90598p2353b0417B04450k5157f1514H0521a42230k14502a01201j5763A50239
17864D3006h0318j92069J01474f2902F7901a62048e3551B48541A20329h886k39313
17853b48199A24419J24460b25839A82819G7287J9763J7397f5657B31516a14561
17842h8220j03733C81603j03926H3533C2676a72139C7454a05752k86515J46937
17832b45330p5814a4060k49532O4691D3390M0607i1716B9937b633j0127n999p4689
$$ y = [-87541, 75116, -55957, 179375, -9036, 172368, 62061, -38051, 183152, -163140, 262476, -208048, 264152, 21265, 69067, 157053, 32489, -167109, -38427, 973, -3687, -287259, 53459, 263508, 110375, -408208, 113287, 110631, -186234, 207572, 119955, -23175, 186936, -88884, 290598, 218245, -20417, 204450, 179293, -61514, 80521, -142230, -356732, -101201, -116964, 150239, 43006, -80318, -272387, -170913, -62902, 67901, -162048, -53551, 248541, 120329, -8886, -248199, 124419, 248879, -225839, 182819, 77287, 97050, 114447, -65657, 231516, -114561, -88220, -191953, 381603, 277677, 83533, 32676, -172139, 37454, -105752, -392267, -245330, -321144, -14060, -263592, -198901, 43390, 83997, -91716, 29937, -2633, -12760, -18759, -93448]
17820i3448C1376K76072b6515J875m4868n1157o0491i095j73122H7943b2278q0855
17808a03133k47950d6799A52222J7572b45420A50532K35612O6298E5285M8370
17798A03655G437O0342j5088k2812G39O5823K61450B9461a0103j51912r6247a02401
17785a44109f314l12489B482b28916B6202a24332D7579d2497l0785l43995B691
17773a21846e7984j9570j74897G9260g3735B79731q0287A6501b49568E287i142
17761g8396j3915K0162A23946h3328I5315d2087A10372a12228A17820K59500R2692
17750D70012b51149C2851a5558F4950i6343C29368C5961D94L508J65987a17959
17738B84704C7688b5664r3641A06652j9066i3294B30191G1048a02688B21896E8736
$$ y = [-93448, 31376, 307448, -26515, -24640, -69508, -120665, -181156, -9095, -182217, 87943, -22278, -103133, -351083, -46799, 152222, 169794, -245420, 150532, 386144, 452442, 55285, 103655, 7437, 67779, 52691, 29879, 739, 66562, 328012, 29461, -10103, -162015, -258262, -102401, -144109, -6314, -318803, 2482, -228916, 26202, -124332, 47579, -42497, -73282, -417277, 2691, -121846, -57984, -77554, -252451, 79260, -73735, 279731, 199444, 16501, -249568, 5287, -9142, -78396, -92311, -72149, 123946, -83328, 95315, -42087, 110372, -112228, 117820, 377320, 470012, -251149, 32851, -15558, 64950, -96343, 329368, 35961, 494, 4002, 169989, -117959, 284704, 37688, -25664, -119305, 106652, 87586, -93294, 230191, 71048, -102688, 221896, 58736]
17726a53846J7580C87559J60571a53547P3217j40075P3228A29575k3011b00867
17715a86683F9424c1108E287J69161F8209K2490i9878k62746i9767d5782j23478
17704a69260A2975b90409B03226e5661A23487a9322A83119Q9852a59185c9242
17693C15091G7600b16848h1373A55544c08990B77558p1438b26324e0651J689I2057
17681b32120H3286f2744B89800j16779F0590j396b20028C5826C132P334a22307
17669C0430L26350d94382A21085J34854A03487c8295J0363B78518A22416f4104
17658E9786E906a26091K1934j1841A42627M921i8285k30073p155A71406o312L8058
17646B03152m1789O4372N8467A02442k4869j8181N0533a66382D0866a27627C74849
$$ y = [-153846, -136266, 387559, 548130, -153547, -80330, -220405, -147177, 129575, 106564, -200867, -186683, 69424, -31108, 5287, 174448, 68209, 90699, -99878, -362624, -99767, -45782, -169260, 12975, -290409, 203226, -55661, 123487, -19322, 183119, 272971, -159185, -39242, 315091, 77600, -216848, -81373, 155544, -308990, 277558, 206120, -226324, -50651, -48962, 92057, -232120, 83286, -62744, 289800, 173021, 60590, 59194, -220028, 35826, 3132, 10466, -122307, 30430, 356780, -494382, 121085, 255939, 103487, -38295, -27932, 278518, 122416, -64104, 59786, 5906, -126091, -104157, -115998, 142627, 147548, -98285, -328358, -335513, 171406, 165094, 203152, 161363, 225735, 284202, 102442, 77573, 59392, 109925, -166382, 40866, -127627, 374849]
17634D98055D6188N9435J08890b210j49436O5380p6690B54116b56356A61294F9151
17622C92143f4213D3417b1842n6672b8535m38697E6936K10132d4275A16349J9023
17611A35372c4795B44881j3444b90850B7579J74693h6499C70184c27465D0678
17600a78262B80702o6304a02961A20263a53722C8680R9150f3412A67470o2822
17590A04648b7189G192N9367b2168d39A07208a34893j40936J23745B189J90748
17579A92937b56091F7835L56050D3002J83299D7638b1185B6012J25623c6466A3527
17567H7611E74c35690J9133G3982j9935N7487K89283e8017B43258j13914e4183
17555b10500L7285N2436k28269A80765b44830N0877a5763G0176e9967n1233k8236
$$ y = [498055, 46188, 105623, 214513, -2210, -151646, -86266, -162956, 254116, -256356, 161294, 69151, 392143, -64213, 43417, -21842, -78514, -28535, -467232, 56936, 267068, -44275, 116349, 135372, -34795, 244881, 231437, -290850, 27579, 202272, -86499, 370184, -327465, 40678, -178262, 280702, 214398, -102961, 120263, -153722, 38680, 137830, -63412, 167470, 104648, -27189, 7192, 66559, -22168, -439, 107208, -134893, -275829, -152084, 2189, 192937, -256091, 67835, 423885, 43002, 226301, 47638, -21185, 26012, 151635, -36466, 13527, 87611, 574, -335690, -316557, 73982, 54047, 111534, 400817, -58017, 243258, 129344, -54183, -210500, -173215, -120779, -349048, 180765, -244830, -193953, -15763, 70176, -59967, -111200, -139436]
17544a39436A88403b09084D9872N9659k9507a3493A64600b07364G1738K9238J22266
17533B23242b56965b5283B72361A22801m4239M8782o725J75321I7884R888M5501
17522A53273a33208N6797A70289a9788k117A78368m1191c00061B44318a3349A0876
17510d1815D2806L4508K63255J03246a60550B26416b5409n1915I8666F715a45089
17498B96662j28186b49612P3617I8753b146D13919j14090I8844D7463K07287g3604
17486A28339J71857h3309C15184l0536J10685H678K91641n9796k5876Q2805l6885
17475B60567J11611a2332A59956m7713M47041B19567F1539O8293J21857k4244
17465B27445D1225A3439J7017J6406a23599E214c01811E8357K72837n4273j04348
$$ y = [-139436, 188403, -209084, 49872, 109531, 80024, -13493, 164600, -207364, 71738, 100976, 223242, -256965, -25283, 272361, 122801, 78562, 127344, 120619, 295940, 97884, 107772, 153273, -133208, -76411, 170289, -19788, -21905, 178368, 137177, -300061, 244318, -13349, 10876, -41815, 42806, 77314, 340569, 443815, -160550, 226416, -25409, -77324, 98666, 6715, -145089, 296662, 168476, -249612, -175995, 98753, -2146, 413919, 299829, 98844, 47463, 254750, -73604, 128339, 300196, -83309, 315184, 284648, 395333, 8678, 300319, 240523, 214647, 297452, 260567, 372178, -12332, 159956, 112243, 559284, 219567, 61539, 129832, 251689, 227445, 41225, 13439, 30456, 46862, -123599, 5214, -301811, 58357, 331194, 276921, 172573]
17454A72573c1489H04174C64970j35898n136R4650P6059k8667j4683L68104C21216
17442B1284K11228o0980a69971L1231A30775n6525L14505A41149g9597B26395
17431C22657j54794R382K80074A96117e9204B17923K06643J93058B87943A29384
17420A67809J01521C9315J72885K98246k47050A06850K45946M5154E1205P1521
17410A22726L00930A55551P9937J06588b33921B5534J42464o4402K7961J93613
17400C25170j60929a02680B36282E9234N0965P7688f0182H8000G29J64323b4542
17388C34702r0250K13264B20487o1117O1700m4886a652j45811i152B31431l7021
17377A94410J19639D7706d8707A59083F4651L76350r3543f3464A3966K95675O4188
$$ y = [172573, -31489, 804174, 364970, 229072, 223936, 318586, 394645, 365978, 351295, 719399, 321216, 21284, 232512, 171532, -169971, -138740, 130775, 74250, 388755, 141149, -79597, 226395, 322657, 167863, 177245, 457319, 196117, -59204, 217923, 424566, 617624, 287943, 129384, 167809, 269330, 39315, 212200, 510446, 263396, 106850, 352796, 397950, 51205, 122726, 423656, 155551, 235488, 342076, -233921, 25534, 167998, 103596, 131557, 325170, 164241, -102680, 236282, 59234, 110199, 187887, -60182, 88000, 729, 165052, -24542, 334702, 244452, 457716, 220487, 159370, 221070, 176184, -1652, -147463, -9152, 231431, 194410, 314049, 47706, -48707, 159083, 64651, 441001, 347458, -63464, 13966, 309641, 373829]
17366C73829A13648L0420o2576d4007A92344R1014j15257p1832a36140B59888
17355E1986F56O102L18959j62019b04763E4540j8456h916D6990J15063J38207
17344C00260a23937A11899R1384l3610N5709B4463K7490L39713j93286c5415A24974
17332A77753L77444A54478L41981g6402K6271j53952C46079F4030a06575B29861
17321D10994j92688C4529K54341K26518C5638K2580J81238F0610J93770a23302
17310F7583B8510b4058j4930D40014f3333B27098H7715P5782A0020Q0751N5557
17299A46328a892E89957E0896J9923a20154A32883J35486O4786C5208o765K35376
17288B63819J2144J80780j99102p8806B908L75506j56665L17202h6756B84597
$$ y = [373829, 113648, 144068, 81492, -44007, 192344, 283358, 168101, 96269, -136140, 259888, 51986, 656, 6758, 325717, 163698, -204763, 54540, 36084, -8916, 46990, 162053, 300260, -123937, 111899, 203283, 169673, 225382, 24463, 51953, 391666, 198380, -35415, 124974, 177753, 555197, 154478, 496459, -76402, -50131, -204083, 346079, 64030, -106575, 229861, 410994, 218306, 34529, 288870, 515388, 35638, 58218, 239456, 60610, 254380, -123302, 67583, 28510, -24058, -38988, 440014, -63333, 227098, 87715, 163497, 10020, 90771, 146328, -1892, 589957, 50896, 70819, -120154, 132883, 268369, 333155, 35208, 28443, 263819, 275963, 456743, 257641, 178835, 2908, 378414, 221749, 538951, -86756, 284597]
17277B10030b6754A89940J13895K4154n0259M2658n7578m4077J66062j0212b7260
17265B54504j06978K3577L02938k20835r3519g1893C98985j30469k8211e2482
17254a06706A23627J11034m6956f26A24527L39084j61261H4534b93041A05714
17243D55624F5387K86291j08306J15115o1489A32108Q1482K62602d3194B77168
17232A32277J60095M7373P3586J02542c8823C58255A40237b2824B21761O4719
17222B86480b7292B31532A815J30644J02549N1331L3481r5819g6612A33934M7090
17211A81024J27576P2193A42925K51795k5546C7940L49413j00535j14867J64546
17201C36497J86312p0686A49171J17301L14853B27864l5205o0106B3321G258N5148
$$ y = [210030, -26754, 189940, 303835, 327989, 277730, 320388, 262810, 218733, 384795, 374583, -27260, 254504, 147526, 171103, 474041, 253206, 159687, -71893, 398985, 268516, 240305, -52482, -106706, 123627, 234661, 187705, -626, 124527, 463611, 302350, 84534, -293041, 105714, 455624, 65387, 351678, 243372, 358487, 296998, 132108, 213590, 476192, -43194, 277168, 132277, 292372, 339745, 413331, 515873, -38823, 358255, 140237, -22824, 221761, 286480, -27292, 231532, 1815, 132459, 235008, 286339, 319820, 224001, -76612, 133934, 181024, 308600, 380793, 142925, 394720, 369174, 37940, 387353, 286818, 171951, 336497, 522809, 452123, 149171, 266472, 581325, 227864, 192659, 132553, 23321, 7258, 62406]
17190F2406J11362K62031j54730K56655k41110j0320F5343J59924G9095L42023
17180D21118J10205k65566D8997R8775J88801r3158k7548M70403A2510L16900
17170C29410I5869L7009C334L82471j66547g6383C111N01671r0165b9982C98845
17158B29137K39740q0616Q0637l0467A78930K28223J2328A77378B6001R9887N31971
17147F57859k31122A64203J52057p0907A19386M27827b1735C82269J49739B22720
17136C35653o4611o7303N1488L33517o0158m6738Q2317B46401J97251j35449k9376
17125B78827j5222K00284J1084A90805E7766L55483L14994B22907L30470k46537
17115C06840J58266K03707k04844j63881N7401r8921K87821j24944J51695B46586
$$ y = [62406, 173768, 435799, 281069, 537724, 296614, 286294, 65343, 225267, 79095, 421118, 531323, 265757, 48997, 147772, 336573, 243415, 215867, 686270, 12510, 329410, 95869, 132878, 3334, 385805, 219258, -76383, 3111, 504782, 414617, -29982, 398845, 229137, 468877, 388261, 468898, 438431, 178930, 407153, 419481, 177378, 26001, 125888, 657859, 426737, 164203, 316260, 245353, 119386, 547213, -21735, 382269, 532008, 222720, 335653, 271042, 203739, 255227, 588744, 528586, 481848, 564165, 246401, 443652, 308203, 278827, 263605, 463889, 474973, 190805, 57766, 413249, 728243, 222907, 553377, 306840, 465106, 668813, 463969, 300088, 357489, 258568, 546389, 421445, 573140, 246586]
17104A39750L32100J22524o31B88948q1159J44578K98063B45442n919L9027Q01554
17093A080104D67948J10036B72043N24385l18900j37818J86129A75459K53718
17084D29177J88688o1717j70059k7290J73108N0340k63419O555L17838k81856
17074C61365K33738J33140j09633B74646L982L8415J28895K78415C05715Q5431
17064C91146l2974L821J94084j21111l4118P3504j85829L4847A55056L79897k54604
17053B80349J99742K17569C21559A05916K80809J04790o0180K1025M9117j4710
17043D86767r9596N6997k9231L05213j7446K11783l10112N2486k11545K78301
17033G23617l20061Q6349L90921B11050N05927j56908N4927j9358A75934K55212
$$ y = [139750, 471850, 594374, 593743, 288948, 207789, 352367, 650430, 245442, 239523, 278550, 1080104, 467948, 577984, 272043, 796428, 477528, 339710, 525839, 175459, 429177, 617865, 556148, 386089, 358799, 531907, 582247, 318828, 325383, 643221, 361365, 595103, 728243, 618610, 274646, 278628, 317043, 445938, 724353, 305715, 391146, 358172, 361993, 556077, 434966, 400848, 474352, 288523, 323370, 155056, 534953, 280349, 480091, 697660, 321559, 105916, 386725, 491515, 431335, 452360, 501477, 486767, 387171, 444168, 414937, 720150, 702704, 914487, 604375, 656861, 445316, 723617, 403556, 489905, 880826, 211050, 716977, 560069, 614996, 595638, 175934, 431146]
17023D31146J44917k17050L76148J03677k43615M5062J15570l27894j04825M46629
17013G69765j58000M57282k06277k51691p9996k5556K17844k72173J46962j77568
17003D20592M62792J07526D63648L35701k11740j02736L65473K7545q7204L92016
16993A182703E14448M70901k12607m6480L11057k46824M6115J67100j33407K81985
16983A152288j14904m85754L36818O9477l99322J23141M15128j87799L3490L0551
16973I73114j80534J95820k3283p3921j40135J99785o0570K7393q1347m0933q5092
16962G10297M95159k09721Q4879L5331K76722o51442M51825j58575k85547M64791
16952A213719M256j50815J62398j83768Q0221n4161J42234J85126k78634P2896
$$ y = [431146, 576063, 359013, 735161, 838838, 595223, 640285, 755855, 427961, 323136, 769765, 611765, 1069047, 862770, 611079, 531083, 505527, 723371, 451198, 598160, 420592, 883384, 990910, 463648, 799349, 587609, 484873, 850346, 877891, 790687, 1182703, 514448, 985349, 772742, 726262, 1037319, 790495, 836610, 1003710, 870303, 1152288, 1037384, 551630, 888448, 957925, 558603, 681744, 1096872, 909073, 942563, 973114, 792580, 988400, 965117, 891196, 751061, 950846, 890276, 917669, 836322, 795389, 710297, 1205456, 995735, 1080614, 1115945, 1392667, 741225, 1193050, 1034475, 748928, 1213719, 1217975, 1067160, 1229558, 1045790, 1126011, 1071850, 1214084, 1399210, 1120576, 1193472]
16942A193472k57257N18326k46841N0617j76874P9266P1662o2953M36505m73400
16932A132523J63650J34588j45716J22117n88772M09600J84463j56779J16424
16923A372098j02911L06140o2454K1251k51278L40821L39475o00015n4996M38446
16913A746577m46345O16940j75085K98482j72340k65891k12295J32932J22856
16904A645831L24019k39826N9848q3713N3589j99593J12779M7930o1668L46087
16894B005283J34883m58675Q8411L9670Q8804M5381J55438k25084J61654k00312
16884A835453K45977J63511J50986M7542j42799p2830k8428K57548M8233n2863
16874B452330k54714n2532k6186M63348M9670j67253k73303O73528l05226M9877
$$ y = [1193472, 936215, 1454541, 1207700, 1258317, 1081443, 1160709, 1232371, 1169418, 1605923, 1132523, 1296173, 1430761, 1285045, 1407162, 818390, 1227990, 1412453, 1255674, 1372098, 1269187, 1575327, 1512873, 1534124, 1282846, 1623667, 1963142, 1363127, 1308131, 1746577, 1300232, 1917172, 1742087, 2040569, 1868229, 1602338, 1390043, 1522975, 1645831, 1969850, 1730024, 1789872, 1706159, 1759748, 1560155, 1672934, 1720864, 1659196, 2005283, 2140166, 1681491, 1769902, 1809572, 1898376, 1943757, 2099195, 1874111, 2035765, 1835453, 2081430, 2244941, 2395927, 2443469, 2300670, 2227840, 2199412, 2456960, 2505193, 2452330, 2197616, 2145084, 2118898, 2582246, 2631916, 2464663, 2191360, 2864888, 2559662, 2609539]
16864B609539P7574M98551l56215P3227j79688k5025K64837k11048L18221L17842
16854C387815m68074J45124n5313J47843J14737Q853l7073N4664N9048L24714
16844C682338k42748K34110K5050k18563L98467k8536J06698k7050J45778L5951
16834D111495j65248M08126r9195K21245M67659j11631l02386L47894M18833k79087
16824E017705L12774P4911J40340r8868L61747M0432l40253M95702j37111M12549
16814F279928K09413k37001M19265r9695K18241P7722K71452J83641J69093J71861
16804G663920R2746M4378J09043O49311p3118K56799K17213K32180K39105L69991
16794I801568j22375M01535J22078M73453K46023J49648L32226L5226P36461P755
$$ y = [2609539, 2687113, 3185664, 2829449, 2902676, 2722988, 2697963, 2962800, 2751752, 3069973, 3387815, 2919741, 3064865, 3009552, 3157395, 3272132, 3280985, 3243912, 3298576, 3357624, 3682338, 3439590, 3673700, 3698750, 3480187, 3878654, 3850118, 3956816, 3929766, 4075544, 4111495, 3946247, 4354373, 4255178, 4476423, 4944082, 4832451, 4530065, 4877959, 5296792, 5017705, 5330479, 5405390, 5545730, 5446862, 5808609, 5849041, 5508788, 6004490, 5867379, 6279928, 6489341, 6252340, 6671605, 6571910, 6790151, 6867873, 7139325, 7322966, 7492059, 7663920, 7756666, 7801044, 7910087, 8559398, 8486280, 8743079, 8960292, 9192472, 9431577, 9801568, 9679193, 10080728, 10202806, 10676259, 10922282, 11071930, 11404156, 11439382, 12175843, 12183598]
16784A2183598L72382K58514L98095L80111O27371R130M55686N04067P60211K48924
16774A6198089O94122N46417K56377Q86121M67709R87249N75993L54998J036243
16765B2003318N40819R16810Q59285J040503Q68003P83859J647673P16036J523480
16756C0899786Q77073J555728J180797K025919J398638J612392K054163J845164
16748D3449660K250940K035945K323783K845730K452851K945490L144512L465136
16740F4914047L409507L677944M157524M681682M353495N257836N208168N626351
16732A01286554O473563O213522O323547P395371P460513P283503P658066P979850
16724A58074489P403272P794662P215067O057213O185718M598784L920609K464619
$$ y = [12183598, 12555980, 12814494, 13212589, 13592700, 14220071, 14229201, 14684887, 15188954, 15949165, 16198089, 16892211, 17438628, 17695005, 18581126, 19048835, 20036084, 20612077, 20967075, 22003318, 22544137, 23460947, 24320232, 25360735, 26228738, 27012597, 28660270, 29376306, 30899786, 31776859, 33332587, 34513384, 36539303, 37937941, 39550333, 41604496, 43449660, 45700600, 47736545, 50060328, 52906058, 55358909, 58304399, 61448911, 64914047, 68323554, 72001498, 76159022, 80840704, 85194199, 90452035, 95660203, 101286554, 107760117, 113973639, 120297186, 127692557, 135153070, 142436573, 150094639, 158074489, 165477761, 173272423, 180487490, 186544703, 192730421, 197329205, 201249814, 203714433]
16716B03714433R92855m84304j373831l229727m735349n203303o334858p074553
16708A76271363p797794p867176q160959q235162p828383p937011p591600o637907
16700A14215371p177250o424096n686138n967227n421734m922592m621385m087403
16692F9907546m172013l659916l441644l418568k402594l292735k396495k347103
16684D4776478k055232k246335k032873j867856j692404j420320j413454j883165
16676C0164839j097803j103855j333549q85151j149891j006640j285171p14454
16668B1588325p71365o78980q02690r33697L5905j005469p41907o07360k85102
16659A5797660r64554k57525o43057m12597l37653q08963K14371m87656k43366
$$ y = [203714433, 204707288, 204222984, 202849153, 199619426, 194884077, 189680774, 183345916, 176271363, 168473569, 160606393, 152445434, 144210272, 136381889, 128444878, 120853278, 114215371, 107038121, 100614025, 94927887, 88960660, 83538926, 78616334, 73994949, 69907546, 65735533, 62075617, 58633973, 55215405, 52812811, 49520076, 47123581, 44776478, 42721246, 40474911, 38442038, 36574182, 34881778, 33461458, 32048004, 30164839, 29067036, 27963181, 26629632, 25744481, 24594590, 23587950, 22302779, 21588325, 20816960, 20137980, 19335290, 18401593, 18437498, 17432029, 16690122, 16082762, 15797660, 14833106, 14575581, 13932524, 13519927, 13182274, 12373311, 12587682, 12100026, 11856660]
16650A1856660m87755m02613n1210l59531p42826R3053p02485R5208l39279l98746
16640H560476P6455j24237j54780k51151j52045k18434k41524o33124p6865m7965
16630F736806n123n25286j09747l8281j1354j47666k0826q4667l99788L16272
16620E710340l51573l2334l61258n3496l8259L9660M6336m50668Q2367k70274
16610D320841J1381J021r0470k17958K29051l42766R7361n0035l2645m10930J99579
16599C714430l1656j79219p218k5509l46271N21406j08272j12325j79659l72691
16589B873016J3131J09194k14547m7702J29100q6318J19156j33165J66875l54854
16579B573886K10442m10388J35558j77088j20740L49090l39738l3689l3979L95435
$$ y = [11856660, 11368905, 10966292, 10915082, 10555551, 9812725, 9905778, 9203293, 9298501, 8959222, 8560476, 8636931, 8512694, 8357914, 8106763, 7954718, 7736284, 7494760, 6861636, 6784771, 6736806, 6731683, 6206397, 6096650, 6058369, 6047015, 5899349, 5878523, 5793856, 5394068, 5710340, 5358767, 5326433, 4965175, 4911679, 4873420, 4913080, 4959416, 4508748, 4591115, 4320841, 4332222, 4333243, 4242773, 4024815, 4253866, 3911100, 4008461, 3958426, 3925781, 3514851, 3714430, 3682774, 3503555, 3496337, 3470828, 3124557, 3645963, 3537691, 3425366, 3245707, 2873016, 2886147, 2995341, 2780794, 2733092, 2862192, 2775874, 2895030, 2761865, 2928740, 2573886, 2784328, 2373940, 2509498, 2332410, 2211670, 2560760, 2221022, 2187333, 2153354, 2548789]
16569B548789m07749J37250J31620m34069J47170J72292n55711L25413l69018
16560A695987K82931n4748m4685j12559k33682K77249r0541j12829m8199p6770
16550A482154k39311M46483k91357J97231l7737l15016M14731j72462Q6205K07101
16540A778022l57311N13014o31913J38780J24503l11686J38231K76644j03474
16531A564810m01670n1430K69449K40792o31633J34188K7068K45609K0340j05716
16521A311807j66123r4857P8305L3355k81335J11065K44720N041k8413j26589
16511A086976N6840l36453O5034L27525k42009J6763q013k50519L09832J58044
16501A184020o4640l80864K70304N8406k09393M8131j31138K04150J8180j72232
$$ y = [2548789, 2141040, 2278290, 2409910, 1975841, 2123011, 2295303, 1739592, 2065005, 1695987, 1978918, 1924170, 1879485, 1766926, 1533244, 1810493, 1719952, 1607123, 1558924, 1482154, 1242843, 1689326, 1397969, 1595200, 1557463, 1242447, 1657178, 1484716, 1570921, 1778022, 1420711, 1933725, 1301812, 1440592, 1565095, 1253409, 1391640, 1668284, 1564810, 1163140, 1111710, 1381159, 1621951, 990318, 1124506, 1151574, 1397183, 1417523, 1311807, 1145684, 1050827, 1129132, 1162487, 881152, 992217, 1236937, 1241978, 1213565, 1086976, 1143816, 807363, 872397, 1199922, 957913, 974676, 966663, 716144, 1025976, 1184020, 1119380, 738516, 1008820, 1067226, 857833, 905964, 774826, 978976, 997156, 824924]
16491H24924C64931N41209j74939j67501L89096J88544m5274j9353q5144k93490
16481F98079n7246K1269K46214l45624Q1605j21826L04416l76002J10687J39280
16471G00852j31359p3059K41703j42861O4771J74258k88422J45938K48659l04997
16461F35483L25399o6141j23288P346J04949l33814j57139K99567M4997C35291
16450F62362k39167M58546m25582J28070K2589K88730l21297B64114K62446K4724
16440E51284m4073j36832L07642k21542A39571K91131L16739B93543M32558p8833
16430F47268k37818K00533j64658J99250l8434n1042k39027j7089O2702J21213
16420D82898o2590J86307k23972L24138k31481J63316k81938K31079B06008L19205
$$ y = [824924, 364931, 906140, 731201, 563700, 952796, 1141340, 1096066, 1076713, 991569, 698079, 640833, 662102, 908316, 562692, 644297, 522471, 826887, 450885, 561572, 700852, 569493, 496434, 738137, 595276, 660047, 834305, 545883, 691821, 940480, 635483, 960882, 894741, 771453, 778799, 883748, 549934, 392795, 692362, 737359, 335291, 662362, 423195, 881741, 456159, 584229, 606818, 895548, 574251, 264114, 526560, 551284, 507211, 370379, 678021, 456479, 139571, 430702, 747441, 293543, 726101, 647268, 409450, 609983, 445325, 644575, 606141, 555099, 316072, 298983, 361685, 482898, 420308, 606615, 382643, 706781, 475300, 638616, 356678, 587757, 206008, 525213]
16410E25213k11847q0296K14520P3820k12118L74435C30632K65002A81570O459
16400A88029Q020J02049J67743m3592Q9768j53475M5956J50472k03510L4526j00248
16389B85738J50862J09866j11336k0754L757B05131J25494L11705j20013j81667
16379C40650A54337J39149Q2208k008J35561o973n4593j94086c5251C83525j15659
16368B67866b0351A95513l0530p6065K42117c9205C81373O1730E3445J15510k1045
16357A47910P27409I8078R1047k031J7640N8236K0535A12592K37296Q9090I9177
16345C32172A34760J47788j33610K34455j52584r8497N52914B87629O7681l0148
16335C25162j61224G4110M7540K00340A46255J95709j17203P4909m9723e9269
$$ y = [525213, 313366, 233070, 447590, 521410, 309292, 683727, 330632, 595634, 181570, 188029, 196049, 298098, 465841, 422249, 512017, 358542, 404498, 554970, 351460, 385986, 285738, 436600, 546466, 435130, 414376, 418133, 205131, 330625, 642330, 522317, 340650, 154337, 293486, 375694, 373686, 509247, 502274, 447681, 253595, -35251, 383525, 267866, -20351, 195513, 164983, 88918, 331035, -39205, 381373, 443103, 53445, 168955, 147910, 875319, 98078, 189125, 187094, 204734, 262970, 283505, 112592, 349888, 438978, 99177, 332172, 134760, 282548, 148938, 383393, 230809, 132312, 685226, 287629, 355310, 325162, 163938, 74110, 121650, 321990, 146255, 341964, 224761, 299670, 249947, -59269]
16324e9221j5105A1237K09591a1308E75043H0245J6772K79258j09643Q949f4364
16312C4995O4752J96928G278j961M90858C3260K00276E5023c9786D01061F6061
16300D58138j05093H1808N4521j5993C757J28557a93248A78288n0653o1612c7005
16288A38345b9152B98527Q638j40691l5610b63909A85693l6440k002K3381o9873
16277A00759K4869K84827J10551k47085a37646B93703b66420C56377k0533c0554
16266B60510F6731M06173H3578l2972O8474i9258B8762a4241B9148J60091B6674
16254D0022L6048J69796O0819j26512O5151K89001i4828L1913E9119J7222l3920
16243D2421L92278f4817A94027b74821d1331B57622q3310M5338b68407H6638J1006
$$ y = [-59221, -74326, 11237, 220828, -11308, 575043, 80245, 97017, 376275, 266632, 275581, -64364, 34995, 99747, 296675, 7278, 5317, 496175, 33260, 233536, 55023, -39786, 401061, 66061, 458138, 353045, 81808, 136329, 120336, 3757, 132314, -193248, 178288, 127635, 66023, -37005, 138345, -29152, 298527, 307165, 166474, 130864, -263909, 185693, 149253, 147251, 170632, 100759, 125628, 410455, 521006, 273921, -137646, 293703, -266420, 356377, 335844, -30554, 260510, 66731, 472904, 83578, 50606, 119080, -99258, 28762, -14241, 29148, 189239, 26674, 40022, 76070, 245866, 306685, 180173, 245324, 534325, -94828, -62915, 59119, 76341, 42421, 434699, -64817, 194027, -274821, -41331, 257622, 174312, 219650, -268407, 86638, 97644]
16232I7644j2009d8722p3333A69743E4867a37062F5061a93562a5309A99087r0725
16221A08362J04515j02281a48803A8673K14657p5262d4137A49074B0005N57494
16211E77499A18852a11585A37425a83592C46852A00144O0775a10451N1434a4465
16200f5971K6038j28247h2392R942F4280L57980A63101J4810q5710k0822Q0976
16189A52355m8753d4120A43539d7313A86380a81378L6644B54679I6014L6963i016
16177a21844r6697A07106J50296D3856a7500D51998e521j04908n8552c1945j88543
16166b20488A22991L5606a62260D01340a27509m3071g5439I8727M8390F4739a14208
16154H686a13318j15022B21790n0584A3027b98683A87045R594q3453a14947J235
$$ y = [97644, 85635, -48722, -122055, 169743, 54867, -137062, 65061, -193562, -15309, 199087, 108362, 212877, 110596, -148803, 18673, 233330, 158068, -44137, 149074, 20005, 577499, 118852, -111585, 137425, -183592, 346852, 100144, 160919, -110451, -59017, -14465, -65971, -39933, -168180, -82392, -72450, 64280, 422260, 163101, 177911, 92201, 71379, 152355, 103602, -44120, 143539, -47313, 186380, -181378, -144734, 254679, 96014, 132977, -9016, -121844, -218541, 107106, 257402, 43856, -17500, 451998, -5521, -110429, -168981, -31945, -220488, 122991, 158597, -162260, 401340, -127509, -170580, -75439, 98727, 147117, 64739, -114208, 8686, -113318, -228340, 221790, 171206, 13027, -298683, 187045, 196639, 113186, -114947, -113712]
16143a13712F4417L146l0916g1992K3500k83270E3107K2736J0909B4803e1052
16131a98382G2326i4163Q621G3941K7058e262k8686A51663a94413P7550D05792
16119f8280A85786I0446b6651A00541a18864B0560c08190g854A10218P8758d06002
16107H0497N2038C1469a89575L8520A66628b4989A05162J42540b68131A29629
16096a3993F1809J11777d7408m4555k6322j99030G2234a23683b2048f647E2794
16084a03064A51546b2612C5581a1933k80711A32031c06989E5970J76547f1334
16073a80180A34695a28737C82001d99175a64670j7224f421C95000f2294I9623
16062E8861a95716a4092r235j62760C49219a49743j16967G9626c71700M6393E53795
$$ y = [-113712, 64417, 67563, 36647, -71992, -48492, -331762, 53107, 75843, 86752, 24803, -51052, -198382, 72326, -94163, -85542, 73941, 100999, -5262, -33948, 151663, -194413, -116863, 405792, -68280, 185786, 90446, -26651, 100541, -118864, 20560, -308190, -7854, 110218, 188976, -406002, 80497, 132535, 31469, -189575, -151055, 166628, -24989, 105162, 247702, -268131, 129629, -13993, 61809, 173586, -47408, -91963, -118285, -317315, 72234, -123683, -22048, -6647, 52794, -103064, 151546, -22612, 35581, -11933, -292644, 132031, -306989, 55970, 232517, -61334, -180180, 134695, -128737, 382001, -499175, -164670, -181894, -6421, 395000, -62294, 99623, 58861, -195716, -14092, -23327, -186087, 349219, -149743, -266710, 79626, -371700, -325307, 553795]
16050B55842b65992c8139r6514B50927J57950f1283j35838C7220K78639E9481
16039E31595B22010A6356a35861B2888J26011B9637r363j770a44320l6018l8558
16028b18896E8875D292K61118b59383J05715A49751J29132C7544b29103C9760
16017g6180B66078N3629b8051j00963b6771j6079k52535J45323F2924a79215B07967
16005a20411p8417h7803F1803L2634J8974J44179a08961j49094J18947e0390j37542
15994a87932M3468j25303a1755n4402A48942a18320a5751j42483e650j46301A83092
15982B57777L4562A01040L00895q2077a14729B1775J58376c16951a0949G873Q194
15971A6067N996L1686b08960B2004c947j85401N0049N9444G168a37515F2694C0198
$$ y = [255842, -265992, -38139, -134653, 250927, 408877, -61283, -197121, 37220, 315859, 59481, 531595, 222010, 16356, -135861, 22888, 148899, 29637, 20274, 18504, -144320, -180338, -218896, 58875, 4292, 265410, -259383, -153668, 149751, 278883, 37544, -229103, 39760, -76180, 266078, 319707, -28051, -129014, -26771, -42850, -295385, -150062, 62924, -179215, 207967, -120411, -198828, -87803, 61803, 94437, 113411, 257590, -108961, -258055, -139108, -50390, -187932, -144464, -269767, -11755, -66157, 148942, -118320, -15751, -158234, -5650, -151951, 183092, 257777, 292339, 101040, 401935, 319858, -114729, 21775, 180151, -316951, -10949, 7873, 16067, 22063, 53749, -208960, 22004, -3947, -189348, -139299, -79855, 7168, -137515, 62694, 30198]
15958A83584G7853G516A908L39611a674j8950G701g7751k44310a02094G4895C7158
15945g1952k65993H3781B6829c82087A31103A3255h9149k7372B5489b901A04885
15933a89605L7359k2644O4057A20401D7069c2217A15865J17421b54464J8038O5187
15922a71239j03475B31505c5172k19994A23384k8830J13458a77442Q3319L289
15912i0834j0227I3879P6667b81284B30404f2386j34077A13110B4473P0784d1170
15900h7015c7869B62006j06858K4830H4737a96914A52643c50171C2905a9786r3345
15889a13131A5354a09967M296A36417c6240C25524a25663k5080E55873a31782
15878f995A14291n1105P8883c30976J55098j19445J43658I9305a15187K9429D3200
$$ y = [183584, 77853, 7516, 1908, 341519, -1674, -20624, 7701, -77751, -322061, -102094, 74895, 37158, -71952, -337945, 83781, 26829, -382087, 131103, 13255, -89149, -116521, 25489, -2901, 104885, -189605, -152246, -174890, -110833, 120401, 47069, -32217, 115865, 233286, -254464, -236426, -171239, -274714, 231505, -35172, -255166, 123384, 94554, 208012, -177442, -94123, -90834, -101061, 93879, 170546, -281284, 230404, -62386, -196463, 113110, 24473, 95257, -41170, -87015, -37869, 262006, 155148, 179978, 84737, -196914, 152643, -350171, 32905, -19786, -113131, 15354, -109967, -105671, 136417, -36240, 325524, -125663, -150743, 555873, -131782, -6995, 114291, 63186, 142069, -330976, -175878, -295323, -151665, 99305, -115187, -85758, 43200]
15866A88064N2234c51111B21717a65945a0958k94786b284p869o9186C0259i8912
15854A00236e910A77026B7337i9577j20236A04722m2538b44798a03022k02902
15844c05924J31693D8874a79654d7124c984B51156D3485f159n1945l7182a2822
15832B19717a50190m8553i7362k472J0926D2599O5778a22467k32217D9089a62874
15820a46064A44097k3806J19338b6019j14282k3949A60094a31491f576j54261
15810a60837D0946c52224J56404A076a08898A08876g1522A22283a12980k5682
15800a38662i445I3833a36950j0469e7210C2971o461a61502D92882a45294A88960
15788a16964d1011C1692e3416C95686f0127A95147d5793G6065p381c48236D435
$$ y = [188064, 240298, -351111, 221717, -165945, -10958, -305744, -2284, -10153, -79339, 30259, -98912, 100236, -5910, 177026, 27337, -99577, -219813, 104722, 62184, -244798, -103022, -305924, -174231, 48874, -179654, -47124, -3984, 251156, 43485, -6159, -58104, -95286, -12822, 219717, -150190, -198743, -97362, -99834, -88908, 42599, 108377, -122467, -354684, 49089, -162874, -146064, 144097, 120291, 239629, -26019, -140301, -164250, 160094, -131491, -6576, -160837, 40946, -352224, -195820, 1076, -108898, 108876, -71522, 122283, -112980, -138662, -9445, 93833, -136950, -147419, -57210, 32971, 26510, -161502, 492882, -145294, 188960, -116964, -41011, 31692, -53416, 395686, -60127, 195147, -45793, 76065, 68684, -348236, 4435]
15776B6003e564C9373a87084A59030f232A28139c86972d4989K061A60575n1263
15765A09312a9821l39434J69772I8362a09412K8164A27513C4973F151J84291E2995
15753A64720J50838c32216a14109A57345l3373J10926o9027h7911L6690B63515
15742B5267h0256A01947N4316L0572a16451l1092l6491m616j20554k4630B87579
15730B33547r4635b60284D0130b66478N4988j6014m5174J05312N6024o0061A7987
15718D50083D3215J81446B5934a22306a0697j6904D8774J93479i0350e085j15065
15707a20150A02143B5150J27155o4994j2812J34628i6328j35724K2564g9900K7786
15696e2114C54194a8798n6468e285A45332D8963c5812j77342O5628o975B33775
$$ y = [26003, -5564, 39373, -187084, 159030, -6232, 128139, -386972, -44989, -42928, 160575, 109312, -19821, -359255, -189483, 98362, -109412, -81248, 127513, 34973, 6151, 190442, 52995, 164720, 315558, -332216, -114109, 157345, 123972, 234898, 165871, -87911, -51221, 263515, 25267, -80256, 101947, 156263, 186835, -116451, -147543, -184034, -188650, -309204, -333834, 287579, 233547, 138912, -260284, 40130, -266478, -211490, -227504, -272678, -167366, -111342, -171403, 17987, 450083, 43215, 224661, 25934, -122306, -10697, -27601, 48774, 242253, -90350, -5085, -120150, 102143, 25150, 152305, 87311, 74499, 209127, -96328, -232052, -209488, -79900, -52114, 354194, -18798, -75266, -5285, 145332, 48963, -35812, -213154, -147526, -154501, 233775]
15684b21053f498D863K37946f8598j11982L5625A9847g1954j60804b1589A20831
15672D13486j88468i5810A41697g259A32101b05064a4334m40968f929l9253N561
15661d0621J5937j97748L160j84169a95474f3172l23402d3460l8372n972m2104
15650a29908e4138A22964B3439J56761b3083o6471c5483F9032e6317q3017E17
15638d3585M371A06261K29277d684n8468C2751R716g8734m0015R198j37371a03096
15625A40436b43961H9196P2784J71839A8060J44181L46459b13401N8901A91281
15614A74192a78249a3335n7059A69638F7169Q3287a72164I8069P1183N8348I8002
15602b5022j98987A31678c04098g4827G7291a82534I1043P2120c05578A75593
$$ y = [-221053, -6498, 4863, 242809, -68598, -180580, -144955, 19847, -71954, -232758, -21589, 120831, 413486, 225018, -95810, 141697, -7259, 132101, -205064, -14334, -455302, -6929, -46182, -40621, -24684, -222432, -219272, -403441, -195474, -63172, -386574, -43460, -81832, -87804, -129908, -54138, 122964, 23439, 180200, -23083, -89554, -35483, 69032, -56317, -139334, 517, -43585, -39214, 106261, 335538, -4684, -63152, 32751, 42467, -78734, -118749, -109551, -246922, -103096, 140436, -243961, 89196, 161980, 333819, 18060, 162241, 508700, -213401, -154500, 191281, 174192, -178249, -13335, -70394, 169638, 67169, 150456, -172164, 98069, 169252, 227600, 98002, -25022, -224009, 131678, -304098, -74827, 77291, -182534, 91043, 163163, -305578, 175593]
15591e60E2025b18474A50376O6212b70888a11605A5937N4221J15321m9582a29843
15579C07962B8914L5514N783B1596J90154b10285C64497h0218j64621F2014d7311
15567b40069c9222k34561B57040h9576l09794f5293C40768d0395B77732a9878
15556g6470C8180N4401L1778a66753d0098A45596b8978j68A83397a99483r5494
15545b94977G3650a97789j1511A46622h8473A80311j8983n4019Q0762B0204J05287
15534A25491a82177g9107B92726n4930a03159j97868B8745M033i9283F1740O4782
15523A26522g8450B09679E4136K0001Q3032h6408D9514L6930a34713q925A38275
15511C27521G7758e0355l05184i1267A88064b52378j33958B7202J70976a01572
$$ y = [-560, 52025, -218474, 150376, 216588, -270888, -111605, 15937, 70158, 185479, 135897, -129843, 307962, 28914, 64428, 70211, 21596, 211750, -210285, 364497, -80218, -244839, 62014, -47311, -240069, -39222, -273783, 257040, -89576, -399370, -65293, 340768, -40395, 277732, -19878, -76470, 38180, 92581, 124359, -166753, -40098, 145596, -28978, -29146, 183397, -199483, -294977, 73650, -197789, -209300, 146622, -88473, 180311, 161328, 107309, 188071, 20204, 125491, -182177, -79107, 292726, 237796, -103159, -301027, 28745, 32778, -99283, 61740, 126522, -78450, 209679, 54136, 74137, 157169, -86408, 49514, 86444, -134713, -143638, 138275, 327521, 77758, -50355, -355539, -91267, 188064, -252378, -386336, 27202, 198178, -101572]
15500c65983k1782c6935k39875O0828P1199j12726e9435A92367o4650b1658j18078
15489a39736M6196D103a85857B2477K8215a09944j34477N3991A31613a86675b6868
15477A00213c63834A14661B9977b1705k38017a06669j33318k21163F831N487b02349
15465d4373D14114A86106b64951F6207a66746i167q9270G3986a86462A77835o1131
15454A16704i7674D96672b03812m8121R1903N4123A42977c50681D3662i9940H3818
15442i6666d4382C25635c98544C07331J36044D8720m043j6078P9719j7567A9228
15430b08615j90G3339f444A23355a3229j48316A02783C9166R1894J30669a87309
15418c0610F4395b53293o9502a03127B36739q089K77060d6105k25307n7223D7707
$$ y = [-365983, -387765, -36935, -276810, -215982, -144783, -257509, -59435, 192367, 127717, -21658, -139736, -93540, 4103, -185857, 22477, 50692, -109944, -244421, -190430, 131613, -186675, -26868, 100213, -363834, 114661, 29977, -21705, -259722, -106669, -239987, -461150, 6831, 12318, -202349, -44373, 414114, 186106, -264951, 66207, -166746, -9167, -98437, 73986, -186462, 177835, 116704, -97674, 496672, -203812, -251933, -160030, -105907, 142977, -350681, 43662, -99940, 83818, -96666, -44382, 325635, -398544, 307331, 443375, 48720, 44677, 28599, 108318, 90751, 19228, -208615, -208805, 73339, -6444, 123355, -13229, -161545, 102783, 39166, 131060, 261729, -187309, -30610, 64395, -253293, -322795, -103127, 236739, 228650, 505710, -46105, -271412, -328635, 47707]
15406a28663k94235g7343B67337F4336K00749a8221A46173e7957p750p605k33891
15395c07203b6962B91580b52348O3435p4922j7797a23923E4071j5983g0685j31414
15384b02099n1400a07304j8383C00905a12522G1450N8672f541k7584G9815N3616
15373A33431J51239a09375j3214k11817e7935G7422a19799C8891d7658j49554
15363a97212L2607B09118E0045M0070a95332E7867P750h4515A70652a5905B16053
15351a90161g1490B95147n6294r2931d3158O926G2587B6512a24763n976j84996
15340c15735a42088b3191B79533b88786c4057p3153C49555a29647B68128g8395
15329B04674H9753c3940A64033p1651K731b38996R4095B52763b63153e3825E8485
$$ y = [-128663, -422898, -77343, 267337, 64336, 265085, -18221, 146173, -57957, -65707, -73312, -307203, -26962, 291580, -252348, -188913, -263835, -281632, -123923, 54071, 38088, -70685, -202099, -253499, -107304, -125687, 300905, -112522, 71450, 130122, -6541, -34125, 79815, 133431, 284670, -109375, -122589, -334406, -57935, 77422, -119799, 38891, -47658, -197212, -164605, 209118, 50045, 90115, -195332, 57867, 65617, -84515, 170652, -15905, 216053, -190161, -71490, 295147, 238853, 145922, -43158, -36232, 72587, 26512, -124763, -130739, -315735, -142088, -23191, 279533, -288786, -34057, -107210, 349555, -129647, 268128, -78395, 204674, 89753, -33940, 164033, 92382, 95113, -238996, -144901, 252763, -263153, -53825, 58485]
15317B10354E2428P4686i8669I9411J93273K6848A39866J04826A078N6814K29772
15306B87664h7550F240f0679D1461J10494m4426B6223K30269B9772R6124a83776
15294C06605j44020B0378O0900J14660d8875l11918A96690A6214b13502B8655
15283C94194C540P2189a22145F9556b63631i2104G7057f0076A62562L26756F8235
15271F4239g2224C8707L98519j93962H3890K2965f1603f59A88714a63084D0839
15259c1532A68801a52296B24010J03252a86887A06574K23809M0128A63662C2283
15248H20106J169654o50884k59400P49443G84299C38204C3620a26594g517A66347
15237H4713b25743A19017c63C2707K79564a0827j12184A93962n6635J37720j12566
$$ y = [210354, 52428, 127114, -98669, 99411, 292684, 319532, 139866, 244692, 1078, 57892, 287664, -87550, 6240, -60679, 41461, 151955, 107529, 26223, 256492, 29772, 125896, -183776, 306605, 162585, 20378, 81278, 195938, -48875, -360793, 196690, 16214, -213502, 28655, 394194, 3540, 75729, -122145, 69556, -263631, -92104, 77057, -60076, 162562, 489318, 68235, 64239, -72224, 38707, 437226, 243264, 83890, 106855, -61603, -659, 188714, -163084, 40839, -31532, 168801, -152296, 224010, 327262, -186887, 106574, 330383, 370511, 163662, 32283, 820106, 1989760, 1338876, 1079476, 1828919, 784299, 338204, 33620, -126594, -7517, 166347, 84713, -225743, 119017, -363, 32707, 312271, -10827, -123011, 193962, 137327, 275047, 162481]
15226A62481a21963A62133J6343g1119L5477B08672G093l65b96256I6452J93458
15215B89910K61361c61526a11500B1358J41978f333B84980I7219P3804l8629k5778
15204A06616a34759b6517r7037D1503Q5368J56546a03336m6145A52815b86817
15193A59484B491J14692A3239N0852g5648C4450q109i4409K3900j66319E5573
15181A94267a8894C8440K61616B8962J26539a97402B22910P4358j32316A7587
15170b1863C31586B995J65831m1491l5709J74769B6309K6374K26999B5819J9798
15159D5617J75137E396a65907A09349J5956a29361j0307A14190K7945m9237B5742
15147B40513K54558j19775B1445L57090a9409H3525K32698A02555b61569K5875
$$ y = [162481, -121963, 162133, 178476, -71119, -35642, 208672, 7093, 6728, -296256, 96452, 289910, 551271, -361526, -111500, 21358, 163336, -6333, 284980, 97219, 171023, 132394, 106616, -134759, -26517, -123554, 41503, 126871, 283417, -103336, -149481, 152815, -286817, 159484, 2491, 117183, 13239, 64091, -75648, 34450, 26341, -94409, -70509, -236828, 55573, 194267, -18894, 38440, 300056, 28962, 155501, -197402, 222910, 297268, 164952, 17587, -21863, 331586, 2995, 168826, 127335, 91626, 266395, 26309, 52683, 279682, 25819, 45617, 220754, 5396, -165907, 109349, 125305, -129361, -139668, 114190, 142135, 92898, 25742, 240513, 495071, 375296, 21445, 378535, -19409, 83525, 316223, 102555, -261569, -235694]
15137b35694C98086j62589q8614b35185B5711J23440C5026a30985J7873A12728
15126a94407B5057J18841O3953B6432A642J47127J74424D2372J8962d0180A04787
15114A63192K57643j71132k0427I6513B089N1351D037f7529B24877r1178c3828
15102a80098C33805a05459B38326b42918L3074B14756A7870b41837C0212R4574
15092A24786L18995C1512e4772k0287A94792i7914A32266A3400J55382J77217
15082C45999J5487j14861J9164L5144e7752C8742L43784j90196R3478E1246L49063
15071D00309A07083P1257p912K5984D2786P8754O7489M42031g0417A66546J07467
15060B74013p9707J63398G1188B9108g5214a3334I0404l6408A2891L3104L44332
$$ y = [-235694, 398086, 235497, 146883, -235185, 25711, 149151, 35026, -130985, -113112, 112728, -194407, 25057, 143898, 207851, 26432, 1642, 148769, 323193, 42372, 61334, -40180, 104787, 163192, 420835, 249703, 229276, 96513, 2089, 53440, 4037, -67529, 224877, 133699, -33828, -180098, 333805, -105459, 238326, -242918, -209844, 214756, 17870, -241837, 30212, 124786, 443781, 31512, -54772, -75059, 194792, -97914, 132266, 13400, 168782, 345999, 361486, 246625, 265789, 300933, -57752, 38742, 382526, 192330, 285808, 51246, 400309, 107083, 178340, 170428, 196412, 42786, 121540, 189029, 631060, -70417, 166546, 274013, 194306, 357704, 71188, 29108, -75214, -13334, 90404, 53996, 12891, 45995, 390327]
15049C90327A85151p6931N2232J44885G5573O548Q2282L55741i6622C85470j02788
15038B82682b09136B60150j16293l7690e7281j5198A73529K4849a41962A4225
15027B24432I6002i2611F59570e9035I6560J25473J00083o5447k6907r9313L158
15016A33607J45049P4525a07473B39894R6029N2741N9522A81717J71458b45545
15005B36789M7480P1893I7028K79688j49458j02583A3948P0112J75115m1364K18778
14994D36589b07055B81683m2093N5085P6625g0786D61304H4099M28778a97630
14983C87411A51498K14178C8619M13952g8304A99278m0218d6791D48064L8834
14973D86898A32578E1426k1975L18539h4973D07554l0989j39477K16538i7816
$$ y = [390327, 185151, 108220, 160452, 305337, 75573, 82121, 164403, 520144, -96622, 385470, 282682, -209136, 260150, 143857, 106167, -57281, -72479, 173529, 198378, -141962, 14225, 224432, 96002, -92611, 659570, -59035, 96560, 222033, 322116, 256669, 229762, 130449, 133607, 278656, 353181, -107473, 239894, 335923, 388664, 448186, 181717, 353175, -245545, 236789, 284269, 356162, 97028, 376716, 227258, 124675, 13948, 84060, 259175, 217811, 436589, -207055, 281683, 239590, 294675, 371300, -70786, 461304, 84099, 512877, -197630, 387411, 151498, 365676, 38619, 452571, -78304, 199278, 159060, -46791, 448064, 486898, 132578, 51426, 29451, 347990, -84973, 407554, 376565, 237088, 453626, -97816]
14962B88578P9879j20350E6540L18101j63697K43879j85337h197p7584i06B56343
14950D3699R0242b6421A95821K9108K6145J9036p598F9285M46312A31640m7954
14939H3686K88407q9565M72291B16548L28672A68488J52160p3390J13002J05728
14929D65988B15974J08618Q5965a6009A59214J16394q1226Q7928p1208J03574
14919C14676J19148B15445K84655j98749K10052j60043J13112j31033Q9028j33158
14909B89309D5182K07307M05604n8678A00040J49819m9517K48016B02073m7841
14899A54232J16454K73240J2763K411B28475P0838l5315J98354M6056j83511K58625
14888E83522A53900J20568K1430M6338M4637K4613j08743P5354J71320A93074
$$ y = [288578, 368457, 248107, 56540, 374641, 210944, 454823, 269486, -8197, -85781, -906, 256343, 43699, 133941, -26421, 195821, 224929, 251074, 270110, 262512, 69285, 515597, 131640, 83686, 372093, 282528, 754819, 216548, 545220, 168488, 320648, 247258, 360260, 465988, 215974, 324592, 410557, -16009, 159214, 275608, 194382, 282310, 211102, 314676, 433824, 215445, 500100, 301351, 511403, 351360, 464472, 333439, 422467, 289309, 45182, 252489, 658093, 599415, 100040, 249859, 200342, 448358, 202073, 154232, 270686, 543926, 556689, 559100, 228475, 299313, 263998, 462352, 508408, 324897, 583522, 153900, 274468, 295898, 342236, 386873, 411486, 302743, 378097, 549417, 193074]
14877E13719K22817B64915J4559k3570p4044M2037L29032m8158B33163K47724
14867D80887r4097o9185q5277M46676C24799J20968H1820K53063M06163k16302
14857E24744j95327K84327A96110J60068R0672m4910K4932K8373J09354R0326
14847F54925k66862J64328J41181C46456r6670J49218L5249l3594O8975j1075
14837D58559k0232J2660K2893j12040J70995J18828M4980A70062N75657A70416
14826A75030L02888K16655C21123Q2765K29606J8950j53720B41817K27999J6884
14816D86700j4290m4871K70374C29345L62951j84542K93982O0392B08398N69679
14806G78077j1652l41433J20239j58099n6276L11564k54371L69116l11574J16224
$$ y = [513719, 736536, 264915, 279474, 255904, 181860, 223897, 552929, 504771, 233163, 480887, 386790, 317605, 232328, 679004, 324799, 445767, 81820, 334883, 741046, 524744, 329417, 613744, 196110, 356178, 446850, 401940, 426872, 455245, 564599, 654925, 388063, 552391, 693572, 346456, 249786, 399004, 434253, 400659, 469634, 458559, 438327, 450987, 473880, 361840, 532835, 651663, 696643, 170062, 745719, 170416, 175030, 477918, 694573, 321123, 403888, 633494, 652444, 498724, 241817, 469816, 486700, 472410, 427539, 697913, 329345, 692296, 507754, 801736, 862128, 208398, 778077, 766425, 424992, 545231, 387132, 330856, 642420, 388049, 757165, 445591, 561815]
14796E61815q4573p4012J70232J52516j78375J805N2832M5708Q5659j96665J71736
14785G08678r5659l7067J88823o1273Q8138k91915R6817Q0939j35200J60992n4220
14774F49053j8334P0804K6256k42419M46480j24673l39420j38966J45781j60282
14764C14280M44918j81668Q2985L31883m89248Q2596J60428K40712C34817L73539
14754G08356J3417j8194O458J9962B78576L87427q9652k38786N35826k50862P7831
14743G00360q2650J05801j62969j2586L73430k47790K00495J3383N0253D12618
14732F27585j15883K53563n4282J05406L1159M3926k5267n8844l35223J85974
14722F58114M17922J10436n17796J14634J16524J09900k12141J80191l16275K25943
$$ y = [561815, 477242, 403230, 573462, 725978, 547603, 549408, 602240, 647948, 733607, 536942, 708678, 613019, 575952, 764775, 703502, 791640, 499725, 596542, 677481, 542281, 703273, 649053, 630719, 701523, 727779, 485360, 931840, 807167, 467747, 328781, 474562, 314280, 759198, 577530, 660515, 992398, 503150, 585746, 746174, 986886, 334817, 708356, 721773, 703579, 710037, 729999, 278576, 666003, 576351, 337565, 873391, 622529, 700360, 617710, 723511, 560542, 547956, 921386, 673596, 874091, 887474, 937727, 412618, 627585, 511702, 765265, 710983, 816389, 847548, 891474, 866207, 807363, 472140, 658114, 1076036, 1186472, 668676, 783310, 899834, 1009734, 797593, 977784, 661509, 887452]
14712H87452l9265j57925j29697M20551j71299L00700l8010l68156R3244k1924
14702G75671o8371J16770J59236n1692J54872m58366L04599L05091m52119J27359
14692I13050P6097L82779l12260l51775L35248l03007J49609j41512L60018j3157
14682A095090p3562l8104m561K58769o06763O90821n76699N97457k54130k36125
14672H52193L60522N7859L9776k23032j35030L39821K0908O1813k90083J90031
14662A274778L60777G85132M58859j76673L08938l72605j35600M66262K19746
14653A554059k79122j79720K95255o6319L7306R490J57300l66087N37212k72926
14643A426448k20671l7961P9344k25039M06175J62700j79323k31713N3734K41859
$$ y = [887452, 848187, 690262, 560565, 981116, 809817, 1110517, 1072507, 704351, 797595, 775671, 707300, 824070, 983306, 931614, 1086486, 628120, 932719, 1237810, 785691, 913050, 989147, 1371926, 1059666, 707891, 1043139, 740132, 889741, 748229, 1108247, 1095090, 1021528, 983424, 978863, 1237632, 630869, 1321690, 744991, 1342448, 1088318, 852193, 1212715, 1270574, 1310350, 1087318, 952288, 1292109, 1313017, 1374830, 1084747, 1274778, 1635555, 785132, 1243991, 1067318, 1376256, 1003651, 868051, 1334313, 1554059, 1274937, 1095217, 1390472, 1324153, 1361459, 1370949, 1528249, 1162162, 1699374, 1426448, 1205777, 1167816, 1247160, 1022121, 1428296, 1590996, 1411673, 1179960, 1233694, 1475553]
14633A475553k44787L5861L8112k19090N70360k00964M51237k33588l07699J1736
14623A376731K85511k51069K31793k91134K51057P1574P381m719p4007J72007
14613A775125j20130K66052k82018J13363m41513O00368j64438J20083m48467
14604A418425l9580O1211L30291j18680L87839l35820O4592j45152l610J34054
14594A753570K54744l19799L58203J2499N0943k38449J47442k6279L59366p43001
14584A609239J76796L38576J76236k53452M9458N7106k42675k07705M26745k3519
14574B106805M01858l35552M7517L18367q5133J95789J67185n46068J23385K23461
14564B617614M15914l16901j16218J99273J87827J68322O6379k23399K58785K49634
$$ y = [1475553, 1230766, 1266627, 1304739, 1085649, 1656009, 1455045, 1906282, 1672694, 1364995, 1376731, 1662242, 1411173, 1642966, 1351832, 1602889, 1674463, 1681844, 1677125, 1603118, 1775125, 1654995, 1921047, 1639029, 1752392, 1310879, 1911247, 1746809, 1866892, 1418425, 1378845, 1440056, 1770347, 1651667, 2039506, 1703686, 1768278, 1623126, 1619516, 1753570, 2008314, 1688515, 2046718, 2059217, 2110160, 1871711, 2019153, 1992874, 2352240, 1609239, 1786035, 2124611, 2300847, 2047395, 2096853, 2153959, 1911284, 1703579, 2130324, 2106805, 2508663, 2173111, 2220628, 2538995, 2453862, 2649651, 2816836, 2270768, 2394153, 2617614, 3033528, 2716627, 2600409, 2799682, 2987509, 3155831, 3222210, 2998811, 3257596, 3507230]
14554C507230K15145L71788O84318L29219Q49932J514139M194647R539909K0799975
14545D2006302P745880B2705205H774737D069267j290113j92858l8182o56923
14537A891191P8119j97929O0540N94529m84852J66620Q9494L62328k16291J59278
14527B503027j66275L58353j41055J62331J12103m22973o1491N57516r4972k26264
14517B580300M11053j48495P8015J87228n97570N05190m6971K21158k50558O2400
14507C001750K90412l03087J00013K77756k71836N9832N1665L59927m3842O5167
14497C587757m051J60647j55380l1328Q4171j8092q6895L26873m89661N14948
14487C888989m2422R9800R2467o3100P1075r8486j52261J02144L80086M46502
$$ y = [3507230, 3722375, 4094163, 4778481, 5107700, 5957632, 7471771, 11666418, 21206327, 42006302, 49752182, 22705205, 8774737, 4069267, 2779154, 2586296, 2548114, 1891191, 1969310, 1771381, 1831921, 2426450, 1941598, 2108218, 2197712, 2560040, 2343749, 2503027, 2336752, 2695105, 2554050, 2716381, 2828484, 2405511, 2344020, 2901536, 2806564, 2580300, 2991353, 2842858, 2920873, 3108101, 2510531, 3015721, 2968750, 3189908, 2939350, 3001750, 3292162, 2989075, 3089088, 3366844, 3095008, 3154840, 3206505, 3566432, 3522590, 3587757, 3583706, 3744353, 3588973, 3557645, 3641816, 3623724, 3536829, 3863702, 3374041, 3888989, 3846567, 3946367, 4038834, 3975734, 4046809, 3948323, 3796062, 3898206, 4278292, 4724794]
14477D724794m38494J0472j19395P0092L78075N2320K41986j20126J21374j99896
14467D721202j06450K38234K3687L37631l66792L32112j55539L41879j70739j21234
14457E073991L56697R6486n4623J27053J45693j43040J73673J40482l1186J87757
14447F072983r7929J54103J05867K64459m62160L7463L43454M0560L14816l2128
14437F741488K4374K37169L88842k07765K48627j84975N7965K19755K30042R3832
14427G849354k34135K11183J82439L98088J68940k32587L53697k63469K52581
14418H686091M54514p3954j47100M78208K3099L99619n2511k2220M90563j78018
14408A0058291M3389J99482L24836k3471j8188O9280L70023K64026J66930J02511
$$ y = [4724794, 4286300, 4296772, 4177377, 4247469, 4625544, 4677864, 4919850, 4799724, 4921098, 4721202, 4614752, 4852986, 4876673, 5214304, 4847512, 5179624, 5024085, 5365964, 5195225, 5073991, 5430688, 5527174, 5472551, 5599604, 5745297, 5602257, 5775930, 5916412, 5885226, 6072983, 5975054, 6129157, 6235024, 6499483, 6037323, 6074786, 6418240, 6458800, 6773616, 6741488, 6765862, 7003031, 7391873, 7184108, 7432735, 7247760, 7305725, 7525480, 7755522, 7849354, 7615219, 7826402, 8008841, 8406929, 8575869, 8343282, 8696979, 8433510, 8686091, 9140605, 9066651, 8919551, 9397759, 9420858, 9820477, 9767966, 9745746, 10236309, 10058291, 10101680, 10301162, 10625998, 10602527, 10584339, 10653619, 11023642, 11287668, 11454598, 11557109]
14398A1557109M04729k73764O61533L6225J14670M81373l42765P00933M81376
14389A3821419J99330j19116N69123r6342O52592K65700J76K73436N76481K85955
14379A6428754J14105L32357O52719J88557M08014L10967K26663M25180J20878
14370A9208194Q17063L78775M03799L02421Q37955j3822M26873M34401P10751
14361B3506410O81197L60266K73440O51538P59234O89173M55285O19009L41152
14352B8336704R10665J089669Q57487J98111Q82725R52268O77535Q37704R80098
14343C5722966J029815R77663J045552Q78727R95625J204992J521803Q94006J421546
14334D5692695J559453R67307J551324J324728J423123J897463J978726J867208
$$ y = [11557109, 11961838, 11688074, 12349607, 12385832, 12500502, 12981875, 12639110, 13340043, 13821419, 14020749, 13901633, 14470756, 14374414, 15027006, 15292706, 15292882, 15566318, 16142799, 16428754, 16542859, 16875216, 17527935, 17716492, 18124506, 18435473, 18662136, 19087316, 19208194, 20025257, 20404032, 20807831, 21110252, 21948207, 21934385, 22361258, 22795659, 23506410, 24187607, 24547873, 24821313, 25472851, 26232085, 26921258, 27376543, 27995552, 28336704, 29247369, 30337038, 31194525, 31392636, 32275361, 33227629, 33905164, 34742868, 35722966, 36752781, 37730444, 38775996, 39654723, 40650348, 41855340, 43377143, 44271149, 45692695, 47252148, 48219455, 49770779, 51095507, 52518630, 54416093, 56394819, 58262027]
14326E8262027J911541J752204J861275K118943K233675K447456K180850K665207
14318G5433178L089952K828024K888261L246721L370686L425034L753991L827811
14310A01863658L993489M648136M364234N067282N185360N469096N462348N986614
14302A42040217O632083O626195P150992P773825Q039640Q146449Q705092R187083
14294B04301576J0259067J0233736J0624871J1956539J2020156J2659046J3003179
14287B85058170J3802990J3879179J4595896J4629464J5214138J5364552J4952229
14280C87496618J4614824J4472220J3880697J2948010J1507236J0781787Q457668
14273D74159060O043402K087225j113367j552332j842519n104581m935985q393277
$$ y = [58262027, 60173568, 61925772, 63787047, 65905990, 68139665, 70587121, 72767971, 75433178, 78523130, 81351154, 84239415, 87486136, 90856822, 94281856, 98035847, 101863658, 105857147, 110505283, 114869517, 119936799, 125122159, 130591255, 136053603, 142040217, 148672300, 155298495, 162449487, 170223312, 178262952, 186409401, 195114493, 204301576, 214560643, 224794379, 235419250, 247375789, 259395945, 272054991, 285058170, 298861160, 312740339, 327336235, 341965699, 357179837, 372544389, 387496618, 402111442, 416583662, 430464359, 443412369, 454919605, 465701392, 474159060, 480202462, 482289687, 481176320, 479623988, 477781469, 472676888, 467740903, 459347626]
14265D59347626j0068053j2485963j4092982j5109476j5705939j6251427j6140229
14258C59493557j6581009j6026859j5738346j4207641j4352139j4150733j3511167
14251B54925663j2830177j1866224j1302531j1003097j0273211r413928q997047
14244A79239448q112725q128126p688657p228026o674447o284559o125064n073845
14236A23923999n023531n596557m415299m910412l429886m262449l728505l469561
14228H9087799l835235l165885l212398k812398k645659k611414k555431j964141
14220F6285238k214574k123432k294963k053964j595814k088330j578724j028286
14212E1307151j932414j310451j635341j411497j176710l56237j401523j718579
$$ y = [459347626, 449279573, 436793610, 422700628, 407591152, 391885213, 375633786, 359493557, 342912548, 326885689, 311147343, 296939702, 282587563, 268436830, 254925663, 242095486, 230229262, 218926731, 207923634, 197650423, 188236495, 179239448, 171126723, 162998597, 155309940, 148081914, 141407467, 135122908, 128997844, 123923999, 118900468, 113303911, 108888612, 103978200, 100548314, 96285865, 92557360, 89087799, 85252564, 82086679, 78874281, 76061883, 73416224, 70804810, 68249379, 66285238, 64070664, 61947232, 59652269, 57598305, 56002491, 53914161, 52335437, 51307151, 49374737, 48064286, 46428945, 45017448, 43840738, 43484501, 42082978, 40364399]
14204D0364399r99221q81549j231471o32914j054533r00039q82068p61883j216958
14195C1803763o44507o69830q48806p89174o35393j140520m50410k99761o19564
14186B5705798o60165l97365p52286n09123p10779r0007n23464n17575n08691
14177B1036343m28048l40623q04909K69468n01379m35329o15583n4411k04244
14168A7921285n12369j95046j57510o66295K70160n76758n50738R5952m46563
14159A5182118j97360k55433j79470l57548n93816Q9168j37738J34405o49782
14150A3034544n9275m35374M2484k62119k29680m25465J89141n92707K07104n868
14140A1462785n23249k76980m0335J34006m09754K62045o86012P924m79766Q7145
$$ y = [40364399, 39365178, 38483629, 37252158, 36619244, 35564711, 34664672, 33782604, 33020721, 31803763, 31159256, 30489426, 29640620, 28851446, 28216053, 27075533, 26625123, 26325362, 25705798, 25045633, 24648268, 23895982, 23386859, 22676080, 22586073, 22062609, 21545034, 21036343, 20608295, 20267672, 19462763, 19732231, 19230852, 18795523, 18179940, 18125529, 17921285, 17408916, 17213870, 17056360, 16390065, 16660225, 16083467, 15532729, 15628681, 15182118, 14984758, 14729325, 14549855, 14192307, 13598491, 13687659, 13549921, 13684326, 13034544, 12975269, 12539895, 12582379, 12320260, 12090580, 11665115, 11854256, 11261549, 11468653, 11462785, 10939536, 10662556, 10622221, 10756227, 10346473, 10608518, 9922506, 9930430, 9450664, 9537809]
14130I537809L5252o7223l10508j43973M98917p08863m49506Q8403L06040o53566
14120H132782j57587j00616K73028m7935k07492j17021k06305J6149n07458P25686
14110G803231o50365k8288j75062J62879m05627J79191l64730K10512j43709k861
14100F585171k40859j9063L40646n17661k64193m7518M14393l05667j58581L50198
14090F136866l68251J73390k94091j14807N7414j3154m96677N45664l92578P1090
14080E304866l28237J35006K64213j60535k41977q2505m3117n120l58093N09722
14070D994223k7780l76154j48926K3840K05168R0873l85967J31569L0678p0473
14060D467051k6098j88844J19309k60517k6972K12981j81155q5661l06675P5801
$$ y = [9537809, 9573061, 9505838, 9195330, 9051357, 9550274, 8841411, 8391905, 8480308, 8786348, 8132782, 7975195, 7874579, 8147607, 8099672, 7892180, 7775159, 7568854, 7585003, 7077545, 7803231, 7152866, 7124578, 6949516, 7112395, 6706768, 6885959, 6521229, 6731741, 6588032, 6585171, 6344312, 6325249, 6665895, 6148234, 5884041, 5836523, 6250916, 5945249, 5786668, 6136866, 5768615, 5942005, 5647914, 5533107, 5590521, 5577367, 5080690, 5626354, 5233776, 5304866, 4976629, 5111635, 5375848, 5215313, 4973336, 4890831, 4847714, 4842594, 4484501, 4994223, 4966443, 4590289, 4441363, 4465203, 4670371, 4761244, 4375277, 4506846, 4537524, 4467051, 4440953, 4252109, 4371418, 4110901, 4083929, 4296910, 4115755, 4030094, 3723419, 3799220]
14050C799220L8243j20058K07643K6745k59891N2775n8265k45804R7469o9430
14040C468647K54201k47090j7208j56980K84586k59930o0027O6043J90416j47108
14030C375550j3407l00317K20532J53298l61517K47552l08043n9324n1390L06359
14020C209293m09623r7059J05439J72812q9734N3928m3021j74122L9026r8684
14010B668255L34181m19347j2110j10648K30010m44062R4901J23507j25904K56373
14000B595156r1491k34080K12856K04533j10841k21563K16422j76304J53602r9171
13990B449119M07000P38220K441659P649198K0074960J8340702k5337457j3140324
13982A3623077n498823k190631j076415n41908m16233j20551n54814l16219n8169
$$ y = [3799220, 3837463, 3717405, 3925048, 3951793, 3691902, 3744677, 3686412, 3440608, 3538077, 3468647, 3722848, 3475758, 3458550, 3301570, 3586156, 3326226, 3266199, 3332242, 3522658, 3375550, 3362143, 3061826, 3282358, 3435656, 3074139, 3321691, 3013648, 2954324, 2902934, 3209293, 2799670, 2702611, 2808050, 2980862, 2891128, 2945056, 2902035, 2727913, 2766939, 2668255, 3002436, 2583089, 2570979, 2460331, 2690341, 2246279, 2341180, 2464687, 2338783, 2595156, 2503665, 2269585, 2482441, 2686974, 2576133, 2354570, 2570992, 2394688, 2548290, 2449119, 2856119, 3594339, 6035998, 13685196, 33760156, 52100858, 26763401, 13623077, 8124254, 5933623, 4857208, 4315300, 3899067, 3778516, 3223702, 2907483, 2849314]
13973B849314P1403l41771L17679j64366l17648K13981J42714l87292j77320L44291
13963B550985o17109M89184J10086l56699L15255l02595K60873m13774L23110
13954B359316j08302p5090k9441K5412j9017j18691L01155l59234K98759j18738
13944B156129k36591M5704N1636J51128k82874l15179J77057M07526j42061j69474
13934A843001K00994p8500k99614M151L06321k76213o4343N0125p6333K61399
13924A870988M6082r1080J36762k74424J48784j94986J33051j32426l9232k5005
13914A578514J56215k26720M03324o73519N14311j63726j1255n9648j54414M5829
13904A408911K0180M2732J71483J0338k67234N1127M7568k30671N84798k94338
$$ y = [2849314, 2920717, 2578946, 2896625, 2732259, 2414611, 2628592, 2771306, 2384014, 2206694, 2550985, 1933876, 2423060, 2533146, 2176447, 2491702, 2189107, 2449980, 2036206, 2359316, 2251014, 2175924, 2146483, 2171895, 2152878, 2034187, 2335342, 1976108, 2274867, 2156129, 1919538, 1965242, 2016878, 2168006, 1885132, 1569953, 1747010, 2154536, 2012475, 1843001, 2043995, 1965495, 1665881, 1670032, 1976353, 1700140, 1635797, 1685922, 1609589, 1870988, 1917070, 1825990, 1962752, 1688328, 1837112, 1642126, 1775177, 1642751, 1603519, 1578514, 1734729, 1508009, 1911333, 1237814, 1752125, 1588399, 1577144, 1517496, 1363082, 1408911, 1429091, 1471823, 1643306, 1653644, 1386410, 1437537, 1485105, 1254434, 1839232, 1544894]
13894A544894l98542J86998R0840K77399m64424K84850j47963J90380k83794K7001
13884A307639P8070K22629n46518K59689r4631j9518j82640J47299K10530k26188
13874A156361O2648J64096l75094K38269j89514M86411m45908M992j98733O67652
13864A571180k92675j48735j51599l9483K91728L30246l05799k20580M24794q5674
13854A373403k84304J58799L93955l77296l1162l04528J0735J09199l1378P3607
13844A091030n9108L8607k18317K10168J6133m5728L26578m08531k48430J56723
13834H59125K1547K28503k71544L14438j54970J13379m32705K56161n8054M4988
13824I20868R6231l262j57581K72372j79582l32719L06260J18056l75060K72718
$$ y = [1544894, 1146352, 1333350, 1424190, 1701589, 1237165, 1522015, 1374052, 1564432, 1280638, 1307639, 1385709, 1608338, 1061820, 1321509, 1226878, 1207360, 1024720, 1172019, 1382549, 1156361, 1219009, 1383105, 1008011, 1246280, 1056766, 1543177, 1097269, 1102261, 903528, 1571180, 1278505, 1129770, 978171, 938688, 1230416, 1560662, 1254863, 1034283, 1459077, 1373403, 1089099, 1247898, 1641853, 1264557, 1233395, 928867, 939602, 1048801, 1017423, 1091030, 1031922, 1070529, 852212, 1062380, 1078513, 1032785, 1359363, 950832, 702402, 859125, 880672, 1109175, 837631, 1152069, 997099, 1110478, 677773, 933934, 875880, 920868, 1017099, 1013837, 856256, 1128628, 949046, 616327, 922587, 1040643, 665583, 938301]
13814I38301K52057L2759o8702m37754p3075J96371M26173l64379j44433K43397
13804A000715k09526Q2361j49754J77421r6457O5621r7524r3583O8868k91J08490
13793H56341j9851J57318K716j55076j11392J48438j35023j34198M9561R8989
13783G57823J77677R3659k33435r1198K14398l02084K91396l9630l2077k18401
13773F18128j46118N56708l66094l5798K02057k91244J73160K62450k39324k48462
13763D85463L92073r1589J1404J14151j50313N8237j27397j42927J31688l4140
13753F46650K5598J57470m6587n2668l3445p2200K13830j28692K44818j36821
13743H17953j82969K37123o4631R309k97755n5601K87538m7834J71930D25804
$$ y = [938301, 1190358, 1223117, 1154415, 716661, 643586, 839957, 1266130, 901751, 757318, 1000715, 791189, 873550, 723796, 901217, 804760, 870381, 772857, 679274, 748142, 747851, 856341, 836490, 993808, 996524, 841448, 730056, 878494, 743471, 609273, 658834, 757823, 935500, 1029159, 795724, 704526, 918924, 616840, 908236, 868606, 836529, 618128, 472010, 1028718, 662624, 626826, 828883, 537639, 710799, 973249, 733925, 485463, 877536, 785947, 797351, 911502, 761189, 819426, 692029, 549102, 680790, 646650, 672248, 829718, 783131, 730463, 697018, 624818, 838648, 709956, 954774, 817953, 634984, 872107, 807476, 816785, 519030, 463429, 750967, 703133, 875063, 425804]
13732F19318r857o236j23122K66286M8172P9557l37647j58703K28026J47377l59692
13721C93479J74959p0634J9253K89047j3111k61972j98451M02270K63310l54508
13711F43642j31091J4847k0579N3484N0964P792J28172l5218C412P71673l26673
13700D48412L9803J81813P0521l06021K5276q6910M90573D00781M39468k72993
13690E67256L6866r0870K01148C26707M78017r8064k89792K59850C36863M57055
13680G93918j58451j29949J06231j58433K79379k4708j93680O9159J2867O997
13670F03330L1332B41181N58583l54988J76676B12492K97958B54350J26453j506
13660C79297M01346k34244K6697A64339L72157J52551j93101L74541m12686K14462
$$ y = [619318, 609461, 603225, 480103, 746389, 794561, 874118, 536471, 377768, 605794, 753171, 393479, 568438, 497804, 517057, 806104, 792993, 531021, 332570, 734840, 998150, 643642, 512551, 527398, 506819, 560303, 611267, 619059, 747231, 712013, 3412, 775085, 448412, 488215, 670028, 740549, 434528, 459804, 372894, 863467, 400781, 840249, 567256, 604122, 513252, 714400, 326707, 804724, 706660, 416868, 676718, 336863, 793918, 635467, 505518, 611749, 453316, 732695, 707987, 514307, 583466, 596333, 603330, 634662, 241181, 799764, 444776, 621452, 212492, 510450, 254350, 380803, 379297, 780643, 546399, 573096, 164339, 536496, 689047, 495946, 870487, 457801, 672263]
13650F72263k05829K19139j76300J47052k08441j49453L49196j3723k99145k9855
13640C04904J78544k19619a68652F05237p9133L9657r8756M7869m5302J47839
13630F17411l04445l176K66779j60177L13404B83249j586J52617n6186M1224j06776
13619C12542J25764o5577K39492J05099j09062j96154j08589K0623p713L024J81942
13608E01391R375j35397J34842j995k12290j7341P5036R1265j99172K4232l8528
13597B31418P4999N1037A16791L66778J25956k51690n5143J98408A63369L75541
13587E38910j23384J37183k63077J04561j53818L39564B6406L20842J76125j06164
13577D17209L12314B83673J67213M21347H6930K46439j53327K98562j16897J05639
$$ y = [672263, 466434, 685573, 509273, 656325, 447884, 298431, 647627, 633904, 334759, 304904, 483448, 263829, -168652, 605237, 526104, 565761, 467005, 514874, 469572, 617411, 312966, 309790, 576569, 416392, 729796, 283249, 281663, 434280, 378094, 419318, 312542, 438306, 372729, 612221, 717320, 608258, 412104, 303515, 324138, 316425, 319449, 501391, 510766, 375369, 510211, 508216, 295926, 278585, 353621, 444886, 245714, 269946, 231418, 306417, 357454, 116791, 483569, 609525, 357835, 302692, 501100, 163369, 538910, 415526, 552709, 289632, 394193, 240375, 579939, 26406, 347248, 523373, 417209, 729523, 283673, 450886, 872233, 86930, 333369, 180042, 478604, 361707, 467346]
13567D67346j91592J74005B19395p880q4822P2412j2525j6207J41919Q2673j05119
13556B89846J81291h4024C80911j77139M8427O5413J48552K81907C64820R0527
13546D55347A01145K16592p951A53327K75471O7360C7549M39881e7131D63903
13535E30044A89141R8697K68963j38883j97504K66074k0785l7004O9115j7198
13525D80616m3242A38340J39900M1846N6142j1627J56574A97329q4270K00433
13515C13492m7476J80160C9975M09068J08164j45994A73684G1106K30265I5584
13504C45268H8035K09720b43989F0888L55732p9937P7389L6134a9069C15964A37690
13492F60859A93530N50186k39150B47623O7412J28282J52268A73335R9403L56722
$$ y = [467346, 275754, 449759, 219395, 211515, 126693, 199105, 186580, 170373, 312292, 394965, 289846, 471137, -84024, 380911, 203772, 252199, 317612, 466164, 748071, 364820, 455347, 101145, 317737, 309786, 153327, 428798, 496158, 37549, 477430, -57131, 463903, 530044, 189141, 287838, 556801, 417918, 220414, 486488, 465703, 428699, 497814, 480616, 437374, 138340, 278240, 320086, 376228, 364601, 521175, 197329, 113059, 313492, 266016, 446176, 39975, 449043, 557207, 411213, 173684, 71106, 301371, 95584, 345268, 88035, 297755, -243989, 60888, 416620, 336683, 414072, 450206, -19069, 315964, 137690, 660859, 193530, 743716, 504566, 247623, 315035, 443317, 595585, 173335, 272738, 629460]
13482F29460k83135j67434J34517q8885L8110A01478M86193A30446L61017A48120
13471A92409A6829L39530A77143J53788j37117L4067J01715m0545o1495L2121
13461B59677j9210L10849A35125O0697j157o0075J45149N9517A08725K06629n3045
13450B62309j1750O9714d9170C32485K01804A61543P4237l0064K87272i43B04401
13438b56717E25418r4665j78116M3798Q143A39600K5532J70568G8506J86427J49820
13427D14753J950F6690k246N31378A77100a6599A96127K815j9594P8006r6838
13416A60516a09393C38394j19029d2105C30655N7740a9138o6976b9181B54737
13405A91768I3294f8282K0393A27562R8543m5930K4004q6074P6072J83256A59818
$$ y = [629460, 346325, 178891, 313408, 224523, 262633, 101478, 587671, 130446, 491463, 148120, 192409, 16829, 356359, 177143, 330931, 193814, 227881, 329596, 289051, 227556, 259677, 240467, 551316, 135125, 195822, 194665, 134590, 279739, 339256, 108725, 315354, 262309, 250559, 320273, -49170, 332485, 534289, 161543, 235780, 205716, 492988, -943, 204401, -256717, 525418, 430753, 252637, 296435, 304578, 139600, 165132, 335700, 78506, 264933, 414753, 416703, 66690, 64444, 595822, 177100, -16599, 196127, 198942, 179348, 257354, 160516, -109393, 338394, 219365, -42105, 330655, 388395, -19138, -86114, -29181, 254737, 191768, 93294, -68282, -47889, 127562, 226105, 180175, 204179, 118105, 194177, 377433, 159818]
13393A09696J47296b35798A38865J67529a95427B69373j1568n9174O4434n0023
13383B13042J77025j69839J98951l4833A53073K2546P8558f0590C02883O0151
13373C63034j01600K80497g4089E13483D9259A3030J81056J83510N1937A44222
13362A01595L27257j18468L44010a03247C50503K02692B37421J95101j08317p1543
13352B52662F1336K10704m5021G3563C2628L50742j1538e4282D11596j58888I8511
13340E1723M74986F8331P3231K11553j01315A10780P2164O0847n9282J37549Q5623
13329D07681H3803J79269K18163n4087A874J65094J15585J61867j42372F3251
13318C34482M7597j5036A22485J77766p3868A06443J28446B0904L32045a40716
$$ y = [109696, 256992, -235798, 138865, 306394, -195427, 269373, 257805, 198631, 263065, 213042, 390067, 220228, 419179, 384346, 153073, 175619, 254177, -60590, 302883, 363034, 261434, 541931, -74089, 513483, 49259, 13030, 194086, 377596, 429533, 144222, 101595, 428852, 310384, 654394, -103247, 350503, 553195, 237421, 432522, 324205, 252662, 61336, 272040, 227019, 73563, 32628, 383370, 371832, -54282, 411596, 252708, 98511, 51723, 526709, 68331, 141562, 353115, 251800, 110780, 182944, 243791, 184509, 322058, 407681, 83803, 263072, 481235, 427148, 1874, 166968, 282553, 444420, 302048, 63251, 334482, 382079, 367043, 122485, 300251, 226383, 106443, 234889, 20904, 352949, -140716]
13307D16020D8662d330D08009j47217G4696R2382M216J38716j40036J97476a555
13295a03682E9951a16311C27727p0630j19888a4017D51418A43366B9893J11810
13285A41703k1288L39294c028n2909i351C2392A2518J57007A01J59674a6589o9190
13273h5779B9002K4249G542a22052A09282K67508A74332J01365A36568O0977q6092
13262A11453c6991k0810I3904a14042B19866J9991c7493C72489a21593B1290i6026
13250E8556a49158A41858j1353p403M8713G8270b5568C16472a7541C94321D6017
13238d2945A08611q71b2599A60587J30472J93932n8004E0824J11295a66269A59555
13226A40636K6759p0447m093a36852A94432J41143l8596a72255A24218J71197
$$ y = [416020, 48662, -4330, 408009, 260792, 74696, 167078, 171294, 310010, 169974, 367450, -1555, -103682, 59951, -116311, 327727, 257097, 137209, -14017, 451418, 143366, 29893, 141703, 120415, 459709, -3028, -55937, -9351, 32392, 12518, 169525, 101, 159775, -16589, -85779, 29002, 53251, 7542, -122052, 109282, 376790, 174332, 275697, 136568, 197545, 111453, -36991, -57801, 93904, -114042, 219866, 239857, -37493, 372489, -121593, 21290, -96026, 58556, -149158, 141858, 130505, 123102, 171815, 78270, -25568, 316472, -17541, 394321, 46017, -42945, 108611, 107740, -22599, 160587, 291059, 484991, 426987, 50824, 162119, -166269, 159555, 140636, 167395, 96948, 92855, -136852, 194432, 335575, 296979, -172255, 124218, 295415]
13216B95415j10793K6106q6774K01790I8255K83613A69219J16866j16989H2857
13205F2598b52C0089K15740m7708L30393p7409c2711A00183L29043A91469L34420
13194E25889D0640J49862H3709N06905A59831a87656I1369l1625K94390G5817
13183g6167K8129C70121B3962O7187N575K2430M9262h5342F0701K11954k5204
13172B47451L22352D1547d8943B25093K23128F9626a54539A0997K89708D1434
13161D82302b55074D52e0707A2731O2227p770J4004J81550Q9617O2721I9179j0119
13149H9060M2757J79389d34795G1372B4336M59268H1217R5608N4043B8804N6675
13138H5479l7245h7454k08188D37539A15774L4025E5534J59187a81670A05977
$$ y = [295415, 184622, 210728, 123954, 325744, 98255, 381868, 169219, 286085, 169096, 82857, 62598, -252, 30089, 245829, 198121, 528514, 451105, -32711, 100183, 429226, 191469, 525889, 40640, 190502, 83709, 590614, 159831, -187656, 91369, 59744, 354134, 75817, -76167, -48038, 370121, 23962, 91149, 96724, 119154, 168416, -85342, 60701, 272655, 247451, 569803, 41547, -48943, 225093, 448221, 69626, -154539, 10997, 300705, 41434, 482302, -255074, 452, -50707, 12731, 74958, 67188, 81192, 262742, 352359, 415080, 99179, 89060, 131817, 311206, -434795, 71372, 24336, 483604, 81217, 176825, 230868, 28804, 85479, 48234, -87454, -295642, 437539, 115774, 149799, 55534, 214721, -181670, 105977]
13127A78013o8464G14J33373o3863p375j1941J32247p2845g4651f347B72335J9896
13115B92231A07471a4956j74381B0474g1255A15940j3862J45925l69B0182e060
13103d2520a3755C00053F6421B2545K20437C6361K57352E4469k1529J13769N9066
13092B05775q6244m094l2772K44098i1737l07864b2233B3161L37800A16385a56779
13080b11214C3950a48900A79435E9701R5623K02605j76525H8218K22120j37208
13070A73130b6505j83893f2458b7146A68310f4493D81866A59985a00771B45683
13059B66460a25344C36685q9791b04590d9647j27368I1726K88500j72808Q3751
13049B91169b26500B73200e5559k7690b2225B2007J25576e3234D30714A49882
$$ y = [178013, 109549, 714, 134087, 70224, 62849, 50908, 183155, 110310, -74651, -6347, 272335, 292231, 107471, -14956, -189337, 20474, -71255, 115940, 102078, 248003, 247634, 20182, -5060, -42520, -13755, 300053, 66421, 22545, 242982, 36361, 293713, 54469, 32940, 146709, 205775, 119531, 115437, 82665, 326763, -91737, -399601, -22233, 23161, 360961, 116385, -156779, -211214, 33950, -148900, 179435, 59701, 155324, 357929, 181404, 88218, 310338, 173130, -26505, -210398, -62458, -27146, 168310, -64493, 481866, 159985, -100771, 245683, 266460, -125344, 336685, 246894, -204590, -49647, -177015, 91726, 380226, 207418, 291169, -226500, 273200, -55559, -83249, -22225, 22007, 147583, -53234, 430714, 149882]
13038A01936N3277b03127F7445h5741A21066M97534B18392o3771k4083Q4502p4826
13027A40214f8525I277J41985f0354B01378F4521a77947a7669C9057g7074B84402
13015B17561q7028a31291A36924J98203p9700F0095M7332j1076K2923e5984B04655
13003B74743H5892a07765A60593J03548R17E9049K47167a68992q4044f8907l7034
12992a05941B25861I1107l3105N5506a66030A13414J77014m9302n2037d0324F0347
12980a00009A09565k0731A6645J60061F6610m413j2713q550b56973Q764g9837
12968F595b79645G3426a84669A8686L03556j03642p7512b11861B42886b1028A75853
12956B47525a8394C139L31763A38380m7532a40830e2280A36661d5765n7113i270
$$ y = [101936, 155213, -203127, 67445, -85741, 121066, 618600, 218392, 154621, 130538, 215040, 140214, -68525, 9277, 151262, -60354, 201378, 64521, -177947, -17669, 39057, -77074, 284402, 217561, 130533, -131291, 136924, 335127, 255427, 60095, 107427, 96351, 119274, -55984, 204655, 274743, 85892, -107765, 160593, 264141, 265058, 59049, 306216, -168992, -253036, -68907, -105941, 225861, 91107, 58002, 113508, -166030, 113414, 290428, 241126, 189089, -40324, 60347, -100009, 109565, 88834, 16645, 176706, 66610, 62197, 49484, 40934, -256973, -248209, -79837, 6595, -279645, 73426, -184669, 18686, 322242, 218600, 141088, -211861, 242886, -21028, 175853, 247525, -18394, 3139, 334902, 138380, 90848, -140830, -52280, 136661, -45765, -102878, -9270]
12944D0625N290a84133b6141A58042J63369j28896Q6627b21548A63794a88662
12933A59733E9957Q5656C7341a87556A1005P9959O1895a30090A05708c47274H2743
12921h8740o4525B7679a25438e4539D05908G0012R2918k8987L9928A3593a90667
12909B47428b10390B81759a89668A99371e4710C17170b80632C48857A50430F7141
12898E09071d00664D7339b06436A7680J56441B8289m41J99068o7889a3411j28675
12887a42086B44302A02285L6513a42426C68185A80211A5294M5532J2068l2949
12877C9945J56593O8685F6826K36741E3267K1268A7995L3729B3417g4264A59838
12865A78908a22853F4969L3951m6091Q2253F5800J82526o9998g6357A07616Q9404
$$ y = [40625, 45915, -184133, -26141, 158042, 321411, 192515, 279142, -221548, 163794, -188662, 159733, 59957, 145613, 37341, -187556, 11005, 90964, 152859, -130090, 105708, -347274, 82743, -88740, -153265, 27679, -125438, -54539, 405908, 70012, 162930, 133943, 173871, 13593, -190667, 247428, -210390, 281759, -189668, 199371, -54710, 317170, -280632, 348857, 150430, 67141, 509071, -400664, 47339, -206436, 17680, 174121, 28289, 27848, 226916, 159027, -13411, -142086, 244302, 102285, 138798, -142426, 368185, 180211, 15294, 60826, 72894, 39945, 196538, 265223, 66826, 303567, 53267, 74535, 17995, 51724, 23417, -74264, 159838, 178908, -122853, 64969, 98920, 52829, 135082, 65800, 248326, 178328, -76357, 107616, 197020]
12854A97020f9737J6260C16197g0237m565b7441A70681B11a98831C67628p3334
12843B94294a97677E3938M50294A18247A916a20313E2879K33717A4959l403a42387
12831C17661a15996C1158J38347i9885q1640f411C1438N1047a90092A8057o212
12820A1845Q4706a19948A78709o3365b17565O8856A32390m1042J2286m845m6811
12809E1978K0150g1016j37993B43771g9903K1450F1704K64895DJ81351f9400j01656
12797a71056f3643E0127a24765p2683B9774b17829A2092K8787e4416n8792g450
12785f8004h252j60932A77929G6559a71393g615A68091J14310F0521H029J79824
12774A87853k2730L9427p6032K14803j7940a79577L0976K0376A61827Q0103A0906
$$ y = [197020, -69737, -53477, 316197, -70237, -74802, -27441, 170681, 211, -198831, 367628, 294294, -197677, 53938, 504232, 118247, 1916, -120313, 52879, 286596, 14959, 11556, -142387, 317661, -115996, 31158, 169505, -99885, -181525, -6411, 31438, 82485, -190092, 18057, 11845, 96551, -119948, 178709, 115344, -217565, -148709, 132390, 91348, 103634, 98789, 51978, 72128, -71016, -209009, 243771, -79903, -58453, 61704, 326599, 4, 181355, -69400, -171056, -63643, 50127, -124765, -197448, 29774, -217829, 12092, 40879, -54416, -113208, -7450, -68004, -8252, -169184, 177929, 76559, -171393, -7615, 168091, 282401, 60521, 8029, 187853, 165123, 204550, 128518, 343321, 325381, -179577, -148601, -128225, 161827, 241930, 10906]
12762h3950E48608c521D6196J52296c8308G0880C1381J47078J98459A78343J24924
12751C03267p6240k0753b48749A14432D2820A1516f8748k02706G3925M1660k9905
12740H5680K1936R8160C3521O4621a0257k00010a2408B13963b5337p4859A19952
12728a24456C59667A09901J8249K9276J68416i4687B35268j16029E8190b18840
12717d0425A60411J9140l7799K3697o4026C8016K89220q0373A9784L99037P483
12706D26304P8295A75160K00053j35337r7036P7752A0781a40457A43930K19691
12696C63621A3316c21576A1774K67094j39143l1065m7518R8479M2205e2799A03226
12684g6547k71538F866a14733G0080J76419b7994C23935l5j59008C8675Q8785
$$ y = [-83950, 548608, -3521, 46196, 198492, -38308, 70880, 31381, 178459, 376918, 178343, 303267, 227027, 206274, -248749, 114432, 42820, 11516, -68748, -271454, 73925, 115585, 85680, 107616, 205776, 33521, 98142, -10257, -210267, -12408, 213963, -25337, -100196, 119952, -124456, 359667, 109901, 128150, 157426, 325842, -94687, 235268, 119239, 58190, -218840, -40425, 160411, 179551, 141752, 165449, 101423, 38016, 327236, 246863, 19784, 418821, 426304, 504599, 175160, 375213, 239876, 142840, 220592, 10781, -140457, 143930, 363621, 13316, -321576, 11774, 278868, 139725, 108660, 61142, 159621, 201826, -52799, 103226, -76547, -348085, 6866, -114733, 70080, 246499, -27994, 323935, 323900, 164892, 38675, 127460]
12673A27460I152a61770o936A78645c3212H0535h983o5519B13477A0933L89573
12662D00506L6368A90026J24910G0890j1682J82340K8886K9924f1293A55843K53952
12651D09795A06442b08163A64430n8650D343M7718c3329A37179D6725R7258J91225
12640C35208I2878a0697E0859B1221O8802O2341C8882J12067K06264f6593C05681
12628B98984n6049K3123g1860D7673J46676q5241O535J85453I4883J03714f9887
12616A41915e0697b1324A04689f0392r143J974c3332j20880J0297H2263a01496
12604b07962G5420O1414O3527q1139O0504E457J50080A9367J35216C8862b7135
12592A57322f854o4837E7753L3918k7109a36740L516j39474B49161p9266D7689
$$ y = [127460, 9152, -161770, -168706, 178645, -33212, 80535, -8983, -74502, 213477, 10933, 400506, 436874, 190026, 314936, 70890, 59208, 241548, 270434, 300358, -61293, 155843, 409795, 106442, -208163, 164430, 105780, 4343, 52061, -33329, 137179, 46725, 143983, 335208, 92878, -10697, 50859, 21221, 90023, 152364, 38882, 150949, 357213, -66593, 305681, 298984, 242935, 266058, -71860, 47673, 194349, 109108, 115643, 301096, 94883, 198597, -69887, 141915, -50697, -21324, 104689, -60392, -69535, -67561, -33332, -154212, -143915, 82263, -101496, -207962, 75420, 136834, 200361, 119222, 179726, 5457, 155537, 19367, 154583, 38862, -27135, 157322, -6854, -71691, 57753, 91671, 64562, -136740, -133224, -272698, 249161, 169895, 47689]
12580a61497A58347a82406N9751a5098A46453Q3085b02181j18854A91727a45729
12569a7315B1995K62376r8201p040a3741j57340j07039A40422J50402I2445f8779
12557B37003a2992H2676R943L58453a87002Q331j29974I2307a92779G8455K8451
12546A06906N703J03204a2833j24237A09019c46246a66829C2253b4163i211n0582
12535e9793A34703k786l9978a1444k9192A84487O3827J8990J19789j73486I2317
12523C3155J72711b22121A41664d74670B1362c5487A70243i4598F0684o106d43564
12511G2847J94309e8637j54669A80076i1254A51209b08270C11109j46639J05167
12501B69637A9616L3052J62494f3900B8209K86564c58279a53820C57466e7033
$$ y = [-161497, 158347, -182406, -122655, -15098, 146453, 229538, -202181, -321035, 191727, -145729, -17315, 21995, 284371, 186170, 179130, -13741, -171081, -278120, 140422, 290824, 92445, -68779, 237003, -12992, 82676, 92619, 451072, -187002, -178671, -308645, 92307, -192779, 78455, 106906, 112609, 215813, -12833, -137070, 109019, -346246, -166829, 32253, -24163, -9211, -59793, 134703, 131917, 91939, -11444, -40636, 184487, 248314, 267304, 387093, 213607, 92317, 33155, 205866, -222121, 141664, -474670, 21362, -35487, 170243, -94598, 60684, 54578, -443564, 72847, 267156, -58637, -213306, 180076, -91254, 151209, -208270, 311109, 164470, 269637, 19616, 52668, 215162, -63900, 28209, 314773, -358279, -153820, 357466, -57033]
12490h014E126J67741D5430c07585g686B9722M6798K78369f313k06054d5178a9712
12477G0428h3322C53344a46605A62287O8306m4768a70139C80441c90632B27964
12466d8330l63l17609A19494C7316A0727J20852K1832E071e9215j23082A04530
12454c962I8884i6611A22340d8507q2274d6051p0147B66165b04414A59341o1331
12443I8010Q7676o5235c85573a70324f5702A67156a5956k3663k62363A69198a78720
12431b57779I0096b93473F2069Q1278B533N6587f7887A44050a76045C07974e9461
12419A8295i8578d7440A27125D7358P7364R8063D1304M993e3441C4683A7054j890
12407A5164a06242p1014A35599b13318o770R4045c4589I6232H093L7690j091i3675
$$ y = [-8014, 5126, 172867, 45430, -307585, -7686, 29722, 76520, 354889, -6313, -212367, -45178, -19712, 70428, -83322, 353344, -146605, 162287, 230593, 185825, -170139, 380441, -390632, 227964, -48330, -48693, -366302, 119494, 37316, 10727, 131579, 153411, 5071, -59215, -182297, 104530, -3962, 98884, -96611, 122340, -48507, -130781, -46051, -116198, 266165, -204414, 159341, 98010, 185686, 120451, -385573, -170324, -65702, 167156, -15956, -39619, -301982, 169198, -178720, -257779, 90096, -293473, 62069, 143347, 2533, 59120, -67887, 144050, -176045, 307974, -59461, 18295, -98578, -47440, 127125, 47358, 124722, 222785, 41304, 46297, -53441, 34683, 17054, 15164, -106242, -177256, 135599, -213318, -220088, -126043, -34589, 96232, 8093, 45783, 44692, -93675]
12394A91178D4515C436O8714K00909a40495A17270f8300k48936D3088L66299a82850
12382a66760B20388c9038D0100c50304c6130B15999e4409j52084j36153H1403
12371G9212K64326a90579p6310D9441b52654C44893c5984p1024k90258A05337
12360G1231a79421l7729A5208h1042l5653c1634C30210C389b36583D3284b7768
12348B00089b59844d3815I7118g4645L7214G147R7126h0768B23742k57i4415B64373
12335d18036B62432h5010b5519A6678a5548B42333A9817c507H4544r133a13603
12323b77298a9224o583A13992L76696b0540A49992d2216B06924a06665A36890
12312C32942a90922b9797B61370a21180r4545F5629k919P3137N7104J4538d17352
$$ y = [191178, 44515, 3436, 72150, 273059, -140495, 117270, -68300, -317236, 43088, 409387, -182850, -166760, 220388, -39038, 40100, -350304, -36130, 215999, -54409, -206493, -342646, 81403, 79212, 343538, -190579, -266889, 49441, -252654, 344893, -35984, -107008, -397266, 105337, 71231, -179421, -217150, 15208, -81042, -116695, -31634, 330210, 3389, -236583, 43284, -27768, 200089, -259844, -43815, 97118, -74645, -37431, 7147, 104273, -80768, 223742, 223485, -94415, 264373, -418036, 262432, -85010, -25519, 16678, -15548, 242333, 19817, -3507, 84544, 75411, -113603, -277298, -19224, -25807, 113992, 490688, -20540, 149992, -42216, 206924, -106665, 136890, 332942, -190922, -29797, 261370, -121180, -215725, 65629, 62710, 135847, 192951, 207489, -417352]
12300C26645b30521A56005A0747a51038B78774A32154a41249F1261c04305a12493
12289B1196Q9103b79209C92899h469b654B82334o5327K071d27241a65779H8543
12277C38736j19579E876J93996K22154A31964B9239K5828e9438C33490i6189j57938
12266b54127d4763D23680A461L73209A06649m2771i3342c3694k805A00930b7316
12254C44625a03136B1125J54621J7667b2057j75286D0095a92199B10826d6208
12243C26246D0823b43675F2211o981b70481o5381i614C18731j52697a23201G2199
12231A19116J63073B5710L33172m8842A5628L11446j53685D9845P2531g0712d169
12219A85769J2884R9181j1961H2206L00602j53538l4024e2674j0569H8622a31137
$$ y = [326645, -230521, 156005, 10747, -151038, 278774, 132154, -141249, 61261, -304305, -112493, 21196, 110299, -279209, 392899, -8469, -2654, 282334, 217007, 219078, -427241, -165779, 88543, 338736, 219157, 5876, 199872, 422026, 131964, 29239, 55067, -59438, 333490, -96189, -254127, -44763, 423680, 1461, 374670, 106649, 63878, -93342, -33694, -36499, 100930, -27316, 344625, -103136, 21125, 175746, 193413, -22057, -197343, 40095, -192199, 210826, -46208, 326246, 40823, -243675, 62211, 55230, -270481, -335862, -9614, 318731, 166034, -123201, 72199, 119116, 282189, 25710, 358882, 310040, 15628, 327074, 173389, 49845, 122376, -70712, -4169, 185769, 198653, 297834, 285873, 82206, 382808, 229270, 195246, -52674, -63243, 88622, -131137]
12207E17488B8948J83653J25780a50112q874e5985I1757J76835C2081Q5051J47576
12196B64708j25598J1702k1643K9728b12532c6562B838K16234n7145E7999N5175
12185A13174J11692H9233R4716p4300l0051K18955j6584D5916J00202m6241b7891
12173A00114a10382C14115J03557A94683K8832R4893a2013l20673a41634B31452
12162C80193j86395d8439C3096c346q4863A28499K74086g9343D5646B2630J88279
12151B10909j03673g1826F9403c1373B19888a30279D0497J43209a48107D37128
12140i1570H9701J44736a47430L3916C06513A18504P7475a59288e5257p4849C71209
12128C5164A1976a414B19632F71P5614J94980a08415E22914b68609L1942B25351
$$ y = [517488, 28948, 212601, 338381, -150112, -158986, -55985, 91757, 268592, 32081, 117132, 264708, 139110, 150812, 129169, 158897, -212532, -36562, 2838, 219072, 161927, 57999, 113174, 224866, 89233, 183949, 109649, 79598, 298553, 281969, 45916, 146118, 99877, -27891, 100114, -110382, 314115, 417672, 194683, 223515, 318408, -12013, -332686, -141634, 231452, 380193, 193798, -48439, 33096, -3346, -88209, 128499, 402585, -79343, 45646, 22630, 210909, 107236, -71826, 69403, -31373, 219888, -130279, 40497, 183706, -148107, 437128, -91570, 89701, 234437, -147430, -113514, 306513, 118504, 195979, -159288, -55257, -130106, 371209, 35164, 11976, -1414, 219632, 671, 76285, 271265, -108415, 522914, -268609, -236667, 225351]
12116G6612a41288C91654A04307M19535k32296h1797G6404a01548j21545F5999
12105A67528a8538A21124k8191k7901Q0511a00828L4514j90091P1622b0785A2305
12093f9672B43509m0838a84635m721A04666J1159K3790J43981A22201a49823q6813
12082b36636A37374J43881b12813B46799m9711J89736j14808M73009J831906A011500
12071E16770A10798a93196a4310B33781a77969B35739b13488B72938A25425b35694
12060A04334a04361I0504i8838A3255e4062j84612h776B0963b28314L0332L9703
12049a58279e7194G9505K5174a74885P7733L8093K6072A15509d4563D3244J8729
12038F1973b85381A13545J96308o2526e7279p8862A01048A999c00721J49686D8064
$$ y = [76612, -141288, 391654, 104307, 523842, 291546, -81797, 76404, -101548, -223093, 65999, 167528, -18538, 121124, 92933, 65032, 145543, -100828, -66314, -256405, -184783, -20785, 12305, -69672, 243509, 202671, -184635, -189356, 104666, 115825, 139615, 283596, 122201, -149823, -236636, 137374, 281255, -212813, 246799, 197088, 386824, 272016, 745025, 2576931, 1011500, 516770, 110798, -193196, -14310, 233781, -177969, 235739, -213488, 272938, 125425, -235694, 104334, -104361, 90504, -98838, 13255, -54062, -238674, -8776, 20963, -228314, -197982, -158279, -57194, 79505, 104679, -174885, -97152, -59059, -32987, 115509, -44563, 43244, 61973, -285381, 113545, 309853, 247327, -57279, -136141, 101048, 1999, -300721, -151035, 48064]
12026A61190h8792c214I8305c0208E5815i5853E4134c6627B23953J04540A1887
12014B8861P8439C2618c61516A366c6059C21809j07997b27997J2258F6122J47076
12003B13198R6587e55377A84250c25660I85P2202P9896k4246J58901a9603G0545
11991f9815B23428p5130b353F949b40531a00086B04775k320h711G561Q1676l4148
11979E5089J02627J55899A16025h0437j00078F8685b42642g4245A89086q2234
11969A06852R2411a70538c4909A14353e47979a78942r9829C06903A33765a12526
11958A46233a93507o4262d6952A70574a76052L0365A34353a36685B38817I9680
11947a77534C40671c8636N060j00993C4384h5098q4336A06082a94054A70097j5063
$$ y = [161190, -88792, -3214, 98305, -30208, 55815, -95853, 54134, -36627, 223953, 328493, 11887, 28861, 107300, 32618, -361516, 1366, -36059, 321809, 213812, -227997, -215739, 66122, 213198, 309785, -555377, 184250, -325660, 985, 73187, 153083, 128837, 287738, -19603, 70545, -69815, 223428, 148298, -2353, 6949, -240531, -100086, 204775, 202455, -8711, 7561, 89237, 55089, 157716, 313615, 116025, -80437, -180515, 68685, -242642, -74245, 189086, 106852, 199263, -170538, -34909, 114353, -547979, -178942, -278771, 306903, 133765, -112526, 146233, -193507, -257769, -46952, 170574, -176052, -145687, 134353, -136685, 238817, 99680, -177534, 340671, -38636, -33576, -134569, 34384, -85098, -169434, 106082, -194054, 170097, 155034]
11936A55034D6416a76513A95060K0734a39538C30945g591o1179j80541D5574K83482
11925C29056A1923J71456B7271i7706A82963J25568a40841D79633k14366r9055
11915A66212c1462m10292D2209K06207g3621A6483J18447b3195O077k7656j80297
11904b25071D12681j82416a30563A05575a63316k22326B48746a37077F2662h4229
11893b98004A1127K70629b62131B9774c38624H1722a87181c3943j39618K6712
11883a46849e6699a9190k40038a13714r386c7325l498o3940A93927J66903d0716
11871i9482L9426r8520A53775a05984A30372m8446b60092a02947B38582b42689
11860a83283o9215h5915k80858C09265E2543a0211l9978B8869a19084D1240A5831
$$ y = [155034, 46416, -176513, 195060, 215794, -139538, 330945, -7591, -68770, -249311, 45574, 329056, 11923, 183379, 27271, -97706, 182963, 308531, -140841, 479633, 265267, 166212, -31462, -441754, 42209, 248416, -73621, 16483, 134930, -23195, -17118, -44774, -225071, 412681, 230265, -130563, 105575, -163316, -385642, 248746, -137077, 62662, -84229, -298004, 11127, 281756, -262131, 29774, -338624, 81722, -187181, -33943, -173561, -146849, -56699, -19190, -259228, -113714, -123100, -37325, -40823, -104763, 193927, 360830, -40716, -99482, -60056, -158576, 153775, -105984, 130372, 81926, -260092, -102947, 238582, -242689, -183283, -252498, -85915, -366773, 309265, 52543, -10211, -50189, 28869, -119084, 41240, 15831]
11848D5124a69778b5478q1407A43955h1091H7355b9860B89815b98841K1282f0529
11836E023P9222a75910A89710E568J9299h5389A49398o4481b92820A78378a36312
11824f8513H451b30097i2366A85919o5162j5845c69642C42900b6649A28497l9943
11813H8554b42785a1202r9171a0282o1523p1683A10833N7005J30044F3964k4422
11802C9542K28065A18256d8545j32412E1024b03075A23451b62489B5491M1506
11792F6997J47612i2919C9546a26204A0918h7626j42308B73103a571B0092p7a85005
11779F2409l010J11527k905a29855C0228a46000M9962j23064a5050k2725A18125
11767d648j27839G1169L1706J54812d65060a9573k70068B3180J34770k6624a42705
$$ y = [45124, -169778, -25478, -106885, 143955, -81091, 87355, -29860, 289815, -298841, -277559, -60529, 5023, 84245, -175910, 189710, 5568, 24867, -85389, 149398, 84917, -292820, 178378, -136312, -68513, 8451, -230097, -92366, 185919, 120757, 104912, -369642, 342900, -26649, 128497, 88554, -242785, -11202, -110373, -10282, -71805, -143488, 110833, 167838, 297882, 63964, 39542, 267607, 118256, -48545, -180957, 51024, -203075, 123451, -262489, 25491, 66997, 214609, -92919, 39546, -126204, 10918, -87626, -229934, 273103, -1571, 20092, 20015, -185005, 62409, 59399, 170926, 168021, -129855, 30228, -146000, -96038, -219102, -15050, -37775, 118125, -4648, -132487, 71169, 102875, 257687, -465060, -19573, -289641, 23180, 157950, 131326, -142705]
11755e2154G2093L09275I8387J92025a79103f9013D15622e4220b2025A35941a94
11743d91r9432H3843f425B38343e1735j98451C40928a64454D6184i5329j13126
11732b08455e1669k1073j28484K4187B85357H0073a0444j6200k5477J1890q0292
11721a20523A77409J71021d1922J1026j6591B17836a12641a9450C721b5028p7344
11710a02372A32535a24641A73934c0769m546B73994G0446Q2697N1421J03175A18766
11698a67349C53948a18016B83681a24274p2240C82756G4552P3474a55281J5500
11688a39781A9398N1622J40780r8355b25102a04471A44638E9589J26055a1383
11677a58578L6714A6581h9949j03171I8409B068i1590n561B2895g3390j02432
$$ y = [-52154, 72093, 381368, 98387, 290412, -179103, -69013, 415622, -54220, -22025, 135941, -194, -491, -99923, 83843, -6425, 238343, -51735, -250186, 340928, -164454, 46184, -95329, -208455, -51669, -72742, -201226, -177039, 285357, 80073, -10444, -26644, -52121, -40231, -120523, 177409, 348430, -41922, -30896, -47487, 217836, -112641, -19450, 3721, -25028, -102372, 132535, -124641, 173934, -30769, -35315, 273994, 70446, 153143, 204564, 307739, 118766, -167349, 353948, -118016, 283681, -124274, -196514, 382756, 74552, 148026, -155281, -139781, 19398, 71020, 211800, 113445, -225102, -104471, 144638, 59589, 185644, -11383, -158578, -121864, 16581, -89949, -193120, 98409, 2068, -91590, -97151, 22895, -73390, -175822]
11666a75822D7630d382j72372e4592j35724b5740j07944B31985c0017I1123Q5039
11655A76162F2380L3195k2446P6249c00693m3042A32025F2824b6738I7644e2435
11643F8864d0383D973a02688k98856E7973J99659h3095k15497A2923a19609K1448
11632i8161A44922L26687j69257h9890A16648k0504a2631B5207H417a54270B88816
11620A3685J09755D4948M0511l9261a53312A71880O0739h2874j26793A32364e6145
11608A44210e338A12J51665n2652J04549L6000i1239C74220A08505J92388C9135
11596C0100f2854I201J32244J3743B2894a21305I8195J39005J96600j90353g6105
11584I1619J7167a20412A15409P5763J40948e7880j56429C84119H4308a72915
$$ y = [-175822, 47630, -4382, -176754, -54592, -190316, -25740, -133684, 231985, -30017, 91123, 176162, 62380, 95575, 73129, 149378, -300693, -343735, 132025, 62824, -26738, 97644, -52435, 68864, -40383, 4973, -102688, -401544, 57973, 257632, -83095, -298592, 12923, -119609, -98161, 144922, 471609, 302352, -89890, 116648, 96144, -12631, 25207, 8417, -154270, 288816, 13685, 123440, 44948, 85459, 46198, -153312, 171880, 232619, -82874, -209667, 132364, -56145, 144210, -5338, 112, 151777, 99125, 203674, 239674, -91239, 374220, 108505, 300893, 39135, 30100, -62854, 9201, 141445, 155188, 22894, -121305, 98195, 237200, 433800, 243447, -76105, 91619, 108786, -120412, 115409, 191172, 332120, -57880, -214309, 384119, 84308, -172915]
11573A56077d7543j25149c2024j42920f3953A18484D363J98309I1983J34292a455
11561A21763b9864D35443D6097K53710q8327I794b50074a14560D03915j21977
11551B81938D7300O5764c97C37262B0664M7856J84725o4855b1486I8446J64865
11540B63311e578H2289J73967D4971b27841B65980b47684A94657a57851B60725
11529a71096A45515L38058H3191P7184L7774E931J60933P3116H5191f8846A30015
11517D6551p28K22718M0894j49582L34099b7463l4145i422D12707j62788I0836
11505a06043A51828B3095a83550Q1459B17179F1149c0039j1340j13227D04482
11494h8044B54696j15444J14919o3169C0380J39799l6d2803B38678M7456n2156
$$ y = [156077, -47543, -172692, -32024, -174944, -63953, 118484, 4363, 202672, 91983, 226275, -1455, 121763, -29864, 435443, 46097, 299807, 211480, 9794, -250074, -114560, 403915, 281938, 47300, 113064, -397, 337262, 20664, 68520, 253245, 188390, -21486, 98446, 263311, -5578, 82289, 256256, 44971, -227841, 265980, -247684, 194657, -157851, 260725, -171096, 145515, 483573, 83191, 160375, 198149, 5931, 166864, 239980, 85191, -68846, 130015, 46551, 45823, 268541, 309435, 159853, 493952, -27463, -61608, -9422, 412707, 249919, 90836, -106043, 151828, 23095, -183550, -102091, 217179, 61149, -30039, -41379, -154606, 404482, -88044, 254696, 139252, 254171, 191002, 30380, 170179, 170143, -42803, 238678, 286134, 233978]
11483B33978b49984B7553c4027J2793A79225K73577A1448K68640P2860l4699J3865
11472C32114d6869A91219k0544P3829C1900J3226h3607C78215Q6810C8586a39012
11460f6385k46048C28589a34664J6360B33272J08157m6665A248N8386n692N7610
11449A11552j8503e2227F050M47328a12968k09925h1696A94718n2696K74672p1436
11438C45258A3144j008L01889D7601J970O9059b9569A68554F4342a68512C3109
11426a13307j04165K4738A71787m2579A7261J82477a56610b6752A27821J12817
11416B40638E1554h3242r0707N5750E4468J23100a50207m9035A71309p81a21210
11404A85353o8181J2455P8613F0125M0916K36045d1624D92207q4199j51407e166
$$ y = [233978, -249984, 27553, -34027, -21234, 179225, 452802, 11448, 280088, 352948, 318249, 332114, -46869, 191219, 170675, 244504, 31900, 45126, -83607, 378215, 465025, 38586, -139012, -66385, -312433, 328589, -134664, -118304, 233272, 341429, 294764, 1248, 59634, 53942, 111552, 93049, -52227, 6050, 453378, -112968, -322893, -81696, 194718, 142022, 416694, 345258, 13144, 12136, 314025, 47601, 49571, 118630, -29569, 168554, 64342, -168512, 33109, -113307, -217472, -192734, 171787, 129208, 17261, 199738, -156610, -26752, 127821, 240638, 51554, -83242, -173949, -118199, 54468, 177568, -150207, -199242, 171309, 170528, -121210, 185353, 117172, 129627, 208240, 60125, 101041, 337086, -41624, 492207, 408008, 256601, -5166]
11392C08496a81265E2164J2583b47040j7754I6786B537K4939a93933i6522B57518
11380C04887a93869A00777i7580B05817a16139E7443B5506J08916b9739o1956
11370i1695d3693j12351c4691A00909b2214o8481k4140E10b26122e8328A58863
11358C38590e620q6611a1693G864b10821d6401p7249e2818J0624N158j31735N2004
11346a16767A9483b8494o1021F5313b13789A07539C5712j2713J03427E0054e7560
11334g7190n8438A59294c1443j667o1291j25909h4104j54850h7944A26740d8768
11322H6616L096a54533L6166j30656B56830b45575e8359a9824A49328a85758g7770
11310a34276J962l7102I3497e6139j39599L9066L3470M7556C5137b71594A20811
$$ y = [308496, -181265, 52164, 64747, -247040, -264794, 96786, 2537, 27476, -193933, -96522, 257518, 304887, -193869, 100777, -97580, 205817, -116139, 57443, 25506, 134422, -29739, -91695, -43693, -156044, -34691, 100909, -22214, -90695, -114835, 510, -226122, -58328, 158863, 338590, -5620, -92231, -11693, 7864, -210821, -46401, -123650, -52818, -42194, -37036, -168771, -116767, 19483, -28494, -89515, 65313, -213789, 107539, 35712, 22999, 126426, 50054, -57560, -77190, -135628, 159294, -31443, -33110, -94401, -220310, -84104, -238954, -87944, 126740, -48768, 86616, 89712, -154533, -118367, -249023, 256830, -245575, -58359, -19824, 149328, -185758, -77770, -134276, -132314, -169416, 93497, -56139, -195738, -156672, -123202, -75646, 35137, -271594, 120811]
11298D3665N1122R3215b8004C60076f2462B3071b69444Q2851H9865c85432a41797
11286c47112N6930a4921I4249J0374K00104A01854a17549A77781m4739b27244
11275h4510q0427A15631K47537j67497o3978e868k37319h889l55613c6115J7620
11264a8495A66815H2296J1356K2376f9830n56b0900l12993J03326g693A68188
11252A10664b31054F2667o222J59386a86501j88233F6529d19438a0790j20441
11242a31231j64474a41726D429d7082A52994h190j89573N7719D6644a31205j10679
11231b41884M104d3760H7254K1179L14110A83420K3287a81624B2131e1287a9505
11219G3947O5046B6403J2456A1327K10665c20505J22406d087A82647G5759N4537
$$ y = [43665, 94787, 188002, -28004, 360076, -62462, 23071, -269444, -186593, 89865, -385432, -141797, -347112, -290182, -14921, 94249, 104623, 304727, 101854, -117549, 177781, 133042, -227244, -84510, -164937, 115631, 363168, 195671, 131693, -5868, -243187, -8889, -364502, -36115, -18495, 166815, 82296, 93652, 116028, -69830, -70386, -20900, -333893, -230567, -7693, 168188, 110664, -231054, 62667, 56445, 215831, -186501, -374734, 66529, -419438, -10790, -131231, -295705, -141726, 4429, -47082, 152994, -8190, -197763, -140044, 46644, -131205, -241884, -237780, -43760, 87254, 108433, 422543, 183420, 206707, -181624, 22131, -51287, -19505, 73947, 138993, 26403, 38859, 11327, 221992, -320505, -198099, -4087, 182647, 75759, 130296]
11208A30296a6818C93972b00440a277l5838j65965A49961b26576l5035A2136a1747
11196F3472a97087j51577J66394r9975C10336m8074c4205a6647A53171b13793
11185a20485j13114A59062L1698h2852j42836A54989b09553L0216F7331c15611
11174a52034c0832A01098a69133G9237d7696l08072I2478a9258k39839A4072K2498
11163C6570d2673B3647g9053L7185n9506j82425A44007f3367k72666G0909b95964
11151e8931j77867e8756E243a72901F0612c2247A7544a47929E2771J37808E0759
11139C7522N5860a05317l713k0225B2970K26471b480k57380a2308l03694A29206
11127B4221K5035P4987j9676M8314B0929L55908j44645I3494j1172a1646j98055
$$ y = [130296, -16818, 393972, -200440, -1277, -37115, -203080, 149961, -226576, -261611, 12136, -11747, 63472, -197087, -348664, -182270, -282245, 310336, 262262, -34205, -16647, 153171, -213793, -120485, -233599, 159062, 190760, -82852, -225688, 154989, -209553, -179337, 67331, -315611, -152034, -30832, 101098, -169133, 79237, -47696, -355768, 92478, -19258, -259097, 14072, 36570, -42673, 23647, -79053, -41868, -101374, -283799, 144007, -63367, -336033, 70909, -295964, -58931, -236798, -58756, 5243, -172901, 60612, -32247, 17544, -147929, 52771, 190579, 50759, 37522, 93382, -105317, -109030, -129255, 22970, 249441, -2480, -259860, -12308, -316002, 129206, 24221, 49256, 124243, 104567, 152881, 20929, 376837, 232192, 93494, 82322, -11646, -209701]
11116b09701H9692d8518D21758a23628A61530K91968g6444A88658b93003A6591
11105A69296a48322C12062I4832C5078f5103C01085j2247o8900I9915P9967J56208
11094C36090H2706J76734a36134G0979J27009l9489N6717p9859L18325A36619
11083A85693K52409a38794B54526O1072R0253A49971N17161B55303J25279j24515
11073B56067K7645R6923q9223p5920J0237K23241K65633B34659J77098J31413
11063E43170j3695J60052C41081J00036P6619J51528J62205L8941k69020K33029
11053H34419r7968Q2703j39951J26568p7966N16164m47060k16889k73242M20750
11043G27528p1664P2425j47997K57079l19271M00273m55696K72335j35825O8250
$$ y = [-209701, 89692, -48518, 421758, -123628, 161530, 453498, -76444, 188658, -293003, 16591, 169296, -148322, 312062, 94832, 35078, -65103, 301085, 288838, 219938, 99915, 179882, 336090, 82706, 259440, -136134, 70979, 197988, 158499, 215216, 135357, 453682, 136619, 185693, 438102, -138794, 254526, 315598, 405851, 149971, 667132, 255303, 380582, 256067, 283712, 380635, 291412, 215492, 225729, 448970, 714603, 234659, 411757, 543170, 529475, 689527, 341081, 441117, 517736, 669264, 831469, 870410, 601390, 834419, 736451, 819154, 679203, 805771, 727805, 1243969, 796909, 580020, 306778, 727528, 655864, 728289, 580292, 837371, 518100, 918373, 462677, 735012, 599187, 667437]
11033F67437l2040p678O0958j86002k13058O00061j69877K38866o498k65525R6776
11022G83420l66001K3585N8962k7960J27346j49404K87281j20816r4741q3674
11012D37998J78648k14863L94109j69913J5454k04855R9154R3972l0636L31216
11002I30284m14999J35542j52312N17191m09640j91005J30106L48429j70880r7743
10992F24973q3317L27476J94065Q7479k38137K81849k30455k02591J62776M08550
10982A332668k54008L26093k95867J95538j1682K33459K43562L27458M63819L06777
10972B867817j61071N36333l41788k57344j86891K6394m12772k03372l33223n2791
10962A481292J11462k00513J75934k8276K16217q0229j02143m9327j56893M4577
$$ y = [667437, 635397, 627719, 688677, 502675, 289617, 889678, 719801, 958667, 952169, 686644, 783420, 417419, 441004, 499966, 472006, 599352, 449948, 737229, 616413, 521672, 437998, 616646, 401783, 795892, 625979, 641433, 436578, 535732, 629704, 599068, 930284, 515285, 650827, 498515, 1015706, 606066, 415061, 545167, 893596, 722716, 624973, 541656, 869132, 1063197, 1150676, 912539, 1194388, 963933, 761342, 924118, 1332668, 1078660, 1404753, 1108886, 1304424, 1292742, 1526201, 1769763, 2097221, 2561040, 2867817, 2706746, 3243079, 2901291, 2643947, 2457056, 2483450, 2070678, 1867306, 1534083, 1481292, 1592754, 1392241, 1568175, 1539899, 1756116, 1675887, 1573744, 1524417, 1367524, 1412101]
10952A412101k80454o6982k36115C21818O40972C88594K40405B93850A26486L82037
10942E08523A33734h2118A10307L36231d5792B71869R0648G9841d8021j266B43995
10930G2058c8997d608D73631a16989C43555J08391A67206b32533g3482A99860
10919b11219Q4447F1862d91227D01092A19231J11006a65965g0311j17099B53746
10908c5856A20127b6624E2892K57385A50678J22317K75469B5722P7417d10725
10897a38545G1460a71039j11838h2169o9976D0556b58817i7555H985a25615N9855
10886f5760j106D0260M5944k1401a48207D4929a93233f5041j25159b5613B99429
10874b11731A21734q991h2637j53529a07819B47741C3634P9704c00686A53245
$$ y = [1412101, 1131647, 1064665, 828550, 321818, 962790, 388594, 628999, 293850, 126486, 508523, 133734, -82118, 110307, 446538, -45792, 271869, 362517, 79841, -48021, -49287, 243995, 72058, -38997, -4608, 473631, -116989, 343555, 451946, 167206, -232533, -73482, 199860, -211219, -126772, 61862, -491227, 401092, 119231, 230237, -165965, -70311, -187410, 253746, -35856, 120127, -26624, 52892, 310277, 150678, 272995, 548464, 25722, 103139, -410725, -138545, 71460, -171039, -282877, -82169, -152145, 40556, -258817, -97555, 8985, -125615, -65760, -66866, 40260, 86204, 64803, -148207, 44929, -193233, -65041, -190200, -25613, 299429, -211731, 121734, 112743, -82637, -236166, -107819, 247741, 33634, 113338, -300686, 153245]
10863a67755d7160p2220j11233I3760P8736f9726G587J36191b30300I6875b86788
10851E7801b04886C7613J66070c2299j63166D8439J42b79761B3831a20476k33510
10840c53986C2869K46334B6643K28711a40611j49220b8613C0431K60442a68589
10829C6205J3322f470A44686p1401A1789J41451a83246C23116E6694B023a30483
10817b97043J41554G287a22356A2768a97753A22280B5413J10450c17035i9958
10806f9427C34117A65241o6683c31882A3891J1375J07416d2619A47976h1783A08796
10794A8401e21567B9830a22985A5475R7333i0245E2997b0868F1999b4574B9971
10782b96915a20420A50500b99359B5779a66080h2199F2164i8598m1288A5200a67382
$$ y = [-167755, -47160, -119380, -230613, 93760, 172496, -69726, 7587, 143778, -230300, 96875, -286788, 57801, -204886, 37613, 203683, -32299, -195465, 48439, 48581, -279761, 23831, -120476, -353986, 32869, 279203, 26643, 255354, -140611, -289831, -28613, 30431, 290873, -168589, 36205, 49527, -6470, 144686, 73285, 11789, 153240, -183246, 323116, 56694, 2023, -130483, -297043, -155489, 7287, -122356, 12768, -197753, 122280, 25413, 135863, -317035, -99958, -69427, 334117, 165241, 98558, -331882, 13891, 25266, 132682, -42619, 147976, -81783, 108796, 18401, -521567, 29830, -122985, 15475, 112808, -90245, 52997, -20868, 61999, -24574, 29971, -296915, -120420, 150500, -299359, 25779, -166080, -82199, 62164, -98598, -139886, 15200, -167382]
10770a19463L7760m4073M2391M1030k8809j07439f2816m2577j03318g8109E4477
10758a52957p6122P048A35987a66278D3359J54206q1497J18807j00841n7269a84687
10746c12861a35747M1023A67379b05371e2708m010q5516b4358A3275h2312B10312
10734i4583B2100d9794k06008A683d1831k5404A61844d13546a54770f2533A40629
10722h290b624G6453e2009j13970j20142L6766J14057A72144a31797j60720a25761
10710C7484C565c25227J34644g1277C4049J39254b76974c2742j7044k04131h54
10698b57274j85207a30157A35392b75939i3200G2633B0679b3171l6328A8709a64114
10686a91023P2244J6755J2294B29171J18546I3673i6540j32200F2192j0806a65121
$$ y = [-119463, -81703, -125776, -83385, -42355, -71164, -178603, -62816, -105393, -208711, -78109, 54477, -152957, -229079, -222031, 135987, -166278, 43359, 197565, 116068, 234875, 134034, 76765, -184687, -312861, -135747, -94724, 167379, -205371, -52708, -56718, -142234, -24358, 13275, -82312, 210312, -94583, 22100, -49794, -255802, 1683, -41831, -67235, 161844, -413546, -154770, -62533, 140629, -8290, -2624, 76453, -52009, -165979, -286121, -249355, -135298, 172144, -131797, -292517, -125761, 37484, 3565, -325227, -190583, -71277, 34049, 173303, -276974, -32742, -49786, -253917, -854, -257274, -442481, -130157, 135392, -275939, -93200, 72633, 20679, -23171, -59499, 18709, -164114, -191023, -118779, -102024, -89730, 229171, 347717, 93673, -96540, -228740, 62192, 51386, -165121]
10674b70627B81033d60041D413b01968a5083A30008a26130A47597m9381B0112
10663a0302k34082L9221i8979c1070B1993M7593q437a64003N2348D4176K59008
10652C03184a09262j11960A84661a47486I500a68181P7959j97696a03283p3213
10642a76496L424n7258B6631N5154c84141J26256N2085B74399a69208A17700b36315
10630b98373I9159J28157f8243A9951g6922r2130d4253B79022b45024L6187E0229
10618a92357M1157J5537r6778p6630A1210i3455c4182A82958a44351k7299C76788
10606B13878a34666A91035a32397e4929B6384b19542a08605n0933D2214i3530
10595b43518B33307f5903j65616b4269j02629B11970a04717j35088P4822f4153
$$ y = [-270627, 281033, -460041, 4413, -201968, -15083, 130008, -126130, 147597, 98216, 20112, -10302, -244384, -205163, -98979, -31070, 21993, 69586, 61149, -164003, -111655, 44176, 303184, -109262, -221222, 184661, -147486, 9500, -168181, -90222, -287918, -103283, -176496, -173072, -230330, 26631, 81785, -384141, -257885, -205800, 274399, -169208, 117700, -236315, -298373, 99159, 227316, -68243, 19951, -76922, -169052, -44253, 279022, -245024, -208837, 50229, -192357, -151200, -135663, -232441, -309071, 11210, -93455, -34182, 182958, -144351, -171650, 376788, 213878, -134666, 191035, -132397, -54929, 26384, -219542, -108605, -159538, 42214, -93530, -243518, 233307, -65903, -231519, -24269, -126898, 211970, -104717, -239805, -164983, -64153]
10584A30668Q093e0893C75057e8198j58556A76274a53721k50584J74164m5298
10574b75439H0580J61817a49253D7556a78554J6312k4811j25819O2253E5739h9792
10562A3477c57918A95284b21097J1795k36064C0021J25550G073a55720A62656
10551B84657A409c78252H6505g6170B8010a00220M0569j0778A49456a0449m6169
10540e6618p9229M1869B9081R9283g0874A45280K02112A8215a05769B6153J37686
10529A63839p198b137A09317N326L5087B9936a61951f0806m5284D0040E192a26270
10516A47521i0547l3481B5882b2678A47740b31268C97827A48300l8799J65012
10506B74513D4618N3736j3440a64349Q2095J9077j9902i067B95339a83307O9070
$$ y = [130668, 138761, -50893, 375057, -58198, -216754, 176274, -153721, -404305, -230141, -275439, 80580, 242397, -149253, 47556, -178554, -162242, -187053, -312872, -250619, 55739, -89792, 13477, -357918, 195284, -221097, -209302, -445366, 30021, 155571, 7073, -155720, 162656, 284657, 1409, -378252, 86505, -76170, 28010, -100220, -59651, -70429, 149456, -10449, -56618, -135847, -93978, 29081, 128364, -70874, 145280, 347392, 18215, -105769, 26153, 163839, 156641, -2137, 109317, 114643, 149730, 29936, -161951, -60806, -106090, 40040, 5192, -126270, 147521, -90547, -124028, 25882, -22678, 147740, -231268, 397827, 148300, 109501, 274513, 44618, 98354, 84914, -164349, -82254, -63177, -83079, -9067, 295339, -183307, -114237]
10495a14237I0236k478D3577a62834b6303I41J32654c1194C21415b14062i917
10483G5441L07990A12071N65850p8650B80841j648n2661D5557f3028j78316A15359
10471F6512a38842j20315J02206A19312J37679a00975j3153G414R4003c49748
10460a04525C8408b12286A36276b75139D1818c61958A98540C894J57182a11351
10449a05242B03557G8019b28205P4672e1554j67310d4694k49268G1388i0545I8719
10437g6119C4230i4532F8900b29759N5758j25055J38610F033J64078A1331J91574
10426B02905B1465g0606D2464d6015j13026I8064a79135q0838D1120A8957c9502
10414A18802b27711J06880J835A88672b85019a28024d0842A89204B6374P7321
$$ y = [-114237, 90236, 87758, 43577, -162834, -26303, 941, 133595, -31194, 321415, -214062, -9917, 75441, 383431, 112071, 677921, 599271, 280841, 279193, 226532, 45557, -63028, -241344, 115359, 66512, -138842, -259157, -156951, 119312, 256991, -100975, -114128, 7414, 101417, -349748, -104525, 38408, -212286, 136276, -275139, 41818, -361958, 198540, 3894, 161076, -111351, -105242, 203557, 78019, -228205, -153533, -51554, -218864, -44694, -293962, 71388, -90545, 98719, -76119, 34230, -94532, 68900, -229759, -174001, -299056, -160446, 6033, 170111, 11331, 202905, 21465, -70606, 42464, -46015, -159041, 98064, -179135, -259973, 41120, 18957, -39502, 118802, -227711, -120831, -118996, 188672, -285019, -128024, -40842, 189204, 26374, 103695]
10404A03695L12902j70672E4795a6028j76704B43245G5926J62790d028j08915
10394a12943j6053D68149A40955B3386J20095J52373A06095a20837B02013F7595
10383F2169a47534C22344I9835R2258h154q5560B22366K11048j87073L4073d890
10371B37417o3872G884J49974J80857K10175M1208J89529j53887l01663j27901
10361A96176l756J4029J02017G7482a28108A90734a8116c616B8044N08288L9866
10350E76198j02147n9479J09834j22641r7450B5076K95807n2494J18514n1585
10340C35318j15610j164b63797J23005A74771g3507j25345A35786m6676B4391
10329B33876a4167A87272J95867A51336a57379N4658C87120A50840O9889K09950
$$ y = [103695, 416597, 245925, 54795, -16028, -192732, 243245, 75926, 238716, -4028, -112943, -128996, 468149, 140955, 23386, 143481, 295854, 106095, -120837, 202013, 67595, 62169, -147534, 322344, 99835, 192093, -8154, -93714, 222366, 433414, 246341, 280414, -4890, 237417, 173545, 7884, 157858, 338715, 548890, 590098, 779627, 625740, 324077, 196176, 192420, 206449, 308466, 77482, -128108, 190734, -18116, -3616, 28044, 536332, 576198, 474051, 414572, 524406, 401765, 304315, 25076, 320883, 268389, 386903, 335318, 219708, 218544, -263797, -140792, 174771, -73507, -198852, 135786, 89110, 24391, 233876, -14167, 187272, 383139, 151336, -157379, -102721, 387120, 150840, 220729, 430679]
10319D30679n2560j50431d2573B15790l623J43843A69125B3444j418J50373H2073
10307a62717A52383J62725c6075j67094B75900b2098j80309A71850F3386Q0584
10297A43970a17213e4186j95398A13551a44980e4461D61814H7998a31584B05927
10286a514r6509j86342f8282j005k85029f3681B73943B6878a89391q2855h4784
10274C95684A29825N7792g9825m7791I1724a00815G6058o605K03242a42804j57349
10263c00153g8250l539J2988A84768J8405J50234A76265R4296C8803a16230k3880
10252a40110J9393j34392A65847O1129e44A28672b47911n9320p0411g5736F4035
10240a29089E1945b34939D7041J25617b43583J1550I2395B825b813j03619q8712
$$ y = [430679, 378119, 227688, -42573, 215790, 212167, 356010, 169125, 23444, 22026, 172399, 82073, -162717, 152383, 315108, -36075, -203169, 275900, -22098, -202407, 171850, 63386, 143970, -117213, -54186, -249584, 113551, -144980, -54461, 461814, 87998, -131584, 205927, -1514, -98023, -284365, -68282, -69287, -354316, -63681, 273943, 26878, -189391, -272246, -84784, 395684, 129825, 187617, -79825, -127616, 91724, -100815, 76058, 69453, 272695, -142804, -300153, -78250, -81789, -68801, 184768, 203173, 353407, 176265, 270561, 38803, -116230, -140110, -120717, -255109, 165847, 226976, -544, 128672, -247911, -307231, -377642, -75736, 64035, -129089, 51945, -234939, 47041, 172658, -243583, -232033, 92395, 2825, -2813, -106432, -195144]
10229a95144f1381j53326E6793H671J01859h6449k3945e0272r9972j66012A91853
10217c4140j82491F9122a514q4465r8122j10919a04115p313k31043a1007A42983
10205A90201a8722m88980F7833a96353d1204B01572d32253A1792J51389q871G6257
10193D16290c5726A98248b59995c9982A56477a05145A34233J54559d1926b0712
10182d80814B84108a75623d5025j9702k1900k07123A82830Q418n6150F1706a53829
10170a34223j59794N0383e1819o9324A12018E4221L8410e87968b30517h0329l4069
10159a14398G0230g7123C021J37749a29565A71061i2086G8837a7333B31694A8643
10147b60253A244b64216B19987H9849L539L2304a50412a9181o0381j20797M8358
$$ y = [-195144, -61381, -214707, 56793, 8671, 110530, -86449, -110394, -50272, -150244, -316256, 191853, -34140, -216631, 69122, -1514, -85979, -184101, -295020, -104115, -111428, -342471, -11007, 142983, 190201, -18722, -507702, 67833, -196353, -41204, 201572, -432253, 11792, 163181, 154310, 76257, 416290, -35726, 198248, -259995, -39982, 156477, -105145, 134233, 288792, -41926, -20712, -480814, 284108, -175623, -45025, -64727, -86627, -293750, 182830, 191248, 135098, 61706, -153829, -134223, -294017, -243634, -51819, -121143, 112018, 54221, 92631, -587968, -230517, -80329, -114398, 70230, -77123, 3021, 140770, -129565, 171061, -92086, 78837, -17333, 231694, 18643, -260253, 1244, -264216, 219987, 89849, 93388, 125692, -150412, -19181, -79562, -200359, -152001]
10136a52001K4024o0699b6214l5292q7215o5997F011J49015l0767f9828C84378
10124C4064e9701A7339J11349f6083k52192k1483A82317g5398k4239J04G0519
10112b1105A18321h3275n2500k33100B80761D0246Q8084a90201A91443e6943p2477
10101a29420A4013b76011C30444c47687J23350A62048c10934P6998c3911B11142
10090G1949a10141b5427m8187k21076C6754b96969P9397l00354A67138a58508
10079A54052c65015G7651L4053d46668J71596D0799O0624a14418b3440E3063e2932
10067A52503a1249B48173I6500j8383c39488Q8313f8556H3173K01572B3256e4770
10055b24023c0989h220A08275J65895r5644c74823C7011g4362A82887b208k73224
$$ y = [-152001, -127977, -188676, -26214, -61506, -148721, -214718, 6011, 155026, 124259, -69828, 384378, 34064, -59701, 17339, 128688, -66083, -318275, -339758, 182317, -75398, -99637, -99533, 70519, -21105, 118321, -83275, -135775, -368875, 280761, 40246, 128330, -190201, 191443, -56943, -129420, 14013, -276011, 330444, -347687, -224337, 162048, -310934, -233936, -33911, 211142, 71949, -110141, -25427, -73614, -294690, 36754, -296969, -217572, -517926, 167138, -158508, 154052, -365015, 77651, 111704, -446668, -275072, 40799, 101423, -114418, -23440, 53063, -52932, 152503, -11249, 248173, 96500, 78117, -339488, -251175, -68556, 83173, 284745, 23256, -54770, -224023, -30989, -8220, 108275, 274170, 178526, -374823, 37011, -74362, 182887, -2208, -275432]
10044b75432e6964B2253O9131J17989N7109a36699A37012B0993a78267R911C4424
10032a94051A90554e9367m2167A70479o6042b80559k01154b33130h3424m4256
10022a27680C41756A62593J6445a84095f6850l16321D2056a96018h3573B41384
10011c28084h3866A4410K96149A41123k6548b45769r6880a32454j32539B01425
10000i9542C03957A4314c35476J60960B5986a81381O8008o4328j08100a14145
9989A6656p840K07830a54243B23996Q9254d28566f8472n4228m27218D2585b3303
9977a57092G5825d7690A88485e1522A2908J21284c8326A9580e2838l63498e6280
9965G0310h5293A32350A1531a95369j12647R2412N9996f9549A47445M2517I034
$$ y = [-275432, -56964, 22253, 91384, 209373, 266482, -136699, 137012, 20993, -178267, -168356, 34424, -194051, 190554, -59367, -101534, 170479, 104437, -280559, -481713, -233130, -83424, -127680, 341756, 162593, 179038, -184095, -66850, -383171, 42056, -196018, -83573, 241384, -328084, -83866, 14410, 310559, 141123, 114575, -245769, -342649, -132454, -264993, 201425, -99542, 303957, 14314, -335476, -174516, 25986, -181381, -113373, -177701, -285801, -114145, 16656, 8816, 216646, -154243, 223996, 313250, -428566, -68472, -122700, -549918, 42585, -23303, -157092, 75825, -47690, 188485, -51522, 12908, 134192, -38326, 19580, -52838, -416336, -56280, 70310, -85293, 132350, 11531, -195369, -308016, -215604, -155608, -69549, 147445, 189962, 9034]
9953B75155a62102A26756g3340n2696A3205a18491A14493C5959a50668p1163J03541
9942a18290C2511a44348c6948r7700j07767H3105a01791G0255a88983P8826j72819
9931b82976j65504a93248b2773A29469c90377B4073K0481a39096K1499C29921
9920b0586k73109n6833a50019k39791A90771E8605K9998a88388d0445j80399e8141
9908f8094k7270C6256G370b74457e0893b2519j62731P2576H829b4405B89070E1516
9895g1197A2743b4579l28928a29801b4060C8685c17118J6689A72183a05063E4047
9883G0364J62746a59058N0526N1465j17306f5243j51225c0551B28457M6722a54492
9871A65064O965a47193k03720e0414A03308m8390c25810J4473F5539a90057O2335
$$ y = [275155, -162102, 126756, -73340, -126036, 13205, -118491, 114493, 35959, -150668, -221831, -118290, 32511, -144348, -36948, -134648, -242415, 83105, -101791, 70255, -188983, -110157, -282976, -448480, -193248, -22773, 129469, -390377, 24073, 44554, -139096, -117597, 329921, -20586, -293695, -350528, -150019, -389810, 190771, 58605, 88603, -188388, -40445, -220844, -58141, -68094, -95364, 36256, 7370, -274457, -50893, -22519, -185250, -112674, 8829, -24405, 289070, 51516, -71197, 12743, -24579, -353507, -129801, -24060, 38685, -317118, -300429, 172183, -105063, 54047, 70364, 233110, -159058, -108532, -57067, -174373, -65243, -216468, -30551, 228457, 275179, -154492, 165064, 172029, -147193, -350913, -50414, 103308, 54918, -325810, -311337, 65539, -190057, -127722]
9860a27722Q179j73350A24205a5746j7561B1291J4264f6789I976b49594A11622
9848b21213J03139r3168R5554R91m9118k9990d1856j09911j8867A74626a63687
9836a60108B96249b60039J7773i6583B1747b4489m1614J797A63020E5403J15144
9825A70547p9840O691b49742D3418a28605K7052b7346A58524B2540a31987N1015
9814h0972A14956f4104F7922K6179c44481A30638f7079D61336g1402D4105a22633
9802c71744J55661L0488k05121e8353E9604c82241A70354M9261g151p6419m3434
9791a27004q4231A20598n3683B4132c5890H152d06939A18778D9974a41302A00161
9779c41450D62695b7949l37181g5363j5768M5291j05836A2355a84163r280N4011
$$ y = [-127722, -119543, -292893, 124205, -15746, -33307, 21291, 35555, -66789, 9976, -249594, 111622, -221213, -118074, -211242, -115688, -114697, -163815, -193805, -41856, -151767, -170634, 174626, -163687, -160108, 296249, -260039, -242266, -96583, 21747, -24489, -66103, -64306, 163020, 55403, 170547, 90707, 97398, -249742, 43418, -128605, -101553, -27346, 158524, 22540, -131987, -80972, 114956, -64104, 67922, 94101, -344481, 130638, -67079, 461336, -71402, 44105, -122633, -371744, -216083, -185595, -390716, -58353, 59604, -382241, 170354, 219615, -7151, -83570, -127004, -211235, 120598, 66915, 24132, -35890, 8152, -406939, 118778, 49974, -141302, 100161, -341450, 462695, -27949, -365130, -75363, -91131, -45840, -151676, 12355, -184163, -193443, -139432]
9768a39432A67304a23523B14112b68374I1870Q4239a07472A62471b9771k17919
9758b47690b3134j59601C72488E5434i2102K3335n9207H2422L31202A31522q688
9747A22834c80323a64233o8079a02326m232k97817g5998k75989D7797a12110d2369
9735b00407B81686H3862K053l760a97425B6485L1861a52593Q531O7343m65089
9724e41808J12180a21981C4505A3744b84840i6567j80608C63860a15200j34182
9714b49382h0658A89798a38125N3563J8751j0979L770B42288L3485J39747a03001
9702i4810c7951j37049C32765a40194k7160D8469L62536j85254a5018m7979m41620
9691e04617h2916j9970F9735l2897j4392i9445M0229j07814j0084H7917j0439
$$ y = [-139432, 167304, -123523, 214112, -268374, 91870, 176109, -107472, 162471, -29771, -247690, -23134, -182735, 372488, 55434, -92102, -68767, -127974, 82422, 413624, 131522, 122834, -380323, -164233, -232312, -102326, -106558, -404375, -75998, -351987, 47797, -112110, -42369, -200407, 281686, 83862, 85915, 82155, -197425, 26485, 58346, -152593, -144062, -76719, -541808, -429628, -121981, 34505, 13744, -284840, -96567, -277175, 363860, -115200, -249382, -80658, 189798, -138125, -84562, -65811, -76790, -73020, 242288, 275773, 415520, -103001, -94810, -37951, -175000, 332765, -140194, -167354, 48469, 411005, 225751, -15018, -62997, -504617, -82916, -102886, 69735, 36838, 22446, -99445, -59216, -167030, -177114, 87917, 77478]
9680G7478h9379B4147a85298D5890a49279j36978j1798J25736H0572a40895D7222
9668b77342A0635b34801I903a44796A11044a62339J2849C80408E2719B0761c23532
9656B79946G6947c06441b7625E2348J33141c0280l65881J42126q1073j2614c1293
9644A40586j7202a15584C02678b47968B11790a64431j45158f2202k9244p512B85558
9632H15L403h0130r8100d9317j08906B1287m506b56101G4733d41220E7992c32348
9619C8832a52041I548J57915J5366j3862M6630n5068E6423F0a09301d2433I5649
9606d03622P5894A91587r2654g9700A28775g1062j35137I7150J11900F2777h4261
9594A1872O1664P730c8211C79060a05326c6581k45481d3597F3172Q1329A6251
$$ y = [77478, -89379, 24147, -185298, 45890, -149279, -286257, -298055, -172319, 80572, -140895, 47222, -277342, 10635, -234801, 9903, -144796, 111044, -162339, -149490, 380408, 52719, 20761, -323532, 279946, 76947, -306441, -27625, 52348, 185489, -30280, -396161, -254035, -335108, -347722, -31293, 140586, 123384, -115584, 302678, -247968, 211790, -164431, -309589, -62202, -91446, -98958, 285558, 815, 4218, -80130, -178230, -49317, -158223, 21287, 16781, -256101, 74733, -441220, 57992, -332348, 38832, -152041, 9548, 167463, 182829, 168967, 215597, 160529, 56423, 60, -109301, -42433, 95649, -403622, -327728, 191587, 98933, -79700, 128775, -71062, -206199, 97150, 209050, 62777, -84261, 11872, 73536, 81266, -38211, 379060, -105326, -36581, -282062, -43597, 63172, 144501, 16251]
9582a39057F223d1660j57944L7916f2422F8956a7410k53483Q7362B1414a33323
9570c41423B27861b38113c5180l03278a39182j03507B52920a00349j17427j88022
9560d05798A13163C6445J82805g2050j19464A21664h3847d0852l1750m7443m6014
9549a66059M3969j95748n8415B59105a48862k5216r8712A51781A2347b1478D7021
9537B30011H6277j7211b48294f1243j49920F7292A095c9333j25685J3868A5378
9525E8657f2640n2990j25204L654r9767C41410a98381B26056b24917A19585i6926
9513G9580a30266M1885j68905B8950d2201j1075A9026K19760j09648j6193i1361
9501a07336F5130a4722j83149Q9395j05457A37653b64854D53329a63058A09100
$$ y = [-139057, 6223, -41660, -199604, -161688, -62422, 68956, -17410, -270893, -183531, 21414, -133323, -341423, 227861, -238113, -35180, -338458, -139182, -242689, 252920, -100349, -217776, -405798, 113163, 36445, 219250, -72050, -191514, 121664, -83847, -40852, -72602, -120045, -166059, -122090, -317838, -376253, 259105, -148862, -174078, -272790, 151781, 12347, -21478, 47021, 230011, 86277, 69066, -248294, -61243, -211163, 67292, 1095, -39333, -165018, -151150, 15378, 58657, -62640, -115630, -240834, -237180, -336947, 341410, -198381, 226056, -224917, 119585, -96926, 79580, -130266, -88381, -257286, 28950, -42201, -53276, 19026, 238786, 129138, 112945, -91361, -107336, 65130, -14722, -197871, -108476, -213933, 137653, -264854, 453329, -163058, 109100]
9490A18454i72j71564b9544M78j34188N4163m3002O1901A54283j9930a01819n7218
9478a59037e9054D935a59903b5293k5972j82796G7527a81871d2495l6771A07246
9466B4768G514M1663a11588D19196G189f923o7740A69261n6739b27598i7341j32373
9454b29714j0399D1944a71265K7830A14158e92A56259a61865N2433a9112A64706
9442A7595R6905b60029J6312R8857G4326a04254A53898G0868c25999E8604a69622
9430d77046b19036p995C0420d58l2625A44488K8557a5344k8812q6624Q608a6993
9417E0363B1034c77784e6186A51101a40837A06433c88380h2845n6345B12402c66385
9405C74856b90755o7705a4848A19725J38354h6494A68300a57157D4196K23362
$$ y = [118454, -972, -172536, -29544, -29066, -163254, -109091, -152093, -90192, 154283, 134353, -101819, -159037, -59054, 4935, -159903, -25293, -51265, -234061, 77527, -181871, -42495, -79266, 107246, 24768, 7514, 49177, -111588, 419196, 7189, -6923, -74663, 169261, 112522, -227598, -97341, -229714, -240113, 41944, -171265, -143435, 114158, -592, 156259, -161865, -109432, -19112, 164706, 17595, 114500, -260029, -243717, -144860, 74326, -104254, 153898, 70868, -325999, 58604, -169622, -477046, -219036, -227031, 30420, -458, -33083, 144488, 173045, -15344, -44156, -130780, -122172, -16993, 50363, 21034, -377784, -56186, 151101, -140837, 106433, -388380, -82845, -139190, 212402, -366385, 374856, -290755, -358460, -14848, 119725, 258079, -86494, 168300, -157157, 44196, 267558]
9395B67558E1069L9008P07h6768d1536k44791K2030I2573b91211J45386B75315
9383E3611G310K03525b93770f4183m19520e5899o9354A89967q5793l9325c659
9371b34562C42706e3212g79C50343a71431p0288g8596r0872a0380j40067k05742
9360c56189a16067C8611a18386j23716B24307b01223p3803J12142l35649f950
9349B02982c61781A79585J2521r51F3338k807b56951G2695L16a92878h9456r1842
9337a81298F8389B2590g6926A88974l5726m2454a94661A66629E368b36691M5853
9326a90838H3077a80237B3938P3022a84077P2739C32598B0154e1355A93586a35021
9314A02659a60680l9446C5075J49839D2834c33524d4200A11593k5319C261a4698
$$ y = [267558, 51069, 90077, 90784, -86768, -41536, -286327, -264297, 92573, -291211, -145825, 275315, 53611, 7310, 210835, -293770, -64183, -483703, -55899, -125253, 189967, 104174, 64849, -3659, -234562, 342706, -53212, -779, 350343, -171431, -241719, -78596, -169468, -10380, -150447, -356189, -116067, 38611, -118386, -242102, 224307, -201223, -275026, -162884, -498533, -6950, 202982, -361781, 179585, 192106, 191155, 63338, 60531, -256951, 72695, 73011, -192878, -89456, -181298, 68389, 22590, -76926, 188974, 153248, 110794, -194661, 166629, 5368, -236691, -190838, 83077, -180237, 23938, 96960, -184077, -111338, 332598, 20154, -51355, 193586, -135021, 102659, -160680, -200126, 35075, 184914, 42834, -333524, -44200, 111593, 86274, 3261, -14698]
9302H4005b27784G6390a24221l6090K0779A59067c9481p6359r1287j72377k6047
9291d05551R2550c8887j73854j20157A20959n6706b22852l8606a15269A1123K06888
9280B18011a93500N4200j5636O8491H3078a4095q7604M3013k47316A01202g1153
9268E4557b86041b3885j05339A279b40876M8583B14638c61365R3985n7572J19199
9257b05753j8441K9944j00681b5325Q331j16819B98741c49450l2701C1741c11478
9245H5039k5806c29402B31729a96013d1760f689A54283j5346c4062j43843m8155
9234b26060j25434J19350Q0001e2164I3713c35849A21989J54036f9429j02457
9224a71886j08D32528a27826C03455b8899j76594A77896p7315b6986L867j98518
$$ y = [84005, -227784, 76390, -124221, -160311, -139532, 159067, -39481, -115840, -207127, -379504, -405551, -313001, -38887, -212741, -332898, 120959, 64253, -222852, -261458, -115269, 11123, 218011, -193500, -139300, -154936, -86445, 83078, -14095, -101699, -58686, -306002, 101202, -71153, 54557, -286041, -23885, -129224, 1279, -240876, -192293, 214638, -361365, -267380, -324952, -205753, -224194, -194250, -294931, -25325, -16994, -133813, 298741, -349450, -382151, 31741, -311478, 85039, 59233, -329402, 231729, -196013, -41760, -6689, 154283, 138937, -34062, -177905, -226060, -351494, -232144, -152143, -52164, 93713, -335849, 121989, 276025, -69429, -171886, -171994, 432528, -127826, 303455, -28899, -205493, 177896, 100581, -26986, -23119, -221637]
9213b21637n9135O7987j54046A03627d058l24106F001c5143k6740A17329D0339
9201b7012A44799I970b05050k2402J3519m6351J06531B1801M0458e0712j63250
9190b13962p353a6028C1810L4039N6043b11060f2106C13277a49801h142j77278
9179a85420M2625A08000O4220J49550b47726J14966A86497k0353M0237b66140
9168A13889b78074I3851c34151h5122j32571H5972c69229m3599H1696b08591i1036
9156b17522B5276K27002c5330D1380b93193d1939B8368b70955A0688b08587j7163
9145b25750G7254g6129j86588o2723A23927i5816e813D3356b87706G7867P845
9134H5712c26071A38946Q1531A0361J04272i3238p2809k19207i7938K7079A99914
$$ y = [-221637, -280772, -212785, -366831, 103627, -4058, -328164, 6001, -35143, -61883, 117329, 40339, -27012, 144799, 9970, -205050, -227452, -213933, -260284, -153753, 21801, 62259, -50712, -213962, -221315, -16028, 31810, 65849, 121892, -211060, -62106, 313277, -149801, -8142, -185420, -142795, 108000, 172220, 321770, -247726, -132760, 186497, 166144, 206381, -266140, 113889, -278074, 93851, -334151, -85122, -217693, 85972, -369229, -412828, 81696, -208591, -91036, -217522, 25276, 252278, -35330, 41380, -293193, -41939, 28368, -270955, 10688, -208587, -225750, 77254, -76129, -262717, -325440, 123927, -95816, -5813, 43356, -287706, 77867, 85712, -326071, 138946, 220477, 10361, 114633, -93238, -166047, -385254, -97938, -70859, 199914]
9122a01693c6199j56442i4657j44479I2400R4239b51057g7154k28670g9334A90506
9110A79293f009k42312C38757A44064D8373M6166b22582i5814B2840P7920l2362
9099F8398c30396B69297M6987h0445a9980M664A12368N5517b31602i0422G137
9087B38039a54894q0695G4233k1367C468d77983a04838A4064a86013M5000B27500
9075C07720a34543A33358c06602Q1784c6473l66547B42003F9810K79314A26115
9064B90651b08042A83697a87842P9353j03870j02202d9220I3201b34091c1445
9053B8344a5811j2522k1965n6530d7135j34187L261C7665a8164m2483C10734a78162
9040B21786J04540F3393b72845C24943A2332c86121h6589j97991A77374D6129
$$ y = [-101693, -36199, -192641, -94657, -239136, 92400, 186639, -251057, -77154, -305824, -79334, 190506, 179293, -6009, -248321, 338757, 144064, 48373, 94539, -222582, -95814, 22840, 100760, 68398, -330396, 269297, 316284, -80445, -19980, -15316, 112368, 167885, -231602, -90422, 7137, 238039, -154894, -235589, 74233, 52866, 3468, -477983, -104838, 14064, -186013, -141013, 227500, 307720, -134543, 133358, -306602, -224818, -36473, -403020, 242003, 69810, 349124, 126115, 290651, -208042, 183697, -187842, -108489, -212359, -314561, -49220, 93201, -234091, -31445, 28344, -15811, -28333, -50298, -106828, -47135, -181322, -178061, 37665, -18164, -60647, 310734, -178162, 221786, 326326, 63393, -272845, 324943, 12332, -386121, -86589, -284580, 177374, 46129]
9029b97774i6626a7242p0632q1907C7309A8022b60395C11684a27111E2639a31452
9017c1498k84249j51087i4299m0664l9175h1011K574j34538E460a74226o5312
9006b39538l1130i943j32271j45779F9935i0467m1142A02409k2287a01077r8779
8995a99856A10520a83597a4675B20538A01792J00238a88047l5677A05157E776
8984B03398c46710A25530n5741Q8247E3470a21157G3186b35061R8664D56719A09910
8972D8569a4454n7511o1987J3238N6585j73537A83511c59590a21451H7065a47646
8960a49763A7962a19299l6901N136A276i9032o8059C5790L8544b75849b9477B30130
8947a86779A80981F9203c59080A17778f1154j54011B3289b86511B2027M8624M4463
$$ y = [-297774, -96626, -17242, -87874, -169781, 37309, 18022, -260395, 311684, -127111, 52639, -131452, -31498, -315747, -466834, -94299, -134963, -174138, -81011, -78437, -212975, 5460, -174226, -239538, -270668, -9943, -142214, -287993, 69935, -90467, -131609, 102409, 80122, -101077, -199856, 110520, -183597, -14675, 220538, 101792, 202030, -188047, -223724, 105157, 5776, 203398, -346710, 125530, 69789, 158036, 53470, -121157, 73186, -235061, -136397, 456719, 109910, 48569, -14454, -71965, -133952, -120714, -64129, -237666, 183511, -359590, -121451, 87065, -147646, -149763, 17962, -119299, -156200, -151064, 1276, -99032, -167091, 35790, 74334, -275849, -29477, 230130, -186779, 180981, 69203, -359080, 117778, -61154, -215165, 23289, -286511, 22027, 70651, 115114]
8936A15114i291F13603B06971o7314c09018B47402a30197g201B12408q0396K01047
8925C33059J9185K66947J937229O209722l576353A280598B25026C516R4833J01312
8915A99661a19675D8291k1011e8534K5875C9393P8886N9580c89170I2733i3142
8903C6700a67881A75427J1468i0566k25764a16842e2886a5160k22521c4650j12177
8892a46827k32506J72950l3806d6203A62286d80218A79364o4604J54483I6100
8881g2352k79341J53077d476l0097k77703h1428c8921F1845b29287O2759A95354
8869d5399j72271I9463b66012a028j29630L5605A30069d29895K7661J53129a22221
$$ y = [115114, -9291, 613603, 206971, 139657, -309018, 247402, -130197, -7201, 212408, 132012, 333059, 352244, 619191, 2556420, 8766142, 5189789, 1280598, 225026, 3516, 98349, 199661, -119675, 48291, 27280, -58534, -32659, 39393, 118279, 177859, -389170, 92733, -93142, 36700, -167881, 175427, 186895, -90566, -316330, -116842, -52886, -15160, -237681, -34650, -146827, -379333, -206383, -240189, -46203, 162286, -480218, 179364, 114760, 269243, 96100, -72352, -351693, -198616, -4476, -34573, -312276, -81428, -38921, 61845, -229287, -166528, 195354, -45399, -217670, 99463, -266012, -1028, -130658, -95053, 130069, -429895, -402234, -249105, -122221]
$$ [...]
##END NTUPLES=NMR SPECTRUM
##END=
