
##TITLE=AC1324_UGAAH12153_6535724_wPBb3waUKT
##JCAMPDX= 6.0         $$ Bruker NMR JCAMP-DX V2.0
##DATA TYPE= NMR SPECTRUM
##DATA CLASS= NTUPLES
##ORIGIN= BRUKER
##OWNER= Administrator
$$ 1.72 TOPSPIN		Version 2.1
$$ 2012-12-11 19:03:42.792 -0500  Administrator@X
$$ Compression mode = diff/dup
##.OBSERVE FREQUENCY= 400.02188249412
##.OBSERVE NUCLEUS= ^1H
##.ACQUISITION MODE= SIMULTANEOUS (DQD)
##.ACQUISITION SCHEME= undefined
##.AVERAGES= 64
##.DIGITISER RES= 22
##SPECTROMETER/DATA SYSTEM= spect
##.PULSE SEQUENCE= noesygpps1d.comp
##.SOLVENT NAME= COFFEE_meoh
##.SHIFT REFERENCE= INTERNAL, COFFEE_meoh, 1, 14.96076
##AUDIT TRAIL= $$ (NUMBER, WHEN, WHO, WHERE, PROCESS, VERSION, WHAT)
$$ ##TITLE= Audit trail, TOPSPIN		Version 2.1
$$ ##JCAMPDX= 5.01
$$ ##ORIGIN= Bruker BioSpin GmbH
$$ ##OWNER= Administrator
$$ $$ E:\/data/COFFEE/nmr/AC1324_UGAAH12153_6535724_wPBb3waUKT/22/pdata/1/auditp.txt
$$ ##AUDIT TRAIL=  $$ (NUMBER, WHEN, WHO, WHERE, PROCESS, VERSION, WHAT)
(   1,<2012-12-11 19:03:37.229 -0500>,<Administrator>,<X>,<go>,<TOPSPIN 2.1>,
      <created by zg
	started at 2012-12-11 18:52:07.320 -0500,
	POWCHK enabled, PULCHK disabled,
       configuration hash MD5:
       86 BA 57 50 F2 9D 5C 9B 26 00 A9 28 5F 66 2E 89
       data hash MD5: 64K
       07 A1 84 09 6E 05 43 69 3D 99 D9 EF A3 EB 33 EA>)
(   2,<2012-12-11 19:03:40.082 -0500>,<Administrator>,<X>,<proc1d>,<TOPSPIN 2.1>,
      <Start of raw data processing
       efp LB = 0.3 FT_mod = 6 PKNL = 1 PHC0 = 0 PHC1 = 0 SI = 128K 
       data hash MD5: 128K
       FA 2C B8 8D 3E 67 41 94 80 71 EB 8A EE 09 AC A7>)
(   3,<2012-12-11 19:03:41.123 -0500>,<Administrator>,<X>,<proc1d>,<TOPSPIN 2.1>,
      <pk PHC0 = -81.41968 PHC1 = 0 
       data hash MD5: 128K
       22 38 C3 9C 7C C4 5D 07 E7 F8 2A 11 76 25 83 F0>)
(   4,<2012-12-11 19:03:41.812 -0500>,<Administrator>,<X>,<proc1d>,<TOPSPIN 2.1>,
      <abs ABSG = 1 
       data hash MD5: 128K
       A3 A7 0A 30 BD 55 F3 9A B0 71 C0 93 85 35 D6 E2>)
(   5,<2012-12-11 19:03:41.965 -0500>,<Administrator>,<X>,<proc1d>,<TOPSPIN 2.1>,
      <abs ABSG = 2 
       data hash MD5: 128K
       34 EA 72 46 34 09 94 F5 2F 96 BD DA 90 0F 85 C2>)
(   6,<2012-12-11 19:03:42.134 -0500>,<Administrator>,<X>,<proc1d>,<TOPSPIN 2.1>,
      <abs ABSG = 3 
       data hash MD5: 128K
       26 24 E6 4A 6C 5C CE 0D BF B4 CC 2A FB 24 0F 91>)
(   7,<2012-12-11 19:03:42.302 -0500>,<Administrator>,<X>,<proc1d>,<TOPSPIN 2.1>,
      <abs ABSG = 4 
       data hash MD5: 128K
       C2 82 C1 8E E2 0D 90 95 32 1B 5D 89 A9 05 50 CA>)
(   8,<2012-12-11 19:03:42.486 -0500>,<Administrator>,<X>,<proc1d>,<TOPSPIN 2.1>,
      <abs ABSG = 5 
       data hash MD5: 128K
       42 94 B2 49 33 58 6E F0 D6 B2 84 7F 14 86 6A 62>)
$$ ##END=
$$ 
$$ $$ hash MD5
$$ $$ B7 42 C6 1B EB 49 A2 85 45 94 36 D7 4B 2E B3 BD
##$RELAX= 
##$RELAX= 
##$RELAX= 
##$RELAX= 
##$RELAX= 
##$RELAX= 
##$RELAX= 
##$RELAX= 
##$RELAX= 
$$ Bruker specific parameters
$$ --------------------------
##$DU= <E:\>
##$EXPNO= 22
$$ [...]
##$TP07= 0
##$TPNAME0= <>
##$TPNAME1= <>
##$TPNAME2= <>
##$TPNAME3= <>
##$TPNAME4= <>
##$TPNAME5= <>
##$TPNAME6= <>
##$TPNAME7= <>
##$TPOAL= (0..7)
0.5 0.5 0.5 0.5 0.5 0.5 0.5 0.5
##$TPOFFS= (0..7)
0 0 0 0 0 0 0 0
##$TUNHIN= 0
##$TUNHOUT= 0
##$TUNXOUT= 0
##$USERA1= <user>
##$USERA2= <user>
##$USERA3= <user>
##$USERA4= <user>
##$USERA5= <user>
##$V9= 5
##$VALIST= <valist>
##$VCLIST= <CCCCCCCCCCCCCCC>
##$VD= 0
##$VDLIST= <DDDDDDDDDDDDDDD>
##$VPLIST= <PPPPPPPPPPPPPPP>
##$VTLIST= <TTTTTTTTTTTTTTT>
##$WBST= 2048
##$WBSW= 25
##$XGAIN= (0..3)
0 0 0 0
##$XL= 0
##$YL= 0
##$YMAX_a= 6483026
##$YMIN_a= -13480774
##$ZGOPTNS= <>
##$ZL1= 120
##$ZL2= 120
##$ZL3= 120
##$ZL4= 120
##$ABSF1= 14.96076
##$ABSF2= -5.597422
##$ABSG= 5
##$ABSL= 3
##$ALPHA= 0
##$AQORDER= 0
##$ASSFAC= 0
##$ASSFACI= 0
##$ASSFACX= 0
##$ASSWID= 0
##$AUNMP= <proc_prof1d_extract.lims>
##$AXLEFT= 0
##$AXNAME= <>
##$AXNUC= <1H>
##$AXRIGHT= 0
##$AXTYPE= 0
##$AXUNIT= <>
##$AZFE= 0.1
##$AZFW= 0.1
##$BCFW= 0
##$BC_mod= 0
##$BYTORDP= 0
##$COROFFS= 0
##$CY= 15
##$DATMOD= 1
##$DC= 0
##$DFILT= <>
##$DTYPP= 0
##$F1P= 0
##$F2P= 0
##$FCOR= 0.5
##$FTSIZE= 131072
##$FT_mod= 6
##$GAMMA= 0
##$GB= 0
##$INTBC= 1
##$INTSCL= 1
##$ISEN= 128
##$LB= 0.3
##$LEV0= 0
##$LPBIN= 0
##$MAXI= 10000
##$MC2= 0
##$MEAN= 0
##$ME_mod= 0
##$MI= 0
##$NCOEF= 0
##$NC_proc= -2
##$NLEV= 6
##$NOISF1= 0
##$NOISF2= 0
##$NSP= 0
##$NTH_PI= 0
##$NZP= 0
##$OFFSET= 14.96076
##$PC= 1
##$PHC0= -81.41968
##$PHC1= 0
##$PH_mod= 1
##$PKNL= yes
##$PPARMOD= 0
##$PPDIAG= 0
##$PPIPTYP= 0
##$PPMPNUM= 2147483647
##$PPRESOL= 1
##$PSCAL= 4
##$PSIGN= 0
##$PYNMP= <proc.py>
##$REVERSE= no
##$SF= 400.020009730847
##$SI= 131072
##$SIGF1= 0
##$SIGF2= 0
##$SINO= 400
##$SIOLD= 131072
##$SPECTYP= <>
##$SREGLST= <1H.CDCl3>
##$SSB= 0
##$STSI= 131072
##$STSR= 0
##$SW_p= 8223.68421052631
##$SYMM= 0
##$S_DEV= 0
##$TDeff= 65536
##$TDoff= 0
##$TI= <>
##$TILT= no
##$TM1= 0
##$TM2= 0
##$TOPLEV= 0
##$USERP1= <user>
##$USERP2= <user>
##$USERP3= <user>
##$USERP4= <user>
##$USERP5= <user>
##$WDW= 1
##$XDIM= 131072
##$YMAX_p= 447568104
##$YMIN_p= -12627
##$CURPLOT= <Network HP LaserJet P1505>
##$CURPRIN= <$Network HP LaserJet P1505>
##$DFORMAT= <normdp>
##$LAYOUT= <+/1D_H.xwp>
##$LFORMAT= <normlp>
##$PFORMAT= <normpl>
##$SURQMSG= 1
$$ End of Bruker specific parameters
$$ ---------------------------------
##NTUPLES= NMR SPECTRUM
##VAR_NAME=  FREQUENCY,     SPECTRUM/REAL,   SPECTRUM/IMAG
##SYMBOL=    X,             R,               I
##VAR_TYPE=  INDEPENDENT,   DEPENDENT,       DEPENDENT
##VAR_FORM=  AFFN,          ASDF,            ASDF
##VAR_DIM=   131072,        131072,          131072
##UNITS=     HZ,            ARBITRARY UNITS, ARBITRARY UNITS
##FACTOR=    0.0627417313425164, 1,          1
##FIRST=     8223.62146879497, 4208,         -63693
##LAST=      0,             6605,            -63419
##MIN=       0,             -12627,          0
##MAX=       8223.62146879497, 447568104,    0
$$ Real data points
##PAGE= N=1
##DATA TABLE= (X++(R..R)), XYDATA
$$ [...]
67875 105252 105443 104846 104263 104309 104826 105209 105022 104287 103523 103488 104514 105971 106769 106502 105796 105419 105493 105732 105985
67856 105985 106161 105991 105319 104498 104070 104090 104089 103630 102667 101399 100048 98796 97696 96642 95601 94841 94715 95205
67838 95205 95877 96296 96401 96454 96761 97423 98188 98541 98155 97325 96894 97612 99518 101980 104283 106209 108062 110182
67820 110182 112572 115017 117367 119473 120939 121326 120721 119829 119279 118991 118379 117009 114911 112467 110204 108557
67804 108557 107470 106322 104549 102366 100581 99586 98808 97349 95056 92767 91570 91917 93431 95302 96722
67789 96722 97058 96012 93834 91330 89418 88605 88818 89571 90224 90244 89589 88821 88612 89135 90093 91230 92474
67772 92474 93625 94368 94812 95661 97561 100320 102961 104468 104608 104234 104714 106675 109278 111107 111747 111974
67756 111974 112440 112906 113012 112954 112827 112071 110502 109365 110229 112858 115162 115514 114385 113384 113371 113937 114273
67739 114273 113959 113043 111762 110323 108802 107181 105418 103506 101601 100080 99208 98651 97720 96364 95415 95372
67723 95372 95424 94430 92536 90941 90168 89609 88918 88784 89796 91417 92754 93734 94818 95999 96858 97311 97619
67706 97619 97767 97503 96933 96497 96322 96128 95842 95787 96100 96368 96112 95411 94840 94907 95680 96818 97862 98577 99053
67687 99053 99463 99773 99837 99729 99781 100206 100835 101299 101383 101161 100867 100762 101055 101792 102782 103697 104327 104698 104877 104804
67667 104804 104554 104723 106190 109202 112858 115726 116983 116870 116312 116264 117100 118206 118362 117045 115188 114116
67651 114116 113851 113245 111882 110895 111388 112824 113737 113605 113177 113118 113191 112913 112333 111834 111584 111513 111639 112063 112697
67632 112697 113187 113200 112792 112416 112524 113199 114272 115697 117526 119500 121058 121923 122348 122582 122443 121792 121093
67615 121093 121085 121995 123459 125098 126796 128524 130262 132055 133809 135107 135568 135321 134778 134036 132916 131492
67599 131492 130137 129028 128066 127327 127084 127232 127152 126433 125421 124831 124972 125513 125805 125368 124338 123484 123508 124236
67581 124236 124802 124694 124256 124014 123904 123442 122340 120714 118934 117481 116690 116341 115784 114750 113831 113846 114900
67564 114900 116338 117460 117963 117862 117417 117127 117470 118522 119910 121156 122041 122786 123943 125813 127819 128785
67548 128785 128172 126742 125644 125088 124454 123452 122515 122008 121740 121503 121532 122028 122680 123094 123410 123993 124687 124888
67530 124888 124407 123800 123711 124179 124789 125237 125446 125330 124812 124187 124100 124871 125910 126178 125338 124241 124062 125016 126153
67511 126153 126409 125648 124591 123988 124086 124755 125754 126691 127076 126759 126265 126329 127009 127634 127794 128000 128971 130513 131644
67492 131644 131787 131323 130916 130868 131323 132502 134303 136053 137149 137686 138014 138022 137390 136361 135614 135397 135410 135564
67474 135564 136214 137461 138781 139687 140278 140809 141053 140493 138978 136916 134986 133817 133656 134073 134252 133895 133657
67457 133657 134409 136296 138776 141344 143762 145766 147037 147584 147843 148316 149253 150586 151933 152745 152714 152061
67441 152061 151276 150709 150596 151243 152718 154431 155499 155631 155327 155154 155265 155684 156569 157932 159405 160599 161462
67424 161462 162044 162146 161490 160107 158334 156542 155080 154280 154216 154510 154556 153967 152756 151288 150153 149843 150304
67407 150304 151027 151808 153117 155301 157681 159073 159259 159345 160403 162169 163451 163495 162601 161606 161190 161572 162438
67390 162438 163066 162899 162167 161724 162094 162882 163337 163301 163260 163494 163586 162976 161786 160751 160413 160656 161031 161310 161526
67371 161526 161700 161798 161901 162196 162782 163606 164643 165949 167481 168987 170177 170945 171280 171141 170624 170197 170435
67354 170435 171393 172487 173169 173517 173906 174336 174539 174656 175204 176202 176910 176831 176502 176691 177147 176919 175879 175140
67336 175140 175702 177386 179450 181626 183904 185780 186559 186388 186309 187135 188721 190501 192211 193808 195010 195378
67320 195378 194829 193843 193130 193184 194078 195543 197177 198580 199348 199129 197928 196305 195044 194495 194397 194420 194668 195509
67302 195509 197077 199150 201452 203829 206073 207791 208602 208484 207865 207350 207343 207842 208509 208874 208604 207702 206563
67285 206563 205730 205469 205561 205604 205540 205810 206898 208731 210615 211843 212339 212597 212979 213272 213138 212844 213164 214488
67267 214488 216375 218193 219896 221841 224054 226108 227691 228864 229714 230090 229840 229054 227969 226834 225977
67252 225977 225690 225854 225956 225726 225569 226034 227020 227872 228249 228477 228892 229216 228892 227885 226855 226497 226931 227799
67234 227799 228705 229388 229598 229118 228009 226685 225626 225065 225022 225502 226444 227528 228316 228715 229174 230200 231718
67217 231718 233066 233696 233743 233836 234425 235433 236488 237299 237747 237817 237655 237638 238164 239284 240661 241867 242655 242949
67199 242949 242745 242174 241598 241545 242477 244466 247007 249292 250859 251900 252747 253245 252993 252099 251163 250488 249849
67182 249849 249239 249206 250060 251284 252271 253197 254491 255783 256232 255846 255712 256713 258633 260703 262467 263868
67166 263868 264982 265997 267130 268225 268747 268421 267648 267105 267127 267655 268534 269663 271009 272572 274173 275309
67150 275309 275589 275369 275520 276380 277399 278015 278394 278954 279668 280330 281140 282358 283619 284213 284079 283997 284662 285995
67132 285995 287501 288938 290422 292057 293611 294561 294442 293324 291939 291175 291418 292464 293916 295488 296912
67117 296912 297872 298225 298265 298638 299855 301813 303811 305151 305715 305878 305968 306060 306253 306803 307871 309357 311083
67100 311083 312907 314621 316046 317349 318851 320372 321184 320968 320415 320460 321198 322003 322501 322893 323394 323887 324243
67083 324243 324630 325358 326529 327897 329028 329738 330486 332120 335023 338678 342213 345086 347072 348062 348315 348594
67067 348594 349454 350587 351351 351813 352702 354399 356491 358325 359486 359776 359301 358703 358838 360063 362043 364229
67051 364229 366161 367496 368292 369325 371550 375071 379026 382536 385342 387571 389417 391178 393051 394731
67037 394731 395679 395923 396146 396942 398466 400807 403969 407373 410235 412754 416086 420599 424917 427421 428153
67022 428153 428512 429592 431594 434421 437871 441330 444151 446435 448843 451614 454367 456898 459534 462545
67008 462545 465742 468854 471909 475075 478442 482087 486029 490027 493745 497205 500785 504685 508707 512658
66994 512658 516642 520837 525277 530017 535201 540786 546402 551721 556816 561997 567403 572846 577986 582586
66980 582586 586722 590768 595079 599661 604344 609266 614952 621727 629199 636485 643000 649025 655503 663189
66966 663189 671816 680185 687282 693362 699725 707398 716226 725297 734034 742705 751997 762236 773001 783465
66952 783465 793199 802631 812554 823232 834277 845416 856984 869358 882256 895058 907772 921113
66940 921113 935486 950276 964585 978479 993058 1009211 1026660 1044462 1062179 1080165 1098750
66929 1098750 1117660 1136524 1155647 1175802 1197246 1219383 1241555 1263886 1287017 1311229 1336183
66918 1336183 1361542 1387444 1414186 1441633 1469307 1497023 1525275 1554891 1586369 1619521 1653631
66907 1653631 1687981 1722308 1756879 1792142 1828407 1865820 1904510 1944532 1985744 2027943 2071023
66896 2071023 2114761 2158529 2201655 2244170 2286860 2330427 2374982 2420502 2467157 2514693 2561952
66885 2561952 2607806 2652376 2696625 2740727 2783676 2824699 2864338 2903652 2942875 2981301 3018107
66874 3018107 3052735 3084673 3113499 3139262 3162472 3183579 3202486 3218512 3230833 3239221 3244452 3247715
66862 3247715 3249315 3248209 3243105 3233867 3221497 3206866 3189818 3169541 3145535 3118089 3087954 3055679
66850 3055679 3021309 2984739 2946203 2906160 2864765 2821871 2777669 2732889 2688077 2643003 2597075
66839 2597075 2550017 2501867 2452701 2402904 2353438 2305159 2257952 2211033 2164069 2117438 2071380
66828 2071380 2025539 1979644 1934154 1889786 1846668 1804271 1762164 1720584 1680241 1641610 1604448
66817 1604448 1568094 1532272 1497384 1463879 1431551 1399747 1368086 1336630 1305505 1274811 1244859
66806 1244859 1216027 1188259 1161111 1134387 1108409 1083563 1059904 1037282 1015488 994187 973057
66795 973057 952147 931807 912153 893001 874420 856830 840261 823967 807251 790376 774186
66784 774186 758977 744228 729434 714772 700789 687675 675086 662574 650065 637791 625872
66773 625872 614203 602896 592501 583362 574911 566121 556701 547340 538652 530525 522710 515360 508434
66760 508434 501152 492820 483912 475550 468038 460714 453299 446536 441071 436285 430820 424045 416630 409740
66746 409740 404001 399202 394728 390169 385580 381158 376765 371937 366390 360391 354582 349495 345251 341592
66732 341592 338089 334405 330409 326096 321497 316800 312430 308765 305746 302940 299999 296834 293354 289364
66718 289364 284909 280485 276650 273506 270720 268002 265368 262961 260771 258565 256040 253077 249875 246746
66704 246746 243781 240839 237901 235172 232669 229911 226431 222529 219132 216795 215154 213552 211941 210823
66690 210823 210410 210180 209397 207875 206079 204497 203054 201271 199021 196929 195764 195421 194832 193106 190559
66675 190559 188285 186830 185666 184008 181737 179309 177043 174864 172679 170669 169121 168085 167281 166300 164881
66660 164881 163023 160851 158478 156089 154135 153129 153107 153406 153227 152378 151381 150899 151172 151879 152390 152181 151177
66643 151177 149658 147788 145402 142465 139575 137636 136990 137142 137395 137502 137548 137489 137078 136217 135151 134220 133466
66626 133466 132572 131254 129692 128407 127614 126918 125858 124635 123917 123919 124035 123523 122343 121136 120541 120685 121163
66609 121163 121330 120745 119515 118203 117332 117004 116983 116937 116556 115618 114148 112430 110777 109370 108357 107883 107889 108072
66591 108072 108185 108230 108218 107956 107291 106362 105366 104264 103027 102026 101729 102028 102274 102060 101657 101521 101643 101611 101117
66572 101117 100207 99145 98217 97541 96922 95973 94589 93283 92841 93554 94861 95862 96129 95980 95918 95934 95520 94376
66554 94376 92878 91682 91004 90558 90133 89802 89517 88895 87740 86512 85850 85651 85021 83290 80851 78841 78147
66537 78147 78811 80226 81697 82780 83307 83267 82794 82270 82219 82884 83890 84536 84458 83875 83154 82376 81443 80363
66519 80363 79233 78145 77355 77334 78301 79754 80820 81065 80691 80040 79315 78811 78861 79266 79234 78285 76907 75904
66501 75904 75349 74704 73827 73285 73495 74026 74076 73411 72551 72079 71993 71814 71280 70847 71307 72876 74866 76383 77165
66482 77165 77464 77367 76700 75583 74551 73973 73707 73537 73589 74039 74715 75376 76160 77352 78763 79788 80145 80176
66464 80176 80204 79958 78985 77502 76380 76170 76449 76403 75864 75416 75489 75748 75583 74904 74147 73681 73502 73506 73692 74020
66444 74020 74341 74570 74830 75288 75929 76508 76664 76115 74911 73518 72488 72043 71975 71914 71554 70828 70060 69819 70237
66425 70237 70557 69796 67934 66079 65314 65722 66694 67762 68755 69466 69646 69330 68861 68536 68328 67929 66996 65539
66407 65539 64165 63734 64563 66103 67582 68735 69693 70394 70559 70196 69730 69496 69370 69035 68442 67876 67686 68000
66389 68000 68632 69197 69428 69458 69774 70818 72559 74396 75514 75500 74667 73706 72936 72076 70823 69436 68459 67999
66371 67999 67618 67001 66402 66212 66284 66035 65217 64299 63898 64011 64100 63913 63841 64308 65110 65719 66087 66712 67886 69227
66351 69227 70115 70303 69983 69510 69241 69379 69731 69730 68981 67742 66716 66402 66742 67379 68104 68988 70079 71049 71333
66332 71333 70758 69827 69203 69049 69157 69476 70012 70336 69842 68594 67323 66358 65165 63274 61088 59382 58467
66315 58467 58308 58916 59978 60580 60120 59304 59475 61007 63058 64830 66266 67406 67955 67868 67754 68135 68722
66298 68722 68912 68714 68694 69100 69539 69575 69343 69374 69961 70867 71661 72190 72607 73023 73331 73425 73350 73135 72719 72167 71712
66277 71712 71394 70924 70201 69641 69654 70024 70227 70161 70075 70017 69926 70093 70819 71596 71415 70136 68854 68535 68842 68827
66257 68827 68255 67658 67425 67533 68030 69042 70191 70590 69814 68540 67858 68037 68310 67893 66877 65936 65433 65191
66239 65191 65068 65293 66012 66889 67467 67697 67776 67652 67181 66687 66866 67945 69276 69925 69467 68179 66725 65736
66221 65736 65425 65424 65176 64541 63906 63713 64120 65062 66310 67402 67891 67862 67956 68664 69729 70445 70457 70124 70097 70581
66201 70581 71074 70947 70308 70033 70728 71934 72657 72468 71675 70620 69445 68477 68210 68729 69564 70188 70216 69165
66183 69165 66808 64013 62454 62971 64685 66217 67296 68530 70018 71019 70963 70102 69012 67904 66713
66168 66713 65565 64879 65009 65884 67044 67977 68358 67960 66655 64836 63681 64343 66711 69395 71162 71991
66152 71991 72489 72774 72480 71605 70822 70873 71918 73437 74605 74897 74492 74021 73864 73861 73732 73445 73050 72496 71819
66133 71819 71160 70462 69527 68602 68462 69488 71064 72260 72804 72965 72863 72452 71961 71800 72093 72667 73417 74324
66115 74324 75359 76615 78227 79832 80590 80231 79627 79608 79655 78648 76638 74897 74304 74634 75509 76896 78413
66098 78413 79204 79124 79223 80372 82014 82985 83052 82872 82842 82798 82741 83114 84173 85592 86794 87362 87133 86198 84874
66079 84874 83443 81943 80480 79615 79990 81460 82975 83591 83405 83341 84122 85625 87115 87897 87760 86998 86054
66062 86054 85166 84287 83388 82694 82481 82673 82865 82849 82888 83239 83631 83581 83197 83154 83728 84290 84137 83503 83306 84028
66042 84028 85371 86958 88782 90747 92195 92403 91442 90233 89727 90207 91404 92974 94687 96290 97511
66027 97511 98291 98831 99282 99550 99590 99710 100270 101128 101753 101908 101939 102286 102991 103716 104039 103737 103152 103193 104469 106347
66007 106347 107528 107760 108256 109981 112295 113970 114985 116406 118861 122024 125430 128909 132262 135349 138553
65992 138553 142380 146526 150131 152991 155686 158316 160063 160415 160001 159634 159181 157949 155716 152801 149562
65977 149562 146346 143560 141227 138768 135709 132336 129220 126415 123681 121172 119321 118194 117492 116973 116405
65962 116405 115369 113818 112649 112875 114176 115041 114582 113493 112934 113146 113711 114579 116062 117995 119661 120711
65946 120711 121623 123048 125006 127001 128712 130304 132108 134215 136458 138685 140947 143335 145604 147068
65932 147068 147110 145953 144746 144653 145813 147339 148303 148561 148652 149226 150712 153245 156603 160249 163625 166513
65916 166513 169154 172098 175842 180358 185017 189270 193395 198065 203101 207238 209487 210184 210256 210052 209601
65901 209601 209429 210082 211007 210959 209676 208249 207661 207727 207754 207390 206454 204686 202156 199340 196325 192497 187470
65884 187470 181791 176178 170661 165013 159555 154833 150888 147491 144735 142742 141094 139280 137436 135897
65870 135897 134233 131607 128122 125000 123251 122748 122796 122994 123285 123697 124322 125190 125943 125891 124635 122473 120130
65853 120130 118336 117633 118163 119465 120727 121434 121658 121804 122314 123524 125389 127258 128304 128381 128252 128829 130331
65836 130331 132201 133616 134094 133815 133467 133639 134390 135496 136960 138965 141512 144483 147940 151995 156501
65821 156501 161365 166976 173597 180318 185428 188223 189819 191745 194237 196385 197474 197473 196508 194567 191828
65806 191828 188756 185706 182655 179361 175665 171734 168186 165745 164425 163196 160917 157620 154516 152658
65792 152658 151936 151508 150910 150466 150791 152172 154408 157040 159637 161919 163791 165408 167287 170144 174367
65777 174367 179653 185365 191327 198000 205634 213423 219850 223935 225827 226104 224852 221779 216973 211011
65763 211011 204313 196890 188901 180994 173782 167367 161755 157389 154749 153619 153363 153847 155517 158565 162652
65748 162652 167606 173780 181396 190073 199410 209610 220971 233056 244846 255615 265136 273177 279307
65735 279307 283300 285356 285744 284466 281334 276156 268781 259223 247883 235542 223066 211159 200270
65722 200270 190451 181307 172396 163832 156305 150360 145787 141819 137822 133719 129909 126926 125051 124066
65708 124066 123351 122362 121014 119609 118487 117798 117515 117514 117656 117876 118134 118242 117867 116888 115712 115036 115201 115911
65690 115911 116604 116963 117031 117028 117208 117752 118668 119836 121292 123297 125974 128990 131890 134683 137766 141275 144933
65673 144933 148684 153110 158888 166083 174326 183484 193748 205197 217710 231278 245893 260974 275313
65660 275313 287946 298896 308821 318106 326458 333211 337807 340102 340496 339754 338527 337082 335565 334398
65646 334398 334226 335528 338403 342525 347044 350680 352322 351650 348891 343994 336422 325951 313269 299471
65632 299471 285196 270595 255962 241820 228311 215024 201721 188974 177686 168144 159903 152622
65620 152622 146603 142321 139598 137536 135219 132360 129281 126455 124133 122260 120608 118916 117036 115091
65606 115091 113526 112868 113279 114361 115527 116545 117561 118594 119271 119283 118926 118888 119487 120362 120974 121169 121067
65589 121067 120682 120041 119612 120122 121618 123101 123555 123272 123644 125599 128829 132793 137805 144472 152495 160873
65573 160873 169263 178308 188480 199432 210847 223107 236404 249730 261620 271701 280686 288819
65561 288819 295119 298430 298637 296462 292435 286462 278263 267991 256443 244744 233601 222777 211475
65548 211475 199409 187358 176517 167420 159683 152647 146079 140250 135542 132111 129897 128834 128878 129831
65534 129831 131251 132679 133927 135099 136425 138109 140167 142200 143445 143284 141736 139380 136907 134798
65520 134798 133239 132111 131125 130104 129020 127702 125781 123161 120259 117517 115008 112912 111959 112757 114840
65505 114840 117000 118511 119515 120332 121079 121897 122785 123161 122431 121190 120949 122313 124200 125352 125865 126695
65489 126695 128357 130830 134097 137938 141616 144651 147635 151479 156022 160117 162964 164609 165258 164902 163674
65474 163674 161852 159399 156168 152626 149685 147567 145481 142717 139537 136611 134100 131738 129541 127960
65460 127960 127373 127631 128062 127903 126865 125337 123943 122965 122388 122248 122547 122930 122980 122856 123162 124129 125380 126564
65442 126564 127667 128593 129045 129128 129515 130619 132006 133044 133761 134613 135763 137053 138496 140334 142687 145423
65426 145423 148214 150428 151207 150105 147573 144514 141489 138649 136202 134411 133109 131742 130099 128733
65412 128733 128416 129289 130724 131946 132628 132856 132700 132145 131495 131490 132623 134479 136210 137571 139007 140761 142608
65395 142608 144614 147370 150994 154557 157103 158775 160277 161698 162560 162715 162396 161629 160365 159038 158110
65380 158110 157173 155412 153015 151211 150722 151055 151520 151984 152275 151895 151002 150839 152293 154654 156657 158223
65364 158223 160209 162874 165696 168605 172258 176878 181772 186375 191094 196674 203308 210751 218813 227229
65350 227229 235362 242572 248754 254124 258589 261708 263269 263610 263186 261959 259345 254836 248689 241912 235458
65335 235458 229472 223433 216900 209932 202887 196198 190325 185478 181218 176709 171660 166716 162684 159640
65321 159640 157137 155005 153446 152420 151444 150096 148435 146823 145613 145053 145184 145666 145985 145967 145865 145751
65305 145751 145169 143703 141691 139963 138959 138558 138740 139873 142083 144808 147434 150056 153092 156304 158857
65290 158857 160424 161612 162965 164126 164490 164345 164666 165811 166999 167234 166345 164928 163636 162805 162518 162728
65274 162728 163306 164034 164511 164139 162508 159862 156985 154510 152552 151042 150028 149411 148706 147416 145540 143466
65258 143466 141560 140054 139087 138534 137941 136952 135726 134714 134177 134209 134987 136577 138592 140433 141826 142687
65242 142687 142666 141393 139258 137332 136273 135767 135270 134792 134555 134316 133585 132408 131474 131402 132133 133086 133744 134076
65224 134076 134412 134884 135133 134764 134007 133523 133481 133310 132545 131524 130939 131059 131753 132876 134195 135208 135560 135534
65206 135534 135713 136260 136886 137322 137383 136779 135474 134124 133533 133656 133727 133400 133088 133004 132693 131921 131421 132068 133737
65187 133737 135571 137161 138845 140876 142954 144707 146236 147886 149679 151228 152212 152777 153352 154023 154310
65172 154310 153797 152870 152430 152861 153706 154490 155313 156292 156993 157030 156941 157789 159980 163022 166381 169988 173887 178002
65154 178002 182432 187446 192962 198487 203773 209144 214933 221072 227548 234812 243342 253140 264103 276629
65140 276629 291285 307926 325496 342674 358486 372491 384822 396076 406860 417398 427655
65129 427655 437569 446777 454304 459021 460447 458769 454244 447143 438299 428994 419919 410604 400145 388201
65115 388201 374975 360644 345297 329304 313345 298043 283802 270913 259465 249117 239226 229384
65103 229384 219789 211074 203768 197868 192841 188083 183409 179052 175234 171921 169012 166554 164607 163047
65089 163047 161671 160394 159276 158500 158357 159028 160213 161206 161560 161479 161365 161172 160564 159584 158842 158952 159938 161150
65071 161150 161680 161036 159569 158107 157039 156009 154756 153854 154120 155474 156976 157982 158727 159602 160399 160579
65055 160579 160045 159354 159291 160300 162162 164123 165526 166342 166961 167567 167975 168040 167819 167319 166509 165672 165290 165352
65037 165352 165137 164005 162124 160175 158512 156869 154777 152105 149251 146792 144780 142508 139390 135989
65023 135989 133582 132600 132188 131593 131221 131734 132810 133660 134374 135714 137650 139113 139428 139156 139141 139398 139520
65006 139520 139675 140502 142171 144116 145804 147337 149166 151502 154222 157130 160012 162458 163989 164523 164518 164439
64990 164439 164244 163672 162907 162581 163117 164498 166692 169809 173622 177413 180634 183318 185570 187105 187782 188138
64974 188138 188735 189201 188616 186694 183934 180748 177230 173832 171397 170110 169035 167179 164568 161934 159750
64959 159750 158058 156859 156080 155248 153791 151742 149808 148625 148178 148041 147904 147639 147007 145694 143835 142241
64943 142241 141740 142250 142863 142901 142543 142189 141737 140957 140205 140128 140788 141743 142918 144668 146889 148823 150020 150826
64925 150826 151527 151650 150647 148801 146885 145262 143957 143297 143755 145129 146508 147192 147251 147113 147002 146934 146943 147139
64907 147139 147722 148970 150965 153263 155170 156523 157983 160342 163686 167445 171186 175083 179589 184872
64893 184872 190744 196951 203252 209245 214490 219011 223419 228219 233131 237379 240570 242881 244438 244988
64879 244988 244338 242767 240712 238273 235272 231623 227447 222958 218416 214154 210533 207911 206526 206113 205721
64864 205721 204384 202216 200408 199899 200322 200532 199824 198300 196383 194379 192320 189819 186292 181663 176721
64849 176721 172385 168803 165631 162934 161198 160402 159719 158368 156412 154479 153006 152021 151463 151425 151939 152654
64833 152654 152905 152384 151685 151785 152815 153790 153909 153697 154330 156175 158630 161137 163554 165561 166643 166961
64817 166961 167524 169131 171676 174774 178451 182752 187214 191397 195617 200540 206222 212128 218034 224357
64803 224357 231452 238926 245793 251081 254236 255170 254076 251214 246883 241524 235632 229477 223119 216855
64789 216855 211342 207026 203621 200478 197324 194362 191747 189371 187179 185396 184345 184211 184981 186373 187815
64774 187815 188788 189356 190198 192006 194892 198387 201894 205130 208383 212418 217978 225114 233009 240550 247087
64759 247087 252660 257597 262111 266345 270614 275292 280287 284859 288268 290689 293175 296558 300518 303906
64745 303906 305728 305619 303621 299962 295088 289417 282921 275186 266169 256698 248019 240853 234998 229732
64731 229732 224494 219276 214563 210938 208638 207455 206986 206857 206720 206318 205735 205416 205674 206318 207078 208381
64715 208381 211251 216232 222644 229126 234692 239028 242012 243534 243848 243662 243484 243074 241811 239502 236513
64700 236513 233146 229252 224639 219556 214516 209736 205052 200419 196275 193275 191709 191301 191513 191936 192404
64685 192404 192906 193503 194306 195413 196776 198148 199267 200149 201233 203181 206465 211084 216633 222624 228755
64670 228755 234924 241162 247588 254367 261467 268383 274155 277830 278992 277904 275182 271314 266401 260340
64656 260340 253297 246018 239555 234544 230741 227326 223713 220042 216984 215113 214465 214577 214940 215401 216175
64641 216175 217512 219452 221947 225136 229391 235111 242469 251317 261272 271930 283088 294699 306586
64628 306586 318230 328842 337614 343882 347246 347677 345490 341090 334797 326983 318209 309019 299658 290200
64614 290200 280925 272368 264948 258742 253640 249562 246497 244541 243910 244658 246214 247434 247431 246406 245489 245724
64598 245724 247245 249357 251269 252688 253759 254564 254829 254225 252873 251403 250425 249993 249626 248804 247383 245580
64582 245580 243632 241559 239428 237820 237793 240056 244226 249132 253840 258173 262205 265711 268335 270091 271347
64567 271347 272281 272523 271309 268023 262693 256110 249294 242786 236506 230309 224377 218909 213763 208770 204266
64552 204266 200858 198624 196860 194859 192755 191418 191564 193059 195085 196923 198473 200006 201531 202687
64538 202687 203307 203769 204496 205287 205467 204696 203345 202008 200875 199725 198351 196862 195558 194604 193847 193023
64522 193023 192111 191364 190954 190853 191206 192432 194611 196999 198635 199385 199894 200581 201230 201753 202720 204743 207712
64505 207712 211049 214430 217906 221586 225620 230367 236130 242801 250049 257765 265936 274247 282170 289408
64491 289408 295793 300744 303348 303165 300685 296848 292423 287934 283705 279643 275285 270455 265805 262369
64477 262369 260576 259869 259179 257630 254912 251311 247451 243856 240687 237922 235672 234135 233354 233218 233701
64462 233701 234865 236577 238425 240045 241382 242567 243704 244920 246475 248558 250955 253141 254819 256217
64448 256217 257736 259451 261172 262876 264799 267057 269525 272316 276016 281037 286853 292355 297109 301909
64434 301909 307952 315800 325402 336790 350260 365882 383279 402157 422947 446742 474575 506880
64422 506880 543787 585994 635164 693245 761411 839902 928661 1027309 1133872 1243860 1351528
64411 1351528 1452544 1545462 1630624 1707957 1775813 1831448 1872146 1896019 1902247 1891127 1864164
64400 1864164 1823994 1773589 1714810 1647404 1569649 1480393 1380796 1274365 1165614 1058723 957034
64389 957034 863111 778672 704252 639198 582394 533198 491570 457243 429105 405661 385983
64378 385983 369887 357256 347446 339340 331757 323926 315878 308359 302002 296525 291087 285336 279602 273985
64364 273985 267916 261034 254023 248009 243347 239518 236022 232871 230201 227990 226272 225261 225055 225518 226674
64349 226674 228914 232527 237149 242021 246788 251791 257402 263208 268093 271120 272213 271865 270432 267992
64335 267992 264771 261312 258027 254864 251690 248831 246918 246208 246296 246573 246836 247395 248716 250987 253882 256608
64319 256608 258217 258120 256480 254212 252417 251660 251711 251940 251819 250984 249124 246226 242844 239742 237103 234402
64303 234402 231159 227484 223723 219902 215838 211621 207711 204590 202476 201231 200454 199850 199550 199878 200728
64288 200728 201599 202409 203787 206185 209111 211779 214276 217496 222039 227702 234003 240607 247135 253150 258587
64273 258587 263908 269553 275440 281170 286552 291771 297039 302042 305727 306863 305083 301273 296775 292508
64259 292508 289097 287356 287776 289657 291591 293008 294475 296156 296750 294577 289265 281781 273208 264232 255629
64244 255629 248286 242446 237466 232708 228336 224904 222431 220363 218448 217173 217113 218100 219373 220373 221057
64229 221057 221500 221658 221690 222073 223051 224213 225024 225545 226222 227058 227502 227184 226368 225559 224930 224243 223111 221305
64211 221305 219032 216912 215426 214396 213252 211802 210438 209626 209542 210158 211242 212184 212305 211621 211005 211403
64195 211403 213067 215623 218624 221830 225208 228865 232908 237423 242772 249789 259261 271115 284409 298123
64181 298123 311532 323816 333902 341023 345068 346098 343873 338198 329519 318884 307475 296308 286081
64168 286081 276978 268739 261046 253766 246854 240316 234325 229108 224660 220809 217552 214971 212923 211289
64154 211289 210479 211028 212615 214172 215146 215991 217189 218585 220086 222168 225093 228262 231009 233484 236129
64139 236129 238834 241320 243845 246711 249431 251177 251731 251288 249745 247123 244372 242747 242385 242359 242109 241980
64123 241980 242364 243234 244691 247125 250540 254365 258119 261743 265223 268578 272409 277779 285241 294445 304810
64108 304810 315941 327268 337930 347400 355591 362133 366204 367611 367553 367807 369487 372932 378342 385921
64094 385921 395473 406268 417328 427743 436875 444387 449998 453288 453992 452422 449149 444283 437544 429031
64080 429031 419335 408744 397060 384512 372235 361328 351851 343196 335084 327745 321434 316192 311927
64067 311927 308446 305605 303600 302722 302566 302037 300586 299025 298527 299130 299807 299861 299658 300033 301502 304089 307473
64050 307473 311222 315110 319287 323993 329343 335594 343336 352919 363884 375476 387672 401115 415936
64037 415936 431147 445514 458670 471010 482637 492751 500127 504107 504997 503489 499775 493514 484725
64024 484725 474474 464349 455440 448106 442528 438895 436847 435232 432797 429081 424402 419149 413381 407068
64010 407068 400298 393083 385273 377059 369408 363506 359545 356456 353161 349786 347227 345776 344788 343746
63996 343746 342975 342976 343561 344189 344955 346767 350441 355825 361879 367541 372544 377444 382851 388737 394718 400780
63980 400780 407331 414487 421845 429207 437106 446197 456466 467465 479036 491287 504002 516689 529351
63967 529351 542772 557750 574294 591838 610132 629739 651568 676037 702853 731720 763113
63956 763113 798145 837722 882204 931992 988093 1051908 1124916 1208981 1306695 1420827 1553305
63945 1553305 1704940 1875932 2066150 2274806 2500258 2740380 2992920 3255407 3524815
63936 3524815 3797369 4068370 4331953 4581080 4808074 5005600 5167776 5291000 5374021 5417001
63926 5417001 5420159 5383072 5305196 5187003 5030752 4840471 4621567 4380477 4124270 3859905
63916 3859905 3593345 3329226 3071353 2823257 2588158 2368563 2166226 1982341 1817451
63907 1817451 1671164 1542366 1429765 1332040 1247620 1174839 1112414 1059302 1014001 974586 939681
63896 939681 908969 882379 859207 838373 819010 800351 781563 762352 743411 725481 708187
63885 708187 690586 672825 656382 642470 630888 620791 611932 604706 599503 596594 596431 599392 605183
63872 605183 612892 621863 632324 644999 660131 676963 694267 711376 728631 746771 765924 785335
63860 785335 803944 821060 836454 850090 861928 871893 879856 885576 888747 889143 886707 881511 873651
63847 873651 863306 850858 836839 821578 804976 786752 766863 745479 722661 698367 672797
63836 672797 646444 619806 593313 567555 543086 519850 497240 475020 453852 434566 417221
63825 417221 401235 386215 372236 359432 347696 336817 326752 317780 310374 304607 299678 294496
63813 294496 288955 284070 280460 277325 273536 269290 265817 263730 262487 261460 260687 260405 260494 260621 260508 259898
63797 259898 258655 256996 255257 253432 251345 249190 247379 245863 244192 242295 240595 239270 238019 236732
63783 236732 235799 235445 235294 234864 234077 233053 231869 230777 230226 230328 230662 230810 230776 230731 230816 231324 232464 233714
63765 233714 234024 233050 231580 230357 229131 227453 225778 224982 225148 225632 226082 226619 227184 227437 227378 227418 227799 228415
63747 228415 229191 230116 230993 231703 232698 234594 237218 239658 241382 242731 244081 245194 245763 246099 246777 247929
63731 247929 249304 250822 252667 254972 257714 260816 264047 267009 269554 272090 275171 278886 282968 287360
63717 287360 292167 297070 301322 304501 306821 308436 308917 307830 305456 302394 298690 294105 289240 285591
63703 285591 284116 284237 284628 284546 284026 283312 282791 283212 285169 288309 291599 294468 297163 299985 302831 305730
63687 305730 309215 313704 318889 324044 328626 332233 334379 334843 334040 332608 330745 328438 326225 325137 325659
63672 325659 327095 328248 328551 328398 328542 329396 330850 332470 333729 334193 333750 332708 331504 330216 328483 326017
63656 326017 322940 319435 315377 310683 305866 301641 298036 294459 290742 287542 285413 284031 282701 281207
63642 281207 279781 278684 278308 279285 281844 285258 288568 291784 295702 300567 305575 309919 313733 317652 321929
63627 321929 326437 331302 337030 344052 352431 361999 372492 383506 394629 405873 417889 431588 447509
63614 447509 465623 485637 507322 530564 555439 582399 612157 645096 680846 718582 757510
63603 757510 796589 833835 866418 891765 908533 916735 917405 912292 903386 892342 880320 868276
63591 868276 856962 846472 836144 825060 812312 796783 777405 754117 728232 701406 674515
63580 674515 647788 621593 596598 573452 552796 535323 521289 510099 500791 492837 486218 481159
63568 481159 478223 478193 481184 486151 491896 498331 505996 514704 523595 532416 541751 551878 562404 573279
63554 573279 585263 598979 614289 631121 650265 672808 699290 729883 764950 804862 849524
63543 849524 898156 948790 997362 1037992 1065351 1077300 1075354 1063091 1044468 1022964 1001187 980851
63531 980851 963127 948808 937834 928955 920308 910178 896990 879105 855463 826442 793573 758372
63519 758372 721824 684825 648482 613743 581157 551161 524230 500529 479645 460893 443801
63508 443801 428309 414613 402882 393015 384652 377406 370981 365026 359243 353832 349508 346671 344753
63495 344753 342740 340253 337715 335654 334257 333491 333143 332785 332171 331717 332073 333208 334370 335135 336018 337852
63479 337852 340964 345062 349516 353565 356709 359175 361625 364140 365929 366315 365630 364654 363505 361616 358691
63464 358691 355172 351663 348302 344860 341287 337993 335535 334099 333405 333234 333795 335291 337322 339322 341584
63449 341584 345127 350274 356080 361673 367540 374784 383558 393054 402826 413301 425053 438371 453583
63436 453583 471061 490754 512416 536552 564368 596200 630248 663166 691748 714088 729833
63425 729833 740003 746483 751365 756653 764321 776030 792552 813842 839946 871414 908598 950902
63413 950902 996850 1044254 1089944 1129996 1161152 1182037 1192748 1193820 1186291 1172397 1155185 1137170
63401 1137170 1119797 1103974 1090148 1077537 1063951 1046959 1025157 998291 966742 931269 892980
63390 892980 853107 812833 773379 735952 701317 669559 640470 614118 590913 571225 555043
63379 555043 541919 531181 522368 515566 511262 509775 510864 513846 518017 523095 529420 537699 548368
63366 548368 561211 575754 591876 609830 629840 652041 676681 703979 733822 766041 801009
63355 801009 839442 881453 926133 972044 1017506 1060218 1097248 1126062 1145483 1155544 1156828 1150330
63343 1150330 1137654 1120902 1102330 1084069 1067564 1052838 1038548 1023105 1005537 985069 960552
63332 960552 931123 897348 861056 824033 787328 751759 718355 687964 660805 636755 616033
63321 616033 599441 587981 582165 581394 583737 586186 585352 578502 564805 545887 524728 503546 482916
63308 482916 463006 444956 430209 418831 409391 400613 392438 385316 379219 373801 369068 365368 362834
63295 362834 361152 359806 358449 357118 356065 355202 353803 351153 347500 343873 340849 337981 334734 331494
63281 331494 329164 328035 327520 326896 325900 324650 323428 322611 322503 323050 323824 324412 324729 324987 325467 326342 327591
63264 327591 329038 330568 332356 334784 338053 341899 345786 349388 352818 356396 360300 364589 369402 374938
63250 374938 381178 387885 394955 402537 410634 418853 426880 435165 444820 456818 471398 488134 506367
63237 506367 525604 545791 567278 590434 615387 642249 671284 702434 734778 767012 798547
63226 798547 829716 860741 891008 919638 946458 972116 997539 1023566 1050836 1079524 1109193
63215 1109193 1139102 1168582 1196903 1223004 1245742 1264277 1277721 1284426 1282318 1270378 1249563 1221880
63203 1221880 1188717 1150516 1108014 1063115 1018151 974521 932506 892289 854632 820460 790242
63192 790242 763994 741570 722656 706807 693900 684346 678429 675567 674726 675561 678650 684442 692428
63179 692428 701570 711231 721369 732077 743270 754766 766420 778159 789960 801757 813308 824174
63167 824174 833814 841646 847129 849996 850373 848409 843794 835889 824349 809425 791634 771493 749583
63154 749583 726531 702815 678917 655753 634397 615126 597195 579964 563879 549893 538300
63143 538300 528655 520571 513881 508104 502465 496704 491366 487093 484040 482171 481673 482649 484668 486987 489171
63128 489171 491262 493499 496134 499436 503554 508323 513369 518439 523525 528686 533924 539216 544552 549908
63114 549908 555282 560731 566254 571651 576664 581268 585647 589849 593633 596739 599137 600918 602140 602947
63100 602947 603641 604379 604948 605137 605228 605763 606814 607852 608437 608681 608889 609049 608986 608813 608959 609838 611670 614486
63082 614486 618130 622325 626860 631626 636470 641306 646469 652631 660108 668528 677445 686959 697380 708564
63068 708564 720066 731817 744231 757834 773149 790724 810705 832532 855693 880770 909125
63057 909125 941508 977617 1017106 1060338 1107878 1159949 1216747 1278620 1345323 1415559 1487902
63046 1487902 1561883 1637549 1714190 1790249 1864598 1937303 2008904 2079418 2148454 2216072 2283048
63035 2283048 2350104 2417172 2483656 2549191 2613564 2675604 2732576 2781147 2818726 2843460 2853314
63024 2853314 2846125 2820839 2778056 2719119 2645297 2558250 2460722 2356202 2248130 2139678 2033745
63013 2033745 1932527 1837323 1749188 1669508 1599404 1538919 1487415 1444604 1410501 1384481 1365186
63002 1365186 1351556 1343358 1340463 1342182 1347666 1356459 1368159 1381819 1396267 1410991 1426297 1442504
62990 1442504 1459333 1476197 1492710 1508613 1523423 1536648 1548301 1558698 1567439 1572912 1573209 1567345
62978 1567345 1555258 1536968 1512340 1481724 1446191 1406899 1364614 1320037 1274245 1228584 1184291
62967 1184291 1142308 1103128 1066775 1033229 1002825 975776 951371 928385 906451 886236 867976
62956 867976 850706 833539 816890 801537 787056 772247 756836 741695 727343 713180 698444
62945 698444 683206 668148 653894 640796 628902 617855 607188 596896 587491 579366 572383 566133
62933 566133 560347 555060 550613 547459 545686 544802 544235 543866 543704 543338 542352 541177 540856 541804 543318 544367
62917 544367 544375 543185 540932 538195 535683 533410 530634 526909 522804 519249 516526 514262 512042 509613 506756
62902 506756 503429 499957 496745 493871 491189 488775 486985 486067 485874 485989 486090 486176 486436 486900 487363 487745 488249
62885 488249 488905 489203 488681 487708 487105 486991 486756 486333 486738 488829 492078 495171 497484 499339 501015 502216
62869 502216 502549 502036 501015 499885 499028 498635 498478 498108 497449 496990 497210 498008 498921 499851 501244 503386 505734
62852 505734 507337 508036 508906 511202 515015 519253 522813 525341 526970 527883 528346 528692 528934 528681 527756 526617
62836 526617 525805 525233 524432 523364 522525 522234 522270 522339 522538 523153 524246 525692 527503 529845 532781 536139 539721
62819 539721 543439 547227 550949 554565 558369 562855 568203 573997 579572 584635 589450 594386 599451 604452
62805 604452 609572 615506 622789 631052 639306 647157 655466 665468 677419 690514 704093 718354 733792
62792 733792 750577 768904 789504 813264 840546 871340 905955 945131 989624 1040152 1097631
62781 1097631 1163013 1236792 1318984 1409473 1508075 1614317 1727551 1847078 1971635 2098793
62771 2098793 2225419 2348693 2466018 2573873 2667595 2742919 2797433 2830311 2841122 2829514
62761 2829514 2795847 2741612 2669122 2581033 2480147 2369469 2252238 2131731 2010790 1891495
62751 1891495 1775395 1663874 1558035 1458353 1364917 1278087 1198495 1126284 1060742 1000962 946562
62740 946562 897644 854268 816121 782423 752094 724351 699343 677761 659569 643471 628042
62729 628042 613175 600003 589341 580629 572578 564770 558208 553988 551637 549438 546605 544412 544484 546577
62715 546577 549123 551663 555451 561428 568869 576625 584720 593989 605016 618319 634846 655131 678256
62702 678256 702728 728389 756645 788745 824590 863359 904562 948198 994318 1042788 1093226
62691 1093226 1144936 1196939 1248009 1296525 1340459 1377877 1407534 1428791 1441061 1443595 1435838 1417784
62679 1417784 1390032 1353723 1310431 1261977 1210261 1157063 1103660 1050487 997552 945427 895551
62668 895551 849361 807368 769269 734613 703037 674242 648203 625181 605148 587413 571162
62657 571162 556132 542409 529947 518764 509270 501751 495642 489905 484045 478283 472818 467507 462281
62644 462281 457326 452842 449038 446346 445041 444648 444277 443680 443476 444225 445816 447913 450431 453155 455323
62629 455323 456089 455325 453710 452147 451229 451146 451900 453524 456005 458942 461562 463436 465215 468281 473578 480977
62613 480977 489744 499282 509370 520039 531425 543541 556059 568478 580649 593007 606256 620905
62601 620905 637135 655007 674848 697487 724026 755210 791153 831805 877380 927908 982596
62590 982596 1040114 1099463 1160061 1220918 1280235 1335931 1386070 1428549 1460931 1481210 1488773 1484352
62578 1484352 1469045 1443583 1408546 1365098 1315206 1260935 1203660 1144253 1084062 1025181 969355
62567 969355 916977 867609 821221 778403 739537 704463 672961 644984 620314 598559 579651
62556 579651 563852 551066 540524 531307 522739 514212 505262 496248 488454 482992 479721 477549 475523
62543 475523 473298 470825 468166 465653 463861 463158 463303 463507 462943 461293 458849 456092 453333 450869 449200
62528 449200 448714 449302 450772 453573 458489 465473 473382 481223 489228 498324 508971 521090 534899 551251
62514 551251 570979 594169 620127 647976 677313 708318 741106 774943 808371 840202 870052
62503 870052 897738 922512 943275 959275 970218 975880 976198 971792 963997 954111 942797 930366 917573
62490 917573 905955 897310 892794 892549 896308 904272 917209 935701 959601 988352 1021493 1058568 1098801
62477 1098801 1141347 1185685 1231132 1275616 1315413 1346783 1368122 1380349 1385050 1382388 1370888 1349022
62465 1349022 1316712 1275473 1227589 1175327 1120474 1064141 1006983 949855 894250 841986 794525
62454 794525 752608 716270 685008 658237 635845 618064 604567 594048 585195 577812 572515 569610
62442 569610 568960 570668 574960 581280 588407 595768 603907 613245 623052 632105 639719 645549 648939 649246 646626
62427 646626 641780 634998 625985 614599 601336 587044 572515 558292 544591 531419 518980 507836
62415 507836 498409 490496 483528 477137 471167 465399 459709 454390 449871 446155 442944 440275 438480 437459
62401 437459 436441 434737 432413 430046 428143 427070 427220 428796 431388 434068 436034 437134 437840 438892 440901
62386 440901 443992 447634 451010 453798 456577 460245 465094 470721 476790 483449 490826 498623 506611 515202
62372 515202 524958 535746 546980 558640 571368 585476 600481 615922 632191 650292 671262 695978
62360 695978 725012 758276 795272 836097 881825 933412 990617 1052347 1117628 1185455 1253861
62349 1253861 1319792 1379948 1431351 1471455 1498711 1513411 1517451 1512819 1500481 1480795 1454401 1422210
62337 1422210 1384833 1342618 1296440 1248098 1199725 1152874 1108345 1066702 1028648 994743 965019
62326 965019 939126 916704 897305 880054 863857 848047 832495 816977 800793 783209 763939
62315 763939 742982 720433 696861 673579 651956 632361 614122 596532 579723 564605 552104
62304 552104 542359 534526 527493 520873 515091 510398 506247 501997 497876 494693 492743 491522 490518 489725
62290 489725 489352 489548 490584 492865 496468 500887 505480 510014 514561 519090 523439 527626 531933 536544 541313
62275 541313 546051 551020 556894 564042 572021 580111 588341 597705 609301 623554 640360 659594 681299
62262 681299 705695 733339 764988 801079 841639 887005 938259 996424 1061342 1131759 1206296
62251 1206296 1283693 1362010 1438175 1508654 1570399 1621120 1659165 1683695 1695067 1694744 1684498 1665418
62239 1665418 1637601 1600804 1555306 1502006 1441894 1375913 1305447 1232556 1159476 1088209 1020670
62228 1020670 958620 902946 853304 808926 769481 734883 704744 678674 656705 638633 623179
62217 623179 608666 594588 581800 571082 562212 554541 547732 541644 536060 530876 526140 521688 517219
62204 517219 512952 509686 507912 507314 507429 508245 509811 511813 514148 517553 522963 530260 538189 545605 552482
62189 552482 559640 567779 576909 586513 596093 605595 615357 625771 637027 649075 661553 673729 684736
62176 684736 694032 701619 707939 713795 720286 728464 738899 751795 767583 787182 811558 841262 876403
62163 876403 916803 962003 1011240 1063417 1116817 1168902 1216779 1258059 1291155 1314981 1329027
62152 1329027 1333938 1331466 1323386 1310564 1293115 1270948 1243878 1211780 1175217 1135775 1095426 1055744
62140 1055744 1017979 983376 952805 926278 903392 884137 868777 857124 848568 842816 839856 839005
62128 839005 838737 837917 836798 836282 836532 836885 837072 837879 840402 845031 851520 859764 869885 881308 892152
62113 892152 899998 903368 902264 897469 889892 880821 872146 865440 860609 855844 849135 839702 828033 815060
62099 815060 801706 789003 778095 769824 764335 761097 759379 758828 759700 762398 766640 771251 775080 778077
62085 778077 781070 784461 787640 790041 792362 796042 801591 808057 814426 821046 829282 840047 853142 867863
62071 867863 883789 900962 919690 940327 962944 987104 1012208 1038255 1066116 1096862 1130896
62060 1130896 1167751 1206411 1245379 1282436 1314786 1339924 1356590 1364921 1365822 1360392 1349845 1335433
62048 1335433 1317826 1296575 1270595 1239401 1203689 1164648 1123091 1079521 1034814 990420 947829
62037 947829 907970 871017 836623 804503 774920 748555 725749 706073 688777 673400 659684
62026 659684 647210 635486 624248 613321 602390 591369 580809 571343 562694 553824 544156 534255
62014 534255 525089 517075 510044 503708 497842 492271 487039 482450 478746 475858 473620 472130 471708 472578 474651
61999 474651 477620 481263 485663 491008 497024 502812 507550 511165 513984 515906 516466 515672 514136 512159 509322
61984 509322 505228 500164 494586 488424 481385 473662 465836 458204 450669 443251 436302 430173 424950 420551
61970 420551 416830 413515 410256 406867 403466 400321 397546 394964 392273 389420 386736 384613 383138 382189
61956 382189 381700 381625 381749 381897 382315 383442 385359 387838 390927 394945 399764 404705 409497 414918 422097 431455
61940 431455 442597 454906 467890 481283 495213 510093 525983 542245 558108 573363 588175
61929 588175 602492 615988 628379 639437 648853 656429 662166 665882 667043 665409 661591 656462 650308
61916 650308 643145 635675 629125 624121 620408 617909 617429 619982 625821 634416 644989 656813 669311 682232
61902 682232 695489 708586 720362 729579 735587 738243 737498 733414 726513 717725 707869 697259 685783
61889 685783 673304 660081 646858 634430 622941 611809 600574 589704 580175 572168 564484 555535
61877 555535 544856 533445 522674 513103 504418 496270 488843 482541 477361 472826 468572 464790 461927
61864 461927 460029 458656 457618 457531 459325 463217 468571 474832 482188 491070 501495 513438 527559 544781
61850 544781 565032 587010 609511 632512 656595 681612 706457 730054 752089 772619 791204
61839 791204 806693 817923 824528 826893 825372 819854 810441 798288 785356 773318 763088 755283 750496
61826 750496 748886 750087 753954 760946 771323 784156 797595 809943 820171 827606 831670 831947 828219
61813 828219 820385 808511 792922 774120 752793 730089 707518 686115 665778 645825 626196 607729
61801 607729 591269 576853 563868 551731 540287 529768 520493 512502 505479 499096 493374 488551 484657
61788 484657 481407 478462 475581 472567 469327 466037 463083 460774 459206 458362 458161 458375 458666 458773 458646 458394
61772 458394 458166 458107 458310 458792 459392 459674 459074 457445 455443 454085 453876 454591 455949 458002 460710 463653 466615
61755 466615 470105 474720 480122 485122 488708 490550 490657 489178 486696 484135 482004 480025 477806 475614
61741 475614 474063 473111 471803 469254 465663 462118 459508 457963 457301 457472 458230 458812 458658 458340 459079 461282
61725 461282 464181 467099 470284 474064 477899 480974 483343 485752 488560 491513 494412 497336 500166 502496
61711 502496 504115 505134 505551 505063 503442 500820 497585 494226 491229 488833 486882 485093 483354 481542 479308
61696 479308 476400 473015 469469 465750 461855 458306 455792 454317 453213 451880 450027 447387 443916 440242
61682 440242 437191 434743 432188 429454 427544 427200 427754 427778 426564 424578 422696 421342 420193 418520 415988
61667 415988 413136 410774 408959 407082 405035 403616 403455 404133 404867 405540 406470 407500 408037 407962 407965 408866 410859
61650 410859 413408 415660 417055 417783 418616 420127 422208 424508 427042 430009 433176 435918 437928 439524 441219
61635 441219 443192 445235 446921 447707 447150 445287 442775 440472 438772 437294 435257 432226 428547 425003 422000
61620 422000 419190 415973 412326 408932 406491 405070 404198 403415 402542 401440 399817 397393 394128 390159 385583
61605 385583 380437 374756 368543 361908 355482 350353 347024 344552 341402 337274 333373 330623 328465 325989
61591 325989 323505 322009 321398 320314 317834 314454 311163 308327 305858 303902 302765 302328 301998 301245 300041
61576 300041 298832 298137 298130 298535 298911 298899 298275 297093 295947 295628 296179 296669 296371 295787 295901 296730 297478 297929 298775
61557 298775 300442 302495 304470 306469 308529 310122 310896 311425 312569 314334 315887 316598 316651 316674 317012 317408
61541 317408 317385 316959 316815 317554 318880 319974 320511 320846 321250 321629 322066 322933 324212 325312 325896 326305 326810 327020
61523 327020 326490 325456 324449 323525 322358 320784 318834 316461 313639 310635 307904 305882 304936 305152 306022
61508 306022 306813 307472 308681 310753 313043 314775 315858 316432 316310 315561 315058 315542 316476 316717 316154 315770 316151
61491 316151 316853 317402 318068 319222 320528 321249 321117 320562 320277 320772 322165 324194 326430 328569 330534 332386
61475 332386 334243 336207 338220 340040 341455 342466 343197 343663 343686 342962 341347 339362 338202 338631 339841 340128
61459 340128 338988 337822 338071 339381 340347 340500 340542 340954 341509 342183 343472 345412 347096 347682 347392 347121 347406
61442 347406 348138 348977 349667 350157 350703 351742 353489 355820 358582 361736 365010 367751 369486 370486 371525
61427 371525 373052 374740 375809 375657 374322 372535 371292 371181 372050 373356 374785 376381 378103 379572 380444
61412 380444 380830 381047 380983 380192 378703 377257 376358 375494 373872 371677 369931 369146 368810 368321 367657 366855 365582
61395 365582 363782 362216 361640 361788 361813 361500 361344 361541 361682 361599 361881 363190 365429 367901 370028 371676 372939
61378 372939 373948 374865 375875 377117 378716 380873 383736 387046 390048 392060 393226 394474 396577 399455
61364 399455 402569 405606 408401 410509 411526 411837 412427 413827 415730 417724 419867 422346 425158 428367 432270
61349 432270 437031 442579 448983 456387 464322 471664 477638 482445 486620 490365 493861 497572 501618 505331
61335 505331 508052 510026 511915 513745 514939 515108 514267 512483 509878 506853 503834 500925 498128 495665 493728
61320 493728 492201 490994 490335 490392 491002 492136 494140 497075 500423 504037 508802 515577 524009 533277 543571
61305 543571 555763 569873 584919 600254 616001 631961 647000 659826 669775 676652 680459 681513
61293 681513 680376 677421 672761 666583 659154 650591 641001 630750 620204 609392 598363 587582 577432
61280 577432 567693 558230 549883 543826 540119 537718 535807 534350 533462 533166 533822 535894 539098 542467 545408
61265 545408 547998 550301 552183 553903 556084 558991 562554 567144 573419 581230 589466 597145 603862 609194
61251 609194 612758 615112 617527 620392 622732 623730 623785 623542 622845 621309 619148 616709 613844 610447 607035
61236 607035 604132 601548 598888 596273 594012 592111 590720 590522 591961 594518 597417 600698 604885 610029
61222 610029 615841 622472 630245 638685 646713 654026 661656 670750 681125 691373 700283 707902 715058 722006
61208 722006 727942 732068 734812 737435 740554 743635 745925 747398 748710 750848 754857 761267 769563 778783
61194 778783 788785 800272 813466 827594 841980 856672 871304 884133 893147 897864 899452 899379 898493
61181 898493 897104 895269 892907 889901 886020 880741 873692 865425 857186 849548 841837 833281 824130 815080
61167 815080 806105 796538 785983 774618 762855 751169 739882 728652 716575 703324 689853 677350
61155 677350 665836 654458 642918 632019 622852 616039 611664 609399 608594 608560 608757 608556 607088 603720
61141 603720 598599 592433 585904 579419 573237 567526 562478 558434 555601 553639 552023 551046 551843 555063 560007
61126 560007 565567 571585 578835 588017 599258 612271 626576 641792 658122 676281 696688 719076
61114 719076 743078 768733 796027 824371 852931 881091 908338 934177 958486 981429 1002727
61103 1002727 1021695 1038362 1053735 1068273 1080746 1089303 1093165 1092617 1087974 1079457 1067635 1053157
61091 1053157 1036200 1016778 995295 972285 948079 923310 899172 876438 854649 833006 811639
61080 811639 791304 772333 754736 738870 725099 713047 702027 691954 683109 675329 668263 662107
61068 662107 657367 654146 652355 652246 653986 657105 661081 666023 672001 678317 684466 691231 699707 709591
61054 709591 719689 729880 741335 754804 769745 785261 801079 817651 835951 856935 880477
61043 880477 905244 930365 956650 985217 1015655 1046858 1079075 1113640 1150965 1190200 1230685
61032 1230685 1272373 1315122 1359005 1405042 1454149 1505519 1557450 1609428 1661880 1714444 1766524
61021 1766524 1819330 1875341 1935943 2001789 2075270 2159904 2256798 2364084 2480393 2606688 2744958
61010 2744958 2898629 3075426 3286847 3543856 3856481 4238871 4710726 5291976 6000945
61001 6000945 6861261 7906575 9176119 10712209 12561472 14748561 17200709 19676353
60993 19676353 21799659 23228207 23839363 23781311 23361204 22891964 22616147 22692593 23157458
60984 23157458 23852509 24424576 24468803 23736549 22246139 20224733 17961011 15692505 13572751
60975 13572751 11683063 10050190 8664100 7498488 6525323 5717695 5048697 4493888 4033895
60966 4033895 3652647 3334776 3066426 2836960 2638112 2462815 2306173 2166111 2041291
60957 2041291 1929089 1826736 1733395 1649744 1576105 1512035 1456947 1409648 1367483 1327093 1286308
60946 1286308 1244957 1204111 1164965 1128107 1093358 1060326 1029121 1000090 972850 946359 920112
60935 920112 894543 869924 845748 821647 798136 775898 755009 735320 716888 699464 682383
60924 682383 665695 650706 638528 628600 619518 610810 602983 596203 590047 584457 579975 576865 574789
60911 574789 573509 573278 574254 576006 577829 579238 580138 580886 582265 584985 588929 593136 596625 599089 600827
60896 600827 602323 603976 605920 607868 609268 609716 609139 607560 604937 601359 597260 593164 589168 584725 578982
60881 578982 571323 561676 550522 538706 527128 516282 506002 495856 485908 476924 469632 463955 459137
60868 459137 454464 449669 444929 440878 438447 438146 439391 440922 441995 442855 444100 445968 448262 450404 451454
60853 451454 450660 448448 446490 446354 448238 451242 454532 457776 460729 463032 464639 466089 468115 470961 474037
60838 474037 476207 476568 475105 472570 469677 466558 463096 459575 456796 455550 455985 457361 458386 458106 456720
60823 456720 455440 455346 456429 457755 458357 457830 456373 454585 453122 452194 451344 449800 447090 443310 438976 434740
60807 434740 431057 427890 424797 421379 417566 413409 408897 404160 399611 395553 391824 388083 384254 380372
60793 380372 376263 371838 367605 364297 361903 359613 356906 354205 352182 350860 349854 349188 349306 350318 351701
60778 351701 352828 353476 353749 353838 354037 354763 356281 358514 361272 364599 368705 373626 379156 385075 391236 397359
60762 397359 402962 407663 411478 414639 417206 418973 419740 419485 418272 416199 413532 410722 408117 405725 403375
60747 403375 401050 398950 397259 396011 395115 394342 393240 391277 388192 384121 379351 374078 368586 363508 359535
60732 359535 356740 354308 351198 347104 342674 338824 335932 333718 331680 329519 327256 325196 323809 323398
60718 323398 323748 324289 324746 325438 326672 327994 328462 327667 326100 324418 322828 321484 321024 322081 324411 327110
60702 327110 329714 332516 335662 338555 340570 341967 343637 346163 349523 353497 357874 362259 366187 369586
60688 369586 372870 376407 380104 383575 386565 389160 391743 394751 398263 401765 404534 406310 407422 408172
60674 408172 408412 407937 407082 406495 406355 406151 405373 404116 402684 400800 397677 393009 387500 382149 377342 373030
60658 373030 369410 366800 364925 363058 361069 359697 359563 360505 362192 364625 367554 370146 372005 373947 376859
60643 376859 380230 382729 383901 384136 383263 380642 376798 373516 371624 369834 366577 362123 357998 355040 353026
60628 353026 351778 351571 352479 354010 355426 356135 355992 355574 355820 357030 358594 360012 361523 363224 364345 364313
60612 364313 363989 364747 366585 368191 368692 368316 367390 365850 364007 362778 362669 363225 363791 364222 364600 364950 365490
60595 365490 366537 367947 369333 370998 373785 377625 381134 383174 383994 384234 383710 382136 380297 379355 379270 379046
60579 379046 378421 378281 379378 381512 384159 387064 390017 392876 396150 400876 407457 415159 423231 432037 442496
60564 442496 454752 467943 481107 493659 504962 513942 519433 520796 518235 512692 505451 497634 489964
60551 489964 482955 477148 472943 470358 469280 469919 472696 477586 483938 491189 499554 509704 521863 535575
60537 535575 550413 566585 584546 604042 623729 641788 656814 668096 675242 677856 675810 669751
60525 669751 661128 651521 641960 632785 623998 615563 607541 600184 593920 589026 585324 582414 580270 579331
60511 579331 579835 581297 582959 584621 586741 589799 593983 599596 607370 618048 631877 648831 669273
60498 669273 694021 723659 757984 796242 837790 882392 929862 979351 1028925 1075957 1118158
60487 1118158 1154168 1182838 1202084 1209151 1202477 1182895 1152608 1113449 1066858 1015264 962286 910980
60475 910980 862390 816180 772205 731063 693543 660126 630816 605056 582001 561239 543055
60464 543055 527648 514436 502679 492476 484450 478503 473559 468614 463484 458426 453580 448980 444721
60451 444721 440843 437322 434248 431719 429509 427211 424684 422050 419293 416371 413675 411833 411014 410986 411809
60436 411809 413710 416116 417677 417654 416546 414887 412247 408182 403544 399896 397843 396754 395968 395512 395597 396149
60420 396149 397036 398262 399686 400898 401618 402087 402864 404257 405935 407142 407410 407063 406787 406735 406461 405779 405231
60403 405231 405483 406724 408889 411931 415483 418746 421267 423491 426056 428909 431644 434347 437429 440892
60389 440892 444372 447811 451485 455470 459643 464013 468475 472368 474993 476597 478228 480579 483510 486720
60375 486720 490224 494045 497975 501914 505975 510081 513844 517100 520228 523706 527521 531155 534018 535886
60361 535886 537108 538403 540331 543048 546554 550907 556003 561614 568057 576400 587409 600531 614463
60348 614463 628449 642292 655330 666260 674079 678519 679534 677118 671775 664506 656079 646804 637107
60335 637107 627592 618355 608986 599600 591254 584828 579932 575369 570365 565022 559819 555006 550322 545174
60321 545174 539341 533529 528868 525768 523693 522162 521472 522226 524676 528835 534820 542750 552672 564881
60307 564881 579970 598134 618669 640472 662865 685565 707941 728490 745082 755730 759425 756396
60295 756396 747503 733410 714478 691345 665275 638018 611544 587721 567646 551292 538184 528310
60283 528310 521771 517727 514592 511489 508794 506940 505429 503479 500985 498282 495427 492298 489031 485833
60269 485833 482602 479210 475901 472994 470412 467877 465377 463015 460653 458148 455835 454331 453811 453751 453472
60254 453472 452760 451956 451453 451158 450519 449243 447833 447133 447439 448400 449721 451483 453721 456160 458470 460423
60238 460423 461797 462602 463380 464674 466145 466885 466814 466974 468074 469463 470135 470303 471267 473890 477638 481021
60222 481021 482763 482780 482240 482499 483896 485796 487693 489777 492480 496182 501404 508480 516721 524674 531645
60207 531645 538312 545510 553156 560770 568211 575287 581404 586393 591074 596246 601572 606240 610243 614246
60193 614246 618511 622684 626320 628961 630102 629726 628551 627135 625126 621997 617967 613466 608304 602338
60179 602338 596505 592003 588630 584999 580349 575174 570138 565430 561282 558134 555981 554338 553050 552418
60165 552418 552359 552165 551328 549987 548355 546322 543884 541376 539059 536924 535043 533679 532924 532656 532872 533582
60149 533582 534380 534715 534597 534427 534127 533192 531735 530768 531102 532596 534736 537386 540636 544474 548901 553948
60133 553948 559242 564070 568217 572274 576756 581307 585125 587847 589674 591012 592349 594149 596454 598816
60119 598816 600966 603345 606652 611042 616055 621106 625769 629777 633153 636232 639257 641960 643815 644637
60105 644637 644724 644367 643424 641472 638273 634069 629411 624726 620083 615426 610921 606903 603495 600557 598099
60090 598099 596548 596374 597421 598766 599384 598979 598083 597342 596807 596041 594686 592661 589963 586721 583435 580676
60074 580676 578336 575649 572145 568167 564166 560026 555441 550513 545441 540041 534167 528358 523442 519604
60060 519604 516299 512871 508823 503801 497981 492364 488043 485176 483148 481573 480509 479844 479238 478835 479365
60045 479365 481308 484417 488236 492624 497651 503373 509834 516940 524272 531339 537964 544050 549079 552431
60031 552431 554202 555218 556147 557058 557773 557985 556955 553857 548793 542916 537202 531571 525536 519232 513257
60016 513257 507715 501896 494911 486503 477345 468682 461582 456385 452751 450077 447724 445162 442290 439572
60002 439572 437522 436096 434843 433517 432194 431008 430115 429708 429609 429198 428318 427965 429228 431761 434231 436272
59986 436272 438908 442798 447128 450821 454004 457501 461427 464990 467380 468278 467744 466137 463986 461557 458652
59971 458652 455122 451364 447994 445234 442912 440879 439108 437501 435930 434473 433424 433026 433195 433464 433267
59956 433267 432491 431671 431420 431727 432073 432129 432001 431859 431775 431952 432719 434204 436248 438591 440834 442440 443330 444328
59938 444328 446368 449158 451199 451299 449561 446888 444151 442005 440830 440487 440558 441061 442506 445158 448746
59923 448746 453089 458402 464826 472175 480263 488812 496772 502525 505271 505744 505176 504066 502402 500477 498840
59908 498840 497734 497120 497010 497396 498031 498680 499419 500390 501389 501914 501574 500470 499418 499657 501895 505657 510037
59891 510037 514940 520908 527864 535019 542143 549804 557933 565298 571140 576405 582404 588954 594862 599750
59877 599750 604379 609434 614901 620498 625773 629792 631532 630783 628141 624085 618583 611661 603921 596333
59863 596333 589703 584323 579895 575878 572070 568735 566094 564018 562444 561710 562188 563935 567022 571803 578474
59848 578474 586697 596042 606444 617776 629306 639957 648748 654644 656672 655036 651827 649753 650070
59835 650070 652128 654532 655999 655347 651753 645509 637967 630416 623273 616398 609748 603418 597396 591585
59821 591585 586019 580865 576194 571770 567121 562003 556779 552125 548326 545101 542154 539483 537016 534355
59807 534355 531200 527710 524198 520811 517768 515534 514349 513823 513346 512697 511997 511354 510866 510758 511217 512227
59791 512227 513638 515098 515908 515503 514288 513412 513434 513808 514025 514494 515670 517032 517703 517612 517198 516395 514734
59774 514734 512305 509766 507550 505771 504775 504995 506209 507532 508260 508299 507883 507387 507342 508114 509531 511225 513230
59757 513230 515797 518843 522115 525783 530314 535753 541694 547938 554697 562097 569884 577632 584902 591286
59743 591286 596715 601702 606923 612502 617962 622768 626644 629554 631747 633692 635713 637760 639710 641563
59729 641563 643109 643863 643682 643101 642627 642143 641487 641075 641307 641722 641466 640266 638314 635545 631866 627861 624422
59712 624422 621782 619595 617784 616495 615380 613886 612260 611429 611753 612674 613703 614936 616422 617839 619151
59697 619151 620935 623594 626686 629387 631375 633065 635185 638110 641321 643572 644016 643076 641823 640669 639270
59682 639270 637585 636229 635651 635565 635419 634871 633622 631282 627677 622971 617376 611076 604515 598339 592905
59667 592905 588094 583604 579177 574616 570000 565840 562658 560474 559053 558476 558987 560459 562545 565239 568691
59652 568691 572553 576160 579392 582734 586408 590007 593000 595064 595840 594992 592666 589416 585539 580889 575390
59637 575390 569272 562770 556046 549495 543713 539147 536042 534573 534514 535012 535331 535693 536657 537777 537775 536107
59621 536107 533512 530768 527738 524060 520050 516329 512935 509372 505367 501257 497707 495124 493293 491657
59607 491657 490120 489378 490116 492048 494177 495858 497209 498643 500421 502466 504166 504712 504171 503883 505077
59592 505077 507429 509695 511381 512863 514216 515171 516113 517847 520121 521468 520875 518752 516068 513417 511119
59577 511119 509279 507440 505058 502513 500726 499594 497957 495448 493129 491744 490581 488876 487203 486442
59563 486442 486266 485757 484896 484277 483785 482645 480662 478498 476794 475746 475505 476247 477762 479509 481193 482945
59547 482945 484908 487016 489264 491873 495068 498807 502950 507792 514333 523747 536608 553003 573183
59534 573183 596862 621081 639932 648197 645485 635843 623650 611166 599691 590772 585178 582089 580479
59521 580479 580430 582233 585135 588029 590707 593447 595880 597101 596531 593926 589122 582521 575372 568710 562344
59506 562344 555524 548245 541196 534846 529242 524341 519894 515356 510592 506231 502673 499298 495461 491819
59492 491819 489568 488684 488039 487217 487094 488335 490321 492052 493445 495131 497415 500043 502828 505983 509713
59477 509713 513816 517898 521840 525789 529721 533336 536508 539422 542051 543987 545258 546837 549509 552517
59463 552517 554239 554177 553332 552629 551990 551237 550877 551501 553194 556015 560331 566189 573111 580919 589937 599809
59447 599809 608981 616126 621506 626151 630213 632854 633285 631148 626270 618829 609692 600050 590846 582744
59433 582744 576172 570977 566484 562360 559045 556987 555950 555537 555911 557467 560227 563990 568758 574711 582220
59418 582220 592078 605047 620903 638605 657790 679320 704081 732105 763007 795635 826191 848105
59406 848105 855766 848605 830988 808807 786839 768201 754457 746156 744142 749761 762396 777011
59394 777011 785739 782714 767255 742997 715079 687859 663686 642848 624899 610102 599272 592525
59382 592525 588951 587501 587609 588978 591379 594657 598512 602376 605943 609656 614177 619586 625493 631615
59368 631615 637786 643744 649413 655048 660621 665523 669480 673237 677611 682311 686466 689954 693386 697160
59354 697160 701390 706489 712885 720261 727851 735384 743109 751144 759516 768646 779030 790557 802713
59341 802713 815201 827812 840023 851422 862103 871927 879780 884425 885832 884914 882253 877792 871393
59328 871393 862893 852050 839305 826189 813988 802364 790278 777906 766614 757316 749907 744019
59316 744019 739217 734638 729614 724562 720252 716395 712013 707088 702623 699104 696037 693046 690422 688599
59302 688599 688107 689941 694974 703078 713686 726605 740703 752141 755967 750076 736338 717785 696420
59289 696420 674052 653108 635160 619845 606441 595544 588096 583591 580458 577810 575871 575005 575187
59276 575187 576287 578318 581464 586127 592637 600760 609936 620212 632281 646264 660972 674863 687314
59263 687314 698591 708898 717872 724789 728965 730083 728283 723916 717306 708933 699570 689845 679963 670238
59249 670238 661509 654362 648292 642417 636761 632029 628418 625652 624024 624354 626832 630826 635888 642013
59235 642013 648889 655816 662415 668600 673943 678165 682163 687269 693258 698260 700855 701114 699369 695432
59221 695432 689644 683457 678099 673481 669019 664580 660078 655103 649735 644928 641304 638251 634940 631524
59207 631524 628568 625878 622730 618916 614926 611307 608345 606101 604311 602505 600507 598624 597187 596295
59193 596295 596009 596306 596730 596642 595987 595371 595333 596027 597487 599564 601754 603908 606958 611927 618278 624352 629495
59176 629495 634471 639613 644035 647265 650385 654679 660148 666132 672546 679660 687345 695331 703700 712535
59162 712535 721498 730121 737958 744262 748332 750447 751501 751357 748612 742505 734057 724668 714641 703791
59148 703791 692558 681559 670836 660390 650738 642082 633642 624719 615850 607946 600805 593406 585359
59135 585359 577248 569762 563102 557083 551396 546024 541595 538802 537257 535706 533735 532458 533027 535354
59121 535354 538858 543529 549384 555752 562053 568698 576336 584769 593476 602650 612751 623497 634202
59108 634202 644732 655235 665172 673540 679991 685057 689396 693279 696614 698942 699679 698845 697283 695700
59094 695700 693817 690935 687007 682712 678769 675574 673195 671427 670106 669479 669717 669978 668749 665466 661064
59079 661064 656576 651982 646825 641067 634759 627771 620494 613977 608624 603485 597639 591588 586472 582569
59065 582569 579350 576427 573600 570517 567124 564033 561690 559610 557095 554253 551634 549362 547324 545770
59051 545770 544982 544691 544337 543514 541896 539361 536627 534924 534513 534304 533508 532720 532697 533062 533093 532890 532761 532338
59033 532338 531427 530923 531706 533224 534367 535233 536901 539915 544061 549255 555582 562765 570556 579289 589192
59018 589192 599607 609761 619768 629907 639439 647261 653232 657828 660882 661823 660827 658697 655916 652784
59004 652784 650098 648582 647944 647586 647953 650128 654336 659854 666077 672631 678786 683939 688505 693281 698037
58989 698037 701800 704311 706144 707506 708054 707878 707588 707347 706696 705465 704149 703425 703996 706699 711924 718997
58973 718997 726850 735206 744493 754900 766303 778802 792491 806851 821085 834906 848458 861793
58961 861793 874898 887662 899266 908402 914852 919936 924368 926664 924942 919411 911443 900959 886699
58948 886699 868895 849793 831310 813711 796733 780493 764937 749747 735316 722760 712604
58937 712604 704313 697330 691675 687375 684183 682026 680909 680289 679398 678279 677729 678155 679218 680492 681675
58922 681675 682244 681776 680600 679369 678162 676740 675362 674385 673371 671643 669597 668398 668450 669110 669888 671062
58906 671062 673211 676911 682624 690119 698451 707421 718410 732561 748653 764221 778317 791668 804457
58893 804457 815855 825868 835925 847233 859882 873897 889801 907661 926695 946240 966143
58882 966143 985970 1004748 1021679 1036201 1047373 1054269 1057089 1056888 1054156 1048684 1040698 1030897 1019357
58869 1019357 1005690 990496 975480 961880 949828 939317 930647 923698 917774 912325 906971 900947
58857 900947 893618 885379 876904 867708 856798 844488 832012 819458 805856 791423 777934 766379
58845 766379 755907 745598 735789 727008 719041 711697 705192 699112 692258 684212 675901 668053 660292 652409
58831 652409 645285 639759 635593 632349 630286 629635 629774 629952 630262 631339 633619 637224 642022 647532 653342
58816 653342 659678 666839 674168 680461 685386 689518 693022 695522 697289 699247 701524 703122 703400 702803 701851
58801 701851 700362 697876 693934 687942 679836 670855 662514 654890 647093 639216 632219 625955 619094 611347
58787 611347 604135 598677 594880 592471 591634 592083 593021 594510 597420 601620 605747 609220 612879 617118 621001
58772 621001 623813 625803 626666 624972 620112 613396 606379 599353 592235 585522 579505 573802 568451 564217
58758 564217 561114 557966 554209 550819 548726 547698 547482 548562 550843 553009 554224 555266 557032 559161
58744 559161 561090 563242 566234 569932 574163 579338 585647 592716 600633 610006 620370 629914 637630 644393
58730 644393 651200 657759 663589 669010 674067 677966 680597 683275 686925 690818 694103 697276 701151 705723
58716 705723 710999 717598 725491 733559 741462 750481 761309 772348 781454 788072 792417 793905 791842 786727
58702 786727 779559 770658 760078 748107 734551 718711 700917 682799 665202 647364 629035 611720
58690 611720 596702 583504 571546 561563 553918 547218 540325 534244 530246 527527 524487 521036 517832
58677 517832 514441 510219 506028 503225 501723 500744 500628 502206 505099 508240 511480 515286 519634 524608 531261
58662 531261 540377 550989 561321 570520 578378 584299 587721 588744 587391 583311 577118 570667 564923 558998
58648 558998 552410 546535 542385 538806 534653 531005 529194 528227 526404 524132 522781 521950 520342 518412 517724
58633 517724 518330 519096 520005 521861 524169 525515 525816 526263 527318 528598 530387 533406 537323 541080 544409
58618 544409 547570 550035 550966 550532 549406 547601 545253 543792 544733 547898 552238 557533 563702 569437 573401
58603 573401 576164 579189 582559 585372 587614 589794 591414 591617 590880 590385 590265 590011 589938 590652 591753 592646
58587 592646 593886 596189 599064 602009 606036 612158 619385 626109 632573 640023 648352 656645 665151 674572
58573 674572 684128 692447 699795 707514 715965 724927 735165 747510 761206 775229 790484 808613 829439
58560 829439 851691 875392 901212 928161 954246 978796 1001948 1022443 1038137 1048176 1052791 1051846
58548 1051846 1045732 1036803 1027614 1018477 1008765 999470 992030 985712 978695 970646 961595 949569 932526
58535 932526 911782 890414 869013 846297 823227 802912 786528 772566 760159 750036 742200 735700
58523 735700 730796 728437 727509 725516 722100 719128 717272 715374 713175 711651 710392 707613 703192 699074
58509 699074 696378 694584 693566 693661 693707 691881 688708 686527 685879 685159 683828 682998 682738 681828 680518 680524 681892
58492 681892 682738 682552 682942 684710 686958 689499 693360 698496 703716 709240 716630 725959 735733 745827 757629
58477 757629 771168 784988 799077 814845 831958 848189 862583 875559 885739 890127 888116 882212
58465 882212 874323 864449 853346 842954 833549 823881 814815 809396 808565 810235 813442 819867 830178 842353
58451 842353 854919 868594 883422 897313 908621 917304 922629 922853 918239 911323 903300 893213 881582
58438 881582 871329 863917 857842 852190 848430 847340 847357 847362 848164 850060 851979 854200 858828 866411 875133
58423 875133 884365 895696 909227 922153 932375 940443 946750 949993 949666 946961 942113 934006 923439
58410 923439 913384 904980 896643 887976 880805 875303 869066 861397 854654 849976 845644 841155 838815 839504
58396 839504 840804 841258 842712 846577 851495 856503 862729 870119 876282 880414 884581 889412 892630 893697
58382 893697 895730 900664 906629 912225 919175 928386 937627 945627 954421 965109 975310 983453 991571 1001196
58368 1001196 1010484 1018171 1026462 1037163 1048663 1059432 1070856 1084021 1097418 1110317 1124672 1141283
58356 1141283 1157934 1173464 1189418 1205482 1217954 1225451 1231508 1238693 1244772 1247579 1249016 1251187 1253257
58343 1253257 1255185 1259742 1267612 1275385 1281617 1289853 1302179 1315149 1325952 1337383 1352490 1369450
58331 1369450 1386107 1404577 1426700 1449594 1470326 1490394 1511143 1529479 1542843 1553785 1564939
58320 1564939 1574123 1579278 1583533 1590317 1597857 1603512 1609156 1617342 1626589 1635335 1646121 1661000 1677370
58307 1677370 1693073 1710674 1731768 1752354 1769260 1785967 1806432 1828292 1848049 1867799 1890696
58296 1890696 1914691 1936971 1959807 1985830 2012333 2036446 2061114 2089753 2119946 2148626 2178304
58285 2178304 2211744 2245818 2277382 2309833 2346951 2385557 2421415 2457057 2496632 2538465 2580041
58274 2580041 2624777 2676183 2730735 2784143 2839109 2899209 2961052 3020565 3081083 3146936 3215123
58263 3215123 3281799 3350749 3426622 3506096 3584782 3666314 3755240 3847593 3938107 4029943 4127226
58252 4127226 4225172 4318196 4410769 4509403 4611174 4711345 4814724 4927658 5046417 5165780
58242 5165780 5291224 5429840 5577260 5727066 5884885 6059003 6245336 6436539 6637645
58233 6637645 6857150 7091051 7331975 7585677 7861719 8156415 8462519 8787003 9140919
58224 9140919 9520666 9918361 10341519 10802460 11297953 11820433 12379501 12990371 13651712
58215 13651712 14358506 15125919 15975604 16909956 17926403 19045065 20294290 21682483 23215465
58206 23215465 24928509 26869080 29063787 31539179 34360516 37614054 41374298 45738443
58198 45738443 50879906 57027508 64423527 73363412 84251223 97550656 113712744 133226925
58190 133226925 156702728 184805064 218118432 257003918 301057900 347888965 392122950
58183 392122950 426296331 443900588 442445596 424058785 393509196 355782173 314945336
58176 314945336 274131497 235640378 200868287 170392750 144269527 122262477 103927729
58169 103927729 88716141 76116259 65700772 57079367 49894542 43871208 38813005
58162 38813005 34545778 30907767 27786658 25114273 22819780 20823522 19071746 17537602
58154 17537602 16187035 14976171 13880257 12893390 12000545 11178329 10421014 9737520 9123384
58145 9123384 8560920 8044906 7582883 7171263 6795033 6450073 6142745 5867629 5607262
58136 5607262 5354169 5113451 4884425 4659499 4440992 4239818 4056822 3882696 3716025
58127 3716025 3564028 3425553 3290568 3157235 3033367 2920293 2810795 2703781 2605989 2518079
58117 2518079 2433232 2350532 2276156 2210356 2146391 2083254 2026753 1977229 1928494 1879638 1835834
58106 1835834 1796714 1755762 1711996 1670868 1632934 1592911 1550621 1511757 1477069 1441690 1405921
58095 1405921 1375794 1351880 1328092 1302690 1280172 1261138 1240496 1217177 1195862 1177617 1158215
58084 1158215 1137025 1118196 1101741 1082742 1060786 1041089 1024766 1007051 986736 968423 953483
58073 953483 937438 918446 900169 884148 867334 849238 833740 821598 808641 793519 780135
58062 780135 770390 761518 752509 746234 743145 739483 733650 728099 723318 716287 706448 696974 688706 679070
58048 679070 668167 659604 653921 647559 639607 633270 629361 624763 618671 613964 610979 606384 599701 594463
58034 594463 591266 586195 577984 570336 565012 558841 549879 540572 532475 523558 513091 503721 496398 488533
58020 488533 479356 471905 467644 464183 460182 457353 455827 452876 448258 445580 446287 447387 447054 447271 448891
58005 448891 449424 448017 447530 449309 450827 450794 451653 454624 457089 457319 457127 457488 456234 452507 448893 446628
57989 446628 443218 437300 431415 427489 423911 419554 416301 414996 413200 409590 406440 405186 403685 400524
57975 400524 397976 397990 399094 399866 401513 404424 406093 405264 404408 405442 406650 406505 406752 408857 410996 411463
57959 411463 411776 413672 416188 418241 420798 423946 425145 422978 419473 416398 412599 407391 402964 400788
57945 400788 399101 396656 395458 396924 398834 399162 399680 402644 407026 411268 416704 424816 433827 441473 448751
57930 448751 457614 467100 474879 480598 484755 486275 484194 480019 475684 470771 464114 456376 448748 440879
57916 440879 432333 424353 418178 413405 409703 408027 408383 408754 408104 408107 410070 412639 414502 416695 420101 423230
57900 423230 424730 425675 427151 428085 427667 427411 428498 429595 429579 429896 431913 434494 436566 439399 443813 447722
57884 447722 449216 449646 450961 452377 452369 451540 450748 448760 444605 440008 436704 433639 429655 426453 425766 425871
57868 425871 424241 421584 419918 418625 415885 412389 410201 409305 408533 408487 410432 413599 416700 420740 427225
57853 427225 434825 441056 446131 451993 458511 463855 467899 472204 477162 481880 486273 490675 493987 494747
57839 494747 493502 491881 490106 487606 485095 483606 482333 479823 476570 474211 472939 471840 470823 470142
57825 470142 469045 467029 465322 464997 464878 463607 462391 463161 465260 466684 467542 469417 472127 473899 474138
57810 474138 473410 471227 466458 459597 452295 444974 437083 429188 422707 417953 414416 412375 412324 413536 415054
57795 415054 417337 421043 425135 428210 430746 433992 437622 440533 442976 445697 448048 449272 450666 454057
57781 454057 458966 463553 467600 472291 477940 484172 491441 499983 508167 514289 519196 524797 530866 535763
57767 535763 539374 542760 545638 546873 546865 546923 546886 545833 544397 543831 543463 541719 538971 536636 534107 529502
57751 529502 523186 517736 514580 513261 513709 516467 520702 524647 528120 532213 536608 539630 540896 541524 541853
57736 541853 541401 540960 542139 544725 546929 548415 550692 554332 558111 561241 564281 567541 570501 573060 575617
57721 575617 577907 579507 581221 584173 587905 591299 594837 599772 605538 610363 614048 617701 621044 622553
57707 622553 622201 621529 620956 619466 617040 614993 613749 612540 611375 611149 611847 612824 614673 618404 622811 625213
57691 625213 624851 623201 621020 617754 613950 611432 610568 609794 608341 607164 606902 607234 608589 612159 617942
57676 617942 625085 634385 648028 666637 689071 715394 747473 786358 831821 884894 947706 1019232
57664 1019232 1092837 1158437 1205473 1224841 1212334 1172234 1115347 1052133 988885 929730 878371
57653 878371 836284 802066 774217 752595 736330 723024 711476 702839 697732 694483 691615 689807
57641 689807 689816 690598 691109 692061 694236 696844 699086 701728 705550 709708 713051 715689 718059 719861 721119 722811
57625 722811 725315 727674 729458 731691 734772 737162 737638 737361 738221 740303 742429 744126 745745 747463 749307
57610 749307 751396 753373 754478 754865 755899 758519 762277 766372 770484 774290 777580 781205 786413 792745
57596 792745 798182 801814 804726 807840 810705 813010 815341 817724 819395 820872 824202 830054 836381 841122
57582 841122 844529 847757 851004 854286 858300 863108 867419 870439 873101 876367 879866 883321 887658 893364
57568 893364 899172 903786 907649 911843 916480 921327 926681 932497 937936 942853 948354 954818 960839 965321
57554 965321 969259 974229 980482 987665 995940 1005079 1013787 1021287 1028396 1035824 1042723 1048135 1052568 1056900
57540 1056900 1061015 1064879 1069649 1076225 1083712 1090645 1096779 1102572 1107959 1112799 1117460 1121936 1125509 1128248
57526 1128248 1131514 1135924 1140209 1143300 1146182 1150404 1156117 1162913 1171189 1181125 1191432 1200689 1209076 1217555
57512 1217555 1226297 1235137 1244519 1254764 1265389 1276171 1287746 1300100 1311837 1322154 1332250 1343450
57500 1343450 1355206 1366335 1376887 1387345 1397221 1406014 1414516 1423691 1433250 1442653 1452350 1462564 1472085
57487 1472085 1479880 1486906 1494772 1503464 1511902 1519858 1527844 1535902 1543903 1552377 1561774 1571526 1580813 1589419
57473 1589419 1597085 1603251 1608377 1614184 1621515 1629328 1636814 1644839 1654089 1663582 1672533 1681939 1692619 1703438
57459 1703438 1713395 1723826 1736419 1750489 1764327 1777886 1791951 1805921 1818771 1831134 1844185
57448 1844185 1857439 1869878 1882231 1895822 1910085 1923577 1936637 1950660 1965431 1979639 1993449
57437 1993449 2008180 2023882 2039537 2055309 2072237 2089950 2106912 2122841 2138771 2154870 2170240
57426 2170240 2184797 2199478 2214641 2229945 2245590 2261959 2278426 2294281 2310353 2327818 2345856
57415 2345856 2362557 2377801 2393251 2409761 2426843 2444460 2463227 2482937 2502747 2522612 2542704
57404 2542704 2561811 2578512 2593753 2610071 2628343 2647300 2666064 2684862 2703342 2720651 2737537
57393 2737537 2756077 2776823 2798202 2819101 2840066 2861475 2882552 2902835 2922948 2943379 2964047
57382 2964047 2985411 3008345 3032516 3056484 3079699 3102840 3125989 3148246 3169510 3190867 3212754
57371 3212754 3234399 3255515 3276918 3298955 3320935 3342639 3364915 3388198 3411880 3435627 3459955
57360 3459955 3485016 3510185 3535354 3561346 3588546 3616296 3643987 3671606 3698928 3725403 3751130
57349 3751130 3776827 3802741 3828707 3855196 3882883 3911222 3938944 3965990 3993407 4021343 4048901
57338 4048901 4076145 4104368 4133960 4163789 4193181 4222825 4253097 4283184 4312589 4341976 4371735
57327 4371735 4401098 4429523 4457747 4486646 4516069 4545446 4574644 4603743 4632867 4662548 4693345
57316 4693345 4724863 4756095 4786734 4817134 4847122 4876236 4905116 4935081 4966171 4997084 5027278
57305 5027278 5057606 5088587 5119637 5150419 5181468 5213056 5244766 5276564 5308899 5341438 5373142
57294 5373142 5403943 5434906 5466420 5497668 5528201 5558498 5588658 5618139 5647196 5676973 5707710
57283 5707710 5738468 5769026 5800327 5832538 5864395 5895205 5925840 5957021 5988231 6019099 6050306
57272 6050306 6082251 6114345 6146377 6179098 6212594 6245584 6277227 6308263 6339515 6370720 6401693
57261 6401693 6433166 6465417 6497348 6527976 6557710 6587240 6616348 6644684 6672574 6700236 6727310
57250 6727310 6753938 6781091 6808965 6836229 6861674 6885502 6908370 6930405 6951912 6973685 6995692
57239 6995692 7016675 7035891 7054073 7071926 7088971 7104713 7119622 7134072 7147552 7159850 7171744
57228 7171744 7183672 7195093 7206124 7218379 7233040 7249315 7265953 7283107 7301551 7321260 7341960
57217 7341960 7364011 7387551 7411705 7435745 7460114 7485253 7510406 7534582 7557781 7580320 7601883
57206 7601883 7622135 7641277 7659144 7674903 7688531 7701376 7714216 7726000 7735551 7743231 7749706 7754339
57194 7754339 7756221 7755805 7754179 7751634 7748127 7744155 7739840 7734152 7726320 7717145 7707630 7697293 7685198 7671703
57180 7671703 7657719 7643027 7626866 7609557 7592077 7574546 7556470 7538041 7519851 7501606 7482228
57169 7482228 7460910 7437248 7410783 7381293 7348954 7313466 7273791 7229565 7181882 7131777 7078972
57158 7078972 7023253 6966046 6909228 6853103 6796857 6740412 6684571 6630022 6577436 6527967 6482277
57147 6482277 6439476 6398223 6358531 6321441 6287334 6255579 6225365 6195836 6165717 6133703 6099037
57136 6099037 6061191 6019704 5974898 5927939 5879428 5828809 5775995 5722645 5670997 5622336 5577437
57125 5577437 5537352 5502581 5472459 5446464 5425159 5408709 5395507 5383579 5372547 5363195 5356270 5353105
57113 5353105 5356476 5369348 5393466 5430256 5481990 5550682 5637010 5742131 5870067 6027095 6219893
57102 6219893 6456022 6745558 7101035 7537025 8071901 8729910 9540751 10538469 11762090
57093 11762090 13254998 15059503 17209617 19726964 22618706 25874080 29461723 33331526
57085 33331526 37418012 41640185 45900354 50087253 54080699 57751782 60963298 63581680
57077 63581680 65499056 66648741 67003129 66562033 65346077 63398714 60789931 57615845
57069 57615845 53993631 50053341 45928438 41747152 37625567 33661951 29932668 26490927
57061 26490927 23368193 20576472 18111104 15954868 14082733 12465446 11072006 9872321
57053 9872321 8839466 7949904 7182443 6518089 5940716 5436860 4995062 4606094 4263213
57044 4263213 3960845 3693129 3454548 3241332 3050924 2880505 2727303 2589944 2468067
57035 2468067 2360796 2266885 2185998 2118398 2063665 2021200 1991909 1978247 1982937 2008350 2054877
57024 2054877 2116114 2175161 2209192 2200801 2146115 2053547 1937239 1811465 1687437 1571697 1466632
57013 1466632 1372760 1290349 1219251 1158608 1107288 1063997 1026923 994226 964984 938875 915093
57002 915093 892527 870836 850249 830462 810828 791433 772862 755205 738479 723541 711043
56991 711043 699928 688718 678066 670186 665903 664301 665281 670155 679091 689867 699740 706761 708765
56978 708765 703261 689584 669810 646619 621606 596247 572759 552637 535592 520988 509355 501447
56966 501447 496822 494430 493945 495740 500226 507904 519528 535715 556848 583232 614139 646220 673929
56953 673929 692214 698437 692205 674986 650392 623248 597175 573444 552177 533531 517529 504119
56941 504119 493964 488071 486261 487242 490645 497716 509519 525813 546343 571845 602809 638024 674702
56928 674702 708716 734296 745399 739139 717522 685280 646917 606186 566608 530698 499137 471705
56916 471705 448572 429935 415072 402692 391895 382289 373702 366308 360497 356195 352857 350371 349246
56903 349246 349615 350912 352898 356096 360768 366332 372276 378861 386448 394900 404077 414279 425889 439255
56889 439255 454985 473509 494303 516530 540211 565213 588797 605904 612676 608685 595522 575000
56877 575000 549611 522977 498201 476440 457954 443569 434166 429683 429767 434832 445612 462236 484528
56864 484528 512722 547353 589034 638843 698138 766964 842277 917150 981111 1022560 1033784
56853 1033784 1015252 974552 920929 861633 802533 748998 704383 669151 642831 625693 617728
56842 617728 617728 625054 641207 668334 707156 757665 820876 898573 991961 1100997 1222719 1347478
56830 1347478 1457457 1532140 1557674 1532278 1464535 1368141 1257340 1144226 1037649 943189
56820 943189 863424 798280 746247 706190 677963 661394 655558 659514 673094 696740 731329 778404
56808 778404 839525 914577 1000494 1090516 1173199 1233242 1257060 1240128 1188663 1114058 1026970
56797 1026970 936178 849179 770866 702626 644455 597064 560744 533794 514015 500941 495103
56786 495103 496162 503423 517355 538957 568281 604860 648341 696429 742475 777074 792656 786326
56774 786326 759557 716998 665233 610754 558123 509902 467349 430397 397906 369123 344412
56763 344412 323853 306288 290880 278470 269915 263980 258432 252476 246575 240647 234198 227813 222758
56750 222758 219211 216307 213665 211526 209651 207519 205491 204458 204327 204010 202838 201049 199048 197131 195654
56735 195654 194544 193001 190640 188451 187629 187954 188443 189069 190511 192597 194369 195588 196940 198763 200638
56720 200638 202281 203934 205917 208409 211500 214878 217866 220305 222757 225234 226600 226227 225372 225705 227174
56705 227174 228515 229299 230108 231154 232105 233078 234573 236443 237876 238401 238338 238482 239747 242494 245705 247651
56689 247651 247979 248152 249171 250197 250414 250788 252464 254574 255380 254779 254018 253606 253188 252940 253501 254825 256384
56672 256384 258100 259863 260794 260241 258883 257633 256236 254207 252176 250811 249426 247332 245634 245827 247390
56657 247390 248680 249455 250574 251888 252570 252996 254139 255438 255411 254154 253121 252553 251277 249035 246943 245451
56641 245451 243773 241531 239277 237225 235132 233465 233021 233285 232830 231424 230216 229838 229887 230141 230676 230841
56625 230841 229847 228268 227324 226816 225494 223283 221321 219887 218191 216132 214351 212584 210010 207236 205877
56610 205877 206018 206122 205598 205341 205527 205120 204076 203817 204826 205772 205771 205634 206106 206664 206937 207706 209535 211754
56592 211754 213575 215027 216231 217003 217586 218599 219881 220595 220619 220541 220303 219371 218237 218030 218577 218608 217958 217699
56574 217699 218026 218125 218342 220143 223399 226042 227219 228702 232202 237259 242805 248883 255706 262781 270211
56559 270211 279373 291060 304103 316639 327402 335151 338575 337929 335459 333107 330888 328191 325367
56546 325367 323031 321008 318855 316525 313892 310653 307141 304136 301505 298242 294118 289985 286270 282637
56532 282637 279369 277331 276225 274598 272019 269561 267786 266139 264762 264838 266462 268142 269158 270417 272171
56517 272171 272970 271939 270145 268621 266879 264490 262278 260767 259152 257037 255482 255116 254822 253566 251985
56502 251985 250982 250270 249497 249260 249816 250266 250164 250446 251604 252460 251941 250651 249542 248539 247592 247470 248298
56485 248298 248848 248478 248276 249082 250034 250379 251054 253001 255453 257403 259279 261607 263404 263554 262638 261912 261556
56468 261556 261238 261255 261834 262396 262681 263439 264916 266002 266010 265899 266555 267325 267473 267632 268526 269654 270466 271369 272425
56449 272425 272670 271973 271842 273057 274311 274657 275364 277602 280093 281074 280937 280918 280665 279288 277558 276873 277010
56432 277010 276886 276564 276704 276956 276609 275919 275294 274280 272847 272374 273699 275489 276274 276722 278093 279799 280536
56415 280536 280595 280999 281442 281140 280745 281373 282622 283457 284171 285578 287229 288304 289325 291156 293221 294628
56399 294628 296062 298614 301635 303649 304550 305018 304706 302949 300404 298119 295782 292732 289788 288245 288008
56384 288008 288525 290502 294595 299391 302834 304907 306900 308853 309696 309173 307635 304709 300153 295297 291674
56369 291674 289004 286332 284331 284506 286877 290307 294267 298475 301891 303990 305992 308925 311674 313026
56355 313026 314286 317393 321655 324968 327309 330277 333931 336791 338472 339744 340385 339449 337322 335267 333329
56340 333329 330807 328292 327145 327567 329152 332449 337758 343420 347782 351912 357807 364822 370591 374694
56326 374694 378591 382673 386317 390242 395659 401378 404797 405703 406235 407230 407511 406824 406550 407193 407704 407682 407953
56309 407953 408880 410192 412340 415865 419735 422592 425186 429144 433985 438059 441925 447691 455198 461910
56295 461910 466724 471004 475752 480611 485886 492633 500279 506782 511658 516551 522648 529877 538602 549484
56281 549484 561460 572433 582228 592526 603959 615749 628166 642563 658837 675464 692213 710273
56269 710273 729678 749311 769541 792121 817309 843770 871494 902079 935968 972153 1010838
56258 1010838 1053783 1101950 1155508 1216138 1286358 1366439 1454966 1552712 1662916 1787379 1925180
56247 1925180 2075507 2238719 2414136 2599732 2794379 2997398 3205402 3412439 3613550
56238 3613550 3805217 3982121 4136855 4263673 4359672 4422048 4447624 4435954 4389923 4312566
56228 4312566 4206187 4075013 3925300 3761881 3587406 3405442 3221151 3038170 2857925
56219 2857925 2682586 2515490 2357995 2209156 2069255 1940393 1822921 1714710 1614768 1524217
56209 1524217 1442874 1368308 1299260 1236709 1180629 1129127 1081673 1039713 1003056 969188 937159
56198 937159 908636 884088 861608 840637 822983 808780 795226 780943 767967 757797 749019 740521
56186 740521 733521 728649 724364 719930 716657 714622 711592 706833 702635 700479 699107 697852 698216 700459
56172 700459 702326 703000 704745 708754 713046 716412 720731 727225 733906 739028 743783 749498 755480 761606
56158 761606 769697 780345 791594 802555 814876 829024 842914 856040 871025 889130 908341 928030
56146 928030 951286 980153 1012853 1048526 1090714 1143079 1205366 1276449 1357542 1449081 1547601
56135 1547601 1648403 1748100 1842337 1925222 1994410 2053685 2108047 2159674 2210614 2264485 2321816
56124 2321816 2377402 2425668 2465218 2495410 2512887 2515390 2505341 2485752 2455528 2411967 2354623
56113 2354623 2283682 2198286 2100105 1995499 1890988 1789524 1693478 1607053 1532507 1467896 1411696
56102 1411696 1365761 1330682 1302560 1277966 1257978 1243911 1233346 1224030 1217416 1214582 1212935 1210775
56090 1210775 1210775 1215034 1221076 1226686 1234016 1244678 1255429 1263350 1270853 1280956 1292001 1301746 1312233
56077 1312233 1325767 1340307 1353717 1368312 1386376 1405436 1422844 1440696 1461378 1482723 1502499
56066 1502499 1523065 1546552 1570053 1590776 1611230 1634190 1657447 1678824 1701146 1726718 1752250
56055 1752250 1775079 1798843 1826790 1855082 1879369 1902462 1928537 1955263 1978975 2002322 2029178
56044 2029178 2056977 2081786 2106198 2134517 2164984 2194380 2225425 2261804 2300821 2338946 2379611
56033 2379611 2427434 2479725 2531815 2585489 2643794 2703091 2759079 2815256 2876392 2939178 2998562
56022 2998562 3057667 3121833 3188654 3253927 3321634 3397568 3478767 3559853 3643934 3736290 3833229
56011 3833229 3928724 4026218 4132169 4243772 4355045 4468949 4591067 4717676 4843063 4972315
56001 4972315 5113479 5263655 5416708 5577793 5755355 5945580 6140331 6343667 6564359
55992 6564359 6798934 7039222 7290047 7561907 7852843 8155747 8476741 8827129 9203969
55983 9203969 9598406 10016284 10469992 10957356 11470402 12017515 12614289 13260505 13950359
55974 13950359 14697240 15523041 16431796 17420929 18508952 19723178 21070948 22555344 24209187
55965 24209187 26080150 28195465 30580607 33301963 36452214 40111471 44374301 49406103
55957 49406103 55428668 62676412 71433914 82100154 95146002 111030298 130239057
55950 130239057 153377559 181120893 214084090 252722608 296888472 344605903 390781578
55943 390781578 427629630 447568104 446809493 426848111 392961479 351426038 307549882
55936 307549882 265061971 226195486 191950089 162483008 137535563 116677025 99367003
55929 99367003 85024727 73138343 63292422 55116025 48275300 42517729 37665447 33558099
55921 33558099 30042560 27011372 24401130 22147479 20177516 18443594 16924802 15591712
55913 15591712 14402098 13331799 12377548 11527093 10755042 10049323 9413875 8842892 8317611
55904 8317611 7830179 7386636 6984411 6609435 6257171 5934860 5641139 5363907 5100087
55895 5100087 4857811 4637185 4427782 4227054 4043047 3876727 3719026 3567607 3429828
55886 3429828 3306591 3189248 3075197 2971398 2879599 2792154 2704867 2620462 2537309 2448339
55876 2448339 2353800 2262671 2179207 2099770 2024085 1957059 1897664 1838289 1777331 1721001 1670876
55865 1670876 1621178 1570306 1523715 1483127 1443776 1404508 1369928 1340340 1310069 1278106 1250210
55854 1250210 1228093 1206474 1183296 1162930 1146585 1129122 1108183 1087361 1067573 1044365 1016731
55843 1016731 989963 966712 943455 918647 896167 877670 859346 839388 821249 806596 792224
55832 792224 776723 763173 752581 741539 728988 718476 711153 703282 693210 684066 676854 667559
55820 667559 654097 640004 628286 617350 605678 594900 585704 576088 565972 558286 553457 548153
55808 548153 541203 535363 531621 527528 522847 520979 522835 525090 526526 530300 537824 546099 553224 560847
55794 560847 568981 574155 575183 575282 576108 575039 570689 565615 561130 554895 546205 538226 532179 524538 512837
55779 512837 499273 485791 470755 453552 437638 425778 416556 408557 403740 403893 407750 414090 423310
55766 423310 433469 439291 438014 432353 425404 416960 407158 398832 393216 387579 380094 372858 367340 361201
55752 361201 352686 343903 336589 328773 318968 309668 303267 298175 292329 286957 283467 280094 275084 270073
55738 270073 267035 264973 262679 261561 262607 263653 262839 261735 262024 262172 260514 258418 257129 254552 248715
55723 248715 241626 236176 231809 226696 221680 218565 216718 214790 213743 214919 217077 218493 220152 223835
55709 223835 228834 233410 237688 242332 246241 248318 249746 251794 253067 251553 247677 242836 236738 228729
55695 228729 220006 212012 204342 196577 190346 187108 185694 184395 183659 184349 185318 185316 185546 187760 191430 195162
55679 195162 199226 204300 209425 213574 217543 221899 224813 224444 221852 219194 216687 213756 211425 210832 210810
55664 210810 209498 207202 205411 204374 203822 204625 207360 210573 212651 214160 216355 218871 220943 223281 226550
55649 226550 229540 231014 231861 233306 234597 234606 234047 233843 232950 230150 226374 222900 218852 212899 205899 199447
55633 199447 193368 187022 181422 177531 174042 169541 165307 163236 162417 160645 158040 156256 155247 153762
55619 153762 152185 151976 152896 153302 152597 151135 148615 144894 141442 139604 138333 135963 133149 131599 130981
55604 130981 129797 128318 127932 128307 127941 126928 126549 126618 125835 124351 123537 123532 123273 122625 122297 122066 121172 119990
55586 119990 119326 118746 117601 116913 118019 120151 121686 122985 125564 129138 132117 134592 138277 143710 149891
55571 149891 156481 164108 172661 181368 190254 199488 207611 212571 214232 213927 211950 207566 201065 193719
55557 193719 186027 178031 170888 166016 162952 160026 156786 153899 151234 148111 144914 142368 139771 136018
55543 136018 131774 128507 126018 123183 120468 119302 119474 119552 119428 120019 120999 121354 121688 123299 125400 126076
55527 126076 125737 126641 128990 130456 129935 128907 128591 128422 128006 128028 128401 127698 125215 121706 117563 112216 105831
55510 105831 99777 94958 91431 89753 90769 93854 97305 100598 104278 107653 108930 107895 106151 104350
55496 104350 101564 97841 94932 93644 92621 90655 88303 86468 85217 84644 85105 85971 85972 85321 85598 86972
55480 86972 87602 86518 85075 84623 84675 84475 84564 85537 86664 86950 86453 85643 84574 83397 82608 82146 81319 80078
55462 80078 79266 79262 79522 79674 79818 79620 78529 77076 76459 76704 76818 76830 77851 79803 81112 81196 81435 82929
55444 82929 84956 86389 87068 87087 86263 85063 84652 85345 86264 86909 87588 87993 87123 85214 83965 84113 84429 83876
55426 83876 83112 82980 83098 82957 83012 83689 84539 85211 86113 87403 88585 89741 91770 94679 96952 97419 96506
55409 96506 94975 92825 90248 88307 87606 87344 86581 85557 85075 85448 86595 88233 89569 89808 89219 88712
55393 88712 88343 87591 87054 88082 90433 92170 92460 92682 94082 96112 97837 99228 100218 100194 99433 99388 100522
55376 100522 101352 100588 98761 96801 94606 92037 89756 87937 85681 82831 80862 80736 81308 81183 80721 80897
55360 80897 81525 82024 82730 83979 84927 84714 83906 83502 83396 82945 82135 81090 79498 77663 77044 78485 80858
55343 80858 82621 83719 84808 85735 86146 86646 87887 89260 89821 89848 90192 90782 90946 90655 90283 89701 88695
55326 88695 87759 87518 87823 88174 88487 88810 89055 89532 90790 92370 92930 92290 91957 92766 93509 92984 91894 91315
55308 91315 90814 89661 88586 88537 88805 88293 87688 88378 89920 90598 90053 89467 89409 89331 89109 89394 90306 91109 91278
55289 91278 90818 89698 88112 87074 87570 89196 90629 91196 91041 90149 88394 86316 84715 83599 82488 81493
55273 81493 81140 81422 81953 82742 83931 85145 86030 86936 88130 88878 88433 87406 86970 87159 87167 86931 87087 87646
55255 87646 88011 88164 88580 89082 89009 88468 88256 88524 88617 88267 87886 87626 87168 86580 86441 86881 87275 87095 86463 85772
55235 85772 85216 84714 83968 82826 81837 81925 83088 84071 83975 83461 83602 84303 84886 85479 86664 88253 89635 90904
55217 90904 92418 93612 93590 92670 92043 92007 91790 91071 90395 89960 89303 88477 88389 89476 90874 91423 90948 90221 90084
55198 90084 90776 91794 92377 92393 92564 93525 95006 96318 97130 97279 96391 94488 92474 91198 90433 89567 88855
55181 88855 89036 90077 91214 92006 92416 92216 91287 90327 90236 90892 91455 91778 92585 94246 96283 98128 99662
55164 99662 100902 101818 102460 102812 102674 102144 101952 102713 104157 105571 106613 107130 106761 105452 103894 102645 101331
55147 101331 99505 97708 96754 96480 96249 96218 96953 98132 98796 98660 98172 97514 96590 95814 95808 96453 97151 97833 98754
55128 98754 99583 99720 99309 98890 98312 97085 95630 95004 95422 96082 96389 96338 95888 95083 94767 95949 98297 100306
55110 100306 101117 101326 101880 103044 104499 105718 106200 106055 106220 107418 109134 110330 110809 111052 111154 110914 110556
55093 110556 110256 109387 107456 105479 105079 106401 108171 109570 110733 111599 111846 111945 112807 114259 115221 115495 115957
55076 115957 116815 117215 116892 116780 117500 118548 119416 120310 121196 121393 120709 119961 119734 119495 118527 116976 115550 114805
55058 114805 114927 115523 115591 114531 113192 112903 113569 113848 113234 112546 112183 111386 109730 108029 107082 106689 106532 106933
55040 106933 108099 109489 110563 111299 111560 110923 109671 108968 109435 110348 110812 110867 110889 110772 110316 109752 109263 108635
55022 108635 107768 106934 106203 105344 104545 104434 105085 105839 106351 106886 107373 107263 106724 106833 107959 108955 108641 107247
55004 107247 105814 104986 104961 105757 106868 107422 107251 107095 107318 107284 106589 106015 106511 107902 109272 110041 110137 109718
54986 109718 109217 109056 108990 108366 107331 106933 107713 109083 110429 111769 112866 112882 111669 110398 110101 110433 110581
54969 110581 110507 110481 110352 110164 110718 112500 114697 116115 116542 116419 115902 115145 114867 115630 116919 117824 118252 118690
54951 118690 119197 119426 119370 119326 119361 119350 119332 119364 119330 119195 119040 118614 117582 116482 116593 118286 120372 121658 122312
54932 122312 122955 123346 122979 122305 122296 123190 124511 125885 127112 127953 128732 130622 134471 139739 145397 151377 158209
54915 158209 165637 172690 178886 184441 189310 192843 194346 193361 189636 183549 176478 169981 164564 159725
54901 159725 155133 151174 148322 146382 144408 141299 136773 131971 128637 127417 127343 127273 127154 127486 128219 128926
54885 128926 129578 130405 131309 132049 132771 133834 135420 137762 141392 146610 152951 159600 166058 172134 177798
54870 177798 183409 189484 195681 200483 202471 201465 198048 192600 185429 177347 169381 162215 156280 151858
54856 151858 148668 145919 143355 141615 140951 140311 138449 135462 132438 130036 128139 126473 124800 122862 120802
54841 120802 119309 118714 118377 117527 116315 115408 115012 114897 114985 115273 115587 115909 116472 117066 116925 115862 114819 114700
54823 114700 115337 116150 116953 117398 116706 114927 113482 113303 113315 112055 109986 108739 108693 108933 109165 110056 111748
54806 111748 113544 115110 116669 117991 118407 117975 117516 117455 117582 117866 118397 118651 117995 116963 116806 117691 118531
54789 118531 118756 119064 120061 121322 122230 122842 123429 123962 124450 125117 125920 126487 126828 127560 129195 131673 134635
54772 134635 137618 139996 141349 142017 142799 144216 146535 150182 155323 161302 167359 173770 181339 189844 197963
54757 197963 204702 209890 213296 214385 213145 210153 205552 198957 190673 182097 174447 167889 162175 157316
54743 157316 153189 149255 145240 141576 138741 136660 135085 134055 133578 133246 132553 131442 130382 130046 130860
54728 130860 132573 134479 136342 138779 142223 145979 149137 152086 156167 161902 168523 175209 181784 188056
54714 188056 193395 197227 199252 199066 196393 191799 186415 180825 174957 169054 163787 159335 155267 151505
54700 151505 148432 145935 143378 140818 139113 138431 137698 136104 134242 133080 132613 132210 131636 131073 130653 130513
54684 130513 130822 131288 131153 130081 128593 127311 126352 125760 125732 125957 125428 123611 121244 119456 118538 118151 118151 118574
54666 118574 119194 119759 120430 121472 122663 123473 123640 123259 122529 121715 121182 121155 121621 122500 123626 124477 124380 123221
54648 123221 121596 120175 119264 119053 119706 121034 122516 123811 124871 125501 125429 124925 124730 125180 125972 126848 127756
54631 127756 128196 127357 125386 123687 123314 123694 123607 122864 122348 122734 123858 125162 126271 127159 128014 128828 129176
54614 129176 128771 128194 128390 129301 129785 129163 128069 127304 126736 125972 125352 125407 125855 126057 126119 126676 127759 128666 128860
54595 128860 128339 127205 125621 124250 124046 125284 127149 128498 128878 128677 128460 128291 127749 126603 125343 124774
54579 124774 125127 125916 126640 127210 127602 127653 127435 127368 127652 128017 128318 128864 129753 130363 130178 129807 130448 132329 134291
54560 134291 135098 134713 134024 133623 133273 132571 131795 131772 132943 134867 136727 138069 138884 139338 139691 140199 140722 140698
54542 140698 139933 139146 139274 140469 142214 144043 145551 146129 145556 144623 144316 144521 144441 144054 144006 144137 143425 141687
54524 141687 140066 139351 138968 138260 137670 137839 138395 138527 138123 137563 136909 136090 135435 135281 135386 135303 135022 134736 134381
54505 134381 133889 133537 133555 133785 134121 134846 136066 137242 137709 137319 136245 134750 133471 133276 134287 135614 136502
54488 136502 137184 138113 139097 139835 140591 141505 141853 140953 139406 138528 138816 139779 140967 142335 143728 144781 145351
54471 145351 145538 145469 145543 146488 148503 150624 151642 151443 150843 150398 150112 150024 150207 150252 149606 148438 147544 147362 147746
54452 147746 148623 150110 151882 153088 153180 152382 151170 149718 147997 146092 144267 142865 142130 141900 141635 140975
54436 140975 140121 139414 138841 138330 138224 138917 140166 141294 142055 142818 143945 145346 146658 147498 147615 147164 146790
54419 146790 147057 147824 148441 148544 148428 148677 149645 151156 152539 153119 152879 152456 152319 152266 151952 151474 151109 150832
54401 150832 150554 150539 151133 152230 153393 154346 155085 155790 156934 159073 162113 165140 167381 169018 170565 171832
54385 171832 172164 171451 170219 168787 166963 164620 162093 159886 158292 157374 157094 157428 158422 160064 162104 164245
54369 164245 166502 169025 171619 173909 176034 178489 181241 183734 185991 188766 192233 195518 198152 200971
54355 200971 204670 208236 209864 208858 205739 201170 195895 191215 188154 186281 184384 182094 179839 177474
54341 177474 174255 170229 166423 163483 161096 158973 157415 156589 156128 155795 155873 156595 157743 159038 160325 161278
54325 161278 161553 161381 161387 161653 161602 160984 160338 160241 160634 161137 161519 161636 161354 160785 160255 159896 159606 159421 159477 159594
54305 159594 159348 158634 157668 156420 154552 152120 149885 148674 148649 149240 149620 149359 148922 149357 151101 153320 154891
54288 154891 155792 156878 158427 159700 160016 159607 159230 159448 160445 162042 163642 164516 164317 163164 161305 158993
54272 158993 156662 154845 153909 154025 155182 156960 158565 159500 159956 160237 160231 159938 160063 161358 163668 166200 168460
54255 168460 170314 171613 172518 173788 175774 177408 177201 175090 172362 169927 167751 165866 164747 164489 164698
54240 164698 165407 167096 169524 171509 172240 172004 171352 170437 169488 169069 169357 169856 170196 170514 170739 170300 169068
54223 169068 167877 167535 167738 167473 166227 164484 163244 163155 163861 164245 163696 162872 162653 162694 161967 160526 159534 159464
54205 159464 159512 159148 159010 159621 160277 160041 159096 158283 157887 157627 157396 157348 157540 157961 158664 159529 160232 160765 161553
54186 161553 162762 163925 164509 164476 164081 163589 163360 163688 164327 164759 165030 165702 166746 167290 166780 165737 164967 164620
54168 164620 164395 164088 163616 162987 162527 162563 162797 162658 162378 162732 163555 163612 162457 161255 161079 161441 161404 161208 161635
54149 161635 162464 162680 161938 160798 159742 158813 158101 157869 158276 159401 161310 163631 165415 165958 165451 164447
54133 164447 163140 161721 160895 161259 162444 163520 164032 164114 163915 163578 163563 164312 165682 167209 168791 170651 172734
54116 172734 174610 175928 176731 177398 178399 179857 181281 182108 182584 183545 185199 186790 187694 188042 187925 186891
54100 186891 184912 183044 182291 182359 182310 182006 182137 183244 185400 188444 191887 195045 197954 201617 206512 211322
54084 211322 214050 214072 212254 209502 206255 203140 200953 199787 198961 197907 196488 194559 192008 189365 187649
54069 187649 187438 188496 190247 192131 193623 194518 195219 196227 197355 197962 197896 197659 197650 197770 197854 198065 198768 200249
54051 200249 202546 205359 208266 211214 214542 218353 222231 225801 229072 231939 233960 235092 236033 237325
54037 237325 238728 240108 242171 245446 249188 252322 254965 257920 261143 263959 266506 269583 273006 275470
54023 275470 276368 276603 277205 278112 278767 279096 279333 279472 279335 278750 277394 274981 271801 268605 265725 262751 259191
54006 259191 255036 250533 245941 241657 238102 235291 232824 230364 227809 225118 222423 220240 218992 218383
53992 218383 217761 216997 216414 215976 215322 214536 214033 213594 212427 210391 208352 207030 206284 205872 206037 206746 207123
53975 207123 206391 204932 203723 203055 202487 201819 201416 201527 201821 201842 201690 202044 203506 205923 208447 210433 212221
53958 212221 214820 218772 223567 228228 232319 236311 241169 247660 256004 266198 278527 293399 310353
53945 310353 327450 341885 351187 354007 350535 342751 333749 325958 319984 315457 312470 311364 311503 311395
53931 311395 310204 308312 306281 304112 301769 299660 298158 297217 296845 297396 299071 301577 304600 308239 312622
53916 312622 317539 322762 328360 334330 340268 345782 351006 356317 361620 366224 369408 371015 371519 371560 371366
53901 371366 370663 369173 367024 364498 361679 358608 355543 352668 349721 346321 342507 338533 334287 329388
53887 329388 323694 317224 309812 301436 292805 285008 278624 273642 269971 267326 264800 261475 257517 253862
53873 253862 250825 247928 245110 243060 241981 241015 239382 237286 235167 232853 230096 227325 225118 223368
53859 223368 221610 219861 218566 217968 217968 218350 218742 218635 217889 217024 216604 216516 216109 214870 212788 210322 208246
53842 208246 207226 207326 208032 208847 209523 209836 209693 209572 210150 211205 211552 210499 208821 207809 207876 208555 209383
53825 209383 210166 210731 211024 211253 211515 211582 211478 211896 213411 215558 217268 218046 218237 218269 218306 218548 219257 220395
53807 220395 221735 223415 225973 229656 234007 238284 242111 245707 249631 254350 259829 265533 270877 275652
53793 275652 279888 283543 286559 289110 291456 293543 295050 295913 296533 297287 297970 297923 296790 294933 293000 291153
53777 291153 288962 286042 282508 278627 274375 269649 264765 260321 256621 253471 250482 247291 243624 239560
53763 239560 235653 232429 229826 227529 225674 224640 224182 223430 221969 220345 219319 219088 219396 219920 220253 219984
53747 219984 219131 218172 217489 217150 217346 218463 220369 222097 222696 222118 221008 220007 219569 220013 221230 222554
53731 222554 223351 223644 223881 224295 224792 225278 225807 226496 227498 228922 230640 232363 234009 235749 237615 239390
53715 239390 241056 242927 245059 246880 247791 247932 248067 248893 250676 253341 256613 260173 263825 267434 270751
53700 270751 273690 276834 281152 286855 292904 297966 301578 304074 305769 306771 307441 308414 309930 311373 311676
53685 311676 310270 307709 305295 303967 303600 303520 303502 303851 304580 305081 304813 303924 303005 302471 302282 302003 301122 299641
53667 299641 298303 297848 298100 298309 298272 298441 298832 298677 297486 295782 294380 293534 293212 293563 294573 295683 296324
53650 296324 296494 296388 295854 294737 293474 292863 293363 294904 297107 299407 301289 302780 304509 307000 310127
53635 310127 313397 316363 318603 319838 320458 321517 323761 326940 330340 333607 336792 340003 343373 347033
53621 347033 350906 354908 359461 365210 371952 378522 384069 388818 393174 396828 399389 401263 403235 405672
53607 405672 408686 412479 416819 420764 423635 425879 428238 430605 432475 434056 435959 438092 439811 440944
53593 440944 441768 442105 441395 439712 437856 436323 434819 432945 430729 428409 426212 424454 423411 422932 422521
53578 422521 421837 420861 419680 418403 417200 416173 415282 414514 413821 412801 410980 408676 406954 406314 406049 405425
53562 405425 404815 404942 405596 405970 405816 405441 404932 404286 403892 404047 404289 404107 403959 404638 405908 406877 407549 408909
53544 408909 411465 414724 418203 422030 426432 431459 437321 444135 451283 457845 463808 470081 477261 485183
53530 485183 493708 503042 513104 523460 534112 545581 558029 571073 584610 598965 614016 629102
53518 629102 644192 660281 678143 697372 717185 737579 759174 782290 806604 831457 856286
53507 856286 881105 906622 933453 961203 988788 1015688 1042232 1068535 1093899 1117543 1139473
53496 1139473 1160321 1180746 1201067 1221087 1240256 1258409 1276254 1294608 1313391 1332054 1350727
53485 1350727 1370004 1389756 1409309 1428824 1449246 1470550 1491203 1509811 1526249 1540644 1552387
53474 1552387 1560972 1566878 1570760 1572422 1571410 1567998 1562763 1555710 1546529 1535297 1522213 1507176 1490427
53461 1490427 1473246 1457114 1442263 1427639 1412101 1395135 1376591 1356398 1334610 1311419 1287223
53450 1287223 1262889 1239598 1218042 1197903 1178414 1159207 1140487 1122783 1106890 1093633 1083220
53439 1083220 1075025 1068319 1063019 1059504 1057971 1058198 1059646 1061632 1063767 1066415 1070316 1075628 1081807 1088556
53425 1088556 1096258 1105280 1115500 1126894 1139923 1154955 1171903 1190794 1211870 1234664 1257871 1280956
53413 1280956 1305118 1331759 1360637 1390560 1421369 1453960 1488584 1524411 1560938 1598739 1638504
53402 1638504 1680222 1723763 1769583 1818321 1869996 1923974 1979499 2036074 2093503 2151752 2210753
53391 2210753 2270355 2330468 2391013 2451515 2510912 2568063 2622352 2673735 2722481 2769096 2814070
53380 2814070 2857215 2897426 2933434 2964634 2990895 3011952 3027473 3037502 3042316 3041883 3035846 3023880
53368 3023880 3005679 2980753 2948693 2909631 2864204 2813326 2758369 2701238 2643620 2586123 2528470
53357 2528470 2470438 2412240 2354264 2297072 2241625 2188965 2139555 2093212 2049585 2008272 1968482
53346 1968482 1929046 1888939 1847789 1806132 1765439 1727503 1693212 1662036 1633091 1606414 1582605
53335 1582605 1561499 1542140 1524142 1508293 1495478 1485557 1477526 1470192 1462355 1452877 1441187 1427650
53323 1427650 1413187 1398694 1384842 1372029 1360148 1348630 1337017 1325474 1314682 1305381 1298080 1292865
53311 1292865 1289274 1286617 1284674 1283942 1284935 1287360 1290288 1293149 1296356 1300916 1307613 1316636 1327843 1341238
53297 1341238 1357083 1375574 1396448 1419007 1442600 1467138 1493070 1520759 1549788 1578943 1606937
53286 1606937 1633090 1657281 1679471 1699573 1717673 1733916 1747988 1759049 1766390 1769952 1770021 1766705
53274 1766705 1760011 1750242 1737913 1723295 1706303 1686838 1664981 1640893 1614786 1587078 1558356 1529041
53262 1529041 1499150 1468464 1436898 1404683 1372216 1339781 1307478 1275415 1243858 1213070 1183087
53251 1183087 1153861 1125562 1098491 1072615 1047405 1022248 996954 971903 947780 925130 903913
53240 903913 883507 863370 843697 825169 808189 792751 779013 767387 757830 749529 741760 734762
53228 734762 729315 725458 721926 716914 709333 699409 688148 676275 663778 650441 636390 621741 606091
53215 606091 589117 571640 555318 541081 528430 516466 504947 494063 483852 474314 465573 457500
53203 457500 449629 441799 434279 426844 418480 408652 398287 388648 379725 370622 361199 352302 344451 337300
53189 337300 330544 324542 319724 315995 312920 310104 307212 304078 300919 298032 295235 292114 288891 286434
53175 286434 285137 284309 283064 281434 280150 279520 278964 277678 275490 273004 271073 270138 269940 269803 269237 268333
53159 268333 267530 267025 266496 265581 264546 264131 264586 265192 265111 264438 263912 263733 263292 262123 260513 258987 257738
53142 257738 256747 255927 254958 253542 252140 251842 253115 255174 256985 258351 259552 260552 261210 261872 263030 264586
53126 264586 265972 266819 267075 266834 266516 266851 268102 269624 270698 271435 272310 273296 274197 275376 277243 279251
53110 279251 280316 280142 279293 278006 275898 272924 269790 267161 265119 263552 262449 261585 260516 259116 257691
53095 257691 256434 255244 254146 253417 253193 253393 254025 255057 256040 256453 256500 256935 257931 258725 258563 257480 255948
53078 255948 254296 252747 251583 250895 250460 250091 249878 249950 250237 250557 250714 250515 249976 249451 249256 249194 248822 248079
53060 248079 247288 246664 246210 245999 246092 246316 246574 247175 248289 249324 249541 249148 248989 249243 249292 248945 248803 249129 249258
53041 249258 248599 247533 246847 246801 247178 247792 248495 249018 249180 249011 248529 247768 247090 246935 247102 246850 245957 245097 244906
53022 244906 245233 245670 246242 247185 248454 249937 251762 253981 256161 257670 258224 258033 257684 257916 259022 260277
53006 260277 260447 259144 257294 256098 255931 256454 257216 257791 257811 257282 256646 256246 256078 256222 257000 258390 259734
52989 259734 260401 260418 260192 260017 260160 260957 262366 263693 264145 263519 262234 261025 260729 261920 264508 267965 271995
52972 271995 276513 280943 284316 286330 287642 288785 289505 289577 289458 289486 289177 288152 287160 287242 288139 288458 287367
52955 287367 285385 283513 282215 281302 280296 278847 277068 275433 274150 272873 271324 269854 268959 268593 268420
52940 268420 268405 268591 268596 267982 266983 266204 265671 264833 263500 262158 261229 260501 259515 258162 256747 255716 255367 255603
52922 255603 255895 255684 254833 253609 252370 251468 251234 251730 252597 253438 254247 255218 256263 257044 257418 257537 257554 257427
52904 257427 257040 256398 255766 255633 256300 257441 258359 258849 259395 260309 261089 261013 260038 258733 257596 256797 256295 255814
52886 255814 254980 253925 253444 254091 255372 256317 256654 256903 257541 258623 260071 261765 263449 265052 266949 269327
52870 269327 271488 272543 272770 273500 275450 277918 279910 281373 282778 284079 284780 284810 284659 284620 284384 283582 282375
52853 282375 281218 280182 278786 276498 273194 269049 264243 258993 253759 249086 245267 242321 240230 238875
52839 238875 237850 236747 235692 235171 235249 235375 235063 234362 233519 232673 232079 232099 232691 233378 233983 234831 235902 236448
52821 236448 236017 235270 235133 235576 235931 235970 235855 235401 234354 233326 233471 235112 237452 239799 242357 245494 248822
52804 248822 251391 252490 252045 250513 248566 246673 244859 242970 241050 239241 237492 235700 233999 232567
52790 232567 231298 230098 229352 229530 230390 231110 231203 230869 230510 230460 231137 232782 234875 236405 237000 237318 238031 238893
52772 238893 239164 238593 237601 236635 235707 234586 233279 232243 232024 232636 233439 233799 233666 233318 232847 232319 232192 232927
52754 232927 234237 235280 235669 235780 235993 236271 236655 237594 239354 241504 243392 244894 246363 248043 249889 251858
52738 251858 254097 256770 259795 262761 265129 266591 267271 267504 267529 267501 267598 267848 267970 267646 266878 265798 264325
52721 264325 262362 260216 258361 256895 255703 254978 254966 255211 254837 253785 253065 253450 254529 255476 256090 256448 256130
52704 256130 254692 252720 251496 251479 251807 251541 250791 250301 250375 250741 251127 251446 251501 251099 250548 250512 251123 251606 251201
52685 251201 250216 249718 250282 251436 252364 252714 252597 252135 251278 249959 248321 246848 246113 246160 246275 245775 244925 244656
52667 244656 245452 247051 249127 251474 253389 253798 252532 250835 250110 250650 252055 254187 257068 260367 263782
52652 263782 267533 271812 276036 279300 281236 281808 280782 278225 275206 272971 271562 270086 268224 266561
52638 266561 265454 264532 263456 262397 261604 261183 261432 262687 264632 266453 267858 269365 271408 273731 275791
52623 275791 277240 277906 277825 277332 276599 275150 272514 269251 266586 265032 264207 263941 264412 265035 264514 262629 260913
52606 260913 260772 261787 262712 263383 264541 266221 267447 267576 267071 266744 266800 266872 266668 266320 266160 266281 266435 266434 266483
52587 266483 266836 267322 267643 268011 268950 270417 271761 272640 273354 274143 274805 275257 275823 276563 276903 276406 275438 274626
52569 274626 274029 273266 272216 271211 270711 270946 271583 271693 270510 268457 266922 266831 267897 269387 270922 272168
52553 272168 272447 271308 269098 266569 264241 262463 261514 261189 260752 259789 258746 258180 257945 257655 257518 258090 259384
52536 259384 260750 261526 261514 261063 260937 261771 263424 265185 266726 268339 270033 271177 271456 271469 271811 272224 272309
52519 272309 272413 272999 273757 274211 274818 276462 279069 281580 283222 284103 284763 285876 288189 291916 296198 299826
52503 299826 302392 304147 304957 304331 302396 299922 297251 294031 290206 286517 283689 281646 279860 277993 275956
52488 275956 273808 271828 270383 269484 268800 268210 268013 268465 269424 270562 271661 272617 273424 274200 275047 275897 276748
52471 276748 277925 279759 282060 284265 286109 287797 289551 291349 293102 294768 296287 297709 299307 301234
52457 301234 303109 304289 304546 304139 303274 301838 299701 296871 293405 289543 285911 283242 281775 281153 280849
52442 280849 280455 279668 278371 276763 275117 273493 271919 270663 269957 269654 269538 269773 270458 270940 270272 268490
52426 268490 266805 266322 267109 268688 270894 273756 276869 279427 280933 281662 282312 283259 284242 284910 285572 287081
52410 287081 289901 293675 297999 303232 310173 319255 330417 343301 356915 369328 378418 383007 382944 378523
52396 378523 370569 360908 351675 343849 337007 330614 324881 320185 316420 313398 311340 310512 310588 310732 310215
52381 310215 308933 307571 307224 308483 310843 313316 315565 317968 320770 323869 327447 332008 337527 343253
52367 343253 348656 353881 358937 363139 365929 367703 369241 370732 371933 372888 373873 374857 375593 376058 376341 376295
52351 376295 375832 375419 375686 376607 377570 378366 379558 381771 384957 388550 392085 395467 398839 402417 406424 411105
52335 411105 416769 423681 431814 440811 450397 460768 472373 485301 499197 513905 529952 548028
52323 548028 568053 589081 610281 631700 653714 676018 697691 718376 738793 759777 781232
52312 781232 802538 823670 845295 867772 890584 912852 933995 953715 971727 987885 1002508
52301 1002508 1016335 1030087 1043944 1057413 1069767 1080595 1089771 1096862 1101083 1102086 1100397 1096616
52289 1096616 1090498 1081420 1069516 1055786 1041231 1026586 1012791 1000877 991108 982807 975310 968669
52277 968669 963399 960107 959517 962161 967654 974785 982696 991654 1002425 1015317 1030061 1046116 1062683
52264 1062683 1078848 1094148 1108742 1122783 1136057 1148537 1160871 1173828 1187558 1201771 1216250
52253 1216250 1230693 1244322 1256209 1265942 1273577 1279036 1281897 1281700 1278244 1271681 1262469 1250988 1237080
52240 1237080 1220325 1200963 1180022 1158240 1135511 1111908 1088627 1066979 1046817 1026944 1006963
52229 1006963 987771 970169 953929 938529 924002 910630 898443 887456 877892 869720 862435 855770
52217 855770 850165 846104 843367 841460 840434 840608 841693 842924 844040 845550 847908 850927 854080 856865
52203 856865 858774 859500 859537 860123 862119 865119 867958 869855 870843 871470 872471 874466 877501 881026 884650 888638
52187 888638 893166 897428 900244 901499 902140 902665 902383 900469 896949 892193 886069 878301 869316 860125 851555
52172 851555 843974 837473 831896 826942 822706 819879 819019 819859 821755 824502 828235 832796 837784 843077 848801
52157 848801 854865 860945 866773 872023 876208 879141 881217 882776 883525 883223 882542 882521 883468 885228 888159 892798
52141 892798 898675 904586 910134 915918 922090 927874 932898 937955 943960 951060 959303 969309 981646 996260
52127 996260 1013097 1032597 1054958 1079598 1106044 1134754 1166410 1200901 1237630 1276180 1315867
52116 1315867 1355084 1392020 1425922 1457178 1486378 1513786 1539262 1562108 1581333 1596607 1608586
52105 1608586 1617759 1623560 1625350 1623812 1620466 1616155 1610883 1604869 1598693 1592430 1585519 1577593 1568597 1558029
52091 1558029 1544852 1528394 1508750 1486273 1461383 1434964 1408238 1382010 1356614 1332669 1311209
52080 1311209 1292886 1277682 1265592 1256924 1251623 1249076 1248980 1251776 1257705 1266040 1275837 1287057 1300289
52067 1300289 1315658 1332597 1350544 1369188 1388069 1406510 1424141 1441142 1457809 1474108 1489705
52056 1489705 1504217 1517330 1528887 1538966 1547742 1555201 1561050 1564916 1566422 1565018 1560050 1551247 1539048
52043 1539048 1524113 1506507 1485681 1461443 1434707 1407118 1380039 1354082 1329323 1305544 1282350
52032 1282350 1259501 1237301 1216394 1197097 1179178 1162253 1146022 1130011 1113600 1096612 1079627
52021 1079627 1063416 1048249 1033915 1020143 1006766 993707 981186 969697 959488 950181 941206 932493
52009 932493 924399 916981 909584 901167 890981 879090 866348 853692 841310 828633 815197 801190
51997 801190 787059 773061 759491 746992 736217 727480 720972 716805 714311 711690 707194 700678 693413
51984 693413 686470 679803 672839 665218 656773 647379 637149 626371 615006 602641 589266 575864 563865
51971 563865 554067 546269 539891 534707 530924 528723 527999 528666 530980 535251 541293 548531 556632 565443 574167
51956 574167 581283 585811 588156 589094 588357 585053 579238 572252 565442 559322 554047 549965 547356 546275 547028
51941 547028 550366 556760 565784 576520 588425 601525 615955 631559 647855 664214 680074 694989
51929 694989 708396 719468 727564 732885 736488 739548 742673 745740 747881 747435 742229 730351 711066
51916 711066 685324 655591 624863 595373 568085 543394 521879 504051 489732 478408 470097 465197
51904 465197 463443 463750 465338 468388 473195 479160 485120 490342 494716 498146 500249 500669 499336 496297 491469
51889 491469 484716 476202 466628 457018 448164 440410 434088 429843 428066 428144 428897 429974 432308 436949 443893
51874 443893 452464 462346 473514 485206 495735 503696 509019 512523 514655 515129 513677 510622 506451 501258
51860 501258 495065 488480 482483 477539 473464 470289 468757 469625 472800 477444 482562 487152 490186 491029 489820
51845 489820 487077 483006 477504 470655 462929 455003 447632 441399 436212 431314 426207 421361 417679 415591
51831 415591 415038 415913 417835 419837 421036 421493 421757 421754 420821 418746 415928 412608 408761 404793 401523 399271
51815 399271 397670 396513 396030 396256 396909 398064 400136 402969 405774 408240 410814 413517 415391 415677 414780
51800 414780 413537 412280 411181 410680 410816 410829 410226 409627 409648 409515 407823 404367 400287 396599 393553 391312
51784 391312 390207 390112 390345 390530 390998 392103 393602 394974 395986 396750 397434 398132 398894 399909 401750 405266
51768 405266 410955 418519 427237 436692 446917 457955 469453 480575 490159 497173 501225 502433 500782
51755 500782 496099 488876 480466 471902 462921 452785 441748 431037 421605 413619 406988 401687 397505
51742 397505 394185 391891 391008 391403 392520 394327 397575 402905 410187 418910 428558 438220 446388 451869 454847
51727 454847 456656 458427 460232 461588 462532 463816 465847 467627 467221 463580 457663 451486 446343 442317 439136
51712 439136 436748 434950 433050 430263 426286 421487 416804 413415 412031 412419 413921 416365 419934 424109
51698 424109 427532 429337 430124 431049 432272 432942 432595 431985 432337 434078 436446 438117 438097 436165 432666 428012
51682 428012 422458 416309 410152 404682 400338 397253 395547 395452 397044 399937 403432 406999 410545 414162 417854
51667 417854 421738 426415 432756 441118 450965 461377 471590 480815 487817 491226 490380 485731 478533 470380
51653 470380 462867 457161 453829 453352 456663 464489 475782 487315 495399 498062 495441 488567 478438 466228
51639 466228 453611 442218 432775 425049 418607 413359 409321 406102 403044 399984 397676 397172 398788 401871
51625 401871 405611 409763 414279 418455 420917 420677 417993 413973 409570 405208 401141 397575 394266 390495
51611 390495 385871 380990 376908 374061 372043 370385 369086 368308 367974 367935 368272 369241 371091 374093 378513 384404
51595 384404 391630 400287 410777 423047 435854 447109 454967 458434 457254 451862 443653 434791 427156
51582 427156 421375 416997 413596 411529 411645 414464 419830 427319 436761 448269 461807 476869 492580
51569 492580 508097 523046 537678 552545 567862 583197 597841 611539 624858 639133 656175
51558 656175 677698 704505 736147 771519 809559 848900 886937 919994 944874 960173 966091 963382
51546 963382 952678 934407 909078 877790 842560 805721 768762 732053 695914 661486 630213
51535 630213 602772 578977 558468 541114 526796 515206 505855 498207 492016 487697 486073 487436 491025
51522 491025 495493 499506 501733 500958 496873 490485 483166 475460 467251 458736 450573 443216 436777 431432
51508 431432 427328 424087 421037 417988 415244 412786 410091 406903 403652 400858 398593 396739 395328 394368
51494 394368 393722 393372 393498 394066 394631 394786 394616 394559 395081 396516 398831 401352 403065 403450 402790 401540 399706
51477 399706 397120 394053 391210 389084 387530 385952 383893 381484 379211 377201 374906 371819 368334 365479
51463 365479 363808 363013 362610 362447 362400 362088 361273 360212 359291 358542 357764 356864 355906 355132 355149 356745 360199 365017
51445 365017 370622 377085 384948 394705 406732 421240 437605 453791 467040 475433 478760 478157 475337
51432 475337 472135 470111 469986 471211 472105 470670 465774 457999 449346 441861 436432 432754 430131 427999 425925
51417 425925 423538 420625 417179 413431 409966 407571 406603 406559 406521 406037 405317 404728 404460 404684 405566 406993 408541
51400 408541 409908 411119 412267 413361 414525 416016 417862 419817 421911 424693 428665 433801 440009 447645
51386 447645 457062 467963 479960 493688 510547 531235 555415 583112 615505 653575 696724 743747
51374 743747 794648 850020 908235 964340 1012488 1049208 1074133 1088313 1092572 1087119 1071907 1047200
51362 1047200 1014110 974628 930907 884549 836685 788432 740879 694833 651028 610563 574685
51351 574685 544028 518297 496701 478419 462756 449251 437762 428234 420319 413480 407520 402634
51339 402634 398826 395621 392571 389727 387311 385146 382893 380763 379520 379509 380045 380105 379535 379167 379737 381067
51323 381067 382472 383609 384579 385420 386011 386442 387045 387851 388348 387979 386697 384958 383356 382292 381640 380630
51307 380630 378391 374887 371074 367988 365899 364495 363543 363096 363301 364204 365574 366754 367092 366661 366094 365477
51291 365477 364032 361394 358631 357168 357049 357122 356841 357002 358550 361414 364916 368831 373646 379887 387344
51276 387344 394837 400862 404725 406962 408359 408822 407756 405373 402922 401472 401072 401346 402357 404503 407863
51261 407863 412002 416194 419583 421369 421161 419163 415928 411955 407540 402864 398163 393829 390205 387197
51247 387197 384309 381277 378501 376591 375669 375359 375264 375087 374549 373603 372587 371768 370881 369562 367979 366544
51231 366544 365253 363941 363010 363141 364268 365554 366511 367507 369038 371114 373473 375864 377969 379557 380849
51216 380849 382226 383581 384490 384989 385495 385983 386032 385789 386011 386939 387963 388715 389633 391090 392764 394392 396348
51199 396348 398894 401529 403672 405328 406538 406852 406073 404871 403895 402840 401199 399469 398625 398673 398688 398257
51183 398257 398007 398511 399347 399580 398881 397957 397891 398981 400255 400374 399127 397593 396728 396372 395924 395359 395094 395359
51165 395359 396287 398198 401182 404720 408254 411771 415345 418532 420842 422437 423695 424398 423981 422352 419886
51150 419886 416867 413539 410326 407404 404378 401086 398302 396810 396088 394880 392896 390972 389629 388502
51136 388502 387329 386508 386338 386526 386795 387344 388387 389789 391457 393519 395879 398119 400177 402663 406129
51121 406129 410346 414529 417994 420446 421982 423068 424280 425867 427681 429511 431279 432957 434566 436187
51107 436187 437736 438912 439725 440794 442640 444877 446711 448068 449517 451120 452206 452477 452616 453411 454742
51092 454742 455767 455835 455024 454081 453847 454457 455163 455325 455321 455860 456629 456558 455450 454357 454043 453995 453451 452591 452110
51073 452110 452309 453285 455414 458866 462921 466573 469609 472578 475938 479899 484976 491972 501315 512932
51059 512932 526947 543987 564313 586642 608135 625879 638726 647899 655922 665112 676916 691838
51047 691838 709027 726022 739956 749545 755432 758275 757207 750830 739275 724524 708965 694322
51035 694322 681887 672733 666945 662815 657407 648442 635894 621733 607992 595255 583219 572320
51023 572320 563918 558707 555762 553738 552428 552519 554267 557218 561049 565850 571616 578183 585812 595085 605954
51008 605954 617500 629075 641183 654653 669234 683586 696640 708432 719489 729855 739069 746814
50996 746814 753198 758436 762513 765255 766535 766461 765545 764642 764368 764535 764534 764501 765757 769802 777198 787850 802003
50979 802003 820193 842090 865898 889197 910274 928907 946474 965417 988039 1015475 1047934
50968 1047934 1085794 1129900 1180725 1237845 1300557 1368470 1441158 1517799 1597710 1680823 1766992
50957 1766992 1854925 1942309 2026838 2106687 2180050 2244881 2299341 2342377 2373839 2394269 2404475
50946 2404475 2405068 2396329 2378705 2353363 2322224 2287544 2251460 2215383 2179260 2141607 2100915 2057298
50934 2057298 2012552 1968652 1926541 1886244 1847590 1810470 1774751 1740215 1706347 1672006 1635636
50923 1635636 1596265 1554286 1510978 1467299 1423428 1379409 1335879 1293965 1254644 1218377 1185183
50912 1185183 1154800 1126861 1101169 1077873 1057186 1038905 1022413 1007229 993352 980885 969505
50901 969505 958555 947662 937074 927398 919136 912465 907306 903525 901059 899818 899516 899814 900717 902569
50887 902569 905451 908825 912039 914996 917968 920980 923904 927145 931586 937665 944912 952682 960943 970032
50873 970032 980039 990854 1002662 1015927 1030897 1047441 1065408 1084900 1106188 1129566 1155373
50862 1155373 1184008 1215807 1250995 1289835 1332837 1380842 1434860 1495706 1563776 1639358 1723328
50851 1723328 1817376 1923232 2041568 2171845 2313307 2465826 2629457 2803294 2985306 3173528
50841 3173528 3366910 3564381 3763046 3957834 4142868 4312658 4461892 4585129 4677794 4737531
50831 4737531 4764177 4758609 4722264 4657735 4569118 4461342 4339395 4208320 4073556 3940755
50821 3940755 3814995 3699964 3597636 3508601 3432539 3368087 3312189 3260237 3207611 3151333 3090118
50810 3090118 3023240 2949945 2869795 2782859 2689426 2590106 2486330 2380220 2273719 2168256
50800 2168256 2065394 1967224 1875750 1792168 1717001 1650523 1592706 1543012 1500666 1465096 1435997
50789 1435997 1413091 1395954 1383932 1376148 1371755 1370108 1370539 1372083 1373869 1375775 1378188 1381090 1383797
50776 1383797 1385666 1386543 1386364 1384888 1381987 1377715 1371863 1364018 1354313 1343539 1332078 1319246 1304174
50763 1304174 1286970 1268566 1249816 1231263 1213461 1196936 1181906 1168384 1156406 1145938 1136847
50752 1136847 1129322 1124011 1121409 1121396 1123818 1129201 1138419 1151888 1169540 1191409 1217803 1249028 1285365
50739 1285365 1327179 1374711 1427923 1486908 1552155 1623855 1701180 1782819 1868148 1957289 2050070
50728 2050070 2145545 2242656 2340802 2439453 2537601 2633899 2727103 2816076 2899422 2975203 3040842
50717 3040842 3093154 3128540 3143501 3135487 3103813 3050147 2978087 2892173 2797151 2697834 2598993
50706 2598993 2504867 2418661 2342403 2276965 2222098 2176797 2139940 2110427 2086624 2066013 2045730
50695 2045730 2023351 1997137 1965841 1928598 1884961 1835051 1779880 1721454 1662066 1603379 1546529
50684 1546529 1492979 1444456 1401783 1364554 1332433 1306094 1286342 1273026 1265559 1263894 1268144 1277685
50672 1277685 1291622 1309902 1332975 1360367 1390430 1421518 1452662 1483004 1511399 1536942 1559442
50661 1559442 1579258 1597061 1613828 1630469 1647262 1663952 1680464 1697203 1714725 1733556 1754284
50650 1754284 1777218 1801913 1827573 1854154 1882707 1914507 1950206 1989881 2033372 2080328 2130233
50639 2130233 2182669 2237362 2293858 2351368 2409029 2466081 2521635 2574529 2623672 2668638 2709915
50628 2709915 2748617 2786045 2823651 2863151 2905302 2946926 2979079 2990218 2973365 2930763 2871552
50617 2871552 2805736 2740831 2682384 2634568 2599111 2574953 2560150 2553747 2555352 2563547 2575499 2587895
50605 2587895 2597739 2602311 2598790 2584258 2556379 2514369 2459213 2392767 2316897 2233752 2146317 2057867
50593 2057867 1970897 1887134 1808281 1735799 1669854 1609258 1552778 1500049 1451216 1406363 1365411
50582 1365411 1328027 1293587 1261821 1233443 1209359 1189288 1172055 1157389 1146389 1139859 1137119 1137034
50570 1137034 1139360 1144388 1151906 1161288 1172231 1184808 1199049 1214861 1232139 1250785 1271046 1293902
50558 1293902 1320399 1350238 1381731 1413572 1445876 1478977 1512011 1543571 1573209 1601381 1628261
50547 1628261 1653547 1677283 1700089 1722565 1745095 1768295 1793250 1821266 1853590 1891120 1934062
50536 1934062 1982216 2036024 2097007 2166730 2245557 2332840 2427870 2530104 2638907 2753940 2875676
50525 2875676 3004756 3140781 3282251 3427547 3575233 3723287 3868683 4007960 4137792
50516 4137792 4254906 4355936 4437748 4497859 4534643 4547442 4536449 4502207 4445205 4366261 4267337
50505 4267337 4151844 4024335 3890141 3754925 3623979 3501801 3392579 3300703 3229995 3182322
50495 3182322 3157471 3154467 3172450 3210002 3264082 3329924 3401591 3472282 3534434 3580088 3601610
50484 3601610 3592693 3549740 3473148 3367279 3238740 3094311 2940080 2781694 2624415 2472520
50474 2472520 2328775 2194663 2070975 1958161 1856461 1766105 1687373 1620074 1562940 1513792
50464 1513792 1470537 1431808 1396674 1364240 1334011 1306362 1282057 1261450 1244617 1232097 1224664
50453 1224664 1222187 1223402 1227178 1233435 1242409 1253619 1266239 1280171 1296102 1314568 1335589 1359161
50441 1359161 1385430 1414049 1443594 1471810 1496379 1515620 1528900 1536748 1540589 1542190 1543060 1544003 1545089
50428 1545089 1546134 1547257 1548794 1550746 1552715 1554575 1556911 1560586 1566229 1574440 1586142 1602341 1623693
50415 1623693 1650675 1683949 1724154 1771370 1825111 1884698 1949339 2018043 2089853 2164052 2239740
50404 2239740 2315266 2388547 2458001 2522798 2582219 2635181 2680498 2717078 2743543 2757850 2757676 2741255
50392 2741255 2707943 2658297 2593894 2517147 2431191 2339784 2247031 2156847 2072478 1996363 1930242
50381 1930242 1875258 1832103 1801279 1783160 1777600 1783573 1799368 1823162 1853125 1886875 1920934 1950880
50369 1950880 1972172 1981135 1975537 1954623 1918915 1870155 1811185 1745349 1675617 1604286 1533448 1465371
50357 1465371 1402059 1344548 1292828 1246399 1204735 1167349 1133803 1103894 1077875 1056483 1040621
50346 1040621 1030787 1026588 1026715 1029184 1031463 1030680 1024497 1012378 996009 978290 961802 947970 937143
50333 937143 929115 923697 920968 920922 922925 925862 928945 932131 935673 939665 944262 949931 957057 965417 974285
50318 974285 982922 990724 997104 1001505 1003508 1002908 999865 995045 989309 983138 976743 970857 966823 965425
50304 965425 965975 967111 968301 970050 972737 975895 978845 981675 985288 990568 997688 1006252 1016013 1027250
50290 1027250 1040409 1055648 1073017 1092969 1116620 1145856 1183014 1228766 1278393 1320585 1342547
50279 1342547 1338209 1311425 1271354 1226125 1181089 1140300 1106508 1079748 1057972 1039588 1024456
50268 1024456 1012560 1003119 995336 988946 983673 979005 974890 971935 970696 971480 974918 981885 992567 1006358
50254 1006358 1022924 1042553 1065154 1089644 1114734 1139623 1163528 1185321 1204385 1221315 1237222
50243 1237222 1252673 1267869 1283362 1299717 1316363 1331286 1341974 1346501 1343866 1333829 1316745 1293607
50231 1293607 1266140 1236622 1207305 1179824 1155120 1133769 1116125 1102121 1090958 1080896 1069239
50220 1069239 1052950 1029970 1000356 966207 930623 896588 866108 839656 816505 796025 778515
50209 778515 764446 753292 743838 735511 728649 723483 719587 716387 713559 710790 707862 705074 702898 701024
50195 701024 698449 694791 690802 687210 683673 679391 674270 668995 664263 660347 657110 654073 650707 646895
50181 646895 642906 638836 634520 630106 626182 623005 620113 617087 614353 612836 613119 615148 618378 621908
50167 621908 624895 627264 629688 632655 635910 639162 642748 647095 651950 656768 661696 667521 674771 683338
50153 683338 692896 703220 714151 725633 737864 751008 764739 778317 791175 803341 815400 828322
50141 828322 843200 860862 881709 906086 934649 968066 1006395 1049008 1095004 1143323 1192400
50130 1192400 1240188 1285022 1326575 1365888 1404447 1443303 1482824 1522591 1560906 1594506 1619512
50119 1619512 1633150 1634463 1623444 1600235 1565701 1522162 1472676 1419648 1364706 1309649 1256623
50108 1256623 1207217 1162017 1121193 1084927 1053162 1025494 1001425 980237 960635 941221 921510
50097 921510 901932 882834 864214 846513 830702 817257 805827 796296 789295 785129 782990 781886
50085 781886 781745 782915 785211 788139 791516 795122 798202 800116 801170 802077 802836 802866 801961 800444 798486 795916
50069 795916 792612 788589 783920 779028 774767 771579 768822 765496 761407 757011 752504 747901 743820 741190
50055 741190 740035 739239 737796 735779 733995 733195 733738 735547 738205 741374 745149 749776 755196 761281 768273
50040 768273 776427 785380 794481 803668 813346 823418 833221 842626 852438 863321 874813 885885 896112
50027 896112 905897 915739 925617 935162 944255 953445 963628 975234 987951 1001573 1016870 1035059 1056441
50014 1056441 1079928 1103881 1126847 1147547 1164941 1178856 1190248 1200494 1210514 1220694 1231241
50003 1231241 1242180 1252930 1262089 1267756 1268240 1262697 1251127 1233789 1210856 1182894 1151426 1118502
49991 1118502 1085619 1053299 1021667 991102 962309 936069 912911 892604 873950 855469 836430
49980 836430 817050 797760 778733 760148 742366 725615 709882 695338 682594 672188 664001 657289
49968 657289 651210 645322 639796 635193 631724 628681 624983 620427 616099 613377 612806 614060 616577 619870
49954 619870 623500 627282 631593 637204 644718 654166 665036 676596 688229 699566 710357 720260 728919
49941 728919 736215 742255 747095 750670 753015 754339 754784 754131 751652 746134 736313 721896 704323 686074
49927 686074 668974 653367 639061 626530 616651 609535 604270 599944 596494 594364 593697 594170 595467 597525
49913 597525 600224 603108 605657 607811 610028 612785 616184 620173 624968 631020 638537 647233 656657 666699
49899 666699 677718 690188 704208 719212 734002 747114 757366 764322 768365 770242 770429 768909 765506
49886 765506 760261 753351 744833 734767 723524 711657 699389 686559 673142 659561 646375 633938
49874 633938 622505 612391 603806 596745 591205 587235 584649 583031 582301 582903 585068 588220 591544 594968
49860 594968 599087 604270 610383 617334 625384 634759 645381 657122 669931 683535 697278 710495 722864
49847 722864 734158 743815 751074 755646 758083 759365 760034 759820 758028 754083 747574 738180 726106 712585
49833 712585 699388 687646 677457 668659 661348 655419 650323 645745 642049 639511 637676 636170 635742 637521
49819 637521 641419 646160 651047 656852 664719 674817 686380 698481 710282 720915 729665 736267 740954
49806 740954 744349 747315 750518 753811 756159 756363 753867 748887 741988 733706 724530 715025 705727 696743
49792 696743 687547 677496 666645 655776 645495 635729 626319 617757 610878 606035 602891 600791 599035
49779 599035 597090 595030 593519 593003 593145 593480 594211 595824 598289 601386 605591 611786 620089 629638 639546
49764 639546 649410 658884 667511 675164 682036 688055 692892 696618 699765 702535 704430 704750 702888 698161
49750 698161 690180 679620 667972 656241 644522 633086 623082 615623 610703 607570 605766 605277 605919
49737 605919 607028 607690 607174 605475 603631 603213 605161 609183 614191 618980 622627 624890 626489 628487 631294
49722 631294 634755 639259 645959 655585 667689 681482 696748 713407 730619 746824 760297 769352
49710 769352 772659 770141 763365 754570 745368 736507 728287 720644 713156 705641 698656 693116 689606 688222
49696 688222 688514 689102 687925 683699 677082 669884 663373 657852 653593 651272 651340 653558 657408 662631 669195
49681 669195 677057 686124 696305 707553 719965 733911 749983 768802 790641 814736 838684 858844
49669 858844 871926 876580 873758 865991 856392 847733 841723 838844 838897 841739 847581 856677 868419 880245
49655 880245 887644 886230 874514 854508 829614 802483 775015 749384 727837 711432 699505 690489
49643 690489 683096 676950 672444 669991 669330 669767 671042 673356 676347 678726 679470 678920 678074 677154 675528 672766
49627 672766 669075 664694 659447 653058 645631 637801 630561 624768 620560 617414 614912 613141 612160 611580 611051
49612 611051 610782 611035 611502 611754 612102 613382 615979 619510 623389 627257 630995 634689 638465 642070 644875
49597 644875 646690 648223 650236 652534 654359 655541 656653 658146 660000 662102 664362 666422 667810 668501
49583 668501 668923 669441 670185 671246 672563 673771 674688 675801 677642 679792 681255 681923 682981 685672 690196
49568 690196 696077 702980 710793 719290 728177 737289 746534 755703 764477 772422 778901 783204 784960 784375
49554 784375 781997 778291 773401 767318 760436 753918 749213 746935 746473 746884 747801 749222 750855 752302 753658
49539 753658 755373 757548 759863 762103 764372 766832 769646 773128 777587 783131 789949 798572 809451 822427
49525 822427 837161 853933 873460 895888 920227 944517 966117 982276 991399 994004 992001 987110
49513 987110 980448 973301 967265 963429 962153 963829 968994 977252 986624 994442 998580 997675 990864 978053
49499 978053 960338 939732 918337 897705 878640 861397 846115 833092 822517 813995 806649 799781
49487 799781 793366 788012 784542 783332 783700 784168 783736 782748 782167 782319 782851 783637 784969 786857 788829 790515
49471 790515 791979 793467 795284 797782 800956 804173 806903 809506 812637 816087 819096 821672 824549 827743
49457 827743 830291 831726 832820 834304 835666 835759 833930 830083 824339 817301 810108 803644 798001 793062 789035
49442 789035 786031 783709 781904 781123 781924 784228 787722 792447 798486 805502 813182 821763 831605 842535
49428 842535 854056 865828 877610 889309 901576 915763 932610 951642 972649 996912 1025221
49417 1025221 1054421 1077302 1086980 1081440 1064073 1040748 1016724 995296 977905 964910 956451 952808
49405 952808 954074 959651 968308 978850 990766 1004196 1019265 1035417 1051411 1065902 1078157 1088428
49393 1088428 1097791 1107353 1117271 1126661 1134590 1140888 1145589 1148029 1147271 1143388 1137558 1130775 1123144 1114522
49379 1114522 1105058 1094874 1084018 1073232 1064022 1057391 1053073 1050517 1049970 1051896 1055935 1061317 1067882
49366 1067882 1075831 1084672 1093270 1100833 1107149 1111999 1115133 1116785 1117415 1116843 1114362 1109871 1104238 1098359
49352 1098359 1092427 1086397 1080591 1075533 1071603 1069155 1068593 1069988 1072841 1076444 1080176 1083340 1085202 1085588
49338 1085588 1085071 1084097 1082209 1078649 1073619 1068359 1063938 1060490 1057809 1056164 1056151 1058077 1061835 1067126 1073324
49323 1073324 1079422 1084716 1089659 1095571 1103467 1113578 1125968 1140871 1158178 1177309 1197938 1219972
49311 1219972 1241988 1260361 1271164 1273015 1267433 1256728 1242493 1226020 1208801 1191955 1175739 1160028
49299 1160028 1144836 1130207 1116237 1103516 1092988 1085072 1079371 1075372 1072749 1070804 1068424 1065093 1061332
49286 1061332 1057684 1053879 1049497 1044701 1039605 1033509 1025716 1016848 1008533 1001859 996764 992837 990056 988663
49272 988663 988825 990503 993259 996137 998103 998755 998470 997810 996881 995308 992803 989725 986934 984923 983377
49257 983377 981969 981444 983399 989177 999468 1014598 1034181 1056532 1079572 1102439 1124925 1145014
49245 1145014 1158558 1162505 1157447 1146118 1130576 1112130 1092930 1075618 1061400 1049693 1039596 1030635
49233 1030635 1022444 1015122 1010016 1008871 1011841 1017226 1023267 1029265 1034913 1039718 1043579 1047113 1050925 1055137
49219 1055137 1059847 1065324 1071460 1077708 1083928 1090795 1099028 1108599 1118775 1128482 1136635 1142845 1148038 1153782
49205 1153782 1160831 1168951 1178235 1189686 1204059 1220780 1238509 1256211 1273244 1289035 1303368 1316689
49193 1316689 1329538 1341858 1353274 1363849 1374133 1384559 1395046 1405052 1413832 1420900 1426588 1432007
49181 1432007 1438204 1445521 1453983 1464055 1476580 1492033 1510311 1531374 1555840 1584734 1618917 1659042
49169 1659042 1705738 1758731 1814921 1867662 1909196 1934766 1944600 1942365 1932556 1919412 1906788 1897492
49157 1897492 1892581 1891909 1895166 1901826 1910514 1919443 1927589 1934906 1941553 1947665 1953823 1960899 1969267 1978755
49143 1978755 1989372 2001422 2014837 2029117 2044061 2059832 2076125 2092041 2107086 2121705 2136515
49132 2136515 2151579 2166741 2182111 2197825 2213804 2230030 2246577 2263047 2278521 2292534 2305780
49121 2305780 2319411 2333912 2348968 2364203 2379762 2396332 2414865 2436200 2460956 2489928 2524486
49110 2524486 2566311 2617074 2679112 2756535 2854754 2977564 3123159 3281555 3436380 3573066
49100 3573066 3690027 3802251 3928881 4071732 4205035 4289331 4299156 4240246 4142457 4036918
49090 4036918 3937249 3837469 3724068 3590150 3441041 3289730 3148651 3024965 2920886 2835870
49080 2835870 2767986 2714466 2672289 2638737 2611693 2589822 2572507 2559165 2548437 2538313 2527384
49069 2527384 2515740 2504403 2493991 2484258 2474777 2465509 2456444 2447225 2437730 2428817 2421755 2416766 2412777
49056 2412777 2408910 2405493 2403095 2401251 2398999 2396294 2393955 2392350 2391093 2390098 2390009 2391404 2394299 2398774 2405284
49041 2405284 2414009 2424453 2435864 2447265 2456766 2461910 2461718 2458031 2454086 2451851 2451254 2451544 2452530 2454464
49027 2454464 2457390 2460996 2464858 2468634 2472049 2474794 2476563 2477394 2477965 2479225 2481676 2485248 2489913 2495956
49013 2495956 2503495 2512162 2521629 2532095 2543814 2556346 2568642 2579924 2590312 2600644 2611788 2623971
49001 2623971 2636543 2648376 2658500 2666467 2672405 2677003 2681161 2685119 2687915 2688119 2685157 2679625 2672418
48988 2672418 2664092 2655012 2645531 2635913 2626476 2617808 2610288 2603479 2596658 2589968 2584252 2579640 2575160 2570117
48974 2570117 2564996 2560541 2556600 2552429 2547553 2541774 2534863 2526850 2518393 2510421 2503578 2498178 2494200 2491130
48960 2491130 2488426 2486423 2486219 2488338 2492178 2497147 2503556 2511845 2521746 2532980 2546201 2562430 2581935
48947 2581935 2604356 2629467 2657040 2686324 2716386 2746774 2777282 2807506 2837356 2867622 2899255
48936 2899255 2932382 2966761 3002839 3041389 3082322 3124839 3168805 3215095 3264390 3316338 3370112
48925 3370112 3425132 3481026 3537366 3593811 3650364 3707419 3765629 3825487 3886627 3947724 4007500
48914 4007500 4065724 4122839 4178793 4232756 4283987 4332478 4378756 4423323 4466353 4507723 4547432
48903 4547432 4586007 4624119 4661568 4697163 4729993 4760370 4789029 4815955 4840634 4862927 4882766
48892 4882766 4899144 4910397 4915623 4915201 4909941 4900420 4887203 4870997 4852286 4831185 4807729 4781929
48880 4781929 4753556 4722383 4688735 4653378 4616765 4578643 4538377 4495264 4448619 4397967 4343351
$$ [...]
##END NTUPLES=NMR SPECTRUM
##END=
