
##TITLE=AC1324_UGAAH12153_7163909_z8CT513T2h
##JCAMPDX= 6.0         $$ Bruker NMR JCAMP-DX V2.0
##DATA TYPE= NMR SPECTRUM
##DATA CLASS= NTUPLES
##ORIGIN= BRUKER
##OWNER= Administrator
$$ 1.72 TOPSPIN		Version 2.1
$$ 2012-12-01 13:28:28.712 -0500  Administrator@X
$$ Compression mode = diff/dup
##.OBSERVE FREQUENCY= 400.02188249412
##.OBSERVE NUCLEUS= ^1H
##.ACQUISITION MODE= SIMULTANEOUS (DQD)
##.ACQUISITION SCHEME= undefined
##.AVERAGES= 8
##.DIGITISER RES= 22
##SPECTROMETER/DATA SYSTEM= spect
##.PULSE SEQUENCE= zg30
##.SOLVENT NAME= COFFEE_meoh
##.SHIFT REFERENCE= INTERNAL, COFFEE_meoh, 1, 14.98509
##AUDIT TRAIL= $$ (NUMBER, WHEN, WHO, WHERE, PROCESS, VERSION, WHAT)
$$ ##TITLE= Audit trail, TOPSPIN		Version 2.1
$$ ##JCAMPDX= 5.01
$$ ##ORIGIN= Bruker BioSpin GmbH
$$ ##OWNER= Administrator
$$ $$ E:\/data/COFFEE/nmr/AC1324_UGAAH12153_7163909_z8CT513T2h/10/pdata/1/auditp.txt
$$ ##AUDIT TRAIL=  $$ (NUMBER, WHEN, WHO, WHERE, PROCESS, VERSION, WHAT)
(   1,<2012-12-01 13:28:21.116 -0500>,<Administrator>,<X>,<go>,<TOPSPIN 2.1>,
      <created by zg
	started at 2012-12-01 13:27:14.339 -0500,
	POWCHK enabled, PULCHK disabled,
       configuration hash MD5:
       86 BA 57 50 F2 9D 5C 9B 26 00 A9 28 5F 66 2E 89
       data hash MD5: 64K
       1A BD A1 BC 8E 8E 88 D0 15 1A 5E 1B 78 FC 39 8F>)
(   2,<2012-12-01 13:28:24.271 -0500>,<Administrator>,<X>,<proc1d>,<TOPSPIN 2.1>,
      <Start of raw data processing
       efp LB = 0 FT_mod = 6 PKNL = 1 PHC0 = 0 PHC1 = 0 SI = 32K 
       data hash MD5: 32K
       FE 2C 83 F1 1A 07 38 82 43 D8 0A BA 1D C0 AB 69>)
(   3,<2012-12-01 13:28:24.745 -0500>,<Administrator>,<X>,<proc1d>,<TOPSPIN 2.1>,
      <pk PHC0 = 99.01428 PHC1 = 0 
       data hash MD5: 32K
       A2 8A AB 48 A2 46 87 57 FC BD D6 59 7D 0C 5F 26>)
(   4,<2012-12-01 13:28:24.967 -0500>,<Administrator>,<X>,<proc1d>,<TOPSPIN 2.1>,
      <abs ABSG = 1 
       data hash MD5: 32K
       CC 7A 3B D4 27 97 F6 68 4F E8 53 7E 88 E2 93 48>)
(   5,<2012-12-01 13:28:25.107 -0500>,<Administrator>,<X>,<proc1d>,<TOPSPIN 2.1>,
      <abs ABSG = 2 
       data hash MD5: 32K
       2E 04 AB A7 87 F9 7F 39 4D DB 13 12 F4 57 AB 17>)
(   6,<2012-12-01 13:28:25.246 -0500>,<Administrator>,<X>,<proc1d>,<TOPSPIN 2.1>,
      <abs ABSG = 3 
       data hash MD5: 32K
       AF B4 DA 44 B0 86 22 54 F2 7F 84 5B 1C DD B9 31>)
(   7,<2012-12-01 13:28:25.385 -0500>,<Administrator>,<X>,<proc1d>,<TOPSPIN 2.1>,
      <abs ABSG = 4 
       data hash MD5: 32K
       9F 8B D2 AB E4 7C ED E4 1E 87 30 EC 5B 87 05 A6>)
(   8,<2012-12-01 13:28:25.538 -0500>,<Administrator>,<X>,<proc1d>,<TOPSPIN 2.1>,
      <abs ABSG = 5 
       data hash MD5: 32K
       99 F7 BC 90 81 F2 F9 05 30 C5 7C 2A 92 37 CC EB>)
$$ ##END=
$$ 
$$ $$ hash MD5
$$ $$ 72 05 F1 73 99 0A 2A 6D F8 CE 9D F4 88 C9 A0 B9
##$RELAX= 
##$RELAX= 
##$RELAX= 
##$RELAX= 
##$RELAX= 
##$RELAX= 
##$RELAX= 
$$ Bruker specific parameters
$$ --------------------------
##$DU= <E:\>
##$EXPNO= 10
##$NAME= <AC1324_UGAAH12153_7163909_z8CT513T2h>
$$ [...]
150 150 150 150 150 150 150 150
##$TP07= 0
##$TPNAME0= <>
##$TPNAME1= <>
##$TPNAME2= <>
##$TPNAME3= <>
##$TPNAME4= <>
##$TPNAME5= <>
##$TPNAME6= <>
##$TPNAME7= <>
##$TPOAL= (0..7)
0.5 0.5 0.5 0.5 0.5 0.5 0.5 0.5
##$TPOFFS= (0..7)
0 0 0 0 0 0 0 0
##$TUNHIN= 0
##$TUNHOUT= 0
##$TUNXOUT= 0
##$USERA1= <user>
##$USERA2= <user>
##$USERA3= <user>
##$USERA4= <user>
##$USERA5= <user>
##$V9= 5
##$VALIST= <valist>
##$VCLIST= <CCCCCCCCCCCCCCC>
##$VD= 0
##$VDLIST= <DDDDDDDDDDDDDDD>
##$VPLIST= <PPPPPPPPPPPPPPP>
##$VTLIST= <TTTTTTTTTTTTTTT>
##$WBST= 1024
##$WBSW= 4
##$XGAIN= (0..3)
0 0 0 0
##$XL= 0
##$YL= 0
##$YMAX_a= 612840
##$YMIN_a= -517534
##$ZGOPTNS= <>
##$ZL1= 120
##$ZL2= 120
##$ZL3= 120
##$ZL4= 120
##$ABSF1= 14.98509
##$ABSF2= -5.573092
##$ABSG= 5
##$ABSL= 3
##$ALPHA= 0
##$AQORDER= 0
##$ASSFAC= 0
##$ASSFACI= 0
##$ASSFACX= 0
##$ASSWID= 0
##$AUNMP= <proc_prof1d_extract_pilot.lims>
##$AXLEFT= 0
##$AXNAME= <>
##$AXNUC= <1H>
##$AXRIGHT= 0
##$AXTYPE= 0
##$AXUNIT= <>
##$AZFE= 0.1
##$AZFW= 0.1
##$BCFW= 0
##$BC_mod= 0
##$BYTORDP= 0
##$COROFFS= 0
##$CY= 15
##$DATMOD= 1
##$DC= 0
##$DFILT= <>
##$DTYPP= 0
##$F1P= 0
##$F2P= 0
##$FCOR= 0.5
##$FTSIZE= 32768
##$FT_mod= 6
##$GAMMA= 0
##$GB= 0
##$INTBC= 1
##$INTSCL= 1
##$ISEN= 128
##$LB= 0
##$LEV0= 0
##$LPBIN= 0
##$MAXI= 10000
##$MC2= 0
##$MEAN= 0
##$ME_mod= 0
##$MI= 0
##$NCOEF= 0
##$NC_proc= -8
##$NLEV= 6
##$NOISF1= 0
##$NOISF2= 0
##$NSP= 0
##$NTH_PI= 0
##$NZP= 0
##$OFFSET= 14.98509
##$PC= 1
##$PHC0= 99.01428
##$PHC1= 0
##$PH_mod= 1
##$PKNL= yes
##$PPARMOD= 0
##$PPDIAG= 0
##$PPIPTYP= 0
##$PPMPNUM= 2147483647
##$PPRESOL= 1
##$PSCAL= 4
##$PSIGN= 0
##$PYNMP= <proc.py>
##$REVERSE= no
##$SF= 400.02
##$SI= 32768
##$SIGF1= 0
##$SIGF2= 0
##$SINO= 400
##$SIOLD= 32768
##$SPECTYP= <>
##$SREGLST= <1H.CDCl3>
##$SSB= 0
##$STSI= 32768
##$STSR= 0
##$SW_p= 8223.68421052631
##$SYMM= 0
##$S_DEV= 0
##$TDeff= 65536
##$TDoff= 0
##$TI= <>
##$TILT= no
##$TM1= 0
##$TM2= 0
##$TOPLEV= 0
##$USERP1= <user>
##$USERP2= <user>
##$USERP3= <user>
##$USERP4= <user>
##$USERP5= <user>
##$WDW= 1
##$XDIM= 32768
##$YMAX_p= 437077348
##$YMIN_p= -722506
##$CURPLOT= <Network HP LaserJet P1505>
##$CURPRIN= <$Network HP LaserJet P1505>
##$DFORMAT= <normdp>
##$LAYOUT= <+/1D_H.xwp>
##$LFORMAT= <normlp>
##$PFORMAT= <normpl>
##$SURQMSG= 1
$$ End of Bruker specific parameters
$$ ---------------------------------
##NTUPLES= NMR SPECTRUM
##VAR_NAME=  FREQUENCY,     SPECTRUM/REAL,   SPECTRUM/IMAG
##SYMBOL=    X,             R,               I
##VAR_TYPE=  INDEPENDENT,   DEPENDENT,       DEPENDENT
##VAR_FORM=  AFFN,          ASDF,            ASDF
##VAR_DIM=   32768,         32768,           32768
##UNITS=     HZ,            ARBITRARY UNITS, ARBITRARY UNITS
##FACTOR=    0.250966925370066, 1,           1
##FIRST=     8223.43324360094, -1530,        104073
##LAST=      0,             121887,          -136135
##MIN=       0,             -722506,         0
##MAX=       8223.43324360094, 437077348,    0
$$ Real data points
##PAGE= N=1
##DATA TABLE= (X++(R..R)), XYDATA
$$ [...]
19490G1970K6402a40176q2395j34795a76082f4299I5886c00234f4000A1439P4375
19479H5814Q789a46251E7381i9839k8879A83661c2478A4857b47212c3421f233
19467c2240B6118a42133C7770h8123a9363A9408c7039j08569j4908k2040B11973
19455b53980m4501B31282I5323a00723j01872F0634Q5990b27165i5641G7868d9533
19443b34823R7257C0124K93867g1009n4099B20007a22703A33352g2885j91838
19433b64723B72136j24331F1391f1381B6850c43120R7912J00921M0122j09362
19423b13527c3887j7527q9426a9003c534F5612c28177M9081b1594j80131B0294
19411f63110c8471j56347d5726j54355B82978d06609a63031N5047F8830J64165
$$ plain form
19490 71970 98372 -140176 -222571 -357366 -176082 -64299 95886 -300234 -64000 11439 85814
19479 85814 94603 -146251 57381 -99839 -128718 183661 -32478 14857 -247212 -33421 -6233
19467 -32240 26118 -142133 37770 -88123 -19363 19408 -37039 -145608 -160516 -182556 211973
19455 -253980 -298481 231282 95323 -100723 -202595 60634 146624 -227165 -95641 77868 -49533
19443 -234823 -137566 30124 323991 -71009 -125108 220007 -122703 133352 -72885 -264723
19433 -264723 272136 147805 61391 -61381 26850 -343120 -245208 -144287 -104165 -213527
19423 -213527 -33887 -51414 -140840 -19003 -3534 65612 -328177 -279096 -21594 -201725 20294
19411 -663110 -38471 -194818 -45726 -200081 282978 -406609 -163031 -107984 68830 232995
19401B32995c86127A06740e72249A15158a5273p638l2875l47660e1184H3802b7090
19389e9703o0418C8587C276O4691b81533H7660c2768p8393B4480O2194a13966
19377a99117g3285D28988c02039J37671Q1445j76164b7736A00545k2299b69175
19366A51044a49931e8367I6953a14329l18080J36189d1249j92283j0036A5833
19355A46239J97680a29447D2605a31437q5634C877c05926A15240b71133j18742
19345c89875g3696q0083F6429K4021a3185C36348B8192a97133k38257A74950F729
19333A19739N713f1757j65759G1223J09685B3243a84151n704P8415j71510f0484
19321b47660j73502J79464a05791j67927J15580j09640O9967f4123j02756J9986
$$ plain form
19401 232995 -386127 106740 -572249 115158 -15273 -22911 -55786 -403446 -51184 83802 -27090
19389 -59703 -120121 38587 3276 67967 -281533 87660 -32768 -111161 24480 86674 -113966
19377 -199117 -73285 428988 -302039 -164368 -82923 -259087 -27736 100545 78246 -269175
19366 151044 -149931 -58367 96953 -114329 -432409 -296220 -41249 -233532 -243568 15833
19355 146239 343919 -129447 42605 -131437 -217071 3877 -305926 115240 -271133 -389875
19345 -389875 -73696 -153779 66429 90450 -13185 336348 28192 -197133 -435390 174950 6729
19333 119739 125452 -61757 -227516 71223 180908 23243 -184151 -189855 -111440 -282950 -60484
19321 -247660 -421162 -241698 -105791 -273718 -158138 -267778 -197811 -64123 -166879 -146893
19311a46893B35363j08903a74196D0634b36348F1427a68116e6063k8816D2223
19300C204a33550m5459f0391I5295d12107a30831n1978P3201K0617G4110h7630
19288A13784a81779r9120h0026G9695C4178g5815A29741a50130N5699j54061C11901
19276a68953n2387j06104a49200e5300r6933A78962D6174a2938B35605G5771d8238
19264A16380a02297j61762k1219A53580f8373A28892i6177p0824n0238A5820a87471
19252d5981p6118J1625N0955p7735d8023j4932B24352J5235H6738a72065j1920
19241a83985A12293a55219j81406J1030f0465r5259M2429o0208c1289j0908l41875
19230c84072H3756b11182C00484b95067g5265A7387K14622c96758a32475l1447
$$ plain form
19311 -146893 235363 126460 -174196 40634 -236348 61427 -168116 -56063 -84879 42223
19300 3204 -133550 -179009 -60391 95295 -412107 -130831 -182809 -109608 -88991 74110 -87630
19288 113784 -181779 -280899 -80026 79695 34178 -75815 129741 -150130 -94431 -248492 311901
19276 -168953 -221340 -327444 -149200 -55300 -152233 178962 46174 -12938 235605 75771 -48238
19264 116380 -102297 -264059 -285278 153580 -68373 128892 -96177 -167001 -217239 15820 -187471
19252 -45981 -122099 -110474 -59519 -137254 -48023 -62955 224352 239587 86738 -172065 -183985
19241 -183985 112293 -155219 -336625 -325595 -60465 -155724 -113295 -173503 -31289 -42197 -384072
19230 -384072 83756 -211182 300484 -295067 -75265 17387 232009 -396758 -132475 -163922
19220a63922a0997n5117n5118B25517f3139A38098b23906A96536J2896b49740
19209h8229A20870e1237I5010q841e1334d57E9822i7392j11476B98315j26489
19198A71826c4151B31797b40353A762a58461G2116d7718D96J91695b29881A3503
19186b10052R7031B05738G7689b84247J23946F9264e37014A57253J40243j31309
19176A66187P9322a95190m05298e3764E7256b05116R0315G5209c91988A4993b11264
19164b55446D024J1596g5748A86945e4133l87895C06211a70102G2888b57688A37472
19152A1605l025b69836i235k28683j61081b5171C2638K06734a48325j44069c201
19140B51621C7702d9306j61380E6626G405K02866a34009D3852b13341A12523b80644
$$ plain form
19220 -163922 -10997 -66114 -121232 225517 -63139 138098 -223906 196536 209432 -249740
19209 -88229 120870 -51237 95010 86169 -51334 -457 59822 -97392 -208868 298315 171826
19198 171826 -34151 231797 -240353 1762 -158461 72116 -47718 496 192191 -229881 13503
19186 -210052 -113021 205738 77689 -284247 -160301 69264 -537014 157253 297496 166187
19176 166187 245509 -195190 -600488 -53764 57256 -205116 -114801 75209 -391988 14993 -211264
19164 -255446 4024 15620 -75748 186945 -54133 -442028 306211 -170102 72888 -257688 137472
19152 11605 8580 -269836 -9235 -237918 -398999 -25171 32638 239372 -148325 -292394 -3201
19140 251621 37702 -49306 -210686 56626 7405 210271 -134009 43852 -213341 112523 -280644
19128A7637f8837j16110B9340a53105r3941b3928j70671d7040J9044j96849F7666
19116b78322K8279R97A57343b82543A13437a61753j16191J37996n1550b8588l98004
19105d26592E1592e2216l1440I4050A3087b10803g0656E0266N99a96983Q136E3638
19092a72964k5896A86545a36498B63770q6939b29492a12884B1241b98599a12947
19081b43874n672I4851a52076l0875Q5885H8014e4237k03018f1206E4814J28873
19070A83687a05430C1288b3213j46687A63172h4773I7702h8775D8395a04871G7110
19058b5155k31802A92348e60932I5118a82821A88439a9940A62606b2569D3793
19047b93679A50490d1107g76D2886J30625B8056c9430j4976A60096A3961P345
$$ plain form
19128 17637 -68837 -184947 29340 -153105 -247046 -23928 -194599 -47040 -27996 -224845 67666
19116 -278322 -250043 -249046 157343 -282543 113437 -161753 -277944 -139948 -191498 -28588 -426592
19105 -426592 51592 -52216 -83656 94050 13087 -210803 -70656 50266 50865 -196983 -188847 53638
19092 -172964 -198860 186545 -136498 263770 176831 -229492 -112884 21241 -298599 -112947
19081 -243874 -249546 94851 -152076 -182951 -97066 88014 -54237 -257255 -61206 54814 183687
19070 183687 -105430 31288 -23213 -169900 163172 -84773 97702 -88775 48395 -104871 77110
19058 -25155 -256957 192348 -560932 95118 -182821 188439 -19940 162606 -22569 43793
19047 -293679 150490 -41107 -776 42886 173511 28056 -39430 -54406 160096 13961 21306
19036B1306L283a26423A83444o2842i8068H2486h8040d0354A27730l2902i5643
19024a78673a5111A69314b39536B04968a11445A90610b00714A79324p9640a86640
19013A10404a62212k58785j42928A68214G657J75117C275g4385D6343J59778a48129
19001C17564b29569i6937A59581R4161b00021E6899a99879f971j46108K9636j36177
18990b59620J18642j78012i6577A53410b64707D44157a96654j29221a23970j3442
18980a37412J4923c0067j58093m9423H11a70923A9023M31032J31812j21419o3628
18969C96820A84146c5175B32038o1985b01903A10338g394j42933k7233L5365j72436
18958c14631B9714a04141C1123g1827A09605N2025a83652E1835A7269b19381A31739
$$ plain form
19036 21306 24589 -126423 183444 120602 -98068 82486 -88040 -40354 127730 94828 -95643
19024 -178673 -15111 169314 -239536 204968 -111445 190610 -200714 179324 99684 -186640
19013 110404 -162212 -420997 -563925 168214 7657 182774 3275 -74385 46343 206121 -148129
19001 317564 -229569 -96937 159581 253742 -200021 56899 -199879 -6971 -153079 -123443 -259620
18990 -259620 -140978 -318990 -96577 153410 -264707 444157 -196654 -325875 -123970 -137412
18980 -137412 -122489 -30067 -188160 -237583 811 -170923 19023 450055 581867 460448 396820
18969 396820 184146 -35175 232038 170053 -201903 110338 -7394 -150327 -177560 -142195 -314631
18958 -314631 29714 -104141 31123 -71827 109605 161630 -183652 51835 17269 -219381 131739
18946a38261k42346e6730j28170M9726B24172b26457j2745a02487H8813a14774
18935c3854C62345e0213G946N3379K20269F6645d1929A48105o5796f8027A759
18923A25923k6671a62767A4133b75511B39075g9316q4195N5729A52606a12258
18912a75978C7537h0453B16321j3512N03569l00958J4727b88284k08219A09676
18901a10276B78209C1553L23365A50710b64386A01532d73049b15774P6940A27602
18890C638c10533q6711F8961g5486B32531c4907m9898a8985k09465I0638C0456
18878a28695B16586b21568h0420j54855C24306g4453j76521A03703b03003f739
18867A23333a23486M7230o6012e7848A79836i3828Q765I3671a10207I3646h7005
$$ plain form
18946 -138261 -380607 -56730 -184900 -135174 224172 -226457 -239202 -102487 88813 -114774
18935 -33854 362345 -50213 7946 61325 281594 66645 -41929 148105 82309 -68027 1759
18923 125923 99252 -162767 14133 -275511 239075 -79316 -163511 -107782 152606 -112258
18912 -175978 37537 -80453 216321 202809 706378 405420 420147 -288284 -496503 109676
18901 -110276 278209 31553 354918 150710 -264386 101532 -473049 -215774 -138834 127602
18890 3638 -310533 -397244 68961 -75486 232531 -34907 -84805 -18985 -228450 90638 30456
18878 -128695 216586 -221568 -80420 -235275 324306 -74453 -250974 103703 -203003 -6739
18867 123333 -123486 -76256 -142268 -57848 179836 -93828 -85063 93671 -110207 93646 -87005
18855b63235B53165l3311n9602b11413D7488A5593a33312e1311E8655J23352A5191
18843B17412m5221C4355R5318c8921C10879d75417J6985A38532a10230B7360a89278
18831A3356a36339D9727a97609J4904B15384h2681l3000r8329A0262K2221R8151
18820A30634a42395H562a57469n9663A0576J98790e6548A16608n6975b94861J35991
18809a58870f374k75151M2706B46808C3849K27010I8707a41544B20667a71502
18798a80152e0466j92220H4525a65407B2601L21705j47735b83210H0490d54287
18787A17999m9005A3946J75879a93386A5486J89053J07759r2771F9983M4901a20419
18775c89523i5259j98094c6998n9H3752L579b38673G2317b60695A4943C70a89800
$$ plain form
18855 -263235 253165 219854 160252 -211413 47488 15593 -133312 -51311 58655 182007 15191
18843 217412 172191 34355 129673 -38921 310879 -475417 -458432 138532 -110230 27360 -189278
18831 13356 -136339 49727 -197609 -182705 215384 -82681 -115681 -214010 10262 32483 130634
18820 130634 -142395 8562 -157469 -217132 10576 209366 -56548 116608 59633 -294861 -158870
18809 -158870 -6374 -281525 -238819 246808 33849 260859 98707 -141544 220667 -171502
18798 -180152 -50466 -242686 84525 -165407 22601 344306 196571 -283210 80490 -454287
18787 117999 68994 13946 189825 -193386 15486 204539 312298 219527 69983 114884 -120419
18775 -389523 -95259 -293353 -36998 -37057 83752 87331 -238673 72317 -260695 14943 370 -189800
18762F9800J01895J86415b98009J13693A61903b01097J2113j03896B66803n1029
18752B15774a8079j23288r9818A0036a99803f0457m584A90309c43421J06885N2044
18741a84492C6493h3096j73579C25326r2447a30684G7232a64135j64101L3427
18731b94809J32247B0749d05169i7323l16616J74845a15818I4525e7207r8152
18721a55359P7112k04372G2370b40718o9260N1043N9003N1632A00908J68926n7432
18710B12402a31484m6646C4565i8945j91188A9346J14116c93721i1876a8654G1279
18698A99535d4200j48859a1334j02086E8918J19698a95933j18341B04520h3717
18687d22067A36779b76263g2665j1754j42223C41678b79428a6816j34898A1780
$$ plain form
18762 69800 171695 358110 -298009 -184316 161903 -201097 -188984 -292880 266803 215774
18752 215774 -18079 -141367 -241185 10036 -199803 -60457 -65041 190309 -343421 -236536 -184492
18741 -184492 36493 -83096 -256675 325326 232879 -130684 77232 -164135 -328236 -294809
18731 -294809 -162562 20749 -405169 -97323 -413939 -239094 -115818 94525 -57207 -155359
18721 -155359 -78247 -282619 72370 -240718 -309978 -258935 -199932 -148300 100908 269834 212402
18710 212402 -131484 -178130 34565 -98945 -290133 19346 133462 -393721 -91876 -18654 71279
18698 199535 -44200 -193059 -11334 -113420 58918 178616 -195933 -314274 204520 -83717
18687 -422067 136779 -276263 -72665 -84419 -226642 341678 -279428 -16816 -151714 11780
18676c10337P8352f7086j03736H6543g4236K3386j58236C0349G033a98979B9718
18664C05960d2420r3869G7043d78860e6116k8601p7711O277r2635J4603k2392
18653b56575O1540A0096a58926A6052b64685a29621F1474R842a73227n9509A55896
18641C3971g922l87033a33567b7934G6661c26563J49223C1648a26444J6027j1965
18630a22382j38626C7436e4392A28563b20419A06961J1013D6959A0744b9336k2109
18619e1445q2969B32419n2090K40531c45739e642k904A02644k3427J21647J2409
18608B13273h9979l4942K0868j0183H0180a32217A13272b68083e4118j64589o4729
18597b83436g1350j57289A45575o729E2876b8498j3155l05346a45243p3246A74305
$$ plain form
18676 -310337 -231985 -67086 -170822 86543 -74236 -50850 -209086 30349 7033 -198979 29718
18664 305960 -42420 -136289 77043 -478860 -56116 -84717 -162428 -156151 -248786 -234183 -256575
18653 -256575 -195035 10096 -158926 16052 -264685 -129621 61474 71316 -173227 -232736 155896
18641 33971 -7922 -394955 -133567 -27934 76661 -326563 -177340 31648 -126444 -110417 -122382
18630 -122382 -261008 37436 -54392 128563 -220419 106961 117974 46959 10744 -29336 -51445
18619 -51445 -134414 232419 180329 420860 -345739 -5642 -8546 102644 79217 200864 213273
18608 213273 -89979 -124921 -104053 -114236 80180 -132217 113272 -268083 -54118 -218707 -283436
18597 -283436 -71350 -228639 145575 138846 52876 -28498 -41653 -346999 -145243 -218489 174305
18585h8449E3725c71104B64501b39920A21573c70418B30615f3928j14508A06925
18574C748b34640q0959E0833d5060B36883b96070A27128g0752H894c3192O919
18563b6273J870q0625b3628E6487J37090d0319C7411b5073k21255b4917j65559
18552a90476L4449n1642c9768A45209b58721R209A65069n3930a15908K6593I4740
18540a02566A17724D9148b69886g0057n899c995k47897J8505k8750J04302E6126
18528i8733I7136a08992d819p7957G9271g1558B9770A983J80766a42820n2872
18517a95692B18318g2925j61188A03358b40938c8563B46324a55971k65812A01905
18506A64142c38297D0492Q7341E7604K06708b32683A62589A2997b70615E1014
$$ plain form
18585 -88449 53725 -371104 264501 -239920 121573 -370418 230615 -63928 -178436 106925
18574 3748 -234640 -315599 50833 -45060 236883 -296070 127128 -70752 8894 -33192 -26273
18563 -26273 -24403 -105028 -23628 56487 193577 -40319 37411 -25073 -246328 -24917 -190476
18552 -190476 -156027 -207669 -39768 145209 -258721 -249512 165069 111139 -115908 -89315 94740
18540 -102566 117724 49148 -269886 -70057 -75956 -3995 -251892 -233387 -262137 -157835 56126
18528 -98733 97136 -108992 -4819 -82776 79271 -71558 29770 1983 182749 -142820 -195692
18517 -195692 218318 -72925 -234113 103358 -240938 -38563 246324 -155971 -421783 101905
18506 164142 -338297 40492 127833 57604 264312 -232683 162589 12997 -270615 51014
18495C5046b97576K6867N2702L4741f9186C52275b38581J08668O4396j29058b8315
18483c88475A42763a15072K8901k72384b8513D76305j74334b63636A35612b04512
18472c9116p2237k32088D33100a45509A4405f1858f580j94739E4672h3939A43452
18460C54447b1593B19936m409f7158B80233c60229J52913A2496a39632c2304J3748
18449a8556A63039b8506m3968A79176F4690f7408A78255j4295a39588j39441D8278
18437b72650G3590J95333n5467a12231K6078k95594i5299p4890O9405J5960A12149
18425d32409A9097a02815E7345j233J28493a8774j79249Q8731j45146B0610q568
18414A2042a88398g8278Q483A28468B557a36403p0070e7402A82150A8157J61979
$$ plain form
18495 35046 -297576 -270709 -218007 -183266 -69186 352275 -238581 -129913 -65517 -194575 -28315
18483 -388475 142763 -115072 -86171 -358555 -28513 476305 301971 -263636 135612 -204512
18472 -39116 -111353 -343441 433100 -145509 14405 -61858 -6580 -201319 54672 -83939 143452
18460 354447 -21593 219936 215527 -67158 280233 -360229 -207316 12496 -139632 -32304 -18556
18449 -18556 163039 -28506 -72474 179176 64690 -67408 178255 163960 -139588 -279029 48278
18437 -272650 73590 268923 213456 -112231 -86153 -381747 -95299 -170189 -100784 -84824 112149
18425 -432409 19097 -102815 57345 56112 184605 -18774 -198023 -109292 -254438 20610 12042
18414 12042 -188398 -78278 -69795 128468 2557 -136403 -206473 -57402 182150 18157 180136
18403A80136k7143m0824a34804e1663B9961e1005A22716p984l9681B6497g7722
18391B44401d38818b15040k84524I0239a34184N2709C2489M6181a8972C76776
18380G2187b03095n8949k68031A64476A7O5205e2414B06073F5830J60672b42398
18368a88176A91724a4031k2729j59818c047m7591q3828j89533A08405O4439b78123
18356B04473d5224J9802j51743q4222c7801J1931B34344q7640d8517C66869a12269
18344B5671K27347d6244j83648F8604d21392R4018J14413C4556K0061b48417i7448
18332A28981a08581K7796j92755B98364i441j39321q625r4585A00919a99205A21543
18320b24404A65056a65840b2348A60839a38705A87736I18b1879j91397F213e3869
$$ plain form
18403 180136 152993 112169 -134804 -51663 29961 -51005 122716 114732 75051 26497 -77722
18391 244401 -438818 -215040 -499564 90239 -134184 -81475 32489 78670 -18972 376776
18380 72187 -203095 -262044 -530075 164476 17 65222 -52414 206073 65830 226502 -242398
18368 -188176 191724 -14031 -36760 -196578 -3047 -50638 -134466 -323999 108405 172844 -278123
18356 204473 -45224 -25422 -177165 -261387 -37801 -25870 234344 146704 -48517 366869 -112269
18344 25671 253018 -46244 -229892 68604 -421392 -327374 -212961 34556 54617 -248417 -97448
18332 128981 -108581 -80785 -273540 298364 -9441 -148762 -157387 -251972 100919 -199205 121543
18320 -224404 165056 -165840 -22348 160839 -138705 187736 918 -21879 -213276 6213 -53869
18308b22067A2852c96018a41482k6996N6832A87906m6907Q3851G3883L6075j8234
18297I1724K7297C3015a70885A48405f8532E5561P3787i4579H2399a91058O4811
18286a26247A66976o7680B6421a06375c8051j2939j86997C248L6442K71793a99826
18274A84140b53522P4322f0616h081C9635K07190n9219f3615k7159a8803A2817
18262a83342O6975b0422A27139C5251h3188B14512H1556j4422A3064c20104a9732
18250B4079i5007j89693A16189a45688j9402k1571A28092c00838b6743m7368c5706
18238a42375A32153g8432j47688C057c0987l27933A6531a39798D60051i6429j83304
18227b79733F4423J52462h6521A03195a06560l0967j46603P5270D32083f4546
$$ plain form
18308 -222067 12852 -396018 -141482 -168478 -111646 187906 140999 224850 73883 109958 91724
18297 91724 119021 33015 -170885 148405 -68532 55561 129348 -94579 82399 -191058 -126247
18286 -126247 166976 99296 26421 -106375 -38051 -50990 -237987 3248 39690 311483 -199826
18274 184140 -253522 -179200 -60616 -8081 39635 246825 187606 -63615 -90774 -18803 12817
18262 -183342 -116367 -20422 127139 35251 -83188 214512 81556 67134 13064 -320104 -19732
18250 24079 -95007 -284700 116189 -145688 -165090 -186661 128092 -300838 -26743 -74111 -35706
18238 -142375 132153 -78432 -226120 3057 -30987 -358920 16531 -139798 460051 -96429 -279733
18227 -279733 64423 216885 -86521 103195 -106560 -137527 -284130 -208860 432083 -64546
18216b14092b9788o5682A11748b5374l11237a1824A87742a21763J7940j75634
18206b79457A44889E5285K78171e9861A02336a50854A20872a25306C64305B7866
18195b3332A71304J4841g1083k2632B35289a71914E9338e5983b3533j9978k18007
18184b61518i0103l3614b020H9062a59333L176g3889j84120C02520f1889A60278
18172E761N4300c45726a02648A04422a7373G5922a55539A79148e5227G3529J29002
18161B02531c94000A02236j8701M2824J18563j21970a43734I7549a02883j4991
18151a17874j77162B84388b40949C09016e0492D01855a42621B24659E9343B053
18140a90012M9953M6105C56467D5536j3325A0885b93010A69443a01986D14671
$$ plain form
18216 -214092 -29788 -95470 111748 -25374 -336611 -11824 187742 -121763 -103823 -279457
18206 -279457 144889 55285 333456 -59861 102336 -150854 120872 -125306 364305 27866
18195 -23332 171304 186145 -71083 -93715 235289 -171914 59338 -55983 -23533 -43511 -261518
18184 -261518 -90103 -123717 -2020 89062 -159333 -156157 -73889 -258009 302520 -61889 160278
18172 5761 60061 -345726 -102648 104422 -17373 75922 -155539 179148 -55227 73529 202531
18161 202531 -394000 102236 83535 126359 244922 122952 -143734 97549 -102883 -117874
18151 -117874 -295036 284388 -240949 309016 -50492 401855 -142621 224659 59343 2053
18140 -190012 -140059 -93954 356467 45536 32211 10885 -293010 169443 -101986 414671
18129a45834M5673k2566f744C18369j45054j1016o6101a83444f0680k910f874
18117c070B14789J4527A07451i4845A7108J49131a08443N0867A6838a62249F8625
18105b5989n1874G7937L3304a74519G3181i9156A24435M6983a81224G1399b44838
18093A76217J0051a6787j48763g842m2054B02172k9867c3396k50718f1917B49401
18081b65682A09027K66919A58709f3327p1060O6793r3693C9457c12978d4599l2504
18070g7103A28107A1373O3557b35567R7949A14759K1949h4070L5530j20490j04916
18059b73946B54139G1411b0097G0010b11280j4792j0760N9159c7057O363A10506
18047a66105l2170l2177A14975a57263d0498a9687k54345P9037e9329a7029k5223
$$ plain form
18129 -145834 -100161 -122727 -6744 318369 173315 162299 96198 -183444 -60680 -63590 -6874
18117 -3070 214789 229316 107451 -94845 17108 166239 -108443 -57576 16838 -162249 68625
18105 -25989 -77863 77937 111241 -174519 73181 -99156 124435 171418 -181224 71399 -244838
18093 176217 186268 -16787 -165550 -7842 -49896 202172 172305 -33396 -284114 -61917 249401
18081 -265682 109027 375946 158709 -63327 -134387 -67594 -161287 39457 -312978 -44599 -77103
18070 -77103 128107 11373 74930 -235567 -137618 114759 136708 -84070 -48540 -169030 -273946
18059 -273946 254139 71411 -20097 70010 -211280 -226072 -236832 -177673 -37057 -30694 110506
18047 -166105 -198275 -230452 114975 -157263 -40498 -19687 -274032 -194995 -59329 -17029 -42252
18036d2252L370B1559b7051j55614A2997c2349A95877f3996D4652a84275A8300
18024C75213K5253f5095b2449E6925K6160b5779j77491P9455A53073c40259O3482
18013b76777H2985N1887n1435J80259d2633J4028H9048b23703a10482J2186I4066
18001d5189q4552j17209D3939h8978F1707a48193F2415b27519B28259r812j7117
17990B01330J12420b70415I9129M6193F1241M145L63324D5262P1743m8915J12458
17979A80548c51034A81027g4159b9120A77398C9994J79506a82273Q1329o7490
17969a68434B28249i1788A27442l9718n841a89552m8950o4303E3496q473O625
17958E1648K15332c66322C3108J73982A9284k464J95937L2289g1121F142a28681
$$ plain form
18036 -42252 -38882 21559 -27051 -182665 12997 -32349 195877 -63996 44652 -184275 18300
18024 375213 400466 -65095 -22449 56925 83085 -25779 -203270 -123815 153073 -340259 -276777
18013 -276777 82985 134872 83437 263696 -42633 -28605 89048 -223703 -110482 -98296 94066
18001 -45189 -129741 -246950 43939 -88978 61707 -148193 62415 -227519 228259 218447 201330
17990 201330 313750 -270415 99129 145322 61241 65386 428710 45262 117005 68090 180548
17979 180548 -351034 181027 -74159 -29120 177398 39994 219500 -182273 -100944 -168434
17969 -168434 228249 -91788 127442 87724 81883 -189552 -238502 -302805 53496 45023 51648
17958 51648 266980 -366322 33108 207090 19284 16820 212757 245046 -71121 6142 -128681
17946c4368A88574a42057c4089C56303j55886d2473B94971J6134A35813m461B2788
17934b7098l29953B92891e5337B12199A9800g3670B6366a84227O3926j23461A03048
17922B40963b0400A79125F6097q331a27530B43455D222J9712K8656a39439H3613
17910F5255b67559J07604I629a18959A01127a36094j7671G654b50653A13401e382
17898A14055b78906E8494J59862a88607F9838P5182m3914g6061m5618I7818c2580
17886B76054E414a68194A43912r528B8176a31322A8462J00471K02603H0527b44563
17874b54915B79704I711M31847b40562H7919o390c87564i6628L4657B4234a77675
17862i1648k02709g1495q4027A64638a66937C6486c5727D9026c34934J64265j70082
$$ plain form
17946 -34368 188574 -142057 -34089 356303 200417 -42473 294971 311105 135813 131352 22788
17934 -27098 -357051 292891 -55337 212199 19800 -73670 26366 -184227 -120301 -243762 103048
17922 240963 -20400 179125 66097 57766 -127530 243455 4222 23934 52590 -139439 83613
17910 65255 -267559 -159955 9629 -118959 101127 -136094 -153765 7654 -250653 113401 -5382
17898 114055 -278906 58494 218356 -188607 69838 145020 101106 -76061 -121679 97818 -32580
17886 276054 5414 -168194 143912 134384 28176 -131322 18462 118933 321536 80527 -244563
17874 -254915 279704 9711 441558 -240562 87919 81529 -387564 -96628 -61971 24234 -177675
17862 -91648 -294357 -71495 -155522 164638 -166937 36486 -35727 49026 -334934 -170669 -340751
17851c40751J64650A96740f653F5582L04758b4158C6686f6230C47985A41053f912
17839C2260J60629b46928G0372C858J96962g3737B35171c6174A10809b28521c9728
17827A41385D3701J08499J8303K8888M18385F30f2826I0779b35356N9136f0502
17815f3553H0047M7143J38364j28501K960k145B1718M3356Q5421b36497I5287
17803B8703h5306j04345A3801K0307J69539a77844B58122B8303b9954A55654a94297
17791D04049b28671M9580A63323i1377H359d39896g7436j1444n360G7549l3990
17780D3559J20479b75418D12495K1879I9956b21038r2797D175J86818b12412h9424
17768D73046C3064J57575c6800n0730H7860b36314a9444D2641b8531D75704B11551
$$ plain form
17851 -340751 -176101 196740 -6653 65582 370340 -24158 36686 -66230 347985 141053 -6912
17839 32260 192889 -246928 70372 3858 200820 -73737 235171 -36174 110809 -228521 -39728
17827 141385 43701 152200 170503 199391 617776 630 -62826 90779 -235356 -176220 -60502
17815 -63553 80047 127190 265554 137053 140013 137868 21718 65074 150495 -236497 95287
17803 28703 -85306 -189651 13801 34108 203647 -177844 258122 28303 -29954 155654 -194297
17791 404049 -228671 -179091 163323 -91377 8359 -439896 -77436 -88880 -94240 77549 43559
17780 43559 164038 -275418 412495 434374 99956 -221038 -313835 4175 190993 -212412 -89424
17768 473046 33064 190639 -36800 -87530 87860 -236314 -19444 42641 -28531 475704 211551
17756F9804i8712l3346A72834N0002b47105a14226H7095b7318H6836d6171B46302
17744A25782c6499C26733j10841n6473b22116A18796a6822q7230B6005b0726p045
17733b7771A72533a32027H7438a12752A04660L24821A04557N111i8735A55213
17722a07057A09725K0065D7183K14801m8372L4723a81161j51215f8320A57680
17711b1484A17232A2341N36999c15688F3617R347a20953d630D7215K19929J09528
17700C76672b23442O7180J3869B00221C6899Q1894C0057b7012D84376A24846b3554
17688b00796r3691g256A4905d7126A04449j8461d1682j55206H8989J33795m5211
17677A77573b1427p9970D9363K61441G2988b6935j94561A6117L66315F7943O1175
$$ plain form
17756 69804 -98712 -132058 172834 222836 -247105 -114226 87095 -27318 86836 -46171 246302
17744 125782 -36499 326733 215892 159419 -222116 118796 -16822 -104052 26005 -20726 -27771
17733 -27771 172533 -132027 87438 -112752 104660 429481 104557 109668 -98735 155213
17722 -107057 109725 129790 47183 261984 213612 248335 -181161 -332376 -68320 157680
17711 -21484 117232 12341 549340 -315688 63617 72964 -120953 -4630 47215 267144 376672
17700 376672 -223442 -156262 -142393 200221 36899 118793 30057 -27012 484376 124846 -23554
17688 -200796 -294487 -7256 14905 -47126 104449 85988 -41682 -196888 88989 222784 177573
17677 177573 -21427 -101397 49363 310804 72988 -26935 -221496 16117 382432 67943 129118
17666A29118b51433i9301C352a8354E80966A74079E7872j1157B167J07004M2096
17655A51267i2068B63679A01865l0266R2473K3012N1885i2611C43947C5546a28855
17643c83469e0715A75998R0624c8035A7795K00232H4369J76313j00975J28714
17633B88421A24881K87960a19427m6535A98737b5516A30986J67833k8678J6571
17623B86712F2318Q5001I884f3379F9420c00409B11194f5397k60077A44625i0179
17611E0260a43282a4118B32459a11745A31429J5618h1950C45643I7570b96685
17600C92539e733G7643a27016D89126j74188a96196D09402H7778K911J89174j09281
17589A70582a21298C29733p7895j04439Q2908A13964J31843b86374b2756A86777
$$ plain form
17666 129118 -251433 -99301 3352 -18354 580966 174079 57872 46715 2167 109171 151267
17655 151267 -92068 263679 101865 71599 164072 187084 238969 -92611 343947 35546 -128855
17643 -383469 -50715 175998 266622 -38035 17795 218027 84369 260682 159707 288421
17633 288421 124881 412841 -119427 -165962 198737 -25516 130986 298819 270141 286712
17623 286712 62318 147319 9884 -63379 69420 -300409 211194 -65397 -325474 144625 -90179
17611 50260 -143282 -14118 232459 -111745 131429 147047 -81950 345643 97570 -296685
17600 392539 -5733 77643 -127016 489126 314938 -196196 409402 87778 90689 279863 170582
17589 170582 -121298 329733 251838 147399 230307 113964 245807 -286374 -22756 186777
17578B5297J40965b15923I6424O5458g6611H4883i3709A93399D8155c9360A74334
17566D91412A05473N6465a6571B05271I1159K82649A63761G0575K66765C7086
17555C55845a53539E2926O5806i7582C26741j07619f563F0102L95716m6451D6387
17543B6517J70662M2694r9449M9208L67565A31439E1680P5458G713N5871J19305
17532A82889r0413d2855A88396L10277j82937j34584P19440j26620Q1564K41303
17522A096839J18947p8295E63436j77078j22007I3071L42393R5012k33517M42093
17512G39052A17523N07992M12949j1315L86197n66839K9553k27563B78794K75033
17502E53827J9055J69555C60238D8651N03515g1828F0724L54257O8527J38697
$$ plain form
17578 25297 166262 -215923 96424 161882 -76611 84883 -93709 193399 48155 -39360 174334
17566 491412 105473 161938 -16571 205271 91159 373808 163761 70575 337340 37086
17555 355845 -153539 52926 118732 -97582 326741 219122 -6563 60102 455818 409367 46387
17543 26517 197179 239873 140424 189632 557197 131439 51680 127138 7713 63584 182889
17532 182889 92476 -42855 188396 498673 315736 181152 900592 773972 855536 1096839
17522 1096839 1215786 1137491 563436 386358 264351 93071 435464 530476 296959 739052
17512 739052 117523 625515 1038464 1027149 1413346 846507 876060 648497 278794 553827
17502 553827 572882 742437 360238 48651 552166 -71828 60724 414981 483508 622205
17492F22205H7211R7690O4338q7745L73054k64446k4288J18678j17416J98012
17482D45088r5813o952o9106P6984j60186J08982R9123A77735J66514r4319J77130
17471D27060G8477a51628B47924A01874M38732C1706g9492F5552J01512j4987
17461A52077K92070j18457J88547k0357J0733A48207M5723J35287J71171P5202
17451E75590G9616J16423K17448R130B4029J63921L16605J24840A37317R1426
17441B28743J89089j71151m706p268L88500k63900O9290r5732j03602R8963C1171
17429E53609k53039P342i1901D38597k11973P6229j48262K2454K26010Q6972r9841
17418C90186M6462A74440o5073L41979R2142A42423J00685j788J19379J12573
$$ plain form
17492 622205 87211 184901 249239 161494 534548 270102 245814 364492 247076 445088
17482 445088 349275 342323 273217 350201 190015 298997 398120 177735 344249 249930 427060
17471 427060 78477 -151628 247924 101874 540606 31706 -79492 65552 167064 152077
17461 152077 444147 325690 514237 493880 504613 148207 193930 329217 500388 575590
17451 575590 79616 196039 413487 422617 24029 187950 504555 629395 137317 228743
17441 228743 417832 246681 241975 234707 623207 359307 428597 332865 229263 328226 31171
17429 553609 300570 307912 -91901 438597 226624 302853 154591 177045 403055 490027 390186
17418 390186 436648 174440 109367 451346 543488 142423 243108 241320 360699 473272
17408D73272n6334B08243K17197n8860e8743A93665q1517R0839a86902C65933
17397B27015J71707b09211A23798a61062A54070J65468p6061m0533I8867K50765
17387C49632A65192K27161J36200E0014L35155R8870j64418J37445j79428q3156
17377A94482J20593O991j00741a36869E263K3169K02163J80071Q1075A42751J6356
17366A59107J7444l8828a05507A87953K44258j59031E3933M10785H1688L47877
17356D29565A18472L23891k12646A14682P6387J07532j8383o9567H1571P3330
17346A54901Q0941J77794a04543H833N98597A80649j8073K42431d5951E66749
17335B57348C6994N0266R8534i5971A59104K11202o823m9484d1482C67469m4389
$$ plain form
17408 473272 416938 208243 425440 366580 -58743 193665 112148 202987 -186902 365933
17397 227015 398722 -209211 123798 -161062 154070 319538 243477 202944 98867 349632
17387 349632 165192 392353 528553 50014 385169 484039 319621 457066 277638 194482
17377 194482 315075 322066 221325 -136869 5263 28432 230595 410666 491741 142751 159107
17366 159107 176551 137723 -105507 187953 432211 273180 53933 464718 81688 429565
17356 429565 118472 442363 229717 114682 191069 298601 280218 210651 81571 154901
17346 154901 235842 413636 -104543 8833 607430 180649 162576 405007 -45951 566749
17335 257348 36994 87260 185794 -95971 159104 370306 363483 313999 -41482 367469 323080
17324C23080j47871J85603K4341A83309J62518K76069A71088J09614J50883j69674
17314B61911q8433K76933j17082M6334n6568A01752L65241B19131J96505B00244
17303C29133J42463A75560n7398K7767D4218J94091A17512J36129K40226c8043
17292A89990m4463K49952A12703K57025G5559J60200K39496k5838j40990J1712
17282C20139J36991J60692f6430C47808j16569k5527K43020l67J99403k23504
17272D24264i8908C4722J80796K04856j97122K71448A94314J70912l7683r8449
17262B29094J9013k2042l8105K43324M0132j43331M9232K0115G7337k9444a00007
17250C90332f2101A92396K90755a5695E5431M11385C8599J06403J91204j20088
$$ plain form
17324 323080 175209 360812 385153 183309 345827 621896 171088 280702 431585 261911
17314 261911 173478 450411 333329 379663 323095 101752 466993 219131 415636 200244
17303 329133 471596 175560 118162 145929 44218 238309 117512 253641 493867 -38043
17292 189990 145527 395479 112703 369728 75559 235759 475255 449417 308427 320139
17282 320139 457130 617822 -66430 347808 231239 205712 448732 448365 647768 424264
17272 424264 -98908 34722 215518 420374 223252 494700 194314 365226 327543 229094
17262 229094 248107 226065 187960 431284 471416 328085 377317 397432 77337 47893 -100007
17250 390332 -62101 192396 483151 -15695 55431 466816 38599 145002 336206 216118
17240B16118j7620J41425L4773j8519J09920A18880J42492M53491K37127l63678
17230E88312O1599A04910M58047A64526J37172j460J66434A43460L32201A77396
17219F71330k70649O2600M8113M2011k01366A56544K77349L4410k26236k3596
17209B18471J28359j33992M64701k09587J52950B42342K72655q6786j50139K0601
17199B98673l6054O8834R1324K3782Q2076K0559J86225l61069R9803j37480J730
17188C38403J9701J02031n9560l1426j24891L39374B35599A15180L68273k02538
17178B80915K11837p4471R4689K0444M0232j62142L36729k13703A91380L51919
17168E43299B45197J01138J36570N4903A54308J92540k3283j4535N06872B70089
$$ plain form
17240 216118 198498 339923 374696 356177 466097 118880 261372 714863 951990 588312
17230 588312 649911 104910 562957 164526 301698 300238 466672 143460 475661 177396
17219 671330 400681 463281 511394 553405 352039 156544 433893 468303 242067 218471
17209 218471 346830 212838 677539 467952 620902 242342 514997 428211 278072 298673
17199 298673 262619 331453 422777 446559 528635 549194 735419 374350 474153 336673 338403
17188 338403 358104 460135 400575 369149 244258 583632 235599 115180 483453 280915
17178 280915 492752 418281 512970 533414 573646 411504 748233 534530 191380 543299
17168 543299 245197 346335 482905 537808 154308 346848 323565 309030 815902 270089
17157G21780B80156R9192L5488L6065K1258J22803k1462j80861J90324k02676
17147C80287J46306j82234M19042j54059k64961p7870K09683N3175L6950P4862
17137F41181j40656j8597J78186A09722N48960k39970j98817K00562o5708L42637
17127F97386M7283r9063j62458r4123L39071J00499k23625m4125l4785J4955K5475
17116E66490K35851J29657D59157J95866j11422j5906K00898K07850k57038l21696
17106C57709l7420K11493k31574L72410n8914m6612J76363j07293l7327J30225
17096G29060j26371B82056K14497J64344l7452F6628M86203k00690K9499J94972
17086E76612N4753j9927N4515O5363k19248L31768l1232J83665o3491D13491L81675
$$ plain form
17157 721780 280156 379348 414836 450901 472159 594962 573500 392639 582963 380287
17147 380287 526593 344359 763401 609342 344381 266511 476194 529369 566319 641181
17137 641181 500525 481928 660114 109722 658682 418712 219895 420457 354749 697386
17127 697386 744669 645606 483148 389025 728096 828595 604970 560845 526060 541015 566490
17116 566490 802341 931998 459157 655023 543601 527695 728593 936443 679405 357709
17106 357709 320289 531782 300208 672618 613704 567092 743455 636162 598835 729060
17096 729060 602689 282056 496553 660897 623445 66628 552831 352141 381640 576612
17086 576612 631365 611438 665953 731316 512068 843836 812604 996269 932778 413491 795166
17075G95166l31752J51875P5813J42673o9462p9563J11643k31829P3675J31633
17065G69872K60662E05314m4653M09091K4475N5340j1914k78812L00140k93007
17055F65974L51329J23193j84397k56166L76865j58615P7787O665P7090j97738
17045H81987J00104J73347l59878M9379L3389J86192K3076k06174J97079C98395
17034H02661J220J00229N2732P0186l65590P13877j14773n53829K89362k26139
17024G69936J09681N17485o49556M26425J02191l05660L08581l37855L35145j32196
17014A144177M9900k5098k8756l0823j13771L3902j43756K55844k34322M79476
17004A386773m30044M59473k63342q0217J35332j31541K17914r4608j017K35562
$$ plain form
17075 795166 463414 615289 691102 833775 764313 684750 796393 564564 638239 769872
17065 769872 1030534 505314 460661 869752 894227 949567 937653 658841 958981 665974
17055 665974 1017303 1140496 956099 699933 1076798 918183 995970 1002635 1079725 881987
17045 881987 982091 1155438 795560 844939 878328 1064520 1087596 881422 1078501 398395
17034 802661 803881 904110 956842 1027028 661438 1375315 1260542 706713 996075 769936
17024 769936 879617 1397102 747546 1173971 1276162 970502 1279083 941228 1276373 1144177
17014 1144177 1194077 1168979 1140223 1109400 995629 1029531 885775 1141619 907297 1386773
17004 1386773 956729 1416202 1152860 1072643 1207975 1076434 1294348 1199740 1198723 1434285
16994A434285O4517k38334k686l17367n7695L59574j48149L57224l66027K95015
16984A380357K65564n19011J16416k10241L83612j32017J7434K7242J30918R2535
16974A552809K46022j47151j99550J96466l10473L42228j54795j16603J09151
16965A518104N4021J36025k08158M7228J25531J15325j62046p7283R7166J81376
16955A827289j63907p6166j55353M03374k60103L92554l1552n16040N49785k28980
16945A740901q7368K77352M66J9834j35309k16538K33944K5409J59006K79932
16935B297629l4828k48293K1188J19050j04866P6876q3068K72022R8468j27495
16925B286683j19327J06440o8247j85258L85345k63336K81254j68538K44965k51315
$$ plain form
16994 1434285 1498802 1260468 1257782 940415 882720 1242294 1094145 1451369 1085342 1380357
16984 1380357 1645921 1126910 1243326 1033085 1416697 1284680 1302114 1329356 1460274 1552809
16974 1552809 1798831 1651680 1452130 1648596 1338123 1680351 1525556 1408953 1518104
16965 1518104 1572125 1708150 1499992 1547220 1672751 1788076 1626030 1548747 1645913 1827289
16955 1827289 1663382 1587216 1431863 1835237 1575134 1967688 1936136 1420096 1969881 1740901
16945 1740901 1653533 1930885 1931351 1951185 1815876 1599338 1833282 1858691 2017697 2297629
16935 2297629 2262801 2014508 2035696 2154746 2049880 2126756 2043688 2315710 2414178 2286683
16925 2286683 2167356 2273796 2205549 2020291 2405636 2142300 2423554 2255016 2499981 2248666
16915B248666J43743L24034j20594j19783K5368j52700J87260J01605K8094m9399
16905B616294P2937j35971q5478m2730L15279L1981L16208k42829J59232l76890
16895B628033L59276R6010M7667j9126Q6059J9831k86476M99571J54819j56767
16885C428897j4486J02920J38005J72259r5968m96826N33695N0829n25416L50887
16875C644796q3990L77077k33371K48058N2807L41060l53701j15652M40150O2066
16865D379300k29110Q5084L33485l16323M73166J62813j63796j54763N06491m02445
16855D673902O93888o04780L06328J34946M6502J52876L15837l60428K60018j03752
16845E515337O5024K79343Q5207K90503k07828L21828j69909Q6858K43344J87642
$$ plain form
16915 2248666 2392409 2716443 2595849 2476066 2501434 2348734 2535994 2637599 2665693 2616294
16905 2616294 2689231 2553260 2467782 2425052 2740331 2772312 3088520 2845691 3004923 2628033
16895 2628033 2987309 3083319 3130986 3111860 3197919 3217750 2931274 3430845 3585664 3428897
16885 3428897 3414411 3517331 3655336 3827595 3731627 3234801 3768496 3819325 3293909 3644796
16875 3644796 3560806 3937883 3704512 3952570 4005377 4346437 3992736 3877084 4317234 4379300
16865 4379300 4150190 4235274 4568759 4252436 4725602 4888415 4724619 4569856 5076347 4673902
16855 4673902 5367790 4763010 5069338 5204284 5250786 5403662 5719499 5359071 5619089 5515337
16845 5515337 5580361 5859704 5944911 6235414 6027586 6349414 6179505 6266363 6509707 6697349
16835F697349J12082k6005k72415N22130L15031k80886P22654k62204k3242N4570
16825G559064J88459N01272q6695L81841l9445K01059K49643K53961K25136r1944
16815I342351K2780L59780J1638L31816M96267L88065j56887L10194J01460l080
16805A1204384O44931O1374N24688K40535J42978L19481L15946k3536Q04978J33171
16795A4368930N11363J91614P54168o2919L02615L31918O10529K4879P59674P23061
16785A8515832K93228L42492O70369L75195Q65732O94294K96180J79251J272200
16776B3504773L27401P04713J041183M69036P27267J122852R32843Q46737P92255
16767C0469060R18775Q02463J624976P31442J320224P45740J585465J393622J266418
$$ plain form
16835 6697349 6809431 6783426 6511011 7033141 7348172 7067286 7789940 7527736 7504494 7559064
16825 7559064 7747523 8248795 8162100 8543941 8504496 8705555 8955198 9209159 9434295 9342351
16815 9342351 9365131 9724911 9736549 10068365 10564632 10952697 10795810 11106004 11207464 11204384
16805 11204384 11849315 11910689 12435377 12675912 12818890 13138371 13454317 13430781 14235759 14368930
16795 14368930 14880293 15071907 15826075 15763156 16065771 16397689 17008218 17033097 17792771 18515832
16785 18515832 18809060 19151552 19821921 20197116 21062848 21757142 22053322 22232573 23504773
16776 23504773 23832174 24536887 25578070 26047106 26774373 27897225 28830068 29676805 30469060
16767 30469060 31387835 32190298 33815274 34546716 35866940 36612680 38198145 39591767 40858185
16758D0858185J489443J598255J253978J090290K111957J947723J903698J571212
16750E3824741K014363J855172J964833K087174K285729K131200K065244K593015
16742G0821471K271849K495946K523266K539589K492858K297508K575881K682445
16734I0700813K264322K245108K228684K184707J914778J804987J440875J834655
16726A06618929J442307M86208J030330L27733N99686m61510k56242n00979p66094
16717A08520368j151298j158057k054364j403366j763411k283174k054137k027926
16709I4624635k975027k330679k665999k459370k518883k189207k498246k959862
16701G4027362k467962k172328k206689k914632j831658k226990j671345k100986
$$ plain form
16758 40858185 42347628 43945883 45199861 46290151 48402108 50349831 52253529 53824741
16750 53824741 55839104 57694276 59659109 61746283 64032012 66163212 68228456 70821471
16742 70821471 73093320 75589266 78112532 80652121 83144979 85442487 88018368 90700813
16734 90700813 92965135 95210243 97438927 99623634 101538412 103343399 104784274 106618929
16726 106618929 108061236 108547444 109577774 109905507 110505193 110043683 109787441 109286462 108520368
16717 108520368 107369070 106211013 104156649 102753283 100989872 98706698 96652561 94624635
16709 94624635 91649608 89318929 86652930 84193560 81674677 79485470 76987224 74027362
16701 74027362 71559400 69387072 67180383 64265751 62434093 60207103 58535758 56434772
16693E6434772k419610j784559j842503j721808j576648j796096j560573j586091
16685D2146884j382691j467821j340384q66645j482840j169200j266664j237357
16677C1933282m90057j192507j108043p63790p31090j163209m94450j114647n52480
16668B4323009q29030q98982p14725l14603m81255r22515m61390o28706m97375
16659A8574428r0044p78544n04819n19154k19936k64827n19807n97358k04963
16650A4874976o63396m7795o92411n5245j51157j44180o35301j72366l23022j54271
16640A1835832n21443p6397l60834J43875m59624n74160R8962l66003j14665j62143
16630I443400k47811j86220j41678j88997l31663n3174j50023l36538J46535N6138
$$ plain form
16693 56434772 54015162 52230603 50388100 48666292 47089644 45293548 43732975 42146884
16685 42146884 40764193 39296372 37955988 37089343 35606503 34437303 33170639 31933282
16677 31933282 31443225 30250718 29142675 28378885 27647795 26484586 25990136 24875489 24323009
16668 24323009 23493979 22594997 21880272 21565669 21084414 20161899 19700509 19071803 18574428
16659 18574428 18484384 17705840 17201021 16681867 16461931 16197104 15677297 15079939 14874976
16650 14874976 14211580 14163785 13471374 13416129 13264972 13120792 12485491 12313125 11990103 11835832
16640 11835832 11314389 11237992 10877158 11021033 10561409 9987249 10086211 9720208 9605543 9443400
16630 9443400 9195589 9009369 8867691 8678694 8347031 8293857 8143834 7807296 7953831 8009969
16620H009969n00684P3608j98217k45675O6307l95544k05258p0179j17509q5474
16610F331344l00883M2357j29495n2435J12321k92969K02223l45005j94600K19357
16600E592215N421k83035O7318l28254J10349j42955k54856k2933k9403J84552
16590D898419Q9619p49180M47298k81791j09340q7584k26289J06968k45635J06291
16580C948776j921j09990N5173j78595K57157l46174J18876m71523O42452o55548
16570C258683j12169M16923k26848K00711n32061K52200j49066Q1901J7897l6257
16560C171914l03634K16084k64421J16568L34670o20590K20719k46283J5473Q5505
16550B726005j46295K65968j41510m64995L83960j66458m7743J38883m04940M46444
$$ plain form
16620 8009969 7509285 7582893 7384676 7139001 7205308 6809764 6604506 6534327 6416818 6331344
16610 6331344 6030461 6072818 5943323 5890888 6003209 5710240 5912463 5567458 5372858 5592215
16600 5592215 5597636 5314601 5381919 5053665 5164014 5021059 4766203 4743270 4713867 4898419
16590 4898419 4988038 4238858 4686156 4404365 4295025 4207441 3981152 4088120 3842485 3948776
16580 3948776 3946855 3836865 3892038 3713443 3970600 3624426 3743302 3271779 3914231 3258683
16570 3258683 3146514 3563437 3336589 3537300 3005239 3257439 3108373 3190274 3208171 3171914
16560 3171914 2868280 3084364 2819943 2936511 3271181 2650591 2871310 2625027 2640500 2726005
16550 2726005 2579710 2845678 2704168 2239173 2623133 2456675 2408932 2547815 2142875 2589319
16540B589319j45264o6710p188R5544O5592p5868m68713J16036j3600J97778r3990
16529B192936r8172P3061J74522k50516L6584j94134M2783L7160L23468n89470
16519A748222L69398m27909J08381k66284L22439K4967j25443J08523k70281K1853
16509A613866j07501L54356m45763M15531k75658J83779m72181L92272J38136
16500A796837k78154J04688k87730L94275l82494l8931O3527k4171L31905m91015
16490A188737L4703J98563j12828J98558j23839K4007r563j49364K08231n3668
16480A403537K53268m78335J44966K91462k72117O2902n06816O18545j52606J19150
16470A483956r0214l72401M30552l01633L09020m38292K28649j04313N966j87724
$$ plain form
16540 2589319 2444055 2377345 2370157 2465701 2531293 2455425 1986712 2102748 2089148 2286926 2192936
16529 2192936 2094764 2167825 2342347 2091831 2128415 1934281 1977064 2014224 2337692 1748222
16519 1748222 2117620 1689711 1798092 1531808 1854247 1879214 1753771 1862294 1592013 1613866
16509 1613866 1506365 1860721 1414958 1830489 1554831 1738610 1266429 1658701 1796837
16500 1796837 1518683 1623371 1335641 1729916 1347422 1308491 1372018 1347847 1679752 1188737
16490 1188737 1223440 1422003 1309175 1507733 1383894 1407901 1398338 1248974 1457205 1403537
16480 1403537 1656805 1178470 1323436 1614898 1342781 1405683 898867 1517412 1364806 1483956
16470 1483956 1393742 1021341 1451893 1150260 1459280 1020988 1249637 1145324 1151290 963566
16460I63566J20954P3082R3468l0502J93913o55222K00950K77920l55972J06222
16450I88379J59957p9825j7780j48672K00615j10923L0722j6446j97672L16702
16440A125057r6436j92761Q2145J22952J72957l00823Q5254Q6082j60857j16906
16430H06664j70077K15195J73118K102k36328k28705N08385n03393L69718m5530
16420H91149J50350j96760J88106l84163J84724j41059k2225o0697J05612L05761
16410A020798m43505L10275k6023J98004j73408r4724k98644K08249k71548O4374
16400D93848N34220m93449K08011j09049o7118J00051K45401o4347j56693K30564
16390I21439l07288K90525k24509R8275j49219k23620K80400k70090K25813l0395
$$ plain form
16460 963566 1084520 1157602 1251070 1220568 1414481 759259 960209 1238129 882157 988379
16450 988379 1148336 1068511 1050731 902059 1102674 991751 1022473 1006027 808355 1125057
16440 1125057 1028621 835860 918005 1040957 1213914 913091 998345 1084427 923570 806664
16430 806664 636587 851782 1024900 1027002 790674 561969 1070354 566961 936679 891149
16420 891149 1041499 844739 1032845 648682 833406 692347 670122 609425 715037 1020798
16410 1020798 577293 887568 861545 1059549 886141 791417 492773 701022 429474 493848
16400 493848 1028068 534619 742630 633581 566463 666514 911915 847568 690875 921439
16390 921439 614151 904676 680167 778442 629223 405603 686003 415913 641726 611331
16380F11331K53008j38616B88649J73711J18162B29230J96617J37424m9529J44492
16370F58234k622j95254J00235Q4510L07261l72232j7644k22523J41589J88665
16360F70219M3338l40296m0807L01895l228k16159r761L8477M0684A17134K90377
16349D07511J09173j10349J8224K05993n9458k15908L84018A14738L35549l5667
16339D14620j2288j61031p8091K78277K00644r4212k46358K10703p8030L4692
16329D68926r8893L28904j90291k24836N37478C48441K82826j56673j54801L18777
16319F38570j46317j05698R096Q612K34482K7645C16489K56963H6588L25467N9249
16308D71304M4839H0975L48241P1722B47310Q1764J71144J50762B68847A27174
$$ plain form
16380 611331 864339 725723 288649 462360 580522 229230 425847 563271 513742 658234
16370 658234 655612 460358 560593 645103 952364 580132 562488 339965 481554 670219
16360 670219 713557 373261 332454 634349 631121 414962 405201 443678 484362 117134 407511
16349 407511 516684 406335 424559 630552 571094 355186 739204 114738 450287 414620
16339 414620 402332 241301 163210 441487 642131 547919 301561 512264 434234 468926
16329 468926 370033 698937 508646 283810 821288 348441 631267 474594 319793 638570
16319 638570 492253 386555 395651 404263 638745 666390 316489 573452 86588 412055 471304
16308 471304 516143 80975 429216 500938 247310 329074 500218 650980 268847 127174
16297C38671M6949F4373K50022k0521m4627k8516d31B54122A19009L64685J98194
16286F81888j66752p6787j00416K57075B46213J59600j17683M7414j04662L87283
16276F18165l05019A8149P03693B63182K26281A88641P0887q8220J94168k2927
16266C42549A6565K62840J54393K6609M72k08977J49198A44524E9487K16273H6365
16254C67274j37885c2629C46145A70729F4837K28950q2655L42854B70578m8995
16244B21583q2224B2994L72323o1317n1421A15810L20613A89815K21383j51768
16234B59430H438L23097A36013K18873j46022B9929l090K69917k1789l1780r0371
16223A52816K35956A81945g0593B65584E1289J0198L48444f7451C93095j18585
$$ plain form
16297 338671 385620 64373 314395 293874 249247 220731 -431 254122 119009 483694 681888
16286 681888 515136 438349 337933 595008 246213 405813 288130 335544 230882 618165
16276 618165 313146 18149 721842 263182 489463 188641 259528 171308 365476 342549
16266 342549 16565 279405 433798 460407 460879 251902 401100 144524 59487 275760 86365
16254 367274 229389 -32629 346145 170729 64837 293787 211132 553986 270578 221583
16244 221583 139359 22994 395317 334000 282579 115810 436423 189815 411198 259430
16234 259430 8438 331535 136013 354886 208864 29929 26839 296756 274967 243187 152816
16223 152816 388772 181945 -70593 265584 51289 61487 409931 -67451 393095 274510
16213B74510M1934J60273f3334A44109J24415K9202j33563J40203h52A05488l3058
16202G2430l1843L77071j28599a6053n9927B68123K54512a13606A15545M85570
16192F01115B22095O1169o5323P190J58837A17350n0567L8495N7988K92172j31202
16181C24236b78152B84299a27144C7195d384C99174I9075P2190l2782J39686F2404
16169i1296B02613j9884b6140D96224j55645F3789f5019B24506A02671L3393b5739
16157B44873C7689Q299a5145H6043J53475h7344K1226A07743a9050p1621B48959
16145B2083a19261b1050A87833o0885d9147E0856f6883j59278H8170g2579D17501
16133B10317H0617K41004O4807O10N733H464a0606C40839A24573d3383C32907
$$ plain form
16213 274510 316444 476717 -63334 144109 268524 297726 164163 304366 -852 105488 72430
16202 72430 40587 417658 289059 -16053 -75980 268123 522635 -113606 115545 601115
16192 601115 222095 283264 217941 225131 383968 117350 66783 105278 163266 455438 324236
16181 324236 -278152 284299 -127144 37195 -4384 399174 99075 171265 138483 278169 62404
16169 -91296 202613 182729 -26140 496224 340579 63789 -65019 224506 102671 136064 -25739
16157 244873 37689 45988 -15145 86043 239518 -87344 -66118 107743 -19050 -90671 248959
16145 22083 -119261 -21050 187833 126948 -49147 50856 -66883 -226161 88170 -72579 417501
16133 210317 80617 321621 386428 387038 392771 8464 -10606 340839 124573 -43383 332907
16121A60767K1900q4488b5165A02124j0100p275a21511C13942a93485b773A51422
16109C78659a73488d339C16129J01350B3150K44991j03979K7142K64096H8041
16098C51715c9634k74778O8324N5310j03303A77139d6828C34795A38195a64735
16087B29035k1835a05487j31369A32061a86598B07754f9963A64767j0381l5755
16077A18631f1863q5316b553j52283G3780m092P2888P9628J29844a18356H9994
16065A24447c23098G9214J20816k8287C5810N3945m3090f620A04576P4765a93349
16053C45965G3329J04636C5424J01798R1487P3829r7180M3607I253a08734K5609
16042h3125j80061C6558M2725P1326J90232c59195A97214H957K53792f5272g596
$$ plain form
16121 160767 182667 98179 -25165 102124 92024 84749 -121511 313942 -193485 -2773 151422
16109 378659 -173488 -4339 316129 417479 23150 268141 164162 191304 455400 88041
16098 351715 -39634 -314412 -246088 -190778 -294081 177139 -46828 334795 138195 -164735
16087 229035 207200 -105487 -236856 132061 -186598 207754 -69963 164767 154386 118631
16077 118631 -61863 -147179 -2553 -154836 73780 69688 142576 222204 352048 -118356 89994
16065 124447 -323098 79214 200030 171743 35810 89755 46665 -6620 104576 179341 -193349
16053 345965 73329 177965 35424 137222 228709 302538 205358 248965 9253 -108734 -83125
16042 -83125 -263186 36558 79283 150609 340841 -359195 197214 8957 262749 -65272 -7596
16030a54766C95017A5925M9341c8397a2850j19140B7750L26160B2445P8174A0231
16018B03116b70310A14947C2511J78200B1885b4958A91074a55737P1959j65459
16008b49237A41226D662J31931l072L71515A19648n5573K95064F1553k6995C620
15996E4584J7208l158a41327k70952b4409I8306L19399C3720K33540J37097N5604
15985D59961P45773R8536O7546o2149l54830l20023q6553A69727o5225h8148A07094
15973A77372a81117P1824d1441k601B65015C8852n36K83817J227l0512I4945a06317
15960A51083e2614I2228B7807g5721j1061m559A71826f6941r2025H2641D5K29962
15948B30007d0414l31734E6645e5260p2828G6273a97243G1935c011j52308E6873
$$ plain form
16030 -154766 395017 15925 65266 -38397 -12850 -131990 27750 353910 22445 100619 10231
16018 203116 -270310 114947 32511 210711 21885 -24958 191074 -155737 -83778 -249237
16008 -249237 141226 4662 136593 133521 505036 119648 64075 359139 61553 34558 3620
15996 54584 71792 68634 -141327 -412279 -24409 98306 417705 33720 267260 404357 459961
15985 459961 1205734 1304270 1371816 1309667 954837 634814 548261 169727 104502 -88148 107094
15973 177372 -181117 -109293 -41441 -44042 265015 38852 38316 322133 323360 292848 94945 -106317
15960 151083 -52614 92228 27807 -75721 -86782 -91341 171826 -66941 -158966 82641 45 230007
15948 230007 -40414 -372148 56645 -55260 -128088 76273 -197243 71935 -3011 -155319 56873
15936B06013D0721j0335b12721p8877P6654f4759B06393c9886A8829c5725A7471
15924a66900C2359c2685E1120a92888A13022c66963A8281N2284P5118h9257j1607
15913a00864I4794c8115P608o8427b0788P872o4217K9452B03351D7824f5820A34554
15900a18751e6687k94243A3147f5740K4578l184m2607J8910p6130A57566D0260
15888B87316e8575j26264A39076l027b56562G4375a02815j59357a15122B59257
15877i5239B44056H0441a52597j06157I3091e04B43009B081N2820c26169A10096
15865a51488e6322j8836q7411J8434B996K14061g4286j89901B92794j35029g4173
15853B89684f6451p3438L2600H620d27261i3795C2202b02847F7161J952B1933
$$ plain form
15936 206013 40721 30386 -212721 -291598 -214944 -64759 206393 -39886 18829 -35725 17471
15924 -166900 32359 -32685 51120 -192888 113022 -366963 18281 70565 145683 -89257 -100864
15913 -100864 94794 -38115 -30507 -98934 -20788 -12916 -77133 -47681 203351 47824 -65820 134554
15900 -118751 -56687 -350930 13147 -65740 -41162 -44346 -86953 -68043 -144173 157566 40260
15888 287316 -58575 -184839 139076 136049 -256562 74375 -102815 -262172 -115122 259257
15877 -95239 244056 80441 -152597 -258754 93091 -504 243009 2081 54901 -326169 110096
15865 -151488 -56322 -75158 -162569 -144135 2996 217057 -74286 -264187 292794 157765 -74173
15853 289684 -66451 -139889 -107289 8620 -427261 -93795 32202 -202847 67161 69113 21933
15841A00348B1849b24831A4612a13680B11299r9352a55732B48805G4907M1657
15831A16564K76509a31590C0593J01129b17039k6748A76385N2257g3173j1646
15821h4819j87614N9361f90A30301c44007D2382K538e9148m21568a16118n7460
15810a73578l8386j22841J32812F1592J5193L8894b09857A66056a24915k45626
15800c70541A94353M710a00504o9759l1978j59843A61243a79050A5642K9258J14017
15789A58917K48269D259a4378A50498e9275m877A31802a5503A36153F6527d4734
15777H0957a10794M5725n13262a82l29760A67104f1253O060j79594a04233B29912
15765I8728c35039A63123a1264I0466a54519C89026q8603j04054b03365c1135
$$ plain form
15841 100348 21849 -224831 14612 -113680 211299 111947 -155732 248805 74907 116564
15831 116564 393073 -131590 30593 131722 -217039 -243787 176385 228642 -73173 -84819
15821 -84819 -272433 -213072 -690 130301 -344007 42382 44920 -59148 -480716 -116118 -173578
15810 -173578 -211964 -334805 -201993 61592 76785 115679 -209857 166056 -124915 -370541
15800 -370541 194353 199063 -100504 -170263 -202241 -362084 161243 -179050 15642 44900 158917
15789 158917 407186 4259 -14378 150498 -59275 -64152 131802 -15503 136153 66527 -44734
15777 80957 -110794 -65069 -578331 -182 -329942 167104 -61253 -55193 -234787 -104233 229912
15765 98728 -335039 163123 -11264 90466 -154519 389026 300423 196369 -203365 -31135
15754a71513A50997P8654R0831a0215k57678B21965b31809B48658A9417N0648
15744G0065a14035a9008A33324m1471c07243a06688n3415j397A27828E6922a53223
15732A83871f1299k81723A38044Q5686r2766a79214C0200a0219F7053J2441b2133
15720a72497r0149f2787A79508p5617H124b4848j0066c275r0956A2595b58322
15708I6526b62638b6399l37134M4266E2071c8261A01012a37375D3916a75309e4410
15696A22850c78910c3104j7536I886d17873D70572k19408e2774A90085m1192M07914
15685E56807f7103G9002a47147B06577G6503c3605A28562M1246o1499R7249B6446
15673e0041j7308H5959C5917e2758o501j79634A25530a08807j98398D55976I947
$$ plain form
15754 -171513 150997 229651 320482 -10215 -267893 221965 -231809 248658 19417 70065
15744 70065 -114035 -19008 133324 91853 -307243 -106688 -160103 -161500 127828 56922 -153223
15732 183871 -61299 -343022 138044 223730 130964 -179214 30200 -10219 67053 79494 -22133
15720 -172497 -262646 -62787 179508 103891 8124 -24848 -34914 -3275 -94231 12595 -258322
15708 96526 -262638 -26399 -363533 -319267 52071 -38261 101012 -137375 43916 -175309 -54410
15696 122850 -378910 -33104 -50640 9886 -417873 470572 251164 -52774 190085 148893 556807
15685 556807 -67103 79002 -147147 206577 76503 -33605 128562 169808 108309 205558 26446
15673 -50041 -67349 85959 35917 -52758 -59259 -238893 125530 -108807 -307205 455976 9947
15661g1487C9714J97264B1913f0354C65881G9028c49252P7360A15280L9343M0894
15650A95517a24586A71507f7634B13866a96192B01869q2045J15908d4282j53705
15640a97987B0153i8315B56645d51697a60130N2799k63918J09214F9196b25977
15629a76873k62009J72038F0337a50699B5925a21770m1999B16731a05656B77903
15618f2669K7257C9065i7897D8168J31586a95378E4120b15792r768N7329D6502
15606I0740Q2807e9737k60161M9628B2629a9980j04413Q078b4537k7635A2973
15594A6808N1542C0629R5812b27934A19388n6759a55178P7318A22372c56236i263
15582b8558A63168a01623A0730q18M3222b3382i215A33401J0328a96241G2042
$$ plain form
15661 -71487 39714 236978 21913 -60354 365881 79028 -349252 -271892 115280 154623 195517
15650 195517 -124586 171507 -67634 213866 -196192 201869 119824 235732 -44282 -197987
15640 -197987 20153 -98315 256645 -451697 -160130 -107331 -371249 -262035 69196 -225977
15629 -176873 -438882 -266844 60337 -150699 25925 -121770 -163769 216731 -105656 277903
15618 -62669 -35412 39065 -97897 48168 179754 -195378 54120 -215792 -225560 -168231 46502
15606 90740 173547 -59737 -319898 -270270 22629 -19980 -124393 -116315 -24537 -52172 12973
15594 16808 68350 30629 126441 -227934 119388 62629 -155178 -77860 122372 -356236 -9263
15582 -28558 163168 -101623 10730 9912 53134 -23382 -9215 133401 143729 -196241 72042
15570a09613D43544a07389j94532g742k29025h3222b1323p2517A06467a53930
15559f4044A19805c49689A38407c3521k11603C5624R4012e0302m13236f3302k23379
15548b86681a05934A14944b27557A8625J14754K80258A13437N5577C0758f1086
15537E2066g8870D9796K6405D033P0687O474O3645P1168O1496A08912L4292M7352
15525A90556O6253g1021B88642J9582A20018l785N3420Q0676A2341K07487R7346
15514C17174A49261B4586K81385I2529O1773A8144K4343O1420D8454J32965C1685
15502C41733E8014J31841R9707J03751J5572C1794O4021J1538K2973K94274j03798
15491C20802I685K57420A24211K11359h0576A46909P5809n704M986j03200b7736
$$ plain form
15570 -109613 443544 -107389 -301921 -7742 -236767 -83222 -21323 -93840 106467 -153930
15559 -64044 119805 -349689 138407 -33521 -245124 35624 129636 -50302 -463538 -63302 -286681
15548 -286681 -105934 114944 -227557 18625 133379 413637 113437 169014 30758 -61086
15537 52066 -78870 49796 76201 4033 74720 81194 144839 216007 277503 108912 143204 190556
15525 190556 256809 -71021 288642 308224 120018 116233 169653 250329 12341 219828 317174
15514 317174 149261 24586 305971 92529 154302 18144 42487 103907 48454 181419 31685
15502 341733 58014 189855 289562 393313 408885 31794 95815 107353 130326 424600 320802
15491 320802 9685 267105 124211 335570 -80576 146909 222718 217014 222000 118800 -27736
15479A23332i424C44866A68512L237J47877A56322N54393J45960k90045j69113
15469C97517A73107K3250r7651c5183A51056d21457J60148l5669A38022M7122
15459A85144G9858L9868i0180l11292a16049O89B58334j03846b5503D9062A0291
15447a16577D59257a5465D2795K43140A33067N48293M4659N62538q7529j96257
15437A004771D20651j56120r0890m9917b7973l9819B82830q3314c90539g4940
15426H7774a42500D164J95013b832j40039f6739D5362M7435r771c1023m38A28346
15413H6472g3987A31623a25441o1419j342I2555a05799A11082a07500j95039h2349
15401C5320a38753A05109d2041A09150n2152M4399J9000b44435h3240A32263J0785
$$ plain form
15479 123332 -9424 344866 168512 171749 319626 156322 710715 856675 566630 397517
15469 397517 173107 196357 98706 -35183 151056 -421457 -261309 -296978 138022 185144
15459 185144 79858 119726 -90180 -401472 -116049 -115360 258334 154488 -25503 49062 10291
15447 -116577 459257 -15465 42795 285935 133067 681360 726019 1288557 1201028 1004771
15437 1004771 420651 264531 173641 123724 -27973 -67792 282830 199516 -390539 -74940
15426 87774 -142500 4164 199177 -2832 -142871 -66739 45362 92797 83026 -31023 -31461 128346
15413 86472 -73987 131623 -125441 -186860 -188202 92555 -105799 111082 -107500 -302539 -82349
15401 35320 -138753 105109 -42041 109150 56998 101397 120397 -244435 -83240 132263 143048
15390A43048J23348D1851e781B97999N7942j77182o2304R5546Q0672b82365d4144
15378B5135i7039E4307B3876M750K08214p80p3591a20338B02532q1024R2834C1130
15365C4986N2647m1580B1158J02248i2256j0926D28278A40042J09004L39981H0148
15353a75301A84854a33528L0977D0129c4082A5452J70407p3876N2576L17937B35857
15341A17718M17624B23632K37793h7788l3114A05278N8935J08235a0933C8814
15330A30824E2096j959h1753C13856H9468A4985a61925a6663B37381l2589K91682
15319D96474b04270C06134H1590P8568R393F2367J66824g0676B04025k8590L8812
15308B14247a50699C08978q6161L6156c1887A57221b06312k4003F8473K96161
$$ plain form
15390 143048 266396 41851 -5781 297999 355941 178759 116455 212001 292673 -282365 -44144
15378 25135 -97039 54307 23876 28626 236840 236060 162469 -120338 202532 121508 214342 31130
15365 34986 87633 46053 21158 123406 -92256 -103182 428278 140042 249046 589027 80148
15353 -175301 184854 -133528 -102551 40129 -34082 15452 185859 111983 164559 482496 235857
15341 117718 535342 223632 461425 -87788 -120902 105278 164213 272448 -10933 38814
15330 130824 52096 50137 -81753 313856 89468 14985 -161925 -16663 237381 204792 496474
15319 496474 -204270 306134 81590 160158 169551 62367 229191 -70676 204025 175435 214247
15308 214247 -150699 308978 222817 258973 -31887 157221 -206312 -230315 68473 364634
15298C64634b17142D69297b70682A95756a79898B51477A19005J54949a11009b6107
15287A7985J50299E9361c7734A16090f7026B42788b10245c0778j39846O9491B23168
15275a32292P681I8475J79557O0373A14094h6780K8836A07675d19811f1892G144
15263b534j05163G3235J76179p7164E9866K94222a13211B95292K6244m4380G6007
15251A25028e2276A1919L8065c07335E19600p8193b06950Q0670f0208G18505J280953
15240A999458o96801M25633p5194D98937A54337K68731a5950B69879A05051k629
15230A02422B4652J43359m1879J33058i0103k2101B02027p0433b2319B3187K31918
15219B55105q8880d2641A00003C5805R9012b06372A92750O5731J40859A69591
$$ plain form
15298 364634 -217142 469297 -270682 195756 -179898 251477 119005 273954 -111009 -26107
15287 17985 168284 59361 -37734 116090 -67026 242788 -210245 -30778 -170624 -101133 223168
15275 -132292 -124611 98475 278032 338405 114094 -86780 -57944 107675 -419811 -61892 7144
15263 -2534 -107697 73235 249414 172250 59866 354088 -113211 295292 321536 277156 76007
15251 125028 -52276 11919 49984 -307335 519600 441407 -206950 -126280 -60208 718505 1999458
15240 1999458 1302657 1728290 1653096 498937 154337 423068 -15950 269879 105051 102422
15230 102422 24652 168011 126132 259190 -90103 -112204 202027 131594 -22319 23187 255105
15219 255105 166225 -42641 100003 35805 134817 -206372 192750 258481 399340 169591
15208A49359A8683K43022c2241I622d2394C85845f8693b2811B52939b86946f9543
15196A27301J03887j244B8675J10813J3239F2651a46990j97236B59277E573J89924
15185A95497m0007b35233b3819C06790P0626A32803K01526f2730r9773A52145
15174A0644R2673b3411g442B75587D1639K08477b9936p864B7176M4402L6240b37410
15161g9908a6477m1120G5181K05822b22968D8555j6584K09510J46289g0506A72581
15149g353I0530L68449b06524E0589h8432A48248D2365M0704g9402A14988a56262
15137b27889A19524B9286K15244e2806C99133b2399k22698B06423G4594J50961
15127B25555K12453A32204L9843K21827A8241J76194j3046K49448O1044j88144
$$ plain form
15208 149359 18683 261705 -32241 9622 -42394 385845 -68693 -22811 252939 -286946 -69543
15196 127301 231188 229944 28675 139488 152727 62651 -146990 -344226 259277 5573 195497
15185 195497 155490 -235233 -23819 306790 377416 132803 334329 -62730 -162503 152145
15174 10644 103317 -23411 -7442 275587 41639 250116 -29936 -37800 27176 71578 107818 -237410
15161 -79908 -16477 -57597 75181 281003 -222968 48555 31971 241481 387770 -70506 172581
15149 -7353 90530 458979 -206524 50589 -88432 148248 42365 83069 -79402 114988 -156262
15137 -227889 119524 29286 244530 -52806 399133 -22399 -245097 206423 74594 225555
15127 225555 438008 132204 172047 393874 18241 194435 181389 430837 491881 303737
15117C03737P0558g3520D74698k08140g5108B51627I1741O3366A4660b5572A27586
15105e8740I2788a17516B76678J12614D1304B0169d8857J0988D42253j48202I9337
15093c0543l04724G1103M61319a88763C48413j07180j19750l432i5767j02553
15083a98320A51856R4275a63126C4300R7004N8314o9810a48314D0487b00838C38711
15071a05726A91824g9808a7159C96815a22038A76658A5435L1654a45543E584L49660
15060C55244A16831J08445H1889K38134A04979l7622J89133J60751A22349m2278
15050H0071J33675J57812k3523J3997K51123j35599q7804J82754B20315K55786
15040D76101j81155k2321K24340E2923L09836A49505D0251L52440J85365j94292
$$ plain form
15117 303737 374295 -73520 474698 266558 -75108 251627 91741 155107 14660 -25572 127586
15105 -58740 92788 -117516 276678 389292 41304 20169 -48857 -37869 442253 294051 99337
15093 -30543 -335267 71103 532422 -188763 348413 241233 121483 118051 -95767 -198320
15083 -198320 151856 246131 -163126 34300 131304 189618 119808 -148314 40487 -200838 338711
15071 -105726 191824 -79808 -17159 396815 -122038 176658 15435 47089 -145543 5584 355244
15060 355244 116831 225276 81889 320023 104979 67357 256490 417241 122349 80071
15050 80071 213746 371558 348035 362032 613155 477556 389752 572506 220315 476101
15040 476101 294946 272625 496965 52923 362759 149505 40251 392691 578056 383764
15030C83764J49748k46533L90083j07893k09921L04308p6322j16517Q6511m302
15020E52926j28933K73666k83429M2022H7171M5120N3855K04427O0412A30859
15009D71890j53174n5677N3698P4632A36864n0600J14529J78159j63967J23528
14999C38513K34597n7184J0564o7123j59968e9978E67061A86287n4860L12196
14989D43623j01754J62620K58365k57187n7620P2538j95523N16569M3794j27227
14979G58198J06388l27443o7778j61452p5158L01727m4658O8276K78372m04575
14969D31897K81729l04819J11035B30790K20505l2502j2205j92599F4577K35763
14959C00340k1096k8979M26267k74510F4011E660N73363m3444A83775J19952Q326
$$ plain form
15030 383764 533512 286979 677062 569169 359248 663556 587234 470717 557228 552926
15020 552926 423993 697659 414230 456252 87171 132291 186146 390573 450985 130859
15009 471890 318716 263039 316737 391369 136864 86264 200793 378952 214985 338513
14999 338513 573110 515926 526490 459367 299399 -59978 567061 186287 131427 443623
14989 443623 341869 504489 762854 505667 448047 520585 325062 841631 885425 758198
14979 758198 864586 537143 469365 307913 232755 534482 489824 558100 836472 431897
14969 431897 713626 408807 519842 230790 451295 418793 406588 213989 64577 300340
14959 300340 279244 250265 676532 402022 64011 5660 579023 535579 183775 303727 312053
14948C12053J19425J68013B03764J58716A44501N00647l00082K0783j71149L77704
14938E72404j28256d8285F13352k93004K16766k43618O21616k24798J48112P1012
14928I09438K32178O655m53401N72470L60012l19408J56022j31203k03445K43951
14918A373269M96034J58867K81446j70235l22542l58996m61914q8110j48302R0486
14908H50003D17681L63857A55466K22697L01459j90721n9979k05918J33453J8296
14898C74753J46532F028b827B23291I2644M52308l3581k4887Q7622F6720K72339
14887C39059K01208j1223K28334k33220R705M39125k20295J02301k33679K73722
14877H95037j98539j93895j02306K36310q3063J45409k26166k0875G3446L04435
$$ plain form
14948 312053 431478 599491 203764 362480 144501 645148 345066 365849 194700 572404
14938 572404 444148 -48285 613352 320348 537114 293496 915112 690314 838426 909438
14928 909438 1141616 1148271 694870 1267340 1627352 1307944 1463966 1332763 1129318 1373269
14918 1373269 1869303 2028170 2309616 2139381 1816839 1457843 995929 907819 759517 850003
14908 850003 417681 781538 155466 378163 679622 488901 428922 223004 356457 374753
14898 374753 521285 6028 -2827 223291 92644 544952 511371 486484 574106 66720 339059
14887 339059 540267 529044 757378 524158 533863 972988 752693 854994 621315 895037
14877 895037 696498 502603 400297 636607 553544 698953 472787 451912 73446 377881
14867C77881L34607m1522J51902L2352l16467J57773j35181k64079j15463L84981
14857E66784j41933l685M5495j33596J36130J2756j09783J01967K15280l6792
14847F52623j70286J64384L92968m32443L16960L52392n2290j89831n3605j95203
14837G85669k08232Q3180J88897L08118B94108l7328K72749Q1335k14962J6913
14827D12815K60167J15718C52706J63349J4488J08571P3718j42268K03138l86174
14817C87528K30615p8625J11248J27319j68086o0255M0490q4729J11897K90487
14807I07889D04629M93246j8308M2288j8359j49727k88993n6616K60137n5970
14797F12327I4169K39750N4002P15J73606Q5576j16330n0941J5772R6374H6224
$$ plain form
14867 377881 712488 670966 822868 855220 538753 696526 561345 297266 181803 566784
14857 566784 424851 421166 466661 333065 469195 481951 372168 474135 689415 652623
14847 652623 482337 646721 1039689 607246 924206 1276598 1224308 1034477 980872 785669
14837 785669 577437 660617 849514 1157632 294108 256780 529529 610864 395902 412815
14827 412815 672982 788700 352706 516055 530543 639114 712832 570564 773702 387528
14817 387528 618143 539518 650766 778085 609999 549744 590234 505505 617402 907889
14807 907889 404629 897875 879567 921855 903496 753769 464776 408160 668297 612327
14797 612327 94169 333919 387921 388636 562242 647818 531488 480547 496319 592693 86224
14785D15193L37244C28426M20859q0556K78823j4734m16512j60203M17411J04470
14775H77984K47415l51276q9250k86119N2954J62670P1216j20663r0121Q0873
14765E55683P507j92043j03082L77400K60862j48846j90502Q3656m1753O7986
14755F76868l01780M13304l36372K27149j66661J68595J60711j49583q5461J1014
14745F17784l7431L1318K22873j35420J9945L1860J56559j74989j22154J71366
14735G81711C87407K38615L1611J72628k4366J47711M87800K39277J67831M6097
14725A894611k84952l79007r1572j35295L90911o44992R68J22303K68281E40441
14714G44887K03500k24889L57890O26k15212j06717N24311j00956m78946K21483
$$ plain form
14785 415193 752437 328426 749285 668729 947552 932818 516306 356103 773514 877984
14775 877984 1125399 774123 684873 398754 451708 614378 685594 564931 474810 555683
14765 555683 563190 371147 268065 645465 906327 757481 566979 650635 608882 676868
14755 676868 375088 788392 452020 679169 512508 681103 841814 692231 606770 617784
14745 617784 580353 611671 834544 699124 719069 750929 907488 732499 610345 781711
14735 781711 387407 626022 657633 830261 805895 953606 1441406 1680683 1848514 1894611
14725 1894611 1609659 1230652 1139080 1003785 1394696 749704 750672 872975 1141256 540441
14714 744887 948387 723498 1081388 1082014 866802 760085 1284396 1183440 704494 925977
14704I25977K81983J60020J38637J3903K13201k84616j06390l47816Q3792l84394
14694F94297J72886n7589Q3245p2962j48898k66048L85699k8500M2842L9505j06315
14683G38162O9257J661K90480D69152M45164J6536p6966j01976R6452k54966J25739
14672G19135J34532l45742L03824J91442j29490k5101N6957J83812j14451n019
14662I69899J88726j84372L5351l0957k2147J79890k12452J99322j64677O61838
14652A620421n06097L41900m31510k56410N91142l75862K79774k24745l05495
14643G33118L98766j92j13862n0532P3910J26858j66586K70570j10240P8425l24428
14632I15807K70398n0085k18668J62777J68738r9340K11474j55197R8950p9693
$$ plain form
14704 925977 1207960 1367980 1506617 1520520 1733721 1449105 1342715 994899 1078691 694297
14694 694297 867183 809594 892839 819877 670979 404931 790630 762130 804972 844477 738162
14683 738162 807419 809080 1099560 469152 914316 930852 853886 751910 848362 593396 719135
14672 719135 853667 507925 811749 1003191 873701 848600 905557 1089369 974918 969899
14662 969899 1158625 974253 1009604 978647 956500 1136390 923938 1123260 958583 1620421
14652 1620421 1114324 1456224 1024714 768304 1359446 983584 1263358 1038613 733118
14643 733118 1131884 1131692 1017830 967298 1041208 1168066 1001480 1272050 1161810 1240235 915807
14632 915807 1186205 1136120 917452 1080229 1248967 1149627 1361101 1205904 1304854 1225161
14622A225161E33815Q89429j4166j89027j21546Q3280J03641R3067j59146l34638
14612H84709L59168J68911l6618l10870L30375K6728L8690j2463l00331J84308
14602A332607N7422K03377l30918M27659j29021m3966k84071j99877P44515m32858
14592A344869J57425J54255l1977J93880q487J8600k22156L56432k85143l58554
14582A319144N52118m85173K89498L62463m78787J64950M64782m46569K21578
14573A964004l75246j1896Q3194K79199j38924M05505Q8811m71044M72474Q910
14563B304987m38713P91353m61674r3558M06234L22185l39775L73921j23394M59030
14553C200596m1421r661P64212P69660J303383K400113P155014J7377440J8570057
$$ plain form
14622 1225161 533815 1423244 1409078 1220051 1098505 1181785 1285426 1378493 1219347 884709
14612 884709 1243877 1412788 1376170 1065300 1395675 1422403 1461093 1448630 1148299 1332607
14602 1332607 1390029 1593406 1262488 1690147 1561126 1517160 1233089 1033212 1777727 1344869
14592 1344869 1502294 1656549 1624572 1818452 1809965 1828565 1606409 1962841 1677698 1319144
14582 1319144 1871262 1386089 1675587 2038050 1559263 1724213 2188995 1742426 1964004
14573 1964004 1588758 1576862 1660056 1939255 1800331 2205836 2294647 1823603 2296077 2304987
14563 2304987 1866274 2657627 2195953 2102395 2508629 2830814 2491039 2864960 2741566 3200596
14553 3200596 3159175 3149514 3913726 4683386 5986769 8386882 15541896 32919336 51489393
14544E1489393B1412537H478534l912410j456232o56609Q3235K31321J844316
14536D612155l82122j889720l02588r3811L5937k09249P5997K79723R3376l51996
14526A867702J47476k37705K44162J63703P7964K60360j69097M6954q2344P7409
14516B396584k2627P097L53275k36024J29472m9925K11083k53425J929J59310
14506B696749j68143Q7447J7907K15837J4825k00813J41225J17516j45846M4075
14496B820779K65330j07119n7197J45795O8764J5890k66359K83771j13096Q9898
14486C146456L81409m8664j65307J7244J21949J97488K37938m03001L61961n08420
14476C339053L59950L63532j59936l71009K06741Q3915l45073L72106j12425M54632
$$ plain form
14544 51489393 21412537 8478534 4566124 3109892 2453283 2536518 2767839 4612155
14536 4612155 4230033 2340313 2037725 1943914 1979851 1770602 1846599 2126322 2219698 1867702
14526 1867702 2015178 1777473 2021635 2185338 2263302 2523662 2354565 2401519 2319175 2396584
14516 2396584 2373957 2381054 2734329 2498305 2627777 2577852 2788935 2535510 2537439 2696749
14506 2696749 2528606 2616053 2633960 2849797 2864622 2663809 2805034 2922550 2776704 2820779
14496 2820779 3086109 2978990 2921793 3067588 3136352 3152242 2885883 3169654 3056558 3146456
14486 3146456 3527865 3479201 3313894 3331138 3453087 3650575 3888513 3485512 3847473 3339053
14476 3339053 3699003 4062535 3902599 3531590 3738331 3822246 3477173 3849279 3736854 4191486
14466D191486l79343K73738J32072j84083L4264K86200J50257l21510K45846J7200
14456D446127L29725M2321j76035j3836O3161K88231j09301k2997J30764M1586
14446E019746L67429m52308J70725J91865k2011K48130K81098K5748j36370J1958
14436E706010K75351j72355K71936p9118J06500k4640M65811k80328M30300n662
14426F693805n3197K21549J39210L514L21474K52055K02969K93367l32738J53445
14416G895453J12849j32936J6603Q8181L94453l82023K38285J72368O97933N730
14406I106896j83559L04468K95215K09607j22314K17449k32414J54499K13946
14397I963793K92105N7025J83256J54015K20569L05445P5444o9818M75667r5051
$$ plain form
14466 4191486 3812143 4085881 4217953 4033870 4068134 4354334 4504591 4183081 4428927 4446127
14456 4446127 4775852 4818173 4642138 4628302 4691463 4979694 4870393 4847396 4978160 5019746
14446 5019746 5387175 4934867 5105592 5297457 5275446 5523576 5804674 5830422 5694052 5706010
14436 5706010 5981361 5809006 6080942 6001824 6108324 6083684 6549495 6269167 6699467 6693805
14426 6693805 6640608 6862157 7001367 7004881 7326355 7578410 7781379 8074746 7742008 7895453
14416 7895453 8008302 7875366 7891969 7980150 8374603 7992580 8230865 8403233 9101166 9106896
14406 9106896 8923337 9227805 9523020 9732627 9610313 9827762 9595348 9749847 9963793
14397 9963793 10255898 10312923 10496179 10650194 10870763 11176208 11251652 11181834 11657501 11562450
14387A1562450P68061N1823J41287J21657K44713M07154M00485N4836K76733K54860
14377A4284059l2331L88238K30956L33530K66345J45072O53272l2313M83955L73855
14367A7094638L94313N62237M35002M98619M13972k42744p6746R48652J85262
14358B0213205O69768M47407M55748R17473J26077L89430M86187Q57956L26056
14349B4889307O47159R01190P46081O46236O20807P38080O38663J172938L72736
14340C1373197Q25238Q60709J331917N29451J251178J210509R09300R75485J306133
14331D0573117J637095J052927J380647J299988J939921R59966J787083J759519
14323E2390263J547824K087758K000760K008141K005775K619406J896467K644070
$$ plain form
14387 11562450 12330511 12382334 12523621 12645278 12889991 13297145 13697630 13752466 14029199 14284059
14377 14284059 14251728 14639966 14870922 15204452 15470797 15615869 16269141 16236828 16720783 17094638
14367 17094638 17488951 18051188 18486190 18984809 19398781 19156037 19079291 20027943 20213205
14358 20213205 20882973 21330380 21786128 22703601 22829678 23219108 23705295 24563251 24889307
14349 24889307 25536466 26437656 27183737 27829973 28450780 29188860 29827523 31000461 31373197
14340 31373197 32198435 33059144 34391061 34920512 36171690 37382199 38291499 39266984 40573117
14331 40573117 42210212 43263139 44643786 45943774 47883695 48843661 50630744 52390263
14323 52390263 53938087 56025845 58026605 60034746 62040521 64659927 66556394 69200464
14315F9200464K648562K460910K862154L200074L641012L378411L681473L497608
14307I4570668M171611M041995M924025M710537N264339M864574O181209O413297
14299A35142255O329168O725957P514608P762794Q462226Q978293R147128R220129
14291A99282558J0772970J1329845J1320193J1795190J2535034J3195833J3275783
14284B83507406J3937776J4353439J4638363J4295237J4402533J4038270J3500778
14277C82673802J2831523J1832069J0692769Q928307O388392L281177M49309j017067
14269D36060281j627173m301211m448376m939042p846655r572179j0437908j2917254
14261C79970483j3363633j4327090j4459518j5526893j4605929j4654952j3921175
$$ plain form
14315 69200464 71849026 74309936 77172090 80372164 84013176 87391587 91073060 94570668
14307 94570668 98742279 102784274 107708299 112418836 117683175 122547749 128728958 135142255
14299 135142255 141471423 148197380 155711988 163474782 171937008 180915301 190062429 199282558
14291 199282558 210055528 221385373 232705566 244500756 257035790 270231623 283507406
14284 283507406 297445182 311798621 326436984 340732221 355134754 369173024 382673802
14277 382673802 395505325 407337394 418030163 426958470 433346862 436628039 437077348 436060281
14269 436060281 434433108 430131897 425683521 420744479 412897824 403325645 392887737 379970483
14261 379970483 366606850 352279760 337820242 322293349 307687420 293032468 279111293
14254B79111293j3978288j3199093j2644776j2106074j1592966j1014272r996685
14247A94579139q146113r399933q950919p871737p470919p486723o686823o456867
14239A32109105o449834m868431n081404n585585m764334m620571m188898l914339
14231I2635709l382291l396365l792461l291619k910750k858521k796139k479755
14223F7727808k700370j979213k391239k023377j863611j953047k058512j642355
14215E1116084j729192r93200j490924j205396j624584j630206j441508j015792
14207C9985282o32047q16647j422809j195510j066568j039917p01184k21054j178096
14198C1711450j053594r61642q97926n63795o50123n84131p24128n61617q51843
$$ plain form
14254 279111293 265133005 251933912 239289136 227183062 215590096 204575824 194579139
14247 194579139 186433026 177033093 168082174 160210437 152739518 145252795 138565972 132109105
14239 132109105 125659271 120790840 115709436 110123851 105359517 100738946 96550048 92635709
14231 92635709 89253418 85857053 82064592 78772973 75862223 73003702 70207563 67727808
14223 67727808 65027438 63048225 60656986 58633609 56769998 54816951 52758439 51116084
14215 51116084 49386892 48393692 46902768 45697372 44072788 42442582 41001074 39985282
14207 39985282 39353235 38536588 37113779 35918269 34851701 33811784 33110600 32889546 31711450
14198 31711450 30657856 29696214 28798288 28234493 27584370 27000239 26276111 25714494 24862651
14189B4862651k28303o59212n35019m39903r91897m62885m43991o23413j91932
14180B0286096p34110k38291n18925j52689l47834j64538l53377o90190j4860
14171A7071282n75385r321o09382n35571J86120l88849j68064q09589K94817o04422
14161A3851636p2636l83658r3397p3938k16613m49326j22412l2174n79194J83003
14151A2011291l07367o45172j5927Q2271l86989M11901q29508J71813k58540k96641
14141I937132J166j81208N5016l57324j60417k51502J41942m45890j67628m4994
14131H526293J50025k84242R1332J7543j85352l66653k34104J39664l76701j08777
14121G369028L28236m07915k75994m3447J59934m04566m9336J98714l51294M31423
$$ plain form
14189 24862651 24634348 23975136 23440117 23000214 22008317 21545432 21101441 20478028 20286096
14180 20286096 19551986 19313695 18794770 18642081 18294247 18129709 17776332 17086142 17071282
14171 17071282 16495897 16486576 15877194 15341623 15527743 15138894 14970830 14161241 14456058 13851636
14161 13851636 13779000 13395342 13301945 13228007 13011394 12562068 12439656 12407482 11828288 12011291
14151 12011291 11703924 11058752 11042825 11125096 10738107 11150008 10320500 10492313 10233773 9937132
14141 9937132 9938298 9757090 9812106 9454782 9294365 9042863 9184805 8738915 8571287 8526293
14131 8526293 8676318 8392076 8483408 8500951 8315599 7948946 7714842 7854506 7477805 7369028
14121 7369028 7697264 7289349 7013355 6969908 7129842 6725276 6675940 6874654 6523360 6954783
14111F954783m37702J22926m34051Q0054L0196j69176n639j67279r2372j46352
14101E735388K18333k81530J14697k98078k84620M01163j34214j76535l3279k34971
14091E026354J40182k2553N9031m05173Q9937L0312K6236q5003m29379K23006
14081D652950J1661k97912r8437M25639m96465M4673l8540k56042n7069L61424
14071D251882r802l08834L29642k47079q3624j52381J61053l1743N955k94286
14061C620783K43416K31204j13787k4740m13334L96378j85116L6695k12978J35973
14051C714494l52108L6012j31986M1586j17007Q3434k99159J02913L08943k27178
14041C159944k85969K72041l11699L8475R241j39883L50436m5996O3080k73783
$$ plain form
14111 6954783 6517081 6640007 6205956 6286010 6316206 6147030 6141391 5974112 5881740 5735388
14101 5735388 5953721 5672191 5786888 5488810 5204190 5605353 5471139 5294604 5261325 5026354
14091 5026354 5166536 5143983 5203014 4797841 4887778 4918090 4944326 4859323 4429944 4652950
14081 4652950 4664611 4366699 4268262 4693901 4197436 4242109 4203569 3947527 3890458 4251882
14071 4251882 4242080 3933246 4262888 4015809 3932185 3779804 3940857 3909114 3915069 3620783
14061 3620783 3864199 4095403 3981616 3956876 3543542 3939920 3754804 3791499 3578521 3714494
14051 3714494 3362386 3398398 3266412 3307998 3190991 3274425 2975266 3078179 3387122 3159944
14041 3159944 2873975 3146016 2834317 2872792 2882033 2742150 3092586 3046590 3109670 2835887
14031B835887O3804j69996Q1141j06926k8329R9926p5937K4304j84720L7814Q0699
14020B657667j21310k2890J7493N2798k34682q1522K19784j77889r7155K24821
14010B437115p355m37244J88838j20881K66275j80533J2523P6855n35772L22669
14000B022490k76863J81584l8789J83764j39263l8367j00172m2073L6638R3931
13990A882880J63584K89337J351555M839968J5258238K6916052k1061852A4492837
13981H418179k654387j113641r51402k50757m35954J14815k30898k89227J68J021
13971B607917m17580K27257k05839J62001l06740M0269J22786l24591L74544l20525
13961A959499J12941j3880m12133M22232K99638o85683L75394n96217L12175K64199
$$ plain form
14031 2835887 2899691 2729695 2810836 2703910 2675581 2775507 2699570 2723874 2539154 2576968 2657667
14020 2657667 2536357 2513467 2530960 2583758 2349076 2267554 2487338 2309449 2212294 2437115
14010 2437115 2429760 1992516 2181354 2060473 2326748 2146215 2158738 2235593 1699821 2022490
14000 2022490 1745627 1927211 1888422 2072186 1932923 1894556 1794384 1752311 1788949 1882880
13990 1882880 2046464 2335801 3687356 8527324 23785562 50701614 29639762 14492837
13981 8418179 5763792 4650151 3698749 3447992 3012038 3126853 2895955 2606728 2606896 2607917
13971 2607917 2190337 2417594 2211755 2373756 2067016 2107285 2230071 1905480 2280024 1959499
13961 1959499 2072440 2058560 1646427 2068659 2368297 1682614 2058008 1461791 1773966 2038165
13951B038165l37744j10603J49390J77387L0134m3274j63774J15623M9874n94830
13941A310348K88757l72371Q1337M92618n68436K44911K44294J4763l12874M86838
13931A910185m55590j6636L0823k19870p9546N19547N5940l40979M4832L2009
13921A480715r3808K30454p8432j15447L8777k82184L15286j33703J79378m18602
13911A122434M65520j98725K41203k55803J81774l17319k9870Q6999j50817K29099
13901A374495J37893l13640J84460m38728K39462J16179L1957k02554J98350k71354
13891A056520K95079k1474j31239L14461n08041K36303J6482J55567n02851J74572
13881A085379j687O3902J52597m0768l97783L42311l42531K21296k45177L39701
$$ plain form
13951 2038165 1700421 1589818 1739208 1916595 1946729 1903455 1739681 1855304 1905178 1310348
13941 1310348 1599105 1226734 1308071 1800689 1232253 1477164 1721458 1736221 1423347 1910185
13931 1910185 1454595 1437959 1468782 1248912 1169366 1688913 1744853 1403874 1448706 1480715
13921 1480715 1386907 1617361 1538929 1423482 1462259 1180075 1495361 1361658 1541036 1122434
13911 1122434 1587954 1389229 1630432 1374629 1556403 1239084 1209214 1296213 1145396 1374495
13901 1374495 1512388 1198748 1383208 944480 1183942 1300121 1332078 1129524 1327874 1056520
13891 1056520 1351599 1330125 1198886 1513347 1005306 1241609 1258091 1413658 910807 1085379
13881 1085379 1083692 1147594 1300191 1259423 861640 1203951 861420 1082716 837539 1177240
13871A177240j5217m5792k19162J65124r1094n7334K50292l07170L79811n63817
13861F72881P9565K67924j0394j97835J96561j0023k35158M88840j72008j85417
13851H94936L74571k37398p5723P3608J37729m17771K27237k77106J92626l91988
13841E00721M36889m5128j42202p1466L71567l12589K18894j7174Q2914n3617
13831I68809j07091J07780N6171j38469K0877j01316j30868j792K08975M9003
13821I32079M96175C99675L35072L02038k82039L5656k60486K2568J22447l19472
13811C55459M55745J51333O2072j05714L9078j16459k28050N4928r1773K30544
13801H07163l3994k9598k28995J66355R7146m6932p2615j44409L15927j62316
$$ plain form
13871 1177240 1162023 1116231 897069 1062193 971099 913765 1164057 856887 1236698 672881
13861 672881 752446 1020370 1009976 812141 1008702 998679 763521 1252361 1080353 894936
13851 894936 1269507 1032109 956386 1029994 1167723 749952 977189 700083 892709 500721
13841 500721 937610 892482 750280 678814 1050381 737792 956686 939512 1022426 968809
13831 968809 861718 969498 1025669 887200 908077 806761 675893 674101 883076 932079
13821 932079 1428254 399675 734747 1036785 754746 790402 529916 552484 674931 355459
13811 355459 811204 962537 1024609 918895 957973 841514 613464 668392 576619 807163
13801 807163 773169 743571 514576 680931 778077 731145 658530 514121 830048 667732
13791F67732K9657Q9289M1164l01015P4904L65867n226j04799K23456E35848L36172
13780H72020K9217j43881L24465D78672J04125K66097C44873K69974K886j04368
13770E13365K05936K89546j48055L202j51948M8865k80139L85825D06320K69675
13760F75995M0194j58939K7161J1369L9633k0627k6574L6409j55193K71874k16879
13749E24423J05655n942p3483J10708j03777r0349J98764k72745L903L7304j44581
13738B89880A22543N70786j81329j88409O40844D00055l5880L76776n3577J40806
13728H28180l04126J70162p6495n5870J02931j89272j11711R3447J33830J9308
13718F10384R3597j44826L06660k09629m8142k18631J64847j67449J87275k80135
$$ plain form
13791 667732 697389 786678 827842 526827 601731 967598 962372 857573 1081029 535848 872020
13780 872020 901237 757356 1081821 478672 582797 848894 344873 614847 617733 513365
13770 513365 719301 1008847 860792 863994 712046 760911 480772 866597 406320 675995
13760 675995 716189 557250 584411 595780 635413 614786 588212 624621 469428 741302 524423
13749 524423 630078 624136 550653 661361 557584 467235 665999 393254 397157 434461 289880
13738 289880 122543 693329 512000 323591 964435 400055 364175 740951 687374 828180
13728 828180 524054 694216 617721 561851 664782 475510 363799 457246 591076 610384
13718 610384 703981 559155 865815 656186 608044 389413 554260 386811 574086 293951
13708B93951J66222N4461B30576M45500l13352M9787J17116B01286K86730J27773
13698F15789B93186J01660K71781k26675K4445J66681k42025R7255O4714n9460
13688D91562H3436N30659r7203J05483j09668k02524D7738N42399k14385K34091
13678F09843O5397j26740B16422N67443k57127L08417C92703K97964q1790j18654
13668D90223m6936q0319K02533j15373M58551B43496J08805J88785A55187J51180
13658C06367M67823j26837j13586J65753A77336J31845n7607P3463J19868I3855
13647E12613j47616J96740r1573M2984j56779j26023Q8482k2244D5289K18015
13637B63304L39121j76985r5885J33691A48381P6991L65073k58442o4410J24735
$$ plain form
13708 293951 460173 514634 230576 676076 362724 412511 529627 201286 488016 615789
13698 615789 293186 394846 666627 439952 464397 631078 389053 486308 551022 491562
13688 491562 83436 614095 516892 622375 512707 310183 47738 590137 375752 609843
13678 609843 675240 548500 216422 783865 526738 835155 392703 690667 608877 490223
13668 490223 443287 362968 565501 450128 908679 243496 352301 541086 155187 306367
13658 306367 774190 647353 533767 699520 177336 309181 251574 325037 444905 93855
13647 512613 364997 561737 470164 513148 356369 230346 318828 296584 45289 263304
13637 263304 602425 425440 329555 463246 148381 225372 590445 332003 267593 392328
13627C92328j36100J49819j91961q6473L07969M0726A3293J38576N00947k30565
13617D22251q394A62133N86358r5584k74257J54127B61648J5210l4548J38396
13607C80706e626C11331J79901j41034K48474A45298J87250j31663M5455R3023
13597C39363M3540o7220M9034A54156J10932l4209J52977q4214K07082A55571
13586F68133k72907j00046M4517m2585j19238q7631K64153k3562j20809j7748
13576A92277o0948J91674J01917j80403N17313l27910o6563q5113J38058j02550
13566C17752J53739e243A67151n4747N2599M22829A28314K9802m0934L2940k682
13555A47440E8550J99307K54034q4756G7123c2302A46880K3884M2974k7352K39620
$$ plain form
13627 392328 256228 406047 214086 127613 435582 476308 13293 151869 652816 422251
13617 422251 413857 162133 748491 652907 378650 532777 261648 276858 242310 380706
13607 380706 -5626 311331 491232 350198 598672 145298 332548 200885 246340 339363
13597 339363 382903 315683 364717 154156 265088 230879 383856 299642 506724 155571
13586 668133 395226 295180 339697 297112 177874 90243 354396 330834 210025 192277
13576 192277 131329 323003 424920 244517 761830 433920 367357 282244 420302 317752
13566 317752 471491 -5243 167151 112404 165003 587832 128314 158116 117182 150122 147440
13555 147440 58550 257857 511891 427135 77123 -32302 146880 170764 213738 186386 426006
13544D26006j89088J18390m9531j17716o7675K80062p9033k4927J32106j63468
13534B65126K04749A30765j1204K37270m7623A3868L76316a31263D06781j61410
13524B45371J08717b7842A55257o4448K56555J26259J20637A91981j5677J38239
13514C14543j41213J63038A01640J45087L3153N2358J6648N2g6364D09429p4994
13503C34435A45306K35606j24149n5527J35534j0866C6047K06980r2068K20996
13493C71955A72749B9633M19048A70460J0375m9015l433K18419l174j48196O6453
13482B61889A21910K17146J42826D9884N08714A5542R2031K54933J34171A2843
13471D17465n9876j67806E1534L831J11856k793L285K88201j65548E6115J16248
$$ plain form
13544 426006 236918 355308 305777 188061 120386 400448 321415 296488 428594 265126
13534 265126 469875 130765 119561 356831 309208 13868 390184 -131263 406781 245371
13524 245371 354088 -27842 155257 90809 347364 473623 594260 191981 176304 314543
13514 314543 173330 336368 101640 246727 279880 332238 348886 348938 -76364 409429 334435
13503 334435 145306 380912 256763 201236 336770 325904 36047 243027 150959 371955
13493 371955 172749 29633 448681 170460 180835 131820 128387 346806 343632 195436 261889
13482 261889 121910 339056 481882 49884 558598 15542 107573 362506 496677 12843
13471 417465 357589 189783 51534 55365 167221 164428 167713 455914 290366 56115 172363
13460A72363a60304e7686C60270j77273l0289J22668p5062M0915I654K20828J23572
13449C54054A57494J85751a68204C35254j12314H3418O5819F0071P8208k6977
13439A11302Q0642E5644J54123K37694o5912A75417D3339J69514E9034O0107J27695
13428B46836G0672L3205J15202P3029b1178A42290K0835a30753C22750r0881p3409
13417A58460j4634A3958i8259F9265P8424F4118L62674A05794K0914M19838k6053
13406E20493e7711C77343A4621L45079d5827A77192B2718J57771P0762F7793J75703
13395B43496C348J68218b8362A96322O9326L3941j42484K05042j75451p0063J57725
13384B74358n9978K73231B14813K31615j85174k9643R3614g8235B59139b8571
$$ plain form
13460 172363 -160304 -57686 360270 182997 152708 275376 200314 241229 9654 230482 354054
13449 354054 157494 343245 -168204 335254 222940 83418 149237 60071 138279 111302
13439 111302 191944 55644 209767 447461 381549 175417 43339 212853 59034 119141 246836
13428 246836 70672 103877 219079 292108 -21178 142290 163125 -130753 322750 231869 158460
13417 158460 143826 13958 -98259 69265 147689 64118 426792 105794 126708 546546 520493
13406 520493 -57711 377343 14621 359700 -45827 177192 22718 180489 251251 67793 243496
13395 243496 3348 171566 -28362 196322 265648 299589 157105 362147 186696 116633 274358
13384 274358 214380 487611 214813 446428 261254 231611 325225 -78235 259139 -28571
13373A28578K43965P2054j57003L0761j8174K7273A04480A5166L04366J2138j11248
13362B20422C931J45324E9177J74567p1616P0683a46368B43889B5413J18551J42114
13351B86078g43A02288B9303L11387j37732L4636o4696L1412i3087G21244C12013
13339A34650J31921K01287j66808j842J53937j03773A61525a42324A72347k5928
13329A46419N8841I9679K1200Q236J94277l338l7653j07199J91205j35801J27231
13318C57837j57719a42381D88174k38928M1608l1651n7480r6498G230K80451b77759
13306a62847D27285j01468A07427B2818J82213D6436J11947e1747p3841B8794
13295D0858L89049k03690k9306d72644D76232F451Q2816J89045A39069f7907E4777
$$ plain form
13373 128578 372543 444597 287594 318355 300181 327454 104480 15166 319532 331670 220422
13362 220422 3931 149255 59177 233744 162128 232811 -146368 243889 25413 143964 286078
13351 286078 -743 102288 29303 340690 202958 237594 172898 204310 -93087 721244 312013
13339 134650 266571 467858 301050 299208 453145 349372 161525 -142324 172347 146419
13329 146419 205260 99679 120879 129115 323392 320054 282401 175202 366407 230606 357837
13318 357837 200118 -142381 488174 249246 290854 259203 201723 105225 7230 287681 -277759
13306 -162847 427285 325817 107427 22818 205031 46436 158383 -51747 -125588 28794
13295 40858 429907 226217 196911 -472644 476232 6451 89267 278312 139069 -67907 54777
13283E53905b46649B03591r1894e9232A89560l3883J01130a30132E6932J31855
13273A88787G7473a90335C36046j16994N958O697m2945l7120a34875C39921f6237
13261E7944d4747D87402D0489L08722j26112G6986J10293a0023A876J70672C4189
13249A97392b31355B59260r6829K1859B8963a07501A48993i3059l1776A12202
13238A11247a37267A25712E8872a82859A99478b29411f7417D15679c5281k35432
13228b70713A34664k6703a40393B21249F0276J41830c2473D124a58907B71313
13217i3382C14314C8757c5161C89688F9305B5180M46686a7147C0115i547R48A75794
13204c9505A86746p8517J8365J18906J48297a72142A63826i6004A74222f2852
$$ plain form
13283 553905 -246649 203591 111697 -59232 189560 155677 256807 -130132 56932 188787
13273 188787 77473 -190335 336046 219052 225010 231707 188762 151642 -134875 339921 -66237
13261 57944 -44747 487402 40489 349211 223099 76986 187279 -10023 1876 172548 34189
13249 197392 -231355 259260 162431 184290 28963 -107501 148993 -93059 -124835 112202
13238 111247 -137267 125712 58872 -182859 199478 -229411 -67417 415679 -35281 -270713
13228 -270713 134664 107961 -140393 221249 60276 202106 -32473 4124 -158907 271313
13217 -93382 314314 38757 -35161 389688 69305 25180 471866 -17147 30115 -9547 -8599 175794
13204 -39505 186746 108229 126594 245500 393797 -172142 163826 -96004 174222 -62852
13193a03690H2853K0371L38244a2721k20963F8831K1871K53216F6687K2157L705
13182I2549O7344L537j6124I428b2274C5449b0931B1168J72005o5547C3876i8859
13169a80407P6965D06892H9163P9188j4115K38762C480a42398A87185a83692J829
13158a81863B50271B3134K53710j21693g7685J3046r6436B40301q2358p4884a15065
13146A10583a56084A71413o3599a14310B5797L0345n89b50407O4178B04214J44860
13135C49074a73982G7885Q5555a50512A10282N9474N4631a13922A74872A6864
13124A4056R4922P8282a92399J4609B49522e2550A71276F0265L524L20980q7904
13113B96865b072D223J38211a43514F8413J97321I0947f3508h246A91479L1798
$$ plain form
13193 -103690 82853 103224 441468 -12721 -233684 68831 90702 343918 66687 88844 92549
13182 92549 159893 163430 147306 9428 -22274 35449 -20931 21168 193173 127626 33876 -98859
13169 -180407 -103442 406892 89163 168351 154236 392998 3480 -142398 187185 -183692 -181863
13158 -181863 250271 23134 276844 155151 -77685 -64639 -161075 240301 157943 83059 -115065
13146 110583 -156084 171413 107814 -114310 25797 56142 55553 -250407 -186229 204214 349074
13135 349074 -173982 77885 163440 -150512 110282 169756 224387 -113922 174872 16864
13124 14056 108978 187260 -192399 -177790 249522 -52550 171276 60265 63789 384769 296865
13113 296865 -2072 4223 142434 -143514 68413 265734 90947 -63508 -8246 191479 223277
13102B23277a40505B37851b33082A25316c7706C41408e9587A29888a1568K123
13092i445E5517a05901B30706L2754p8453F7521J73754a0615A75225N1370a093
13080f1445j2711B70251A18006a92430A7930K14807A00759M3469b47714i7646
13069A86267j8061a6249A33319K31359B1879K9079K53954b05498A97142b75607
13058h4450A57997n9162f0977A71747a91444C76655h977j07279i488k3689A70381
13046C14967i9807B52079B029L66660e6427C75682A23691a56060n1776B52146
13035A96752E1967B2082J17686d9898B09987F860a31043A64942h4517A09936e3483
13023A43016c71520A14157q427g7037B59056a68982D90634H1830K01659j8732
$$ plain form
13102 223277 -140505 237851 -233082 125316 -37706 341408 -59587 129888 -11568 -9445
13092 -9445 55517 -105901 230706 263460 185007 67521 241275 -10615 175225 226595 -1093
13080 -61445 -74156 270251 118006 -192430 17930 232737 100759 144228 -247714 -97646
13069 186267 168206 -16249 133319 364678 21879 50958 304912 -205498 197142 -275607
13058 -84450 157997 98835 -60977 171747 -191444 376655 -8977 -116256 -9488 -33177 170381
13046 314967 -99807 252079 2029 368689 -56427 375682 123691 -156060 -207836 252146
13035 196752 51967 22082 139768 -49898 209987 6860 -131043 164942 -84517 109936 -53483
13023 143016 -371520 114157 105730 -77037 259056 -168982 490634 81830 283489 264757
13013B64757G1505b2132R488a14I4738K36178A55648b1162C6839b31721j72221
13002d03942A25716J17305c4467B31304j5122F3654J75852i9703B48000J2768
12992B60768h3759H2799Q0236a61931G1540K85151j36687c4051j2811C3856J17867
12981A51723a42708A71331E6289a44258C07852a75726c2831j5571B6848J72037
12971A98885N0452d934G3858j9807J52452R8688A5723i6591B08554A9370b0545
12959B27691E8351K4478O9481O7088L7614J92157a18776B53567D496J44339m2238
12948A06597L7194a21268c8003A02309a19163l51527g9972K3948A70151b16620
12937A23312R9513b26196e6138b6193A4812L14841b1242B75919b36483D9303a12661
$$ plain form
13013 264757 71505 -22132 -12644 -114 94738 330916 155648 -21162 36839 -231721 -403942
13002 -403942 125716 243021 -34467 231304 216182 63654 239506 -99703 248000 260768
12992 260768 -83759 82799 163035 -161931 71540 356691 220004 -34051 -46862 33856 151723
12981 151723 -142708 171331 56289 -144258 307852 -175726 -32831 -48402 26848 198885
12971 198885 249337 -4934 73858 54051 206503 305191 15723 -96591 208554 19370 -20545
12959 227691 58351 82829 152310 219398 257012 449169 -118776 253567 4496 148835 106597
12948 106597 143791 -121268 -38003 102309 -119163 -470690 -79972 -56024 170151 -216620
12937 123312 222825 -226196 -56138 -26193 14812 329653 -21242 275919 -236483 49303 -112661
12925d0829E8713L26627a17024J6762k2975E3547a86889N6565l7553l9193A42932
12913I8860f7922A22113A9300J13509J05294M8804a72090C5815O9940B8833M3312
12902G2145e6847A25778f5520p6902E30511k45339c71242B32448c15946e5955
12891C8020d066C18772A03012J60485m1470J32477G2624f6782k6197C88288A6932
12879B06285B297h6182B02218d8441j05853L497B42236P3723H2134b39493A50034
12867a13761I3458J2938A2729g8137A1467b41054q6496J14725A02111h1208j22726
12856b03934O7273j63842R3865c939B73725j9181a5977A56600K2551Q1309D4399
12844C24392a00189j2097c8520A19132e2927A79622k1971n9849k5971K98819B9074
$$ plain form
12925 -40829 58713 385340 -117024 -100262 -123237 53547 -186889 -130324 -167877 -207070 142932
12913 98860 -67922 122113 19300 132809 238103 286907 -172090 35815 105755 28833 72145
12902 72145 -56847 125778 -65520 -142422 530511 285172 -371242 232448 -315946 -55955
12891 38020 -4066 318772 103012 263497 222027 354504 72624 -66782 -92979 388288 16932
12879 206285 2297 -86182 202218 -48441 -154294 -150797 242236 315959 82134 -239493 150034
12867 -113761 93458 106396 12729 -78137 11467 -241054 -327550 -212825 102111 -81208 -203934
12856 -203934 -136661 -300503 -206638 -3939 273725 254544 -15977 156600 179151 260460 44399
12844 324392 -100189 -112286 -38520 119132 -52927 179622 157651 97802 71831 370650 29074
12832c6749j21656O8080c4739B9074a11152j17989A8148L3947g3748B11796l6173
12821A75623A4361M5573b59457P0373C47492b23605O3925C02338a1391A51504
12810a99977g6257F4913j5238a39858C6806b85863d8613C66809A0864g6959j89983
12799b66942J32016D8104J37491J01526a4295k4330l35990a33467M2700B61959
12788A6817b2347j01332j94330G3629k113K02986c11313i0894A33577a7759A97420
12776A62758n5479O8173E3920b71928B71747r2682O7412H5659K8334C6025m335
12765C1690h0209k48778J20231C8991L2523i4640G1351a74633b0080j32635P4076
12754g8639n902o6911A26985k0128C0457c00282J35048A95328r5878g7930J033
$$ plain form
12832 -36749 -158405 -90325 -34739 29074 -111152 -229141 18148 52095 -73748 211796 175623
12821 175623 14361 59934 -259457 -189084 347492 -223605 -159680 302338 -11391 151504
12810 -199977 -76257 64913 49675 -139858 36806 -285863 -48613 366809 10864 -76959 -266942
12799 -266942 -134926 48104 185595 287121 -14295 -38625 -374615 -133467 -90767 261959
12788 16817 -22347 -123679 -318009 73629 71516 274502 -311313 -90894 133577 -17759 197420
12776 162758 107279 175452 53920 -271928 271747 179065 246477 85659 113993 36025 31690
12765 31690 -80209 -328987 -208756 38991 71514 -94640 71351 -174633 -20080 -152715 -78639
12754 -78639 -84541 -151452 126985 106857 30457 -300282 -165234 195328 99450 -77930 -76897
12743g6897k67752D2038J40859E3207K97531F1192L11305j70340J233a78621N0497
12732a28124F236b22250M2652A96845b04994M3158P184a9068C02777A5733h5778
12720D7019f1340l163G2281a05310k5981J2179j18712O8414G610a05981B59070
12708D06921o1892A44815b6318f692B71028i0801E3376K81613l4344e9234q9491
12697a48725E4522k0018h0496j66030I7937c39926g1530J5324K2026j29864K576
12686a61468K0675A8363J75710m4408b48893B96667K6898l703c86815A79678m2310
12675A37368D2975O1996J30339f4499N615A10792N5534E6298a5745l12601a4596
12663C93232a0062F0173j5946e9062B97535r2851d0968A11297b35999a668j14687
$$ plain form
12743 -76897 -344649 42038 182897 53207 350738 61192 372497 202157 203390 -178621 -128124
12732 -128124 6236 -222250 -179598 196845 -204994 -161836 -154652 -19068 302777 15733 -85778
12720 47019 -61340 -64503 72281 -105310 -131291 -119112 -237824 -169410 7610 -105981 259070
12708 406921 345029 144815 -26318 -6692 271028 -90801 53376 334989 300645 -59234 -148725
12697 -148725 54522 34504 -80496 -246526 97937 -339926 -71530 -56206 -34180 -164044 -161468
12686 -161468 -140793 18363 194073 149665 -248893 296667 323565 319862 -386815 179678 137368
12675 137368 42975 104971 235310 -64499 -58884 110792 166326 56298 -15745 -328346 -14596
12663 393232 -10062 60173 44227 -59062 297535 204684 -40968 111297 -235999 -1668 -116355
12652a16355B45862M2205A4726L08247b31834C16509B3071J28077C8268b68822
12641c64593a71978B90360G4980d730j10373E5177R910J69713O2281A43204i5195
12629B37443a06234A01983b2511A53052E2281J90006j04656F0339M66076j40018
12619C86397o2330d9536j06445C7880M4666p850a41927k7901j14330F8722l434
12608F5288c4513A33427b70975a31921C5377L3155a01035C05749J37098j26733
12598C16114A41891f9737O026B82908b20934j2384J15354G0749b53002A00268
12587F1565j1486J30482c9207A25989a51859B33035b91606C4487N2866h8564C66
12575B1669J56059g1603m4177a8455j18767A57871L0494a84444B88221b03962
$$ plain form
12652 -116355 245862 288067 14726 322973 -231834 316509 23071 151148 38268 -268822
12641 -364593 -171978 290360 74980 -4730 -115103 55177 65087 234800 297081 143204 -95195
12629 237443 -106234 101983 -22511 153052 52281 242287 137631 60339 526415 386397
12619 386397 324067 -49536 -155981 37880 82546 74696 -141927 -169828 -284158 68722 65288
12608 65288 -34513 133427 -270975 -131921 35377 68532 -101035 305749 442847 316114
12598 316114 141891 -69737 -63711 282908 -220934 -233318 -117964 70749 -253002 100268
12587 61565 50079 180561 -39207 125989 -151859 233035 -291606 34487 87353 -88564 366
12575 21669 177728 -71603 -115780 -18455 -137222 157871 188365 -184444 288221 -203962
12564a64653g331C47598a07787r590D079d6213A93047a13213B14994a26210j95277
12553c21487B94539e97219B19849k1609a94079F9743L54060c11054A52231c27759
12542A98127h0719o3464f2653k25219F1822c42091B08440e2638p5976A53652i2017
12530B03752a03740A16461e9746b7525C56030a87768P3710M5373j08360C3153
12519a11734M1329k07609A9375a22319B19694k0839g6195j8853r2127Q6631F1718
12507a46065l540b0078o0529A21347A489b01453B02657e2825b5408D9307h7669
12495B43103f4280A43867m0245b47266A52295C5042K8399d4975r5686c1981C4237
12483A04807f7642j06653q4090g139l55132D83607b28540h8848r8906B42593N2347
$$ plain form
12564 -164653 -7331 347598 -107787 -117377 4079 -46213 193047 -113213 214994 -126210 -321487
12553 -321487 294539 -597219 219849 198240 -194079 69743 423803 -311054 152231 -327759
12542 198127 -80719 -144183 -62653 -287872 61822 -342091 208440 -52638 -128614 153652 -92017
12530 203752 -103740 116461 -59746 -27525 356030 -187768 -114058 -68685 -177045 33153
12519 -111734 -70405 -278014 19375 -122319 219694 198855 -76195 -95048 -187175 -100544 61718
12507 -146065 -149605 -20078 -80607 121347 1489 -201453 202657 -52825 -25408 49307 -87669
12495 243103 -64280 143867 103622 -247266 152295 35042 63441 -44975 -140661 -31981 34237
12483 104807 -67642 -174295 -258385 -7139 -362271 483607 -228540 -88848 -187754 242593 294940
12472B94940C5983c0829l3207H0468a41010O401A91341a34452A91847N4002J09297
12461C55146G8349b39313O4739C8783a384j50011j84377D9973g0250k41361j58700
12450d70311A21227a33420B1457K28419f9975b3275k79888B21575G0521a07409
12439e1405G1185d0866m9112B49693g2032d196k29236A93793a61544B12572b453
12427A61302b15763E1779i8275C1062a95376c2713E0690R2486J8616a37526D1229
12415b9312j01712q421O7765j15408C19392b9423A96310a22379C64133j67123
12405A97010q2610K77213j33931e5525k34548A92684N8797J00326I4831a02665
12394c38190A29510b59750j5412f4485D64411b4856h927B17259d8388p1300f319
$$ plain form
12472 294940 35983 -30829 -64036 80468 -141010 -134609 191341 -134452 191847 245849 355146
12461 355146 78349 -239313 -174574 38783 -1384 -151395 -335772 49973 -70250 -311611 -470311
12450 -470311 121227 -133420 21457 249876 -69975 -23275 -303163 221575 70521 -107409
12439 -51405 71185 -40866 -89978 249693 -72032 -4196 -233432 193793 -161544 212572 -2453
12427 161302 -215763 51779 -98275 31062 -195376 -32713 50690 143176 161792 -137526 41229
12415 -29312 -131024 -139445 -71680 -187088 319392 -29423 196310 -122379 364133 197010
12405 197010 114400 391613 257682 -55525 -290073 192684 251481 351807 94831 -102665
12394 -338190 129510 -259750 -275162 -64485 464411 -24856 -8927 217259 -48388 -119688 -6319
12382A23698c55814B23803K3239a59989C61012b97671A25044h6304M1410C34880
12371C04089g1346m7787h739G4143d8550k91601A22387j1905b73884E476K2789
12360B8265L26567K523A16766B2318b56809g8004k846l8980G6181b91764J22991
12349a68773O1823A50523a87922F5306O6443k4655D3103a61678d4983a8715m3154
12338f1869B5550K4424J69406I5265O3173d0909K131B55700j06331g7590C33520
12326A00472P882L9874L21499B9224J06616K12321D6253f2977C94923q1447A34009
12314a01924A03111K09564f8208b9680k38252A54920C2205M44498h684m14A46914
12302d87402a36852B82029G6730J37578a23477c044C70051a75809C95828j86408
$$ plain form
12382 123698 -355814 223803 247042 -159989 361012 -297671 125044 -86304 -44894 334880
12371 304089 -71346 -119133 -8739 74143 -48550 -340151 122387 110482 -273884 5476 28265
12360 28265 354832 357355 116766 22318 -256809 -78004 -80850 -119830 76181 -291764 -168773
12349 -168773 -106950 150523 -187922 65306 131749 107094 43103 -161678 -44983 -18715 -61869
12338 -61869 25550 49974 219380 95265 158438 -40909 -38778 255700 149369 -77590 333520
12326 100472 108354 148228 469727 29224 135840 348161 46253 -62977 394923 313476 134009
12314 -101924 103111 312675 -68208 -29680 -267932 154920 32205 476703 -8684 -9098 146914
12302 -487402 -136852 282029 76730 214308 -123477 -3044 370051 -175809 395828 209420
12292B09420D3877h4495j9805B1087N0556L0896C0734a28567B25131G1078K25129
12281B96207A34686K83016r2576b8690B89521b14470E0438R8355o2551P8266K2335
12270A86843m463r607K6541n5925Q0590o5995m7371J11519h124r7292b595H4864
12257B77111A15925a47713L3129C08527c48491A98410F9902J52929J27397A21340
12246B07177J97654g0796A98101o2845a87806b615A60614J16519P5838j64281
12236A88690f4128A551N7287i1740I9932K40934q2796Q73P5922A17239A6978a06153
12223A27966j9923Q6623P680C3388M0349J80671O6499l5461j37257L02033b84548
12211a45442q7385G8319L17226a01635G2387c17151A43853m3203R5400h2374B07481
$$ plain form
12292 209420 43877 -84495 -104300 21087 71643 102539 30734 -128567 225131 71078 296207
12281 296207 134686 417702 325126 -28690 289521 -214470 50438 148793 86242 164508 186843
12270 186843 182380 172773 199314 143389 223979 157984 110613 222132 -8124 -105416 -2595 84864
12257 277111 115925 -147713 -114584 308527 -348491 198410 69902 222831 350228 121340
12246 207177 404831 -70796 198101 135256 -187806 -2615 160614 277133 352971 188690
12236 188690 -64128 1551 58838 -91740 99932 340866 258070 258943 334865 117239 16978 -106153
12223 127966 108043 194666 202346 33388 73737 254408 320907 285446 148189 450222 -284548
12211 -145442 -232827 78319 395545 -101635 72387 -317151 143853 100650 196050 -82374 207481
12199i5004a5640C17858Q453j45799j7798M5783B9614Q2648h8575C08457o0801
12188B47656L08416A03888k8541J12626n3620N618B4068R3323a43656D03887A08516
12176B92536R9135A59328D1609f0487B40537J1082o0461a73381G6922L32972j49086
12165B60808M7666A39397J96395K64256E4116N180J67862N4081D9671a29436A7786
12153B79257N8751B008M45508j36499b18348B93578o1223o1720a18875E6783d4356
12141A81541Q6565a03679m9052D4416J40813K59840A58632m6999R2274m2053b1903
12129b12411k1031A87448C7957J12840J94438J52434a88631A63968c00264A35342
12118B69155r0318J08887o0070G8350K18194K5810N48A08488a18405A36131A3386
$$ plain form
12199 -95004 -15640 317858 326311 180512 162714 208497 29614 112262 -88575 308457 247656
12188 247656 556072 103888 75347 187973 134353 139971 24068 117391 -143656 403887 108516
12176 292536 391671 159328 41609 -60487 240537 251619 191158 -173381 76922 409894 260808
12165 260808 308474 139397 335792 600048 54116 59296 227158 281239 49671 -129436 17786
12153 279257 338008 2008 447516 311017 -218348 293578 232355 170635 -118875 56783 -44356
12141 181541 268106 -103679 -152731 44416 185229 445069 158632 111633 203907 161854 -21903
12129 -212411 -233442 187448 37957 150797 345235 497669 -188631 163968 -300264 135342
12118 269155 178837 287724 227654 78350 296544 322354 322902 108488 -118405 136131 13386
12106a83570C0444K22966a75466O5445H2159J5035d0126A4827Q174K55986j25352
12095A53635L5493m6964a25498J9492k70391F0238K41634H3006f6959A42648J99449
12084C42097b20978B6067J44397N2967K8929F5931f0240J4441A44885a28176j32535
12073b60711A14069L19357a80104B99434J42268k10916j7610J53562A73574k0187
12063A53387J6636K9732J43643a74062j00243B68517G0750E609L6332J59946k5844
12052A76043e8034a8472G2621O989J43269b21979C51057D0179G65K27993q1778
12041A46980D3456c7698n2522A7450K842Q6405e4706o5131K2845L6807j35121
12030a95306A10635b51432d6374B51391r367A13577b46105A58389D5001a08331
$$ plain form
12106 -183570 30444 253410 -175466 -110021 82159 97194 -40126 14827 23001 278987 153635
12095 153635 189128 142164 -125498 -106006 -376397 60238 301872 83006 -66959 142648 342097
12084 342097 -220978 26067 170464 223431 252360 65931 -60240 -45799 144885 -128176 -260711
12073 -260711 114069 433426 -180104 299434 441702 230786 213176 366738 173574 153387
12063 153387 170023 199755 343398 -174062 -274305 268517 70750 5609 41941 201887 176043
12052 176043 -58034 -18472 72621 79610 222879 -221979 351057 40179 765 228758 146980
12041 146980 43456 -37698 -90220 17450 20292 106697 -54706 -119837 -96992 -60185 -195306
12030 -195306 110635 -251432 -46374 251391 242024 113577 -246105 158389 45001 -108331
12019a31885B05045a03848j16021k6524a18440F0363q768M4314a09535A27176
12008C52001F3076K3728J0668j0482K68091A22559l491a36940B89837a10812k616
11997a13428j14259Q7071G2277a98040P7372A60496a36149n784C13041C8218c01216
11985B29830A04296e9953p121q8208a7086B2913a6726p5496k9758M7319B31247
11973B4296a96143g778j13714e8882a0717B07918i435p8947H1075e05069A58654
11961D4852J70832M7941g2570A61786d8797B37907o7039m0781p19A1476g1672
11949a76003j77981a60713n1492o36D3794h7804I6180b63324c3741n5998A07191
11937B0381J07794b55377g2335A24205n7552d1638q4116A01264d1220B1510c13151
$$ plain form
12019 -131885 205045 -103848 -219869 -246393 -118440 60363 51595 95909 -109535 127176
12008 352001 63076 86804 97472 86990 355081 122559 119068 -136940 289837 -110812 -113428
11997 -113428 -227687 -140616 72277 -198040 -120668 160496 -136149 -141933 313041 38218 -301216
11985 229830 104296 -59953 -67074 -155282 -17086 22913 -16726 -92222 -121980 -74661 231247
11973 24296 -196143 -7778 -121492 -58882 -10717 207918 -9435 -88382 81075 -505069 158654
11961 44852 215684 263625 -72570 161786 -48797 237907 170868 130087 129368 11476 -71672
11949 -176003 -353984 -160713 -212205 -212841 43794 -87804 96180 -263324 -33741 -89739 107191
11937 20381 128175 -255377 -72335 124205 66653 -41638 -125754 101264 -41220 21510 -313151
11925A25960m1292a75350D844P5101a30389j83533n909E9507J13691h0549B16500
11913H9088b22783F6410N5469Q7301A9458i8818A54315G1896P7704g4631j2956
11902h7587A11329a96283P4621D00180h991o5007H9371N13f4463F8911h957A77788
11889b11869a00312a4986F4567a54493k83087a97773n4754E9846c3591C1263a00715
11877a12693n4528M5174E8209e14030A77992c35691a41807j20994Q8327K2594
11867a51880A01685D6173J86b16025a00997C68592a2663j38784B06258a28694
11856a50183H8095l9088c50565A392a05518A0323a9044GJ3073i0422r1815j30182
11844c12419F6170N2576g8560B1046Q5494a58808j38677G4094L02731E737J79691
$$ plain form
11925 125960 84668 -175350 4844 79945 -130389 -313922 -319831 59507 173198 -80549 216500
11913 89088 -222783 66410 121879 209180 19458 -98818 154315 71896 149600 -74631 -87587
11902 -87587 111329 -196283 -121662 400180 -8991 -73998 89371 89884 -64463 68911 -8957 177788
11889 -211869 -100312 -14986 64567 -154493 -437580 -197773 -252527 59846 -33591 31263 -100715
11877 -112693 -167221 -122047 58209 -514030 177992 -335691 -141807 -262801 -174474 -151880
11867 -151880 101685 46173 46359 -216025 -100997 368592 -12663 -151447 206258 -128694
11856 -150183 88095 49007 -350565 1392 -105518 10323 -19044 7 13080 -90422 -182237 -312419
11844 -312419 66170 118746 -78560 21046 106540 -158808 -297485 74094 376825 5737 185428
11833A85428b75219o1330J26090b3264i079k77529P4391J01127K023m4165b8393
11821b72935A86374M7265o5130n9753C3139P8872a3443G7300d8844E1062b8516
11809F3526a06730J3192a7738k92220j40144C28562I1649a16604j43468J26659
11799a33413L5888c9646a9700O027F4456e6733H7048J11624b67951f5207j74851
11788b40058Q0887o6425N6169C49511b6135B11456C590K13922d5600A38657K26637
11777C65294J5071j88695P4909C9518h3960A74967a47114C8077J27363a58870
11766f4648k64028h2474j5830A96535C5739d9640j23044F8911K33951c93349A0509
11754A0461f0973b4408k34288J15584N6916j2898C3258N174K01126d6367F4254
$$ plain form
11833 185428 -275219 -336549 -210459 -23264 -9079 -286608 -212217 -111090 -109067 -153232 -28393
11821 -272935 186374 233639 168509 108756 33139 112011 -13443 77300 -48844 51062 -28516
11809 63526 -106730 -93538 -17738 -309958 -450102 328562 91649 -116604 -260072 -133413
11799 -133413 -97525 -39646 -19700 -13673 64456 -56733 87048 198672 -267951 -65207 -240058
11788 -240058 -159171 -225596 -169427 349511 -26135 211456 3590 217512 -45600 138657 365294
11777 365294 380365 191670 266579 39518 -83960 174967 -147114 38077 165440 -158870
11766 -64648 -328676 -82474 -98304 196535 35739 -49640 -172684 68911 302862 -393349 10509
11754 10461 -60973 -24408 -258696 -143112 -86196 -99094 33258 38432 239558 -46367 64254
11742f17383h4487B14496b24800P8906B870K98570H7332d91630A85932C2346b25553
11730a33275H4613a51918A43777J5213D3911a28845l1817k4793Q794a0551l13811
11719c24362A07762B5950L455J37560C8524M1110a34658b1589n4201B9233d8920
11707F6266J9457B0389J47629J34289A31096J68228e7449J0421k2899E1281A8004
11695F29713a96935C65178e1635G711J58105G0072J62851C6817a5449m7391J6041
11684d6799j19794m6722a505H6920C8586P650E058a35142k0416E2873a0129I4558
11671A35681k9510J15427a01868C09713r8635c9240H6446b3359j08109J8446e5976
11659a83137B4430J71197b49373A9630e5252o5918B8081b31323B01373E5787a22901
$$ plain form
11742 -617383 -84487 214496 -224800 -145894 2870 301440 87332 -491630 185932 32346 -225553
11730 -133275 84613 -151918 143777 158990 43911 -128845 -160662 -185455 -176661 -10551 -324362
11719 -324362 107762 25950 29405 166965 38524 79634 -134658 -21589 -75790 29233 -48920
11707 66266 85723 20389 168018 302307 131096 299324 -57449 -47028 -69927 51281 18004
11695 629713 -196935 365178 -51635 7711 165816 70072 232923 36817 -15449 -62840 -46799
11684 -46799 -166593 -213315 -1505 86920 38586 46236 5058 -135142 -155558 52873 -10129 94558
11671 135681 106171 221598 -101868 309713 211078 -39240 86446 -23359 -131468 -113022 -55976
11659 -183137 24430 195627 -249373 19630 -55252 -121170 28081 -231323 201373 55787 -122901
11647b8123o9743C7983b47910B02542g4884A56862a17152K9283l20693F5355a99376
11635I5071c7700r8617J7531k25539a40006A10365h4085q1006A26652H551J01980
11624A10531b970D9151g6011R11l08695C50142A41284a62216B21486b5999r3962
11613a19961k4582I1828a11776A86424c59454B72145c4450q2797k26704c6330
11602A45782Q0875k0213Q452b71876g0650J3051A35642O9021A6891K46923G345
11590e8095C37563b30447e6807j21493B34227o949I5888c970B8381L07642l975
11579C32048a79908a5121A79787b32694c578B18607c4953D5936a39647B96515
11568A46243l559a12909j35296G3772b88388Q9771E6391b6830p4240A26043O2413
$$ plain form
11647 -28123 -97866 37983 -247910 202542 -74884 156862 -117152 -87869 -408562 65355 -199376
11635 95071 -37700 -136317 -118786 -344325 -140006 110365 -84085 -165091 126652 8551 110531
11624 110531 -2970 49151 -76011 -75100 -383795 350142 141284 -162216 221486 -25999 -119961
11613 -119961 -144543 91828 -111776 186424 -359454 272145 -34450 -117247 -343951 -36330
11602 145782 226657 206444 214896 -271876 -70650 -57599 135642 204663 16891 263814 7345
11590 -58095 337563 -230447 -56807 -178300 234227 227278 95888 -3970 28381 336023 332048
11579 332048 -179908 -15121 179787 -232694 -3578 218607 -34953 45936 -139647 296515
11568 146243 142684 -112909 -248205 73772 -288388 -198617 56391 -26830 -101070 126043 188456
11557A88456a77626o9166A07957J09306a8371A51906g8724p5703j4892B09368
11546A89642b7887B08279a95448r8993e7958D3261J3763J07036k6292a07801A59257
11534a08161L4799b8954k25831C3539n513R8703J47139h3250A59503B6514b09949
11522b31428I7753K36556n7056j07968b063A66936k7885a0769A68724A8895Q6643
11511A05538M38N42K63724A03166a6431C06555r1064j00911J19897J89642A51595
11499A17711M6598a96260d3811A95143o0614M2176e8161j27082C28651A31694
11488A20350C1269h1322A17961c15678A10561D6183M34868a77132B17M76779A03722
11476D14241A77979R9885p2042I3165J85648I8901N8002a88057C0545a71027A08253
$$ plain form
11557 188456 -177626 -246792 107957 217263 -18371 151906 -78724 -154427 -169319 209368
11546 189642 -27887 208279 -195448 -294441 -57958 43261 57024 164060 137768 -107801 159257
11534 -108161 -73362 -28954 -254785 33539 28026 126729 273868 -83250 159503 26514 -209949
11522 -231428 97753 334309 277253 169285 -2063 166936 139051 -10769 168724 18895 105538
11511 105538 105976 106518 370242 103166 -16431 306555 215491 114580 234477 424119 151595
11499 117711 164309 -196260 -43811 195143 134529 176705 -58161 -185243 328651 131694
11488 120350 31269 -81322 117961 -315678 110561 46183 481051 -177132 217 476996 103722
11476 414241 177979 277864 205822 93165 278813 98901 156903 -188057 30545 -171027 108253
11464C74054J57945A66684L7674G6108a60904A08686K2085J69438a36287K2881
11454a13406a0520p0700F2040B7939J63503a27425A06819a824A43169a33763j89742
11443c23505d5567l8645A10006D0502J31291R4032f100A17919N295g2120b4578
11431B20136B0012b20282C98639I3433O8922K07704d2878D2387e8626m2088A8747
11419B23043a7089H2868M094c8297m5353c9550C55810G3017k1416g6904e96k32023
11407b32619a476j03640A26846e4263F709N4255l0403g8493b9162j23387c409
11395C87890a52167l133B901L8005Q0052b0064k4904R349r7064B78613d6171C2509
11382A5940Q8717a09098c8410j69892P0249G8233c03071B8288L8266K2006A4955
$$ plain form
11464 374054 531999 166684 204358 76108 -160904 108686 130771 300209 -136287 -113406
11454 -113406 -10520 -81220 62040 27939 191442 -127425 106819 -1824 143169 -133763 -323505
11443 -323505 -45567 -84212 110006 40502 171793 265825 -6100 117919 123214 -72120 -24578
11431 220136 20012 -220282 398639 93433 162355 370059 -42878 42387 -58626 -100714 18747
11419 223043 -17089 82868 86962 -38297 -83650 -39550 355810 73017 51601 -76904 -596 -232619
11407 -232619 -1476 -105116 126846 -54263 6709 60964 30561 -78493 -29162 -152549 -3409
11395 387890 -152167 -155300 2901 40906 120958 -20064 -44968 -35619 -132683 278613 -46171 32509
11382 15940 104657 -109098 -38410 -208302 -138053 78233 -303071 28288 66554 88560 14955
11370f7k06973i1358A36209b42970A25085c9487l9400B38273I7004a03942D6018
11358a20672E7238M3663a7340m344F0511J1369M6515K814c26287d1932a6889l3572
11346e0461A3080d4088l4171G2013R0559r515J34530P2723a24469e193k8882j19084
11334a53159k73456a02330k5270j9649c6528l56837B3434a65394a3397j49181
11324a62578P6454k28519a18913d3810j88508J07392A21994h7909j24427C9237
11313i2147J7534j61420G6050b36580D5521J36470c50214A79975a09206j26357
11303b35563A76092a1933j5979A72323B4631b6118E1593a9647A73756a01998K527
11292i9471A6216d98793a23552b754E6086B4071i1821F7861a69962A0049a09531
$$ plain form
11370 -67 -207040 -91358 136209 -242970 125085 -39487 -78887 238273 97004 -103942 46018
11358 -120672 57238 100901 -17340 -21684 60511 71880 118395 121209 -326287 -41932 -16889 -50461
11346 -50461 13080 -44088 -78259 72013 162572 153057 287587 360310 -124469 -5193 -34075 -153159
11334 -153159 -426615 -102330 -127600 -147249 -36528 -393365 23434 -165394 -13397 -162578
11324 -162578 -86124 -314643 -118913 -43810 -232318 -124926 121994 -87909 -212336 39237
11313 -92147 -74613 -236033 76050 -236580 45521 181991 -350214 179975 -109206 -235563
11303 -235563 176092 -11933 -27912 172323 24631 -26118 51593 -19647 173756 -101998 -99471
11292 -99471 16216 -498793 -123552 -2754 56086 24071 -91821 67861 -169962 10049 -109531
11280b52092d918E7777J5744R7469c02339B18950b14233P0645o3942B5682e4923
11268A50188a54926b7229B91160b53875A03551i3970p432j58311A17590D7037
11257g7479j90977k2587h6876F9807c59697c9970j16423g8157b2210j52829A31450
11245b59505C5530c19864H7820m3591A0884M3823B953c96608a45923B18746c36544
11233a5150p2753K8914A32188m231h6432j46072j83375J76729d6882l4258D4210
11221b87832H1600K48145d00072A09515m3900J6689c30938J28824L2729p9284
11211b48669O1303k4035i8750a9325C01067d2390A50145J3012G7056b73299a23602
11199A15282c00967Q1974l1192j04757C7930J49527a3543F1829L24135b68523
$$ plain form
11280 -252092 -4918 57777 73521 170990 -302339 218950 -214233 -143588 -207530 25682 -54923
11268 150188 -154926 -27229 291160 -253875 103551 -93970 -101402 -259713 117590 47037
11257 -77479 -268456 -291043 -86876 69807 -359697 -39970 -156393 -78157 -22210 -175039 131450
11245 -259505 35530 -319864 87820 44229 10884 54707 2953 -396608 -145923 218746 -336544
11233 -15150 -87903 -58989 132188 127957 -86432 -232504 -415879 -239150 -46882 -81140 44210
11221 -287832 81600 329745 -400072 109515 65615 82304 -330938 -202114 -169385 -248669
11211 -248669 -187366 -211401 -98750 -19325 301067 -42390 150145 163157 77056 -273299 -123602
11199 115282 -300967 -218993 -250185 -354942 37930 187457 -13543 61829 385964 -268523
11188b27466e1334I5917a33870D5347b23744A328q2a39600A74470b0243k19096
11177b39339L3A50714K42012b66386A49424o1567g8685I8134a67546B09456a4053
11165d60351H3418b11827J9637c5172k63166D7360O4092d8817j78085D0161J11547
11154A51708a40031F1657a70881B76745c76029J44441B14034F444N4060K69564
11144C30068h0777A16830f1336j4212m37813A57953J11771d849j03367M9488H5627
11132A14962b93889A76066K53062b45461b9390k05427A66316n8326D6556a00593
11121B1261J10306J7761j8506a11043B47529i5532A21740b16620E21650F8649
11110e76644d7898C4909A4400J79600d27444B53927a3251l8170B82088m6910C5022
$$ plain form
11188 -227466 -51334 95917 -133870 45347 -223744 1328 1246 -139600 174470 -20243 -239339
11177 -239339 -239306 150714 392726 -266386 149424 87857 -78685 98134 -167546 209456 -14053
11165 -460351 83418 -211827 -192190 -35172 -298338 47360 111452 -48817 -226902 40161 151708
11154 151708 -140031 61657 -170881 276745 -376029 -231588 214034 6444 60504 330068
11144 330068 -80777 116830 -61336 -75548 -513361 157953 269724 -4849 -108216 -58728 85627
11132 114962 -293889 176066 429128 -245461 -29390 -234817 166316 107990 46556 -100593
11121 21261 131567 149328 130822 -111043 247529 -95532 121740 -216620 521650 68649
11110 -576644 -47898 34909 14400 194000 -427444 253927 -13251 -51421 282088 235178 35022
11098E0013J70422J78042a11711A28827b2150C36138j22979K8113J36063I8024
11087A71151g495A20899J02073r7774l1464i5464M3166C41758A32272Q4591a9384
11075C96475j85674G594K06914I5103a22710A39856J44847K7245L66415a95144
11064D43176h1180D25208f0851B65775P9825Q4591K55493A52281N03130B54871
11053C74132J19524J93325q6704R3994l9038j37516J19160P9976L4338j55183
11043E96008o2721K73557j86243L77719j01646D41617K96268B87405L61603J33738
11033G82746K3526Q5696j7179l39307J66939j03778j6280n0945j84084J39643
11023D86977J08512L03142k00067j61684r2532J00927j53499M01989k94287Q5689
$$ plain form
11098 50013 220435 398477 -111711 128827 -22150 336138 213159 241272 377335 98024
11087 171151 -7495 120899 222972 125198 93734 -95464 -52298 341758 132272 216863 -19384
11075 396475 210801 7594 214508 95103 -122710 139856 284703 311948 678363 -195144
11064 443176 -81180 425208 -60851 265775 345600 430191 685684 152281 655411 254871
11053 374132 493656 686981 600277 694271 655233 517717 636877 716853 751191 596008
11043 596008 533287 806844 620601 998320 896674 441617 737885 287405 649008 782746
11033 782746 806272 891968 874789 535482 702421 598643 582363 531418 347334 486977
11023 486977 595489 898631 698564 536880 444348 545275 391776 793765 499478 585167
11013E85167j09181K02521N071A78801N49439p0815j30754j07123K44640N2202
11003G16390J6282k01365k3932J19475J09840l7620j16709j52729P9534K14769
10993G23935K11384k86358P4384B98161L46369j54997O0792j24867M6250J89466
10983F61174R6526j20690K40209l44198L63620k8669L66504m4659j91547J00870
10973A099140M55523P4626K7612N83405k67346N70589k77266L00394j50973j40167
10963B275537k08800j67460q4726k31517j30915J36869l21710L09915k96958j40507
10953A139728K67483r45j03564J89991l1244n56455K31047k14165q0984j36920
10943G03972j17666k03527p6075H024a81076B05188K6493N2632p8978a18706A95874
$$ plain form
11013 585167 475986 678507 683578 178801 728240 657425 526671 419548 664188 716390
11003 716390 732672 531307 507375 626850 736690 699070 582361 429632 509166 723935
10993 723935 935319 648961 723345 298161 644530 489533 550325 425458 471708 661174
10983 661174 757700 637010 877219 533021 896641 867972 1234476 1189817 998270 1099140
10973 1099140 1554663 1629289 1656901 2240306 1972960 2543549 2266283 2566677 2415704 2275537
10963 2275537 2066737 1899277 1814551 1583034 1452119 1588988 1267278 1577193 1280235 1139728
10953 1139728 1407211 1406266 1302702 1492693 1461449 904994 1136041 921876 840892 703972
10943 703972 586306 382779 306704 8024 -181076 205188 231681 284313 205335 -118706 195874
10931C84655a25769k26320A35379l0734b09330C01056j09805A1150f1698B42713
10920C2001j4054i857B58327E2696a01996B38659a94347B32848b94816C82805
10909A70370e3790B97545L7707j31543K14593A9050a8246A30790a34663c3617
10898A26031c7878m8247A17497Q1622a08657K2270b4228B6594a38671C18974f2751
10886a09974k11937J28602d0836m49037B43369a54880P7190D0441J24530b71827
10875f8189B44987b65226A96308a59469L2367k4748A57978a33089e0428j33765
10865a84193q4239L2205a02528E4666l378j0778L8590J56679j9058A992J83242
10854A85234k2401a09782A6017b25000d1021J618B52839c21685a6606A81244g4624
$$ plain form
10931 384655 -125769 -352089 135379 104645 -209330 301056 191251 11150 -61698 242713
10920 32001 17947 -9857 258327 52696 -101996 238659 -194347 232848 -294816 382805
10909 170370 -53790 297545 335252 203709 418302 19050 -18246 130790 -134663 -33617
10898 126031 -37878 -86125 117497 199119 -108657 -86387 -24228 26594 -138671 318974 -62751
10886 -109974 -321911 -193309 -40836 -489873 243369 -154880 -77690 40441 164971 -271827
10875 -68189 244987 -265226 196308 -159469 -127102 -151850 157978 -133089 -50428 -184193
10865 -184193 -268432 -236227 -102528 54666 51288 40510 79100 235779 216721 1992 185234
10854 185234 162833 -109782 16017 -225000 -41021 -39403 252839 -321685 -16606 181244 -74624
10842B18461a20560K4662A7903N4179J85465a73433L3008q7816J13654H9534q516
10831H1018a28499Q836k1087K399G3730f8086j81910A21255b63415R4970J6549
10820a51896C8955b23594J07526j01664A10055j9903a50400B66310f7910j03968
10810a71878A44467a8698A36001b47103C53442A74395b7006C51418d15668f2760
10799b86623q2842f6906B6778K20799c06497B37889b41545d3684l90203A07952
10788a45745C8879Q0422i215E2199P2112a24776k85860e0265A46279M3885a07175
10776D559c6666l6820K0145A47086a60919j78301I3267J71455D9342M0052B2823
10764b33424f8705H6725r710a80101k6583a1530A13944i5757j67676j51209J58277
$$ plain form
10842 218461 -120560 -95898 17903 72082 257547 -173433 -140425 -228241 -114587 89534 81018
10831 81018 -128499 -119663 -140750 -138351 73730 -68086 -249996 121255 -263415 -168445 -151896
10820 -151896 38955 -223594 -116068 -217732 110055 90152 -150400 266310 -67910 -171878
10810 -171878 144467 -18698 136001 -247103 353442 174395 -27006 351418 -415668 -62760
10799 -286623 -369465 -66906 26778 247577 -306497 237889 -241545 -43684 -433887 107952
10788 -145745 38879 119301 -9215 52199 124311 -124776 -410636 -50265 146279 190164 -107175
10776 4559 -36666 -73486 -53341 147086 -160919 -339220 93267 264722 49342 89394 22823
10764 -233424 -68705 86725 77015 -180101 -206684 -11530 113944 -95757 -263433 -414642 -256365
10753b56365m5818l099J42509E0834a95439H052h7951E8216K45943j38219J59175
10742C25115f6411c2678j13181C46804g639j84800E7275g2642n3152b260k43089
10731b45349Q6103J7245B41714h4021A93705F2825Q49d4682B03525a11770q4059
10720a95829b7028j6176j09101C30064A50860a01332C3938a79172H5456j3421
10710G2035k5602g5261n2363e5758p204j98574e1345I7381j5291b46934R5782
10699a51152o1152i3244G5311b98220K1584a23772c9789p5230J6027p6722B58064
10687c6092q2387M3859a9582l63716f6378a1302E3161J62750a10003j16104q0226
10676c06333h4152K7564A1649b35217i1943k595j72779p3186a24240j53285d104
$$ plain form
10753 -256365 -302183 -305282 -162773 50834 -195439 8052 -87951 58216 304159 165940 325115
10742 325115 -66411 -32678 -145859 346804 -7639 -192439 57275 -72642 -125794 -2260 -245349
10731 -245349 -159246 -142001 241714 -84021 193705 62825 63674 -44682 203525 -111770 -195829
10720 -195829 -27028 -43204 -152305 330064 150860 -101332 33938 -179172 85456 72035
10710 72035 46433 -75261 -127624 -55758 -62962 -261536 -51345 97381 82090 -246934 -151152
10699 -151152 -212304 -93244 75311 -298220 -276636 -123772 -39789 -115019 -98992 -175714 258064
10687 -36092 -118479 -74620 -19582 -383298 -66378 -11302 53161 215911 -110003 -226107 -306333
10676 -306333 -84152 -56588 11649 -235217 -91943 -94538 -267317 -340503 -124240 -277525 -4104
10664B8778c68427b8533n818j62687A56978E5409b81341G5231P296b99339N5553
10653b43786M3259A85048h1722l9278E7991R5082c08435f3356C42271a45153k210
10642a47363B8241a29891j88896a07805k72439f3992k20286a38635j57823B7702
10631d48170J04859a1754m4881O672A9167J37123m6915m9190Q1658L26436G3196
10619A15721a32425j62855j7732B11511G4866b11709j08754a14820Q605G4442
10608b63003C327a11272A20174i4540A77654d6380l8156j68524Q6800j3459l3239
10597b12958f7972A75242B323c8770j96133b0153r2418B63241a30172G6485f2570
10585e236j4502B0796R8716g656o9718r7766l1524n5406o4437J48142Q1691A56553
$$ plain form
10664 28778 -368427 -28533 -34351 -197038 156978 55409 -281341 75231 82527 -299339 -243786
10653 -243786 -200527 185048 -81722 -121000 57991 153073 -308435 -63356 342271 -145153 -147363
10642 -147363 28241 -129891 -318787 -107805 -380244 -63992 -284278 -138635 -296458 27702
10631 -448170 -343311 -11754 -56635 -49963 19167 156290 109375 60185 141843 468279 73196
10619 115721 -132425 -295280 -313012 211511 74866 -211709 -320463 -114820 -106215 74442
10608 -263003 3327 -111272 120174 -94540 177654 -46380 -84536 -253060 -166260 -179719 -212958
10597 -212958 -67972 175242 2323 -38770 -234903 -20153 -112571 263241 -130172 76485 -62570
10585 -5236 -19738 20796 119512 -7656 -77374 -175140 -206664 -262070 -326507 -178365 -96674 156553
10572a40583J9139A72973a99874A86189c41587a60675O1647c1120j97623B28614
10561A67988a95345J8043I0824J51884A1295c0287m21210H0603a24812H0280Q2761
10550A63041a9133j46168l4897e1205l14911c7409q337k8156p5372H4216e8553
10538A1432L07745c57130b108D9487d9371o0888J1020d2547D8671c97080A63498
10526G2715b7614m0709p0040A54160D585R1027i6648k25421E8627J54362l1624
10515A81365c65692e7793j22797C71L2536P6816m0768D271a59742B06168g7465
10503a7370n9234j12128F2053j4535c27434C4517L06745F5914J6077a06031d5786
10491g5184j49682G8615c02584B92177f1693A13604a8839k40738C0891J87296
$$ plain form
10572 -140583 -121444 172973 -199874 186189 -341587 -160675 -99028 -31120 -228743 228614
10561 167988 -195345 -177302 90824 242708 11295 -30287 -451497 80603 -124812 80280 163041
10550 163041 -19133 -165301 -200198 -51205 -366116 -37409 -45746 -73902 -149274 84216 -58553
10538 11432 319177 -357130 -2108 49487 -49371 -110259 -99239 -42547 48671 -397080 163498
10526 72715 -27614 -68323 -138363 154160 4585 95612 -96648 -322069 58627 212989 181365
10515 181365 -365692 -57793 -180590 371 32907 109723 68955 4271 -159742 206168 -77465
10503 -17370 -76604 -188732 62053 47518 -327434 34517 341262 65914 81991 -106031 -45786
10491 -75184 -224866 78615 -302584 292177 -61693 113604 -18839 -259577 30891 218187
10481B18187c7547l45580C17631b636A18122L7159K64207r3936K31569j26630
10471D30491j12178A31354b53390R5908C1477h0806A14122a4469j45958h397A06172
10459b93507j45P8643N2739A01285F627K93101A02176a85191j27016j11760A03727
10447A7307f1554P545I2111f1801f531B5703q18j1324e3500Q258i83k24473h8493
10433F2014a29790k20315D6941a52616L6972A16868D1117b20670C40741A1775
10422A35174D1490K42142C1615N2625f1654r3880E6566b9893J4630C53597a92969
10410d90720a02447j49906I1266k7107K27102b3385B73947b4641A06637D437Q3911
10399H8348A9325a72613m1130B0862a74049D1178a01011H1185k9930a08977B3998
$$ plain form
10481 218187 -37547 -383127 317631 -2636 118122 155281 419488 325552 557121 430491
10471 430491 318313 131354 -253390 -157482 31477 -80806 114122 -14469 -160427 -8397 106172
10459 -293507 -293652 -215009 -162270 101285 6627 299728 102176 -185191 -312207 -423967 103727
10447 17307 -61554 -54009 92111 -61801 -6531 25703 24885 13561 -53500 -45242 -983 -225456 -88493
10433 62014 -129790 -350105 46941 -152616 -115644 116868 41117 -220670 340741 11775
10422 135174 41490 283632 31615 84240 -61654 -155534 56566 -29893 -15263 353597 -192969
10410 -490720 -102447 -252353 91266 64159 291261 -23385 273947 -24641 106637 4437 88348
10399 88348 19325 -172613 -213743 20862 -174049 41178 -101011 81185 51255 -108977 23998
10387a10113c3374B68252j08223c4599l21713B17806g5921J9459C12677A07259
10376a14439A57074K18933a15897o4678A76251J50759b73382B58956j0938O5656
10366C13674N10965e4372E39560A19235o859P3424M65783B30889K45936J7437
10356D94262k6358j04738a19401k21060E4890K37938Q724k919r5838L65836A93718
10344D09809A795J8490K90473N4898J32513k23598J28656b7061B55487c07475
10333F7055N05205A56207O0014h0263A24021f4241@A56435b30A00052a39439C50141
10320A70807c0219B66876f3964A88664b24717c6294C80400j68278P0840L0292
10310C13254a85506B83687A01049i8977b0598E53431a07544B72435a36995n0285
$$ plain form
10387 -110113 -33374 268252 160029 -34599 -356312 217806 -75921 -56462 312677 107259
10376 -114439 157074 376007 -115897 -180575 176251 327010 -273382 258956 248018 313674
10366 313674 824639 -54372 539560 119235 112376 185800 651583 230889 476825 494262
10356 494262 467904 363166 -119401 -340461 54890 292828 301552 298633 202795 568631 193718
10344 409809 1795 20285 310758 365656 498169 274571 403227 -27061 255487 -307475
10333 67055 572260 156207 216221 -80263 124021 -64241 0 156435 -230 100052 -139439 350141
10320 170807 -30219 266876 -63964 188664 -224717 -36294 380400 212122 282962 313254
10310 313254 -185506 283687 101049 -98977 -20598 553431 -107544 272435 -136995 -187280
10300a87280I6391J03483b37406j139L3224A4271J12282b13331e1943B36016D3719
10288g790j82250K3959H7970k9717b13760q6309I3923a22082C34947d96612H3665
10276a61903E9868a88743c6346B2719e33330e2445l46406b9225b173j71981B6990
10264A1429a95344N7015c5647A59175l5452g981I5629a85454e5867j20898B86492
10252D35917A33061f562F1228J30801o1750C4006g6441G0817j0428a8998j36055
10241a55053e4410F4054a80284A33128C973N4468a88237Q2657o0342N7185C4072
10229b39299J11760F5729B2328M8655g3118A88209Q5533E5052A5449h6686j42548
10218b29234A80580G6008h2745A37856R0685c40804b1231L418k21524A7274e0403
$$ plain form
10300 -187280 96391 199874 -237406 -238545 -205321 14271 126553 -213331 -51943 236016 43719
10288 -7790 -190040 -166081 87970 58253 -213760 -300069 93923 -122082 334947 -496612 83665
10276 -161903 59868 -188743 -36346 22719 -533330 -52445 -398851 -29225 -2173 -174154 26990
10264 11429 -195344 -138329 -35647 159175 123723 -7981 95629 -185454 -55867 -176765 286492
10252 435917 133061 -6562 61228 192029 130279 34006 -76441 70817 60389 -18998 -155053
10241 -155053 -54410 64054 -180284 133128 3973 58441 -188237 -105580 -165922 -108737 34072
10229 -239299 -127539 65729 22328 70983 -73118 188209 273742 55052 15449 -86686 -229234
10218 -229234 180580 76008 -82745 137856 228541 -340804 -21231 -17813 -239337 17274 -50403
10206a19154l29235a76673A09966d3768k45028J07459q1255E2216a36129j64172
10196c00301B98536D3918J27465a53736C04747F0402K62402a11231B2923Q4066
10186A06989e3850k9979j22610B5578g4914j47249a03912r5335f3852j24386C7402
10174A80119N2994h820r3784D2739b30904O1911b5136j76057A53747A1701h2215
10162B10474D4008I007e161H6792b71398E6568b26387B88710c66738B12370D3046
10150f2995o0570k22638f2232a2393j25519C0083b94457R6724b294l88249F8104
10138G3530e7716m33618g6018j435A28826a73746N2294j25635g7168l8251j57034
10127b72453A39824a18771q9527A80392b74080k04423e4642E6532a35328k0414
$$ plain form
10206 -119154 -448389 -176673 109966 -43768 -288796 -181337 -262592 52216 -136129 -300301
10196 -300301 298536 43918 171383 -153736 304747 60402 322804 -111231 22923 106989
10186 106989 -53850 -83829 -206439 25578 -74914 -222163 -103912 -199247 -63852 -188238 37402
10174 180119 233113 -8820 -102604 42739 -230904 -168993 -25136 -201193 153747 11701 -82215
10162 210474 44008 9007 -5161 86792 -271398 56568 -226387 288710 -366738 212370 43046
10150 -62995 -123565 -346203 -62232 -12393 -137912 30083 -294457 -197733 -2294 -390543 68104
10138 73530 -57716 -491334 -76018 -77453 128826 -173746 -121452 -247087 -77168 -115419 -272453
10127 -272453 139824 -118771 -208298 180392 -274080 -478503 -54642 56532 -135328 -155742
10117a55742L5211d8661o3234k6313m9928A09842M3154a84606b3467A15658g2448
10105b08718B77321D3873P9536l2758j8122g3707j02837g4166G9442a41287c9731
10093i126j80988B16464I531c41782a48600B84979A14045b5989J2277L96p9567
10082i2883D7803J8416J60014B9428e6252A70800c88095e2716j42206k86964a49642
10070a73098f6102K3034k50936d842n3738p3577A30685b70824d964A47654b80950
10058G4050K7482i965p5352B56466e11m9609k01056R9256M1859G2070f9109B4446
10045b67153j41639K02003h0975A73060b48552d3768j51754j8584j51010H4913
10034g7046q3806D3909a6659o3476A1998c1781E8547j5638J25535o1060b2320
$$ plain form
10117 -155742 -120531 -48661 -111895 -138208 -188136 109842 152996 -184606 -23467 115658 -72448
10105 -208718 277321 43873 123409 90651 72529 -73707 -176544 -74166 79442 -141287 -39731
10093 -9126 -190114 216464 9531 -341782 -148600 284979 114045 -25989 -13712 -13316 -92883
10082 -92883 47803 66219 226233 29428 -56252 170800 -388095 -52716 -194922 -481886 -149642
10070 -173098 -66102 -43068 -294004 -4842 -58580 -132157 130685 -270824 -4964 147654 -280950
10058 74050 101532 -9965 -85317 256466 -511 -50120 -251176 -151920 -110061 72070 -69109 24446
10045 -267153 -408792 -206789 -80975 173060 -248552 -43768 -195522 -214106 -365116 84913
10034 -77046 -160852 43909 -16659 -80135 11998 -31781 58547 42909 168444 107384 -22320
10022h4348r0332q2259H6499c17565J04595j4911H172P1717R6695a5565j77321
10011a92886j37930I393J00851a43164q4669h454A74091F0597g3302p773G051
9999I2237l0835b79416q1685J8574o3951b7733F8941e8118k70117J50059H6004
9987C08375a57724P4298j26487i2202j25822B2417a52879j92727D3395Q9829b77061
9975a53180j1176C9629b37131m240M1342J1010A39075D2044J456f9305B56629
9963B70670m8812b11605h4406C11074g4561I779a1786j87833O7665D9694j2329
9952C7365J50199a6039j8715B75969F2643a37737A26511j1524P8631J0788a25219
9940b18283h7874I5627m6047R8010e80258a33138D5717a79148B83395d8330k19229
$$ plain form
10022 -84348 -174680 -256939 86499 -317565 -212970 -227881 8172 79889 176584 -15565 -192886
10011 -192886 -330816 9393 110244 -143164 -227833 -8454 174091 60597 -73302 -81075 7051
9999 92237 61402 -279416 -361101 -342527 -406478 -27733 68941 -58118 -328235 -178176 86004
9987 308375 -157724 -83426 -209913 -92202 -218024 22417 -152879 -345606 43395 133224 -277061
9975 -153180 -164356 39629 -237131 -241371 -200029 -189019 139075 42044 43500 -69305 256629
9963 270670 221858 -211605 -84406 311074 -74561 9779 -11786 -199619 -131954 49694 37365
9952 37365 187564 -16039 -34754 275969 62643 -137737 126511 114987 193618 204406 -125219
9940 -218283 -87874 95627 49580 147590 -580258 -133138 45717 -179148 283395 -48330 -267559
9929b67559h6258E0342f1455l47624a97430I3522b09606A59575i375j22542O3039
9918f8878b01A04391a31399l43377Q0868I1190r010c30602C9515f760j96527h87
9905a68789h3561C56609B0689K23089c58679J13648A91567d3243j0034j73109
9895b26386B22564c32411C1406a89917N6487k70100A46309d02398h3632C24856
9884A29394R898b16519O5531M2562Q084b9484n4153j18358b7282o3175E8460b12058
9871b01418R3721o2964H8146b41410j1570e3572k96801a00453q3774k59695k1880
9860d65802b9471k40376K6582c2103C1013a45732L2292k69903A70629b02312A00940
9848d88613A47321m2615A6918J19609K3183a46800A2874k457c77220a68260B16393
$$ plain form
9929 -267559 -86258 50342 -61455 -409079 -197430 93522 -209606 159575 -9375 -131917 -68878
9918 -68878 -201 104391 -131399 -474776 -393908 91190 82180 -330602 39515 -6760 -203287 -887
9905 -168789 -83561 356609 20689 243778 -358679 -245031 191567 -43243 -53277 -226386
9895 -226386 222564 -332411 31406 -189917 -133430 -403530 146309 -402398 -83632 324856
9884 129394 139292 -216519 -150988 -108426 -100342 -29484 -83637 -201995 -27282 -90457 58460 -212058
9871 -201418 -107697 -170661 88146 -241410 -252980 -53572 -350373 -100453 -184227 -443922 -465802
9860 -465802 -29471 -269847 -243265 -32103 31013 -145732 -113440 -383343 170629 -202312 100940
9848 -488613 147321 104706 16918 136527 159710 -146800 12874 10417 -377220 -168260 216393
9836a70321F637L97101a64979P2121B20204b65887I7929b05425B00766c46474
9825a10047J460k9100M1895G7054a4863j97562A7062J2540a5184k5147C88839
9813D9925a26432k13257k107i0503l2125l9359A80022A885c190H900c05352F2174
9800B50128a27364F6496A7918J57913c7466B23759d2217k82395a07730n3629F8891
9788D2763a23465c0119l28770c65j82656O8180A2222L0304L7773b73391J31625
9777a41766G7146l0294N6955a22732q8794A89555c37274L9046B06964a20372B64101
9765F3021a73032B07928b89611a811k89292J478d4684L547j367m625k4893B73628
9752D0749c37611a21916A9309j013d60390H3106a19467j69512d8245k40545J17651
$$ plain form
9836 -170321 6637 403738 -164979 -92858 220204 -265887 97929 -205425 200766 -346474
9825 -110047 -108587 -137687 -95792 77054 -14863 -212425 17062 29602 -15184 -40331 388839
9813 49925 -126432 -339689 -341796 -90503 -122628 -161987 180022 1885 -3190 8900 -305352 62174
9800 250128 -127364 66496 17918 175831 -37466 223759 -42217 -324612 -107730 -161359 68891
9788 42763 -123465 -30119 -358889 -365 -183021 -114841 12222 42526 80299 -273391 -141766
9777 -141766 77146 46852 103807 -122732 -211526 189555 -337274 -298228 206964 -120372 264101
9765 63021 -173032 207928 -289611 -1811 -291103 -289625 -44684 -41137 -42504 -47129 -72022 273628
9752 40749 -337611 -121916 19309 18296 -460390 83106 -119467 -288979 -48245 -288790 -171139
9741a71139k5311B80735D1034a66531n2727f9499h898g93j28894q9095a3908n5246
9729f9154A25807a49880j02691h5533A69452a9499o5121j92141a9949j98508e7619
9717e3720j23445o8168C738J9297H866K93296B9416Q7660J58655h9436A54445
9705B33598J60032A50319a26384l8591B25329a68525Q2423d2262C16985A32113
9694B31214c74288e390r1844m7832L352k37132A2141g0356a7692A27649G966K6342
9682C4308d52452a59059c9167l39853f9264A24148m2746k4394c04429B58822A07822
9670g2840I1300J55177D2410Q0121f9335D9802a79716F0480b03832g8558B38851
9658a37404o746B6435c1276C6587a698r3325A24019J15905q9110B0257d6645B0069
$$ plain form
9741 -171139 -196450 280735 41034 -166531 -219258 -69499 -8898 -793 -129687 -218782 -13908 -69154
9729 -69154 125807 -149880 -252571 -85533 169452 -19499 -84620 -276761 -19949 -218457 -57619
9717 -53720 -177165 -245333 3738 23035 8866 302162 29416 117076 275731 -89436 154445
9705 233598 393630 150319 -126384 -164975 225329 -168525 -86102 -42262 316985 132113
9694 231214 -374288 -5390 -97234 -145066 -141714 -378846 12141 -70356 -17692 127649 7966 34308
9682 34308 -452452 -159059 -39167 -379020 -69264 124148 81402 57008 -304429 258822 107822
9670 -72840 91300 246477 42410 122531 -69335 49802 -179716 60480 -203832 -78558 238851
9658 -137404 -144150 26435 -31276 36587 -1698 -95023 124019 239924 150814 20257 -46645 20069
9645f1898J7228A51178c34549d5433k23014J11224L6027d6226j47857L6739j29760
9634b87104d973m5146b3493r196j81132k40553b20645O997C335d01950h0093b5075
9621a66326B41231a57926f7901B78628c36722A27275c91677i0993A44586M1099
9611A85685L8028a96705B32304I6095b64688d018C62684b07229L1284J5667N0931
9600a09347q3463Q8442k36545P196J19615A62417C0644r178J84493F18b30762
9588A61244b83007O4199B5677b59071N4696B48119f7927A21789N0813e5072p280
9577f2352l27228a82209p9146e9476B6143e7980n0466k40170B8367J6207J17774
9566A62348D0663a91066D6733J86377b87608G8117f3494j59336B80350a95055
$$ plain form
9645 -61898 -44670 151178 -334549 -45433 -268447 -157223 -121196 -46226 -194083 -157344 -287104
9634 -287104 -4973 -50119 -23493 -32689 -213821 -454374 -220645 -213648 3335 -401950 -80093 -25075
9621 -166326 241231 -157926 -67901 278628 -336722 127275 -391677 -90993 144586 185685
9611 185685 223713 -196705 232304 96095 -264688 -4018 362684 -207229 -175945 -160278 -109347
9600 -109347 -192810 -104368 -340913 -333717 -214102 162417 30644 21466 205959 618 -230762
9588 161244 -283007 -218808 25677 -259071 -204375 248119 -67927 121789 172602 -55072 -62352
9577 -62352 -389580 -182209 -261355 -59476 26143 -57980 -108446 -348616 28367 44574 162348
9566 162348 40663 -191066 46733 233110 -287608 78117 -63494 -222830 280350 -195055
9555a019m16011P4675a36082D3652b22203J02186c1033o0874j49844C8a50177
9543a28862C5666Q1673c32958B54666b77366B5436d9630N889l8467j96008h0929
9531b2060j75777h6298l39168g1119l585m1073n3843A23355m6064D016M0954R7543
9519A42513i0290l23181c8525A72159j0625a16239G5468K00952i7149c6740l93595
9508d30335A61340j6297b16794B74206f7066A10547b40806J00777L8471K1844
9498g9714E9373J73415a47255l88479D5390J65935c50351B16474b31622R953f5712
9486D4615a36539l46661J34660F1057K09716A12155N080a52635A34828D7115a2436
9474F5878K0785a22259J4650A36706b89135d324D9781f4017m9779k44820J01311
$$ plain form
9555 -1019 -417030 -342355 -136082 43652 -222203 -120017 -31033 -91907 -241751 38 -150177
9543 -128862 35666 117339 -332958 254666 -277366 25436 -49630 -43741 -82208 -278216 -80929
9531 -22060 -197837 -86298 -425466 -71119 -74704 -115777 -169620 123355 77291 4016 44970 142513
9519 142513 -90290 -413471 -38525 172159 161534 -116239 75468 276420 -97149 -36740 -430335
9508 -430335 161340 145043 -216794 274206 -67066 110547 -240806 -140029 -101558 -79714
9498 -79714 59373 232788 -147255 -535734 45390 211325 -350351 216474 -231622 -221669 -65712
9486 44615 -136539 -483200 -348540 61057 270773 112155 117235 -152635 134828 47115 -12436
9474 65878 86663 -122259 -107609 136706 -289135 -4324 49781 -64017 -113796 -358616 -257305
9463b57305C59202A02379a5696j15212f3618k95612A15436a50981A6460P2097
9453H8557a43396o549l8630L2496a8894E7533b60991g4923D6491b14606I8606
9441e4499C87596j90814c53444A03457b14225k14318A15272M0694m6382b35140
9430I0585a08153a1915F4755h7887l06304B54347c58277J73171A82770D5233a2076
9418e8657j05952C1422b14266A5726e75421a43267j46845g7694o026L1494A89979
9406B0724i7935B30653a24626j64795G95h3255L6667A55131i210l15879b6787
9394i6346j13040i3803o9356n9365A14277A8326d06566b0216m08047a2041l71312
9383c83353A47331k5386a87847p324E3112N29L9933K4630M003a81070K8768n0296
$$ plain form
9463 -257305 359202 102379 -15696 -130908 -63618 -359230 115436 -150981 16460 88557
9453 88557 -143396 -149945 -188575 -156079 -18894 57533 -260991 -74923 46491 -214606 98606
9441 -54499 387596 196782 -353444 103457 -214225 -428543 115272 155966 109584 -235140
9430 90585 -108153 -11915 64755 -87887 -394191 254347 -358277 -185106 182770 45233 -12076
9418 -58657 -164609 31422 -214266 15726 -575421 -143267 -290112 -77694 -83720 -52226 189979
9406 20724 -97935 230653 -124626 -289421 795 -83255 -46588 155131 -9210 -325089 -26787
9394 -96346 -209386 -93803 -163159 -222524 114277 18326 -406566 -20216 -428263 -12041 -383353
9383 -383353 147331 121945 -187847 -195171 53112 53641 93574 118204 122207 -181070 -152302 -202598
9371b02598D2857Q5396b7150H6663M8790J05349k3149b06877q8471f009o6373
9360g2382j974A73107l1325B413L90949i6582j10373j24495a25128J4423C03104
9348e90766b45684B53061d2432l29599J62355E1400h4320j27357G6747a89796
9337H4789k7420a56822b4544j67305B21432a64659A29588b13912H9568Q8056a43824
9325a59006g8898I3296b57825A0148a82934G3134i6892L5529j88597J05243g0160
9313D3139a03740m8789A35306a03529A07393Q958e2258A65703D5892B0927f1499
9301c22703h8353E5765O3330D1852c05229A67214b04753M6592a6491p8423p9690
9290a74604D370a71762N6764e5884B7978i1990k2791j50825H384a49606e6583
$$ plain form
9371 -202598 42857 128253 -27150 86663 135453 240802 217653 -206877 -295348 -6009 -72382
9360 -72382 -74356 173107 141782 2413 393362 -96582 -206955 -331450 -125128 -110705 303104
9348 -590766 -245684 253061 -42432 -372031 -209676 51400 -84320 -211677 76747 -189796
9337 84789 57369 -156822 -24544 -191849 221432 -164659 129588 -213912 89568 177624 -143824
9325 -159006 -78898 93296 -257825 10148 -182934 73134 -96892 -61363 -249960 -144717 -70160
9313 43139 -103740 -152529 135306 -103529 107393 116351 -52258 165703 45892 20927 -61499
9301 -322703 -88353 55765 119095 41852 -305229 167214 -204753 -158161 -16491 -94914 -174604
9290 -174604 4370 -171762 -114998 -55884 27978 -91990 -114781 -265606 8384 -149606 -56583
9278C49595H6535e3727j91788a13539k13195c0101A76254L5705a57646k06081
9268c63727J02303A81748h1483A01651f9408C46537c16136L7217a02172j26300
9258b28472o6403B56532P4714c50081J56152c3258o4071k9167G3196A5530Q5253
9247A00783l9686e3474m2289q3112a2393j78375b5895H4557a57505B1487a13061
9235F2395c53545R9110A07220B8799d6903j38286C57426d58201J42485j5166O1781
9224b69101B5435L2210K8654d96882A78903N4899r4383j0814c4337B8557b75771
9212A37161c9623o1395l47240d38j14519A57709a21984B18367a88073B1169f926
9200A7014b11087I2086f1409o5436c622A3838O5505c22317a57199e5494J6048
$$ plain form
9278 349595 86535 -53727 -245515 -113539 -326734 -30101 176254 211959 -157646 -363727
9268 -363727 -261424 181748 -81483 101651 -69408 346537 -316136 -278919 -102172 -228472
9258 -228472 -294875 256532 331246 -350081 -193929 -33258 -97329 -126496 73196 15530 100783
9247 100783 61097 -53474 -95763 -178875 -12393 -190768 -25895 84557 -157505 21487 -113061
9235 62395 -353545 -254435 107220 28799 -46903 -185189 357426 -458201 -315716 -330882 -269101
9224 -269101 25435 57645 86299 -496882 178903 233802 139419 128605 -34337 28557 -275771
9212 137161 -39623 -101018 -448258 -438 -114957 157709 -121984 218367 -188073 21169 -6926
9200 17014 -211087 92086 -61409 -126845 -3622 13838 79343 -322317 -157199 -55494 -39446
9189c9446k70584r8643K6865h7221j468J3992j67891A15285a15038e6176J2964
9178d3212A34710B9362h6444a4335A93555b47168A72803Q2355i0853l9160E6800
9166F5535B6145e501A39766a4210r5605m3256a2276C3412K5018i2657B46072b93407
9153G7038b79388m9848B85094a49402M6227q426d7156A2459J45138b27440o5473
9142b92913h0953l8983B21167c94822B87533b47929K4573B9985Q1031A9666a43024
9130b20837B14332e1543m37517J49448H7802A9855a36683p7307i8674B1410a49756
9118B89398a67593K5868C13504a87361I5054a46050O8614p4209C1448b67602a00163
9106D9399J06398e0942j35673j09423R6949C9459c28163J58515A01179c33934
$$ plain form
9189 -39446 -310030 -408673 -381808 -87221 -88689 -74697 -242588 115285 -115038 -56176 -43212
9178 -43212 134710 29362 -86444 -14335 193555 -247168 172803 255158 -90853 -130013 56800
9166 65535 26145 -5501 139766 -14210 -109815 -153071 -12276 33412 58430 -92657 246072 -293407
9153 77038 -279388 -329236 285094 -149402 -103175 -111601 -47156 12459 157597 -227440 -292913
9142 -292913 -80953 -119936 221167 -394822 287533 -247929 -223356 29985 111016 19666 -143024
9130 -220837 214332 -51543 -489060 -339612 87802 19855 -136683 -213990 -98674 21410 -149756
9118 289398 -167593 -141725 313504 -187361 95054 -146050 -77436 -151645 31448 -267602 -100163
9106 49399 155797 -50942 -186615 -296038 -199089 39459 -328163 -169648 101179 -333934
9095C15030e3896k2499K6265K3243j7742A55648c46990f6354k3670j20963N8371
9084a52616k30330e0751r0133A25483H975d5109n767A6156o557g6413k31381k9314
9072c37108I2313Q3167h2134B69454b00472R588i0202l15133a35193A01679d16343
9060A71383Q6488c65758O8601L3838J10932C01044E9096h0013n2849A84783b9690
9048b52966R4815A40005P8461q1117a53584A52672O9188a72475J2846C09500F1843
9036A9051g2271B0795f6740A71739g3638C68028e59889f829j16604j810B63345
9024a48122c1228E4393K3243N6231e4484k08255I8363J13432r6546d2085l26811
9013c68896F8929a45073j65189a48778f9236l9658H2442b68070A50325c34453
$$ plain form
9095 315030 -53896 -76395 -50130 -26887 -44629 155648 -346990 -66354 -90024 -210987 -152616
9084 -152616 -382946 -50751 -140884 125483 8975 -45109 -50876 16156 9599 -76413 -307794 -337108
9072 -337108 92313 175480 -82134 269454 -200472 -190884 -90202 -405335 -135193 101679 -416343
9060 171383 257871 -365758 -297157 -263319 -152387 301044 59096 -80013 -132862 184783 -29690
9048 -252966 -158151 140005 218466 137349 -153584 152672 221860 -172475 -159629 309500 61843
9036 19051 -72271 20795 -66740 171739 -73638 368028 -559889 -6829 -123433 -125243 263345
9024 -148122 -31228 54393 77636 133867 -54484 -262739 98363 211795 115249 -42085 -368896
9013 -368896 68929 -145073 -310262 -148778 -69236 -108894 82442 -268070 150325 -334453
9002d1895m3941L5180k7675C7867b13255J6147B695L36479A03642H497a91318
8990A96145a18677k01877D0047A1961J96763c61295i0146A00528D749N6135h2556
8978a73935G0549c64706J11857E1981d7497j41480h5173k3758B98031O1153a77135
8966e51335C11323a69898J1894C2462a61300I3083a85549A93172D1072c56468
8955b31782J8419B16710B9433A1045b44728B0933K17706a18303j11026d5620k21901
8944b67521B43109J8527a23790B26050H9260a40403l9822f448H3765Q1629n4846
8933A10548L26200A31021n010a92944j45884B72967c56294C54739P0678A5458
8922B54655F3329N71063K652580Q430579n553360A669003F81672j49028a46231
$$ plain form
9002 -41895 -85836 -50656 -78331 37867 -213255 -197108 2695 339174 103642 8497 -191318
8990 196145 -118677 -320554 40047 11961 208724 -361295 -90146 100528 4749 60884 -82556
8978 -173935 70549 -364706 -252849 51981 -47497 -188977 -85173 -108931 298031 359184 -177135
8966 -551335 311323 -169898 -158004 32462 -161300 93083 -185549 193172 41072 -356468
8955 -231782 -213363 216710 29433 11045 -244728 20933 238639 -118303 -229329 -45620 -267521
8944 -267521 243109 261636 -123790 226050 89260 -140403 -180225 -6448 83765 165394 110548
8933 110548 436748 131021 126011 -192944 -338828 272967 -356294 354739 425417 15458
8922 254655 63329 634392 3286972 11717551 6164191 1669003 681672 532644 -146231
8912H9909M0475a81688m4057C6489b4297j2195B27407h359j4758j23931K216I824
8899b14484e3969j17050F1694J54529D2139b43861B30177F1823g0390B4662a7494
8887b09237K6866b6069k66168i0616A88091J7550D6537i1286K8172A84548J27532
8876C12080e8993f694j80439A26375a01797c7895A6152K13574p3514B010K60174
8865B62184b47128c528q9784O515C00277b68699M3180e0827i390j79737b5332
$$ plain form
8912 89909 130384 -181688 -225745 36489 -24297 -36492 227407 -8359 -23117 -147048 -144832 9824
8899 -214484 -53969 -171019 61694 216223 42139 -243861 230177 61823 -70390 24662 -17494
8887 -209237 -182371 -26069 -292237 -90616 188091 205641 46537 -91286 -63114 184548 312080
8876 312080 -58993 -6694 -187133 126375 -101797 -37895 16152 229726 156212 2010 262184
8865 262184 -247128 -3528 -93312 -86797 300277 -268699 -225519 -50827 -9390 -189127 -25332
$$ [...]
##END NTUPLES=NMR SPECTRUM
##END=
