
##TITLE=AC1325_PERAH11154_6535825_Ft1uJnqipN
##JCAMPDX= 6.0         $$ Bruker NMR JCAMP-DX V2.0
##DATA TYPE= NMR SPECTRUM
##DATA CLASS= NTUPLES
##ORIGIN= BRUKER
##OWNER= Administrator
$$ 1.72 TOPSPIN		Version 2.1
$$ 2012-07-17 23:12:48.281 -0500  Administrator@TOPSPIN
$$ Compression mode = diff/dup
##.OBSERVE FREQUENCY= 400.02188249412
##.OBSERVE NUCLEUS= ^1H
##.ACQUISITION MODE= SIMULTANEOUS (DQD)
##.ACQUISITION SCHEME= undefined
##.AVERAGES= 8
##.DIGITISER RES= 22
##SPECTROMETER/DATA SYSTEM= spect
##.PULSE SEQUENCE= zg30
##.SOLVENT NAME= COFFEE_meoh
##.SHIFT REFERENCE= INTERNAL, COFFEE_meoh, 1, 14.98509
##AUDIT TRAIL= $$ (NUMBER, WHEN, WHO, WHERE, PROCESS, VERSION, WHAT)
$$ ##TITLE= Audit trail, TOPSPIN		Version 2.1
$$ ##JCAMPDX= 5.01
$$ ##ORIGIN= Bruker BioSpin GmbH
$$ ##OWNER= Administrator
$$ $$ C:\Bruker\TOPSPIN/data/COFFEE/nmr/AC1325_PERAH11154_6535825_Ft1uJnqipN/10/pdata/1/auditp.txt
$$ ##AUDIT TRAIL=  $$ (NUMBER, WHEN, WHO, WHERE, PROCESS, VERSION, WHAT)
(   1,<2012-07-17 23:12:41.187 -0500>,<Administrator>,<TOPSPIN>,<go>,<TOPSPIN 2.1>,
      <created by zg
	started at 2012-07-17 23:11:34.687 -0500,
	POWCHK enabled, PULCHK disabled,
       configuration hash MD5:
       6B 1B 68 BB D9 2E 58 E2 7F 35 AD 54 07 DF 0E 41
       data hash MD5: 64K
       17 EA 70 8A EA E2 A5 CF 0F 72 07 36 0F 6F 62 D2>)
(   2,<2012-07-17 23:12:43.906 -0500>,<Administrator>,<TOPSPIN>,<proc1d>,<TOPSPIN 2.1>,
      <Start of raw data processing
       efp LB = 0 FT_mod = 6 PKNL = 1 PHC0 = 0 PHC1 = 0 SI = 32K 
       data hash MD5: 32K
       58 D5 F5 3D 49 F8 2F 60 75 83 4B 7A 4F CC A3 C3>)
(   3,<2012-07-17 23:12:44.312 -0500>,<Administrator>,<TOPSPIN>,<proc1d>,<TOPSPIN 2.1>,
      <pk PHC0 = 176.9458 PHC1 = 0 
       data hash MD5: 32K
       F1 06 68 45 D2 5F 76 B4 8F B5 0E C1 21 32 CC 91>)
(   4,<2012-07-17 23:12:44.421 -0500>,<Administrator>,<TOPSPIN>,<proc1d>,<TOPSPIN 2.1>,
      <abs ABSG = 1 
       data hash MD5: 32K
       4B BA 19 F8 F4 77 27 F2 C4 F7 26 04 CA 2E 72 30>)
(   5,<2012-07-17 23:12:44.453 -0500>,<Administrator>,<TOPSPIN>,<proc1d>,<TOPSPIN 2.1>,
      <abs ABSG = 2 
       data hash MD5: 32K
       A4 15 54 37 B1 4B 0C F3 5D 88 E0 78 0D E1 E4 CB>)
(   6,<2012-07-17 23:12:44.484 -0500>,<Administrator>,<TOPSPIN>,<proc1d>,<TOPSPIN 2.1>,
      <abs ABSG = 3 
       data hash MD5: 32K
       68 DA 87 EB 0F E7 C3 CF 12 8D 7B F7 31 35 D8 6F>)
(   7,<2012-07-17 23:12:44.500 -0500>,<Administrator>,<TOPSPIN>,<proc1d>,<TOPSPIN 2.1>,
      <abs ABSG = 4 
       data hash MD5: 32K
       73 6A 31 B1 23 1F 87 98 3B E7 8B 9F FC A6 D0 7C>)
(   8,<2012-07-17 23:12:44.531 -0500>,<Administrator>,<TOPSPIN>,<proc1d>,<TOPSPIN 2.1>,
      <abs ABSG = 5 
       data hash MD5: 32K
       96 23 AB E0 38 65 28 8D 31 2A CA 3D 41 6F 99 AC>)
$$ ##END=
$$ 
$$ $$ hash MD5
$$ $$ B1 55 CB 92 78 C4 4C DC 37 29 D8 66 0A 8F AA 24
##$RELAX= 
##$RELAX= 
##$RELAX= 
##$RELAX= 
##$RELAX= 
##$RELAX= 
##$RELAX= 
$$ Bruker specific parameters
$$ --------------------------
$$ [...]
##$TP= (0..7)
150 150 150 150 150 150 150 150
##$TP07= 0
##$TPNAME0= <>
##$TPNAME1= <>
##$TPNAME2= <>
##$TPNAME3= <>
##$TPNAME4= <>
##$TPNAME5= <>
##$TPNAME6= <>
##$TPNAME7= <>
##$TPOAL= (0..7)
0.5 0.5 0.5 0.5 0.5 0.5 0.5 0.5
##$TPOFFS= (0..7)
0 0 0 0 0 0 0 0
##$TUNHIN= 0
##$TUNHOUT= 0
##$TUNXOUT= 0
##$USERA1= <user>
##$USERA2= <user>
##$USERA3= <user>
##$USERA4= <user>
##$USERA5= <user>
##$V9= 5
##$VALIST= <valist>
##$VCLIST= <CCCCCCCCCCCCCCC>
##$VD= 0
##$VDLIST= <DDDDDDDDDDDDDDD>
##$VPLIST= <PPPPPPPPPPPPPPP>
##$VTLIST= <TTTTTTTTTTTTTTT>
##$WBST= 2048
##$WBSW= 25
##$XGAIN= (0..3)
0 0 0 0
##$XL= 0
##$YL= 0
##$YMAX_a= 500469
##$YMIN_a= -638102
##$ZGOPTNS= <>
##$ZL1= 120
##$ZL2= 120
##$ZL3= 120
##$ZL4= 120
##$ABSF1= 14.98509
##$ABSF2= -5.573092
##$ABSG= 5
##$ABSL= 3
##$ALPHA= 0
##$AQORDER= 0
##$ASSFAC= 0
##$ASSFACI= 0
##$ASSFACX= 0
##$ASSWID= 0
##$AUNMP= <proc_prof1d_extract_pilot.lims>
##$AXLEFT= 0
##$AXNAME= <>
##$AXNUC= <1H>
##$AXRIGHT= 0
##$AXTYPE= 0
##$AXUNIT= <>
##$AZFE= 0.1
##$AZFW= 0.1
##$BCFW= 0
##$BC_mod= 0
##$BYTORDP= 0
##$COROFFS= 0
##$CY= 15
##$DATMOD= 1
##$DC= 0
##$DFILT= <>
##$DTYPP= 0
##$F1P= 0
##$F2P= 0
##$FCOR= 0.5
##$FTSIZE= 32768
##$FT_mod= 6
##$GAMMA= 0
##$GB= 0
##$INTBC= 1
##$INTSCL= 1
##$ISEN= 128
##$LB= 0
##$LEV0= 0
##$LPBIN= 0
##$MAXI= 10000
##$MC2= 0
##$MEAN= 0
##$ME_mod= 0
##$MI= 0
##$NCOEF= 0
##$NC_proc= -8
##$NLEV= 6
##$NOISF1= 0
##$NOISF2= 0
##$NSP= 0
##$NTH_PI= 0
##$NZP= 0
##$OFFSET= 14.98509
##$PC= 1
##$PHC0= 176.9458
##$PHC1= 0
##$PH_mod= 1
##$PKNL= yes
##$PPARMOD= 0
##$PPDIAG= 0
##$PPIPTYP= 0
##$PPMPNUM= 2147483647
##$PPRESOL= 1
##$PSCAL= 4
##$PSIGN= 0
##$PYNMP= <proc.py>
##$REVERSE= no
##$SF= 400.02
##$SI= 32768
##$SIGF1= 0
##$SIGF2= 0
##$SINO= 400
##$SIOLD= 32768
##$SPECTYP= <>
##$SREGLST= <1H.CDCl3>
##$SSB= 0
##$STSI= 32768
##$STSR= 0
##$SW_p= 8223.68421052631
##$SYMM= 0
##$S_DEV= 0
##$TDeff= 65536
##$TDoff= 0
##$TI= <>
##$TILT= no
##$TM1= 0
##$TM2= 0
##$TOPLEV= 0
##$USERP1= <user>
##$USERP2= <user>
##$USERP3= <user>
##$USERP4= <user>
##$USERP5= <user>
##$WDW= 1
##$XDIM= 32768
##$YMAX_p= 475828036
##$YMIN_p= -743565
##$CURPLOT= <Network HP LaserJet P1505>
##$CURPRIN= <$Network HP LaserJet P1505>
##$DFORMAT= <normdp>
##$LAYOUT= <+/1D_H.xwp>
##$LFORMAT= <normlp>
##$PFORMAT= <normpl>
##$SURQMSG= 1
$$ End of Bruker specific parameters
$$ ---------------------------------
##NTUPLES= NMR SPECTRUM
##VAR_NAME=  FREQUENCY,     SPECTRUM/REAL,   SPECTRUM/IMAG
##SYMBOL=    X,             R,               I
##VAR_TYPE=  INDEPENDENT,   DEPENDENT,       DEPENDENT
##VAR_FORM=  AFFN,          ASDF,            ASDF
##VAR_DIM=   32768,         32768,           32768
##UNITS=     HZ,            ARBITRARY UNITS, ARBITRARY UNITS
##FACTOR=    0.250966925370066, 1,           1
##FIRST=     8223.43324360094, -108756,      45722
##LAST=      0,             -168303,         -65039
##MIN=       0,             -743565,         0
##MAX=       8223.43324360094, 475828036,    0
$$ Real data points
##PAGE= N=1
##DATA TABLE= (X++(R..R)), XYDATA
$$ [...]
23856 150645 -66526 -45416 244539 358 48595 39563 -49318 227866 -347220 -156451 -160803
23845 -160803 15089 68770 -239552 -190737 164527 73131 -534250 295339 -70737 14546 24002
23834 24002 108801 -7038 271735 -127854 25909 -198419 -277418 102808 -91681 -82320 269801
23822 115354 18217 183019 144887 -178043 -235988 -102307 121282 -39091 -23977 -145349
23812 -145349 51362 -10794 -519746 -220482 -139301 44195 241786 -59617 -68262 181775 -49033
23800 125307 -57153 139593 -81611 20742 -153192 -137847 -147975 -164720 65858 33918 44519
23789 44519 -142643 -11458 85004 -308996 78386 267684 67587 -115033 -83131 -237052 -72201
23777 -17709 147677 -103184 164574 -139662 162336 -106819 169 -81110 48168 320577 105586
23765 -71659 -8900 175952 108287 240089 -21187 195384 379649 66681 238427 -126553 302348
23753 14726 -124261 -273283 40770 416861 106795 -5176 -5230 134548 -138732 -47048 -27115
23742 -27115 100966 -56693 242653 320543 -220856 -103876 -68111 -206876 62788 -25756 -115619
23731 -115619 -121679 -236446 -356717 265174 149712 106718 126956 69592 -94629 -117539 -90570
23720 -90570 55131 50195 52915 -348950 6089 -179928 50471 -80396 6380 125561 -129039 -127311
23708 -127311 183322 -66225 14833 23874 310624 74247 -21193 -74059 -237204 38243 -164113
23696 49206 248523 115180 -140740 140806 -131568 -332114 -13067 -66594 -283446 -252223
23686 -252223 -174599 -41231 -35564 -242483 -207123 -394101 79515 -194752 330090 48626 -158826
23674 -225606 -131436 -75144 -162241 -112600 -155022 -20523 -78390 -87726 -85315 -2684 61474 43089
23662 43089 -286447 90341 -60293 -14411 112874 -304064 217577 -182793 132807 -133170
23651 39874 24980 -151303 -138991 -112225 -308330 -245929 6948 46813 -227363 -292741 -81426
23639 87240 202518 241614 234045 340262 -29493 119111 -137262 -22947 -62445 234468 -197682
23627 -133991 -44739 -67034 -21211 153871 -21276 8398 -166718 -70835 94958 -181836 -149113
23616 -149113 -105208 -116541 112199 -65673 -239807 -23633 -158822 131452 47421 95365 -47598
23604 -2790 -210091 228893 -103593 -107891 84810 -16747 -252197 -200204 31433 -182395 -63037
23592 427095 13957 237439 31902 79856 -57972 53998 -12469 168284 76310 43155 107614
23581 107614 -415498 -27695 10352 137818 -137115 68726 -180865 -367539 -81335 -204337
23571 -204337 -214435 17582 -61246 104990 -178312 -4270 271112 53966 -8522 -44627 410954
23559 9612 -90573 233188 126781 12552 178029 20095 49174 -210046 238978 -132154 -68322
23548 -68322 142223 -9090 -37979 68445 -388732 201428 -289982 -1231 -150714 -200036 -78069
23536 -166657 -35489 26990 -64488 -150087 113354 -387642 -8471 269727 284268 -179338 151206
23524 167991 200621 -246907 -139377 -78263 -43538 -194554 -245291 -32241 -168086 -78709 -331390
23513 -331390 -302086 221314 202496 -9297 -196987 101133 -213413 -52769 194514 -383820
23502 86788 -50996 23002 167484 -400352 412765 -40612 193561 12064 -302268 266980
23491 -254654 -216892 54766 -70586 -55084 58330 302051 -100899 -150345 -136508 205555 176655
23480 176655 115313 -99330 -397430 -43133 -211393 218875 171559 -23884 -51064 -16507 33892
23468 -55944 -141275 268693 110914 2376 -114230 -19951 87161 -176036 8493 -106366 -27772
23456 -75546 62034 149582 -62876 -37590 -38540 37940 -838 95892 -101755 41119 98638 -212450
23443 -43376 -30778 339312 6442 52532 -331473 132077 -117004 -1165 -90403 -114452 106429
23431 46354 -19030 176712 -18150 34116 -126384 20271 -301981 -165121 98463 -423175 64790
23419 60925 186030 -13758 -26172 -6924 183173 -247299 -254818 -97786 120072 134798 -32426
23407 -36478 -325467 162684 36525 25125 -102215 264998 -306923 -162134 -114867 129741
23396 -63951 -37883 -59726 469319 -62280 73001 62786 14926 -102280 -180047 -23452 -13959
23385 -13959 -175685 -78194 -9694 53565 154978 51909 -101226 259459 -117679 -160938 178630
23373 56969 77398 -7757 -247075 174022 239556 -256609 160427 125920 57640 -158825 32821
23361 -291963 173784 97977 -138037 123117 -161225 -304436 -220435 -251682 -127603 59406
23350 19390 -261251 7538 50359 175099 94702 96020 -331612 -130828 -106188 -197735 184746
23338 91376 79542 -276067 184648 -81746 12965 86099 -107186 -315994 190376 86096 15614
23326 100001 60985 115595 -39003 -185131 -139812 121520 278543 165005 113190 79561 14331
23314 -162095 16309 202895 -115867 -466243 197283 -267576 223003 -179554 -17430 -285805
23304 -285805 -49171 -67600 -285700 83418 -119850 -233138 -38972 -230649 -93021 -116138 204748
23292 -419859 -13606 -74662 221080 -373256 222047 -70904 -161613 -303800 -241897 223568
23281 105948 -203270 -349364 -242593 -151883 129530 170679 -128519 -71483 -14375 -114002
23271 -114002 164473 -253397 -104647 191300 -116089 -64485 33620 201840 -28347 30059
23260 138008 -218016 -239189 144610 -56398 -275783 -302044 86690 -60631 119328 -210582
23249 -100429 -378095 -373797 -5131 72056 -14395 83786 321279 414084 20273 99553 -59116
23237 53589 -10518 398556 -125810 152875 17690 -86897 -963 -236704 34231 -100930 -109939
23226 -109939 329099 67892 202882 -165910 -169606 -85199 -189857 311083 -20992 296356
23215 -94735 11817 32615 -67533 -184895 -69638 170776 -21536 -20996 -11151 -446281 358855
23203 -41502 -263671 -122545 -148085 -56704 -326822 58564 172952 -161059 -318308 -54846
23192 42854 -788 265973 76471 -312726 131775 297200 -43245 188418 179919 166955 -71310
23180 -69801 132993 -45930 -4941 6652 -187322 -2069 145145 346323 159046 108135 -179250
23168 -46061 -33970 113304 -190567 206288 -125271 -151672 2266 14405 -188510 -186289 105445
23156 56635 -328287 161744 158297 -73426 137535 -202733 24211 -338263 225626 -252152
23145 176685 144190 -200537 -101533 11177 118023 -29815 39869 -462176 55896 -295206 192389
23133 205109 -1119 72242 -18373 -206694 237909 -129079 -284221 30278 -233788 -197861 -63537
23121 -115491 9008 242437 -15204 -141633 -148952 70496 -396528 -109347 -158466 -7632 239171
23109 167321 -109805 71464 85615 -14707 72347 -19296 -6185 3932 -129407 -49185 -109071
23098 -109071 -1795 52729 37435 45273 -389429 -63794 -489908 -209241 215239 -188414 4202
23086 323181 164752 -60243 -265211 5633 -198489 -1587 55720 -147725 -27342 -63773 292893
23074 185355 -29578 245657 -28687 -65166 494127 27347 48739 -156202 -275370 45636 241373
23063 241373 -266650 -37288 150588 227626 42158 481711 23456 -160895 -67836 -375256
23053 -375256 16817 -77897 -163624 -74563 -312467 175827 88880 -486933 -80525 -90789 -34976
23041 -99411 440 -63865 267026 -285094 -59641 -71781 -224468 253559 260880 77638 -36274
23029 123211 -41065 111608 -22285 245416 158476 -135583 -18602 38286 -90031 271892 -10852
23017 -107884 204722 -46985 41949 -161541 -47527 -154657 182820 -162523 121112 145603
23007 145603 -452185 -57851 -59894 -206599 132366 -225902 -92639 -53635 -81808 -236597 -79123
22995 -254659 293735 -4606 -190766 -167130 53920 -191854 -279738 -118799 -237206 -189484 8287
22983 79606 -235522 257673 -50394 58628 -214913 135401 89795 163192 -105816 -112050 -109024
22972 -109024 4379 19474 161815 -64819 227630 -11960 -140911 -52102 70185 -2150 70881
22960 -37599 -73060 43367 -192580 122475 -250762 -88640 21531 57746 61892 102571 -380107
22948 -382472 34685 159209 -191417 -145756 455842 52653 400646 -197120 -63656 -93317
22938 -93317 -129456 -245246 316900 1893 4771 -85172 -154907 -209304 34823 -70389 -48967 -124014
22926 -124014 13420 -213099 26201 24735 137419 -49073 -3736 -103777 109719 -242706 -222111
22915 -222111 -172314 -38251 59792 -148520 200601 281962 172351 215578 -115567 -132321 44606
22903 -23877 -219860 -22103 -102754 -230757 111753 -227279 64422 -9524 299973 -105786 -293904
22892 -293904 109746 216219 -29854 -172297 -52100 -526389 127576 -266453 -250231 -226213
22882 -226213 -65342 -258078 -199670 -370771 -115859 34849 -185107 64488 -56891 5206 248886
22871 248886 -130716 -294433 -59522 -211986 134457 -23927 -316568 56527 -144153 175346
22860 85053 -198911 -31497 -16236 -175704 -50000 -115011 19829 -116531 -386465 -331160 -41312
22848 -25222 -187559 125876 -177217 27374 247558 -41703 458874 -84196 11876 193484
22838 193484 187975 -46982 107189 -83981 -89547 -194331 -91783 126618 50787 -239695 85059
22826 -111451 58042 -230438 -75663 166453 -211024 -412529 208942 -249333 159791 98729
22816 98729 -49903 255114 -258094 50698 6081 -84539 -282772 -126741 -77311 289868 -15628
22804 -161168 -38467 -203682 242886 175100 -80487 -252600 -222504 -17301 157971 21206 -41596
22792 -294815 -25644 150138 72907 -220917 -234308 -438053 100204 175972 9528 461605 -27884
22780 191546 -59722 -342729 82953 -290540 -220823 39603 -111902 175755 -77754 36295 -3984
22768 175542 -622683 -240664 -50521 -229711 -111807 -34461 21538 89116 189890 -155842
22757 -130841 139880 239676 -101638 -234867 -46399 -92213 -332341 205857 -396118 58001
22746 -96337 67845 -84352 -52179 -97089 -315478 -166581 -116093 15557 -161469 127879 284125
22735 284125 156101 -246408 -237284 -99791 127425 7791 7466 5172 37867 -176638 -127906 -170115
22723 -170115 51027 563503 -77401 -138505 -119169 56870 -62903 -34343 -17099 -49560 11610
22711 -98095 -91906 41736 208163 -126254 215108 32455 34473 152980 223655 29435 170853
22700 170853 249377 288964 -85126 -97090 -253029 -151968 -154535 -51917 -76460 7941 -30869
22688 -52863 -7514 -193491 8526 -44822 144417 101806 82477 -218377 132397 145358 122356
22677 122356 160086 -14531 -277117 164068 260399 -162390 -259139 175885 -77598 -285454
22667 -285454 -121442 -37956 -124982 142486 -185024 61910 -78982 -74499 -25904 261903 -26669
22655 212841 153403 92329 32739 -170086 131843 -79558 -98132 -95624 20267 -61751 -33613
22644 -33613 -19080 187177 -210370 -116468 92765 -183035 -197507 31370 -56971 37608 158783
22633 158783 -109909 -259796 -420635 -3643 156387 69233 79856 4918 -136790 290128 13799
22621 32292 -506552 78187 38061 -39109 -126166 -55869 -98648 -151819 -211450 -20822 -242917
22610 -242917 -175897 -56394 -34304 -278299 287622 -175542 -30746 -317170 -16432 -198099
22600 -198099 -38223 -286664 -142471 112111 12339 63032 87069 37094 -38123 -3308 81574
22588 124201 -132686 -60569 -187018 -155592 -4091 146663 212342 5030 113583 -99466 123960
22576 -163108 -212629 3411 -64132 -188636 143107 134103 -27114 25067 116245 48057 63131
22565 63131 -67264 46430 -97519 -155530 110056 -204044 137637 -192670 -155837 303737 85020
22553 -104593 98 -53315 366868 -257027 13391 -201261 -88298 151039 -20746 -139003 -86335
22542 -86335 140456 272638 -422204 -82317 32290 -47603 78790 48344 -581297 167304 130129
22531 130129 -201525 -27777 159685 164332 -91819 -260404 -5040 -317753 -56283 148691 -210369
22519 -100119 198264 159227 -345752 -11345 -62361 330374 114309 -302439 243968 89199
22508 -253422 51185 -383072 -223201 91041 -191313 139809 -76195 -54148 -232928 -69224
22497 -76857 102067 -61339 -93484 -179402 -51043 22991 216986 146882 -210241 -372762 -154092
22485 356981 -76717 -201139 144952 -60124 -330720 -38709 -219287 50896 -149926 -83272
22475 -83272 -402641 220700 -27115 -30219 -32055 -131849 -248915 127364 -92310 249131 -61224
22463 232890 70132 -280573 -408094 59761 -160613 -272937 2989 -154311 -210536 -162140 46529
22451 7012 -213376 -220280 36638 112003 -324457 60609 -299275 -199034 250184 -57425 44205
22439 -92455 190815 -249481 11826 193844 168389 182165 -454725 66315 -3759 228912 -109978
22427 -233733 -173945 92145 -8599 -93287 -207330 -159867 -137020 -66829 -94363 -225798 29096
22415 27917 -12933 246921 -316904 -146384 -89355 -27545 -40565 92615 -92429 183941 -79423
22403 209441 -85333 -105853 20242 115819 -141698 84226 -44214 -58966 88706 55464 102325
22392 102325 -84413 -65604 108258 160590 -418724 80988 270286 -97493 32358 99052 92423
22381 92423 -11645 -215703 -87791 2339 149704 -11933 -215293 -5604 86584 423319 -441301
22369 141756 131913 74350 26483 -179365 323120 -96462 -174745 -128108 423697 -111160 1449
22357 -76366 -81669 190910 -36988 182463 48157 110504 -114184 -136549 -133057 -94109 -204939
22346 -204939 -274173 -151257 192545 1827 170821 -201193 -71437 67078 144247 -274906 -136064
22334 -98096 98722 -46715 -21251 -6130 66341 -161250 17692 -18769 -263093 -42235 -193312
22323 -193312 -238619 -176895 125318 -94777 -51739 12875 121692 306145 59012 -134203 5561
22311 -192587 -279030 -222152 9622 165428 -143239 90511 -220027 -70232 -90452 -328644 124846
22299 152561 -123310 -8262 111242 -322019 1060 -42460 61761 -69007 190010 221967 417939
22288 417939 220633 66451 59948 165485 82698 -241913 51533 -9351 -287731 -131657 -317555
22277 -317555 69258 259358 -127 2720 351375 -427833 -109921 -140570 169971 -69800 9280
22265 -11049 139335 -62251 -222254 -182228 -21474 218158 -266554 -323321 137287 110209 -38158
22253 113653 204934 -39161 75819 -153201 -170256 114202 -322631 -37385 -158276 -140494 -67822
22241 -229228 -32510 -277253 38974 26777 109481 215652 160146 -61355 -463014 -313138 208778
22229 -224954 -430916 115626 -40604 -189708 -145419 -55124 332716 -134691 -401144 -65472
22218 169016 -176361 196740 79903 6001 -212894 49933 -214939 -228261 275432 36296 240755
22207 240755 171992 12100 -145311 34243 -234988 -24827 107778 337346 -249202 60927
22196 67528 203041 -323957 151522 -41710 155176 -748 75533 -142887 222839 -81741 -140478
22185 -140478 152172 -164796 -13835 225325 -50325 150781 208442 -3042 -57640 78312 -156192
22173 -71385 -260071 -51031 226890 -284623 -103154 -24573 68054 -22253 35154 143985 -431489
22161 9476 -170537 -359578 84638 -433249 -98036 -3205 70532 386246 69545 -68825 2138
22149 -290192 74997 -142137 -5917 -25713 102427 -356709 -25017 142448 8588 -34998 -52336
22138 -52336 30751 77951 227384 -324346 -138439 388841 -299699 -128806 -59820 -152686
22128 -152686 -166237 -39552 -145514 281510 -194985 23970 -455574 77860 -302198 14575
22117 34777 47488 -52007 -97463 57070 -197755 -91738 -218597 205350 -86046 -228729 -273894
22106 -273894 116149 28415 -25767 -237630 -176893 -110442 -86417 150810 -155641 10637 -258025
22094 -144354 -111177 108571 111210 -101845 -54957 -132934 -55294 -245795 -290072 -32658 270094
22082 -37008 -126225 11889 159786 -58701 -491699 -13335 -149125 -289635 110426 -58110 -50182
22071 -50182 -97855 -23227 -24864 286559 -16835 83439 -295772 -162684 182474 -94224 -207826
22060 -207826 -41421 312587 -142836 -99448 -325405 -71119 -62858 -20633 178508 186402 -162395
22048 -64870 152234 -37137 -134267 -143369 -318540 12413 -157981 168764 40841 158679 33165
22036 39140 95735 37963 -203436 249899 -167760 -276503 14081 180373 -58030 -19291 33223
22024 -308145 -432664 -205556 -34807 -351186 34817 31529 100092 -152935 -185746 -173535 5005
22012 38584 226775 -139458 46276 185870 95398 116004 25500 127985 -107969 -130433 -339331
22001 -339331 -124876 29528 147227 -75606 70193 128198 -124266 -356689 259077 37972
21990 -134705 -25164 170729 -133476 46269 -91614 30524 -69142 -330018 99214 -286480 116748
21978 -16773 -187724 -79273 -96425 -335221 -146778 -188077 -194932 212456 -274616 126168 -160280
21966 -89324 -105092 -6780 311900 38250 -321653 -138626 -95250 -44878 -356450 20740 27049
21955 27049 9969 97111 -24096 -208308 24549 -31898 56108 13392 -292841 -219809 -75031
21943 -251290 -215205 -136673 -152432 74832 146335 -293406 5219 98910 -121509 -69480 45770
21931 -86693 33826 28195 249943 -282960 146328 111101 -35231 -64792 -302724 209416 39237
21919 -263624 -112614 -130160 -120840 -214999 -151658 -109374 5458 -270417 -70296 27254 98072
21908 98072 -209391 -116154 -214380 197119 54147 -86314 -14879 -151775 -66464 -356486 14120
21896 307160 -321936 49609 39636 15612 -261348 287455 -401896 -96399 154425 296925
21886 296925 23697 -83785 11558 -35721 -49638 113741 227400 107137 -165339 -143007 -285091
21875 -285091 8580 75378 97376 106462 -18306 -33355 252311 -129434 -20453 90834 -69608
21863 -12065 79607 -47203 119509 76155 76444 -200521 55935 74037 105053 -97824 121959
21851 75795 -329470 -117171 -66270 125438 -77320 -206865 111170 -63618 60643 131746 133228
21840 133228 37633 -169371 -106736 -34704 -73240 -376322 -177996 132272 -31606 550834
21829 80687 60994 -135514 -138572 -132582 -113379 -33863 -24795 105442 -6012 29526 -137163 87455
21816 203457 26183 116880 -270298 53469 151308 -152011 -25892 -27028 -115028 -361588 -261791
21805 -261791 -158227 13708 328041 -248406 16627 -11602 163837 247186 -144806 9378 -75377
21793 -113775 71319 -80412 222242 -62046 -21080 34586 -219157 106024 59010 -243201 -70779
21781 -133595 -68945 -13665 -23908 176052 62688 138279 -31621 35671 -357578 2608 62280
21770 62280 20358 -160899 -449692 65735 52147 58670 -205416 -155812 -28486 237343 18804
21758 73652 -100564 -199913 -99474 -82529 118424 226289 163228 120499 -37263 -320211 -164365
21747 -164365 -147126 -260890 -100112 -261137 22575 -339726 8691 80319 239199 -51166 128425
21735 -325885 10406 -144485 217568 92355 -94422 -379584 60991 -64959 -56977 -203286 159133
21723 -284497 -187983 -44237 1954 -162303 -171779 -256229 -274505 65292 -339332 -394010 63923
21711 -277766 -389628 -295029 -160069 52887 -230326 -78825 99870 -381538 377300 -182820
21700 177615 188522 -93469 -263531 69211 -85534 63540 207698 -411608 -274402 42125 -391808
21688 43143 -142469 -111811 -3786 135400 -79722 -232062 -236908 -108139 17799 -86077 -154785
21677 -154785 -57523 373065 133129 -349271 -44750 24764 -73866 -38367 60695 281336 -71984
21665 94122 145624 -462535 287394 -36151 18804 7895 213946 -94011 144197 -301918 -305373
21654 -305373 -112698 28340 82027 100844 195919 -5753 -41398 206700 -98634 -174577 -31646
21642 -99506 -329138 29749 -236625 -135592 -73634 -13234 -69841 25212 45941 33945 -123344
21630 199224 28444 -34181 -88115 -289578 -167294 -44685 83993 -124047 -148474 -8945 -106438
21619 -106438 -46795 -10591 -163876 -364219 -169003 84321 244189 -123071 -124440 -136767 -87108
21608 -87108 240844 -110947 119750 123360 254069 -112038 -99221 -167591 101914 -300948
21597 -121280 -243497 -124967 155027 69642 -31586 57980 254325 -136484 142624 -100542
21586 115811 200632 -104354 -108491 -150077 38813 9338 -153968 35322 181649 257530 -52722
21574 -10874 -168192 70188 207967 35162 -52778 36988 449539 -222640 94954 -68481 318131
21562 158448 -19302 63034 73361 289801 160255 133629 -114747 142522 194313 221560 80226
21550 215019 269985 -2952 -91160 -135745 182766 326381 199548 -310292 -23628 -146920 -231977
21539 -231977 -52867 310475 5191 -103692 -94054 46948 -123488 -30963 -46015 65703 -142944
21527 -265770 -369049 -23021 -119431 -4737 -72090 -97928 -557244 -52732 -28709 237290 -171293
21515 -279198 109245 -252677 -234562 -54113 207132 -143426 378250 88273 108440 -187323
21504 13031 -5703 -227770 -5269 -168241 78336 -138590 -29920 56104 -74949 -78372 -92150 32664
21491 -324082 116729 -144951 -304521 -106346 -234995 28025 -127890 266095 53255 -226239
21480 -101170 -95280 -280462 -91524 -270219 -78204 -105340 -112682 -143535 -139613 94379 -256409
21468 311163 307204 -156796 81485 -360148 -182385 -98484 -93637 263621 -373991 185869 -139363
21456 -256454 -62309 -34105 159950 -93299 19897 27760 23058 77421 -6860 145404 -240420
21444 -462344 210063 -59137 179785 254531 -443127 -229361 287188 231950 373685 100317
21433 240029 -189773 242825 96172 -234459 -424498 144076 306912 -72231 249562 -119492
21422 66118 -1104 -281113 -286549 278134 70002 78289 3427 -77047 -143335 94239 -40006 53250
21409 1962 -109332 5092 -184159 141720 521977 -191846 76829 -341719 -237418 -70762 157202
21397 -104026 -51085 244647 -136766 -23804 70731 -44510 -251744 -62637 -59142 -204054 -184131
21386 -184131 -78805 -322741 -353370 -119938 -62639 -49009 132221 -152116 -348256 -21283
21375 55714 14265 24535 27671 84535 12386 -194007 304438 224927 26056 117839 516537
21364 516537 81947 -5469 -228859 336931 -359750 344509 -226327 -106944 145525 -79371
21353 150127 300765 -20565 -65296 -310282 76283 -248408 119437 344586 82546 11436
21342 -76006 -81092 5008 -138865 -125781 318564 -90285 -160822 -59243 156248 284567 -446739
21330 -122632 -224739 -18234 -380563 64501 -404663 -77801 -172902 -35785 -133043 150213 133622
21319 133622 -147112 50191 -71397 -46820 -93432 -525539 -130948 -241548 -252313 198161
21308 -74377 268898 3183 -202826 -80402 66377 -260674 141409 -109023 -51731 -96090 -69131
21297 -69131 28254 -113879 -233443 128545 -140722 172186 1998 -17665 -72874 -28440 -16266
21286 -16266 101253 -362758 -202027 109588 -167572 160898 -126229 -56411 -150197 -99601
21276 -99601 -102753 77729 16566 -57503 -17953 104681 150368 -17118 117890 194965 -55277
21264 59715 74455 -111681 -200233 151514 -145176 224038 27287 215825 -68289 -41959 29157
21252 -74659 -83073 -7876 -137539 -25085 -84730 -157266 64733 -136696 176143 -86726 -163012
21241 -163012 -467493 16102 -272391 76885 -80168 -107304 -197721 284886 -365612 -38459 -272079
21230 -272079 -308433 -213894 -128662 201740 -151991 -132204 -400315 -176516 80283 199677
21220 199677 111571 -72965 226553 41209 -30834 37955 -192387 273284 187987 -113383 -229808
21209 -229808 -225843 -71920 89288 -91829 -236211 -5698 -490738 -129396 49075 51426 -38023
21197 -226379 -23989 -119321 -426444 327510 246637 15351 -65096 183014 -372129 1709 38356
21186 38356 64802 -185188 -144913 80700 240216 47923 -106052 -2153 -77652 -49514 16620
21174 41159 57675 45739 126534 7709 187867 -25990 9091 54472 -6861 114396 -65245 -188152
21162 -188152 77939 -379057 14412 -52846 -105075 -68103 160517 -170319 -248913 -27699 -194645
21151 -194645 -192154 -173670 -106424 -102918 76563 166579 -82408 -104514 -148748 -49411 -304538 29773
21138 -188469 157167 62679 147840 126189 -126292 97406 -271053 -5953 -7315 -36437 -63012
21127 -63012 -97532 -90305 -176370 -532815 -241202 -141540 -147709 -30902 31993 -104944 -74590
21116 -74590 -143280 248239 75810 -2304 -48127 35276 4872 -89931 -361796 204767 81522
21104 -89739 -75505 -207089 143174 -117472 80448 -114733 -86864 291796 64011 -153601
21093 193187 -122064 -353938 -303109 72811 -44255 -10987 140404 -86193 -193871 -374073
21083 -374073 -168815 -92526 199644 20052 -150069 -118636 222005 -96616 -260916 -128146
21072 -53033 -307955 -162590 -314347 -227764 -100667 88719 38654 -227417 32194 -10255 9210
21060 -178467 -46745 -148906 42509 -117555 -166174 3039 184482 -166262 423953 76631 56448
21049 56448 -322898 135358 -81044 21755 -194469 4378 50574 207919 -48042 -46712 209147
21037 49113 67470 -135385 180250 -445647 -173916 -61324 -35467 26058 94084 58383 -38729
21025 337290 122012 -132572 -212 -199520 -240147 76129 271487 248664 120225 266529 218527
21014 218527 117719 -269724 -141107 -113800 -234396 225648 172892 -262424 -283527 -66304
21003 -87591 -60411 -133704 31505 -217174 -601 -74466 -111710 -121590 -206249 150619 141195 39870
20990 55168 -37722 -151997 -117986 -47944 -21820 -262924 -64549 -327212 -61662 -228700 -668705
20979 -668705 -10034 168819 281241 121540 -245569 -347768 -72901 134708 -275586 -282640
20969 -282640 -294246 62770 79197 129257 68530 -166834 -284858 -325972 -201986 -287474 107388
20957 -32184 -378587 -46628 -13469 294923 41968 -302053 82195 -79257 -286326 3199 35483
20946 35483 -342800 26503 -162003 27824 66702 -221467 -66943 173433 411072 -364929
20935 -58542 -97641 -7616 21097 -510482 -60637 16122 -332515 -288128 -90810 -252418 -101065
20923 -5376 -56858 29528 19996 -63301 52058 -32621 -104933 49874 -4476 -357656 -152637 -69926
20910 91952 -198229 -188376 39043 121967 14360 134449 72451 254606 -3012 -189965 361385
20898 470905 -13624 -184551 -279665 -146100 242300 -42621 201063 213402 281080 -68409 35121
20886 -109673 -169198 -46874 155519 -161166 -94151 -180466 -561765 -339528 -116109 -50883
20875 -144945 -191256 605079 -158992 128345 -23402 -193373 -226049 -28074 -152527 -229775
20865 -229775 52200 194117 -327065 -148096 48924 -60934 -490630 -204178 -304566 -100553
20854 72818 111928 268822 -137514 -163310 -195873 -83967 -199630 -351156 -49443 -179566 148970
20842 224568 19439 216344 -33631 -105141 -50712 -144332 -95130 194234 -59455 198248 291287
20831 291287 -103799 -398931 -27831 -92180 -30834 -167983 83450 -86220 -140378 -24147 -338264
20820 -338264 -118672 -239423 73445 165670 -17742 20303 -67742 -228417 -149721 -22590 -144602
20809 -144602 -37079 97339 -185178 -176845 -240341 110625 175042 -260866 -46956 263551 8544
20797 203324 1658 301711 -105625 51748 -196799 -29172 -252319 378758 -203648 -423980
20787 -423980 37197 18869 -105590 -48700 -48789 -101259 -94918 -2504 94688 -164635 73229 -53444
20774 141585 -262047 -15515 172576 300837 123444 235867 -42 -107237 18080 -146109 59159
20762 63338 89731 416992 -181282 14792 -91 -80982 -144544 -273535 225596 -202866 -239141
20751 -239141 -16938 268330 -149687 12000 -82594 -401320 -34336 30633 22326 -306694 375605
20739 -223341 175564 -61622 189257 275721 53443 -528609 -98165 -197731 -208971 -52104 -89259
20728 -89259 323574 -98482 -398191 -403376 -13311 -125050 -124240 -198691 114429 -74593 14747
20716 193726 -4220 -163415 18334 -209764 -281725 -66808 -136806 -195519 -352204 -61858 -149247
20705 -149247 167491 202670 224669 -22473 53052 -85280 363524 23692 -183111 -99713 96851
20693 -4713 21855 -98411 148400 -378523 268105 -184940 -19582 -266634 281375 -319343
20682 -167999 103812 -84362 -287858 -88247 -309735 -338675 16509 29239 56865 188580 3700
20670 -121417 -290074 150633 96138 29419 10244 -154911 75085 -125356 143278 -307671
20659 36658 183212 -4142 -148077 -35732 72028 230145 -38519 -79800 -121567 -214602 95934
20647 401135 539064 71523 -376802 -208840 12710 89435 222737 -154260 -176157 362616
20636 -231094 -3261 -27161 -100345 -136087 -28806 37700 21283 482504 -76971 120779 35349
20624 -44819 -27944 -63660 -78223 -86983 -138594 78665 -350485 -325597 -23779 39365 134689 -9794
20611 104957 192450 -361625 -179762 -173518 53513 -181770 -247323 -65472 -29604 -136781 -95112
20600 -95112 -117425 8916 109641 56124 49034 -131142 -77500 -211125 -10934 2879 179894
20589 179894 -59288 115203 303026 29944 155634 -144471 120600 204510 359024 9175
20578 290058 -34166 -66565 -54537 21419 127748 -273129 72308 215867 107104 -105401
20567 -123465 -136958 -207017 43500 -268499 -385585 -27048 -151627 -185494 13486 1758 94835
20556 94835 -76194 7385 120007 123213 -142755 -87669 -196969 -88967 110278 -340413 29361
20544 93469 -71908 219579 66627 -124779 -220144 -189060 -118512 -348560 -197452 -329277 -160483
20532 -126449 -87057 -132768 -55042 -48702 -240865 61636 -106598 -183993 -69634 231364 25973
20520 7040 -6944 -206906 -86383 -75149 -249477 161988 -278420 -44517 -48310 -85078 -234492
20509 -234492 92412 -71914 106725 -90994 180088 66437 -29288 -211236 -156002 56383 -311029
20497 -163010 152142 -1334 182549 -74124 -148423 -53822 -55851 -129995 -278647 -124221 -13915
20485 -160214 188890 216999 125917 -299362 -188439 -185746 47478 -214510 -156902 -181238 -90393
20473 -129327 -50248 112419 -40149 35818 -375760 -138228 541871 -56601 -25753 -6784 -304886
20462 -304886 -51702 38124 -126789 -17716 -104463 -73013 -301591 -135955 -169026 -87939 -147853
20451 -147853 -68841 -181363 -154421 28715 -227711 -989 -207782 14021 -265268 -16466 52339
20439 -198370 -31672 -217422 -150734 83303 -95743 -16078 32512 -15195 -188836 147709 117699
20428 117699 -58181 112066 -86003 -137973 -210959 -38119 49458 -167636 -246010 66822 164551
20417 164551 -13533 -179719 -14237 -74162 32802 158417 75247 -96752 28962 39023 -347654
20405 64102 -103897 -239071 -226068 4350 -39290 -127046 -41123 -191874 119960 -187506 86857
20393 9848 50966 68000 -129412 -34408 -166377 -44495 -164074 -28550 -139316 -22674 435205
20381 -3901 -83620 113231 -40844 -125206 165652 103271 -112017 128601 -152630 -225292 56940
20369 83531 258383 -303342 59117 -321259 86554 41689 83357 122430 230941 -79749 -75468
20358 -75468 -44290 -14678 -323523 -150780 152067 -133965 -207133 112134 -155096 -177712
20348 -177712 113001 157728 -198121 -415640 -370531 202846 72545 -27162 -300539 121999
20337 76976 -91941 -84729 -141246 -487543 15344 -49266 -24220 -104472 67025 -126338 -230017
20326 -230017 -129552 -27987 19950 -198960 -45182 59756 95019 -107835 -44033 185242 -354689
20314 30609 -269043 203982 -80846 -292125 -186348 -213577 286820 73066 -159933 -246795
20304 -246795 -255512 -27239 33572 320539 80744 65154 195501 -335952 -70062 207293 -48884
20292 -96884 -85231 119911 -43476 122823 -30389 53823 -279420 -90800 95607 -344570 -13716
20280 42228 24245 -220703 -107550 186393 17885 -415531 -30213 53682 364314 79915 -272317
20268 10195 116119 15088 -142053 -72069 -548458 -231183 156032 -203167 16402 -326400
20257 146945 -43719 -245770 -304848 -171460 -277416 -32233 108497 121467 177647 -223404
20246 -99557 -118704 -209560 -83949 -225055 334783 182317 -141382 121263 -66582 32810 103577
20235 103577 -215999 94282 -65859 -5926 -309666 178887 34601 -117113 -33125 79739 -93817
20223 -220511 285156 14910 -371436 -265952 -3376 31596 -35807 -300912 -179731 11716 -234588
20211 354165 -64261 26449 -93750 7692 218045 -181111 -188184 14252 -151324 45144 -17517
20199 -110620 189943 50840 -148216 -75214 -219255 -163495 4526 -262909 237615 -56157 51699
20187 40140 463527 -186237 -122289 -182297 -307953 64806 -215558 -178212 -56113 108677 -225099
20175 74726 158339 -72782 -84357 259397 69765 323222 357478 61400 -217354 -63937 -971
20163 -224405 -200087 -117365 -212705 -344045 28416 -133507 28039 169395 -116549 46210 -98615
20151 -49848 21216 257794 -421968 -192726 -437934 -113597 190749 289246 168000 -229473
20140 42301 141686 -40180 -110550 -325408 -286966 -24794 278538 -115378 -350936 162801 19705
20128 123372 -22073 -188813 -285118 -385057 -159309 -63201 -160449 164268 40295 -173340 225564
20116 -175759 29013 -221458 -2021 94272 158799 -62699 57135 52371 -48692 -113032 -129222 -285644
20104 -285644 -58789 62134 -346108 -363 -148087 -129323 86182 -202930 -129696 73224 130287
20093 130287 -35585 -99658 73251 -38541 -280725 -89495 -453839 -253688 -252263 -86146 238135
20081 -48647 -3068 108612 147249 115184 -261698 -143506 -85647 -59994 46745 139748 -75838
20069 -164507 207994 99128 -95041 -123202 -127794 -5189 69403 248563 -333810 -238844 102212
20057 22826 -20241 125667 -168152 -72732 -52512 -90096 -225977 -359764 193921 -204920
20046 -312576 -83567 214091 -134505 85684 223311 -2892 121379 71003 127320 -74741 -150445
20035 -150445 -361580 -67507 -52811 -294434 -12366 142977 -296013 -40551 -190275 93897
20024 -158075 -149578 209099 11056 -100682 -214967 -72419 -32828 31772 21843 58935 -126202
20012 -141933 -58893 -136843 -104129 -132574 -131873 13349 232304 108923 -14635 111840 -281933
20000 181554 -340338 -67528 94571 313771 194411 143994 20335 93875 -20234 211215 -63899
19988 361375 232437 1337 -345252 -77847 -72728 -320124 -297147 146247 353700 -41067 295802
19976 -46968 -229907 -18390 -180150 -99410 -6012 -76069 210074 -31477 -6267 -45903 316006
19964 -281184 -75047 227545 77687 160711 32283 -131995 -204872 13065 34797 -67062 49865
19952 132438 -128912 129748 -164901 -28339 -117027 -129619 -78967 135881 131122 -106615 -78237
19941 -78237 374295 177182 -85982 -294748 -445498 55223 -315686 -37276 46877 165853
19931 165853 -151766 -196877 -315642 50714 242918 184337 -59553 -74453 61518 141259 -434877
19919 -32097 -37655 82983 -261760 6904 24473 63099 -363553 -156342 392433 154711 116224
19908 116224 -234735 -528168 -39864 30960 -59562 279605 -95786 85040 37563 -261887 -161137
19897 -161137 50650 -342393 357655 224552 -115169 -30511 -162541 46966 -164786 106040
19886 -12171 111296 2425 152272 -86618 -191054 303791 36179 -20308 -303620 -18855 -594475
19875 -594475 -276757 55633 -16503 -22475 79949 -141608 211411 154698 -164040 55466 -224361
19863 -380112 -202588 -51703 -268768 82212 49833 166401 -10415 19437 -129539 -24813 54862
19851 -171467 -10291 -431340 -191530 -279667 -188628 -99882 -204884 -47453 -59905 89022 162069
19840 162069 35075 -235678 125447 101102 -284734 -156701 -236506 -179327 -124259 -137140 36078
19828 411664 25265 -333298 -81337 21366 -215737 -246490 -218332 222641 359931 -206863
19817 -87986 -17192 -77076 -139451 -198377 -55697 -185217 360254 68563 74906 241329 -43417
19805 70401 -105985 -47739 -59511 -240921 -158222 -190542 -76200 76523 13284 -438714 -126951
19793 -302007 60438 -181572 97003 -26663 -82216 -89735 225768 -356027 -25263 40015 57138
19782 57138 180848 40822 145941 -115766 -110259 -328642 -194808 -31273 -102670 -26293 39029
19770 -196911 -21368 -218001 -102335 -303158 -22542 -227091 291044 -132478 37930 42463
19760 42463 16602 -81354 -377876 -201929 -144006 -159933 124433 -205212 12325 159718 -83907
19748 -225301 -13893 59613 -132518 -90042 129623 -151011 -123833 -102031 -52796 236793 110543
19736 -30522 101098 55123 -237723 -239577 251644 67571 164942 -118705 -72075 -352480 199381
19724 -24765 -77136 19446 -55075 79482 -313638 72987 -149616 97160 -156334 -167306 -276220
19713 -276220 2075 -114325 -85306 -185132 45195 -308634 314550 -79681 -109212 36846 -180270
19701 -36938 83047 -123113 -206118 -19073 -15634 170796 -43267 51919 124554 -7166 -315380
19690 -315380 -292004 -32824 -16648 1471 15072 106755 -52651 -47556 -160089 40030 -237043
19678 -235089 92497 -410220 93683 -348831 -436732 260193 37793 73799 -6110 -82391 -29024
19666 119399 -136572 -8788 79283 -190844 -228955 61685 -167963 -52885 -87255 -60627 -295675
19655 -295675 49428 89466 -153802 -222523 10874 148554 -118450 -125852 -250702 -30852 -119657
19644 -119657 145914 -115889 -38673 152677 -128054 143903 -218515 -179577 -455812 107074
19633 -20340 65935 -95661 130784 -220826 132600 14885 18890 47560 -406069 -158994 -34273
19621 -99973 -332566 -60088 -102604 14005 108062 29586 -383336 -60930 -117278 -141918 151249
19609 60157 -185286 -86220 -288657 -147242 95018 153834 33630 243836 -172198 6433 -104868
19597 -148470 -72654 -155064 -227214 164311 3773 101100 -13584 -79229 304478 -401090 140590
19585 -354910 -455686 -45313 -408228 -135230 -248584 -60047 138359 420300 -88856 -51933
19575 -51933 -146878 -318509 -303152 -292453 9894 -387599 -217671 -26608 -123763 92916 148042
19564 148042 -85777 -257124 150078 -528059 -115674 126232 -12356 153279 147766 -147998
19553 -227999 22621 238189 -221100 4055 -319464 237762 -298391 -271661 70154 170859
19543 170859 -147146 161659 255984 -163476 125466 -313155 -86450 -121869 45097 -73850
19532 -208862 -61167 -11800 -82691 221591 -30787 -245188 -178476 153354 -56150 2875 217397
19521 217397 13394 -335696 -297072 -147305 -23380 -278278 -126307 125029 -324248 87865
19510 -91342 223298 -296877 -227423 -86249 65962 -203405 283770 20558 -229671 -180240 -292349
19499 -292349 52595 199171 -216334 -135845 -46720 -290492 -243752 -268849 -188240 -367579 -46019
19487 9305 130276 21047 88508 61151 -144981 16202 112774 -188325 -187369 190311 -40291
19475 241557 -101212 -295445 31807 -64436 49231 2357 -162049 -136859 -39598 -182257 6244
19463 -58038 -106788 -204977 -215160 56675 -313640 -91732 89094 -78585 -184028 -146710 -43565
19451 183720 46188 -98024 26493 -82761 -51255 -110918 -170468 -352341 -47309 217967 -245048
19439 -89405 -220714 -112501 -2816 238498 29842 162013 -84561 -86770 -321954 -12641 -109755
19428 -109755 -31741 61197 -47528 -164648 -246891 -128860 -41494 53599 -91501 -127837 -17116
19416 51178 -98170 253709 -8715 -334331 -146595 -139039 101880 185335 91125 -60279 -129532
19405 -129532 -66227 -102311 -235152 -14737 -326569 2622 159896 -384816 -54532 285534 29490
19393 33282 -93019 -224599 -139892 37276 53008 -255456 86437 273217 9572 -44848 -117640
19382 -117640 74358 -45474 42138 -190213 36659 43279 -5175 -119096 -78860 -138397 108967
19370 -71205 -68304 -388091 -144951 81134 -81824 17374 -168174 238145 61938 -275807 -65618
19358 -166944 -283350 92786 -72870 -138941 -47048 487721 -211755 72513 -9857 -62512 -233647
19347 -233647 -259493 -98914 6011 -325351 -17516 299279 -36523 325050 5565 -225870 238524
19335 -188285 69257 120503 -144883 83107 -322983 -72269 -119124 136805 100378 120022 -206829
19323 -165156 44863 -103112 17212 -210567 107078 -54996 28196 -298165 -426345 -40815
19312 17820 7258 -143141 -90072 -61291 19697 -219441 -12281 -231662 94062 -222745 -17647
19300 183631 23387 -62229 84569 202514 -49608 15794 -145048 -62435 -25910 -188595 -176313
19289 -176313 -262289 12708 69355 -220637 -153930 8782 71935 -48266 -137737 -158298 -109123
19278 -109123 -235523 -162198 71778 -133542 -11070 229923 130769 -67359 5634 162131 -32983
19266 69188 175776 -128419 226034 -157772 -250427 115952 -159737 -161137 -222040 75056 -306572
19254 -233990 171795 -117702 82117 -82326 -59646 -92951 -87721 -337956 169454 -280159 -398809
19243 -398809 51240 25630 -26199 -20910 89468 -70740 402824 -171931 -104425 -20422 -178170
19232 -178170 -283760 30310 206268 106323 -199214 -11738 -53803 -175743 -100556 -220377
19222 -220377 35813 -3643 24752 275540 -35139 -29604 -197776 184417 71089 -80387 -86754
19211 -86754 36607 -70766 91780 -69439 315123 -72667 37948 -70197 171765 121358 71494
19200 71494 -371500 -216676 -247412 64554 -336113 -188979 27908 207605 -135184 119819
19189 -146441 -217843 108625 127042 84491 55515 97899 50746 121669 -39281 -115971 -90879
19178 -90879 -69312 196522 -79119 -388674 -27317 80681 -67280 -265846 305392 186617 124374
19167 124374 -36883 201745 -155315 -135732 -68118 -78854 101976 191738 -241860 157444
19156 -317587 9789 -120220 -370195 -278851 -137724 -245815 -6106 -170042 91109 -212226 -158943
19145 -158943 213529 -148913 -26957 -193554 -240031 75115 -106371 74682 122878 -112403
19134 37206 -41180 97363 83760 -71248 170521 -115938 -8674 -418708 166099 340705 -415854
19122 -257709 -323786 109765 -115008 -107707 39958 -145451 -283405 98429 -146262 -172640 -25196
19110 182659 184935 62226 -187428 -10436 133550 -113475 -205787 -31137 46693 -133149 -186472
19099 -186472 62331 -293545 -101822 413671 329247 -5699 26822 38020 -291299 -125861 -134665
19088 -134665 81585 127968 165240 273111 -19166 -303492 -4400 -168792 108435 -42627 -261903
19077 -261903 148821 -149936 -75724 14977 77099 -66215 83690 144166 59746 147550 -47502
19065 -46097 -9031 -360520 150594 -236376 -55728 -37118 -147395 -150290 -86174 -121475 -139421
19054 -139421 -229932 -37981 92432 104812 -97971 44915 -126001 -154423 -101045 -115940 96180
19042 15085 -28531 -51127 -64999 296461 -43302 -285407 -40788 249183 106456 138517 -418196
19030 -104230 -250525 -179308 89047 117520 -133230 -168507 -147690 159905 61810 44643 176555
19019 176555 18063 -97003 -362419 -137113 -138226 11853 -84048 -107970 86814 -339577 -203030
19008 -203030 -144205 123343 -236393 -174302 151176 -104714 -60328 108873 149750 -33979
18997 -205943 128175 -374029 -632 -172712 -41118 -164255 -160045 -3506 -330070 -45209 183727
18985 -15707 -183392 202193 -92047 -264350 -83007 266404 -13430 -329794 -89999 -310470
18975 -310470 -37232 114388 47310 -305689 5157 34695 -193037 168022 -27676 64847 195990
18964 195990 -7651 15441 1015 -59202 338610 -78191 -139162 9726 -63569 -60602 102262 -57424
18951 -100586 -37891 -70599 -203724 -150458 -19932 92576 -310077 94798 -383653 -226070 248754
18939 55611 -194606 -89060 -310239 -144099 117746 100213 -98003 -160847 16802 -344459 270010
18927 92115 -143771 -323234 -382913 -460121 12644 107024 125219 -81569 97983 233422 -134326
18915 63331 226954 84830 -99634 -274704 24613 25921 -67174 104932 222578 74709 6977
18903 73999 268669 -185722 11737 -84751 -147121 177921 -117561 -143270 198955 133735 -177642
18891 74317 -92118 -25827 -55468 105541 -303342 72219 -414277 -557531 -21003 226191 -6932
18879 -241494 -230616 266486 -128325 110832 -94957 83162 -10684 -253216 256 4391 -165104
18867 449208 -424707 -348238 -95779 -16271 35916 55072 -143217 -187688 -92359 -470 56014
18855 -55159 167859 -228264 20513 -166865 223922 46706 -259782 -58526 -61047 -195860 -620563
18844 -620563 20778 104145 155703 -177796 36861 79867 -10369 74814 -294899 83071 -402619
18832 169648 24405 27448 -311143 78409 -81480 -122245 -171067 -86148 3155 88869 25198 72218
18820 72218 296934 -251107 319644 102845 134505 -56838 -141067 104553 341380 148436
18809 114456 -115040 -27005 -68304 249829 -241118 -86758 -225094 -44184 -242899 -115083
18798 -224744 98481 102724 -150026 100934 -170452 -7275 64445 315793 3094 9778 -75381
18786 -390619 144321 196588 81203 273484 -360141 39631 228331 -65812 -89913 -142209 -314724
18775 -314724 77779 -88158 -310946 -3448 -210575 42674 -37681 -235290 -218839 75073 52015
18764 52015 -268597 -233347 8881 -309014 -374028 14109 223269 -328206 84327 316781 -344865
18752 90741 -155386 -421062 -256911 -31793 340407 -62723 37786 -40902 207927 -201061
18741 -338897 -12512 28512 263333 -400743 -87866 -68611 300796 -265447 24958 -180485
18730 75478 -99102 -207946 -186674 -17471 -116264 164476 -1234 -144597 -177751 126077 224176
18719 224176 18800 188095 -97138 -126268 84243 -130353 -387775 -32384 26747 -81651 94831
18707 67039 -45857 -13691 -216876 234422 -26 -97872 26502 25882 -171572 -444676 187900 393427
18695 393427 82111 -203825 208964 -300762 -134060 82332 -281449 -7559 -147746 45705
18684 -1463 -73541 118939 100077 -367035 282395 75361 -210464 112244 -97197 -52009 -262920
18673 -262920 -366422 -210054 15125 33773 -47889 208524 66999 -322270 -296142 19220 -357322
18661 -191908 77355 -509663 -53311 -419611 51761 -271723 113915 42452 114766 152408 315132
18650 315132 159644 101684 48054 150476 -66901 9734 58276 60128 -161171 103153 -4172
18638 -270918 150902 -410406 -44614 -178620 -106939 -292750 -280294 -278000 -109152 290691
18627 40575 -73444 48762 242091 -83103 333975 -117999 206600 -14286 -234990 -123533
18617 -123533 10810 1979 -48575 -97465 -128541 154142 -37751 181829 -160710 -139301 232163
18605 -92875 74424 101816 39842 151026 -144579 57136 -204639 -29693 -397692 110392 -37477
18593 -86169 -291607 -102990 -342527 -165216 275167 -230136 -244960 67204 -250164 -160 54433
18581 -122165 -311679 -208264 -36678 -87768 -57862 146440 -313180 -13025 -80449 -319160
18571 -319160 150983 -485204 144532 75885 -42493 -66690 -85949 234439 -36507 -203528
18561 -203528 -7762 53284 251559 26541 -143853 -218639 -9354 -100799 -278028 40476 -307577
18549 190259 -101646 193913 127717 -25921 -105918 -54113 -130388 -121439 -189476 219244 -288666
18537 -34544 -194047 -232569 -173752 -122674 2578 -48072 55730 -64990 169216 52276 25861
18525 315731 -37072 155156 -142785 -388210 -115436 -248376 -415992 10500 -130808 -10086
18514 -36368 59524 -165862 182599 -303099 203890 -164431 17344 -67704 -268231 115704
18503 86281 -94461 -197205 2879 142893 -90334 -288163 -50679 -328197 12797 -82934 -137039
18492 -137039 276889 -270026 5240 104868 -27689 -312494 -223007 -196621 -93111 -321015 139581
18480 139334 -315965 171282 36920 -142648 83353 176039 119650 -47957 -143022 97587 99142
18469 99142 -43623 -76703 -192089 256423 -218785 -80913 -324088 -59340 -37050 76099 -66383
18457 -68256 -78078 111674 -60791 50589 -17453 -47559 52069 -256992 -52806 56837 33596
18446 33596 52551 148226 -77588 -73822 -130416 376535 -213796 121037 193096 -46693 157031
18434 -166968 -234287 -104115 -113605 -294837 -86446 116080 -104396 -249901 -130897 198903
18423 -38775 89909 -300806 287390 -110122 -248903 81096 124219 151103 51527 65947 238597
18412 238597 -52961 -183598 -210613 127766 40330 -62448 -15079 -12643 -4109 -206727 44160
18400 -77929 -114705 205661 -147234 227572 95992 -226683 -58577 -254115 7183 -59832 -188005
18389 -188005 446036 -52718 -227184 -63480 44323 -126790 -86363 -223720 366572 40600
18378 -175038 -185896 -236971 174122 47625 -64719 103970 -221823 -68619 210749 -128928
18367 -223954 -138672 142408 129383 -34561 135604 -247509 141153 -34655 16330 -33899 -197721
18356 -197721 17492 -259949 76951 -28445 8282 260664 -14732 121779 -152955 243988 -55657
18344 103211 279309 76711 158197 358250 -45326 -238408 -70060 86058 105183 -67044 -267246
18333 -267246 -11963 -123920 630 -125240 -133920 -235271 -30735 -140573 34675 47840 94922
18322 94922 -55830 -148357 -68325 -129716 223269 21719 -30515 70264 99188 -392822 -189624
18310 -24120 37663 268542 160962 218097 122620 150550 91472 -213579 -131965 151329 -61331
18298 59534 -346001 223372 245957 21907 -58788 -166021 187607 -301865 -274703 -350141 -277381
18287 -277381 -227258 -129609 -363533 -389955 -355350 116425 39798 159738 1841 185798 177249
18276 177249 -140340 125660 -125876 -103838 -503737 -99936 -71149 -293544 -181526 -51292
18265 -31421 -13182 -70454 105121 -49626 144866 1036 -243511 260880 47230 -255815 190583
18253 112293 11917 57342 124061 -22393 -105409 92502 -241964 -159043 -7290 -219431 -73837
18241 -135813 -52627 98710 -47122 -4695 174212 -277301 194582 -106352 117660 -145258
18230 -169803 -92959 145140 -63927 -254283 -105144 211168 98809 -57951 -223271 -65166
18219 276815 284630 60664 244334 -56401 14637 33106 -100848 49467 -52667 -91817 -32050
18207 -212150 13388 -180723 52128 22378 -74490 -166055 -194977 -19285 40403 -191844 -100881
18196 -100881 301483 89882 -104938 -200311 -276457 -61573 -101537 -240184 -20641 -103659 -159500
18185 -159500 -218577 95709 -47661 -220681 243689 -222990 83186 -19634 -180282 92225 65103
18174 65103 135969 56225 -13801 337418 -111449 -17486 -17367 -62924 -4061 81751 -241304 168747
18161 -48332 -118201 -83933 -146455 168763 37330 -216831 -40001 -339179 -246117 -89186 73932
18149 -140336 20036 105652 5911 -105776 -123534 59768 -100931 205922 -244281 70094 -156990
18137 -101174 -191252 -157892 14193 -122504 -151203 106725 -43805 -305270 -103370 -170595 -161057
18126 -161057 -42053 -39015 -279420 99509 185946 47466 70894 155681 70592 -129418 -10735
18114 172530 183117 -146432 -111361 -279620 107262 15739 -106944 -20715 227589 -20463
18103 -333890 -92161 9166 43745 244759 -82711 -45254 -132415 -72156 38985 -338657 -131560
18091 84301 -245804 443802 -191113 27598 -2435 -183690 189065 67464 -35558 -80555 -174252
18080 -174252 -96979 106209 -132391 56820 65708 122852 203387 76375 -151940 341399 -272975
18068 -97369 158334 109933 140523 56226 -245535 -312270 -199832 -100342 116723 -5413 35526
18056 -106690 343433 -82699 -130429 -161976 -288444 64144 70398 -263829 67820 174603 -13614
18044 592428 -8677 -137632 -17284 -10997 76966 -181990 -25932 -102641 28681 210999 381907
18033 381907 -154749 256350 -328115 60736 -36531 5415 -92321 -166609 8204 -417441 59848
18021 144332 23932 -3450 -152600 -189987 119314 -96868 169444 -83501 -74100 79431 -39074
18009 -241664 -61257 88615 -175297 -121430 -453150 197592 252684 -357846 157646 -93777
17998 181727 88121 -286409 -3718 -55011 -38467 -138317 64078 92400 16189 -54603 139892
17986 -96706 169281 163101 -52105 61073 -34936 -131052 117810 -292323 -279729 -174481 77634
17974 60440 65174 274612 122496 -196181 134808 -4176 146438 187742 190584 13644 -98165
17962 -94811 -25243 -52892 -23489 -468488 74567 84421 -72809 242074 -238118 90019 96909
17951 96909 -67525 52026 -114549 -67260 -73859 175626 -131893 107544 -210957 75266 -116098
17939 241687 67473 112829 -219279 8339 -3015 129284 30588 31279 -99893 -172392 -115916 -197622
17927 -197622 -133133 -311053 190031 -294743 -48999 46853 69778 109327 -116625 -244308
17917 -244308 89781 117624 -8110 484944 -63198 -13456 -77088 102937 -407950 -107976 41820
17905 39929 126416 -302011 -168631 147189 75864 -313763 115770 -21506 -76490 79669 -221063
17893 -124306 215992 155786 -271120 184925 11074 88426 -102065 -7626 505931 20906 -373415
17881 59198 -74885 -322773 104310 67269 -215566 -3334 -345129 93701 66394 -19459 -315931
17870 -315931 132750 -144641 -137241 -154690 166591 286134 -94312 -45680 -103588 -59345 -72288
17859 -72288 345650 -326356 321129 452338 -57553 -263698 -319241 275439 -82896 432688
17848 74601 -53702 -189384 176547 -220440 -9418 -496016 111690 -97621 -279564 -4229 52554
17836 10817 92466 97428 36331 -69076 -59406 -77025 64191 -44069 224106 73496 106208 86570
17824 86570 -143005 93265 106999 -251130 93240 90301 -80654 188503 -144537 90247 169696
17813 169696 -115393 -159636 -75779 -3537 -73256 87868 223910 16741 338016 5241 -89743
17801 -1542 91985 -172617 68186 -242378 243186 -59880 -28976 -8004 -63003 -183352 127212
17789 -49201 -58892 137381 151813 -100098 115852 63709 -29552 28949 18862 -62780 16400
17777 249969 124326 -155189 74968 258829 -97288 45088 -30039 140260 87141 154161 49314
17765 240996 -178520 -193298 154231 207479 346159 159054 -65768 -90247 -161245 59562 116655
17754 116655 14620 179500 86048 -29276 -232556 -149790 -184969 58413 -147262 -333985 142553
17742 3511 132629 -157625 -122235 -59342 -60568 -90229 9953 6921 40775 -2196 -546924 -112261
17729 230921 108147 -63027 -15706 185273 -79954 395671 97453 83491 -94629 -8168 -244416
17718 -244416 172528 28231 -25035 -243580 -74477 103754 176839 -25063 78669 88523 109083
17707 109083 169076 -237467 28159 -154864 -50330 104802 10369 -47945 -3026 99335 -177635
17695 195626 17101 175817 -46652 -117302 10006 48468 153373 -47004 -368828 -158199 -116004
17684 -116004 42125 71532 -52765 50015 -56877 122408 -40150 -86745 -242635 -167138 -52443
17672 -401427 -18263 226712 -344297 -212402 350227 30148 7264 -20537 124007 -263966
17661 321761 116815 291363 -85945 -152963 -73197 241663 26134 114623 -185573 -79053 69846
17649 63460 386642 -199849 -262140 -99176 20275 248249 -245128 125281 249534 -76229
17638 -16611 -249513 -252906 -6872 60691 -105769 177430 39121 146511 265219 214069 105058
17626 96048 389930 204837 -10555 -95091 -6745 153595 -154164 98740 -224315 133147 59289
17614 70003 -98550 43567 -380640 -114111 -197861 74864 16274 -7762 132402 -99553 105848
17602 -119018 78705 103934 238822 -48254 170891 123277 310808 228000 -120201 119415
17591 -194680 77479 -191935 154881 245139 -43368 9450 161635 -95947 150162 -101680 -10145
17579 -239539 159600 60512 45677 232241 -93943 -190070 -142383 -144486 -188230 -16671 18103
17567 121983 -296873 101595 137223 214179 69297 -111993 332519 -305271 330106 537412
17557 537412 -25034 -93662 -143986 158399 -100704 -87677 -126735 -160114 -217357 -98006 166576
17545 -3291 285739 -113461 -97294 12337 36993 29761 9909 223104 40667 95400 -206364
17533 -15135 193141 -7935 35153 73621 225577 133083 244424 -87313 -62752 194339 -408139
17521 121499 125061 1035 41665 -52281 29123 68604 -106635 40892 -27663 114903 217901
17510 217901 -132466 252368 -147720 -28472 16812 -176925 -162783 327610 -10216 -105416
17500 -105416 153800 -209691 105823 296434 112753 154668 140694 -260291 106483 131651
17490 131651 127252 116113 190715 -401198 348662 281151 157052 92931 -62929 220577 272226
17479 272226 66495 -42063 341190 177687 234077 60245 187118 117634 59415 153951 100137
17468 100137 164123 108827 38214 154941 117628 -129104 246224 51758 -74554 -64273 -6111
17456 -138855 -43708 -16531 216884 40616 355923 57658 -147660 -19638 419911 641966
17446 641966 380064 9071 106813 374504 -12950 117899 286412 295166 12987 220979 5669
17434 112221 171880 140692 242229 241364 155694 278991 168439 322539 99559 472492 401047
17423 401047 383938 359074 -124021 86210 185790 211933 105232 32755 427480 47116 -219853
17411 346142 495566 95634 233479 -146009 95223 98322 135609 -82872 89892 121082 12840
17399 396286 317498 397787 -23801 -127735 306684 -138628 -20518 77744 144342 144901 -123644
17387 289100 147145 120262 487406 243070 14274 33551 -18631 55018 -37438 194402 159304
17376 159304 114380 287136 -118644 246905 -15592 519874 314789 260035 122292 277019
17366 277019 -84737 370463 266264 318029 193109 40462 -41149 81847 6646 -70348 188707
17354 29011 422348 156058 26994 298723 20161 170452 323758 -167981 958 81124 62747
17343 62747 239958 319897 126014 194120 -237746 385624 27875 233317 172922 178523 176592
17332 176592 57424 161996 -7045 281301 284444 138102 87681 100840 162243 79452 205207
17321 205207 565337 255784 90723 303759 -44157 308634 323673 464697 -40812 -141165
17311 -141165 160863 154725 120987 13654 185746 270002 554450 158903 2103 185322 41985
17299 -35395 222633 431158 83017 122590 42664 -116400 217832 470464 110088 15981
17288 101224 131113 217791 582745 88964 195247 348722 429210 -36906 430055 164254
17277 -59501 288198 -119360 183319 -87484 206952 204499 68235 390338 82962 173023 349677
17266 349677 158878 160347 244395 120864 170481 290253 407854 -4579 376570 279298 56685
17254 255444 116391 208413 327454 62424 113089 366739 206076 24972 -98724 -5142 200345
17242 199483 50190 101231 -156313 309616 318546 213169 284978 167233 112847 78218 93641
17231 93641 -62813 452946 258594 46268 210796 197463 -263388 -121671 379774 202072
17221 202072 -240425 610800 267105 364602 -747 287185 291659 55811 378042 206096 53025
17209 37376 278620 190592 241545 343966 247054 72961 -61072 120310 48308 35616 310040
17198 310040 429444 195801 282717 145540 65612 17874 145291 339530 257484 149825
17188 149825 312911 127231 87763 492629 248043 308360 371941 28984 304353 -14336
17177 217317 46806 270928 382247 74217 11101 438528 177801 473793 487269 338563
17167 338563 226716 368713 12196 488845 495414 286447 -262680 342662 160872 392255
17157 392255 -201050 519728 465858 252498 593813 625595 343064 711423 94112 310186
17147 310186 142896 2896 461081 -114879 192872 362987 66257 319864 325392 72402 62200
17136 62200 555927 163927 237111 435661 340331 231129 198990 107082 495127 378128
17126 378128 328898 251194 105230 431451 385816 356863 92988 293533 245607 300141 160902
17115 160902 272138 337187 555932 335064 485805 501662 324782 387382 265095 487805
17105 487805 434566 292731 310253 459667 -18315 444045 402575 284455 244502 551579
17095 551579 352426 730583 17957 657850 52386 487255 436838 336814 384124 704688
17085 704688 687799 371370 419715 527901 188962 333023 831450 574909 254798 392595
17075 392595 575854 624448 105940 362246 470438 486343 358852 365926 603718 571389
17065 571389 597178 351327 788761 474282 680163 539567 300844 645442 276474 334657
17055 334657 423414 496865 306365 584038 816577 600503 506525 117682 464518 691633
17045 691633 467910 436883 656098 506805 469944 663734 368522 624589 742848 624418
17035 624418 438028 515328 636788 652003 583349 399464 426040 692055 865772 613881
17025 613881 433578 620365 734257 502789 757110 624061 671460 623541 657280 657774 931421
17014 931421 946031 1113024 629566 632884 525374 720244 707741 797669 817710 692343 502802
17003 502802 416346 360326 955713 698388 616338 371941 1016009 783736 806444 845432
16993 845432 962853 813032 761777 840256 642151 687333 579435 737765 816506 878500
16983 878500 728648 775050 931325 1194430 856686 862662 872359 819835 1110351 818794 1065596
16972 1065596 973546 1104857 1004938 814073 1138947 872540 1094565 1052203 810294 984500
16962 984500 926512 894740 830761 749218 1257428 1178879 1091596 1117189 1029571 1003759 1206903
16951 1206903 985794 1055442 1181311 1030533 1004048 1151022 1231924 1126800 1128493 1017674
16941 1017674 1377293 885811 1083364 1193186 1209463 1367228 1341222 1309432 1440696 1150947
16931 1150947 1304620 1343598 1224879 1296544 1407597 1435703 1410362 1392551 807255 1284321
16921 1284321 1715422 1683939 1505363 1579473 1584917 1942541 1650802 1662376 1944676 1620233
16911 1620233 1959807 1898889 1431284 2031289 1392415 1440780 1526240 1772674 1842407 1711006
16901 1711006 1763316 2103924 2021277 1497722 1712096 2119954 1854897 1801620 1925508 1921718
16891 1921718 1925199 1919256 1768766 2275068 2121453 2118967 2105168 2130958 2074118 2183879 2000653
16880 2000653 2135437 2148134 2238069 2343239 2368487 2172948 2457858 2474112 2537915 2633020
16870 2633020 2515724 2702673 2708787 2570255 2631869 2288563 2807524 2741120 2759722 2950741
16860 2950741 2897058 2877447 2735444 3251997 3132473 3172239 3430639 3084858 3407602 3611663
16850 3611663 3270333 3529004 3556551 3382193 3707734 3514400 3710599 3797687 3483184 4035247
16840 4035247 3900774 3894978 4091668 3969878 4047634 4166249 4676960 4370179 4333033 4168071
16830 4168071 4639039 4854030 4738220 4763459 5058335 4925047 5307402 5258356 4995658 5441037
16820 5441037 5200080 5952471 5471589 6157632 5982520 6322431 6139549 6381877 6301402 6374603
16810 6374603 6505282 6581557 6814625 7066116 7259111 7298169 7628761 7715345 8217036 7911417
16800 7911417 8360473 8735672 8688365 8796612 9451813 9587270 9511641 10193900 9849838 10466635
16790 10466635 10280234 10977977 10919962 10908765 11586381 12301761 12503639 12450012 12734182 13229723
16780 13229723 14015171 14480660 14692068 15339924 15606565 15956487 16777385 16903108 17564352
16771 17564352 18091292 18537039 19465320 19939053 20652112 21494557 22106165 23196131 23767299
16762 23767299 25222922 25869484 26688309 27872050 28999058 30142681 31400900 32652173
16754 32652173 34193325 35796824 37414719 38693306 40685310 42661225 44645778 46938387
16746 46938387 49627962 52005808 54340624 57112297 60451829 63586572 67222094 71337162
16738 71337162 74876998 79180801 84021345 88883086 94389626 100094907 105720794 112316510
16730 112316510 118987027 126225805 133120936 140801962 148397987 156352833 163861910 171392548
16722 171392548 178481185 185026768 190756473 195130504 199040128 201194854 201612687 201485876
16714 201485876 199366610 195981981 191387131 185815506 179040545 172275185 164435063 156539524
16706 156539524 148427168 140644486 132801209 125174684 117797893 110492508 104017884 97650996
16698 97650996 92218110 86429368 81169018 76281115 72057634 67990257 63735868 60464659
16690 60464659 57218324 54005208 50933051 48380581 45782115 43988664 41651754 39462717
16682 39462717 37372020 35714926 34266091 32329955 31067972 29435563 28440865 27011637
16674 27011637 26156526 24881905 23837016 22668458 21727893 21267440 20507195 19750195 18607093
16665 18607093 17979033 17418161 17082271 16182664 15893009 15085193 14781204 14658181 13785352
16656 13785352 13359495 13226811 12682272 11931717 11988672 11639666 11132149 10730655 10181147
16647 10181147 10468193 9757361 9593322 9760177 9454270 8923843 8647192 8411351 8397730
16638 8397730 7874656 7935465 7350223 7289525 7137595 7189911 6756948 6718742 6385894 6541427
16628 6541427 6424017 6173158 5972228 5705220 5700782 5556394 5602849 5351106 5582983 5080265
16618 5080265 5074564 4948063 4787072 4921331 4495679 4713068 4293872 4496728 4061436 4412188
16608 4412188 4138678 3971203 3939516 3913909 3563691 3757810 3759356 3800182 3526501 3316294
16598 3316294 3546809 3233843 3609048 3189984 3113915 3323744 3193561 2963900 3150637 2899505
16588 2899505 3074734 2784365 2550768 2537741 2697693 2954524 3045853 2476953 2536724 2365889
16578 2365889 2633095 2545420 2495812 2305190 2095350 2171612 2172704 2234302 2121910 2049280 1940805
16567 1940805 1796077 2186511 1903545 1963932 1868447 1879743 2164326 2092066 1816263 1882634
16557 1882634 1704650 1884078 1921147 2066834 1890003 1745620 1576081 1729182 1492193 1648372
16547 1648372 1700494 1619985 1485075 1047498 1084742 1527477 1789534 1456720 1437966 1387968
16537 1387968 1378169 1480392 1250558 1533227 1362607 1323527 1436323 972200 1376666 1240000
16527 1240000 1080508 1355094 1143370 1479037 1053452 1267060 1018402 1220007 1421150
16518 1421150 950926 1360838 1234964 1008234 665515 1069559 859440 1001999 1029816 810893
16508 810893 965985 1040264 876805 807287 985312 1412976 679782 918867 1119028 979004
16498 979004 819062 744014 745414 1094489 1021518 1156545 765315 484726 823715 686894
16488 686894 676493 832772 798508 708879 603164 926594 1021645 558333 737784 319702
16477 1120199 657038 764733 403874 872862 444716 548753 433172 746966 708060 591356
16467 591356 672855 988727 674175 696105 587542 937370 559205 1074990 766291 697822
16457 697822 503804 646907 831383 558579 370463 476072 452161 199684 534366 614740
16447 614740 716577 843539 829109 580472 514812 361356 307743 311111 470183 698640
16437 698640 612019 324366 521881 342329 326366 723760 321211 400440 413939 485310
16427 485310 416419 421382 316925 272957 340507 790695 49797 547696 573556 470486 471442
16416 471442 514940 149776 327271 434674 483759 330579 366678 343614 335832 367129 448245
16405 448245 364749 403790 261979 481302 573307 347447 315650 187500 382832 412723
16395 412723 393554 299013 226979 509994 343269 294091 145247 452893 270699 235840
16385 235840 294746 253326 370344 479277 224444 -54036 187717 267906 492897 -37919
16374 569570 76490 220130 200436 86787 227133 373338 116915 259676 196420 242229
16364 242229 110345 406734 650835 139939 138988 347911 422221 318922 151476 726468
16354 726468 333106 341144 188653 37006 320646 333820 296023 366454 304820 304467 304933 367435
16342 367435 199659 370047 391735 339241 254065 285581 524472 422235 309017 466412
16332 466412 70351 310789 162321 211026 383156 239136 -93009 -199506 273211 202720
16322 202720 303787 458232 -174029 -102537 146351 165829 2508 307190 -257152 292617
16311 -165278 70839 -51537 336611 15633 476204 222019 16268 13907 373255 -67562 23109
16299 77101 213709 242728 264778 206492 46342 104776 -288865 133277 172283 145890 181632
16288 181632 231795 -213380 188830 128268 143046 -154117 63715 119404 96970 -218370 10682
16276 167394 418322 159297 195428 -41356 225007 128463 -47230 -288023 88838 349916
16266 349916 15160 344958 121449 28019 80581 339461 -97406 244412 -144235 -121761
16256 -121761 -115190 14116 -2867 -82697 -300094 185816 179265 312586 80907 323288 499783
16245 499783 -107315 185953 -113185 -205386 32287 -95841 -101089 230200 -107319 253361
16234 -43144 -171332 -19942 144441 195012 368953 305795 -48054 -29578 -91120 191111 -57284
16222 -1266 193515 -160686 265983 -194523 270807 35587 -141119 -8812 -31346 258384 -167904
16210 -51107 -11234 211879 -2491 -24759 -243062 -159317 -184549 348388 -137523 188694 -5857
16198 -17521 -133276 -45279 -142701 -14943 -72829 152915 162111 240151 133387 -150450 149432
16186 251861 389432 205302 -66365 -8907 205827 304446 76170 106524 -18417 759851 -246165
16174 197540 -255681 -107598 -46031 -71607 -45992 338752 -179261 68262 -28589 82436 156543
16163 156543 73910 229700 -186097 -77681 21657 60275 296404 -90913 174536 -8152 262714
16151 211284 241364 -215513 185176 -211712 130899 294723 127750 -71308 5112 107252
16141 107252 36897 -4177 -14953 130966 239850 71778 269662 67880 -109727 559608 -125122
16129 79742 -203062 79191 -290043 -135290 -11826 -2751 -16774 18558 42669 -149435 96040
16117 35521 229492 -408438 -144660 141843 -60869 -176364 -257893 266044 50990 19989
16106 -59994 125311 -160518 266790 143574 297931 164349 188156 237235 41618 -181061
16095 130118 -96010 63575 -113243 -113811 -242704 -1752 174768 -102540 -188581 -205629 48218
16083 -100668 -50919 154679 177821 115468 -26327 223874 -64161 100763 -207392 -140763 243157
16071 -153661 -170482 -17469 -259620 46423 44664 -11328 268525 98054 -179978 212196 226928
16060 226928 -246298 225350 43003 76891 113167 -96654 89210 214196 -106337 -232836
16050 -232836 169345 143755 -161017 -209419 -311858 -63625 -191962 -14533 -69578 -78488 -119001
16039 -119001 163261 -7699 45599 -65833 -104379 -167205 -559795 -81134 43681 57021 97186
16028 97186 -29323 -108370 -34999 337307 84741 303163 -20862 -279780 4269 -96709 -46027
16016 -29306 -13121 -190457 -129450 -105386 17895 -64517 -3564 -254947 -477803 197702 112480
16005 112480 296771 -88051 -114882 -1512 -162136 -144118 109555 -61016 -224940 165167 82295
15993 -27036 204798 -143424 -81116 163339 -136832 29865 143917 60282 -98743 273742
15982 383698 145296 355430 244931 148911 -9944 -242440 82569 -10228 149381 44420 -13506
15970 -43851 92338 -163167 -135120 -87021 128810 -35203 110791 -69038 -14492 -250509 -80842
15958 -49625 118042 -122917 206604 83158 -118428 346503 -147679 -71561 163549 -69952
15947 -250717 189215 -39999 -83904 224061 -108488 18603 69883 142865 -13720 -320601 -431241
15936 -431241 -149992 -172539 -30590 -43641 -69825 -156274 -108351 -21273 35903 183813 28573
15924 50790 2339 223105 -7863 -85200 -46427 -78612 9371 -182144 -35936 -95858 220442 -36628
15911 13655 -81257 154258 -352316 34587 211939 -86418 305818 -166949 -139507 41612 127653
15900 127653 26578 -28771 -312946 -12689 152750 -99494 -184417 -326784 203373 -49333 -230994
15889 -230994 82763 34475 -22257 -71111 102332 -11033 -298310 -343288 125696 24964 37376
15878 37376 -113602 -314457 395608 -13655 -376305 51483 -89329 134527 154179 80230 -65646
15866 35446 43890 -203144 92671 -238044 62183 -346877 -59786 146945 -249532 -23639 -139258
15855 -139258 45239 -428081 10760 -123298 -122446 -52388 14606 7583 -174468 -163636 -89036
15844 -89036 -155066 -110992 -155885 -110848 -14104 -84335 -165815 -41129 -202383 -300218 -230878
15833 -230878 128133 -14486 203634 199066 -421669 299755 35388 -64266 27071 130460 36679
15821 216593 -164205 -302723 11292 -84676 154839 243724 -94588 -324488 73016 29763 -240165
15809 -33735 416420 211354 -24320 109231 79563 269614 -36023 53372 136045 104492 -12768
15797 -10518 94652 -151405 3679 115336 -74770 -174351 188608 -47250 207443 266007 -48044
15785 -42161 -153454 28278 -99683 -28195 -32745 -27517 42403 -492219 -11802 108067 -183111
15773 -121490 118737 196038 -50222 -160052 44133 152783 26190 -215872 48198 101425 -170047
15761 38381 -301773 -61774 -84787 145306 28873 -78110 -96168 -16630 -226900 197778 -153712
15749 330134 -95056 -189615 39481 25864 247670 -119439 58932 -15285 254534 21725 -68534
15737 74195 -217145 245155 -126558 165188 92533 -142877 -149158 87328 51219 -31038 89986
15725 19747 13425 -121514 -146659 115135 -108695 -303746 -216688 -28777 -160065 -89627 103043
15713 -36225 289240 237242 299531 -202310 87704 -69724 -348910 -125053 -287157 331453
15702 101298 74663 -329503 48776 -257252 -34421 -154165 -66469 161502 108767 -204850
15691 -55327 104278 -119069 118891 -1382 -164498 138326 -198510 -359683 307291 -127408
15680 -349016 129204 13533 -264780 -54204 -229868 28415 307255 200433 -261573 -272062
15670 -272062 -191872 94089 -34653 67875 -285507 -81242 -5975 -168047 40456 251384 102922
15658 -159806 23740 -82682 172752 9362 -288185 230899 172623 60106 -265081 -262314 -190379
15647 -190379 65716 -87205 -121296 -28120 -147169 51440 -193267 130547 190913 -62909 -107714
15636 -107714 -137846 -228021 -70806 250797 -444381 -184499 182987 250582 -12441 -334839
15626 -334839 156444 -45167 -60255 -43194 -67871 67047 104131 -107594 112835 -6317 349650
15614 265505 -91590 -31842 262402 -232257 -291931 -400607 68639 132059 35274 -18041 125326
15602 108483 -107036 244102 -185330 233698 -97215 187531 -116846 101483 163579 -372248
15591 -274358 -273969 -151178 106523 63256 118560 -139866 -13847 -27348 75441 -102951 103910
15579 67678 69005 -130500 -64498 -170382 127810 -30240 -288324 123298 -193788 -159626 194352
15567 47672 -23994 -126731 359374 -207380 -45125 -5601 -81998 94281 50612 -25319 -83116
15556 -83116 -167315 -144508 -255814 -105924 -256865 210466 -264368 -136008 -46894 126443
15545 -348539 29568 191292 -202435 -387589 -351541 -350381 135148 151734 205963 127898 285722
15534 285722 95620 14837 171614 177969 13384 17732 -220375 398903 -18054 408108 -96642
15522 -92237 69777 -114679 -51717 60823 65360 -149201 415046 123342 239569 -40838 -208740
15511 -208740 -25735 333243 40846 221872 -267553 -182881 -332634 -306614 -60048 -115689 133375
15499 28669 -102170 162427 -120807 -168237 14727 -31247 99948 -163443 173844 24649 58956
15488 58956 38680 -217309 -148493 -37828 -88141 -58957 -155306 -96429 -49770 320613 -80009
15476 238721 35653 -296009 97339 -312834 44617 -97877 426205 -1564 28762 116867 -191214
15464 106453 180842 -147386 -68798 45630 8616 -71780 75190 220560 -169716 254158 -10539
15452 -99149 -52786 -108249 -247296 -146481 87295 238773 139084 27692 -46219 350686 12077
15440 -301074 28944 -218847 -66123 -57861 -286991 -267270 74093 62055 -105528 294435 -161339
15428 -181682 -215409 -119160 -243098 -205545 9495 -86258 -155717 172155 -13625 -284223 4911
15416 41943 253680 -39074 -74007 127591 -13037 -71462 291233 -104525 -62281 -162134 -22739
15404 121102 189584 142601 85952 -47359 115350 -37320 -177954 249355 -352344 289291
15393 -221547 -63409 -196883 -77359 -244417 -181271 126575 114513 267772 94951 54918 -219301
15381 -73985 223360 222131 -54708 178075 -182292 112457 -10091 274540 -405463 -55114 -153697
15370 -153697 -51188 -77893 -442872 413829 311789 122648 -296980 -343684 7629 -8260 113045
15358 -172970 279991 -97017 268808 -167887 34659 -217689 -528300 -260920 19450 190886
15348 190886 55077 133137 -46691 -129830 -240065 110875 7892 -239986 -146855 236885 142574
15337 142574 -76460 -188711 -69764 111032 133399 -124325 -17404 -334287 42774 -226789
15326 198896 -78813 331532 318205 -1238 -138292 -18274 260114 126437 323588 -185782
15315 -275687 -348881 -171366 694854 -111479 77072 76926 151461 -151978 -78956 51897 63320
15304 63320 -207746 -111586 386882 241188 -97220 -67937 -245359 88600 -205878 174892
15293 137967 154265 494216 -238901 402807 -140391 44557 28605 221515 -106737 -126713
15283 -126713 346145 387467 115261 20529 125276 -42480 -186283 -14318 -178096 259042
15272 402860 -108085 -203440 208836 -112141 241455 -251840 107481 -249708 164713 -110893
15261 56626 70963 12202 60484 302655 120653 245397 139139 76773 243485 105574
15250 198674 333075 690824 1516908 1138183 1163025 1762722 561094 189262 121893 181965
15240 181965 109745 -122229 -136762 163315 138485 36545 -189377 -65201 17577 34169 311773
15229 311773 263383 382710 90993 -37554 292178 -212130 195878 128302 130793 172790 125667
15218 125667 -63066 -128755 -67841 -135259 26339 47424 220503 -55094 92984 29319 365095
15207 365095 -77624 211594 16216 43765 213100 -167116 72474 170987 166291 245049 -62543
15195 20061 -78150 76612 -252519 499187 -24232 -62538 272539 -204479 -69753 -195796 -47154
15183 50533 320372 -158104 103368 48688 -30472 32445 -11460 180342 88581 -116476 244619
15171 349412 -272572 173338 -1272 54337 -101342 -101497 143035 -132594 -166397 142048 280599
15160 280599 174411 40749 -196150 56091 384512 216352 93546 188398 179973 208754 132340
15149 132340 64011 -72636 -87206 -51716 6086 -32844 255960 -38061 43713 114098 202738
15138 202738 -36992 -6426 151476 82181 180274 -298227 53882 510242 154909 303455 556
15126 -122947 154663 22860 -52591 327172 166703 250627 215926 163528 58046 -23477 122375
15114 163408 36761 257581 52686 -91477 373171 -23248 -43091 -257423 -159924 230507 23431
15102 14042 231988 313463 138669 10020 112239 -120858 148764 256584 -165850 194218
15091 364771 -144623 -20109 -489882 63290 305201 -128486 105421 6840 330817 328088 -87583
15079 359426 270471 74012 462486 -164900 194985 279512 224377 127208 45190 -194262 169438
15067 247473 -3905 158648 -19024 269064 -18545 -157552 -47130 -62560 197978 216947 225750
15056 225750 91675 -18518 194692 -138464 117205 290714 84038 271875 474282 -96078
15045 215373 199119 232657 -25858 341948 71681 165142 121168 68426 -77952 46792 99515
15034 99515 204909 -62316 12505 732837 434937 259511 474861 369691 -207050 110962
15023 345990 55909 287524 100516 169293 -29399 481153 424888 455318 366705 564765 465895
15012 465895 -3882 116972 159879 33893 88912 238391 393112 -11260 72545 130548 507727
15001 507727 120172 283791 89093 216113 319087 480349 27350 341824 255178 555814
14991 555814 -31274 118252 -16584 309716 -32108 -184439 39435 281369 116009 -56797
14980 64553 3546 98482 203800 -167950 371288 379216 1230 260422 168998 392117 5451
14968 271529 98793 -105613 344557 205994 3490 230774 -23700 273837 581598 -227315
14957 234095 270700 254197 392523 245092 102877 610852 278544 227770 165465 471214
14947 471214 -107339 336713 275574 462532 303179 297906 321225 160035 47147 323803
14937 323803 40178 184932 70696 635321 324297 286228 296652 222649 293250 146833 195981
14926 195981 370939 -17517 363862 406933 303658 168773 434838 302029 334098 237927
14916 237927 80834 257863 -39362 159033 569954 378067 255007 278318 170315 400781
14906 400781 248870 -89514 238515 575223 698602 275335 146270 512380 31405 163104
14896 163104 304579 204969 -27287 347719 237425 531082 601189 371825 595458 395277
14886 395277 143313 148853 396876 372623 419134 179913 622809 51216 338821 191216
14876 191216 410254 187265 373110 341950 289377 366877 577346 364289 633728 440155
14866 440155 401557 417481 427634 -1197 549751 170632 282565 546732 443346 523189 356739
14855 356739 485742 627338 400960 660745 380857 367220 379645 176756 380609 432566
14845 432566 513129 558999 429217 316102 402888 146584 315891 602953 838473 560566
14835 560566 270896 524179 524931 74479 549130 348226 587234 265660 468608 191277
14824 434646 195169 408925 727038 729432 509743 430099 400246 292298 327928 594122
14814 594122 465677 210037 -18200 688313 527628 509591 248989 174897 728179 320717
14803 210320 417795 333496 439841 252773 808402 430664 625641 365164 628566 237862
14792 386367 298154 748495 519662 494851 800824 525678 557304 648552 596295 534340 836307
14781 836307 661013 542854 192629 148851 672500 446967 585210 587089 831546 373284
14770 571320 462414 833637 689670 486417 525887 555798 512206 620007 696896 320207
14759 637098 692559 520788 564190 635720 644426 746638 735484 365567 754346 901936 718700
14748 718700 210473 840412 710246 791271 966062 638090 464561 654150 387720 781906
14738 781906 628294 892013 686116 619459 569746 607389 765289 569719 876524 713451
14728 713451 548266 645068 725353 1000076 718010 1074480 804380 1004288 649739 603102
14718 603102 552782 661383 1073844 897792 732009 604586 692508 696823 618279 683402 855630
14707 855630 860215 411211 1085467 809230 778756 929546 1083451 1138066 1066626 895411
14697 895411 883406 994427 1213250 1213410 712194 1036300 633660 1048476 884179 1062509
14687 1062509 827925 959967 817250 930352 912609 663798 857461 1092659 944670 692497
14677 692497 1306641 893585 1324218 827993 971818 919973 1032309 1167155 1044524 784480
14667 784480 685564 910024 1225071 1463418 1324926 1305563 873853 1037334 1133537 1188903
14657 1188903 1369153 1221298 1336505 1373082 1323546 1009605 1105377 1129363 1336961 1434796
14647 1434796 1479937 1404371 829917 1333703 1171291 1644969 1332892 1077325 1247966 1135086
14637 1135086 1252525 1424780 1254364 1283302 1555506 1084282 1423343 1529130 1527952 1077685
14627 1077685 1540598 1367749 1386016 1245843 1202514 1200467 1608096 1439109 1491609 1613777
14617 1613777 1681711 1323073 1326168 1664426 1726757 1803925 1773204 1521816 1485785 1913299 1633260
14606 1633260 1692808 1832649 1752231 1748577 1634870 1504786 1633965 1677011 1670592 1784172 1686090
14595 1686090 1485755 1955870 1721351 1887914 2083457 2023243 2041408 1992119 1942066 1910141
14585 1910141 1997258 1509611 2088623 2187803 2075026 2067672 2046575 1838549 2042839 2161472
14575 2161472 2204676 2138512 2268465 2433792 2244919 2259192 2193653 2350830 2589555 2486276
14565 2486276 2764577 2573027 2930913 2696085 3051472 2813597 2903408 3266859 3179140 3212333
14555 3212333 3477292 3748185 3880803 4074427 5087219 5268990 6879518 10497700 18330735
14546 18330735 40781762 52026390 24233725 9137105 4793781 2909179 2256200 2050207
14538 2050207 2054030 1952312 2258785 1975413 2274883 2202046 2090415 2129814 2290168 2445358
14528 2445358 2368760 2374622 2267266 2691278 2636933 2438488 2679606 2785624 2430994 2563148
14518 2563148 2588529 2446666 2881231 2831081 2682868 2600481 3080598 2640354 2847272 3180319
14508 3180319 3185098 2750366 3061222 2979253 2931150 3230014 3273545 3077351 3262497 3158600
14498 3158600 3158306 3716881 3390905 3373214 3435782 3580414 3556220 3570785 3583714 3771018 3732865
14487 3732865 3679551 4087096 3390443 4132844 3862230 4147013 4166236 4208514 4008141 4103419
14477 4103419 3658874 4242550 4009494 4470928 4404289 4168465 4377701 4461907 4906270 4910461
14467 4910461 4753982 4934124 4780385 4998503 5223746 4960538 5048891 5218879 4971799 5149362
14457 5149362 5150886 5441829 5641123 5566046 5554664 5424315 5744675 5911603 6184380 5729644
14447 5729644 5585476 6008354 6021495 5666235 6195982 6400392 6292187 6493513 6323973 6814891
14437 6814891 6868349 7266958 6744466 7010629 7026777 7163699 7373758 7339152 7543624 7899447
14427 7899447 7760041 7904234 7976644 7958567 8355822 8112047 8373833 8624782 9063797 8721779
14417 8721779 8667321 8876295 9302244 9392538 9668941 9563816 9474706 10127968 9753083 9997357
14407 9997357 10347438 10395785 10426149 10873381 11041810 11035995 11291886 11635553 11713579 11855886
14397 11855886 11967666 12462606 12338994 12489426 12849137 13078673 13333831 13472885 13357450
14388 13357450 13769493 14445125 14358679 14724276 15070906 15090094 15568042 16050515 16095745 16260251
14378 16260251 16409717 16703360 17400456 17514136 17845057 18240419 18686249 19007955 19478099
14369 19478099 19901160 20194592 20689505 20962854 21711517 21879543 22418024 22645103 23536033
14360 23536033 23784609 24326082 25137928 25190514 26053670 26657784 27332540 27923128 28656276
14351 28656276 29346646 29813479 30833435 31427092 32297262 33139145 33909286 34945884 35577857
14342 35577857 36669237 37778802 38494317 40084160 40963076 42095573 43395432 44361517
14334 44361517 45555627 47180290 48689996 49901269 51269854 52723492 54397352 56644185
14326 56644185 58211891 60350378 61861754 63999493 66128362 68876054 70908821 73545160
14318 73545160 76369240 79106828 82108268 84903703 88567885 91785234 95155415 98957019
14310 98957019 103330816 107274690 111716063 116110360 121181583 126326760 132296860 138044130
14302 138044130 144410334 150804245 157640139 164913887 172617845 181019669 189571400 198334250
14294 198334250 208234163 218310561 229514239 240139750 251864634 264411248 277364706
14287 277364706 290716146 304882861 319168882 333850956 348502496 363587189 378866244
14280 378866244 393776483 408451924 422209958 435109310 447155592 457705729 466457074
14273 466457074 472938264 475289471 475828036 473170348 470175716 465212619 460536252 452536666
14265 452536666 441882763 430026898 416526622 401679618 386112370 370428350 354048065
14258 354048065 337804186 322126085 306751566 292575759 278411504 264529203 251282404
14251 251282404 238715107 227030504 215770324 205187983 194958712 185422614 176475446
14244 176475446 168405475 160749078 153080488 145845671 139388263 132879632 127200558 122349245
14236 122349245 116994295 111904485 107119915 102517513 98581709 95197607 91432094 87712492
14228 87712492 84458963 81009885 78071767 75305508 72413897 69914778 67356531 65455376
14220 65455376 63116035 61057422 59123306 56901729 55076028 53200464 52244978 50876655
14212 50876655 49007652 47421452 45921027 44575696 43363634 42875235 41609672 40499056
14204 40499056 39334327 37855180 36690523 35864137 35443643 34143555 33251305 32343617 31588979
14195 31588979 30764980 30409762 29246844 28866692 28113075 27139192 26941456 25945636 25485226
14186 25485226 25069880 24347438 23510410 23273902 22682739 22104124 21641090 21055590 21081380
14177 21081380 20672909 20079515 19659567 19407310 19063379 18656510 18472857 17643858 17183903
14168 17183903 17082238 17015012 16487414 16251864 15638417 15798803 15657626 15004989 15086046 14611924
14158 14611924 14420701 14151548 13807726 13950543 13198706 13092844 13253569 12678667 12480992
14149 12480992 12245574 12013638 11946724 11966714 11723290 11333175 11073900 11208959 11110074 10708760
14139 10708760 10668818 10367934 10370256 10140876 9964825 9719863 9696426 9547001 9653631 9197562
14129 9197562 9369262 9170176 8790859 8684908 8732416 8424713 8809765 8030038 8214312 7919742
14119 7919742 7863455 7923872 7725737 7800274 7463940 7521775 7694989 7315897 7707648 7071100
14109 7071100 7168281 6904836 6825250 6766512 6577600 6733478 6462028 6459734 6287169 6109259
14099 6109259 6564568 6059905 5859577 6175578 6118654 5852730 6034180 5661785 5983967 5851096
14089 5851096 5898458 5488190 5276397 5715464 5704442 5355544 5430623 5365434 5045016 4800608
14079 4800608 5214105 4936505 5021562 5095354 4966589 4627155 4683166 4873625 4747065 4337384
14069 4337384 4338804 4433097 4465300 4744327 4605880 4220723 4228298 4481346 4184749 4129997 4198704
14058 4198704 4086059 4130814 4104588 3961438 3866799 3889801 3961825 3616326 3881430 4108187
14048 4108187 3741366 3673714 3492183 3761649 3406434 3383575 3473055 3255007 3342614 3341517
14038 3341517 3458193 3160316 3343470 3574813 3280190 3432556 3443750 3006802 3484181 3250398
14028 3250398 3418284 3425188 2842363 3174436 3154388 3032064 3134019 3245447 2803213 2787795
14018 2787795 2572892 2676426 2667493 2948221 2651889 2955711 2637038 2669101 2513740 2490020
14008 2490020 2500385 2450897 2555177 2407084 2202871 2352934 2455689 2730572 2382583 2193682
13998 2193682 2617408 2346443 2398266 2479863 2014167 2366063 2221033 2496742 2639929 3059669
13988 3059669 5467060 11001845 31405389 52527819 28049100 13671177 8406439 6200856
13980 6200856 5104259 4430341 3794514 3803130 3279130 3338229 2751068 2969396 2632091 2802357
13970 2802357 2770861 2630126 2406230 2528206 2474533 2358486 2402759 1994323 2581075 2277428
13960 2277428 2266427 2035340 2076038 2111131 2125726 2175613 2415413 2001611 2258034 1962028
13950 1962028 2205179 2144081 1959506 1983647 1958870 1803991 2048516 2063659 1813453 1410433
13940 1410433 1634335 1690584 1794058 2091989 1893173 1858138 1716366 1659721 1572475 1792735
13930 1792735 1774406 1529692 1379143 2168071 1731355 1879080 1525591 1664217 1587660 1601716
13920 1601716 1913044 1804508 1883260 1715780 1468227 1905943 1622307 1518522 1437649 1320333
13910 1320333 1892702 1493490 1262569 1737566 1428959 1470020 1629373 1493475 1549701 1724713
13900 1724713 1416201 1253070 1319971 1561701 1595429 1534139 1670207 1413180 864961 1534599
13890 1534599 1341145 1438252 1618782 1508946 1460910 1230864 1444696 1158417 1713289 1299976
13880 1299976 1587661 1532896 942637 1259867 1443169 1235053 1351479 1702372 1109064 1310333
13870 1310333 1036626 1414096 820497 1329390 1181502 1072145 1331796 1306379 1377842 1016086
13860 1016086 1194793 1440035 906375 846921 944864 1051365 1046059 972817 841565 1014649
13850 1014649 1102909 1068143 1295972 1127512 1434833 997718 829798 854648 1004804 1176113
13840 1176113 928466 706347 949580 1240936 1405023 947110 990292 1028219 1155819 976381
13830 976381 1206273 841853 804621 1316114 1184080 1088940 1299987 911705 1034519 1022709
13820 1022709 969965 937063 1033532 944225 1107961 947400 1156472 785887 620919 964335
13810 964335 1110083 672110 917421 1011468 829638 868577 913761 855311 1104153 772694
13800 772694 1132354 568090 1091329 954429 663013 548053 833521 729005 862425 833373
13790 833373 1047761 970961 935740 936376 779395 1026976 890943 746120 1093105 713365
13780 713365 1155878 610637 910992 712147 1060115 742452 1151075 976296 682535 872620
13770 872620 560777 565411 876678 470183 746767 771776 723427 955707 625551 710562
13760 710562 868826 791570 507774 800189 825857 787518 456854 518088 795834 738709
13750 738709 757083 686037 586417 945490 861500 959342 639492 614559 691523 787022 587832
13739 587832 769515 610112 543051 525890 565801 749021 836748 1160259 711257 766803
13729 766803 597885 496755 738574 656495 707269 676092 246320 884632 738603 700014
13719 700014 736565 751755 455338 780263 530555 736085 663643 741314 597628 825827
13709 825827 560856 993032 620081 532633 663968 502480 811156 832469 731501 401851
13699 401851 465732 839109 792871 473144 389708 362872 661716 511459 422131 552474
13689 552474 596966 666237 670956 652191 473552 635516 571994 876027 366058 521954 485202
13678 485202 474718 785177 526639 645084 544235 482535 580592 608773 605323 355497 454646
13667 454646 561899 455027 632676 473616 499337 237355 408376 474064 618990 496860
13657 496860 698591 345528 552371 363591 560597 694029 371223 511399 410337 780852
13647 780852 280527 252475 455664 337559 670454 647857 325799 304957 507233 846856
13637 846856 322558 620675 362703 46793 693777 281620 189285 182495 256643 446803
13627 446803 567220 429123 524450 389506 585691 413404 173173 90307 465168 666644
13617 666644 221417 333406 710581 298304 624781 278366 -62919 389948 452720 283174
13607 283174 666703 701037 175876 512404 408586 491847 220131 344269 598085 356614
13597 356614 331497 381048 424238 229420 378670 448612 453453 146137 532095 169430 611505
13586 611505 171963 402769 511931 429499 413812 162174 507854 598995 302015 646124
13576 646124 608247 398584 -68488 206033 639194 412306 352107 495686 355795 457465
13566 457465 243232 401680 281244 251535 719644 204770 593854 373588 239457 45390
13555 35070 136041 308172 470173 181078 415010 270619 750949 75216 167612 276445
13545 276445 327730 361069 558950 670667 226059 613533 126531 348269 177837 477571
13535 477571 417269 252718 122186 452806 272408 320598 109804 175798 47278 143516
13525 143516 297560 193646 122848 389359 503213 262582 601547 578659 342320 -120655
13514 40220 48417 319458 444485 107881 290753 437287 268842 361801 206596 30148
13503 326688 66737 235439 65258 532015 224213 163618 1324 538397 321838 275408 265819
13492 265819 416172 453866 132383 -14225 315211 287862 314459 704148 -38329 334211
13481 100113 45468 280305 454715 139076 112566 245858 797412 543562 35882 313541
13471 313541 183989 158528 505710 267494 114592 453701 55297 227119 766 395409
13461 395409 293315 553921 79617 87008 245203 200577 396662 219704 56125 391160
13451 391160 360751 459012 176662 621785 352006 -9111 197132 521647 -128254 27657
13440 189507 320296 526724 190218 267257 144441 489954 165022 56217 248841 570820
13430 570820 368970 375134 102140 308827 540478 559790 78460 259006 167562 229799 466047
13419 466047 336184 150806 373584 52619 -146050 473926 520463 449477 280126 329345
13409 329345 -388538 536707 174705 410990 357405 83721 210314 -58865 205455 143433
13399 143433 117887 -15467 217010 52014 422845 29024 266086 8499 213071 337967 200188
13388 200188 448416 -101944 305003 -4363 43052 197908 244451 288103 444959 70969 295993
13377 295993 331065 159080 98539 465813 314221 295752 188885 400573 400992 110647 176545
13366 176545 410578 41144 206187 198005 79202 204930 266358 112333 280365 167818
13356 167818 386829 472059 198270 483214 384739 470918 280142 105409 -28966 266996
13345 484238 164523 446135 602829 337141 424331 283255 499346 24471 452267 25584
13334 114125 89605 503863 461832 241094 124741 172727 73476 274192 247479 590411
13324 590411 248495 171075 209345 395939 92059 55238 294299 417018 165462 407749
13314 407749 338771 -13959 17414 175552 98161 303198 54596 309677 326219 134713 472748
13303 472748 307376 297385 169754 348816 170394 305719 120268 177863 101204 250596
13293 250596 257079 -47716 104606 417883 189243 -174627 499368 151938 6372 184292
13283 184292 97901 -366657 247302 196614 97279 193858 136016 337183 -90560 241238 166956
13272 166956 322340 320627 156988 293836 337316 -96961 188371 254974 157338 58158 -107012
13260 95610 221028 217456 451392 123683 -74032 -35670 -108514 123611 212766 7804 166856
13249 166856 541050 26119 392582 -76858 -100449 197058 -78536 264615 103911 -111009
13238 559474 90156 286003 -108502 145911 74650 77876 8149 460465 99351 383267 282411
13227 282411 69423 129634 -107848 43781 279653 135476 -15629 279611 211948 159015 24571
13215 537140 262501 322864 51061 157132 110333 -44894 6111 160377 181504 27262 65111
13204 65111 73266 -276958 137079 407431 278795 429002 98702 357016 251522 316058
13194 316058 -131852 77366 80241 66708 -53788 155325 192751 19514 356378 -77091 224415
13182 158971 -63923 -8081 262236 -109842 324550 41577 257716 218441 -205969 277021
13171 280153 283363 -30792 47320 196649 119440 128392 -292433 572394 120164 116818 209282
13160 209282 278014 25353 -123378 298363 -220173 -49453 95336 310827 -188512 86059
13149 -67963 59144 -200753 -61872 186914 -55787 183129 703221 291960 403046 283085
13139 283085 -97043 178150 -188041 104273 -35289 186838 193180 -37119 -134502 237795 9898
13127 -66035 306848 272541 134403 291869 167687 -97526 343283 -32565 69640 -401757
13116 278172 393413 -80116 191363 74843 -230039 93825 148805 138640 -177538 -63675 19538
13104 121722 -8032 336832 278529 174994 77208 159204 281339 75687 129539 124240 312786
13093 312786 87576 -71757 80089 32143 -70685 413190 279518 78470 -28247 -188447 1306
13081 56362 13015 284985 84279 -346661 27405 -61270 186146 -41139 -40756 8383 -104113
13069 -57524 -47572 -102925 158294 45899 38690 153172 78411 278719 27835 -87019 213047
13057 184268 126841 -29922 38433 150908 173096 -36581 138193 108931 370439 68881 320101
13046 320101 -5749 158779 77821 -124945 25763 277824 296758 312738 307947 240054 264775
13035 264775 -124443 102469 295311 156139 423151 -271992 148709 131430 252465 148942
13025 148942 -4789 475940 416340 106108 151392 -392982 299761 313255 35598 -142241 18232
13013 102714 -208070 172474 384978 22183 71300 -5222 238094 270398 -241740 -152167 81949
13001 219833 138547 207038 -63754 152889 401281 142173 363520 -70137 75918 171888 230695
12990 230695 65974 -174426 -122392 -372533 -44450 107366 50754 155620 139219 293266
12980 293266 -128459 50119 -187363 15621 -183750 -94136 -232749 64851 -261393 -5316 -264621
12969 -264621 -4624 -4439 107443 -207327 26361 244833 -68696 -64785 -76482 42170 271908
12958 271908 -191675 -349960 198325 -49161 1005 61792 49817 231071 -58702 210254 66942
12946 119454 133738 269294 -31480 89357 -7072 173408 65445 -83087 122577 76569 -127002
12934 32938 129248 -132314 38252 30462 122434 15499 -34109 50014 8715 -135071 210447
12922 254501 55102 232793 -43568 -356021 -19923 102212 -90238 82302 63709 2996 109940
12911 109940 -53380 367475 93189 11 -16523 -195161 150917 -120198 -378174 -5498 217509
12899 154596 143827 237915 280184 175066 179544 245479 -95825 230898 315166 -39452 124635
12887 -23165 12766 -34951 -18010 -36772 200340 -202927 115902 143328 138575 19637 -34 461602
12874 89956 -202670 -79036 -64273 225684 357081 195972 -185272 370819 -404941 -142659
12863 196202 107296 153082 114396 -339395 75743 -23892 123019 55749 85051 -53323 50079
12851 -12344 145709 282787 175670 -131583 126969 -55187 310861 413955 121201 -73059
12840 -19163 235272 -21158 -329529 63377 -139309 -185410 24462 33202 41248 -89836 422318
12828 -53221 173237 398788 275492 7885 -23588 -122937 -49952 103758 -436454 -42478 376578
12816 -209957 -194923 340033 -55893 -145116 -44241 -38121 23234 129500 -254383 44114 195313
12805 195313 222476 -318920 56510 -151623 195733 -237364 274335 41091 -53025 -143441
12795 -143441 377498 44202 455210 -226263 -2297 -173179 -221470 196447 100125 177686 110695
12784 110695 -173190 247262 -330130 176758 126338 -154737 186428 21618 108158 146198
12774 146198 146364 -30057 -17197 171878 -66906 183581 47926 -84003 49059 -104775 610569
12762 80124 28581 252124 320702 300856 114912 -43455 -121993 378172 400245 143426 88745
12751 88745 92150 61145 -87598 122404 -65920 229755 -59506 47462 365308 -71189 -152490
12740 -152490 -31778 -115579 36965 504950 -52430 498414 350606 442607 152043 97225 276513
12729 276513 -80942 416550 188924 -9566 49256 190968 115318 353150 236908 -146424
12718 36165 -138531 54286 -66438 -179415 227001 199327 -17801 -216180 -65412 246574 366857
12707 366857 -54599 450121 8700 233540 194352 478986 -336319 52305 83227 388819 409942
12696 409942 127713 78960 -159264 105663 111201 -224526 28081 114684 24612 6064 65873
12685 65873 -392520 -255515 219794 102669 88745 -84078 -156380 -31674 85675 -28921 393494
12673 -127870 278876 241 76787 115139 257543 90123 308136 -40271 227540 311566 105071
12661 18401 80005 -5821 181830 -197514 224824 47347 320038 239047 263166 253540 31150
12649 157784 328973 93015 303820 188097 -22303 123454 302776 131032 -282334 256527
12638 173701 92257 190107 -28437 226657 98437 154597 36039 204673 165305 436055 212993
12626 228445 437427 -7653 184304 66784 47653 107504 203225 -167156 39202 -123755 -144699
12615 -144699 -37174 -3789 -156709 168588 179377 412861 109144 40375 -72371 405833 46427
12603 313110 84943 217082 95226 -196384 278203 313640 244056 104489 145404 202213 210194
12592 210194 194769 -114079 130325 -96224 -400194 353329 197851 225735 -160033 -127853
12582 -127853 379439 -82762 -132254 84156 -361518 -167022 8642 142779 -85350 181878 -125154
12570 181905 -273058 148445 154736 98057 -139085 -223121 74713 -152785 -264887 408032
12559 127794 34749 196281 -251375 42478 -129493 264994 85416 226427 174895 209891
12549 209891 289795 -51813 37224 -272752 135989 -106690 136378 -80694 -210029 71211
12538 -50096 202423 -69498 104882 -188439 -124207 124865 -99502 -26376 -24170 188117 -169248
12526 220704 230594 91910 29343 80433 -134663 39727 -141382 43472 53247 -22554 25322
12514 506548 46218 278568 -13870 106918 -282693 -102547 49396 -102565 -153223 -49537
12503 62613 -145154 98819 171160 183657 -96457 471630 205505 -20441 53490 -8629 82022
12491 129931 208212 90127 241340 -38154 -216939 -194469 184831 -181291 132560 -45232
12480 157980 2492 -36213 -222296 -157966 -71272 95290 268301 -1904 -213544 -126986 -91827
12469 -91827 103865 -37913 35273 -214073 -311454 -40198 237263 -254262 82065 -394465 -102393
12457 -72490 -10808 1704 -155529 99756 -33229 -271575 -28777 -37106 24478 144484 197379
12446 197379 22458 -106849 116306 -28654 37934 -377866 59356 134852 449568 -37397 37785
12434 18767 445112 147361 -196979 98398 7794 -125146 171743 179297 -192465 25786 -119762
12422 93820 -3232 -147491 -11089 131654 -225590 236205 -79248 -308974 -167069 40636 -80904
12410 -254795 165218 48460 79605 17564 197981 28406 -99803 -43697 290316 106988 10426
12398 -217115 164234 200428 94865 184878 -141404 -97932 -97664 184396 34988 -6415 -13099 80542
12385 -51205 95025 1629 -325540 216146 -131404 -135819 5725 343493 -28250 110580 68432
12374 68432 262958 45177 225165 109961 54092 104230 96281 221156 78315 -152694 148003
12362 -265684 -102039 -92256 -80963 -50081 218353 215419 -255578 -185886 -183543 153398 87157
12351 87157 -36524 62278 -68591 -130313 116371 323148 238656 -100716 99 -265458 163481
12339 -32271 -101091 225802 -203668 -142955 -153210 82271 131824 355647 -246974 46397 217208
12328 217208 -203183 -156007 128015 65103 179930 163622 79507 159414 -148138 162322
12317 -101153 355599 -118593 -164012 62014 8189 284548 -51683 156118 -327764 22803 -285502
12305 -235989 -35166 -12508 46875 -146147 106457 174549 300169 99156 77757 -146742 173130
12293 42115 235400 42832 305443 -193026 -23842 81967 163510 273676 79529 280782 -67671
12281 199045 155783 -291741 -216074 144787 139625 596 134370 482776 -1609 261051 234254
12270 234254 -19221 -30718 238777 111864 -175606 213159 27636 112799 -161818 26433
12259 -15144 -195704 326235 -154229 207026 -106092 107856 210335 580128 -55013 214751
12248 241521 309642 136957 4168 -113605 35454 68892 239403 -3807 25405 8574 41236
12237 41236 -88249 86389 274268 -298681 216775 237123 415216 44457 20245 656368 -70996
12225 -76673 -78709 103649 22028 234446 210753 195320 186082 180967 439661 -40051 -60921 2501
12212 99660 286529 43 70759 -16123 367913 160681 260270 182199 163463 340192 189449
12201 189449 -150450 513133 -80309 263869 82853 129748 209945 -94222 8652 317252 49722
12189 25613 299931 207124 230171 31614 161488 6241 -202223 -53436 104902 -64004 -96662
12178 -96662 -100159 -158428 50427 299702 174225 74799 363812 74526 191823 199535 228392
12167 228392 70042 176492 360349 -11138 105985 189379 -31839 282102 56455 85683 187671
12156 187671 -12023 141653 2317 212724 90282 -56402 171206 -61999 375333 188445 153297
12145 153297 81296 184975 -98886 -166839 14803 116225 -86595 -35182 182700 59911 308730
12134 308730 13768 214587 -14466 -93392 406780 207927 159777 -29600 -333441 -26422 -87661
12123 -87661 154099 9397 -115924 103552 228162 -77591 248733 52259 35692 68264 -147546
12111 110701 46979 152451 -264672 197099 -160865 -231369 -100452 39864 -58696 203175
12100 207464 -96965 79305 47883 240604 -137741 57880 264050 -80889 446052 -27531 167445
12088 -167818 144777 -78470 135517 196366 -76230 200690 -36789 -49 -150901 328639 98925
12076 128996 1452928 2304885 235559 231977 -206934 294633 1553 1287 115984 42473 147910
12065 147910 24719 41091 6994 202341 -92417 -56512 -208284 -207929 421335 -254487 -99808
12053 133717 2143 52964 -208102 237778 54857 58158 -63214 16958 347923 -82227 -16004
12041 -99273 39095 -2801 -145860 -190039 215379 94276 186708 -251909 253752 58014 106887
12030 106887 -80309 -67636 -16315 -262258 98913 -295472 -258907 -59603 24359 360649 -98821
12018 28250 -155674 226784 123541 -83953 -337449 282681 31590 326559 51608 144665
12008 144665 77153 21015 154806 -7446 50550 126809 9673 -23408 -179666 186126 -21047
11996 -163926 -213479 -64856 -63163 -50748 -328325 251183 139809 151784 -21556 -172963 -78719
11984 -217418 -27034 344176 209302 91659 203318 293703 167430 -30885 -146817 90047
11973 -83785 -13430 216699 130241 -100966 284252 -143347 101951 -50480 22067 -388389
11962 -188085 -29923 -178730 159279 193327 -193398 -75073 142204 31211 -42 334487 26611
11950 79425 162739 -63301 199981 182095 -133955 135381 -16378 -224496 -128545 -163531 -14651
11938 -113992 105267 -47945 57205 -135150 40605 299200 161921 -184017 -55586 -142746
11928 -142746 59749 71083 -163978 -7184 80444 -127002 276919 -60939 -86128 -112458 -16934
11916 72642 -167264 -66529 256611 -281762 292546 -96510 85155 -287141 36834 -25824 -157700
11905 -157700 70041 -222306 135749 224157 214339 -59770 -131362 119860 64049 -46358 6998
11893 -9544 75546 -6575 48202 -128792 -141709 -29824 53453 167883 -189981 -136305 -61840
11881 -210824 94457 150146 -228003 124478 314322 49141 58658 198848 -167501 132590
11870 -354663 -241083 32421 -118919 -354584 -283626 -113310 64966 -210728 94535 -307012
11859 188518 -44588 81125 -305106 181186 254020 243678 49221 -177006 -194715 -148012 -667
11847 29089 -31093 29503 -296382 157393 273419 -58522 19272 339764 -258483 -194323 -322916
11836 -322916 -124793 -279891 125569 51867 -251216 -12848 -263512 -40297 -9064 -15049 -366386
11825 -366386 -194610 33789 51527 33440 15617 84239 27122 -190176 -284462 -18035 -202701
11814 -202701 72234 1269 -19184 -32898 -107978 -74179 38124 -30525 80497 140157 38170 -122446
11801 -307188 -789 -87440 -252423 51841 -340509 49216 7408 -50280 140730 330991 -117175
11789 299761 150461 -108703 -169921 45665 -91346 -26139 87135 217596 -292732 270123
11778 402096 43997 107798 -55812 -231994 -10456 -26607 183043 -113047 32108 64447 174966
11767 174966 142378 56354 93891 -313835 11899 133296 277268 27735 411135 -155446
11756 -19358 286913 -186322 -130425 155905 44036 -51611 44787 137599 13220 -181522 118277
11744 45440 166497 261905 91837 -94284 65468 189721 -436112 261763 161690 -150057
11733 411866 -144870 418156 -11928 433783 -47345 223209 317552 -96463 166394 -309571
11722 -35434 -27705 49929 92001 -42490 118100 109456 -80633 146566 -7566 -197875 -177978 -340016
11710 -340016 16018 -21846 3710 77103 71869 31594 -69696 -59032 -42919 177879 -26241 131104
11697 144858 92027 -234151 294161 1125 128457 -137953 43453 137429 -77993 80341 156061
11686 156061 -94447 -103566 67555 77544 116391 -165872 218328 197342 217368 79715 266864
11675 266864 290297 429601 -49313 8813 134978 144113 41805 30823 71626 8852 -243486
11663 -22225 185370 42072 -40699 -11183 -109686 -99358 -53332 14199 -73637 -70781 19279 94426
11651 94426 -213728 273936 70559 -88475 384957 177528 40715 99550 -201130 66892 365314
11640 365314 181873 -260327 282481 -9645 13457 167265 56057 -118335 -430763 -107878
11629 -34340 75167 279528 137231 -164276 623959 -55696 -171363 195652 233201 -136551
11618 -99829 -4522 -67888 56667 -99281 89090 -34168 -130825 -4044 86833 30322 -132134 215197
11605 156685 77406 319941 122782 218637 -120619 269641 121063 -122801 -179102 -76305
11594 227758 -55097 88683 80785 -49071 73297 -187296 237659 271648 -4052 165010 73448
11582 -45819 -116497 100888 28972 -253532 154922 295234 69754 74923 366565 -30353 67942
11570 156693 -222297 246148 -16563 277265 -72590 -165135 -127871 53003 417891 61590 285518
11559 285518 145375 83451 -107755 162289 51388 -155265 -155055 -22583 86231 -79420 6768
11547 42507 49292 145742 69890 221611 -81171 482091 443936 354492 61962 -243347 41799
11535 -68238 -17737 -152612 138693 131988 70213 274177 -163575 57015 48183 100921 62163
11524 62163 68735 272817 -214545 -64298 86483 136732 25721 176622 151747 373641 213006
11513 213006 7769 135397 144236 126982 207792 -73572 166362 79653 50964 347677 117558
11501 94331 249396 69693 189014 412423 3221 209849 77386 -246075 139147 -99653 -344696
11490 -344696 284990 94205 119067 -121730 640999 450450 141140 62283 158967 -350993
11479 303244 321950 240899 118943 46526 -182170 359443 183629 385281 312526 -38219
11468 243913 316412 260323 52441 210557 -45294 285198 51842 190017 175443 29351 86282
11457 86282 63974 227360 153414 -215642 52385 -58169 -186166 64567 57068 226754 -294289
11445 18197 131565 -208659 -159356 339139 125819 125161 -1963 145886 130605 43804 -234004
11433 164693 -273094 -19003 83403 222464 149921 152167 225559 84304 95933 99793 225258
11422 225258 -80022 68242 97112 28703 204320 131146 -14559 49565 -91224 14911 -133213
11410 281185 -182208 -302218 -155845 -253540 -21241 175725 298443 -226066 78203 351362
11400 351362 -117120 -129706 233513 -62677 -152101 -265733 -48666 -223036 -312528 202581
11389 -68556 148608 95426 -18924 42373 42351 -7954 20504 145566 -39364 69582 6158 -238958
11376 3731 356225 140205 430759 64840 -181899 139607 204579 -1328 51148 -216248 -204981
11365 -204981 -142666 60144 -99733 41871 96853 300441 79100 -18444 11157 -193416 -192882
11354 -192882 147722 -285476 215697 16632 -10884 182885 60622 699943 189179 262070
11344 262070 -71954 15485 -42093 -5838 141177 116310 -18690 -192414 -56091 96138 -40782
11332 95633 -134540 -246433 -268152 -165025 -264166 164933 -121951 -128978 185466 291298
11322 291298 68167 218596 -87095 495637 61371 133099 -263339 35131 -81826 122755 285001
11311 285001 13663 136297 -135677 -28140 136864 -133630 -123600 97395 408265 -53568
11300 -9173 -103566 -324622 71963 -87488 -41755 -140469 29971 -5194 -113682 177108 9523 535
11287 -275848 -50345 -102174 65124 -205544 -33147 302191 -395504 -191528 25571 -334775
11276 -96916 69621 -132014 93579 63722 166111 19178 -24578 274699 51450 -121264 149147
11264 199911 -92297 -114339 116226 -80661 -101171 -163206 -24189 401208 108669 27302 183230
11253 183230 -1968 108761 -312485 232691 15637 -182464 -63892 220993 46027 178847
11243 178847 -273970 -273169 -54760 383467 12737 -1577 -167346 57680 -33219 367804 470100
11232 470100 -28831 -113013 300674 -65054 5976 45563 111549 251412 223571 -248421 21620
11220 -103970 214126 -299690 -138507 -230013 -236296 -79867 -79989 -217295 25480 2270 118746
11209 118746 108529 -116798 57105 168600 -47799 22062 -211971 -98292 -195205 -24148 262110
11197 85085 -65150 7992 157166 -164217 62299 -587748 196503 -123535 253329 133810
11187 133810 -300701 -141955 -41946 84834 35124 64515 -172618 -190426 153529 210662 -34018
11175 44283 180237 90803 26380 3726 81616 -105936 -111136 27329 -300811 -321910 -233902
11164 -233902 43830 -247388 -358423 -18981 -136584 -62403 -32595 -278014 -55611 176824
11153 40882 -259947 39025 13006 -55869 -34105 18733 -91235 -77700 -191530 -25582 14311
11141 -19673 240982 69358 -150328 -64809 -49447 6866 -91942 -283641 -15016 246298 359318
11130 359318 42775 212085 281264 -21956 90393 257420 -19078 289848 187104 -188332
11119 74506 -6119 84205 171389 223556 -174501 135719 -276754 55404 97932 209138 85579
11107 -200206 37879 263356 87713 -39503 200083 94453 225850 217942 145642 290307 209313
11096 209313 169106 150985 398979 65350 137481 -14315 -286271 165827 311236 -48745 17947
11084 112941 230539 -42833 248343 270019 447155 -3555 520870 305469 348251 165491
11073 331367 460657 387562 330416 313752 531918 391435 165904 566257 62088 551443
11063 551443 428974 489258 755611 794014 586087 579429 634943 550303 601304 845273 447742
11052 447742 577930 403257 513467 547183 506097 687934 1160755 668577 1158104 991837
11042 991837 878573 850914 742714 566541 829331 820140 886665 635469 458901 842402
11032 842402 522754 517066 728306 656206 617363 1138281 672128 840472 741911 575923
11022 575923 671377 895961 633967 894346 624507 676222 657343 709354 574639 439530
11012 439530 440214 398678 941967 662091 511917 420155 539227 877883 669352 543901
11002 543901 689846 750767 568980 779081 509621 659018 907372 871095 815212 823978
10992 823978 1003890 943602 850459 551811 744899 815462 781687 904320 714385 1210395
10982 1210395 1322785 1356385 1248670 1380236 1169412 1719398 1935180 2381498 2431981 2737656
10972 2737656 2620329 3120540 2876088 2470499 2498828 2347666 2203569 1494530 1253497 1384317
10962 1384317 1498858 1459408 1594862 1817031 1442938 1551604 1737306 1791067 1422068 1369384
10952 1369384 1073958 1021456 725320 454109 581010 563026 546984 472643 332107 -10960
10941 195250 403537 -73016 -390129 391362 283527 -55281 260576 328463 -19885 175735
10930 44956 54773 -183443 -230560 -131924 106746 55876 -59710 48915 -101022 80551 -17999
10918 159605 23866 152266 9752 169650 -309841 175276 -202821 -2605 -34882 187270 -150783
10906 -37431 69765 -6106 296833 -289257 186594 221137 10154 186691 -66061 175384 118264
10895 118264 -99167 -8312 45285 -148412 101749 -524254 129846 210928 -31102 -218013 54085
10883 -199701 101176 -255004 388450 189096 -1363 -27264 129183 -58656 267316 -364117
10872 -412711 -38674 105207 -70275 162767 116638 -293640 162303 237861 222225 150113 208809
10861 208809 -85862 -31162 304889 114008 112720 -154293 257478 116452 -58235 129221
10850 -273783 -13222 -70298 -157495 145901 -136108 -138909 -84877 -160308 295931 208418 225213
10839 225213 2219 -102321 -10336 -199574 -213167 -282930 108129 -277802 -230223 290124 350781
10828 350781 10485 108247 129874 -394651 -305689 -403946 244204 -14146 -286643 -24643 -118919
10817 -118919 138304 -129478 -172029 210257 -70009 310823 185541 -40886 -113859 -340584
10807 -340584 90593 -105667 -90157 4481 99039 84284 21048 135755 -6067 367259 -21637
10795 -219126 2480 148457 -176765 -140564 -63083 -130124 139361 -64958 218480 -70063 -343540
10784 -343540 -56063 43521 -110718 -196609 337676 -119660 -109129 -5859 148448 186911 -65572
10772 208335 84130 -32114 80464 74885 -52888 -306272 -211874 -238394 -213832 -45951 -68767
10761 -68767 54061 -260061 20812 58595 46213 -236507 -10259 -76501 -288759 48654 -69062
10749 96053 179652 231051 49173 210420 376067 -196268 67505 -109995 32891 -456505 142695
10737 -214023 41177 -175988 43804 167090 -75216 89909 -21975 -113972 18914 125505 -155853
10725 -75820 -235432 -2102 -18500 302997 -121134 158577 18957 196830 150904 -213503 -185964
10714 -185964 -177277 -19561 -264812 138324 76725 43848 -35938 -307712 73792 50126 124905
10703 124905 -103620 257790 -233223 -231147 45162 -128698 -80212 12759 -191547 23166 27264
10692 27264 20286 -178836 -16782 225341 -329794 -177263 -99597 -137149 4628 311913 -136884
10680 101263 110276 244022 -52821 168213 -108553 31619 -111932 -184687 -28287 37740 -67
10668 -211097 -117926 -1781 53687 21615 300084 -14839 148129 79892 272762 105672 124757
10657 124757 90586 71501 -232356 -142825 -211611 -317450 -230871 60258 -192640 -334720 -264906
10646 -264906 -17177 154824 -832 -385414 -126871 188122 -296026 -167237 -75012 25186 -77077
10634 -180448 91896 124003 -172345 195835 -264881 -157612 -148382 -215150 92228 -137096 -574229
10623 -574229 -280308 -15392 32845 -298514 -12143 -90265 51016 -54206 -52383 -150095 -309387
10612 -309387 97291 -25548 18635 -226967 -134353 -221517 -39845 137315 1282 32606 43013
10601 43013 -40644 55628 129344 61058 -89294 127065 1174 -83736 19594 135058 288934
10590 288934 -63542 80938 -154414 -130972 71054 88433 -9553 128122 -43601 -86499 -14486
10578 137483 -148020 233135 34300 168630 68316 -58321 -82358 -26044 168849 29 -82180
10566 -363069 -145594 -159850 123453 -147517 40942 186995 -109708 72957 -252211 -318325
10556 -318325 -171842 -128318 -175985 -258812 -73289 -49560 189131 -21598 -122899 -164869 285218
10544 -49680 165991 220544 165552 -89911 -37081 -26628 -242837 135566 -239052 104726 234978
10533 234978 -343690 -24632 200604 -91487 -105235 105062 -173199 -51453 -246881 -239601 125998
10521 83609 -46783 197166 36112 26798 68519 -4626 -56046 -68590 12963 164261 -58490 134676
10508 143159 48097 -133140 169992 -214236 57536 -176996 -191027 218359 -6956 170016
10497 -29600 -246674 -6037 105105 101499 -78466 187995 89364 31125 561 -676155 442830
10485 -137308 -62224 -155350 234067 342837 737332 698869 222726 77099 -93069 67374 -225336
10473 129734 100653 248810 -42192 209637 288108 322314 -144810 191990 -265586 87775
10462 118682 -247148 3814 -459854 -102197 -181784 -200605 -284771 -40339 -106181 -163773 -84336
10451 -84336 -54250 39190 120191 -310574 221698 -12544 62366 243642 100212 -9311 158368
10439 254072 -10260 65892 -129140 -41672 138561 148185 -50166 -62139 -44975 -130610 204698
10427 -85654 -52854 -82023 8572 16720 18649 26153 -111393 -132531 -412915 228994 177973 224429
10415 224429 -27823 245783 121851 -99655 -196187 80084 47405 -133045 -52274 -25588 20077
10403 130004 40549 -210908 50873 -108853 -489087 56874 -235375 405003 -19375 -21700 119261
10391 192464 153496 -95189 150314 35822 57742 18802 258795 144071 -93070 242757 31236
10379 105551 103784 494666 99435 209658 231563 186003 69168 422919 443150 422356 163258
10367 148176 759537 612387 679608 296790 199355 232361 154419 217038 13485 -232262 397642
10355 213407 246588 428309 377536 138000 721352 586989 525203 100246 319353 264504
10345 264504 432780 685288 129855 283921 250667 264650 226191 274949 -45256 155374
10334 180069 -69488 -22958 147704 140016 -168119 186129 196977 -118205 141390 2475 267354
10323 267354 182915 -50673 531838 140075 426239 -17228 42341 215393 197827 236750 115959
10311 -274226 56373 -1594 -181547 -72107 76283 23904 51820 -116129 56089 11733 -54166
10299 -80584 67417 25545 -348101 -144029 114500 -43811 138852 -50114 313058 247552 317369
10288 317369 -236310 -56349 44998 -142771 252710 -60329 377985 -136098 -220257 -445988
10278 -445988 -138354 126615 -169946 23361 -27089 114684 -94405 52519 142714 309338
10268 309338 174029 -381585 6403 -121733 -40392 401406 131715 144662 -250725 287315
10257 48373 218291 337477 263140 -68401 -165534 124548 -181862 -254064 4116 195941 134546
10246 134546 -211760 -81522 -29599 190977 -30031 147383 -52230 26672 -61731 64787 -24421
10234 -223513 -122244 -9219 -160910 -71201 -146432 -53002 -50995 44868 135913 16157 -114088
10222 48202 -128741 -264078 -244951 -484617 96519 -143995 -225121 99415 -280399 -228977 -94589
10210 -20651 66027 -212463 -318054 87776 64412 68581 -99616 -230957 96165 181661 46360
10198 16915 -26609 -180177 2372 -75701 -52815 88006 -97548 -316158 -289117 21478 22641 -297997
10185 47191 -78896 -233109 -76799 -92964 -223862 -4303 275538 -181646 -7187 228375 -303603
10173 -170897 -83252 -353041 -147600 71314 -215279 142418 114986 165552 -167973 -170825 -16117
10161 20222 -65086 -117549 -87924 -1691 -91455 -80466 44407 -43499 -286919 -69455 -278402
10150 -278402 -206269 -334713 -57899 -451853 -232732 -52768 49938 -136363 33820 -206346
10139 -400197 -144624 9541 -14385 -217075 -219157 29457 159202 272049 -181655 -300343 225653
10127 -11433 -126202 94399 -223150 41757 203747 1469 167347 -214109 159337 105624 -363
10115 77204 -94906 -121977 -196408 373402 -164234 -99846 -185740 -108084 -174268 111390 83218
10104 83218 120113 -186043 26752 50091 -4771 399390 104119 89982 -53635 -22254 -111248
10093 -111248 256139 -5418 135172 -330126 104352 37969 232870 -518102 -169279 33271
10082 49239 -21711 -166211 -238163 -267618 17837 -149785 97521 28076 92981 32749 -111218
10070 -326916 -57665 419955 -26699 32887 190329 -126019 -241719 163957 160986 37957 -93839
10058 131607 -438632 335537 -174191 197382 221748 -173393 151027 -5333 -344358 -122891
10047 -236464 -210683 -55551 206853 -224235 -100231 -19071 -94823 -136363 304474 350629 280391
10036 280391 258956 -132475 -320648 -197814 -64886 -10237 -302991 58551 -131591 21601
10025 66954 19029 46363 -376217 11406 -258856 173639 -68728 -138543 530 31022 59991
10014 59991 34048 113515 -65091 -231920 12494 -137538 -104386 137024 -198915 -41943 -105364
10003 -105364 44249 205774 -361 3426 -69795 -336691 -173789 -92668 108488 -140200 -243317
9992 -243317 -44416 123548 -43554 -126940 -57782 -83664 -164288 -62788 -332258 -180371 -57471
9980 -175170 -42107 -173461 -143660 24526 270735 -147638 -115222 191 -199566 -59474 -67099
9969 -67099 -135163 -49189 -59953 113920 6602 -59763 -82210 -186611 -213185 454070 -94805
9957 -3796 -111232 29009 24924 -28846 -149791 -146801 160199 -256160 -11613 -39695 261649
9945 -279311 -67898 152445 -71376 94657 63378 -321765 -36538 -215812 411158 -880 23352
9933 -58899 74155 -208447 -289564 103102 -253683 -71142 184832 -288560 -212647 55517 -159384
9921 -284177 -132742 -64305 13862 196477 83954 -45384 -269448 -245254 -384780 131651 -28854
9909 -95308 -335499 -159549 92625 -261969 -267318 -47980 2664 145903 -155445 50619 -5616
9897 349310 119926 74201 -743565 -369466 -143 -19230 42892 -118945 77756 65716 -627900
9885 88296 -201330 -219422 -155003 -82083 -161060 176205 -297892 -80203 105620 -261269 -285058
9874 -285058 108817 43428 35711 -75967 -62668 217644 -135049 -142891 218266 -415032 -42511
9862 202728 -26593 -29312 64108 115963 -185602 -124492 -361156 59675 -256131 -61071 55612
9850 -184976 -219327 204730 -64457 -162771 126918 228374 -36164 147963 -124920 -178610 -72182
9838 -137372 -151294 79088 -48348 -54744 34097 208589 167255 -221123 147745 -426064 437397
9826 -64667 17107 -47878 -23330 -354884 162489 148869 -157745 -71615 47004 136623 188832
9815 188832 -137563 108266 -219517 26496 -99413 -15877 -20605 -173351 322010 -266729 -232524
9804 -232524 37983 -289663 -6922 -75387 -69015 157055 -170617 -208707 -134791 202923 328788
9793 328788 -586208 110050 -102124 -150074 -285305 -256179 -114248 -344750 43848 -2443 280930
9781 -13740 -129179 59800 253813 -221531 -20723 50337 100219 -113355 7998 -168388 8352
9769 -63638 -229534 -278131 -372821 -289755 -192863 -9036 -219305 -132490 -51443 182765 97541
9758 97541 -49576 -117171 -200400 -407166 -290286 -159963 295257 -301007 -57447 -56021 -219503
9747 -219503 158823 291254 -63136 68205 -310868 -1261 163609 43052 -255982 -245338 -135510
9736 -135510 -36061 -165069 -76808 -51132 146508 103601 27383 100103 -137419 -98641 250658
9724 24915 140792 25856 -308324 -117577 135662 -140538 39262 -164743 -91579 -200854
9714 -200854 -150882 -61394 -136512 -38315 -62515 -182636 -214533 -482407 57505 -461575 192031
9702 63040 -105768 89546 -37696 74504 138928 53577 64538 -204274 -505482 177079 -222838
9690 -155792 256199 -178061 -158072 -237376 76378 -239959 45918 165864 -171190 147795
9679 -412533 -181821 125296 -152017 -94402 -299331 104980 -167993 -270348 -91756 -369180
9669 -369180 233568 -200053 -81915 -70704 299004 -37077 14571 -116993 -403107 266319
9658 -49479 336508 42479 -165552 80922 70338 65872 -41016 -76274 -268134 -186269 -159136
9647 -159136 -203951 5195 -284129 -163768 4652 -235561 -48040 174695 28794 -60333 -194697
9636 -194697 -265047 -316543 74901 -39339 -98923 -307883 327474 37099 -114218 -95515 57661
9624 147117 181232 78014 -343564 -245894 128178 -208488 -125504 256725 255030 -15124 -164439
9613 -164439 -226886 -83686 -21217 -198298 148348 -58670 -34607 -2776 41133 -117189 -298665
9602 -298665 -50041 -214102 141485 -202238 -258942 -222381 -138056 101155 188128 -128631 -18334
9590 -109645 -51404 -63402 185997 -381140 100956 -104817 55439 -63225 -131217 12700 30813
9579 30813 63109 5828 -79452 280799 163567 -375713 153937 -141194 -180898 -90258 -250843
9568 -250843 -183789 -99480 -292004 15844 22895 -133853 30225 -133552 -128972 167431 -49042
9556 -75444 -87275 -23302 -163751 -199960 -49481 -165768 -63267 -130993 -163161 95982 136804
9545 136804 199603 -294162 -108535 -132676 83516 -353218 18130 306400 99113 -68320 -360079
9534 -360079 215917 130892 -6325 -194393 -139516 -68638 -232369 102635 -369870 -200402 227116
9522 -229668 262676 80248 -270934 98056 -30872 -5530 -373520 -65033 -70498 -70913 -74223 167230
9509 51958 -161618 159296 -80065 164890 -14611 5297 68040 -216842 1090 -164657 -291608
9498 -291608 68658 1062 -333469 204606 106324 90716 -431848 -23851 -68180 -173972 152198
9486 107241 -83101 -73299 127863 -243240 -435014 133511 134863 72053 -16143 -115549 -141269
9475 -141269 -124267 -142248 170545 -323233 -33022 33566 36044 34755 66909 -16582 -5029 -101555
9463 -101555 158653 -29556 -178897 -59592 -383305 -156056 -43198 80692 33785 -90465 112008
9451 -72830 -230744 -191593 -121697 -51128 43346 61072 -54308 -95078 68909 -199034 38933
9439 146612 -361467 -139665 -41119 -130164 -152302 -107733 -177126 -210987 -118840 -248398 51541
9427 -156146 -165462 -131585 -244052 -297723 33810 -72410 203024 -78877 -138370 -241892 220482
9415 -33705 -257074 -74535 -119676 -300924 77818 32035 -331955 -114711 53193 56792 -590 -139007
9403 -139007 -135578 -4352 4439 -209289 -252469 -191773 -130084 84263 -179581 190633 26792 190024
9391 190024 -160849 -344748 244155 60483 85974 14090 -148293 58335 -36074 230114 385996
9380 385996 -142155 -109586 -108059 67099 54157 -14314 -71087 -30409 110754 -38718 -572572
9369 -572572 -117680 -59015 -181350 57044 -224051 -314742 159210 352100 1683 -31968 38459
9357 -248063 -158885 -75161 -175488 69068 21380 -64056 -268225 3978 -59666 90253 259650
9346 259650 -128230 -299278 -174349 223608 -93623 -138430 -149429 -131462 250576 -356851
9335 -69208 289826 -61186 -117405 -48818 -130456 -192760 -454437 206254 -239518 47569 263796
9324 263796 -12656 58806 1093 362749 75999 -349051 -37678 -384611 -146884 -92707 236830
9312 78973 -124241 89127 -105079 952 -130756 127325 140092 101670 -82095 -226080 -17543
9300 102444 29541 -114193 47645 -332095 -20671 -109617 -172019 -44833 -107988 144805 -198549
9288 212227 214232 34172 186087 -318116 100004 -25324 34322 -15575 -282426 160018 145239
9277 145239 21623 -112474 94703 -329218 17054 -194648 194808 214592 -181051 278640
9266 187071 -124055 -244442 -69748 60493 7055 133660 48738 -168263 -119298 -191120 -107832
9255 -107832 8206 3232 -36454 188075 -122922 -53565 234302 -183247 -74702 -82052 -363654
9244 -363654 11202 -61392 -221059 -204382 -67694 -244396 -236563 24872 -387014 154242 143830
9233 143830 -227671 -109314 203328 -173829 323369 -105265 -437533 -38672 -113672 69436
9222 -290035 -327613 2417 -10327 -210788 -513278 -78120 -44629 2017 -201507 174030 -276667
9210 -69277 -448607 -247284 -186888 151325 40775 398772 65533 -348288 154217 -335646
9199 -193490 289635 70808 -147694 -121745 96438 -116952 -143333 -152623 16779 106467 118814
9188 118814 -55920 -500484 -235141 -251860 -112159 -83805 216466 2368 247781 -439302 69367
9176 40327 -243250 -18156 -204179 -494221 20976 -36261 126806 -48527 -131644 241009 13565
9164 -369218 -68701 -239090 444056 119187 -178919 -116396 -268297 -168857 70264 -168528
9153 119900 -20794 -9093 -36967 18086 -63886 55839 -126184 -65136 34186 -193262 9917 -185611
9140 -135923 145082 89958 -51804 -196325 39714 -93729 -176258 1500 150832 -61339 154471
9128 24117 -79160 50718 134148 -155113 41064 236826 127402 -11613 -337119 -244224 -257980
9117 -257980 -60204 22953 -301438 142433 68436 -48707 -194269 -344158 -103536 -118990 -241340
9106 -241340 -291715 -231762 245767 -25113 329808 -371434 -284138 -183684 13191 -46436 -138193
9095 -138193 -415429 9272 16368 -393414 -223562 -353875 -34560 -128126 -351732 -15369 105679
9083 -73451 -272043 83866 -103460 40768 -86211 223345 839 130694 -128375 -90096 -116011
9072 -116011 103346 -26777 164744 -6786 -15928 -161801 -13262 -347304 68631 -221253 -106811
9060 79047 -312019 -197208 52603 -232239 -308765 -173148 -498722 -89487 288500 -14693 -12222
9049 -12222 12332 -226601 178307 90362 -203416 -240405 -15752 -202952 -176493 -132384 -67198
9038 -67198 -262747 -168598 -168862 16951 -77743 -104145 -216819 81388 -120728 134602 277558
9027 277558 159257 -204270 -378172 -30492 -117592 -150186 177257 -220494 31596 104609 -127104
9015 164154 -106828 -177283 -19844 82696 118864 -7135 -152143 365212 -116467 -357570 -212148
9004 -212148 -100157 -279241 144806 256385 -182530 193184 80709 -120542 -21836 -262664
8994 -262664 -43503 77021 -143348 110992 -213895 -23708 81744 100922 -87891 205410 -40662
8982 43243 -9007 93283 -10805 -272832 49997 191154 -79798 -144434 -93242 -264405 -261810 -55071
8969 -31789 -211958 51120 72000 236990 25021 60089 148838 137437 21592 -271237 -93089
8957 120311 46247 -320891 90668 59012 -4423 -125013 111159 -60887 142946 -268519 -13071
8945 102452 246388 13342 55090 120697 133176 -63385 -187202 -87116 -37437 -393981 231171
8933 137460 -585854 185143 73881 138456 -96241 117310 150980 95378 40997 388494 1084118
8922 1084118 5675772 3896246 1076455 391723 183518 217749 -86554 70569 -217975 -386115
8912 -386115 -155726 238679 -34518 6020 150786 11701 -9573 103755 -310898 -225238 183855
8900 -108036 -63922 75458 93363 113517 50541 -243305 -221209 -64343 -210183 -120773 -105243
8889 -105243 -78423 298788 -119103 -141831 -32325 -63876 185437 -56339 201361 -119941 -276347
8878 -276347 41214 91173 -4807 -100731 -287937 -487701 -124955 -168428 28172 -492467 -4335
8866 -242828 -95674 -77701 -184713 -158490 -27944 169441 -38262 -19423 -474014 -209903 -144755
8855 -144755 -321933 184622 -94069 -116748 87950 -391463 118356 53670 -81375 193802 -120057
8843 -207539 33808 -51894 -68892 153140 190717 83172 -45452 -75167 -193482 -139090 257871
8831 161707 5208 47686 6028 -142487 -21926 27144 -101595 -263153 36562 -24519 -211941
8820 -211941 -314236 -78152 15259 94554 352481 123593 -187674 -233027 -51454 -201056 -191109
8809 -191109 187936 -32104 -60937 -41866 8810 -50361 80192 28463 157632 -499877 78600
8797 -227748 -87898 -207131 165732 -69016 221190 146072 154948 217341 451737 46971 -91721
8785 128102 -108533 90046 58083 114387 -300709 -285086 -415951 -151569 58551 -111229 -390523
8774 -390523 -200325 -40296 -51491 -162608 94204 -342890 -117210 -7488 -226212 72777 85913
8763 85913 189969 -52639 -174960 191669 -243759 -180818 -73291 -74151 -329010 -210941 -113130
8752 -113130 96846 17835 162680 -344100 -90736 47518 -445026 259068 -142605 90834 -31479
8740 86761 253229 -481848 -476320 46719 122723 -82948 -22290 -60029 -293621 10281 -48839
8728 129543 -172269 -115440 -145988 -301868 -42342 -72389 -394939 396 -170906 240756 -2046
8716 -29642 -78493 23141 -197340 -189654 -83522 14885 180288 -45502 -140681 63221 22709 15541
8704 15541 -157440 -13352 -29183 428964 -110453 10979 23055 -126058 -176324 -210666 -161492
8693 -161492 122066 -20023 153739 -103059 31196 -38749 -143282 59893 284587 -199241
8682 -301727 -152809 135610 -168155 117430 169334 -4726 -207516 55546 127276 -48299 -266925
8671 -266925 185626 -117891 90759 88930 24485 -139664 -138759 -104753 25083 -117925 -47409
8659 -169885 140060 -165931 -303636 6563 -311314 -164802 -339664 -71503 -91583 87215 -7813
8647 -255427 128241 -50635 412147 195801 37973 -116810 227482 164099 71234 240160
8637 240160 -270992 -117551 -129048 -226474 -241565 -29470 -25717 -25330 60775 -264575 -176771 136977
8624 -190962 -17635 -196214 22404 498866 -133656 43216 -374728 137525 43319 -419932
8613 -38309 292682 -92230 -132912 -188566 -74478 -32143 43428 -122498 -26652 -103209 -59140
8602 -59140 -92301 -67537 -88483 -110805 188151 -123365 -186756 -289833 -55521 -212580 88283
8590 232423 -42087 192080 184014 205807 -359662 -141773 27053 -74531 -221770 -16815 90014
8578 -236341 28294 30515 84073 -488918 36959 -64383 -141609 -48283 -274164 -37248 -164883
8567 -164883 -245412 -62387 84022 237912 -223161 252088 173493 -28913 -63632 -20837 18787
8555 -7224 115608 -211583 -77190 20709 161934 -59747 50849 95494 -64247 -85581 -142292
8544 -142292 -43916 -46650 -130286 150170 -12487 -419289 -98840 -38137 -9903 87100 -322326
8532 -410969 -186456 122701 -96926 70192 -225458 -90345 -34086 -167479 334793 29795 121516
8521 121516 206113 -71738 -811 -70656 -115200 76336 73182 111582 -269351 199421 121321 75665
8509 75665 35205 12596 -263233 57187 -39255 304835 -338205 -186368 -201041 58071 197839
8498 197839 -29328 167007 -261841 -256814 -5946 348574 9650 -182060 107499 -133208 -311003
8487 -311003 -235918 -348623 -189740 -245951 -54262 -125414 -283909 -139495 -87220 -305143 296052
8475 15778 107504 8969 -63994 -375559 21694 -143774 28893 -170819 -78986 65804 265030
8464 265030 -98509 154225 -76203 372066 -165104 -54243 180228 -54122 122144 64354 -170975
8452 143215 16710 -140541 67161 -82918 297230 -13556 64329 -287968 -41362 66220 141075
8441 141075 94520 -53037 -210900 -153567 -273001 -106505 400850 29007 207087 163558 -84984
8429 64358 243730 -232994 -426098 -47885 -147976 -209535 -35200 152516 -294917 -328136 -287823
8418 -287823 66035 3206 -76072 -244203 75395 53923 -154585 548 -143809 -93917 234575
8406 -15422 -494249 -99544 -100832 -151397 -58085 -289529 -148739 -20673 110980 -58280 -7360
8394 -122229 -203561 126522 96820 261808 -17921 83642 -266249 -271315 5850 -220749 103859
8382 -130934 -44117 -282968 23258 24294 -202399 106027 -37817 -99690 114745 -118591 -118090
8371 -118090 -199927 -270312 284470 142807 -79456 -311784 248486 3651 -79977 -21443 -338130
8360 -338130 -193600 99215 9796 -165821 -16363 -241986 119029 106494 -162219 -74778 -75846
8349 -75846 -81267 80641 -180715 -39807 -368747 -181641 -80379 69659 -162126 -338941 -120150
8337 -185296 -241229 231052 -107205 -12028 -62190 307606 -217371 -5280 -378615 -185726 -32626
8325 -74778 -163407 102611 -157989 120456 102768 180826 -171356 -45513 213674 -10619 -31593
8314 -31593 -328 202616 -21401 77796 47907 20330 121387 161846 252786 -322977 -206702
8303 -206702 -138022 -219160 -19058 -142270 192571 314608 -35392 15353 -178905 130541 150432
8292 150432 -56038 -121748 -197937 27876 -164038 172754 -105426 -16283 186943 -106099 -116778
8281 -116778 -55107 302178 44519 113397 -140490 -158474 312104 -311750 143368 144505 -297775
8269 -108105 -95104 -82169 -473778 37787 -9147 -207199 28515 -205314 -272717 244416 145047
8258 145047 -142474 125276 -329900 -75827 -123508 -141409 -203974 -338773 -134634 149363
8247 -7839 39384 95828 -158434 -208767 -286195 -154097 -196357 -456561 -306630 -310925 -231965
8236 -231965 -195226 355144 78986 223458 127700 61274 -34155 -112564 99811 -170201 -47292
8224 35803 -207063 -308261 -72875 1089 -173937 141168 93605 -301988 -219584 -52257 -263049
8213 -263049 -53334 -33692 36263 -403781 -155712 230861 -82584 -317135 -346288 -43339 -35280
8202 -35280 133316 -182382 24245 -494406 62466 20436 -341795 156044 8591 66145 296360
8191 296360 96484 -219672 4308 -16507 -257382 -60062 78242 -133758 -162731 -266828 -79782
8179 -147336 -53303 -64011 173190 49343 -51367 31109 -5235 -395760 143872 -213906 -142608
8168 -142608 -50063 -137154 -135351 -70758 -219055 -99257 -4745 179399 -99676 -127473 125115
8156 -24915 -1092 20532 -13397 -2333 26003 -9392 -9961 259113 199426 -144384 86173 85396 -63495
8142 8602 -129640 26149 48927 38701 107581 146430 -258394 5051 -119141 135547 -221495
8130 -195209 -253653 117105 73068 -76988 -101988 110027 115754 -178627 -54072 114097 285958
8119 285958 -293230 -72917 22750 110699 27225 113128 -4087 -12950 -19828 -102707 -124933 -45046
8106 -73030 207497 -246884 69911 87658 -182889 -22214 130385 -69750 -305064 119711 56802
8094 -157723 -200740 17747 -136021 76584 126799 -115860 -332123 -96319 -132308 -48775 -244483
8083 -244483 58945 39362 -55072 -151985 50123 38082 460788 -178695 252595 -189150 -91441
8071 -98658 -55219 224121 -191266 48883 338820 -79880 137472 -443560 170775 -11287 86046
8059 -37796 -177939 -42132 59441 -156376 -26558 30286 -357903 342753 -146665 218356 -75201
8047 -24803 -75490 -332117 -26010 -56981 -428593 -130539 -21620 -166131 -241097 37236 -86115
8035 14482 -132195 -138668 -364311 -39165 93490 -129601 -64838 -119548 73396 47556 156962
8024 156962 72951 -96635 -309000 711 -480214 -50939 80761 -153231 87583 -125761 -91113
8013 -91113 26018 -98211 -39597 -247082 -197423 -205232 -66272 -121384 110805 -47045 -69300 88536
8000 -251504 -93272 -140571 1706 305315 -198903 -156869 -78458 195175 -140079 -93815 -138033
7989 -138033 159151 7926 226857 -87034 198645 -354918 78324 -51106 106359 196866 20638
7977 -32677 -168370 126413 142198 -297718 -274141 -26679 139676 93137 87543 338129 60890
7965 -142856 -61733 70675 72031 211266 -26785 -115191 -154502 90403 -26722 -40293 -154423
7954 -154423 106500 -112815 35265 -117576 -17384 -176250 -220346 -61456 -361619 -290816 -202210
7943 -202210 -31186 188462 -171927 -360691 -62058 -232843 -215520 -528358 -160226 34533
7932 138189 -171919 -126494 269407 29953 62394 -24561 -65589 -115098 285607 -216347 -224490
7921 -224490 55571 -105235 -20687 -21896 -38360 -95878 -164830 -235327 -198107 -167352 -45478 -2454
7908 162328 -42082 13583 -11120 139486 -219202 191833 -161586 -281120 -193942 -52903 -97627
7897 -97627 27539 -219519 23619 -284932 38862 -153906 268145 -34491 -174670 93068 -168467
7885 63921 60992 10600 103315 -143684 -165841 -73303 -224537 -145946 -268820 -52877 -18820
7873 -155727 67583 78149 -239665 -27119 126203 -190644 -26537 184264 20582 54009 -87996
7861 234494 -359342 -146015 235400 -396601 -38678 -52925 -244726 -12038 173833 -121149
7850 -131530 257059 -167252 -406800 -78179 122860 -344590 -70839 -240741 183888 -185715
7839 -122490 85773 -144252 73140 17519 -110346 87485 189123 -45007 87034 119238 -181025
7827 17674 -191432 26511 -102701 -156548 352062 -218268 -56403 -164631 -110443 130940 17761
7815 -213548 -85635 184101 -138579 -64058 122506 158938 69215 -120241 -30548 -298806 316529
7803 12599 57992 5749 35055 -372862 -9532 -34838 371002 -50428 -214697 277237 -42839
7791 559 284500 5052 -40693 159687 -324844 -13241 -147523 -350912 -112539 11280 -286543
7779 -94839 -268321 -319611 35460 -255381 3469 26687 -195177 -79427 57493 -347791 -176200
7768 -176200 252025 -288184 -165599 119728 144859 -53794 140144 -22170 -84759 -327161
7758 -327161 -204555 -75683 221430 98103 -117195 112301 103286 -152023 -280711 -38199 2331
7746 166288 127283 -77931 163248 122066 -95222 -46219 -217886 73595 -215035 -565537 208521
7734 -319766 -115685 -290801 118857 -132844 -10395 -62866 -17675 -38199 -93902 73994 49523
7723 49523 413557 52709 -223865 -104510 -39233 -123196 -351042 -166192 -166361 -65994 -13185
7711 316262 -42179 374061 -27557 159310 232068 109901 -23790 114608 -81862 138863 18336
7699 16791 265380 143948 -180487 355081 -92467 -186819 -392343 -27591 247742 -202383
7688 -330234 -76374 -169794 -124224 191336 -176554 78438 206516 195176 -238895 -153802 2577
7676 -104604 -264308 -320236 -320153 57758 44543 -7887 -354380 63625 68157 -131438 100940 -397455
7663 -172831 -4552 237929 -113499 -114667 115586 -18194 -8244 -142174 -216912 89733 215525
7652 215525 77627 146588 -151231 -235626 -308741 -49719 71231 11010 -196975 -17908 156860
7640 247488 61284 -115140 -396296 63931 -33139 443007 -102755 31006 -146141 38623 -50892
7628 -142005 278897 -200367 -116671 -15999 208650 -62355 -70368 77803 -199516 70897 -390886
7616 -3233 182576 143638 105611 -350102 409575 92010 -73970 -180605 -152211 86817 -165595
7604 -73504 -200863 -237476 119589 20262 -67214 -94369 31037 104492 148691 115124 -34004
7592 107781 -163926 167822 -140705 -156738 158958 -118329 67944 165649 -129292 -86856
7582 -86856 35065 194570 -64243 -151968 64026 122708 -22888 -151877 280161 -141169 93769
7570 -121223 277941 -90703 -351370 -289028 -61596 -163443 65747 -77010 157180 -115775 -53046
7558 -251464 -6393 44047 138995 -162947 -403192 319457 -252034 -57543 -53644 -82459 100590
7546 -239755 177717 -82184 -198962 302484 -49486 118328 -158226 -155033 -337100 -128847
7535 -128188 162112 -181845 167609 52344 86018 61295 228540 108042 -139852 138157
7524 50697 -9124 108656 -169637 -307437 81885 103187 200331 -347813 -80753 -58967 257000
7512 44569 170419 -358742 -25653 17707 120160 164745 -176687 -248001 128983 209323 -38501
7500 -65112 -114010 -422156 150426 153598 -25335 111264 -160300 -197813 -102744 134582 -271697
7488 108257 -18688 -201082 -125418 159479 748 -105348 -80768 23611 248992 -123911 -159705
7477 -159705 -162980 -111958 174267 -48809 -181347 -29562 -36983 -140759 143151 -4286 -138821
7466 -138821 302632 139840 347994 -373465 -11774 101459 66746 227410 188666 -108668
7455 -32862 -143332 -353263 347459 53170 162034 -113150 102287 -9661 -230344 -209428 29610
7443 -98799 -211910 50950 -177689 93786 -8222 -30638 154138 24029 154292 -40234 -34115
7432 -34115 51534 -314556 -182739 237207 -231982 -103008 78804 -109319 135759 292717
7422 292717 -33631 -125731 -33543 15613 -64915 117814 86620 -267559 -97646 9944 221992
7411 221992 184095 -103620 132667 49972 -138052 -38573 103048 -298497 -167779 90195
7400 -336886 270780 -91692 215166 -89096 134253 -153963 -42825 -338061 358264 -178250
7389 -161711 198209 11918 94300 302906 124110 56719 -382349 -104144 205898 166774
7379 166774 320116 -133959 15809 -247 -3199 124702 -182544 -31716 380585 196275 -51169
7367 -221093 -42001 9595 -250198 85328 -54529 47214 -109021 23535 96446 -437897 -145298
7355 -277325 -166236 125088 80252 -297691 -74505 -75814 143269 -104363 -122055 70848 -199702
7343 57280 -343656 -166224 127136 27966 111130 -168421 -159087 61015 -102250 -168436 37431
7331 17142 26501 -90575 161692 -101524 191094 -38709 -39896 -161770 228658 137271 -23866
7319 347028 -243914 -20683 267203 -90282 250768 -126902 -298322 -172635 -243213 209344
7308 -325704 302175 276413 -187818 199688 -19221 41522 204143 86086 143341 -101368 -178372
7297 -178372 -136471 -29708 11085 -125967 79970 232517 -74716 106496 -137826 187715 16810
7285 -42081 97185 -179697 -155676 28067 -286584 124597 -62247 -104020 -52564 346615 185034
7274 185034 132227 42695 232748 80940 -215476 61761 199621 237148 -243251 -4993 -388391
7263 -388391 -193133 334723 -212168 -77611 -512040 116852 88481 -415415 667 -234937 75519
7251 -371430 235316 124252 100865 58430 -91764 -293537 -29033 148088 -61930 -136107 -85959
7240 -85959 131264 -48222 111211 -344373 -266084 -36420 -157290 42835 -75187 75289 -184209
7228 226677 -216552 52178 207547 103355 -35354 16057 76719 161300 -276921 -256733 -102064
7216 855 207904 -80221 116305 290819 -137748 13493 -290185 -133072 -21538 -7859 -14540
7205 -14540 -104858 39316 62353 513930 -340929 -100383 -165404 -118946 -112475 -234163 -270671
7194 -270671 117880 342570 -126965 64127 -158646 365335 -69637 -187546 229094 6608
7183 87127 37800 -18667 -291456 -134126 -286760 138256 35962 -447 -128030 -73980 -122506
7172 -122506 165 -9609 222666 -319296 -33390 -113611 190564 201626 -128136 -110735 -297069
7161 -297069 -124505 -168221 -312851 -325041 -287486 -185469 173925 -15464 133740 -91619 72001
7149 -211118 -172622 -168351 -304340 -71624 -155408 -30377 89946 80616 -86661 -333339 -242475 -124666
7137 -124666 -104468 -312550 -186918 49234 13246 -218359 -5385 229420 -230794 -65741 -7888
7125 128563 -226574 -198427 63189 -80235 228598 69238 229771 296704 -177536 76862 -120491
7113 -293017 -416976 -98875 -405359 88963 75997 -154241 -199858 344350 221863 -67661 47224
7101 -65591 72579 -9451 -381440 -43087 23099 -56135 -61170 7801 184820 -77966 94708 110130
7089 110130 -104357 127228 -138823 355003 -19966 -59605 -23721 -79792 -28549 -137959 -50588
7077 -151688 -23132 130846 33871 77067 177284 -40667 61896 116005 50197 -159095 -49401
7065 28658 38572 274381 -289976 361614 113796 -266027 -41976 156267 200222 239889 21118
7053 -268680 -84707 -170604 132027 -64583 -103529 -38310 323169 -73533 215054 -238103 -346551
7042 -346551 -63749 -359269 -261602 514317 -262186 -280422 -27889 101053 217621 105208
7031 -131237 18649 79574 -49071 144874 -190459 -112648 52321 -154538 -290379 -141211 -224642
7020 -224642 134887 65289 -278926 -354417 -28575 -45533 -157402 9820 -66197 1022 -238445
7008 -46006 46501 132678 -451570 291997 273719 -85480 -268326 -149573 -27165 -42168 -239672
6997 -239672 56817 -163702 140822 86589 -117933 134526 -28179 -335482 -239791 -79137 21781
6985 82100 -50432 10040 -171923 -353157 36860 -82148 -131675 -33052 179453 83734 -74213
6973 25525 40392 -326790 327354 -134090 -3658 -265203 82547 -93988 -74776 -224207 52933
6961 -387382 -66460 298767 318877 -355634 -200540 -124155 76792 -187465 -186418 167791 -255120
6949 312162 -80530 60225 -59280 -22981 305948 58633 -262418 158558 56273 167129 -113409
6937 61852 19278 -98839 156174 -277909 -87000 256854 17533 -279927 70229 -206595 -185792
6926 -185792 344195 -166281 106639 -62468 31971 -160778 -64404 109275 -90542 -4105 337978
6914 6497 157361 -194943 165364 -122038 316 -25458 -50123 61553 -309256 51025 68115
6903 68115 -117579 64225 200220 -31729 -126607 -59149 221632 -245749 -75700 -241908 -130369
6892 -130369 -43955 -172709 -92852 24495 -278136 -36160 62643 -27842 -193768 19850 -15577
6880 134983 -18224 193390 -108031 -62177 -23547 -90349 -62626 147202 -39371 -132254 -250820
6869 -250820 7445 125453 -86877 -112695 -11630 -163286 261679 -127370 109288 -124018 89161
6857 249526 106942 -128060 107157 -103634 235796 162836 76556 -184545 -115692 -133409
6847 -133409 57446 -11722 95607 -139797 -46839 -310150 -193251 31414 -11923 -80697 -320904
6836 -320904 -328363 -85299 -366255 -246278 34743 -131850 49006 -5806 -30770 267460 93735
6824 9319 417214 101994 94028 -48541 -239804 169144 10788 250035 -76623 -267142 -47908
6812 -76423 -438025 -20593 -112819 -107358 -288787 -81826 40496 -55213 247878 17260 151994
6801 151994 41331 -334005 -42702 328643 -79101 63266 59930 21998 -201015 110613 -118648
6789 197568 35663 -6334 -237171 -157970 -131227 -50086 108708 -128649 -192579 7130 -64450
6777 17570 -94589 69493 -93397 24509 -187030 96572 220756 -38791 -134553 -35778 -66992
6766 -66992 119806 -90934 -92730 -76314 -209267 71148 -375602 37726 68349 -16937 -87011
6755 -87011 71554 50437 -62519 58117 120797 46523 2537 68768 -571329 -180361 202283
6743 166750 -247384 82966 16185 300940 -107228 -106587 -42776 -176472 13695 122209 293343
6732 293343 -237060 19702 10583 -360668 -114619 103394 -132633 269163 242271 198171 -14316
6720 45607 351385 98292 -2783 84472 55889 50062 -245837 4789 189414 -392640 357052
6708 -343597 -44430 -147699 133535 -31460 -32473 386354 29919 -78841 -302835 -6713 338622
6696 -70279 237920 114539 -71141 -89442 240623 -185766 -211671 327868 -38739 88738 -153604
6684 -80410 190974 -207502 -158932 -34542 -188533 -49026 357267 169778 -62037 192630 299525
6673 299525 413 181835 86328 -22457 -57376 -194420 22136 -255236 73167 -196354 -9623
6661 -5902 165967 -309650 89359 145822 142268 -309127 -98175 -162034 139972 -170928 284107
6649 -123099 -141621 6992 166050 -298024 -133184 200703 221655 -25107 268665 10756 -30806
6637 110812 -268791 11412 39106 7646 30242 -254852 -104623 -135860 -159635 -94801 174084
6625 -33571 -60403 172762 -225397 11466 495018 140191 -365253 -189497 113766 145087
6615 145087 -106947 -148446 -52181 93802 10307 186204 -161569 198590 -49214 151064 178869
6604 178869 70472 -16080 -184409 -189266 94722 -173511 -199514 -107366 263592 -165165 258566
6592 133729 -30406 -43910 -250685 45504 -88773 -2266 -164680 -307616 -253920 327552 271162
6581 271162 -111786 497291 -68056 -149777 -77276 93941 -52734 -214364 -26196 -221707 -16169
6569 130950 56395 263493 116024 -20341 -77005 -97251 -202168 -197846 61971 83485 312843
6558 312843 12160 -46636 206534 251972 -139684 151930 -60198 82682 294260 -190913 -142503
6547 -142503 51060 -324012 67721 -324331 -293704 -108833 127889 389827 -111959 286592
6536 208639 -111268 162485 -184926 -102658 -28470 -68469 -374733 -354663 -38138 -42485 -104327
6525 -104327 68368 54126 -241850 -164684 -31201 -197707 42647 -150778 6811 164306 -43409
6513 -153447 155102 24859 320942 -77673 112210 -235105 125701 -179187 261423 71162
6502 -98104 -181367 80864 4598 20024 -282179 -182586 26496 58628 -375826 -52615 341948
6490 104335 -389532 -160731 242990 55944 -401848 -193039 278543 -124593 -241927 103568
6479 -206464 33470 -225654 -80990 -38060 -64492 184400 480331 55638 -58740 -65316 342463
6467 8090 297410 120590 30323 -219809 -204870 -74102 -157560 -75356 48155 -34026 182922
6455 -44260 -71897 317965 -174751 -277157 -99237 158159 290850 -62145 61224 -100566 -34864
6443 -120123 -445293 -241702 171384 -88175 124584 -18782 360990 -76107 86774 149092 -292719
6431 -42885 56274 136442 -378965 237160 18478 -136458 68857 -108476 135055 -126899 -25500
6419 66514 -60891 195969 -48679 -70192 162927 -293427 119830 116194 70324 -149152 -217374
6408 -217374 -22569 146903 -77278 87055 172464 -33568 87492 -170948 109279 289575 66373
6396 194104 78498 -283988 180536 66080 -7807 255645 94195 -180037 -461704 -139477 -109306
6385 -109306 -20759 15915 -201223 166834 83583 92431 -197759 79385 -38277 -98820 117012
6373 -48891 8930 445114 -53495 -283080 -107142 -182233 -354950 221124 336917 171552 -472947
6361 -278529 297313 -91023 -236948 -127908 -123054 -71980 16696 105756 -200105 47430 166390
6350 166390 94938 -82651 -364580 123821 -219330 234173 70261 95100 -135690 20442 64267
6339 64267 59153 -115700 69824 125411 -146017 -219647 153125 -213237 422061 -69199 43033
6327 33064 -408975 -72137 330381 -204223 -82339 -127442 409195 -204272 -42929 -25279 65431
6315 109429 -113395 186768 101353 -265227 61359 15227 -106579 -81873 103167 -162867
6304 463424 -163965 167321 -40449 -113432 188002 -161130 83581 101830 394895 -104639
6293 -33798 -37734 -94839 317607 -189554 75218 -62662 145600 146440 -56542 -65163 -51616 -203874
6281 -203874 -437286 -54927 48824 61047 -38996 -356549 54476 -117693 -144062 135151 51529
6269 114213 102790 -113748 183883 304199 163365 10710 -63051 99458 -225920 132726
6258 250271 190685 253876 157458 -22576 -32003 -224342 58025 -217535 -1217 66980 89107 312320
6246 312320 49836 60878 -18898 -347900 216128 208661 20876 59323 -74080 -55743 -5371 -221807
6234 -221807 -149414 48616 -183544 63873 -32189 188686 -136671 -8682 -224489 -168559 -71196
6222 -190117 -26482 317177 -23718 -4796 -244933 -11797 39563 -263889 -370595 147521 -63479
6210 -208726 -76576 -109377 184094 12603 91548 -15825 -99840 94918 415055 30557 -209034
6198 156026 -56632 122793 -105038 160190 -132436 168804 -173393 127745 -313966 105857
6187 6480 -96005 65718 106523 157917 275680 -142738 295273 -103788 -168664 70114 -13982
6175 36555 -48672 -430388 50873 80603 117916 -160821 -85379 -117104 123366 13625 6470
6163 -281249 141950 -125529 -208231 -97731 -233214 2521 -129772 107157 -338392 96260 41359
6151 100866 -164409 55144 -48136 -345935 82255 139689 -122188 -67007 -43757 16336 -56055
6139 -165364 178076 179838 66487 43449 107642 121325 -79980 63448 -68327 53328 202454
6128 202454 50691 -101038 -98940 -114006 -22044 -44131 -13295 -97621 72000 145011 -223447
6116 -130152 171492 -32772 35015 -97717 425550 -50197 52107 -107059 -32339 165193 237896
6105 237896 23241 -78483 57392 205379 -66213 -45009 69217 133687 4979 104301 -106547
6093 -267879 -108692 -36083 -270668 166329 -223260 39957 136712 72705 -719 145624 -416440
6081 -396018 41514 -48079 -25327 -87160 471254 -11217 239546 -60043 187235 92765 -312880
6069 -200907 164652 31129 -242590 -57802 7798 13846 -90273 -345643 69715 -64842 174224
6057 -3467 232890 -127432 -47443 132846 -97224 75728 286812 290050 -76400 48886 -57704
6045 72685 189153 -78460 -86402 -143212 -84409 413316 -52729 55539 -175453 -55120 12329
6033 -335617 32772 138846 33221 185862 177227 311583 62917 -81546 -19225 85342 12682
6021 55895 -166856 -130154 -317645 -9661 155234 224427 -5759 -261860 35218 -78682 -51122
6010 -51122 -121521 -169297 -11467 139647 238180 38313 58508 -164617 178327 -20807 377186
5998 -36419 196050 293433 -120157 163971 -41608 -107178 14482 -287825 -189818 -48418 152769
5986 -295527 -105990 133511 338083 -37116 -20938 -104293 -164164 141801 103433 109150 96308
5975 96308 -28727 -291819 -192617 -150051 218966 220790 -296807 -171512 -28801 99149 73422
5964 73422 164339 -9098 159161 -233076 -396218 -66795 33103 -70443 -179164 84463 -92644
5952 -80907 38973 5335 -13951 258905 -223518 116477 121210 -62532 -54552 -209981 -85556 243792
5939 -100878 -131647 219271 142648 291642 -432553 183627 -4671 -193006 5806 133319 127388
5928 127388 -241073 47152 -49952 139027 -213500 -70390 48386 -68417 -79300 -4509 190036
5916 -60835 -238509 -339889 216904 -106080 -41475 11995 185175 224165 123640 -5517 -292352
5905 -292352 -67166 -268072 -71372 -3469 279180 47089 -236758 -108371 -287346 112533 103804
5894 103804 152365 9349 -258726 -151869 -5814 173128 169890 -68775 457670 -59424 25697
5882 -168304 6715 -151203 153171 492749 23102 -43080 82928 404871 -99282 -133383 64318
5870 53061 -29493 -287214 62352 -29960 208442 7533 -151363 -71169 -434622 188376 -158009
5858 -153560 -165931 -67989 139383 -74875 -114117 65502 -198817 -228517 -57572 -176838 -118514
5847 -118514 34836 -110649 122271 -346919 42988 -119888 -254983 -294500 395384 -82682
5836 -95431 -108273 -278446 -80621 -65668 44033 394009 4926 -49969 122148 118553 135761 40044
5823 111708 78046 -22849 65257 141131 -344 -190323 51199 -33843 -6831 48315 -589344 406374
5810 -61796 -9891 -94489 113669 46080 73193 -331686 305405 148091 -188114 3853 -292588
5798 130792 -344845 83709 -26525 87690 -51229 36903 -40962 20578 185299 108006 -23115
5786 121455 137069 -73438 -381736 8417 -129505 94957 -158844 -14460 -139711 -239409 17019
5774 -7157 -175102 112002 -273315 72110 160291 -88020 74109 -49540 -100157 155853 44353
5762 -271908 -37617 175954 196639 -67882 115759 8564 -241781 -234710 134458 -286134 -41255
5750 -64082 168685 132997 -259523 147984 -125648 -266063 120311 62538 23679 178784
5740 178784 -100474 495481 175636 -256671 118483 -148980 21679 73312 90059 -254085
5729 62295 136237 147128 134009 55291 78435 7499 117124 254480 -26876 190967 -405703
5717 98267 -154185 69031 199816 -225792 79649 39232 -136327 267105 -348441 -491260
5707 -491260 30069 -95189 184517 24931 268798 337549 -41974 -292696 115180 -216 88781
5695 113823 -197718 -210867 68629 -156234 -82115 -219561 98103 101216 -84233 -213377 -4119
5683 -250170 -32924 -355603 -166800 -238052 -94902 15561 389267 209801 -286613 133841
5672 30718 -183051 56584 -142595 -46739 129329 -327965 -61864 128391 104264 -233389 487120
5660 57637 18583 -303137 -196408 13990 -87188 121323 54445 -189439 -195814 -90386 105612
5648 96124 -78283 216742 229095 13005 -8022 16751 49402 155180 231971 -302579 11325
5636 67443 -37176 49686 -303357 -21058 -360334 -145647 178299 -46305 117601 -224877 -345246
5625 -345246 -76496 167971 201729 57858 193850 -146710 -98126 141814 245318 119711
5614 -53969 181916 239016 44976 210434 212783 17650 -78707 9549 268663 -211653 -18760
5602 -61541 -220243 -146617 -182327 170568 -97674 -275050 -78674 404729 -14456 61325 55326
5591 55326 -21505 -93922 103563 -16065 28850 103276 46224 -31128 -32975 -75893 52160 171740
5579 171740 392814 -134133 101512 115280 36766 255939 13271 -105616 108004 244584
5569 244584 160042 73781 66881 -331634 -236987 -97009 92038 -251551 -389271 -284173 -201616
5558 -201616 -44757 79429 -215658 -70485 -43827 208254 -174958 129664 147155 222460 32528
5546 137776 -262778 -362033 -238119 36145 215655 282372 -88120 -153200 -7009 273017 320301
5535 320301 116906 64318 -72191 -72925 28454 -32697 -181744 31216 -1661 27602 129663 -110192
5522 -52839 195213 -187432 86136 -277630 117013 -58822 49933 -27029 119530 32561 -30629
5510 -224827 32689 -39014 124506 138307 -179007 4588 -76152 166734 -182779 -103405 -51145
5498 -238756 103728 -137190 -296200 -209426 -58197 125402 118461 -41979 -7543 -227545 247012
5486 -103267 -14561 175541 -86894 -186226 -226834 12233 -215503 -266898 -90190 -147230 -292 -134432
5474 -134432 -203200 1372 24114 7681 45705 -328988 -126738 -4100 -40133 -1456 -128847 -60793
5461 -320523 -144020 108165 35526 -125678 179433 -120890 145644 -4068 285096 -108284
5450 -93571 -116624 -27719 -48245 110829 -215212 -55134 161807 108044 68819 -47158 208406
5438 -173935 5060 261588 231718 210928 219118 -197768 -300631 -136122 -209103 -66546 168457
5426 142521 -153085 297704 -64321 59394 -23217 303188 -30821 -19736 -106252 -213538 -140820
5415 -140820 46007 3151 -63990 13448 -435257 209883 282707 12196 -58509 92065 -63634
5403 146455 171535 -47267 -110191 -153212 -49654 -347758 81177 -80411 470957 51004 -80938
5391 -125360 139805 -47721 -65433 -61472 -763 16546 9446 64634 176168 -109584 206268 102960
5378 198378 8535 -31011 -297230 54367 250782 -148705 -348747 42014 255380 33196 76808
5367 76808 74455 -291 -104798 298219 109158 461077 140226 67607 -136345 144583 -136799
5355 167613 48859 32153 -19866 536265 -142123 93269 -39782 156689 -182755 -293761 3147
5343 341568 -25206 249313 -255017 -83573 81942 16916 114033 65228 -36593 408498 -131945
5331 -79204 140637 20983 -137232 -142019 156725 -132871 33880 10088 73499 107905 -117875
5319 -330781 8107 106152 -9535 96567 -87238 -116330 17791 -118575 -144685 -168137 -75215 -190980
5307 -190980 120573 -103956 57178 -260633 -134975 -246895 -104240 150243 -57823 61479
5296 -59507 -111394 -21655 -112936 -216055 126084 -367595 153018 -101669 -260684 -78434 157687
5284 -793 10203 192027 32155 105105 -299482 -309138 16814 148515 -32701 210899 -40487 -58777
5272 -58777 9046 -122809 17838 -216623 222647 141772 -96904 360607 -205641 -128608 -32785
5260 125630 64248 49049 31284 7971 273390 -248791 37352 -18279 -91286 -51024 -311756
5249 -311756 -382404 115855 -165833 292392 134146 -231500 144064 -268721 164540 -200313
5238 -350667 -216436 101929 -314844 -166319 288398 -38025 129103 -28016 -292135 -160883
5228 -160883 -150431 -155082 162832 156023 -98309 -219085 -342478 -117203 -175768 271614 -167365
5216 -315490 -56215 -289977 68297 -126199 35214 -152251 -65284 301005 31497 217985 55225
5204 245721 70760 -113212 -164583 -20863 44651 -95971 -65123 88647 -108806 102425 191847
5193 191847 396917 -132278 -399380 -194807 -41130 29869 -40671 53394 -130390 -68280 79867
5181 -237688 -249139 -264140 109200 -191793 186992 208194 -32000 256835 189870 70318 141737
5170 141737 -437027 -22942 -165665 261367 -108700 141860 10128 -17917 47817 84078 43989
5159 43989 -171544 -130568 64123 -26534 -117788 -68981 -136491 76294 160513 197987 122695 277414
5147 277414 -105589 82503 118706 -145115 -145291 -152814 70999 18982 44897 157620 191314 -20959
5134 -194308 286920 204517 217029 185700 90051 363029 55476 70736 136309 -143985 -182601
5123 -182601 157890 180211 343496 -2718 -163171 -103324 -49899 -21151 -7399 6131 -71010 157500
5110 103069 288761 -225751 -209643 325507 286781 299375 -62141 317096 -7984 35405 -123301
5098 -31292 -163894 -125402 144078 55774 169120 -128956 112668 35079 -75071 -16829 8440
5086 109267 -114771 81732 19206 205984 -367760 2084 -131306 -46263 -14431 230033 78305
5074 -46700 -27084 -421912 -117415 87230 -349074 161 130276 81650 131811 -117488 -117023 -240612
5062 -240612 209874 -128835 87574 -438777 140817 -299917 -390146 26751 -70185 40204 231640
5051 231640 93310 16967 112908 -33953 -150077 -80595 264464 -123562 47184 -43391 35090
5039 -98360 236721 -92646 7873 81314 367982 80625 148483 -150293 -76737 -371758 233294
5027 125474 98815 502081 -126657 151780 -232446 277 122713 207530 81726 -90557 -198185
5016 -198185 161007 270498 422219 -396799 36818 11432 56562 295941 179844 -22140
5005 -97458 -50103 61795 -28090 -18891 -211970 293983 318082 -185176 96438 -160426 -265445
4994 -265445 36276 -55796 40452 -378626 -117093 61930 206326 -137149 -139498 381993 62831
4982 47226 219851 -160404 -7292 -218213 117690 -237747 175248 106277 333090 -94892 15274
4970 -319856 86083 83885 51004 105813 -49691 170806 -456195 144817 109733 283224 -199730
4958 113843 -44703 208003 -53331 80534 309612 30722 -294531 -99813 -47803 48186 -116352
4946 -90738 41019 -257639 -33911 59809 371612 -125691 36085 -347593 347226 115286 171773
4935 171773 -105700 87296 211477 -35139 -95639 -121355 -123295 156616 266836 -71626 20116
4923 -164716 207298 -63191 163914 -258684 64455 -81041 176827 -53533 -128545 271689 -486501
4911 -44377 -208865 -202711 123490 -215334 -45195 -225870 208144 -83465 128717 -68882 -290868
4900 -290868 -142630 176115 -65497 -13810 40987 48573 -2263 30024 -158636 -12092 -24904
4889 -24904 292592 65719 -34963 -333784 86075 136516 -151865 -20155 161433 216917 239412
4878 239412 -37433 60308 51842 171348 -110678 -183232 -105573 -100899 -134233 -41410 -16718 -159298
4866 -159298 -216169 66350 -66270 83297 -128171 89557 -161064 142770 36326 -383980 -353500
4855 -353500 -283698 -101876 -56881 -82185 -352206 98356 -207593 36157 119505 120491 111817 -26337
4842 77908 50156 160865 -44931 -131594 125650 -63150 194289 208964 20712 185449 77102
4830 -443248 -93731 71816 218170 -308634 71704 -45261 50803 30664 83719 210623 -25934
4818 -170374 107298 -166924 -25821 1599 247819 -16337 93370 205254 78955 11588 -42953
4806 180061 199190 -417949 130844 57282 52044 -138983 213238 155051 340576 406162 -28917
4794 168434 -100223 25116 70819 106768 -186125 52079 -67249 40724 160008 -42861 102043
4782 -64298 -242739 -223889 -318047 -129463 418713 -35690 47480 60750 -387775 145688 -288324
4770 -164499 77093 120367 -214657 -115502 125213 -141175 235439 57905 31114 -19983 -177839
4759 -177839 -395 86400 136141 -6451 -2824 -37728 165930 158074 -38667 -44928 -251324 90141
4746 -73388 48808 -38389 238369 -214367 256694 -132472 -117547 -84369 50010 65581 100776
4735 100776 -234207 524329 84592 4200 53131 110149 -272672 258247 -221870 -182219 240573
4723 229806 274680 -82794 317653 -107746 90754 -45928 82069 507276 139584 -24983 93162
4711 -234278 108332 -187210 142109 -109608 -98593 -126978 -101610 229235 20585 -229424
4700 20624 -16709 20445 -131251 -278257 399049 -263613 13938 -201700 16772 -5858 32929
4688 819 67545 -145044 23006 -39321 175607 79977 -143427 130667 357024 -293549 -64112
4676 321669 -128977 61881 -67163 -56568 -23687 -168910 -16932 -364806 210506 47273 6035
4664 227770 -60325 -395583 -136628 56462 35130 334146 96059 -14609 -22075 8347 -265025
4652 27233 -203088 -8501 138729 -240522 183085 9002 22685 217256 -280542 45294 -311113
4640 -339509 -172589 -459367 121905 216835 98724 -114647 -202706 -143246 225726 -15676 108980
4628 -208748 249855 106285 136543 -223951 -23479 -124684 -68250 4450 -85761 178516 2161
4616 8475 221256 -146185 108147 33570 -120400 218873 13825 170978 -197704 -134355 69441
4604 171079 52381 127962 192122 -42323 120284 44290 -131539 18639 -55242 193840 -177022
4592 239842 138450 20891 -128714 -73530 -111539 -205885 123547 -313352 -280672 -265427 243468
4580 -119837 67334 -168636 -142431 -103595 86406 194536 -217311 22331 -140533 -32833 -46504
4569 -46504 -49147 -177153 -116443 90322 276126 68192 209011 257490 428126 -54149 -169670
4558 -169670 -271686 201945 52174 137855 -63536 -103156 -123974 224813 -52847 -253560 71339
4546 99420 33624 234143 38861 -148065 -395919 -16169 216633 -155407 138178 -103935
4535 -315589 141697 88013 185986 258743 41871 427603 -59851 -102008 245690 -256062 203246
$$ [...]
##END NTUPLES=NMR SPECTRUM
##END=
