
##TITLE=AC1325_PERAH11154_6535825_Ft1uJnqipN
##JCAMPDX= 6.0         $$ Bruker NMR JCAMP-DX V2.0
##DATA TYPE= NMR SPECTRUM
##DATA CLASS= NTUPLES
##ORIGIN= BRUKER
##OWNER= Administrator
$$ 1.72 TOPSPIN		Version 2.1
$$ 2012-07-17 23:25:52.171 -0500  Administrator@TOPSPIN
$$ Compression mode = diff/dup
##.OBSERVE FREQUENCY= 400.02188249412
##.OBSERVE NUCLEUS= ^1H
##.ACQUISITION MODE= SIMULTANEOUS (DQD)
##.ACQUISITION SCHEME= undefined
##.AVERAGES= 64
##.DIGITISER RES= 22
##SPECTROMETER/DATA SYSTEM= spect
##.PULSE SEQUENCE= noesygpps1d.comp
##.SOLVENT NAME= COFFEE_meoh
##.SHIFT REFERENCE= INTERNAL, COFFEE_meoh, 1, 14.96081
##AUDIT TRAIL= $$ (NUMBER, WHEN, WHO, WHERE, PROCESS, VERSION, WHAT)
$$ ##TITLE= Audit trail, TOPSPIN		Version 2.1
$$ ##JCAMPDX= 5.01
$$ ##ORIGIN= Bruker BioSpin GmbH
$$ ##OWNER= Administrator
$$ $$ C:\Bruker\TOPSPIN/data/COFFEE/nmr/AC1325_PERAH11154_6535825_Ft1uJnqipN/12/pdata/1/auditp.txt
$$ ##AUDIT TRAIL=  $$ (NUMBER, WHEN, WHO, WHERE, PROCESS, VERSION, WHAT)
(   1,<2012-07-17 23:25:47.343 -0500>,<Administrator>,<TOPSPIN>,<go>,<TOPSPIN 2.1>,
      <created by zg
	started at 2012-07-17 23:14:17.250 -0500,
	POWCHK enabled, PULCHK disabled,
       configuration hash MD5:
       6B 1B 68 BB D9 2E 58 E2 7F 35 AD 54 07 DF 0E 41
       data hash MD5: 64K
       78 B3 02 7A DC 0F C8 11 A8 19 5E 44 B6 FB E0 14>)
(   2,<2012-07-17 23:25:50.250 -0500>,<Administrator>,<TOPSPIN>,<proc1d>,<TOPSPIN 2.1>,
      <Start of raw data processing
       efp LB = 0.3 FT_mod = 6 PKNL = 1 PHC0 = 0 PHC1 = 0 SI = 128K 
       data hash MD5: 128K
       C3 C7 3A DE 77 28 4E A2 D7 0E 15 02 71 89 74 C2>)
(   3,<2012-07-17 23:25:51.437 -0500>,<Administrator>,<TOPSPIN>,<proc1d>,<TOPSPIN 2.1>,
      <pk PHC0 = -0.5822754 PHC1 = 0 
       data hash MD5: 128K
       51 49 55 71 FC 17 8E 40 88 5D 6C 10 49 23 3D FB>)
(   4,<2012-07-17 23:25:51.671 -0500>,<Administrator>,<TOPSPIN>,<proc1d>,<TOPSPIN 2.1>,
      <abs ABSG = 1 
       data hash MD5: 128K
       44 9C FF 63 0F E5 71 65 5C B1 1C 58 88 2A CB A9>)
(   5,<2012-07-17 23:25:51.750 -0500>,<Administrator>,<TOPSPIN>,<proc1d>,<TOPSPIN 2.1>,
      <abs ABSG = 2 
       data hash MD5: 128K
       A5 51 64 3E 32 BB B9 3A 36 29 42 6F 65 1F 1C 2C>)
(   6,<2012-07-17 23:25:51.812 -0500>,<Administrator>,<TOPSPIN>,<proc1d>,<TOPSPIN 2.1>,
      <abs ABSG = 3 
       data hash MD5: 128K
       78 6D 5D C3 1A B8 A0 A0 F0 5A 06 54 89 51 64 BD>)
(   7,<2012-07-17 23:25:52.031 -0500>,<Administrator>,<TOPSPIN>,<proc1d>,<TOPSPIN 2.1>,
      <abs ABSG = 4 
       data hash MD5: 128K
       DB 69 22 F1 16 C7 E2 88 0F 1F 93 C2 E0 E2 F9 8F>)
(   8,<2012-07-17 23:25:52.078 -0500>,<Administrator>,<TOPSPIN>,<proc1d>,<TOPSPIN 2.1>,
      <abs ABSG = 5 
       data hash MD5: 128K
       6F 31 F8 2C 05 89 EA F3 EA 2B 17 0D DC 39 64 7C>)
$$ ##END=
$$ 
$$ $$ hash MD5
$$ $$ 6D 2F 91 A7 09 77 7D 65 21 DC 5F DC A8 73 E2 7B
##$RELAX= 
##$RELAX= 
##$RELAX= 
##$RELAX= 
##$RELAX= 
##$RELAX= 
##$RELAX= 
##$RELAX= 
$$ Bruker specific parameters
$$ [...]
##$TP07= 0
##$TPNAME0= <>
##$TPNAME1= <>
##$TPNAME2= <>
##$TPNAME3= <>
##$TPNAME4= <>
##$TPNAME5= <>
##$TPNAME6= <>
##$TPNAME7= <>
##$TPOAL= (0..7)
0.5 0.5 0.5 0.5 0.5 0.5 0.5 0.5
##$TPOFFS= (0..7)
0 0 0 0 0 0 0 0
##$TUNHIN= 0
##$TUNHOUT= 0
##$TUNXOUT= 0
##$USERA1= <user>
##$USERA2= <user>
##$USERA3= <user>
##$USERA4= <user>
##$USERA5= <user>
##$V9= 5
##$VALIST= <valist>
##$VCLIST= <CCCCCCCCCCCCCCC>
##$VD= 0
##$VDLIST= <DDDDDDDDDDDDDDD>
##$VPLIST= <PPPPPPPPPPPPPPP>
##$VTLIST= <TTTTTTTTTTTTTTT>
##$WBST= 2048
##$WBSW= 25
##$XGAIN= (0..3)
0 0 0 0
##$XL= 0
##$YL= 0
##$YMAX_a= 12067502
##$YMIN_a= -9366553
##$ZGOPTNS= <>
##$ZL1= 120
##$ZL2= 120
##$ZL3= 120
##$ZL4= 120
##$ABSF1= 14.96081
##$ABSF2= -5.597372
##$ABSG= 5
##$ABSL= 3
##$ALPHA= 0
##$AQORDER= 0
##$ASSFAC= 0
##$ASSFACI= 0
##$ASSFACX= 0
##$ASSWID= 0
##$AUNMP= <proc_prof1d_extract.lims>
##$AXLEFT= 0
##$AXNAME= <>
##$AXNUC= <1H>
##$AXRIGHT= 0
##$AXTYPE= 0
##$AXUNIT= <>
##$AZFE= 0.1
##$AZFW= 0.1
##$BCFW= 0
##$BC_mod= 0
##$BYTORDP= 0
##$COROFFS= 0
##$CY= 15
##$DATMOD= 1
##$DC= 0
##$DFILT= <>
##$DTYPP= 0
##$F1P= 0
##$F2P= 0
##$FCOR= 0.5
##$FTSIZE= 131072
##$FT_mod= 6
##$GAMMA= 0
##$GB= 0
##$INTBC= 1
##$INTSCL= 1
##$ISEN= 128
##$LB= 0.3
##$LEV0= 0
##$LPBIN= 0
##$MAXI= 10000
##$MC2= 0
##$MEAN= 0
##$ME_mod= 0
##$MI= 0
##$NCOEF= 0
##$NC_proc= -2
##$NLEV= 6
##$NOISF1= 0
##$NOISF2= 0
##$NSP= 0
##$NTH_PI= 0
##$NZP= 0
##$OFFSET= 14.96081
##$PC= 1
##$PHC0= -0.5822754
##$PHC1= 0
##$PH_mod= 1
##$PKNL= yes
##$PPARMOD= 0
##$PPDIAG= 0
##$PPIPTYP= 0
##$PPMPNUM= 2147483647
##$PPRESOL= 1
##$PSCAL= 4
##$PSIGN= 0
##$PYNMP= <proc.py>
##$REVERSE= no
##$SF= 400.02000971124
##$SI= 131072
##$SIGF1= 0
##$SIGF2= 0
##$SINO= 400
##$SIOLD= 131072
##$SPECTYP= <>
##$SREGLST= <1H.CDCl3>
##$SSB= 0
##$STSI= 131072
##$STSR= 0
##$SW_p= 8223.68421052631
##$SYMM= 0
##$S_DEV= 0
##$TDeff= 65536
##$TDoff= 0
##$TI= <>
##$TILT= no
##$TM1= 0
##$TM2= 0
##$TOPLEV= 0
##$USERP1= <user>
##$USERP2= <user>
##$USERP3= <user>
##$USERP4= <user>
##$USERP5= <user>
##$WDW= 1
##$XDIM= 131072
##$YMAX_p= 452097656
##$YMIN_p= -12466
##$CURPLOT= <Network HP LaserJet P1505>
##$CURPRIN= <$Network HP LaserJet P1505>
##$DFORMAT= <normdp>
##$LAYOUT= <+/1D_H.xwp>
##$LFORMAT= <normlp>
##$PFORMAT= <normpl>
##$SURQMSG= 1
$$ End of Bruker specific parameters
$$ ---------------------------------
##NTUPLES= NMR SPECTRUM
##VAR_NAME=  FREQUENCY,     SPECTRUM/REAL,   SPECTRUM/IMAG
##SYMBOL=    X,             R,               I
##VAR_TYPE=  INDEPENDENT,   DEPENDENT,       DEPENDENT
##VAR_FORM=  AFFN,          ASDF,            ASDF
##VAR_DIM=   131072,        131072,          131072
##UNITS=     HZ,            ARBITRARY UNITS, ARBITRARY UNITS
##FACTOR=    0.0627417313425164, 1,          1
##FIRST=     8223.62146879497, -215,         -56400
##LAST=      0,             310,             -56752
##MIN=       0,             -12466,          0
##MAX=       8223.62146879497, 452097656,    0
$$ Real data points
##PAGE= N=1
##DATA TABLE= (X++(R..R)), XYDATA
$$ [...]
67830 117126 118266 119228 120708 123372 126892 130174 132365 133442 134082 135318 138029 142246 146936 150796 153290
67815 153290 154736 155557 155850 155589 154765 153158 150348 146274 141650 137581 134770 133149 132189 131360 130303 128795
67799 128795 126797 124561 122497 120799 119343 118074 117345 117577 118638 119847 120594 120691 120113 118841 117176 115876
67783 115876 115587 116255 117320 118336 119142 119569 119381 118616 117788 117583 118379 120018 122042 124155 126410 128829
67767 128829 130920 131942 131797 131396 131864 133564 136037 138623 140848 142461 143590 144748 146277 147771 148404
67752 148404 147816 146339 144394 142217 140284 139400 139953 141396 142881 144160 145439 146544 146809 145934 144484
67737 144484 143288 142575 141976 141172 140200 139132 137790 135979 133848 131820 130156 128736 127293 125758 124239
67722 124239 122757 121158 119405 117856 117049 117156 117765 118328 118745 119299 120045 120559 120504 120218 120428 121348 122375
67705 122375 122769 122503 122266 122729 123951 125429 126585 127140 127168 126976 126961 127436 128369 129308 129757 129722 129734 130197 130929
67686 130929 131469 131651 131651 131622 131553 131436 131289 131144 131230 131999 133628 135654 137484 139127 140921 142659 143742 144259
67668 144259 145075 146450 147364 146915 145827 145724 147139 149051 150333 150840 150925 150602 149635 148121 146562 145487
67652 145487 145186 145680 146791 148273 149944 151672 153265 154473 155100 155038 154306 153159 152014 151102 150335 149675
67636 149675 149387 149565 149707 149303 148840 149555 151976 155163 157735 159314 160570 162119 163862 165357 166379 166940
67620 166940 166994 166425 165362 164318 163918 164442 165701 167330 169013 170371 170900 170398 169416 168955 169570 170909 172191
67603 172191 172940 173205 173269 173324 173338 173091 172375 171242 170023 169022 168239 167413 166299 164868 163301 161862 160750
67586 160750 160006 159542 159203 158873 158572 158437 158472 158374 157848 157140 156945 157566 158492 159098 159487 160169 161122 161758 161804 161621
67566 161621 161554 161541 161590 162005 162739 163005 162165 160736 159957 160460 161867 163539 165144 166462 167235 167546 167914 168707
67548 168707 169678 170332 170547 170576 170608 170609 170548 170531 170740 171352 172445 173776 174736 174777 173935 172785 171890 171499 171670 172331
67528 172331 173085 173341 172901 172188 171631 171053 170048 168768 167846 167519 167338 166934 166612 166918 167896 169136 170360
67511 170360 171610 172930 174153 175020 175293 174878 174027 173333 173232 173493 173510 173112 172772 172923 173380 173620 173483 173378
67493 173378 173850 175095 176786 178259 178900 178561 177685 176935 176684 176828 177119 177563 178402 179704 181140 182306 183185
67476 183185 184072 185050 185793 186051 186103 186512 187478 188594 189240 189092 188352 187600 187381 187794 188526 189366 190545 192389
67458 192389 194699 196724 197815 197917 197464 196943 196667 196788 197332 198148 198849 198950 198249 197125 196304 196237 196816 197725
67440 197725 198869 200303 201927 203469 204701 205578 206283 207188 208519 209929 210696 210598 210310 210602 211398 212022 212113
67423 212113 211792 211121 210007 208619 207336 206171 204805 203328 202360 202158 202119 201571 200729 200393 200896 201783 202451
67406 202451 202734 202778 202615 202158 201631 201771 203257 205793 208074 209036 208971 209039 209820 210835 211427 211501 211289 210969 210872
67387 210872 211545 213189 215315 217249 218726 219688 219879 219160 218073 217639 218515 220549 223073 225367 226963 227825
67371 227825 228314 228831 229446 229888 229825 229180 228309 227904 228407 229456 230183 230193 229971 230160 230829 231669 232531 233347 233838
67352 233838 233771 233420 233340 233661 233916 233576 232558 231257 230277 230048 230489 231140 231738 232501 233690 235104 236315 237221
67334 237221 238070 239067 240260 241674 243239 244776 246413 248861 252740 257602 262004 264707 265535 265109 264155
67319 264155 263202 262590 262413 262471 262375 261741 260445 258837 257632 257307 257686 258263 258804 259350 259810 259991 260080 260700 262365
67300 262365 265069 268403 271778 274535 276230 276945 277135 277106 276919 276743 276849 277109 276958 276093 274855 273613 272100
67283 272100 269848 267097 264848 263944 264365 265425 266415 267028 267418 268001 269056 270451 271797 272904 273975 275326
67267 275326 277043 278955 280873 282674 284158 284987 284943 284214 283284 282485 281745 280861 279893 279183 278992 279191 279323
67250 279323 278974 278182 277493 277491 278136 278679 278369 277245 276107 275770 276403 277523 278467 278850 278748 278509 278453 278699 279195
67231 279195 279804 280391 280990 281864 283150 284491 285291 285412 285287 285236 285098 284796 284778 285403 286181 286211 285259 283926 282860
67212 282860 282352 282623 283862 285780 287608 288784 289356 289651 289886 290174 290446 290258 289194 287636 286626 286689 287337
67195 287337 288094 289356 291571 293985 295121 294501 293162 292320 292139 292084 291990 292281 293298 294766 296011 296569 296553
67178 296553 296476 296702 297119 297411 297567 297961 298918 300341 301760 302659 302785 302370 302055 302395 303371 304540 305681 306985
67160 306985 308470 309610 309880 309456 308956 308577 308025 307344 307245 308240 309876 311279 312213 313079 314005 314552 314378 313705
67142 313705 312958 312392 312228 312667 313427 313775 313488 313441 314645 316873 318847 319801 320266 321158 322551 323604 323489
67125 323489 322217 320725 320189 320997 322351 323128 323187 323435 324544 326059 327135 327775 328820 330780 333105 334753
67109 334753 335185 334693 333956 333415 333072 332760 332548 332793 333777 335327 336921 338189 339236 340413 341772 342825
67093 342825 342953 342069 340820 340117 340488 341827 343610 345274 346537 347524 348528 349588 350350 350455 349917 349057
67077 349057 348205 347654 347705 348502 349877 351584 353587 355847 357936 359260 359761 360065 360826 362090 363398 364331
67061 364331 364852 365241 365746 366218 366113 365078 363553 362591 362976 364599 366661 368353 369403 370181 371296 372968
67045 372968 374846 376490 377858 379122 380277 381274 382372 383951 386037 388363 390732 392908 394384 394854 394834
67030 394834 395193 396091 397042 398032 399705 402286 405158 407895 410844 414180 417162 419103 420482 422314 424775
67015 424775 427196 429085 430436 431287 431778 432510 434132 436591 439327 442081 444899 447515 449511 451089 452989
67000 452989 455533 458381 461339 464766 468973 473723 478508 482904 486594 489574 492446 495925 499842 503151
66986 503151 505154 506245 507307 508867 511070 513909 517170 520615 524493 529341 534973 540306 544618 548451
66972 548451 552739 557599 562612 567796 573487 579577 585671 591830 598361 604971 610965 616303 621673 627416
66958 627416 633227 639095 645625 652910 659966 666068 672089 679562 688631 697871 706193 714095 722721 732373
66944 732373 742522 752844 763557 774792 786229 797596 809133 821222 833762 846304 858759
66933 858759 871597 885204 899369 913686 928230 943430 959376 975622 991800 1008083 1024951
66922 1024951 1042778 1061819 1082230 1103777 1125710 1147315 1168577 1190067 1212240 1235146 1258813
66911 1258813 1283503 1309424 1336394 1363971 1391841 1419978 1448551 1477757 1507683 1538269 1569475
66900 1569475 1601453 1634473 1668631 1703779 1739717 1776289 1813285 1850450 1887739 1925486 1964202
66889 1964202 2004279 2045776 2088252 2130791 2172519 2213292 2253728 2294396 2335178 2375557 2415207
66878 2415207 2453961 2491352 2526683 2559698 2590982 2621477 2651569 2680612 2707365 2731053 2752035
66867 2752035 2771243 2788947 2804318 2816368 2824962 2830664 2833911 2834714 2832879 2828067 2819798 2807989 2793431
66854 2793431 2777220 2759643 2740048 2717826 2692963 2665589 2635619 2603152 2568719 2532796 2495466
66843 2495466 2456959 2418041 2379309 2340270 2299770 2257398 2214080 2171153 2129137 2087555 2045719
66832 2045719 2003464 1961132 1919038 1877140 1835237 1793301 1751467 1709922 1669059 1629556 1591837
66821 1591837 1555437 1519346 1483147 1447458 1413096 1380164 1348194 1316845 1286209 1256623 1228438
66810 1228438 1201695 1175856 1150118 1124239 1098786 1074292 1050565 1027158 1004180 982121 961029
66799 961029 940365 919696 899116 878995 859626 841160 823570 806609 790006 773748 758037
66788 758037 743008 728573 714478 700452 686441 672740 659634 646871 633888 620764 608425
66777 608425 597485 587322 576859 565913 555114 544823 534883 525367 516707 508948 501523 493966 486240
66764 486240 478244 469655 460588 451806 443874 436515 429212 422037 415475 409744 404687 400106 395790 391433
66750 391433 386889 382399 378196 374061 369573 364673 359609 354405 348821 342874 337061 331928 327604 323873
66736 323873 320521 317431 314401 311053 307078 302624 298335 294810 292022 289407 286522 283394 280143 276619
66722 276619 272675 268621 265050 262245 260040 258249 256868 255665 253901 250835 246531 241947 238137 235512
66708 235512 233862 232782 231819 230383 227934 224407 220322 216431 213328 211229 209831 208418 206532 204556
66694 204556 203184 202229 200603 197865 195101 193562 192901 191643 189246 186715 185083 184141 183071 181633 180183
66679 180183 178915 177602 175967 174003 172064 170702 170164 169900 168947 166942 164404 161889 159375 156779 154574
66664 154574 153337 152951 152725 152175 151301 150263 149197 148240 147446 146714 146051 145686 145627 145372 144458 143117 141968
66647 141968 141147 140212 138873 137339 135957 134868 134108 133648 133285 132835 132459 132431 132580 132385 131719 131028 130562 129887
66629 129887 128523 126719 125160 124069 123009 121602 120102 119175 119250 120113 121047 121367 120903 119974 118906 117744
66613 117744 116491 115385 114684 114316 114024 113843 114095 114815 115486 115576 115163 114763 114618 114453 113957 113245 112638 112190
66595 112190 111625 110722 109606 108681 108342 108675 109342 109809 109824 109556 109158 108431 107210 105910 105147 104787 103935 102131
66577 102131 100095 98801 98229 97602 96668 96047 96207 96758 97038 96979 96986 97237 97496 97505 97235 96830 96550 96661 97070 97130
66557 97130 96217 94619 93552 93927 95267 96114 95619 94517 94322 95571 97070 97064 95117 92578 91116 91073 91493
66540 91493 91508 91162 90869 90656 90294 89804 89395 89084 88799 88731 89126 89757 90054 89816 89416 89185 89095 89203 89884 91211
66520 91211 92441 92643 91688 90222 88800 87460 86093 84789 83732 83072 82952 83381 84050 84519 84699 84871 85192
66503 85192 85446 85406 85214 85156 85220 85053 84388 83379 82517 82179 82267 82326 82075 81719 81665 82062 82756 83511 84101 84309 84078
66482 84078 83547 82740 81450 79744 78330 77864 78006 77790 77014 76528 76891 77400 77018 75834 74939 75013 75757 76785
66464 76785 78402 80951 83666 84851 83547 80750 78520 77929 78296 78556 78724 79533 81070 82582 83537 84116
66448 84116 84533 84571 84067 83345 82837 82666 82830 83318 83808 83702 82878 82009 81782 82143 82615 82957 83108 82900 82316
66429 82316 81742 81497 81381 81069 80586 79984 78935 77307 75820 75366 75839 76305 76281 76178 76480 77150 77886 78308
66411 78308 77880 76348 74397 73194 72986 72828 71979 70884 70310 70108 69552 68530 67702 67549 67865 68245 68638
66394 68638 69276 70286 71477 72394 72565 71841 70558 69347 68817 69340 70846 72734 74270 75284 76291 77727
66378 77727 79345 80624 81531 82380 83084 83113 82357 81546 81481 82120 82723 82719 82091 81052 79779 78491 77446 76715
66360 76715 76184 75858 75863 76017 75839 75275 75100 76006 77454 77997 76894 74938 73498 73171 73646 74447 75384 76385
66342 76385 77366 78282 79102 79695 79873 79493 78483 76924 75202 73861 73134 72776 72491 72289 72306 72550 73071 74076
66324 74076 75483 76631 76871 76329 75645 75096 74465 73722 73259 73291 73514 73625 73860 74698 76137 77534 78097 77517
66306 77517 76201 74947 74348 74463 75064 75993 77125 78199 78978 79461 79676 79444 78739 78106 78186 78793 79016 78404
66288 78404 77528 77105 77038 76728 75984 75180 74673 74499 74545 74673 74675 74468 74375 74893 76012 77010 77111 76284 75210 74549
66268 74549 74413 74542 74677 74571 73900 72595 71272 70948 72094 74136 76016 77023 77006 76152 74964 74233 74507
66251 74507 75510 76325 76224 75252 74159 73892 74949 76925 78758 79681 79781 79512 79007 78283 77785 78108 79213
66234 79213 80492 81528 82310 82709 82424 81529 80554 79835 79316 79099 79525 80432 80933 80425 79397 78792 78872 79160
66216 79160 79213 79035 78821 78648 78375 77707 76596 75623 75630 76719 78015 78712 78954 79320 79922 80515 81169 82133 83183
66197 83183 83796 83981 84361 85313 86502 87424 87986 88348 88548 88555 88472 88410 88271 87816 86939 85821 84835 84271 84034 83730
66177 83730 83231 83049 83835 85419 86698 86690 85563 84376 83939 84157 84501 84791 85314 86288 87525 88691 89643 90308
66159 90308 90341 89278 87111 84570 82664 82010 82520 83539 84182 83797 82426 80894 80303 81228 83274 85374
66143 85374 86616 86935 86989 87350 87905 88132 87756 86900 85741 84381 83064 82112 81532 80951 80117 79274 78921 79363
66125 79363 80584 82344 84250 85868 86865 87027 86257 84761 83141 81977 81341 81036 81215 82240 83882 85313
66109 85313 86178 87086 88649 90518 91926 92768 93519 94306 94823 95101 95667 96729 97758 98202 98239 98454 98983 99394
66091 99394 99445 99586 100446 101992 103512 104506 105226 106060 106665 106301 104982 103739 103470 103936 104182 103623 102404 100964
66073 100964 99651 98709 98267 98291 98629 99050 99275 99122 98669 98048 97135 95856 94805 94987 96680 99057 101256
66056 101256 103281 105401 107170 107746 106948 105387 103655 101991 100627 99903 99936 100519 101332 101975 102006 101344 100555
66039 100555 100334 100779 101512 102307 103161 103964 104620 105346 106275 106922 106692 105887 105459 105770 106291 106669 107301 108523
66021 108523 109909 110898 111615 112565 113823 114979 115676 115823 115494 115003 114979 116005 118157 120992 123943 126591
66005 126591 128708 130191 131023 131352 131728 133081 136070 140432 145281 150080 154991 160267 165717 170968 175848
65990 175848 180264 183976 186810 188905 190526 191780 192596 192753 191820 189432 185832 181855 178097 174419 170509
65975 170509 166586 163048 159701 155928 151686 147801 145067 143345 141825 139980 137956 136107 134487 133001
65961 133001 131813 131264 131355 131655 131913 132414 133445 134711 135735 136619 137796 139014 139352 138550 137733 138291 140394
65944 140394 143110 145743 148428 151409 154366 156749 158512 160194 162269 164553 166337 167163 167398 167986 169596
65929 169596 172129 175003 177665 179755 181100 181917 182972 185180 188853 193416 197944 202006 205952 210368
65915 210368 215317 220284 224919 229558 234783 240575 246213 250991 254731 257535 259430 260454 260908 261261 261792
65900 261792 262350 262416 261511 259792 258151 257368 257117 256139 253542 249612 245218 240794 236173 231095 225493 219488
65884 219488 213402 207690 202590 197849 192996 187818 182465 177245 172469 168355 164854 161698 158796 156480
65870 156480 155140 154678 154533 154196 153552 152790 152123 151593 151085 150464 149658 148510 146774 144591 142865 142651 143961
65853 143961 145605 146447 146473 146386 146550 146720 146522 145826 144901 144475 145297 147236 149178 150271 150887 151792 152821 153268
65835 153268 153355 154205 156193 158284 159409 159727 160058 160781 161982 164180 168126 173974 181145 188918 196775 204362
65819 204362 211536 218367 224768 230246 234358 237244 239365 240869 241608 241570 240805 239042 235986 231973 227749
65804 227749 223496 218696 213147 207572 202862 199206 196306 194021 192283 190759 189195 187941 187570 188040 188680
65789 188680 188989 189020 189006 189116 189626 190898 193015 195823 199364 203900 209424 215657 222756 231443 242015 253558
65773 253558 264581 274190 282254 288679 293095 295171 294769 291721 285845 277312 266753 254941 242562
65760 242562 230297 218883 209015 201259 195987 193202 192479 193269 195265 198450 202972 209121 217182 226998
65746 226998 237936 249637 262588 277448 293915 310760 326933 342033 355635 366844 374866 379570
65734 379570 381090 379291 374044 365733 355037 342320 327709 311725 295471 279971 265540 251869
65722 251869 238685 226173 214782 204719 195805 187801 180679 174406 168723 163421 158688 154838 151807
65709 151807 149248 147084 145464 144189 142668 140719 138972 138184 138382 138873 138902 138156 136882 135735 135292 135558
65693 135558 136090 136630 137289 138110 138917 139816 141346 143772 146537 148811 150341 151500 152774 154591 157349 161105
65677 161105 165343 169459 173469 177959 183426 190037 197957 207529 219056 232558 247827 264513 282179
65664 282179 300387 318769 336993 354756 371811 387839 402261 414431 424043 431073 435331 436569
65652 436569 435273 432861 430675 429108 428059 427825 428991 431688 435522 440060 444839 449011 451530 451701 449176
65637 449176 443511 434280 421606 406091 388235 368470 347710 327184 307433 288078 268924 250815
65625 250815 234904 221404 209540 198611 188623 179887 172442 166063 160616 156158 152769 150393 148827
65612 148827 147700 146486 144813 142906 141452 140701 139906 138146 135664 133765 133205 133332 133223 133033 133488 134461
65596 134461 134943 134440 133567 133051 132841 132569 132411 132956 134436 136534 138931 141725 145197 149272 153348 156753
65580 156753 159388 161842 164866 168886 174174 181207 190519 202239 216008 231334 247860 265318 283433
65567 283433 301926 320454 338524 355413 370088 381304 388203 390988 390622 387563 381178 370753 356726
65554 356726 340394 322746 304263 285698 268206 252452 238145 224770 212386 201452 192182 184373
65542 184373 177728 172146 167672 164261 161576 159164 156924 155231 154483 154762 156075 158567 162102 165938 169258
65527 169258 171763 173324 173454 171820 169045 166157 163239 159437 154423 149126 144751 141645 139372 137341
65513 137341 135101 132569 130278 129019 128943 129384 129731 130057 130683 131591 132497 133176 133519 133599 133786 134342 134841 134573
65495 134573 133685 133314 134293 136252 138341 140260 142154 144046 146002 148572 152495 157974 164492 171158 177106
65480 177106 181822 185294 187655 188762 188540 187709 187430 187977 188403 187755 185962 183229 179386 174422 169000 163807
65464 163807 158927 154405 150735 148127 145885 143394 141199 140236 140401 140782 140936 140969 140648 139503 137753 136177
65448 136177 135068 134175 133613 133843 134672 135271 135405 135771 136858 138329 139839 141669 144103 146885 149723 152764
65432 152764 156122 159447 162369 164900 167084 168740 169863 170679 170892 169556 166330 162381 159329 157574 156287
65417 156287 154807 153279 152001 150861 149668 148575 147893 147753 148130 149009 150386 152149 154023 155613 156600
65402 156600 156979 157066 157249 157814 158978 160894 163492 166538 169979 174020 178640 183227 186974 189563 191163
65387 191163 191849 191375 189704 187474 185597 184343 183037 180917 178216 176096 175356 175479 175222 173972 172144
65372 172144 170419 169134 168538 169025 170714 173050 175206 176797 178000 179222 180896 183399 186743 190482 194284
65357 194284 198576 204286 211890 220970 230740 240709 250695 260514 269933 278843 287148 294434 299954 303122
65343 303122 304001 303172 301173 298189 294325 289897 285170 279927 273677 266373 258560 250637 242305 233199 223875
65328 223875 215601 209050 203613 198296 192955 188225 184452 181212 178021 175055 172876 171692 171215 171133 171324
65313 171324 171593 171591 171179 170616 170144 169471 167941 165256 161923 158912 156922 155955 155560 155427 155691 156669 158411
65296 158411 160715 163442 166594 170080 173664 177212 180695 183784 185753 186054 184872 182966 181138 179933
65282 179933 179530 179597 179491 178906 178162 177551 176693 175035 172801 170865 169652 168737 167701 166832 166650 167071 167424
65265 167424 167107 165964 164170 162031 159930 158285 157400 157297 157685 158268 159179 160855 163276 165580 166866 167224
65249 167224 167398 167558 167050 165488 163375 161315 159209 156757 154264 152373 151276 150663 150291 150063 149812 149546
65233 149546 149798 151103 153093 154680 155235 155162 155182 155513 155894 155979 155473 154240 152534 150855 149379 147854 146251
65216 146251 145125 144936 145384 145916 146661 148198 150403 152178 152649 152214 152017 152612 153568 154275 154717 155266 155954
65199 155954 156275 155714 154371 152894 151829 151169 150615 150127 149969 150241 150687 151138 151903 153412 155550 157619 159013
65182 159013 159772 160447 161620 163557 166163 169135 172151 174932 177143 178491 179069 179370 179698 179747 179140 178277
65166 178277 178065 178796 179879 180866 182176 184457 187738 191615 195820 200089 203878 206885 209644 213006 217241
65151 217241 222226 228240 235710 244268 253036 262124 272982 286838 303551 322545 344137 369073 397020
65138 397020 426300 455007 481816 505951 527271 546693 565862 585857 606258 625533 641990
65127 641990 654198 660996 661765 656856 647504 635197 621212 606607 592173 577963 562904 545314
65115 545314 524101 499524 472910 445854 419721 395403 373126 352558 333405 315838 300134
65104 300134 286099 273272 261570 251208 241966 233134 224456 216611 210350 205489 201182 197021 193429
65091 193429 190948 189514 188484 187264 185821 184682 184431 185192 186627 188265 189618 190096 189254 187271 184864
65076 184864 182594 180516 178598 177027 175918 175127 174673 174890 175773 176569 176561 175950 175440 175161 174647 173791 173148 173207
65058 173207 173853 174725 175644 176556 177406 178270 179321 180536 181623 182292 182387 181764 180383 178550 176824 175567 174762
65041 174762 174219 173656 172686 171068 169058 167147 165471 163795 162027 160333 158685 156785 154570 152361 150363
65026 150363 148446 146598 145163 144413 144286 144769 146018 147807 149329 149964 149897 149599 149134 148464 148059 148489 149621
65009 149621 150818 151856 153094 154758 156641 158588 160722 163089 165518 168015 170874 174202 177613 180570
64995 180570 182823 184409 185453 186050 186195 185831 185239 185205 186427 188683 191072 193092 195032 197187 199337 201344
64979 201344 203719 207001 210850 214239 216386 217112 216549 215012 213000 210728 207644 202993 197030 191156 186587
64964 186587 183232 180157 176843 173612 170998 169101 167609 166195 164791 163570 162742 162358 162296 162378 162431 162309
64948 162309 161972 161552 161203 160901 160503 159960 159303 158459 157393 156483 156356 157114 158021 158278 157935 157695 158003 158731
64930 158731 159681 160844 162061 162882 163080 163017 163198 163641 163955 163917 163654 163325 162927 162396 161689 160754 159628 158588
64912 158588 158003 157995 158486 159594 161641 164591 167720 170215 172033 173878 176320 179237 182198 185167 188616
64897 188616 193071 198769 205671 213594 222202 230985 239393 247048 253827 259806 265098 269735 273682 277004
64883 277004 279899 282459 284397 285217 284744 283338 281400 278798 275003 269797 263631 257270 251247 245739 240751
64868 240751 236326 232639 229957 228280 227093 225793 224485 223926 224357 224786 223946 221657 218596 214933 210145
64853 210145 204338 198798 194603 191367 188079 184706 182091 180551 179546 178718 178321 178338 178048 176987 175730
64838 175730 175133 175223 175460 175787 176684 178184 179472 179675 178762 177483 176635 176482 176705 176839 176780 176889 177602 179021
64820 179021 180957 183192 185576 188040 190643 193437 196200 198597 200904 204268 209783 217413 226202 235414
64806 235414 244991 254966 265010 274704 283747 291663 297634 300917 301248 298793 294026 287758 280887 273820
64792 273820 266402 258556 250679 243183 236019 229061 222711 217696 214338 212327 211200 210783 211168 212409 214206
64777 214206 215843 216665 216773 217093 218561 221370 225115 229378 233910 238516 243193 248306 254317 261326 269058
64762 269058 277128 285111 292582 299470 306204 313112 319807 325560 330170 334016 337353 340180 342744 345468
64748 345468 348111 349712 349833 349283 348974 348408 346077 341243 334578 326891 318033 307580 296121 285082
64734 285082 275299 266423 257958 250325 244421 240447 237789 235968 235081 235191 235826 236435 236881 237111 236807 235926
64718 235926 235344 236261 238947 242570 246318 250175 254486 259325 264577 270179 275858 280894 284547 286596 287176
64703 287176 286282 283748 279632 274244 267787 260360 252400 244777 238198 232694 227898 223685 220173 217193
64689 217193 214212 211056 208416 207259 207813 209402 211176 212634 213568 214080 214852 216877 220487 224954 229399
64674 229399 233900 239340 246382 255000 264839 275453 286172 296165 304842 312038 317720 321678 323482 322614
64660 322614 318791 312377 304379 295853 287410 279382 272105 265738 260113 255268 251799 250073 249308 248165
64646 248165 246293 244646 244161 244810 246143 248182 251319 255711 261139 267389 274648 283647 295263 309597
64632 309597 325517 341570 357262 372867 388034 401380 411615 418355 421541 420861 416313 408792 399562
64619 399562 389422 378752 367915 357221 346863 337271 329144 322758 317618 313162 309394 306503 304393
64606 304393 302982 302492 302890 303513 303746 303598 303084 301640 298878 295420 292104 288719 284437 279289 274289 270121
64590 270121 266581 263313 260278 257407 254525 251774 249457 247529 245982 245725 248103 253181 259388 265271
64576 265271 270900 277025 283559 289671 294958 299775 304440 308694 311946 313699 313636 311556 307359 301060 292907
64561 292907 283493 273665 264280 256036 249358 244145 239714 235304 230691 226104 221750 217766 214555 212564
64547 212564 211622 210998 210287 209883 210344 211708 213670 216037 218686 221346 223827 226257 228744 230820 231568 230432
64531 230432 227836 224897 222465 220432 218144 215506 213329 212297 212004 211579 211029 211195 212410 213983 215286
64516 215286 216542 218130 219774 221066 222287 223964 225888 227346 228252 229387 231404 234165 237313 241021
64502 241021 245774 251674 258358 265639 273868 283440 294119 305138 315890 326115 335233 342026 345519
64489 345519 345965 344375 341171 336046 329214 321953 315469 309882 304899 300874 298315 296662 294511 291170
64475 291170 287272 283630 280159 276304 272017 267806 264033 260698 257874 255902 254976 254806 254938 255278 256173
64460 256173 258023 260935 264671 268721 272357 274868 275946 275817 274918 273600 272199 271151 270728 270764 270960 271422
64444 271422 272609 274700 277380 280343 283766 288103 293615 300245 307770 315937 324562 333662 343425 354065
64430 354065 365858 379376 395406 414411 436178 460199 486444 515694 549199 588166 633773
64419 633773 687693 752292 829735 920498 1022764 1133122 1247442 1361088 1469440 1569470
64409 1569470 1660794 1744207 1818894 1881615 1928633 1957635 1967733 1958975 1932980 1893374 1844152
64398 1844152 1787015 1720644 1642675 1552316 1451374 1343482 1232657 1122400 1015790 915891
64388 915891 825396 745657 676420 616783 566096 523722 488466 458865 433909 413060 395717
64377 395717 381099 368548 357589 347817 339044 331423 325049 319567 314481 309615 304836 299602 293426
64364 293426 286702 280398 274815 269309 263419 257696 253037 249609 246877 244436 242442 241292 241207 242216 244376
64349 244376 247927 253128 259916 267816 276357 285382 294623 303083 309320 312551 313187 312115 309823 306459
64335 306459 302388 298159 293968 289571 284907 280600 277629 276544 277090 278592 280569 282884 285376 287613
64321 287613 289198 290195 290987 291675 291838 291019 289279 287057 284649 282127 279778 278253 277860 277807 276568 273275
64305 273275 268545 263699 259366 255155 250526 245461 240234 235091 230432 226868 224642 223199 221760 220185
64291 220185 218939 218339 218261 218517 219072 219845 220753 222083 224432 228051 232561 237475 242711 248288 253884 259194
64275 259194 264617 271019 278642 286694 294326 301701 309650 318344 326720 333267 337073 337972 336208 332349
64261 332349 327394 322563 318950 317449 318609 322083 326387 329786 331481 331548 329789 325442 318277 309334 300063
64246 300063 291105 282354 273845 265957 258977 252972 248050 244260 241351 239037 237460 236906 237096 237221 236764
64231 236764 235913 235125 234751 235167 236753 239314 241848 243300 243493 243105 242806 242668 242383 241780 240992 240144 239013
64214 239013 237137 234339 231099 228211 226043 224240 222254 220075 218292 217451 217534 218149 219011 219979 220690 220659
64198 220659 219955 219452 219972 221432 223305 225769 229704 235447 242242 249269 256740 265552 276228 288655
64184 288655 302570 317744 333738 349762 364739 377380 386485 391428 392173 388686 380809 369067 355108
64171 355108 340700 326566 312729 299648 288204 278664 270464 263141 256808 251519 246784 242060 237384
64158 237384 233269 230236 228582 228223 228632 229188 229698 230317 230975 231341 231473 232095 233934 237071 241094 245649
64142 245649 250523 255408 259826 263349 265862 267649 269147 270458 271218 271085 270097 268321 265476 261429 256860
64127 256860 252830 249771 247514 246192 246291 247681 249476 251286 253930 258372 264428 271050 277513 283897 290762
64112 290762 298824 308602 319881 331722 343378 354886 366324 376839 384988 389947 391922 391610 389902
64099 389902 388029 387292 388404 391417 396320 403194 411657 420597 428773 435408 440033 442122 441284 437710 432074
64084 432074 424936 416411 406481 395502 384259 373526 363619 354410 345711 337517 329896 322806 316157
64071 316157 309974 304393 299518 295413 292204 290119 289305 289514 289995 289859 288781 287353 286590 287061 288616 290895
64055 290895 293711 296827 299664 301701 303091 304587 306810 309784 313301 317472 322663 328961 335989 343382
64041 343382 351254 360048 370026 381151 393314 406341 419720 432667 444540 454878 462977 467926
64029 467926 469422 468160 465090 460688 455401 450326 446587 444223 442470 441175 441044 442279 443805 444301 443364
64014 443364 441167 437477 431717 423795 414332 404217 394357 385670 378731 373300 368476 363492 358236 353147
64000 353147 348777 345465 343196 341733 340920 340834 341574 343034 344941 347059 349337 351916 355001 358614 362570
63985 362570 366837 371771 377634 383985 389988 395416 400936 407303 414731 423157 432603 442892 453416 463663
63971 463663 473835 484633 496567 509663 523631 538082 552787 568023 584561 603114 623890
63960 623890 646771 671719 698903 728716 761905 799491 842444 891523 947430 1010789 1082072
63949 1082072 1162092 1252690 1356366 1474969 1609269 1759968 1928289 2114897 2318763 2537755
63939 2537755 2769971 3013755 3266581 3524540 3782659 4035040 4274789 4494625 4688029
63930 4688029 4849979 4977079 5067559 5120863 5136585 5113736 5051332 4949457 4809548 4634435
63920 4634435 4429077 4200927 3958285 3707846 3454249 3201737 2954986 2717932 2492760
63911 2492760 2280856 2084249 1905349 1745438 1603921 1479072 1369204 1273124 1189710 1117296
63901 1117296 1053811 997756 948817 907111 871907 841532 814492 790124 768050 747625 728208
63890 728208 709581 691730 674474 657570 641001 624969 609750 595659 582965 571807 562349 554932
63878 554932 549727 546376 544479 544420 547123 552835 560764 570162 581129 593964 608258 623214 638523
63865 638523 654417 671086 688527 706712 725359 743596 760343 775084 787972 799209 808605 815730
63853 815730 820215 821882 820755 816943 810436 801204 789603 776365 761875 745727 727499 707829 688140
63840 688140 669158 650156 629881 607901 584859 561733 539292 518069 498314 479755 461704
63829 461704 443757 426334 410251 395740 382233 369273 357277 346990 338341 330368 322372 314682
63817 314682 308085 302840 298583 294872 291511 288499 286021 284403 283758 283693 283647 283436 283171 282719 281658 279872
63801 279872 277858 276246 275232 274616 274119 273435 272204 270293 268077 266110 264423 262389 259479 255992 252774
63786 252774 250296 248246 246091 243752 241535 239614 237930 236600 236025 236385 237241 237854 237884 237574 237270 236951
63770 236951 236306 235247 234203 233824 234253 234780 234436 233086 231710 231412 232232 233174 233263 232319 230776 229212 228187
63753 228187 228105 228868 229876 230636 231218 231840 232319 232418 232564 233560 235521 237702 239614 241672 244333 247156 249386
63736 249386 251174 253444 256583 259926 262605 264392 265595 266702 268341 271042 274673 278418 281691 284806
63722 284806 288500 293107 298509 304574 311151 317735 323624 328440 332220 334950 336284 335855 333762 330620
63708 330620 327097 323414 319403 315137 311248 308311 306046 303667 301041 298950 298029 298047 298582 299860 302354
63693 302354 305946 310087 314521 319233 323878 327942 331458 334939 338538 341807 344369 346305 347697 348265
63679 348265 347777 346514 345106 344058 343559 343530 343753 344083 344624 345541 346710 347769 348544 349258 350322 352043 354405
63662 354405 356857 358408 358258 356382 353282 349279 344295 338277 331474 324349 317548 311843 307649 304563
63648 304563 301720 298667 295586 292778 290418 288814 288346 288922 289952 291095 292618 294790 297327 299781 302248
63633 302248 305300 309345 314271 319645 325095 330557 336278 342554 349454 356851 364581 372447 380271 388266
63619 388266 397231 407981 420602 434560 449433 465192 481960 500118 520559 544161 570903 600113
63607 600113 631716 666488 704724 745229 785821 824182 857829 884197 901722 910707 912609 908873
63595 908873 901009 891269 882111 874729 868658 862829 856416 848578 838083 823785 805367 783357 758552
63582 758552 731635 703376 674998 648047 623692 602208 583343 567104 553801 543313 534876 527963
63570 527963 522986 520674 521021 523349 527224 532676 539439 546596 553346 559898 567199 575785 585113 594179
63556 594179 602625 611091 620531 631536 644518 660205 679437 702529 729281 759745 794615 834793
63544 834793 880754 931972 985976 1037608 1080159 1108377 1120748 1119092 1106713 1087429 1065512 1045030
63532 1045030 1028578 1016818 1009166 1004456 1000994 996653 989349 977421 959682 935552 905354 870295
63520 870295 832036 792303 752681 714363 677972 643808 612252 583717 558267 535619 515557
63509 515557 498058 482940 469680 457811 447404 438968 432786 428356 424539 420355 415673 411039 406937
63496 406937 403495 400911 399660 399890 400839 401254 400385 398372 395814 393273 391118 389505 388456 388126 388934 391256
63480 391256 395032 399830 405218 410907 416686 422392 427831 432576 436044 438004 438791 438703 437396 434291 429444
63465 429444 423596 417472 411434 405777 400771 396291 391885 387513 383870 381657 380718 380211 379580 379105 379435
63450 379435 380771 382670 384680 387026 390421 395217 401046 407459 414637 423109 432992 443956 455953 469577
63436 469577 485623 504691 527464 554973 587943 625530 664750 701347 731483 753034 765888
63425 765888 771595 772801 772488 773070 775964 782131 792855 809600 833089 862916 898138 937800 980712
63412 980712 1025105 1068713 1108842 1142271 1165878 1178144 1180038 1174164 1163317 1149942 1136223 1123685
63400 1123685 1112751 1103140 1094438 1085594 1074116 1056812 1031848 999872 963154 924086 884457 845394
63388 845394 807531 771391 737672 706890 678858 653049 629532 608976 591639 577018 564786
63377 564786 555430 549473 546633 546344 548648 553764 560969 568835 576785 585705 596591 609182 622489 636356
63363 636356 651797 669796 690399 713173 738022 765170 794794 827185 863009 902813 946218
63352 946218 991892 1037989 1082038 1120662 1150482 1169815 1179143 1179909 1173581 1162022 1147749 1132999
63340 1132999 1118869 1105773 1094046 1083416 1072356 1058793 1041257 1018902 991049 957666 920164
63329 920164 880911 841937 804548 769720 738055 709653 684876 665042 651466 643974 641283 642459
63317 642459 646555 650719 650322 641993 625941 604919 581801 558651 536988 517664 500649 485600
63305 485600 472493 461364 451842 443436 435986 429485 423766 418689 414286 410485 407158 404682 403731 404071
63291 404071 404149 402524 399262 395355 391314 387048 382733 378879 375629 372661 369730 366793 363778 360805 358497
63276 358497 357428 357287 357140 356444 355269 353637 351385 348835 346956 346524 347465 349168 351102 352987 354739
63261 354739 356409 357978 359183 359881 360581 362180 365047 368731 372657 376650 380648 384477 388300 392850 398710
63246 398710 405585 412770 420115 427984 436411 445029 454004 464330 476737 490801 505713 521628 539511
63233 539511 559700 581385 603762 626980 651483 676870 702051 726385 750042 773287 795924
63222 795924 817618 838398 858713 879241 900713 923630 947932 973051 998263 1022825 1045786
63211 1045786 1065941 1082064 1093172 1098635 1098252 1092095 1080119 1062059 1038005 1008947 976455 942044
63199 942044 907125 873223 841549 812408 785642 761636 741233 724705 711574 701620 695260 692611
63187 692611 692921 695342 699681 705959 713888 723314 734594 747895 762609 778095 794506 812084 830021
63174 830021 846968 862593 877818 893476 909432 925104 940042 953693 965201 973937 979886 983091
63162 983091 982909 978199 968260 953358 934349 911962 886578 858568 828586 797459 766030 735340
63150 735340 706717 681148 658567 638185 619605 603115 588754 575743 563263 551341 540540
63139 540540 531105 522921 515930 510033 504800 499868 495570 492677 491520 491763 492931 494766 497060 499629
63125 499629 502498 505886 509929 514591 519737 525142 530600 536189 542110 548013 552914 556267 558787 561635
63111 561635 565047 568393 571377 574404 577762 581102 583927 586078 587702 589159 590928 593007 594430 594095
63097 594095 592180 590062 588599 587242 585229 582920 581328 580820 580962 581404 582214 583381 584512 585232 585612 586145
63081 586145 587383 589589 592627 596244 600437 605382 611001 616895 622770 628645 634564 640567 647157 655300
63067 655300 665479 677061 689145 701793 715859 731693 748767 766667 785887 807297 831382
63056 831382 858398 888943 923772 963064 1006291 1052812 1102298 1154521 1209081 1265558 1323718
63045 1323718 1383311 1443697 1503856 1562903 1620601 1677393 1733839 1789931 1845047 1898774 1951729
63034 1951729 2005256 2060164 2115900 2170886 2223233 2270872 2311456 2342707 2362877 2370632 2364766 2344565
63022 2344565 2310390 2263411 2204794 2135700 2058207 1975667 1891726 1809137 1729543 1654014 1583520
63011 1583520 1519154 1462093 1413163 1372368 1339147 1313248 1295014 1284685 1281756 1285232 1294213 1308065
62999 1308065 1326356 1348793 1374889 1403506 1433087 1462554 1491642 1520295 1548302 1575789 1603435
62988 1603435 1631730 1660405 1688882 1716672 1742837 1765649 1783436 1795295 1800412 1797314 1784738 1762884
62976 1762884 1732860 1695205 1649980 1598192 1541976 1483160 1422585 1361095 1300334 1242068 1187356
62965 1187356 1136739 1090625 1049054 1011523 977440 946464 918196 891954 867181 843725 821559
62954 821559 800544 780630 761892 744130 726805 709581 692630 676264 660634 645930 632361
62943 632361 619677 607136 594334 581716 569929 559006 548590 538761 530177 523344 517943 512938
62931 512938 507392 501388 496114 492749 491215 490290 488969 487263 485699 484607 484157 484489 485324 485803 485213 483694
62915 483694 481866 479962 477703 474837 471422 467701 464026 460811 458192 455784 453071 450001 446950 444172
62901 444172 441610 439262 437426 436420 436174 436229 436126 435742 435298 435038 434999 435089 435281 435562 435827 436030 436325 436758
62883 436758 436913 436362 435508 435471 436813 438778 440190 440803 441321 442224 443085 443100 441951 440000 437860 435975 434557
62866 434557 433747 433602 433801 433559 432212 430010 428059 427310 427792 428979 430593 432697 435169 437520 439317 440542
62850 440542 441390 441944 442189 442262 442486 443086 443996 445010 446026 447042 447952 448564 448832 448842 448528 447668 446313 444936
62832 444936 443920 443230 442839 443127 444332 445812 446451 445814 444488 443385 443246 444699 447961 452229 456058 458801
62816 458801 461218 464346 468276 472448 476665 481216 486265 491696 497398 503238 508869 514100 519449 525863
62802 525863 533797 542874 552438 562086 571693 581403 591816 603736 617376 632025 646880 662140 678913
62789 678913 698090 719744 743831 771047 802474 838581 879198 924560 975818 1034195 1100036
62778 1100036 1172968 1252563 1338312 1429299 1524445 1622920 1723692 1824644 1922670 2014670 2098024
62767 2098024 2170142 2228199 2269632 2292763 2297059 2283195 2252827 2207716 2149035 2077945 1996737
62756 1996737 1908678 1816630 1722439 1627768 1534604 1444460 1357772 1274691 1196029 1122934 1056045
62745 1056045 995480 941236 892971 849700 810335 774427 741977 712752 686350 662807 642522
62734 642522 625456 610779 597460 585009 573623 563803 555853 549570 544402 539915 536088 533191 531530
62721 531530 531251 532144 533649 535307 537244 540010 544056 549661 557050 566058 575937 586321 598320 613688
62707 613688 632768 654287 677481 703262 732701 765540 801176 840171 883552 931255 982503
62696 982503 1037319 1096411 1159710 1226174 1294952 1365522 1436522 1505505 1570163 1628944 1680166
62685 1680166 1721402 1750247 1765238 1765847 1752200 1725185 1686333 1637318 1579856 1516054 1448176 1377814
62673 1377814 1305869 1233590 1163012 1095956 1033038 974039 918931 868141 822121 780983 744353
62662 744353 711326 680842 652435 626483 603563 583730 566609 551948 539727 529755 521335 513445
62650 513445 505272 496641 487955 479685 472052 465160 459144 453975 449376 445220 441761 439162 437112 435325
62636 435325 434182 434331 435874 438406 441595 444970 447387 447702 446145 444251 443120 442407 441288 439633 437842
62621 437842 436209 435021 434763 435618 437064 438462 439769 441350 443464 446401 450728 456752 463903 471185 478269
62606 478269 485745 494386 504479 515827 528067 540982 554738 569866 586998 606793 630162 658090
62594 658090 690902 727923 768258 811594 857833 906162 955076 1003242 1049810 1093738 1133277
62583 1133277 1166403 1191561 1207897 1215015 1212697 1200844 1179754 1150586 1115367 1076193 1034381 990641
62571 990641 945917 901533 858365 816418 775650 736947 701770 670879 643857 619892 598606
62560 598606 579876 563263 548136 534331 522225 512014 503229 495225 487904 481597 476313 471591 467195
62547 467195 463530 461011 459263 457390 454993 452528 450576 449214 448380 448434 449754 451793 453223 453313 452808 452974
62531 452974 454097 455450 456600 458058 460451 463707 467557 472443 479254 488264 498887 510653 524004
62518 524004 539868 558694 580189 603932 630024 659068 691563 727356 765727 805987 847840
62507 847840 891024 934672 977206 1016932 1052660 1083711 1109496 1129254 1142168 1147676 1145735 1136996
62495 1136996 1122856 1105229 1085988 1066522 1047902 1031391 1018482 1010271 1007085 1008954 1016285 1029784
62483 1029784 1049885 1076563 1109495 1148007 1191118 1238169 1289219 1343917 1399709 1451809 1495472
62472 1495472 1528204 1549953 1561976 1565653 1561354 1547557 1521603 1482154 1430938 1371707 1307864 1241492
62460 1241492 1174017 1106702 1040412 975716 913559 855499 803099 757267 718052 684796 656609
62449 656609 632958 613758 598760 587180 578213 571481 566598 562726 559125 555831 553329 551900 551812 553580
62435 553580 557173 561324 564525 566528 567978 568808 568107 565550 561862 557579 552316 545531 537230 527641 517027
62420 517027 506162 496152 487392 479373 471845 465415 460564 456823 453430 450131 446831 443183 439127 435262
62406 435262 431972 428711 424859 420894 417950 416422 415722 415299 415331 416381 418780 422358 426577 431010 435771
62391 435771 441142 446664 451103 453691 455016 456257 457936 459863 461944 464485 467865 472360 478140 485044
62377 485044 492542 500258 508336 516963 525882 534865 544390 555289 567791 581408 595748 610960 627337
62364 627337 644883 663496 683551 706231 733223 765780 803994 847207 895201 948601 1007861
62353 1007861 1072208 1139823 1208616 1276445 1340914 1399463 1449683 1489505 1517571 1533860 1539676
62342 1539676 1536658 1525928 1508234 1484240 1454188 1417798 1375183 1327621 1276952 1224650 1172089
62331 1172089 1121252 1074106 1031349 992535 957498 926826 900792 878462 858193 838623 819099
62320 819099 799628 780573 762052 743495 724087 703618 682607 661668 641258 621927 604153
62309 604153 587816 572435 558101 545623 535511 527382 520669 515284 511062 507120 502609 497985 494780
62296 494780 493866 494455 495098 495335 495953 497763 500681 504120 507839 512025 516775 522062 528199 535776 544932
62281 544932 555068 565580 576516 588184 600492 613076 625828 638756 651542 663719 675281
62270 675281 686642 698053 709478 721091 733372 746556 760391 774731 790168 807879 828951
62259 828951 853925 882920 916125 954215 998141 1048434 1104769 1166230 1231601 1299021 1365566
62248 1365566 1427690 1482190 1526744 1559927 1581361 1591833 1592703 1584953 1568932 1544782 1512576 1472088
62236 1472088 1423134 1366535 1304454 1239560 1174091 1109739 1047910 989663 935581 885984 841159
62225 841159 801231 765969 734883 707428 683070 661453 642658 627028 614513 604339 595531 587636
62213 587636 580693 574650 569139 563804 558604 553659 549023 544806 541441 539507 539116 539553 539805 539495 539195
62198 539195 539864 542251 546795 553596 562020 570676 578415 585448 593124 602482 613310 624692 636084 647585
62184 647585 659404 671472 683648 696105 709253 723129 736912 749208 759027 766469 772498 778216
62172 778216 784460 791884 801146 812994 828294 847872 872216 901398 935448 974612 1019018 1068115
62160 1068115 1120515 1174185 1226573 1274793 1316203 1349003 1372342 1386165 1391283 1389334 1382102 1370538
62148 1370538 1354505 1333347 1306498 1273822 1235907 1194240 1150806 1107398 1065356 1025808 989721
62137 989721 957607 929428 904882 883599 865188 849408 836369 826252 818726 812876 807764 802894
62125 802894 798176 793776 790097 787642 786713 787420 790006 794950 802519 812253 822849 832495 839484 842896
62111 842896 842875 840262 836066 831328 827109 824078 822024 820009 816921 811655 803157 791084 776662 762319
62097 762319 750183 741113 735165 732324 732412 734755 738533 743318 748959 755164 761632 768489 776125 784556
62083 784556 793326 802137 811324 821558 833247 846390 860857 876695 894191 913809 935993 960779
62071 960779 987499 1015042 1042554 1069844 1097033 1124142 1151330 1179311 1208984 1240572 1273606
62060 1273606 1307799 1343232 1379184 1413308 1442599 1464979 1479583 1485993 1484172 1475136 1460800 1442654
62048 1442654 1420798 1394427 1362872 1326123 1284763 1239746 1192119 1142865 1093045 1043880 996325
62037 996325 950687 907045 865951 828148 793605 761482 731315 703713 679581 659087 641709
62026 641709 626927 614406 603730 594407 586118 578692 571888 565417 559078 552700 546065 539057 531856
62013 531856 524831 518256 512198 506608 501475 496940 493343 491109 490520 491531 493666 496122 498254 500178
61999 500178 502698 506349 510739 515111 519185 523000 526201 528291 529538 530839 532434 533390 532612 529763 524905
61984 524905 517940 509038 499107 489168 479504 469976 460946 453176 446865 441368 435996 430688 425827 421830
61970 421830 418986 417307 416293 415186 413770 412747 413011 414539 416281 417277 417686 418529 420467 423155 425888
61955 425888 428572 431689 435440 439408 443243 447228 451790 456668 461070 464734 468486 473472 480020 487552
61941 487552 495551 504309 514624 527053 541605 557882 575119 592337 608976 625389 642236 659327
61929 659327 675604 690339 703693 715735 725618 732391 736189 737892 737932 736056 732086 726137 718250 708547
61915 708547 697827 687350 677958 669946 663833 660581 660865 664632 671511 681099 692731 705549 719022
61902 719022 732914 746585 758791 768392 774792 777616 776566 771822 764054 753769 741166 726859 712069
61889 712069 697751 684064 671060 659268 649043 639842 630815 621824 613267 605153 596876 587840 577827
61876 577827 566826 554936 542453 529849 517679 506611 497278 489899 484263 480265 478109 477770 478606
61863 478606 479900 481586 484118 487888 493153 500257 509425 520377 532569 545891 560905 578370 598623
61850 598623 621332 645763 671419 698465 727292 757544 787875 816841 843801 868742 891509
61839 891509 911374 927121 937344 941053 938396 930680 919428 905640 890131 874290 859985 848762
61827 848762 841368 838025 838871 843996 853136 865383 879394 893982 908368 921651 932332 938796 940147
61814 940147 936094 926284 910487 889498 864992 838225 809552 779534 749775 722119 697488 675794
61802 675794 656432 638484 621114 604328 588899 575178 562564 550564 539651 530428 522620 515617
61790 515617 509422 504246 499753 495650 492529 490982 490175 488460 485415 482207 479845 478163 476769 475926 475917
61775 475917 476239 476072 475176 473896 472606 471526 470814 470467 470274 470111 470164 470679 471654 472908 474372 476176 478492
61758 478492 481310 484422 487665 491163 495103 499225 502818 505439 507391 509229 510963 512071 512101 510987 508903
61743 508903 506155 503164 500350 497952 496018 494365 492599 490449 488176 486323 484998 483834 482793 482396
61729 482396 482870 483658 484199 484702 485611 486811 487918 489004 490431 492299 494535 497221 500317 503414 506235
61714 506235 508997 511727 513756 514558 514631 514714 514565 513411 511320 509138 507259 505398 503487 501817 500261 498284
61698 498284 495831 493338 490775 487555 483578 479511 475817 472328 469059 466556 464964 463468 461224 458370
61684 458370 455647 453390 451307 448938 445995 442479 438764 435421 432870 431272 430585 430328 429463 427162 423846
61669 423846 420929 419376 418888 418570 417879 416780 415480 414261 413275 412365 411374 410606 410610 411538 413106 415144 417649
61652 417649 420341 422701 424574 426305 428254 430581 433408 436650 439759 442300 444848 448621 454039 460144
61638 460144 465567 469569 472142 473720 474919 476008 476537 475945 474428 472616 470549 467837 464751 462080 459747
61623 459747 456623 452142 447187 442893 439435 436480 434013 431996 429922 427474 425155 423634 422847 422219 421303
61608 421303 419648 416568 411764 405906 400037 394549 389191 383786 378492 373489 368811 364415 360217 356232
61594 356232 352713 349855 347364 344808 342313 340307 338492 335998 332791 330038 328570 327779 326577 324667
61580 324667 322241 319258 315883 312966 311121 309812 308276 306892 306642 307517 308527 309155 309773 310598 311184 311229
61564 311229 311078 311162 311498 312034 312975 314454 316178 317640 318513 318857 319142 320021 321758 323871 325567 326489 326876
61547 326876 327201 327931 329397 331456 333373 334488 334992 335688 336988 338504 339689 340574 341750 343694 346181
61532 346181 348355 349570 350176 351205 353153 355394 357045 358029 358811 359356 358876 356716 353199 349504 346727
61517 346727 345019 343618 341884 340179 339357 339449 339524 339031 338535 338686 339170 339338 339333 339705 340180 339785 338232 336452
61499 336452 335499 335449 335601 335385 334885 334643 335083 336056 337021 337716 338414 339380 340432 341341 342297 343493 344539 344827
61481 344827 344448 344226 344919 346698 349329 352368 355214 357466 359316 361294 363559 365679 367077 367482 367006
61466 367006 366110 365472 365602 366542 367924 369188 369662 368847 367012 365218 364367 364339 364419 364331 364441 365066 366016 366804
61448 366804 366999 366460 365510 364777 364601 364759 364927 365135 365440 365580 365413 365398 366079 367332 368691 370142 371962 373931
61430 373931 375489 376630 377860 379211 380049 380118 380047 380475 381194 381674 382021 382926 384801 387347 389978 392418 394820
61413 394820 397397 399984 402116 403531 404407 404984 405226 405086 404814 404534 403733 401750 398758 395761 393567 392171
61397 392171 391221 390562 390179 390054 390289 391007 391946 392532 392596 392660 393195 393895 394035 393403 392505 391903 391681 391655 391788 392245
61377 392245 393078 394137 395317 396782 398727 400968 403006 404632 406277 408599 411791 415435 418889 421676
61363 421676 423643 425001 426280 428064 430646 433855 437214 440286 442986 445533 448127 450900 454346 459358
61349 459358 466324 474346 482001 488879 495624 502374 508090 511911 514369 516557 518693 520324 521564 523183
61335 523183 525472 527778 529251 529562 528860 527488 525744 523542 520355 515868 510614 505576 501182 497079 492812
61320 492812 488381 484167 480712 478503 477686 478064 479537 482256 486046 490134 494044 498448 504468 512315 521311
61305 521311 531176 542470 555672 570460 586037 601510 615688 627079 634553 637925 637849 635477 632120
61292 632120 628683 625100 620618 614744 607746 600198 592451 584623 576804 569109 561687 554741 548431 542838
61278 542838 538214 535032 533506 533197 533486 534235 535685 537928 540975 545054 550131 555227 558966 561007 562386
61263 562386 564355 567377 571378 576362 582425 589575 597800 607069 617075 627181 636612 644481 649777 651912
61249 651912 651435 649750 647934 646083 643867 641242 638390 635332 631875 627837 623200 618168 613051 607944
61235 607944 602668 597246 592176 587858 583993 580104 576454 573839 572498 572013 572404 574560 579176 585717 592806
61220 592806 599316 604805 609295 613059 616507 620071 624160 629172 635240 641964 648623 654668 659802 663705
61206 663705 666124 667318 668056 669082 670774 673233 676397 680091 684353 689675 696658 705559 716545 730095
61192 730095 746528 765166 784549 803385 820674 835053 845076 850607 853290 855086 856699 857678 857612
61179 857612 856669 855258 853645 851928 850078 847903 844998 840824 835102 828173 820679 812656 803380 792569
61165 792569 781301 770970 761565 751726 740460 727967 714792 701135 687328 674176 662238 651261
61153 651261 640861 631458 624099 619508 617599 617783 619512 622465 626182 629506 630821 629218 625227 619964
61139 619964 613812 606471 598130 589869 582879 577765 574591 573065 572712 573360 575345 578788 582924 586871 590852
61124 590852 595952 602805 611294 621338 633056 646226 660548 676460 694787 715548 738105 762376
61112 762376 788668 816159 842933 868007 892182 916389 940367 963611 986354 1008637 1029295
61101 1029295 1046952 1061422 1073194 1082034 1087003 1087584 1084012 1076661 1065771 1051689 1034974 1016298
61089 1016298 996406 975889 954869 933248 911353 889894 869264 849416 830480 812816 796420
61078 796420 781019 766883 754701 744562 735869 728439 722670 718463 715102 712582 711907 713499 716385
61065 716385 719613 723470 728591 734798 741576 748897 756909 765604 775446 787403 801630 816961 832443
61052 832443 848500 865886 884449 903846 924685 947969 974008 1002570 1033414 1066024 1099670
61041 1099670 1134458 1171449 1211041 1252219 1294156 1337466 1382987 1430548 1480039 1532542 1589085
61030 1589085 1649337 1712863 1780699 1854083 1932333 2013426 2096102 2180163 2265490 2352316 2442026
61019 2442026 2536438 2636682 2743513 2857477 2977470 3100234 3222845 3344894 3467601 3593097
61009 3593097 3726881 3879407 4062986 4288706 4568499 4917705 5352837 5891223 6560031
61000 6560031 7405401 8487833 9869762 11607338 13728661 16168444 18688915 20889009
60992 20889009 22364812 22932747 22732729 22126305 21497512 21126499 21174890 21681800 22505098
60983 22505098 23289601 23580076 23050058 21669455 19676776 17406196 15129405 13006512
60975 13006512 11114211 9480147 8099547 6948155 5996339 5215507 4577189 4054252 3624988
60966 3624988 3273075 2983554 2741772 2536053 2358485 2202779 2063608 1938010 1824982
60957 1824982 1723134 1630404 1546136 1471494 1407295 1352797 1306728 1267872 1234176 1202740 1171452
60946 1171452 1139863 1108253 1076824 1046068 1016883 989739 964367 940441 917910 896457 875351
60935 875351 854065 832575 811030 789770 769591 751233 734521 718695 703641 690044 678217
60924 678217 667576 657580 648535 641087 635376 631012 627475 624290 621151 618095 615308 612697 610040 607589
60910 607589 606047 605727 606163 606795 607690 609250 611410 613589 615449 617381 619981 623097 625707 626910 626864 626432
60894 626432 626034 625269 623563 620611 616111 609817 602192 594376 586911 578984 569511 558548 546967 535195
60880 535195 523142 511161 500118 490395 481562 473176 465261 457825 450644 443890 438344 434524 431958
60867 431958 429843 428150 427507 428090 429217 430252 431577 434292 439027 445268 451847 457796 462594 465936 467793
60852 467793 468721 469681 471345 473824 477121 481444 486746 492331 497341 501543 505320 508973 512382 515289 517498
60837 517498 518754 518663 516897 513422 508527 502808 497134 492386 489028 486845 485148 483277 481005 478538 476171
60822 476171 474014 472025 470100 467965 465188 461634 457785 454248 450950 447210 442661 437688 432783 427837
60808 427837 422330 415976 408967 401863 395463 390442 386704 383315 379426 375225 371640 369199 367566 366233
60794 366233 365223 364838 364917 364776 363948 362739 361806 361383 361220 361185 361524 362453 363917 365967 368873 372473 375859
60777 375859 378278 380105 382402 385733 389946 394800 399997 404751 408290 410957 413913 417491 420637 422365
60763 422365 423003 423438 423758 423350 421950 419894 417524 414883 411918 408590 404846 400810 396874 393345 390133
60748 390133 387037 384189 382020 380904 380961 382054 383789 385704 387502 388847 388926 386695 381923 375687 369519
60733 369519 364186 359518 355152 351130 347812 345443 343846 342523 341099 339537 337860 336001 334231 333372
60719 333372 333948 335314 336315 336724 337303 338451 339707 340737 341884 343353 344710 345690 346813 348669 351188
60704 351188 354113 357553 361484 365328 368702 372161 376523 381843 387533 393102 398192 402339 405322 407420
60690 407420 408783 408984 407780 405872 404180 402753 401130 399477 398493 398300 398160 397344 395679 393352 390755
60675 390755 388548 387363 387307 388060 389295 390655 391589 391705 391153 390224 388789 386562 383717 380710 377673 374470
60659 374470 371205 368215 365761 364137 363752 364520 365439 365499 364917 364870 366129 368497 371427 374504 377339 379640
60643 379640 381500 383078 384007 383655 382024 379878 377908 376178 374395 372303 369806 367124 364771 363056 361703
60628 361703 360403 359496 359537 360357 361174 361620 361974 362371 362446 361910 360942 359886 359075 359023 360160 362092 363562 363494
60610 363494 361930 359886 358569 358675 360020 361713 362971 363812 364686 365622 366213 366405 366779 367919 369867 372260
60594 372260 374608 376435 377573 378385 379364 380502 381417 382037 382650 383261 383418 382842 381804 380748 379965 379734 380375
60577 380375 381925 384013 386234 388438 390681 393171 396341 400689 406488 413770 422453 432247 442624 453281
60563 453281 464387 475871 486586 494879 500053 502715 503594 502621 499472 494523 488822 483299 478210 473319
60549 473319 468551 464547 462380 462495 464158 466329 468943 472906 479003 487313 497540 509249 521744 534415
60535 534415 547431 561583 577155 593226 608098 620078 627916 631149 630291 626374 620214 612435 604012
60522 604012 596090 589087 582596 576326 570554 565440 560579 555682 551210 547865 545803 544686 544206 544174 544358
60507 544358 544697 545623 547964 552532 559834 569977 582780 598215 616789 639217 665720 695975 729773
60494 729773 767302 808596 853003 899240 945562 989750 1029474 1062995 1089170 1106560 1113010 1106690
60482 1106690 1087510 1057334 1018923 974887 927431 878609 830475 784757 742393 703541 668252
60471 668252 636937 609926 586776 566466 548243 531920 517476 504803 493863 484633 476828 470005
60459 470005 463899 458342 453023 447833 443267 439861 437255 434525 431431 428577 426252 423928 421225 418551
60445 418551 416356 414393 412205 409836 407610 405744 404582 404635 405808 407032 407252 406412 405065 403476 401694
60430 401694 400054 398851 397796 396525 395474 395503 396641 397870 398255 397758 396865 396040 395767 396558 398511 401063
60414 401063 403504 405607 407518 409231 410519 411405 412375 413948 416142 418499 420547 422092 423158 424001 425208
60399 425208 427376 430445 433608 436135 438019 439575 440871 442085 444079 447777 452892 457951 461774 464467
60385 464467 466784 469128 471541 474206 477439 481220 485005 488077 490118 491606 493517 496446 500136 504081
60371 504081 508277 512901 517507 521269 523974 526146 528144 529862 531387 533174 535324 537387 539257 541603
60357 541603 545050 549491 554637 560692 568071 576957 587553 600192 614586 629335 642697 653620 661723
60344 661723 666778 668729 667904 664689 659213 651699 642774 633077 622958 612966 604109 597052 591373 586187
60330 586187 581201 576621 572364 568110 563912 560048 556290 551908 546520 540512 534684 529831 526534 524828
60316 524828 524117 523855 524257 526011 529477 534705 542076 552278 565543 581407 599221 618342 637755
60303 637755 656156 672806 687865 701494 712887 720576 723617 722166 716831 707658 693988 675522
60291 675522 653540 630773 609787 591545 575726 562199 551596 544389 539938 536963 534773 533593
60279 533593 533612 534092 533739 531872 528930 525822 523040 520543 518181 515827 513276 510418 507524 504953 502532
60264 502532 499605 495844 491654 487652 484135 481274 479407 478693 478605 478197 476932 475120 473566 472838 472841 473054
60248 473054 473247 473841 475335 477504 479598 481365 483304 485662 487703 488439 487842 486811 486022 485220 483742 481461
60232 481461 479061 477438 476948 477283 478054 479288 481209 483761 486639 489614 492472 494814 496488 498180 500988
60217 500988 505275 510460 516012 522067 528807 535892 542917 549981 557351 564915 572410 579934 587848 596368
60203 596368 605496 615045 624393 632529 638790 643538 647901 652947 659103 665955 672391 677282 680294 681911
60189 681911 682607 682441 681526 680286 678873 676799 673532 669107 663899 658183 652207 646166 639783 632471 624405
60174 624405 616840 610792 605832 600890 595819 591431 588222 585839 583701 581453 578852 575844 572797 570216
60160 570216 568165 566375 564822 563729 563117 562883 563258 564608 566639 568358 569071 569098 569272 569946 570763 571246 571364
60143 571364 571401 571423 571191 570826 571273 573618 577925 583235 588809 594819 601680 609238 617012 624720 632167 638974
60127 638974 644814 649588 653095 655080 656014 657261 659801 663173 666318 669076 672146 675794 679470 682709
60113 682709 685711 688921 692491 696211 699583 701943 702899 702690 701797 700276 697780 694148 689633 684631 679529
60098 679529 674747 670618 667198 664381 662100 660260 658664 657214 656023 655198 654750 654791 655366 655938 655577 654051
60082 654051 652232 650964 650018 648647 646698 644549 642312 639795 637041 634208 631033 626950 621697 615432
60068 615432 608444 601112 593877 586777 579327 571359 563675 557242 551996 547041 541856 536732 532130 528161
60054 528161 524639 521242 517744 514479 512310 511760 512492 514058 516681 520708 525735 531091 536906 543835 551838
60039 551838 559967 567381 573990 580132 586151 592188 597884 602389 605157 606546 607214 607201 606162 604157 601533
60024 601533 598242 593988 588849 583121 576698 569209 560619 551117 540706 529510 518245 507776 498484
60011 498484 490625 484801 481177 478602 475451 471283 466971 463503 461379 460739 461090 461178 460133 458554 457591
59996 457591 457329 457092 456941 457535 458717 459654 460396 461942 464625 467719 470857 474554 479007 483557 487762 491867
59980 491867 495831 498965 500977 502345 503215 502905 501015 498167 495193 492348 489668 487227 484709 481603 478146
59965 478146 475272 473344 471895 470794 470510 470896 471018 470764 471392 473629 476305 477777 477851 477456 477232 477363 478077
59948 478077 479377 480765 481948 483286 484886 485944 485804 485046 484661 484575 483852 482016 479440 476694 474172 472141
59932 472141 470597 469268 468152 467766 468597 470695 474052 478782 484692 491365 499025 508442 519305 529435
59918 529435 536373 539245 538603 535286 530351 525408 521840 519777 518501 517575 516920 516289 515497 515012 515529 517088
59902 517088 519095 520967 522196 522231 521051 519701 519525 520893 523137 525574 528082 530849 534093 537987 542493
59887 542493 547439 552956 559455 566802 573974 580055 585322 590835 597298 604779 613192 622349 631645 640225
59873 640225 647488 653169 657127 659342 660002 659361 657644 655082 651737 647356 641934 636356 631713 627878 623682
59858 623682 618753 614174 610894 608582 606723 605754 606164 607444 609076 611864 617028 624400 632638 640769 648336
59843 648336 654372 657607 657840 656132 653639 651140 649658 650357 653440 657733 661596 663766 663443 660426 655450
59828 655450 649913 644994 641227 638713 637287 636553 636208 636216 636328 635744 633761 630464 626246 621081 614929 608565
59812 608565 603117 598873 595240 591691 588029 583917 579086 574020 569636 566170 563117 560296 558178 556903
59798 556903 555712 553744 550984 548120 545789 544095 542621 540902 539090 537950 537892 538255 538054 537142 536077
59783 536077 535122 534171 533456 533440 533951 534232 533991 533646 533428 533009 532283 531763 531830 532278 533014 534585 537417 540956
59765 540956 544191 546846 549527 552800 556563 560387 564099 567782 571390 574627 577271 579499 581710 584171
59751 584171 587105 591000 596352 602901 609545 615295 620043 624197 627994 631540 635097 638880 642777 646646
59737 646646 650600 654600 658090 660536 662109 663387 664637 665830 667076 668519 670030 671493 673164 675229
59723 675229 677280 678823 680033 681321 682398 682559 681837 681021 680437 679408 677205 673987 670526 667435 664843
59708 664843 662512 660148 657796 655956 655083 655056 655426 655977 656662 657203 657307 657304 658052 660159 663577 667925 672787
59691 672787 677683 682095 685525 687416 687273 685248 682339 679550 677031 674417 671789 669722 668507 667805 666937
59676 666937 665092 661463 655828 648989 642154 635908 630164 624851 620063 615683 611543 607880 605076 602900
59662 602900 600641 598029 595524 593666 592620 592375 592909 594107 595953 598769 602793 607581 612321 616739 621173
59647 621173 625707 629715 632363 633199 632236 629839 626501 622396 617229 610825 603702 596699 590250 584447 579533
59632 579533 575776 573102 571386 570875 571613 572674 572722 571293 568825 565554 561261 556166 551222 547183 543902
59617 543902 540748 537174 532823 527732 522668 518756 516513 515601 515598 516536 518524 521283 524288 527132 529720
59602 529720 532278 535082 537871 539807 540412 540301 540421 540773 540562 539532 538393 537887 538032 538453 538975 539720 540932
59585 540932 542665 544393 545140 544421 542761 540848 538584 535651 532550 530132 528322 526338 524056 522156 520883
59570 520883 519657 518080 516415 514899 513480 512431 512309 512947 513338 512896 512066 511363 510577 509412 508174 507365
59554 507365 507119 507500 508747 510722 512628 513844 514685 515927 517866 520242 522811 525611 528820 532718 537755
59539 537755 544508 553673 566119 582756 603972 628699 653549 673123 682465 680368 670250 657392
59527 657392 645569 636460 630866 628819 628875 629038 628832 629475 631816 635200 638555 641420 643412 643763 642053
59512 642053 638652 633908 627604 619778 611403 603579 596445 589421 582205 575077 568466 562514 556909 551074
59498 551074 544853 539000 534559 531727 529856 528519 527950 528307 529143 529831 530127 530163 530330 531131 532715 534591
59482 534591 536275 538024 540417 543506 547088 551454 556971 563188 569417 575961 583534 591533 598208 602743
59468 602743 605891 608288 609493 609175 607995 606621 604915 602826 601176 600819 601715 603469 606094 609693 614080
59453 614080 619286 625821 633945 643222 653122 663403 673603 682980 691357 699231 706501 711789 713514 711092
59439 711092 704839 695582 684830 674486 665639 658092 651363 645504 640612 636335 632381 628864 625813 622990
59425 622990 620578 619381 619949 622131 625799 631375 639408 650210 663990 680624 699379 719702 742256
59412 742256 768303 798331 832160 869221 906337 935599 947847 940062 917915 890303 863204 839421
59400 839421 821247 810822 809299 817346 834650 856658 873485 875425 860036 832608 800616 769483
59388 769483 742368 720630 703572 689548 678047 669689 664317 660641 657940 656742 657541 660078 664095
59375 664095 669605 676048 682202 687360 691956 696761 701994 707208 711534 714171 715166 715439 715545 714965 713327
59360 713327 711571 710870 710977 710930 710947 712248 715159 718869 723138 728919 736974 746908 757902 769559 781784
59345 781784 794686 808703 824138 840434 856635 872532 888475 904046 917823 928651 936364 941035
59333 941035 942458 940681 936368 930127 921949 911653 899586 886619 873666 861268 849480 838115
59321 838115 827232 817207 808144 799577 791010 782438 774033 765761 757711 750279 743474 736473 728459 719584
59307 719584 710659 702351 695219 689985 687077 686264 687420 691283 698854 710281 724583 739659 751983
59294 751983 757322 753176 740495 722473 702174 681804 663190 647451 634393 623281 614023 606857
59282 606857 601458 597369 594814 594028 594297 594838 596182 599417 604409 610142 616590 624890 635673 648484
59268 648484 662872 678738 695432 711626 726296 738971 749065 756054 760364 762985 764040 762721
59256 762721 758703 752613 745047 736186 726567 717175 708495 700385 693061 687255 683158 680165 677947 676969
59242 676969 677599 679544 682431 686293 691133 696658 702641 709053 715741 722531 729589 736968 743833 748916
59228 748916 751926 753806 755420 756599 756521 754517 750416 744675 738178 731548 724759 717779 711083 704949 698743
59213 698743 691791 684506 677766 671523 665076 658364 651908 645751 639660 634189 630245 627575 624901 621655
59199 621655 618439 615715 613257 611086 609764 609372 609199 608845 608772 609504 611043 613341 616562 620665 625433 630928
59183 630928 637217 643684 649451 654501 659558 664929 670324 675728 681451 687342 692994 698765 705516 713189
59169 713189 720640 727041 732606 737902 743364 749427 756141 762654 768010 772323 776105 778656 778498 775368
59155 775368 770428 764381 756801 747464 736892 725240 712104 697941 684344 672262 661078 649998
59143 649998 639284 629549 620840 612981 605964 599566 593380 587533 582500 578129 573805 569633 566261 563484
59129 563484 560448 557462 556041 556645 557855 558439 558875 560125 562266 565164 569312 575155 582565 591618 602673
59114 602673 615021 626830 637313 647722 659198 670919 681541 691339 701450 711804 721243 729239
59102 729239 736280 742875 749179 755327 761168 765843 768375 768579 767036 764558 762026 760136 758741 756968
59088 756968 754530 752370 751494 751725 752095 751888 750765 748434 744860 740320 734743 727482 718224 707727 697178
59073 697178 687240 678022 669464 661347 653383 645626 638492 632235 626878 622620 619612 617302 614774 611846
59059 611846 609046 606476 603606 600298 596985 593682 589907 585859 582568 580496 578989 577442 575949 574575
59045 574575 573157 572179 572576 574207 575694 576271 576534 576904 576753 575784 574912 574880 575171 575210 575563 577004 579361 582175
59027 582175 585567 589685 594266 599563 606666 616078 626967 638713 652102 667908 685208 702177 717787
59014 717787 731741 743483 752307 757925 760168 758836 754511 748729 742605 736171 729721 724767 722709 723448
59000 723448 726181 730619 736529 743066 749627 756544 763906 770528 775117 777766 779337 780179 780339 780155 779517
58985 779517 777328 772784 766591 760021 753538 747292 742056 738518 736304 734763 734121 734958 737261 740927 746440
58970 746440 754056 763056 772758 783474 795448 807762 819414 830711 842411 854176 865023 874628
58958 874628 883039 889766 894306 896926 897794 895957 890364 881331 869937 856578 841231 824545 807491
58945 807491 790460 773730 758207 744708 733099 723112 715244 709816 705924 702478 699459 697056 694531
58932 694531 691300 688242 686394 685064 682854 679950 677739 676579 675536 674040 672268 670106 667230 664082
58918 664082 661509 659543 657703 656184 655513 655396 655231 655455 657039 659797 662533 664759 667129 670296 674539
58903 674539 680345 688201 697861 708798 721131 735103 749971 764495 778280 791543 803903 814664
58891 814664 824170 833752 844394 856406 870214 886440 905257 926365 949231 972592 994257 1012440
58879 1012440 1026997 1038539 1046931 1051613 1052746 1050897 1046098 1038332 1028363 1016960 1003930 989111 973730
58866 973730 959473 946756 935198 925144 917161 910503 903645 896137 888495 880533 871253 860246 847928
58853 847928 834533 820129 805432 791355 777933 764805 752488 741909 732976 724826 717232 710589
58841 710589 704725 698919 692885 686652 679862 672294 664696 657911 651583 644858 637899 631545 625994 621061
58827 621061 617143 614616 612821 610995 609630 609592 610559 611815 613879 617683 622656 627356 631574 636130 641030
58812 641030 645517 649596 653740 657450 659828 661351 663305 665636 667009 666839 665716 664076 662066 660375
58798 660375 659468 658254 655222 650654 646090 641923 637314 632106 626993 622069 617121 613041 610981 610320 609485
58783 609485 608637 609459 612434 616472 621190 627278 634378 640867 646235 651745 658163 664532 669493 672225 671917
58768 671917 668083 661726 654587 647124 638766 629989 622212 615628 609117 602394 596296 590895 585467 580539
58754 580539 577812 577638 578600 579973 582502 586246 589680 591652 592551 593033 593306 594096 596552 600688 605478 610729
58738 610729 617247 624968 632740 640099 647505 654762 661172 667241 674175 681599 688002 693522 699870 707294
58724 707294 714140 719869 725938 732969 739559 744758 749498 754811 760846 768256 778160 789906 801269 811674
58710 811674 822712 834565 844653 851099 854963 857482 857503 853522 846178 836806 825159 810355 792757
58697 792757 773347 752439 730334 708102 686627 665919 646148 628172 612428 598713 587420
58686 587420 579343 573754 568565 562948 557889 553683 549188 544279 540596 538753 537090 534426 531901 530854
58672 530854 530894 531396 532873 535564 538597 541807 546531 553449 561649 570957 582924 598062 614146 628714
58658 628714 641231 651435 657790 659356 657295 652858 645720 635894 625341 615899 607307 598881 591314
58645 591314 585154 579332 573002 567181 562811 558905 554387 550198 547764 546844 546599 547333 549529 552531 555718
58630 555718 559552 564003 567542 569162 569867 570675 570804 569318 566903 564503 561911 559225 557862 558494 559720
58615 559720 560424 561694 564872 569612 575494 583430 593455 603093 610013 614645 618309 620750 621654 622630 625183
58600 625183 628223 629919 630551 631289 631619 630240 627274 623509 618835 613484 609348 607912 608277 609199 611513
58585 611513 616378 622759 629156 636416 646294 658419 671017 683498 695939 707177 715964 723227 730917
58572 730917 739328 747498 755375 763638 772338 781554 792483 806177 822307 840706 862778 889624 920232
58559 920232 953178 988431 1025581 1062093 1095407 1125017 1150336 1168579 1177428 1178273 1174263 1166741
58547 1166741 1156095 1144274 1133369 1122999 1111999 1101423 1092910 1085153 1074959 1060986 1043759 1023029
58535 1023029 998108 970193 941695 913775 886832 862434 842159 825302 810240 797304 787893
58524 787893 781562 776452 771817 767822 763786 759032 754584 751652 749339 746173 742820 740842 739813 738205
58510 738205 736143 734737 733648 731848 729852 728705 727694 725509 722783 721100 720485 720160 720585 722327 724127
58495 724127 724574 724497 725339 726525 726933 727389 729073 731062 732312 734435 739447 746303 752828 759618 768809 780390
58479 780390 793116 807689 825630 846181 867647 890455 915346 939795 959835 974327 984020 987915
58467 987915 984519 975511 964092 950636 934000 916182 901307 890520 881923 875215 872293 873540 877477
58454 877477 884010 894348 907860 922604 938590 956857 975601 990816 1000531 1005132 1004285 997300 985943
58441 985943 973039 958790 942181 925176 911314 900748 890889 881534 875018 871657 869518 868559 870572
58428 870572 875002 879268 883429 890269 900495 912069 924466 939227 955725 970499 981413 988867
58416 988867 992732 992000 987699 982256 975747 966463 955154 944771 936062 927396 918797 911984 906519 900245
58402 900245 893553 888897 886173 883016 879652 878864 881029 883804 886847 892138 899417 906112 912101 919686
58388 919686 928429 934925 938314 941271 944957 947812 949930 953701 959241 963889 966960 970381 974001 975185
58374 975185 973844 973168 974620 976833 979961 986163 995122 1004026 1012699 1023827 1037523 1050811 1063101
58361 1063101 1077032 1093180 1109213 1124937 1142748 1162254 1179868 1194558 1208606 1221987 1231655
58350 1231655 1237257 1241853 1246132 1247713 1247080 1248211 1252220 1256291 1259842 1265650 1273873 1281329 1287903 1297336
58336 1297336 1310438 1323957 1337353 1353971 1374171 1394165 1413144 1434502 1458331 1479888 1497464
58325 1497464 1514608 1532547 1547685 1558756 1569075 1579449 1586344 1589605 1594354 1602500 1609878 1614582
58313 1614582 1620408 1629120 1637198 1643566 1652731 1666685 1681329 1694495 1709822 1729053 1748323 1765964
58301 1765964 1786253 1811281 1836688 1859556 1882999 1908985 1934221 1957192 1981562 2008578 2033999
58290 2033999 2056568 2081413 2110922 2140523 2167780 2197126 2231042 2265184 2297007 2330598 2368118
58279 2368118 2405251 2440069 2477454 2519643 2561445 2600060 2640381 2685276 2730178 2772879 2818885
58268 2818885 2871203 2924783 2977111 3034083 3098942 3165821 3231038 3300343 3377853 3458326 3537692
58257 3537692 3620631 3710085 3799913 3885625 3971754 4061032 4147501 4228322 4310909 4400282 4491160
58246 4491160 4580834 4677330 4785844 4899831 5014863 5138208 5274991 5418405 5563971 5719673
58236 5719673 5891189 6071237 6254738 6450012 6663244 6886836 7115432 7358098 7621991
58227 7621991 7899999 8187752 8496113 8832976 9190234 9563450 9966047 10408413 10882203
58218 10882203 11381907 11921912 12514746 13153762 13836409 14582559 15409647 16312991 17292458
58209 17292458 18374407 19584837 20927542 22413894 24086426 25986664 28130583 30546061
58201 30546061 33304169 36486135 40161197 44438036 49504430 55584047 62904714 71757565
58193 71757565 82547477 95763774 112001322 132093876 157139054 188248248 226175997
58186 226175997 270877081 320659935 371051714 414675478 443425190 452097656 440689904
58179 440689904 413541577 376491364 334639822 291813744 250833335 213579257 180935377
58172 180935377 153015923 129547605 110070984 93997986 80725847 69757701 60690731
58165 60690731 53150622 46813449 41457298 36927513 33072082 29753681 26890030 24428123
58157 24428123 22296461 20420972 18764355 17309223 16019985 14855464 13800958 12854750
58149 12854750 11998390 11209629 10488862 9844091 9263220 8726901 8234936 7795099 7398716
58140 7398716 7030872 6692288 6388202 6107124 5832642 5566016 5316887 5082156 4853723
58131 4853723 4636765 4440571 4260211 4085610 3919860 3770900 3633890 3499289 3370092
58122 3370092 3254101 3147052 3040061 2936328 2844197 2760623 2677263 2596264 2524659 2459436
58112 2459436 2393275 2329102 2274185 2225285 2174005 2121688 2075093 2032271 1986469 1939496 1897895
58101 1897895 1859954 1819303 1777334 1739664 1704286 1665451 1625523 1590975 1560264 1527341 1493668
58090 1493668 1465161 1440585 1414466 1388502 1368765 1354205 1338821 1322676 1310123 1299498 1285141
58079 1285141 1267651 1252073 1237892 1220521 1200761 1183245 1167355 1148906 1128983 1112093 1097413
58068 1097413 1080677 1062852 1048285 1036236 1022893 1009664 1000759 994475 985725 975444 968741 965231
58056 965231 959837 951755 944125 936139 924129 909603 897854 889270 879869 869571 862011 856944 850689
58043 850689 843547 839098 836621 831739 824221 817917 813371 807644 801007 796695 794286 790202 784357 779557
58029 779557 774877 766601 755391 745639 737966 729108 718949 710760 704583 697177 688639 682374 678318 672791
58015 672791 665368 659428 655506 650560 644400 640530 639791 639135 637556 637497 639545 641243 641921 643428 645474
58000 645474 645498 643702 643112 644229 644741 644752 646906 650845 652870 651777 650022 648576 645653 641119 637246 634511
57984 634511 631371 628495 628324 630093 630219 628072 626485 626205 624855 621864 619408 617881 615341 612100 610907
57969 610907 611877 612100 610998 611240 613537 615374 615850 617069 619673 621620 622446 624319 627750 630485 631609
57954 631609 632582 633445 632245 629078 626491 625076 622845 619568 617356 616326 614241 611300 610673 613274 616460
57939 616460 619033 623060 629523 636618 643744 652912 664725 676947 688322 699817 710946 719047 723507
57926 723507 726634 729084 728560 724348 718918 713572 706685 697825 689390 682396 674711 665368 656710 650230
57912 650230 644050 636629 629474 624165 620071 616923 616293 618524 621310 623149 625141 627783 629277 628807 628261
57897 628261 628870 629262 628679 629045 631893 636143 640747 646642 654251 661765 667755 672979 678134 682461 685992
57882 685992 690359 695900 700728 704034 707485 711935 715669 717414 718190 718773 718212 716340 714782 714013 712315
57867 712315 709159 706577 705614 704462 701748 698694 696426 694204 692012 691798 694260 697411 700119 703995 709869
57852 709869 715615 719661 723574 728744 733436 735710 736684 738309 740249 741420 742407 743938 745030 744892 744792
57837 744792 745980 747686 749031 750792 753446 755671 756755 758282 761453 764953 767449 769982 773783 777890
57823 777890 781096 784172 787950 791142 792324 792353 792795 793630 794397 795810 798284 800468 800910 799477 795788 788462
57807 788462 777710 766500 757245 749313 741513 734713 729951 726236 722525 719921 719613 720491 720929 721176 721902
57792 721902 722271 721638 721412 723043 725762 728297 731095 734863 738765 742193 746521 752944 760320 767297 774766
57777 774766 783909 793608 802173 810133 818896 828073 836373 843730 850385 855295 857727 859039 860730 862102
57763 862102 861997 861320 861525 862012 861469 860587 861114 863201 865859 868977 872820 876601 879584 882590 886555 890748
57747 890748 894266 897992 903145 909095 914462 919064 922973 925220 925421 925222 926079 927130 927257 927502 929109
57732 929109 930865 930998 930293 930657 931966 932992 934220 936917 940382 942870 944485 946582 949093 951031 952911
57717 952911 956111 960339 964062 966890 969455 971769 973893 977314 983160 989843 994896 998396 1002155 1006337
57703 1006337 1009556 1011785 1014416 1017770 1021055 1024578 1029489 1035464 1040894 1045263 1049240 1052641 1054447 1054705
57689 1054705 1054413 1053817 1052732 1052123 1053261 1055649 1057809 1059738 1062543 1066137 1069582 1073393 1079204 1087309 1096688
57674 1096688 1107403 1120967 1138445 1160208 1187419 1221772 1263897 1313860 1372624 1440291 1512225
57663 1512225 1578588 1628239 1652730 1648452 1618209 1570970 1517462 1464758 1415556 1371375 1333898
57652 1333898 1303389 1278514 1258405 1243244 1232649 1225287 1220332 1217732 1216995 1217267 1218567 1221414 1225392
57639 1225392 1229638 1234432 1240591 1247556 1253892 1259428 1265153 1271194 1276739 1281733 1286799 1291773 1296189 1300873
57625 1300873 1306978 1313672 1318947 1322639 1326518 1331431 1336581 1341611 1347069 1352597 1356980 1360457 1364785 1370443
57611 1370443 1375804 1379733 1383109 1387035 1391286 1395338 1399432 1403886 1408565 1413569 1419264 1425378 1431269 1437182
57597 1437182 1443872 1450954 1457184 1462538 1468396 1475327 1482235 1488127 1493342 1498602 1504117 1510049 1516714 1523980
57583 1523980 1531343 1538682 1546095 1553253 1559972 1567036 1575268 1584160 1592712 1601043 1609691 1617920 1624537 1630028
57569 1630028 1636020 1642870 1649620 1656113 1663240 1671195 1679341 1687733 1696965 1706597 1715551 1723963 1732797 1741877
57555 1741877 1750343 1758846 1769071 1781065 1793267 1805276 1818246 1832290 1845809 1857869 1869070 1879577
57543 1879577 1888491 1895884 1903444 1912373 1922324 1932923 1944532 1956975 1969314 1981380 1993796 2006197
57531 2006197 2017316 2027238 2037523 2048640 2059329 2069064 2078977 2089628 2099978 2109509 2119411 2130619
57519 2130619 2142461 2154186 2166179 2178664 2190838 2202330 2214101 2227002 2240705 2254694 2268944
57508 2268944 2283092 2296455 2309340 2322804 2336751 2349958 2362400 2375572 2389990 2404334 2417780
57497 2417780 2431129 2444781 2457670 2469342 2481179 2494287 2507832 2520716 2533418 2546964 2561358
57486 2561358 2576089 2591005 2605899 2620439 2635133 2650935 2667489 2683378 2698564 2714629 2731974
57475 2731974 2748872 2764229 2779163 2794791 2810491 2825590 2840813 2856687 2872400 2887664 2903876
57464 2903876 2921860 2940153 2957172 2973487 2990365 3007524 3024118 3040621 3058024 3076247 3094838
57453 3094838 3114129 3134216 3153936 3172358 3190328 3209108 3228474 3247490 3266199 3285173 3304291
57442 3304291 3323241 3342440 3362310 3382543 3402966 3424093 3445906 3467350 3488129 3509646 3532928
57431 3532928 3556842 3579705 3601522 3623337 3645478 3667752 3690333 3713184 3735531 3757006 3778340
57420 3778340 3800027 3821566 3842927 3865267 3889012 3912793 3935592 3958417 3982371 4006677 4030282
57409 4030282 4053892 4078518 4103374 4127296 4151074 4176229 4202311 4227476 4251152 4274304 4297659
57398 4297659 4321399 4346007 4371704 4397538 4422644 4447849 4474531 4502474 4530403 4558030 4586032
57387 4586032 4614550 4643279 4672559 4702932 4734028 4765206 4796667 4828642 4860180 4890229 4919284
57376 4919284 4948549 4978128 5007457 5036741 5066380 5095627 5123458 5150272 5177261 5204649 5232068
57365 5232068 5259993 5289175 5319198 5349218 5379590 5411098 5443112 5474261 5504554 5535179 5566463
57354 5566463 5597709 5628779 5660259 5692253 5724528 5757572 5792039 5827404 5862674 5898094 5934532
57343 5934532 5971459 6007158 6040896 6073371 6105153 6136276 6167294 6199191 6232041 6265008 6297722
57332 6297722 6330513 6363398 6396027 6428490 6461055 6493397 6525257 6557490 6591073 6625371 6658783
57321 6658783 6690880 6722515 6754059 6785063 6815554 6846250 6877435 6908871 6940744 6973457 7006606
57310 7006606 7039318 7071425 7103139 7133963 7163336 7192077 7221702 7252424 7283165 7313309 7343018
57299 7343018 7372058 7399961 7427327 7455447 7484515 7513554 7542129 7570757 7599578 7628016 7655966
57288 7655966 7684089 7712797 7741921 7771260 7800383 7828252 7854330 7879815 7906376 7933897 7960886
57277 7960886 7986781 8012278 8037590 8062146 8086066 8110260 8134939 8159507 8184014 8209098 8234409
57266 8234409 8258771 8282116 8305637 8329751 8353498 8376240 8398357 8419892 8440116 8458911 8477022
57255 8477022 8494443 8510105 8523771 8536811 8550390 8564175 8577437 8590056 8601720 8611443 8618873 8625158
57243 8625158 8631754 8639113 8647093 8655747 8665118 8674958 8685172 8695898 8706914 8717773 8728740 8740729
57231 8740729 8754061 8768151 8782586 8797585 8813187 8828969 8844802 8860926 8877028 8892218 8906160
57220 8906160 8919269 8931504 8941960 8950048 8956273 8961553 8966454 8971160 8975391 8978190 8978622 8976766 8973415
57207 8973415 8968974 8963433 8957047 8949956 8941474 8930979 8919263 8907753 8896602 8884928 8872659 8860558
57195 8860558 8848549 8835758 8822278 8809164 8796494 8783212 8769188 8755543 8742308 8727589 8709960
57184 8709960 8690323 8670520 8651297 8632367 8613262 8593283 8571590 8548066 8523404 8498051 8471939
57173 8471939 8445282 8418458 8390964 8361861 8331414 8300816 8270133 8238097 8204150 8168853 8131831
57162 8131831 8091255 8046185 7997647 7946480 7891882 7833116 7771024 7706584 7639471 7569332 7497229
57151 7497229 7424584 7351919 7279854 7210085 7143949 7081068 7020779 6964069 6912738 6867224 6826387
57140 6826387 6788832 6753490 6719603 6687057 6656046 6625520 6592677 6554798 6510871 6460775 6404042
57129 6404042 6340544 6271597 6199287 6125416 6051995 5981894 5917747 5860665 5810842 5768636 5733958
57118 5733958 5705169 5679636 5655077 5629783 5602379 5572466 5541228 5510862 5483965 5463908 5454760
57107 5454760 5459832 5480733 5518372 5574015 5648910 5744355 5863589 6013317 6202857 6442998 6746730
57096 6746730 7130031 7610751 8207653 8941711 9837054 10918415 12207237 13720330 15469974
57087 15469974 17461444 19687843 22125262 24729870 27438377 30176324 32874614 35481184
57079 35481184 37949682 40205672 42118603 43512180 44216600 44130314 43251486 41665556 39507585
57070 39507585 36927274 34069562 31066604 28033583 25066173 22239872 19609919 17211270
57062 17211270 15060074 13157264 11492512 10047448 8799098 7723568 6798125 6001450
57054 6001450 5314155 4720102 4206450 3762071 3376775 3042172 2751763 2499442 2278977
57045 2278977 2085460 1915947 1767861 1637797 1522552 1420207 1329412 1248650 1176871 1113696
57035 1113696 1058333 1009444 966608 930581 901554 878822 862988 856818 863030 882856 916983 964001
57023 964001 1014929 1051858 1056976 1024324 961736 882522 797527 713674 635459 565361 504047 451400
57011 451400 406963 369502 337346 309464 285493 264908 247153 232327 220647 211473 203795 197343
56999 197343 192121 187332 182048 176623 172177 168923 166259 164184 163240 163285 163796 165326 169250 175965 184657
56984 184657 195029 207871 223522 240639 256700 268877 274532 272152 262359 247474 229931 211596
56972 211596 194185 179204 167226 157820 150267 143989 138767 135199 134517 137189 142305 149211 158994 173151
56958 173151 191547 213147 238033 266462 295662 319521 332410 332598 321899 303560 281122 257904
56946 257904 236135 216542 199150 184194 172112 163093 156913 153083 151351 152297 157115 166412 179698
56933 179698 196633 218244 246090 280352 319022 358035 391414 412414 416633 404589 380781 350439
56921 350439 317667 285537 256066 229765 206299 185759 168653 154920 143902 135039 127803 121357
56909 121357 115278 110221 106793 104224 101405 98784 97784 98518 99597 100245 101192 103243 106254 109853 114081
56894 114081 119023 124676 131382 139611 149364 160644 174392 191936 213456 237813 263620 289295
56882 289295 312110 328470 335610 332644 320471 301706 280330 259885 241732 225850 212921 204384
56870 204384 200678 200970 204736 212331 223958 239488 259601 285893 319571 361126 411389 471295
56858 471295 539580 610935 676537 726191 751294 748305 720673 676822 625642 573591 524758 481695
56846 481695 445716 417452 397473 385894 381902 384811 395337 414773 443514 481812 531552 595604
56834 595604 675577 771338 881308 999739 1112983 1201545 1248666 1247794 1203200 1126168 1030999
56823 1030999 931248 836138 749652 673022 607227 552987 510077 477895 456077 444037 440826
56812 440826 446161 460989 486728 524629 575889 641116 718773 803988 888112 958731 1001914 1008030
56800 1008030 977208 918553 843963 763293 683820 610588 545709 489041 440720 401796 372136
56789 372136 349728 333022 322346 318242 320193 328078 343226 366856 398656 437567 481915 527301
56777 527301 565849 589474 593758 578643 547258 505189 458966 413163 369332 328325 292091 262051
56765 262051 237203 215522 196266 179629 165234 152471 141464 132318 124208 116472 109783 104986
56753 104986 101561 98453 95607 93410 91417 88982 86522 84894 84039 83339 82742 82455 82144 81505 81036 81229
56737 81229 81588 81445 81113 81266 81829 82372 82867 83177 82635 81276 80626 82055 84903 87398 88853 89919 91244
56720 91244 92963 94996 96873 97793 97696 97678 98509 99566 100096 100605 101842 103293 103992 104128 104587 105461 106262 107060
56702 107060 108157 109125 109371 109252 109476 109797 109411 108327 107264 106484 105710 104882 104197 103758 103855 105037 107197
56685 107197 109256 110539 111654 113189 114582 115415 116823 120152 124849 129069 131866 133509 134278 134368 134582
56670 134582 135675 137159 137897 137648 136991 136139 134988 134056 134221 135656 137863 140445 143034 144965 145981 146760
56654 146760 147880 148840 149017 148861 149060 149214 148506 147094 145617 143989 141960 140324 140158 141198 142205 142612
56638 142612 142727 142718 142503 142200 141699 140369 138233 136684 136828 137824 138138 137674 137322 137189 136895 136834 137435 137752 136611
56619 136611 134701 133656 133414 132420 130282 128277 127105 126038 124604 123453 123095 123113 123022 122786 122300 121448 120747
56602 120747 120805 121200 121027 120450 120516 121510 122739 123886 125250 126635 127311 127261 127378 128292 129886 131881 133919
56585 133919 135283 135556 135402 135801 136816 138044 139627 141659 143271 143742 143949 145227 147296 148929 150082
56570 150082 151616 153384 154593 155785 158433 162604 167038 171588 177620 185796 195476 206589 220142 236200
56556 236200 252909 268013 279949 287399 289643 287914 284867 282069 279221 275916 272618 269622 266655
56543 266655 263828 261453 258784 254685 249761 245955 243642 241109 237476 234053 231899 230053 227347 224306
56529 224306 221897 219811 217365 214970 213406 212493 211624 210932 210950 211675 212609 213179 212620 210214 206216 201929
56513 201929 198408 195630 193009 189964 186020 181342 177222 174895 173801 172216 169650 167275 165884 164912
56499 164912 163850 163076 162793 162446 161722 160932 160029 158563 156958 156436 157192 158068 158470 159177 160683 162300 163578
56482 163578 165128 167245 169088 170075 170777 171569 171671 170537 169039 168299 168286 168429 168710 169335 170198 171417 173551
56465 173551 176570 179389 181025 181515 181291 180548 179648 179180 179216 179359 179729 180807 182124 182408 181478 180657 180859
56448 180859 181542 182069 182798 184161 185850 187571 189490 191346 192245 191925 191156 190460 189565 188520 188098 188529 189063
56431 189063 189211 189299 189358 188833 187801 187108 186897 186357 185412 185130 185950 187001 187780 188961 190814 192385 193012 193300
56413 193300 193876 194527 195211 196440 198020 198869 198799 198942 199766 200242 199743 199149 199233 199497 199470 199605 200068 200153 199696
56394 199696 199516 199734 199383 198461 198466 199897 201100 200779 199903 199892 200615 201381 202278 203244 203449 202878 202994 204586 206544
56375 206544 207908 209389 211616 213685 214888 216137 218174 220096 221233 222774 225794 229203 231416 232609
56361 232609 233676 234413 234504 234892 236387 238183 239441 241005 243883 247280 249892 251846 253703 254872 254819 254543
56345 254543 255063 255688 255571 255669 257188 259292 260428 260918 262178 264273 266244 268192 271125 275243 279959 285040
56329 285040 290288 294792 297856 300011 301980 303571 304651 306020 308143 310176 311426 312438 313536 313841
56315 313841 312988 312161 312070 311636 310150 308854 308748 308839 308346 308611 310749 313390 315062 316928 320696 325650 330301
56298 330301 335277 341757 348538 353602 357404 361881 367239 372342 377178 382266 386752 389765 392708 397520
56284 397520 403680 409541 415502 423029 431472 438842 445052 451638 458922 466260 474383 484618 496203 507072
56270 507072 516954 527310 538776 551126 565025 581227 598589 615476 632580 651908 673716 696986
56258 696986 722186 750886 783311 818903 858641 904223 955745 1012864 1077348 1151510 1234893
56247 1234893 1325403 1422925 1528730 1642054 1760483 1883084 2009745 2137790 2262541 2380971
56237 2380971 2491578 2590984 2674068 2737559 2780587 2802071 2800893 2778551 2738322 2681750 2609035
56226 2609035 2522663 2427300 2326066 2220231 2112439 2006511 1903729 1802825 1704183 1610678
56216 1610678 1523774 1442106 1364713 1292568 1226182 1164629 1107753 1056539 1010598 967913 927736
56205 927736 891242 858892 829623 802945 779280 757997 737682 718481 701698 687188 673845
56194 673845 662292 653974 647751 640677 632250 624697 619017 614043 609510 606626 605225 603652 601771 600924
56180 600924 600770 599522 597552 597266 599109 601091 602480 604513 607278 609553 611982 616598 622868 628060 631964
56165 631964 637219 644437 651190 656674 663193 671940 681254 690210 700099 711163 721666 731495 743044
56152 743044 757390 773145 790154 810522 834901 861533 890198 923416 962687 1007420 1058796
56141 1058796 1120682 1195169 1280756 1376074 1481361 1594621 1709832 1820433 1921544 2008508
56131 2008508 2077929 2131865 2177294 2219949 2261662 2303426 2345756 2384681 2412519 2424968 2423978 2412969
56119 2412969 2394037 2370866 2348394 2326587 2298616 2257355 2200012 2125624 2033817 1928634 1818749
56108 1818749 1711095 1608077 1512383 1429084 1360462 1303729 1256457 1219554 1192528 1171046 1152203
56097 1152203 1137455 1127588 1119683 1112016 1107050 1106419 1107625 1108730 1111504 1116855 1122029 1125637 1130708 1139387
56083 1139387 1149257 1158133 1167692 1179106 1189983 1199112 1209439 1222793 1236493 1248572 1261417 1276674
56071 1276674 1291648 1304570 1318500 1336111 1355426 1374348 1394405 1416323 1437156 1455725 1475722
56060 1475722 1499468 1523894 1546530 1569843 1595576 1620613 1642939 1665850 1691604 1716691 1738266
56049 1738266 1759469 1783394 1807610 1829762 1852798 1879375 1906866 1933206 1961789 1995143 2029712
56038 2029712 2062414 2096266 2133850 2171544 2206244 2241574 2281289 2322767 2363300 2406421 2455499
56027 2455499 2507382 2558877 2612975 2672063 2731797 2788617 2846521 2909383 2973761 3036624 3102712
56016 3102712 3176376 3253508 3329674 3408687 3494672 3583439 3670620 3760716 3858821 3961035 4062510
56005 4062510 4167241 4280229 4397791 4515574 4638161 4770697 4909407 5050821 5201549
55996 5201549 5367839 5544399 5724871 5913972 6117432 6330057 6546752 6775291 7024480
55987 7024480 7289742 7564642 7856309 8174416 8515427 8873418 9255881 9672653 10120266
55978 10120266 10594101 11104502 11663615 12268781 12917318 13624213 14405523 15258803 16181430
55969 16181430 17193372 18319583 19566892 20943558 22484488 24230852 26204684 28434404
55961 28434404 30986882 33945058 37380586 41389320 46134703 51822981 58669814 66941214
55953 66941214 77004489 89311619 104409568 123058785 146289785 175209086 210652587
55946 210652587 252772388 300274094 349262200 392767182 422416292 432017425 420565016
55939 420565016 392259321 353792299 311355382 269273965 230127505 195253348 165102532
55932 165102532 139551078 118202430 100546138 86001283 73992601 64045731 55789529
55925 55789529 48898443 43090561 38164422 33980694 30409378 27328964 24659401 22350819
55917 22350819 20344751 18578813 17018479 15649336 14444039 13366025 12397729 11536070
55909 11536070 10765972 10064440 9424491 8849792 8330688 7848722 7399658 6989805 6614394
55900 6614394 6260743 5928243 5624679 5346651 5083036 4834064 4608115 4402862 4207666
55891 4207666 4021833 3853062 3700152 3553943 3413502 3285696 3170414 3061231 2958931
55882 2958931 2869697 2791005 2712905 2632108 2552135 2471636 2385862 2298297 2217906 2145504 2074571
55871 2074571 2004170 1939111 1878613 1816866 1754408 1697651 1647484 1598955 1551699 1510171 1473965
55860 1473965 1438031 1402051 1369816 1339813 1306252 1269238 1234603 1203874 1173449 1143282 1117243
55849 1117243 1094929 1071787 1047328 1024940 1003937 980190 954429 931698 912675 893463 873672
55838 873672 856717 842282 826466 809375 794919 783118 770126 755792 743720 733961 723120 711645
55826 711645 703531 698687 692908 685495 679624 674968 667311 655940 644395 633447 620302 605225 592078
55813 592078 581634 571002 560195 552555 548133 543337 537853 535276 536106 536709 536245 538201 543904 550695
55799 550695 557581 566586 577325 586277 592698 599445 606795 611253 611741 611197 610654 607389 600455 592660 585545
55784 585545 577615 568835 561607 555673 547096 533983 518706 503301 487505 472599 462353 458605 460148
55771 460148 466874 480518 500310 522255 543148 560699 569762 564570 546218 522723 500214 478918
55759 478918 458506 441318 428203 416656 405591 397265 392238 387073 379248 370033 360469 349034 335568
55746 335568 323228 314102 306678 299696 294585 291980 289824 287196 286337 288612 291861 293718 294202 293313 289757
55731 289757 284004 279073 276298 273579 269442 265300 261986 257789 251954 246607 243138 240062 236398 233798
55717 233798 233250 233008 231966 231963 234662 239091 244189 250771 259083 267330 274351 280771 285955 287247 284076
55702 284076 279537 275818 271274 264101 255697 248034 240688 232873 225672 219972 214740 209426 205557 203937
55688 203937 202802 200693 198572 197298 195813 193822 193474 196197 200386 204299 208708 214543 220427 224784
55674 224784 228103 231113 232909 232818 231859 230583 227855 223550 219911 218280 216973 214398 211784 210789 210812 210822
55658 210822 211537 213663 216145 218212 220957 224913 228370 230139 231752 234897 238843 242355 245769 249111
55644 249111 250583 249272 247208 246371 245651 242969 238378 232875 226198 218100 209958 202872 195906 188228 181087
55629 181087 175684 171094 166364 162647 161067 160423 159186 157866 157263 156423 154653 153553 154537 156145 156189 154874
55613 154874 153429 151419 148002 144318 142080 140994 139690 137973 136188 133860 130909 128654 127752 126835 125057
55598 125057 124012 125032 126586 126656 125679 124812 123349 120560 118133 117880 118628 118240 117152 117037 117478 116989 116092
55581 116092 116329 117274 117417 117077 117619 118716 119222 119895 122433 126478 130322 133925 138582 144182 149427 154185
55565 154185 159102 163372 165472 165724 165696 165438 163622 160029 155630 150649 144861 139356 135657 133329 130631
55550 130631 127240 124229 121794 119200 116695 115292 114837 114292 113707 113956 114826 115289 115410 116114 117369 118421
55534 118421 119433 121018 122577 123020 122820 123434 124963 126181 126567 126535 125994 124437 122214 120136 118179 116015
55518 116015 114184 113199 112298 110739 109420 109298 109197 107354 104365 102272 101335 100123 98426 97621 98220 99221
55502 99221 99945 100599 101088 101088 101191 102225 103656 104287 104112 103827 103136 101458 99676 99082 99111 98294 96941 96595
55484 96595 97190 97152 96167 95426 95175 94363 92887 91968 92053 92329 92477 92919 93260 92519 91043 90195 90013 89182 87540
55465 87540 86546 86912 87632 87748 87407 86885 86149 85589 85614 85548 84518 83237 83099 83705 83331 81822 80916 81518 82700
55446 82700 83630 84433 84862 84196 82937 82706 83917 85303 86067 86750 87624 88088 88104 88433 89020 88887 88076 87912
55428 87912 88895 90044 90742 91459 92218 92213 91523 91396 92155 92556 91922 91181 91024 90762 89916 89397 89987 90955 91154
55409 91154 90489 89482 88304 86987 85781 84841 84229 84305 85241 86188 86110 85363 85177 85706 86065 86198 86940 88185
55391 88185 88828 88895 89894 92486 95417 97306 97988 97652 96255 94396 93282 93222 93432 93691 94655 96149 96823
55374 96823 96107 94925 93864 92268 89854 87689 86669 86336 85931 85336 84343 82446 80087 78784 79203 80312
55358 80312 81092 81784 82699 83192 82747 81981 81735 82084 82867 84149 85539 86146 85816 85450 85662 86146 86696 87584
55340 87584 88547 88760 88378 88670 89991 90985 90575 89457 88781 88551 88177 87561 86835 85924 85060 84880 85476 86206
55322 86206 86761 87387 87817 87260 85833 84680 84227 83685 82782 82497 83394 84580 85122 85269 85540 85770 85788 85878 85954
55303 85954 85394 84292 83668 83955 84508 85082 86356 88408 90150 91015 91741 92781 93499 93713 94436 96065 97356
55286 97356 97325 96757 96631 96395 95138 93293 91884 91066 90620 90878 91966 92977 93061 92533 91945 90962 89194 87273
55268 87273 86025 85315 84695 84396 84711 85104 84841 83931 82786 81703 81216 81981 83654 84867 85015 85021 85666 86330
55250 86330 86239 85843 85949 86499 87066 87690 88388 88792 88945 89468 90280 90329 89303 88311 88100 87959 87280 86778 87071
55231 87071 87432 87177 86983 87588 88366 88508 88467 88975 89677 90031 90478 91491 92516 93044 93562 94194 93739 91538
55213 91538 89097 88225 88614 88830 88655 88759 89005 88870 88811 89454 90149 89949 89374 89573 90397 90993 91616 93053 94763
55194 94763 95421 95010 94684 94854 94967 94893 94908 94583 93296 91690 91099 91554 91801 91190 90200 89268 88447 88163 88929
55175 88929 90324 91399 92002 92597 93003 92550 91335 90118 89131 88168 87588 87953 88808 89082 88679 88538 89165 90225
55157 90225 91434 92802 94060 94910 95679 96708 97353 96724 95187 94024 93765 93980 94492 95566 96946 97828
55141 97828 97853 97211 95936 94087 92370 91552 91419 91285 91174 91438 91581 90768 89347 88601 89091 90305 91809
55124 91809 93544 95130 96053 96492 96933 97170 96782 96299 96641 97609 98274 98655 99529 100652 100760 99588 98454
55107 98454 98422 99104 99653 99816 99601 98891 97892 97229 97290 98031 99368 101036 102178 102021 100938 100049 99850 100125
55089 100125 100933 102519 104337 105384 105565 105695 106124 106447 106553 106803 107049 106660 105688 104963 104865 105049 105491 106620
55071 106620 108142 108883 108196 106635 104936 103304 101980 101476 101737 101925 101545 101133 101389 102125 102467 101795 100383
55054 100383 99332 99640 100943 101617 100706 99250 98870 99611 100273 100431 100740 101394 101673 101139 100151 99086 98024
55037 98024 97235 96944 96703 96046 95604 96325 97717 98285 97778 97519 98264 99169 99292 98814 98293 97893 97851 98574 99751
55018 99751 100411 100316 100286 100763 101195 101270 101593 102463 103074 102717 101935 101766 102469 103566 104516 104868 104348 103206 102002
54999 102002 100879 99719 99068 99920 102325 105142 107542 109822 112374 114810 116620 117846 118603 118676 118058 117194
54983 117194 116267 114974 113337 111953 111159 110740 110757 111686 113269 114206 113696 112511 111947 112348 113240 114228 115123
54966 115123 115736 116174 116949 118277 119668 120544 120867 120860 120546 119834 118661 116968 115011 113681 113761 114764 115281
54949 115281 114678 113700 113265 113473 114050 114875 115684 116028 115951 116057 116547 116872 116585 115899 115147 114397 113817 113704 113926
54930 113926 114033 114080 114556 115415 116090 116644 117862 119960 122248 124501 127548 131954 137133 142373 147891 154162
54914 154162 160852 167056 171994 175085 175977 174960 172729 169508 165084 159911 155191 151504 148262 144914
54900 144914 141691 138786 135841 132864 130538 129016 127430 125366 123775 123467 123621 122880 121261 119957 119723
54885 119723 120389 121595 123117 124707 126277 128043 130083 132112 134110 136640 140120 144323 148982 154259
54871 154259 160141 166011 171313 175983 179710 181487 180613 177615 173578 169078 164275 159458 154841 150265
54857 150265 145624 141197 137141 133230 129453 126291 124013 122362 121284 121136 121700 121841 120796 119059 117401
54842 117401 115803 114018 112354 111126 110057 108998 108602 109440 111007 112356 113128 113287 112557 111028 109706
54827 109706 109428 109631 109104 107685 106431 106340 107522 109350 110800 111019 110175 109440 109669 110511 111255 111977 113225
54810 113225 115074 117166 119246 121048 122095 122183 121647 120754 119391 117719 116389 115577 114615 113238 112305 112496
54794 112496 113094 113041 112505 112335 112584 112695 112766 113507 115064 116739 117771 117818 117002 116052 115952 116889 118012 118772
54776 118772 119717 121264 122612 122949 122985 124048 126162 128313 130270 132801 136258 140170 144299 149051 154768
54761 154768 161405 168811 176581 183707 189225 193056 195447 195858 193385 188210 181684 174929 168177 161499
54747 161499 155350 150185 146060 142696 139603 136319 133006 130528 129436 129269 129376 129857 130966 132126 132556
54732 132556 132468 132633 133063 133195 133139 133577 134503 135222 135706 136894 139408 142915 146960 151532 156449 161076 165081
54715 165081 168872 172793 176340 178522 178706 176905 173608 169503 165173 160873 156654 152608 148797 145126
54701 145126 141550 138284 135667 133980 133417 133772 134049 133039 130662 128125 126390 125206 124136 123642 124276
54686 124276 125426 125871 125237 124101 123062 122497 122805 123911 124839 124651 123617 122695 122236 122046 122286 123220 124251
54669 124251 124275 123058 121431 120154 119279 118601 118022 117542 117495 118514 120633 122740 123718 123752 123705 123575 122570 120513
54651 120513 118147 116148 114745 114205 114766 116053 117356 118457 119475 120109 119871 118957 118074 117510 117117 117005
54635 117005 117394 117954 118136 118003 117969 117960 117654 117247 117097 116934 116400 116005 116492 117532 118218 118581 119373 120525 121204
54616 121204 121341 121757 122634 123128 122727 121845 120926 120053 119605 120084 121090 121592 121453 121523 122040 122127 121234 119854 118497
54597 118497 117078 115782 115343 115966 116945 117779 118674 119542 119705 119200 119263 120723 122822 124375 125298 126184 127098
54580 127098 127631 127628 127191 126353 125302 124525 124265 124254 124349 124918 126156 127492 128147 127953 127350 126870 126846 127241 127612
54561 127612 127569 127314 127372 127899 128743 129975 131625 133098 133696 133663 133835 134335 134596 134623 135085 135997 136512 136336 136232
54542 136232 136701 137263 137589 138246 139618 140972 141409 141092 140855 141070 141431 141446 140727 139256 137636 136656 136421 136396
54524 136396 136289 136228 136108 135658 135198 135340 135856 135885 135394 135267 135677 135668 134846 134147 134235 134377 133747 132814 132464 132643
54504 132643 132811 132988 133471 134149 134899 135975 137258 137808 137071 135917 135636 136385 137412 138222 138704 138578 137719
54487 137719 136775 136647 137454 138522 139210 139310 139026 138926 139562 140780 141861 142654 143905 146002 148132 149292
54471 149292 149605 149893 150442 150919 151184 151505 152098 152907 153743 154408 154939 155758 157182 158760 159723 160116 160642 161256
54453 161256 160964 159414 157678 156904 157011 157284 157349 156976 155836 154166 152905 152431 151947 150748 149327 148501 148244
54436 148244 148127 148101 148055 147386 145971 144805 144829 145715 146626 147428 148261 148740 148641 148700 149627 150872 151454 151566 152200
54417 152200 153616 155182 156413 157223 157452 157033 156338 155595 154480 153048 152390 153300 154912 155791 155849 156012 156485
54400 156485 156697 156638 156866 157368 157710 158232 159797 162286 164518 165750 166177 165966 164943 163397 162074 161141 160165
54383 160165 159258 159215 160197 161296 161775 161868 161984 161956 161586 161279 161603 162596 163825 164827 165376 165724 166600 168530
54365 168530 171125 173507 175439 177497 180150 183186 186077 188357 189629 189727 188989 187953 186783 185364 183802
54350 183802 182335 180834 178905 176465 173820 171331 169370 168309 168032 167737 166788 165437 164163 162735 160741
54335 160741 158642 157310 156738 156198 155596 155616 156427 157223 157292 156700 155732 154466 153186 152490 152647 153350 154239 155086
54317 155086 155373 154476 152557 150699 149817 149866 150300 150788 151220 151461 151411 151104 150633 150083 149476 148556 146962 145025
54299 145025 144024 144967 147306 149557 150998 151953 152553 152293 151032 149534 148565 148139 148008 148299 149211 150474
54283 150474 151592 152409 153176 154201 155490 156620 157020 156642 156206 156440 157218 157839 157948 157665 157000 155796 154273
54266 154273 153029 152437 152412 152752 153268 153745 154231 155154 156575 157608 157398 156539 156573 158036 159863 160965 161526
54249 161526 162359 163647 164814 165212 164594 163218 161744 160819 160626 161004 161880 163207 164637 165728 166387 166645
54233 166645 166206 164849 163137 161985 161535 161150 160549 160209 160516 161192 161699 161621 160616 158697 156704 155765 156061
54216 156061 156717 157043 157240 157673 158212 158604 158881 159029 158795 158112 157230 156183 154708 152962 151703 151390 151582
54199 151582 151710 151980 153039 155010 157293 159170 160234 160375 159670 158465 157475 157566 159025 160931 161680 160581
54183 160581 158627 157317 157107 157546 158387 159648 160896 161553 161924 162950 164746 166304 166860 166716 166448 166096
54167 166096 165552 165020 164596 163961 162922 161826 161082 160667 160362 160079 159712 159115 158439 158107 158211 158309 157962 157200
54149 157200 156427 156182 156853 158119 158813 158001 156144 154581 153974 153995 154389 155343 156679 157732 158345 159057 159932
54132 159932 160119 159067 157388 155974 154973 154202 153904 154398 155430 156456 157272 157985 158739 159790 161407 163358
54116 163358 164935 165801 166355 166997 167548 167789 168087 168998 170548 172282 173746 174737 175341 175944 176981 178655 181100
54099 181100 184589 189082 193863 198321 202799 207721 212049 213844 212508 209351 205709 201660 196965 191994
54085 191994 187138 182478 178658 176877 177174 177817 177384 176594 177110 179388 182741 186661 190870 194721 197788
54070 197788 200645 203929 206994 208591 208562 207752 206553 204730 202545 200750 199307 197198 193870 190092 187036
54055 187036 185187 184494 184993 186770 189480 192231 194032 194560 194531 195050 196422 197998 199391 201295 204608 209189
54039 209189 214058 218479 222351 225925 229800 234832 241265 248112 254083 259020 263763 268741 273409 277111
54025 277111 279803 281830 283472 284930 286316 287562 288578 289494 290432 291078 290813 289268 286528 282942 279038
54010 279038 275404 272264 269181 265503 261093 256385 251855 247675 243748 239909 236180 232938 230563 228778
53996 228778 226706 223855 220720 218106 216180 214517 212802 211142 209881 209344 209494 209640 208881 207093 205139
53981 205139 203905 203592 204020 204941 205673 205237 203491 201644 200972 201504 202467 203414 204193 204439 204053 203865 204984
53964 204984 207702 211745 217150 224038 231890 240147 249348 260466 272886 283980 291047 293156 291084
53951 291084 286306 280303 274094 267985 262013 256706 252914 250847 249810 249058 248459 248256 248814 250731 254565
53936 254565 260015 265746 270392 273533 275567 276971 277980 278779 279572 280468 281485 282792 284877 288305 293099
53921 293099 298478 303456 307752 311790 315840 319695 323426 327830 333668 340877 348979 357764 366904 375259
53907 375259 381442 385146 387257 388621 389232 388751 387290 385418 383601 381803 379522 376269 372138 367810 363812
53892 363812 359863 355164 349208 342185 334787 327738 321252 314809 307729 300084 292722 286305 280793 275988
53878 275988 271963 268656 265705 263076 261228 260154 258933 256822 254166 251600 248996 246034 243170 241031
53864 241031 239242 236889 233905 231019 228461 225800 223011 220742 219289 218134 216723 215091 213530 212168
53850 212168 211046 210225 209778 209855 210518 211248 211131 210066 209210 209479 210131 209794 208471 207360 206906 206305 205017
53833 205017 203627 202915 203047 203934 205508 207270 208440 208944 209613 211080 212991 214542 215266 215201 214794 214718 215222
53816 215222 215695 215478 214959 215139 216222 217602 219160 221453 224469 227385 229909 232758 236350 240073 243484
53801 243484 247238 251993 257226 261978 266211 270572 275240 279803 284002 287951 291741 295344 298735 301784
53787 301784 304281 306336 308321 310170 311186 310934 309798 308222 305881 302251 297624 292867 288343 283645
53773 283645 278370 272682 267114 262143 257951 254329 250808 247099 243364 239982 237212 235154 233804 232992
53759 232992 232404 231779 230938 229693 227992 226182 224699 223429 221727 219287 216618 214517 213365 213083 213397
53744 213397 213906 214169 213954 213306 212346 211270 210563 210786 211991 213567 214798 215436 215786 216472 217997 220145 221956
53727 221956 222726 222876 223377 224524 225957 227639 229846 232144 233471 233631 233762 234798 236243 237089 237239 237353
53711 237353 237815 238622 239925 241929 244450 247220 250482 254681 259577 264140 267462 269600 271523 274375 278559
53696 278559 283416 287880 291555 294910 298438 301989 305037 307111 307779 306763 304453 302008 300519 300208 300601
53681 300601 301150 301450 301269 300688 300021 299338 298301 296650 294616 292666 291134 290204 289846 289588 288835 287697 287082
53664 287082 287627 288863 289817 290135 290233 290579 291143 291454 291037 289967 289042 288989 289478 289378 288242 287001 286875 288095
53646 288095 290038 292133 294115 295754 296911 297787 298783 300216 302245 304752 307128 308638 309298 309987 311453
53631 311453 313661 316375 319782 324014 328619 333115 337731 342942 348528 353716 358131 362032 365692 369056
53617 369056 371998 374546 376844 379196 381983 385295 388764 392083 395430 399055 402726 406050 409177 412683
53603 412683 416772 420988 424661 427321 428797 429333 429679 430658 432412 434192 434957 434184 432159 429608 427044
53588 427044 424556 422210 420388 419326 418506 417094 415062 413266 412190 411228 409553 407192 404727 402350 399820
53573 399820 397129 394619 392471 390425 388042 385098 381913 379370 378291 378556 379166 379386 379476 379972 380787 381480
53557 381480 382050 382864 383975 385057 385991 387045 388435 390027 391502 392614 393321 393833 394496 395562 397201 399646
53541 399646 403043 407112 411349 415623 420131 424804 429442 434609 441540 450639 460728 470406 479573 488987
53527 488987 498891 508999 519454 530809 543043 555447 567612 579988 593335 608072 624178 641347
53515 641347 659225 677880 697956 719941 743384 767322 791446 816373 842734 870451 899012
53504 899012 927980 956975 985433 1012692 1038358 1062563 1085840 1108633 1130821 1151808 1171160
53493 1171160 1189026 1206036 1223037 1240892 1260002 1279808 1299155 1317414 1334995 1352632 1370671
53482 1370671 1389255 1408550 1428311 1447678 1465950 1483142 1499291 1513618 1525056 1533382 1539240 1543233
53470 1543233 1545421 1545442 1542599 1536092 1525820 1512836 1498471 1483198 1466888 1449913 1433218 1417284
53458 1417284 1401696 1385813 1369244 1351490 1331739 1309510 1285379 1260817 1237207 1214925 1193306
53447 1193306 1171625 1150048 1129282 1109374 1089617 1070030 1052212 1037915 1027234 1018966 1012414 1007867
53435 1007867 1005354 1003973 1002817 1002004 1002389 1004572 1008447 1013508 1019426 1026343 1034564 1043970 1054089 1064956
53421 1064956 1077434 1092195 1108758 1126098 1144012 1163297 1184745 1208464 1234108 1261176 1289151
53410 1289151 1317944 1348230 1380893 1416037 1452890 1490622 1528967 1568184 1608881 1651820 1697470
53399 1697470 1745724 1796271 1848975 1903589 1959446 2016009 2073454 2132103 2191472 2250622 2309382
53388 2309382 2368479 2428275 2487929 2545954 2601244 2653450 2702781 2749558 2793735 2834794 2872214
53377 2872214 2905723 2934845 2958649 2976632 2989564 2998748 3004416 3005366 3000131 2987875 2968224 2940913
53365 2940913 2905934 2863743 2815278 2761984 2705650 2647734 2588835 2529057 2468651 2408011 2347420
53354 2347420 2287426 2229174 2173796 2121602 2072374 2026064 1982460 1940456 1898539 1855974 1812858
53343 1812858 1769261 1725314 1682091 1641400 1604336 1570702 1539885 1511508 1485126 1460227 1436983
53332 1436983 1416331 1398897 1384287 1371652 1360385 1349923 1339401 1327993 1315420 1302018 1288501
53321 1288501 1275560 1263277 1250903 1237726 1224161 1211614 1201236 1193221 1187171 1182615 1179214 1176928
53309 1176928 1175982 1176310 1177338 1178826 1181549 1186338 1192871 1200409 1209409 1221154 1235776 1252017 1269192
53296 1269192 1288092 1309405 1332519 1356684 1382409 1410634 1441034 1472002 1502091 1530832 1558332
53285 1558332 1584552 1608998 1631045 1650664 1668669 1685717 1701149 1713432 1721722 1726232 1727098 1723878
53273 1723878 1716490 1705764 1692640 1677528 1660735 1642595 1622698 1599912 1573865 1545799 1517295
53262 1517295 1488684 1459247 1428461 1396452 1363753 1331140 1299289 1268106 1236856 1205336 1174380
53251 1174380 1144721 1115959 1087213 1058315 1029777 1002047 975344 949698 924622 899161 872961
53240 872961 846920 822286 799475 778206 758341 739982 723197 708224 695598 685470 677163 669950
53228 669950 663837 658900 654232 648418 640961 632513 623753 614567 604373 592713 579497 565028 549874
53215 549874 534608 519741 505920 493693 482818 472331 461706 451549 442617 434649 426768 418778
53203 418778 411355 405059 399733 394783 389602 383694 376813 369022 360553 351804 343571 336762 331435 326512
53189 326512 320955 314986 309657 305503 302168 299114 296100 292952 289469 285721 282143 279160 276819 274767
53175 274767 272590 270327 268660 268284 268990 269732 269734 269105 268248 267157 265647 263854 262144 260799 260019 259841 259867
53158 259867 259489 258648 257872 257381 256710 255520 254127 252862 251556 250112 248957 248399 248187 248266 249228 251274 253411
53141 253411 254543 254858 255270 255967 256463 256710 257188 258060 259158 260573 262356 263820 264077 263266 262429 262266 262788
53124 262788 264038 266104 268392 269872 270320 270516 271035 271701 272470 273930 276421 279341 281878 283925 285780
53109 285780 287332 288073 287690 286246 283829 280416 276066 271153 266381 262549 260148 259109 258956 259101 258967
53094 258967 258145 256767 255563 255218 255699 256451 257122 257773 258460 258911 258685 257553 255830 254353 253827 254076 254281
53077 254281 254100 254021 254413 254804 254619 254062 253665 253381 252860 252257 251963 251709 250717 248762 246451 244414 242745 241239
53059 241239 239708 238091 236593 235614 235245 235138 235274 236359 238754 241484 243185 243856 244687 246252 247843 248689
53043 248689 248875 248753 248280 247360 246249 245194 244160 243166 242463 242057 241446 240120 238185 236397 235688 236525 238373
53026 238373 239949 240513 240747 241815 243703 245188 245419 244739 243809 242728 241386 240107 239480 239826 241036 242673
53010 242673 244128 245025 245527 245944 246116 245695 244926 244496 244530 244450 243968 243548 243543 243537 243001 242129 241566 241609 242067 242676 243333
52989 243333 244054 244949 246121 247490 248879 250300 251919 253695 255349 256697 257745 258513 259204 260469 262979
52974 262979 266562 270199 273054 275100 276593 277433 277347 276404 275037 273690 272581 271674 270838 270152 269987 270535
52958 270535 271369 271780 271466 270537 269003 266706 263768 260654 257776 255365 253609 252518 251718 250888 250266 250248
52942 250248 250555 250414 249519 248255 247012 245888 245060 244765 244857 244947 244991 245137 245071 244316 243190 242567 242563 242352 241572
52923 241572 240942 241063 241480 241570 241592 242187 243326 244408 244987 244918 244212 243211 242576 242609 242923 243066 243007 242673 241646
52904 241646 239903 238371 238041 238798 239667 240022 240016 240010 240097 240192 240247 240398 240993 242260 243855 245165 246164 247488 249363
52885 249363 251031 251675 251435 251021 250772 250662 250859 251526 252263 252394 251832 251219 251207 251973 253350 255059 256827 258556
52867 258556 260392 262444 264520 266283 267544 268331 268902 269788 271467 273739 275767 276879 277027 276341 274753
52852 274753 272393 269825 267377 264610 260955 256580 252094 247665 243015 238174 233717 230235 227895 226486
52838 226486 225633 225039 224741 224974 225671 226374 226857 227411 228241 229021 229437 229793 230508 231337 231686 231513 231262 231057 230565
52819 230565 229689 228851 228441 228396 228456 228556 228845 229436 230133 230453 230195 230119 231554 234883 238735 241164 241369 239858
52801 239858 237302 234066 230742 228237 226963 226394 225698 224539 223168 222016 221362 221171 221142 221081 221156 221607 222314
52784 222314 222942 223387 223739 223943 223954 224124 224986 226569 228348 229818 230720 230789 229900 228625 228019 228501 229421 229975
52766 229975 230058 229828 229041 227535 226036 225604 226254 226888 226817 226662 227308 228568 229567 230167 231130 232784 234268 234539
52748 234539 233685 232814 232921 234245 236486 239120 241534 243327 244604 245770 247077 248542 250121 251616 252621
52733 252621 253010 253318 254082 254965 255237 255128 255820 257802 259995 260994 260517 259056 256802 253795 250755 248755
52717 248755 248014 247731 247274 246863 246857 246947 246561 245745 245131 245068 245143 244711 243689 242614 242006 241886 242021 242363 242984 243653
52697 243653 243842 243287 242415 242083 242877 244559 246130 246606 245910 244924 244515 244776 245370 246183 247147 247810 247808 247599 247967
52678 247967 248777 248984 247981 246251 244516 242974 241649 240780 240440 240298 240011 239469 238535 237275 236556 237493 239909
52661 239909 242252 243582 244704 246682 249175 251196 252778 254733 257238 259785 262275 265051 267918 270041
52647 270041 270802 270037 267604 263672 259423 256487 255445 255525 255815 256026 256039 255598 254812 254315 254546 255310 256266 257463
52629 257463 259148 261490 264611 268502 272736 276573 279453 281103 281248 279747 277074 274149 271509 269062
52615 269062 266707 264687 263201 262169 261588 261651 262209 262555 262106 261029 259924 259168 258806 258785 258921 258774 257982
52598 257982 256719 255625 255204 255442 255999 256635 257303 257880 258046 257672 257143 257011 257308 257597 257817 258602 260466 263056
52580 263056 265597 267726 269507 270890 271728 272132 272265 271867 270529 268400 266192 264457 263302 262757 262935 263670
52564 263670 264432 264747 264480 263714 262693 261901 261800 262339 262953 263131 262860 262482 262246 262008 261281 259761 257868 256488
52546 256488 256040 256161 256503 257297 258618 259639 259371 257888 256099 254606 253612 253688 255460 258347 260657 261407
52530 261407 261323 261568 262228 262623 262588 262671 263296 264297 265286 266065 266653 267144 267585 267988 268536 269713 271916 274884
52512 274884 277830 280302 282688 285714 289646 294108 298456 302163 304956 306705 307158 305976 303180 299417
52498 299417 295418 291245 286468 281103 275984 272137 270048 269555 270074 270842 271319 271509 271689 271848 271707 271252
52482 271252 270804 270504 270189 269970 270396 271766 273552 274902 275574 276105 277110 278610 280060 281083 282122 284103
52466 284103 287188 290195 291785 292165 293014 295636 299716 304026 307695 310369 311709 311455 309856 307541 304906
52451 304906 302006 298998 296238 293814 291341 288547 285880 284165 283617 283569 283338 283036 283090 283225 282576 280844
52435 280844 278721 276945 275487 274054 272837 272171 271824 271225 270289 269529 269475 270373 272227 274722 277215 279249
52419 279249 280950 282615 284201 285608 287109 288980 290947 292546 293800 295063 296605 299010 303611 311570
52405 311570 322587 335241 348445 361706 374061 383746 389213 389855 385811 377882 367727 357243 347461
52392 347461 338584 330986 325285 321367 318394 316063 314917 315050 315465 315240 314531 313899 313443 313182 313570 314949
52376 314949 317002 319402 322487 326681 331671 336796 341904 347308 353096 358942 364346 368749 371690 373197
52362 373197 373738 373577 372591 370865 368943 367215 365641 364391 364123 365117 366686 367950 368774 369465 370035 370358
52346 370358 370646 371218 372145 373580 375984 379450 383170 386265 388891 392063 396544 402478 409774 418204 427193
52331 427193 436121 444951 454278 464759 476629 489608 503116 516908 531658 548488 567679 588286
52319 588286 609287 630503 651953 672882 692214 709656 725716 740929 755713 770760 786786
52308 786786 803832 821299 838657 855679 872102 887568 902004 915736 929196 942666 956139
52297 956139 969159 980936 990896 998961 1005091 1008781 1009312 1006341 1000097 991286 981013 970357 959672
52284 959672 948618 937173 926301 917244 910478 905651 902172 899553 897618 896851 898160 901850 907231 913671
52270 913671 921568 931665 943700 956423 968701 980113 990737 1001017 1011702 1023275 1035484 1047845
52258 1047845 1060406 1073631 1087743 1102640 1118138 1133706 1148226 1160698 1171119 1180166 1188117 1194495
52246 1194495 1198571 1199714 1197427 1191693 1183188 1172727 1160625 1146980 1132280 1117185 1101959 1086746
52234 1086746 1072079 1058419 1045374 1032166 1018814 1006139 994608 983910 973719 964129 955181 946563
52222 946563 938159 930478 924327 920128 917544 915571 913320 911051 910167 911701 915067 918853 922548 926767
52208 926767 932046 938134 944445 950426 955514 959410 962490 965366 968143 970645 973221 976480 980311 984063
52194 984063 987718 991987 997054 1002155 1006748 1011266 1016244 1021375 1025918 1029529 1032229 1033961 1034560 1033809 1031284
52179 1031284 1026527 1019614 1011134 1001537 990972 979980 969610 960521 952483 945206 939141 934943 932523
52166 932523 931186 930500 930580 931630 933616 936392 939918 944324 949747 955946 962068 967072 970454 972369 973142
52151 973142 973060 972597 972277 972166 972000 972007 973101 975939 980160 984783 989063 992682 995522 997577 998863 999208 998450
52134 998450 997094 996456 997874 1001926 1008522 1017375 1028163 1040653 1055100 1072317 1092975 1116886 1143139
52121 1143139 1170849 1199650 1229679 1261163 1293804 1326439 1357622 1386651 1413741 1439130 1462516
52110 1462516 1483624 1502721 1519977 1534619 1545422 1552111 1555815 1558007 1559323 1559578 1558633 1556937 1555178
52097 1555178 1553611 1551930 1549784 1547117 1543708 1538578 1530324 1518192 1502505 1483955 1462902 1439640 1415069
52084 1415069 1390653 1367772 1347340 1329949 1316017 1305559 1297989 1292400 1288213 1285565 1284952 1286544 1290051
52071 1290051 1295324 1302776 1312928 1325639 1340080 1355353 1370920 1386598 1402426 1418463 1434353 1449180
52059 1449180 1462112 1473190 1483148 1492550 1501544 1510354 1519321 1528189 1535860 1541272 1544223 1545014 1543541 1539112
52045 1539112 1531056 1519219 1503927 1485794 1465583 1443993 1421389 1397800 1373344 1348719 1325155
52034 1325155 1303692 1284518 1267158 1251270 1236973 1224388 1213198 1202793 1192448 1181238 1168330
52023 1168330 1153868 1139202 1125721 1113662 1102376 1091348 1080369 1069122 1057459 1046024 1035856
52012 1035856 1027242 1019516 1011896 1003934 995195 985307 974528 963600 952786 941523 929189 915650
52000 915650 900907 884871 867852 850815 834735 819983 806610 794951 785648 779142 775089 772088
51988 772088 768139 761929 753745 744775 735632 726031 715699 704761 693135 680345 666321 651729 637160
51975 637160 622576 607900 593667 580589 568859 558303 548979 541292 535732 532671 532250 534355 538915
51962 538915 546051 555549 566270 576762 586457 595625 604057 610533 613842 613663 610241 604003 595941 587638
51948 587638 580219 573647 567485 561972 557984 556358 557622 561995 569312 579291 592094 608100 626967
51935 626967 647564 669164 691948 715955 740268 763831 786235 806803 823322 832603 832234 821523
51923 821523 801370 774047 742716 710183 677929 646601 617015 590083 566104 544863 526317
51912 526317 510644 497786 487508 479697 474101 469985 466705 464451 463919 465420 468882 474433 482184 491432
51898 491432 500878 509749 518123 525893 531922 534494 532377 525409 514456 501013 486617 472377 459011
51885 459011 447195 437697 431122 427604 426697 427635 429853 433291 438035 443880 450619 458560 468039 478398
51871 478398 488240 496878 504725 511883 517250 519679 519301 516957 512950 507223 500266 492915 485558 478424
51857 478424 472448 468950 468390 470111 473236 477246 481833 486809 492050 496945 500135 500406 497745 492984 486693
51842 486693 479142 471090 463629 457147 451126 445027 438755 432340 425939 420263 416344 414600 414577 415604 417269
51827 417269 419311 421589 424113 426567 427929 427171 424361 420506 416455 412581 409304 407008 405419 403957
51813 403957 402837 402959 404563 406868 409331 412338 416153 419983 422700 423944 423984 422996 421105 418769 416549
51798 416549 414741 413578 413513 414776 416765 418297 418452 417041 414445 411217 407770 404251 400785 397855 396261
51783 396261 396558 398612 401607 404446 406367 407510 408745 410609 412647 414204 415522 417384 419827 422127
51769 422127 424167 427037 431970 439247 448367 458584 468956 478549 487171 495420 503461 510035 513170 511647
51755 511647 505539 495797 483855 471354 459552 448773 438616 428707 419157 410491 403355 398175 394893
51742 394893 393010 391936 391285 391022 391586 393765 398034 403994 410836 418313 426713 435737 443916 449515 451758
51727 451758 451069 448610 445898 444387 444824 446865 449359 450888 450218 446869 441598 436030 431497 428327 426229
51712 426229 424883 423933 422833 421122 418689 415669 412364 409416 407712 407881 410133 414581 421140 428859 435917
51697 435917 440764 443032 443123 441459 438631 435892 434782 436161 439722 444132 447439 447954 445385 441042 436485
51682 436485 432147 427586 422671 417856 413472 409507 406169 404112 403876 405473 408575 412707 417100 420904
51668 420904 423915 427007 431568 438486 447634 458029 468284 477021 483122 485779 484492 479215 470697 460648
51654 460648 451325 444614 441300 441257 444357 450882 460782 472637 483779 491561 494433 492112 485403 475925
51640 475925 465419 454820 444270 434183 425790 420134 416933 415061 413979 414060 415458 417338 418661 419386
51626 419386 420389 422176 423943 424129 421863 417721 413025 408586 404257 399523 394202 388560 383117 378442
51612 378442 374905 372427 370687 369591 369281 369498 369316 367845 365165 362346 360606 360552 362028 364523 367762
51597 367762 372030 377913 385855 396138 409076 424495 440625 454026 461386 461662 456434 448402 439790
51584 439790 431906 425452 420789 417933 416521 416023 416229 417649 421407 428611 439733 454342 471160 488467
51570 488467 504999 520775 536885 554246 572594 590598 606686 619857 630381 640100 651676 667067
51558 667067 686907 711481 741682 778237 820012 863589 904544 938972 964319 979688 985625 983122
51546 983122 972543 953758 927296 894936 858980 821278 783002 744975 707985 673127 642039
51535 642039 616395 596757 582127 570964 562479 556631 553065 550521 547367 542393 535167 526086 516237
51522 516237 506720 497708 488347 477963 467171 457443 449655 443459 438015 432835 427777 422781 417988 413750
51508 413750 410150 406740 403175 399806 397158 395004 392613 389954 387976 387401 387711 387771 387208 386804 387507 389286
51492 389286 391036 391632 391153 390942 392285 395086 398097 400337 401863 403152 404246 404818 404675 403859 402431 400468
51476 400468 398152 395676 393152 390741 388674 386937 385064 382542 379381 376149 373357 370892 368108 364564
51462 364564 360633 357183 354512 351981 349021 346199 344694 344899 346219 348188 350930 354250 357195 359096
51448 359096 360472 362359 365257 369330 375113 383239 393787 406638 422157 440487 459949 476996 488277
51435 488277 492732 491882 488685 486111 486016 488564 492496 495904 496847 493878 486851 477345 467612 458759 450279
51420 450279 441479 432755 425008 418341 412074 405969 400766 397313 395623 395093 395321 396242 397549 398501 398654
51405 398654 398559 399326 401442 404269 406839 408839 410631 412506 414295 415718 416821 417959 419542 421947 425581
51390 425581 430825 437799 446237 455680 465857 476856 489008 502820 519175 539376 564604 595181
51378 595181 630536 670022 713657 762042 815623 873775 934004 991820 1041909 1080311 1105849
51367 1105849 1119566 1122901 1116439 1100048 1073718 1038213 995254 947245 896625 845216 794014 743551
51355 743551 694481 647901 605255 567807 536027 509463 487301 469056 454618 443596 434846 426919
51343 426919 419080 411713 405584 400799 396706 392699 388790 385337 382618 380905 380565 381693 383762 385987
51329 385987 387857 389085 389350 388583 387398 386594 386232 385615 384206 382133 379754 377246 374721 372306 369923
51314 369923 367426 365091 363606 363426 364461 366387 368757 370754 371456 370675 369132 367620 366443 365784 365933
51299 365933 366746 367432 367412 367018 366892 366983 366587 365156 362785 360129 358105 357362 357809 358899 360440 362660 365415
51282 365415 368126 370892 374855 380778 387802 394284 399329 402809 404549 404606 404119 404705 406839 409527 411686
51267 411686 413202 414591 416347 418828 422171 425982 429363 431442 431741 430187 427083 422992 418276 412885
51253 412885 406957 401341 396967 393782 390920 387900 385035 382643 380544 378558 376907 375772 374788 373365
51239 373365 371309 368943 366718 364856 363323 362093 361433 361742 362987 364513 365650 366360 367035 367910 368915
51224 368915 369893 370655 371023 371051 370963 370719 370107 369508 369857 371341 372844 373460 373885 375225 376980 377624 377012 376711
51206 376711 377719 379342 380879 383096 386982 391949 396387 399564 402024 404346 406436 408100 409584 411235
51192 411235 412951 414183 414400 413458 411537 408838 405595 402456 400472 400170 400726 400581 398996 396605 394489
51177 394489 393184 392679 392832 393555 394830 396661 398764 400428 401115 401089 400958 400772 400300 400058 401074 403399 405802
51160 405802 407379 408642 410487 412822 414884 416271 416913 416495 414733 412033 409198 406607 404137 401668 399182
51145 399182 396568 393887 391654 390360 389766 389137 388073 386792 385764 385472 386271 388013 389943 391459 392834
51130 392834 394718 397078 399237 400855 402246 403691 405097 406570 408614 411343 413888 415172 415068 414425 414075
51115 414075 414259 414995 416486 418836 421575 423856 425232 426119 427327 429220 431431 433432 435226 437346 440180
51100 440180 443398 446207 448177 449607 450955 452097 452504 452092 451394 450754 449892 448675 447844 448324 449978 451668
51084 451668 452513 452519 452036 451306 450728 450899 451965 453347 454435 455236 456050 456904 457733 458849 460722 463384 466342
51067 466342 469081 471451 473679 476286 480048 485890 494747 507437 524471 545740 570215 595780 619466
51054 619466 638525 652009 661443 669595 678614 689475 702558 717445 731981 742870 748308 749629
51042 749629 749464 748454 744544 735497 721468 705148 690134 679336 674034 673315 674124 672443 665297 652251
51028 652251 635176 616575 598106 580597 564923 552231 543230 537721 535017 534466 535492 537616 540807
51015 540807 545481 551847 559512 568111 578003 589754 603036 616546 629190 640913 652195 663053
51003 663053 672938 681499 689009 695744 701238 704639 705909 706138 706267 705893 703905 700177 695978 692636 690444
50988 690444 689063 688396 688626 689901 692554 697442 705584 717423 732667 750619 770288 790276 808994
50975 808994 825329 839267 852008 865492 881494 900993 924410 952325 985578 1024504 1068480
50964 1068480 1116556 1168362 1224089 1283763 1346888 1412799 1481036 1551097 1621919 1691786 1758911
50953 1758911 1822014 1880111 1931888 1975864 2011511 2039693 2061446 2076676 2084758 2086203 2082919 2076868
50941 2076868 2069279 2061143 2053312 2045549 2036271 2023978 2008573 1990927 1971764 1951553 1930862 1909942
50929 1909942 1888149 1864398 1838098 1809154 1777263 1741823 1702498 1659443 1612981 1563454 1511486
50918 1511486 1458181 1404982 1353339 1304250 1257961 1214312 1173520 1136359 1103419 1074488 1048836
50907 1048836 1025751 1004573 984635 965582 947553 930830 915557 901902 890021 879597 869940
50896 869940 860895 853163 847342 843123 839855 837380 835717 834448 833194 832382 832761 834266 836041 837572 839195
50881 839195 841493 844721 848841 853719 859236 865484 872745 881021 889862 899037 909067 920624 933625
50868 933625 947449 961889 977425 994655 1013975 1035654 1059807 1086361 1115343 1146961 1181132
50857 1181132 1217447 1256218 1299179 1348428 1404964 1468927 1540915 1622016 1712617 1812189 1920504
50846 1920504 2038186 2165661 2302104 2445824 2595298 2749601 2908056 3069383 3230684
50837 3230684 3387160 3533264 3664314 3776884 3868109 3935643 3978545 3997643 3994737 3972007 3932385
50826 3932385 3879892 3819025 3753862 3687927 3624641 3567607 3520307 3485170 3462513 3450283 3444945
50815 3444945 3442421 3438129 3426955 3404420 3368190 3318036 3254389 3177470 3087635 2985767 2873168
50804 2873168 2751730 2624295 2494223 2364407 2237189 2115196 2001329 1897559 1804258 1720980
50794 1720980 1647323 1582907 1527346 1480759 1443729 1416195 1396719 1383245 1374289 1369103 1367079 1367363
50782 1367363 1368810 1370119 1370326 1369311 1367456 1364772 1360870 1355840 1350352 1344568 1337715 1329134 1319095 1307994
50768 1307994 1295460 1280926 1264564 1246968 1228357 1208848 1189077 1169748 1150783 1131740 1112850
50757 1112850 1094841 1077935 1061988 1047640 1036357 1028951 1024777 1022683 1022175 1023427 1026883 1033399 1044148
50744 1044148 1059619 1078946 1100842 1125204 1153283 1186307 1224368 1266730 1312796 1362518 1416091
50733 1416091 1473571 1534781 1599435 1667321 1738345 1812344 1888875 1967289 2046934 2127064 2206531
50722 2206531 2283925 2358254 2429141 2495810 2555932 2605939 2642634 2664175 2669553 2657944 2629327
50711 2629327 2585683 2531125 2470764 2409454 2351107 2298481 2253295 2216666 2189310 2171190 2161199
50700 2161199 2157671 2159112 2164019 2170011 2173720 2171832 2161975 2142518 2112076 2069793 2016120 1953044 1883465
50687 1883465 1810431 1736872 1665663 1599424 1539859 1487273 1441048 1400783 1366902 1340176 1321028
50676 1321028 1309472 1305409 1308599 1318613 1335135 1358013 1386607 1419347 1454444 1490845 1527929 1564498
50664 1564498 1598849 1629866 1657308 1680965 1700459 1716329 1730536 1745116 1760647 1776648 1793106
50653 1793106 1810797 1830090 1850203 1870062 1889654 1910252 1933419 1959957 1989738 2022305 2057535
50642 2057535 2095806 2137635 2183147 2231781 2282401 2333729 2384730 2434680 2483012 2529155 2572373
50631 2572373 2611663 2646109 2675807 2702489 2728926 2757713 2790528 2827329 2864281 2892095 2898656
50620 2898656 2876062 2826108 2758732 2685528 2615034 2552575 2501615 2463766 2438507 2424183 2419327
50609 2419327 2422711 2432583 2446388 2461096 2473561 2480824 2480387 2470149 2448228 2413376 2365799 2307241
50597 2307241 2240051 2166409 2088513 2008881 1929915 1853187 1779417 1709061 1642713 1580841 1523259
50586 1523259 1469094 1417651 1369456 1326006 1288167 1255122 1225365 1198415 1174936 1155416 1139476
50575 1139476 1126490 1116209 1108644 1103866 1102018 1103094 1106670 1112342 1120340 1131050 1143964 1157823 1171974
50562 1171974 1187013 1203973 1223544 1246118 1271876 1300510 1331445 1364569 1400115 1437632 1475732
50551 1475732 1513205 1549891 1586225 1622501 1658820 1695155 1731157 1766363 1800850 1835279 1870353
50540 1870353 1906979 1946980 1992590 2044750 2102692 2165707 2234553 2310577 2394182 2484843 2582027
50529 2582027 2685445 2794865 2910326 3032201 3160517 3294503 3433030 3574850 3718000
50520 3718000 3859673 3997235 4128710 4251631 4362071 4455654 4529161 4580654 4608723 4612585
50510 4612585 4592540 4549427 4483857 4396797 4290730 4169514 4037303 3898299 3757406 3620219
50500 3620219 3492126 3377637 3280364 3203072 3147718 3115614 3107285 3121793 3156510 3207855 3271829
50489 3271829 3343377 3415619 3480275 3528746 3552967 3546607 3506846 3435028 3335165 3212233 3072150
50478 3072150 2922086 2769016 2617811 2471441 2332542 2203588 2085711 1978613 1881902 1795528
50468 1795528 1718787 1649840 1586683 1528109 1473646 1423240 1377177 1335665 1298355 1264806 1235470
50457 1235470 1211561 1193731 1181331 1173065 1167881 1165175 1164677 1166366 1170205 1175915 1183271 1192456 1203811
50444 1203811 1217564 1234242 1254923 1280250 1309321 1340051 1370222 1397434 1418811 1432420 1439215
50433 1439215 1442322 1444053 1444661 1444206 1444150 1446194 1450538 1456363 1463475 1472533 1484031 1497913 1514054 1532468
50419 1532468 1553158 1576391 1603144 1634808 1672311 1715703 1764576 1818735 1878450 1944030 2015080
50408 2015080 2090210 2167707 2246330 2325069 2402287 2475709 2543480 2604775 2659235 2706302 2745234
50397 2745234 2775118 2794408 2800931 2792933 2769960 2732429 2680724 2615314 2537665 2450643 2358008 2263810
50385 2263810 2172067 2086392 2009448 1942698 1886841 1842467 1810277 1790678 1783326 1787242 1801257 1823981
50373 1823981 1853093 1885015 1915645 1941361 1959109 1965973 1959425 1938312 1903301 1856230 1799284 1734892
50361 1734892 1665998 1595977 1527983 1464241 1405880 1353457 1307484 1268106 1234440 1204964 1178992
50350 1178992 1157277 1140539 1127724 1116145 1102918 1085735 1063010 1034691 1003181 972350 945003
50339 945003 921680 901916 885777 873645 865178 859355 855451 853447 853455 855064 857467 860159 863316 867278
50325 867278 871763 875998 879770 883795 888658 893893 898670 902947 907182 911260 914621 917327 920115 923287
50311 923287 926425 929310 932344 935907 940092 945215 951757 959489 967432 975062 982827 991183 999925 1008972
50297 1008972 1019061 1031048 1045042 1060742 1078140 1097524 1119401 1144922 1175768 1213216 1258155
50286 1258155 1312327 1377405 1450005 1517543 1561900 1570067 1542312 1490425 1428898 1367812 1312029
50275 1312029 1263793 1224216 1193004 1168613 1149532 1135004 1124382 1116543 1110628 1106848 1105786 1107117
50263 1107117 1109772 1113362 1118688 1126814 1138315 1153593 1173154 1197095 1224671 1254513 1284867 1313556
50251 1313556 1338569 1359272 1376832 1393172 1409778 1427488 1446575 1466413 1485364 1501428 1512813
50240 1512813 1517748 1514420 1501820 1480598 1452736 1420613 1386554 1352816 1321374 1293667 1270727 1253195
50228 1253195 1240749 1231444 1221817 1207797 1186088 1155611 1118165 1077396 1036777 998520 963947 933783
50216 933783 907619 883942 861619 841054 823345 808673 796189 785219 775772 767940 761488 756162
50204 756162 751926 748714 746235 744068 741809 739231 736521 734190 732446 730816 728684 726034 723336 720866
50190 720866 718496 716046 713412 710412 706853 702797 698554 694445 690769 687783 685429 683159 680387 677115
50176 677115 673916 671426 670050 669964 670986 672482 673836 675101 676950 679888 683749 688015 692359 696763 701333
50161 701333 706220 711644 717795 724649 732015 739864 748554 758616 770383 784044 800001 818721 840041
50148 840041 863059 887149 912771 940809 971474 1004544 1040524 1080660 1125645 1174938 1227435
50137 1227435 1281977 1336916 1390056 1439818 1486245 1530595 1574410 1619263 1666520 1716338 1766750
50126 1766750 1814032 1853866 1882163 1895612 1892462 1872943 1838716 1792047 1735551 1672092 1604300
50115 1604300 1534386 1464691 1397904 1336106 1279897 1229108 1184061 1145429 1112975 1085203 1060306
50104 1060306 1036969 1014279 991627 969093 947547 928035 911033 896221 882750 869833 857405
50093 857405 846254 837242 830396 825039 820776 818024 817451 819149 822449 826441 830587 834883 839507 844373
50079 844373 849108 853403 857144 860228 862541 864252 865848 867627 869280 870156 869924 868902 867862 867415 867386
50064 867386 866835 864986 862041 858755 855381 851555 847150 842534 837979 833534 829641 827017 825563 824192
50050 824192 822269 820580 820331 821860 824912 829482 835571 842692 850485 859490 870455 883127 896522 910146
50036 910146 924212 938813 953704 968836 984418 1000431 1016635 1032979 1049549 1066315 1083462
50025 1083462 1101687 1121513 1142595 1164503 1187953 1214367 1244222 1276607 1310229 1343867 1375767
50014 1375767 1403687 1426071 1442689 1454136 1461584 1467282 1474106 1483553 1494243 1502616 1504703 1497166 1477806
50001 1477806 1446306 1404599 1355964 1303666 1250626 1199840 1154105 1114803 1081205 1051370 1023843
49990 1023843 998513 976001 956550 939656 924487 910223 896042 881212 865421 848731 831171
49979 831171 812872 794673 777868 762875 748777 734793 721665 710789 702376 695292 688492 681710
49967 681710 674953 668321 662416 657942 654667 651496 647808 643998 640542 637387 634622 632928 632851 634253 637022
49952 637022 641737 649028 658653 669840 682238 695907 710501 724998 738227 749404 758231 764853
49940 764853 769684 773101 775347 776799 777967 778840 778303 774511 765980 752382 734642 714581 694272 675253
49926 675253 658121 642908 629835 619511 612376 608143 605969 605144 605449 606792 608728 610669 612493 614586
49912 614586 617153 619806 622087 624115 626453 629529 633506 638537 644742 651963 659891 668503 678235 689704
49898 689704 703264 718548 734235 748514 760109 768866 775272 779714 782382 783417 782711 779800 774356
49885 774356 766588 756880 745421 732672 719702 707350 695284 682589 669139 655732 643091 631519
49873 631519 621420 613207 606528 600472 594820 590421 588036 587513 588373 590459 593522 596883 600220 604299
49859 604299 610220 618089 627016 636365 646454 657931 670847 684621 698764 713309 728354 743194
49847 743194 756178 765614 770843 772513 772074 771008 769965 768181 763997 756377 745790 733341 719642
49834 719642 705164 691241 679617 670886 664168 658482 653660 649695 646109 642535 639466 637876 638324 640730
49820 640730 644693 649732 655457 661932 669774 679701 691908 705769 719939 732854 743505 751860 758453
49807 758453 763742 768164 772413 776983 781379 784314 784800 782675 778254 772119 765279 758743 752566 745753
49793 745753 737320 727029 715048 701546 687022 672620 659681 649065 640877 634544 629174 624298
49781 624298 620323 617848 616624 615739 614755 613945 613387 612704 612001 612288 614520 618745 624546 631710 640053 649151
49765 649151 658738 668891 679365 689126 697027 702690 706523 709334 712212 716092 720732 724388 725089 722088
49751 722088 715785 706697 695205 682133 668874 656724 646314 637711 630816 625577 622007 620056 619546
49738 619546 620277 622029 624229 625791 625802 624562 623635 624764 628774 635218 642539 648668 652241 653705 654924
49723 654924 657578 662198 668646 676884 687045 699205 713360 729408 746994 765493 783853 800050
49711 800050 811107 814763 811375 803614 794165 784208 773903 763261 752337 741567 732411 726902 726075
49698 726075 729225 734688 740456 743989 742775 736030 725326 713130 701284 691065 683520 678971 676921
49685 676921 677089 679796 684834 690922 697093 703867 712246 722407 734288 748779 767274 790460 818183
49672 818183 849521 881618 909087 926328 931146 925729 914412 901099 888342 877584 869785 866132
49660 866132 868077 876476 890814 909147 927833 941127 942785 929932 905319 874912 843667 814162
49648 814162 787927 765969 748032 733024 720518 710818 703618 697950 693671 691767 692755 695759 699530
49635 699530 703439 707082 709792 711120 711254 710566 709130 706747 702878 696609 687522 676764 666535 658237
49621 658237 651751 646546 642573 639796 637763 636151 635131 634716 634397 633937 633997 635370 637922 640797 643474
49606 643474 646202 649484 653430 657553 661068 663522 665207 666849 668930 671392 673878 675971 677424 678499
49592 678499 679887 681863 683789 684975 685845 687541 690423 693632 696152 697632 698133 697841 697259 697014 697180 697300
49576 697300 697249 697474 698162 698841 699210 699822 701494 704453 708491 713615 720102 728136 737748 748926 761396
49561 761396 774339 786516 796668 803817 807441 807603 804839 799830 793234 785711 777877 770206 763102 757002
49547 757002 752262 749020 747360 747400 748967 751397 753973 756382 758484 759991 760825 761501 762593 764095 765864
49532 765864 768419 772561 778416 785639 794445 805540 818980 834144 851123 871190 895216 921977
49520 921977 948392 971102 987775 997627 1001257 999901 994774 987354 979945 974995 973608 975391 979884
49507 979884 987247 997084 1007419 1015566 1019523 1018076 1010216 995509 975015 951243 927103 904940 886076
49494 886076 870607 857654 846196 835751 826221 817502 809565 802690 797191 793009 789867 787713 786809
49481 786809 787444 789670 793112 796925 800207 802646 804593 806410 808009 809156 809863 810306 810652 811197 812366
49466 812366 814399 817288 821143 826146 831842 836899 840093 841423 841924 842574 843682 845151 846825 848453 849484
49451 849484 849062 846433 841593 835530 829465 823803 818167 812540 807811 804903 803829 803977 804994 806944 809904
49436 809904 813849 818789 824538 830494 836072 841297 846672 852648 859599 868157 879111 893021 910303
49423 910303 931462 956670 985365 1017006 1051886 1089539 1125451 1150691 1156988 1143028 1115377 1083283
49411 1083283 1053160 1027543 1007231 992777 984382 981794 984715 992774 1005053 1020180 1036949 1054373
49399 1054373 1071283 1086641 1100383 1113333 1126130 1138790 1151363 1164196 1177235 1189785 1201278
49388 1201278 1211497 1219619 1223940 1223343 1218500 1210929 1201430 1190181 1177721 1164827 1151790 1138849 1127060
49375 1127060 1117709 1110911 1105732 1101748 1099603 1099946 1102681 1107468 1114121 1122180 1130677 1138718 1145928 1152230
49361 1152230 1157543 1161734 1164430 1164891 1162529 1157589 1150922 1143253 1135130 1127332 1120615 1115088 1110534 1107229
49347 1107229 1105690 1105711 1106545 1108157 1111332 1116285 1121905 1126698 1129764 1130562 1128482 1123152 1114753 1103776 1090961
49332 1090961 1077634 1065467 1055485 1047708 1041922 1038339 1037360 1039288 1044473 1053197 1065379 1081060 1101305
49319 1101305 1127607 1159687 1194207 1225922 1249785 1262256 1262098 1251046 1233196 1212703 1191735 1170618
49307 1170618 1149326 1128358 1108569 1090751 1075335 1062303 1051534 1043223 1037561 1034008 1031520 1029744
49295 1029744 1029388 1031102 1034489 1038547 1042483 1045690 1047484 1047505 1046132 1044063 1041564 1038303 1033704 1027308 1019146
49280 1019146 1009901 1000435 991153 982190 974155 968055 964410 963041 963769 966528 970549 974294 976740 978195
49266 978195 979432 980532 981002 980569 979336 977498 975222 972620 969737 966979 965639 967587 974309 986512
49252 986512 1004304 1026958 1052701 1079679 1106957 1133352 1155458 1168669 1170956 1164337 1151965 1135222
49240 1135222 1114714 1092576 1071940 1054502 1039902 1027144 1015560 1004838 995333 988329 985109 985762
49228 985762 989391 995093 1002049 1009175 1015723 1022077 1029098 1036725 1043889 1049792 1054711 1059640 1065503 1072565
49214 1072565 1080301 1088046 1095907 1104443 1113294 1120984 1126658 1131240 1136291 1142566 1150426 1160771 1174344
49201 1174344 1190587 1208183 1226349 1244751 1262713 1279607 1295723 1311682 1327205 1341355 1353731
49190 1353731 1364560 1373922 1381826 1388774 1395251 1400858 1404940 1407938 1411235 1415863 1422208 1430627 1441308
49177 1441308 1453777 1467712 1484173 1504935 1530713 1561273 1597310 1640775 1692740 1751429 1812232
49166 1812232 1868568 1913013 1939698 1947344 1939935 1924077 1905832 1889577 1878086 1872302 1871258 1873121
49154 1873121 1876508 1880731 1885131 1888720 1890634 1890890 1890661 1891554 1894330 1898506 1903358 1909008 1916192 1925341 1936371
49139 1936371 1949000 1962733 1976815 1990855 2005293 2020670 2036750 2052915 2069060 2085396 2101693
49128 2101693 2117512 2132965 2148499 2164209 2180125 2196783 2214601 2233045 2251378 2269983 2289900
49117 2289900 2311390 2334189 2358863 2386500 2417204 2450548 2487912 2532907 2589213 2659643 2748135
49106 2748135 2860759 3002118 3169348 3349182 3521916 3672273 3801601 3929978 4080106
49097 4080106 4251807 4410950 4508006 4513138 4437047 4319981 4200744 4092797 3984074 3855187
49087 3855187 3698100 3521568 3343340 3179025 3036580 2917454 2819933 2741150 2677767 2626590
49077 2626590 2585220 2552109 2525998 2505416 2488697 2474263 2460740 2447064 2432905 2419002 2406592
49066 2406592 2396160 2387039 2378309 2369680 2361247 2353067 2345507 2339414 2335158 2331866 2328459 2325236 2323559 2324042
49052 2324042 2325944 2328371 2331246 2334879 2339403 2344909 2351527 2359117 2367404 2376615 2387324 2399253 2410572
49039 2410572 2418699 2421735 2419322 2412728 2404313 2396501 2390974 2388710 2390256 2395356 2402620 2410266 2417217 2423033
49025 2423033 2427228 2429460 2430178 2430132 2429354 2427596 2425709 2425443 2427654 2431704 2436885 2443359 2451276 2460012 2468936
49010 2468936 2478162 2487950 2498021 2508119 2518670 2530247 2542747 2555576 2568219 2580180 2590800 2599700
48998 2599700 2607180 2613750 2619411 2623625 2625848 2625921 2624131 2620947 2616549 2610782 2603865 2596805 2590480 2584596
48984 2584596 2578333 2571793 2565802 2560379 2554585 2548104 2541800 2536377 2531583 2527298 2524214 2522608 2521299 2518780
48970 2518780 2514813 2510083 2504821 2498682 2491752 2484871 2478971 2474495 2471315 2468940 2467039 2465942 2466335 2468384
48956 2468384 2471696 2476182 2482289 2490134 2499310 2509903 2522874 2538840 2557299 2577718 2600597 2626567
48944 2626567 2655007 2684516 2714449 2745052 2776271 2807323 2837648 2867731 2898851 2932291 2968811
48933 2968811 3008607 3051666 3098000 3147296 3198547 3250715 3303859 3358999 3416645 3476114 3536491
48922 3536491 3597527 3659243 3721437 3784149 3847900 3912862 3978240 4042948 4106273 4167477 4225583
48911 4225583 4280324 4332647 4383409 4432067 4477497 4519692 4559713 4598245 4635092 4670006 4703201
48900 4703201 4735082 4766049 4796500 4826417 4854927 4880682 4902579 4919825 4931733 4938207 4940258 4939396
48888 4939396 4936470 4931486 4924237 4914486 4901639 4884960 4864317 4840322 4813720 4784909 4754050 4721313
48876 4721313 4686940 4651130 4613646 4573405 4528857 4479158 4424825 4367059 4306836 4244946 4182386
48865 4182386 4120074 4058347 3997309 3937574 3880239 3826171 3775626 3728373 3683913 3641796 3602138
$$ [...]
##END NTUPLES=NMR SPECTRUM
##END=
