
##TITLE=AC1325_PERAH11154_6608673_tQbYA64zly
##JCAMPDX= 6.0         $$ Bruker NMR JCAMP-DX V2.0
##DATA TYPE= NMR SPECTRUM
##DATA CLASS= NTUPLES
##ORIGIN= BRUKER
##OWNER= Administrator
$$ 1.72 TOPSPIN		Version 2.1
$$ 2012-08-01 16:18:41.890 -0500  Administrator@TOPSPIN
$$ Compression mode = diff/dup
##.OBSERVE FREQUENCY= 400.02188249412
##.OBSERVE NUCLEUS= ^1H
##.ACQUISITION MODE= SIMULTANEOUS (DQD)
##.ACQUISITION SCHEME= undefined
##.AVERAGES= 8
##.DIGITISER RES= 22
##SPECTROMETER/DATA SYSTEM= spect
##.PULSE SEQUENCE= zg30
##.SOLVENT NAME= COFFEE_meoh
##.SHIFT REFERENCE= INTERNAL, COFFEE_meoh, 1, 14.98509
##AUDIT TRAIL= $$ (NUMBER, WHEN, WHO, WHERE, PROCESS, VERSION, WHAT)
$$ ##TITLE= Audit trail, TOPSPIN		Version 2.1
$$ ##JCAMPDX= 5.01
$$ ##ORIGIN= Bruker BioSpin GmbH
$$ ##OWNER= Administrator
$$ $$ C:\Bruker\TOPSPIN/data/COFFEE/nmr/AC1325_PERAH11154_6608673_tQbYA64zly/10/pdata/1/auditp.txt
$$ ##AUDIT TRAIL=  $$ (NUMBER, WHEN, WHO, WHERE, PROCESS, VERSION, WHAT)
(   1,<2012-08-01 16:18:34.406 -0500>,<Administrator>,<TOPSPIN>,<go>,<TOPSPIN 2.1>,
      <created by zg
	started at 2012-08-01 16:17:27.906 -0500,
	POWCHK enabled, PULCHK disabled,
       configuration hash MD5:
       6B 1B 68 BB D9 2E 58 E2 7F 35 AD 54 07 DF 0E 41
       data hash MD5: 64K
       A6 1D E6 EC 48 EF A6 3A 6C B8 2C AA 48 28 CC 77>)
(   2,<2012-08-01 16:18:37.640 -0500>,<Administrator>,<TOPSPIN>,<proc1d>,<TOPSPIN 2.1>,
      <Start of raw data processing
       efp LB = 0 FT_mod = 6 PKNL = 1 PHC0 = 0 PHC1 = 0 SI = 32K 
       data hash MD5: 32K
       A4 76 9F C8 C3 6B 6B FA 0D 9F F1 D2 F7 76 4D CA>)
(   3,<2012-08-01 16:18:38.046 -0500>,<Administrator>,<TOPSPIN>,<proc1d>,<TOPSPIN 2.1>,
      <pk PHC0 = 176.7151 PHC1 = 0 
       data hash MD5: 32K
       61 AF E0 69 19 F6 9B CB 5D 20 02 6E 21 A2 DA B3>)
(   4,<2012-08-01 16:18:38.109 -0500>,<Administrator>,<TOPSPIN>,<proc1d>,<TOPSPIN 2.1>,
      <abs ABSG = 1 
       data hash MD5: 32K
       30 69 36 34 04 A2 BD E5 16 EC 37 B1 7F 0C 19 43>)
(   5,<2012-08-01 16:18:38.140 -0500>,<Administrator>,<TOPSPIN>,<proc1d>,<TOPSPIN 2.1>,
      <abs ABSG = 2 
       data hash MD5: 32K
       74 B7 79 FF 62 95 49 F9 88 71 7F 04 67 AB 93 F4>)
(   6,<2012-08-01 16:18:38.171 -0500>,<Administrator>,<TOPSPIN>,<proc1d>,<TOPSPIN 2.1>,
      <abs ABSG = 3 
       data hash MD5: 32K
       D0 53 C5 D6 0E 1F 88 C0 BA D7 A6 B1 48 CD 41 28>)
(   7,<2012-08-01 16:18:38.203 -0500>,<Administrator>,<TOPSPIN>,<proc1d>,<TOPSPIN 2.1>,
      <abs ABSG = 4 
       data hash MD5: 32K
       78 B8 A0 51 12 8D BD 57 05 AD CF D0 8C F9 37 E1>)
(   8,<2012-08-01 16:18:38.234 -0500>,<Administrator>,<TOPSPIN>,<proc1d>,<TOPSPIN 2.1>,
      <abs ABSG = 5 
       data hash MD5: 32K
       1E 43 1D 2F F4 15 13 6D 7C 92 2D BA 80 53 1D 30>)
$$ ##END=
$$ 
$$ $$ hash MD5
$$ $$ B2 7D EE 73 7A 03 F6 E4 BF 80 5A CB F4 50 59 96
##$RELAX= 
##$RELAX= 
##$RELAX= 
##$RELAX= 
##$RELAX= 
##$RELAX= 
##$RELAX= 
$$ Bruker specific parameters
$$ --------------------------
$$ [...]
##$TP= (0..7)
150 150 150 150 150 150 150 150
##$TP07= 0
##$TPNAME0= <>
##$TPNAME1= <>
##$TPNAME2= <>
##$TPNAME3= <>
##$TPNAME4= <>
##$TPNAME5= <>
##$TPNAME6= <>
##$TPNAME7= <>
##$TPOAL= (0..7)
0.5 0.5 0.5 0.5 0.5 0.5 0.5 0.5
##$TPOFFS= (0..7)
0 0 0 0 0 0 0 0
##$TUNHIN= 0
##$TUNHOUT= 0
##$TUNXOUT= 0
##$USERA1= <user>
##$USERA2= <user>
##$USERA3= <user>
##$USERA4= <user>
##$USERA5= <user>
##$V9= 5
##$VALIST= <valist>
##$VCLIST= <CCCCCCCCCCCCCCC>
##$VD= 0
##$VDLIST= <DDDDDDDDDDDDDDD>
##$VPLIST= <PPPPPPPPPPPPPPP>
##$VTLIST= <TTTTTTTTTTTTTTT>
##$WBST= 1024
##$WBSW= 4
##$XGAIN= (0..3)
0 0 0 0
##$XL= 0
##$YL= 0
##$YMAX_a= 474637
##$YMIN_a= -617913
##$ZGOPTNS= <>
##$ZL1= 120
##$ZL2= 120
##$ZL3= 120
##$ZL4= 120
##$ABSF1= 14.98509
##$ABSF2= -5.573092
##$ABSG= 5
##$ABSL= 3
##$ALPHA= 0
##$AQORDER= 0
##$ASSFAC= 0
##$ASSFACI= 0
##$ASSFACX= 0
##$ASSWID= 0
##$AUNMP= <proc_prof1d_extract_pilot.lims>
##$AXLEFT= 0
##$AXNAME= <>
##$AXNUC= <1H>
##$AXRIGHT= 0
##$AXTYPE= 0
##$AXUNIT= <>
##$AZFE= 0.1
##$AZFW= 0.1
##$BCFW= 0
##$BC_mod= 0
##$BYTORDP= 0
##$COROFFS= 0
##$CY= 15
##$DATMOD= 1
##$DC= 0
##$DFILT= <>
##$DTYPP= 0
##$F1P= 0
##$F2P= 0
##$FCOR= 0.5
##$FTSIZE= 32768
##$FT_mod= 6
##$GAMMA= 0
##$GB= 0
##$INTBC= 1
##$INTSCL= 1
##$ISEN= 128
##$LB= 0
##$LEV0= 0
##$LPBIN= 0
##$MAXI= 10000
##$MC2= 0
##$MEAN= 0
##$ME_mod= 0
##$MI= 0
##$NCOEF= 0
##$NC_proc= -8
##$NLEV= 6
##$NOISF1= 0
##$NOISF2= 0
##$NSP= 0
##$NTH_PI= 0
##$NZP= 0
##$OFFSET= 14.98509
##$PC= 1
##$PHC0= 176.7151
##$PHC1= 0
##$PH_mod= 1
##$PKNL= yes
##$PPARMOD= 0
##$PPDIAG= 0
##$PPIPTYP= 0
##$PPMPNUM= 2147483647
##$PPRESOL= 1
##$PSCAL= 4
##$PSIGN= 0
##$PYNMP= <proc.py>
##$REVERSE= no
##$SF= 400.02
##$SI= 32768
##$SIGF1= 0
##$SIGF2= 0
##$SINO= 400
##$SIOLD= 32768
##$SPECTYP= <>
##$SREGLST= <1H.CDCl3>
##$SSB= 0
##$STSI= 32768
##$STSR= 0
##$SW_p= 8223.68421052631
##$SYMM= 0
##$S_DEV= 0
##$TDeff= 65536
##$TDoff= 0
##$TI= <>
##$TILT= no
##$TM1= 0
##$TM2= 0
##$TOPLEV= 0
##$USERP1= <user>
##$USERP2= <user>
##$USERP3= <user>
##$USERP4= <user>
##$USERP5= <user>
##$WDW= 1
##$XDIM= 32768
##$YMAX_p= 462975920
##$YMIN_p= -704231
##$CURPLOT= <Network HP LaserJet P1505>
##$CURPRIN= <$Network HP LaserJet P1505>
##$DFORMAT= <normdp>
##$LAYOUT= <+/1D_H.xwp>
##$LFORMAT= <normlp>
##$PFORMAT= <normpl>
##$SURQMSG= 1
$$ End of Bruker specific parameters
$$ ---------------------------------
##NTUPLES= NMR SPECTRUM
##VAR_NAME=  FREQUENCY,     SPECTRUM/REAL,   SPECTRUM/IMAG
##SYMBOL=    X,             R,               I
##VAR_TYPE=  INDEPENDENT,   DEPENDENT,       DEPENDENT
##VAR_FORM=  AFFN,          ASDF,            ASDF
##VAR_DIM=   32768,         32768,           32768
##UNITS=     HZ,            ARBITRARY UNITS, ARBITRARY UNITS
##FACTOR=    0.250966925370066, 1,           1
##FIRST=     8223.43324360094, -12198,       -154110
##LAST=      0,             -214844,         66729
##MIN=       0,             -704231,         0
##MAX=       8223.43324360094, 462975920,    0
$$ Real data points
##PAGE= N=1
##DATA TABLE= (X++(R..R)), XYDATA
$$ [...]
23810 296172 114069 -47212 -171594 240728 -6995 -111168 223971 102415 -349781 357563
23799 -116475 145615 -112436 31946 3921 -63055 41252 50460 -194026 153793 -37032 43059
23787 22410 -140825 189671 273952 -238938 -245967 -167417 -199648 -18208 -57650 -12606 -53026
23776 -53026 164055 -301421 -21594 -28461 45970 -8924 66243 304578 -50092 -77857 -82003 -31700
23763 154543 -34296 -19876 2018 -7814 57179 110768 -153137 -552110 68734 64372 -301912
23751 -192518 -252118 -213365 -288916 -404433 -84972 -247913 -76952 30907 -1655 -138054 -156945
23740 -156945 -48526 207645 178553 291742 -18157 114249 116189 31847 74213 49975 -447750
23728 49904 419263 -19589 -146737 -16415 -236342 29076 -325274 20216 -202280 -111523 -108172
23717 -108172 -164678 -492853 -11875 -42994 196505 -218141 264118 -75629 185822 -219534
23706 216007 -353489 -261454 -24721 252227 -42930 46785 -322175 153386 -81263 176143
23695 88049 14581 99670 -81924 -61293 83961 -7439 79762 -63960 367140 -238859 -40806
23683 -49823 -247897 -11700 36335 171809 -170750 97498 -248912 190501 -89218 69864 25155
23671 199366 -270360 67241 95820 -259942 20648 85053 165499 -67001 20712 -189553 -31793
23659 -136601 299774 5791 362570 -332881 -75505 -439318 203853 -328579 44515 -207139
23648 117395 -28427 21550 -33152 -80906 -272337 327255 8729 123173 30166 -27946 67726
23636 -178197 21639 219496 173851 -50984 -380144 -358936 -22630 113160 -254028 -85091 -262444
23625 -262444 -222325 -148405 434893 -42009 -400007 -76227 -53806 -23596 -11780 259914 110816
23613 120043 231453 -71441 -128589 237905 -25265 10498 -39796 11952 -95054 57158 178680
23602 178680 133185 285418 163078 -127254 -89929 197639 -92212 -59277 -273313 53963
23591 66167 157878 51774 -83377 83731 25738 310852 -301804 126271 72905 -30520 219589
23579 -126172 83350 -306775 -279136 88638 74274 -144307 32975 -180265 82378 313839 137380
23567 25491 150894 89781 -66843 23690 -35165 -18926 -88868 27087 373132 7538 191164
23556 191164 -200600 3758 297087 -111066 184275 -73072 -62153 138787 -113352 170777
23545 -20386 -256934 -115623 -185488 -162482 533399 -92666 -139404 8833 -52822 -17937 -31060
23534 -31060 322447 128902 -15936 184438 -136925 95644 6000 212625 10494 33556 -117874
23522 -304297 -131131 -129774 51834 30036 22550 -86871 25689 59956 -225855 353377 6772
23510 -108739 -199162 392668 7717 110229 -212885 -91097 74211 -19135 -41317 242549 -334400
23498 12971 -9453 43787 -15371 123625 103357 70613 -25881 -241402 114620 18692 -265007
23486 -189437 -545552 -198488 28824 -110915 -226994 -90885 -75911 133941 20774 -43054
23475 -32034 -217702 38111 274232 -88091 -464285 100546 -36362 -341948 -213153 299850
23464 -329789 -41815 -230887 -45236 -279188 -67798 -116385 -209002 -160426 -149471 66983 -197667
23452 105764 -89337 65164 234078 -2628 -15340 86046 74867 -29569 248594 319921 121997
23440 -112505 -188521 290608 -164000 -21749 4807 264481 93540 63810 177187 -53899 -88216
23429 -88216 201850 -15822 -89210 -249911 -66756 99224 45840 -14709 -41765 -17985 -332177
23418 -332177 -26680 -74365 106144 -26065 -157847 27078 -141254 -164190 86991 -95464 173794
23406 3120 -270164 34435 85517 164479 -182310 147191 -174468 -63896 -492782 -261007 -182099
23395 -182099 -71711 138327 181785 -547466 -304553 -215845 -113392 90936 471813 -151708
23384 51519 120397 124945 -49365 228713 137565 -157514 -155600 -57424 248499 -188054 63194
23372 -350518 -8712 -89456 93434 42090 -9283 -211939 -211392 -80930 -189180 279465 -114894
23360 -92617 342958 -104407 216104 -146660 261986 -118934 -75577 56266 55847 -203393 -197630
23349 -197630 -225291 -77688 118451 -163330 286036 -69693 -27490 -177829 61213 -109058
23338 64194 32478 -77059 -419 -128292 -254957 -84974 -54922 164895 -261945 216277 3233
23326 -279609 126867 -96941 -192514 -316911 -47304 38497 -387491 154238 -9162 -24294 -269943
23315 -269943 372459 -372499 -314197 82278 -168929 -74936 -227971 -116555 -367676 68955
23304 287455 -71154 115432 -46023 -156134 -243612 39440 -264244 67779 -98779 36734 -234466
23292 -102817 154939 -122909 -154324 153821 -1800 55722 76178 111905 13716 232704 -411700
23280 293505 241354 -151894 85082 103453 119229 -73839 -77589 -217084 -16364 -15146 -13052 53056
23267 -180383 184997 308220 -190962 -60319 -7943 33476 111021 -91380 97541 -35104 33552
23255 -260700 32417 -253056 320041 77995 -50275 132058 -310603 206768 -208294 -11223
23244 90163 -147724 106252 -153963 -30267 256040 -407018 -33605 -299062 69813 92300
23234 92300 347987 -46741 20992 175964 7032 -152747 -188961 -395296 -298393 266011 -5185
23222 49723 -268454 21078 98177 89406 248539 -387 -120377 -234031 98729 52919 -9750 -100352
23210 -100352 -149450 -240901 -159197 -104043 73370 207395 -28053 69130 72769 -130223 -139532
23199 -139532 -7194 -65822 -5173 -79448 355990 -112849 -138130 69827 -137543 -99572 -174112
23188 -174112 -114912 -289674 16589 -130371 145449 266157 -79330 37539 150004 189148
23178 189148 187371 213211 -31421 -17573 -164035 -301637 363257 -307715 128312 341660
23168 341660 -106223 -187179 59703 20458 -262824 -392488 15870 62555 75217 97757 113470
23157 113470 -298262 187498 -51973 -159542 -431274 -117612 -112970 -112023 218873 -75310 -191249
23146 -191249 -279320 -14366 168116 -136702 178950 -24274 -23154 94500 274567 -49693 -404593
23135 -404593 120826 5409 -79203 138180 376569 -461313 248319 -171655 122244 339086
23125 339086 168890 -58392 -44613 282648 -445484 127847 234665 143405 -216995 369015
23114 -54250 -47516 17566 -303113 -52152 183485 184105 -459 -61353 -110958 -109566 -8963 -10913 194502
23100 159946 -130602 56178 -105692 100596 251087 -13665 213616 209572 -225972 -66798
23089 340155 4478 138452 -62206 -263410 -9821 185911 -134827 -95769 135093 35306 -70687
23077 66863 -28329 43317 -287406 -139230 80732 -28393 148607 -32126 24187 -296312 -75548
23065 274618 92667 157384 -248014 -417772 -152433 -13102 -6445 -220243 -2507 150907 192952
23054 192952 55398 99094 245440 6334 224365 99043 63690 278502 -117454 -205945 178767
23042 11736 80421 163142 144396 20014 110308 54770 136703 102765 -94231 -177134 -70719 -49842
23030 -49842 48841 -120013 -318235 -118552 -51485 -23727 -182258 19 -188082 -135306 -99431
23019 -99431 -260715 -54059 -69965 -35401 -301947 9921 101543 128483 -219213 84771 -591 -132175
23007 -132175 -130120 -91985 72402 -71368 153902 -70581 -26260 126669 -220241 41784 62922
22996 62922 13108 -127829 -58720 226033 65361 127230 21338 -13675 -75110 6583 44670
22985 44670 -423528 4758 63413 -23876 -182249 -210094 -91396 -29700 -115581 -18162 113440
22973 40150 -37323 -17437 126057 25740 7304 78556 -329262 -169961 147872 -60952 278003
22961 181884 75111 -255100 -69965 170246 35210 177567 352517 -217476 299388 76720
22950 192120 -260350 83444 -230366 -311267 -81382 -356488 276473 -125384 310538 406539
22940 406539 -65604 -328156 -77081 -318365 -214866 48982 70361 -59530 -171299 -281602
22930 -281602 157144 -9034 -243561 -323712 -158628 31050 -444445 -19575 4030 -318097 -100141
22918 63867 -49996 -106169 40153 100839 317276 -165211 228297 -269940 54984 -56528 -485270
22907 -485270 -170746 124180 -161381 81233 140059 -259818 93219 -438508 98187 -220213
22896 -256002 114234 136650 17350 122478 171656 72700 290223 -14672 499482 69656 -177982
22884 60587 -55660 69115 -241665 -222362 175470 -178943 15555 161158 -196914 -53671 72698
22872 -60026 102107 97123 -252252 -221600 -64478 22513 -272282 139642 -92656 88769 -142904
22860 -48808 319149 165653 250963 75844 -133563 -22790 46136 -78678 158333 295 90421
22849 90421 -39271 -40566 -290057 122503 -127716 204693 -68907 13811 -150109 502151 -162112
22837 211314 -185410 224826 -301247 -190391 -213459 70799 78020 49475 -127794 -81912 -339423
22826 -339423 5714 10521 30187 204975 161459 68490 -268627 -25685 -209245 -169744 247995
22814 -443903 -247064 -146889 -36425 -154596 -13450 -140192 120690 -194423 -293127 -147906
22804 -147906 -357160 152429 125322 -123887 -14386 -360683 -106272 89703 -166462 -414265
22794 -414265 11266 49398 -9625 -213077 -125600 -179197 36177 -226568 52910 -11216 -98561
22783 -98561 121833 -121644 -66887 57052 184411 -103135 71109 29158 93546 -178732 -98364
22772 -98364 -49217 -32650 -230742 -492982 -4136 14424 38922 -50899 -81293 78757 -194539
22760 -421061 -369340 -52773 117678 331213 493178 -163562 120892 48935 194722 7383
22749 15684 51752 1277 62250 123677 -128473 -17963 164011 -363935 -103885 82522 -262816
22737 -68677 -9923 133574 204485 -109619 143963 -98966 126376 -46451 -5564 -363283 -292477
22726 -292477 -86612 219432 -264967 16308 22311 -120082 -12097 -205230 -208708 -210444 250710
22714 122532 214146 115668 -150272 195180 -239156 -32105 -33157 13310 -31711 250989 -74311
22702 -94188 216291 -113851 -89230 -85614 -157941 -250909 38460 -98093 80587 -73976 214699
22690 -40164 -142894 101790 2913 -174334 -61167 -65427 392531 181342 -67730 220812 -207215
22678 -35129 -143288 -268870 -12221 130308 -56685 79893 -106037 -125884 -364112 -457140 258677
22666 158426 28354 14048 -164870 -261532 -135916 -18214 -243856 62302 -259906 -54048 468074
22654 128234 20969 177736 -215650 -193040 -28608 419989 6658 -8209 -75291 179931 -90123
22642 139878 -122025 -118273 -22784 -455967 76204 180870 -273510 -96609 268001 43531 125495
22631 125495 -127589 -138365 -52048 -14632 -504127 -154680 -45927 -20368 -304273 255466
22620 -61389 30448 -147053 196833 -217227 -152396 -89326 -122710 208701 -132774 101959
22609 23316 -185514 -11241 -315585 12564 -135855 -124046 -459248 -11412 211063 53283 -249618
22597 299043 53835 -157687 36932 -168961 39265 -36982 95442 50144 -210256 -341038 40655
22585 217004 -48367 -90134 -132619 -315659 33335 -24602 123022 -47368 -282995 -306134 121282
22573 220761 2203 -79479 50470 -46184 15864 -40084 -268473 19649 179467 248790 -21336
22561 -241293 7844 -374781 -275719 -246088 -164500 -115216 51395 267862 46390 95651 28340
22549 103595 59948 -94801 195594 -145135 27824 -213448 -71999 -34652 -110171 58384 -36815
22537 20481 -121424 -359642 -3919 -243997 -164951 -73110 195531 49197 -140578 -10206 -143097
22526 -143097 3106 -248466 -9997 -122759 -17407 55939 165728 128753 -138782 76119 -255483
22514 -287502 -104561 -16930 41236 -104185 178516 206619 226988 -213852 -64228 -39642 33785
22502 -1387 -318292 -257961 -79547 -260896 10619 -185597 42643 -169708 -207228 125824 61428
22490 -25684 119744 -161614 188185 -73774 -17478 201799 253434 -117006 440684 23570
22479 71441 130026 127935 -246437 14023 24007 -222389 -48995 24469 -477883 146748 -198471
22467 -162023 -136651 -7389 65174 167240 56296 -162836 -61216 48220 -246703 -7914 -72068
22456 -72068 131791 216165 14481 274988 -458567 32776 -9694 -19208 -168283 -356444 -153101
22444 163525 -149003 19721 -62877 49624 940 -83433 238276 -88671 -332126 -37851 -96883
22433 -96883 -97789 111487 -306390 309051 -195775 -148120 26850 -22498 -29717 307973 -8169
22421 -262340 92008 -119486 -56618 -25316 -265027 202911 31107 -51491 22097 -441648 -18645
22409 -230363 57989 -3738 -11068 71497 -157796 -259947 -58373 81132 167913 -281324 206472
22397 69466 -120962 -2461 -30043 108382 243104 216236 -254607 -194053 43459 -81033 -110583
22386 -110583 10625 337334 -185958 -244938 -39213 89227 29518 -90027 -161711 421885 115835
22374 -29745 -223623 69209 119982 3221 112803 -439593 -269057 -83289 -82034 -63479 -150384
22363 -150384 48811 1741 109451 21284 75601 -124138 -132117 -281860 -22894 22133 -245418
22351 136737 60660 -192297 -342432 -184208 -95404 -194591 -208317 -41964 -65871 -424021 -35801
22339 -116106 -92498 -42445 189896 70082 -66443 97653 -37540 76752 105229 -289810 -301990
22328 -301990 -4393 -268420 329690 124320 34263 -99629 -65380 -150273 -150385 4836 -63222 -180662
22316 -180662 32619 -94531 58055 29241 -213490 74778 -55444 -134560 -148097 -217683 114184
22304 36450 6680 -452456 52456 102893 -103381 -174225 -175644 -266443 249200 -89002 8490 424867
22292 424867 4184 -195020 -145836 49845 -59952 145393 280022 17848 -47025 153174 123897
22281 123897 -369976 191298 102198 -107907 -46191 162839 217923 -77998 -104871 -41756 -90283
22270 -90283 -46453 22319 119257 -137586 -66112 -173987 -54030 247566 -99849 -145573 -276673
22259 -276673 -67118 -206108 -127802 85846 155033 -144732 -54547 72293 57828 -221520 153216
22247 -25361 221685 -255824 50194 -210950 -112477 -91889 261857 -177444 4496 -82925 130376
22235 95494 -110566 -5829 -75274 6002 -95488 -25507 158872 -301882 9723 80746 -145650
22223 -321868 -180454 -85041 2685 -138723 -53443 -131842 197203 -40675 232767 -140638 -153142
22212 -153142 -529929 -179099 -163808 -336421 -189568 32686 -6985 -27882 -54488 110509 -62222
22200 175637 -173155 -38811 137335 -265319 -371757 185195 183743 -61712 -305634 -233379
22190 -233379 -87667 194107 -79791 -93952 139687 -30257 -103855 -254045 203952 268550 178849
22179 178849 99601 -28733 -38078 4935 -122734 45761 357082 -134454 101491 -29715 -46412
22168 -46412 35291 138301 95004 64031 -63199 -184870 -86552 285026 -50514 -360368 -115900
22156 243596 45491 125880 -73246 -262356 160762 14422 -66557 -147869 27871 22323 -294033
22144 -150429 -412538 -165455 -91365 -201 32851 -31450 -84171 -99683 -100337 -385030 -166724
22132 -42196 -10097 -352005 62104 -78237 88412 69579 7256 -399484 -203716 -187715 84070
22120 -307718 -179865 -173495 -274748 56350 -278163 -23430 25530 -561583 -68328 -104890 -35582
22108 -418098 -46486 -188860 232556 -350135 -60384 -21474 -425506 -180322 39704 -76084
22097 -160521 49201 -155150 -31700 369128 -106595 -36373 86938 173646 187683 -339255 -221861
22086 -221861 -266529 215778 -165438 -168759 -201650 46136 -102909 -339045 -259433 -189405 -47001
22074 -79398 -268732 70788 -35138 -65501 -35427 -128434 -120692 29120 -42358 -79524 17206 -244018
22061 -202503 13740 469564 -14896 -62989 20609 -258563 304816 -42327 -164522 -138389 -54361
22049 -26117 40242 40423 4389 -138424 -95527 14841 -1412 49393 -149782 -414793 -263402 219474
22036 -96449 -45926 -59854 39106 34125 174126 -11279 -256613 26750 77260 -99065 273408
22024 -296994 81674 -112244 -8404 -25817 93260 -285025 64425 -224634 -47671 -90136 85430
22012 214715 94219 23525 30627 -369160 -496873 184336 -104777 215316 191505 -377378
22001 5341 -95264 -14257 -343014 190038 -332802 -172347 77736 92625 -91739 -35507 220765
21989 -49230 81377 -132739 244815 -162417 160112 262863 -178383 -100914 -86768 111656
21978 -190189 -289188 -332109 -125869 -4000 -230202 -113777 -126978 -2932 -271119 5342 128956
21967 128956 -130389 42189 160140 72658 -1993 -152351 150153 87430 -16606 298367 168373
21956 168373 -81483 -163716 121579 -121392 1170 -281649 153062 -173589 -201095 78960 -192822
21944 338510 -13330 -65546 134731 -312840 -141156 54964 -510889 63701 -118691 381644
21933 -185568 271831 -377045 -50909 -6495 -199949 -7265 -42102 87500 -313869 -170704 -216145
21922 -216145 -78749 289340 -4784 11067 -22727 74783 240099 -298088 -276960 -271810 232875
21910 -200480 -127566 196251 578 -69567 -114989 276543 124698 -115036 146351 -224629 -143590
21899 -143590 -263987 -230201 23643 -166337 -156998 -129973 625 82673 165090 -202775 -331528
21888 -331528 -464277 118597 24794 163466 -23423 -418917 91811 -352826 -217260 -125157
21878 -125157 -146049 -47494 -8668 -265600 23301 -79944 84747 -280643 -301439 187281 -119209
21866 59169 -76435 -26928 -106916 34046 23791 170745 -83849 -122826 -253360 -308542 64538
21854 -388145 396347 12026 -282401 173654 -88125 74992 348064 14418 262553 -23556
21843 87746 -275765 -115841 -175397 20290 -38756 -1964 -251832 86073 23829 102753 40389
21831 -57354 73716 -85007 -57668 11576 -244926 -119582 -140654 74401 -236607 61094 -97857
21819 -50934 -211795 -81435 -200755 178778 -31367 -383123 -136849 85353 106298 -139286
21808 33100 22692 62275 -32237 266702 154297 -45341 -174168 -136311 -403670 44105 -20761
21796 -88295 -177187 106799 132945 -163533 128507 366970 261925 -19 -104918 -92178 -65239
21785 -65239 199123 -151908 249645 149902 -63317 -26356 284531 -106316 124788 169382
21775 169382 -320106 -316973 -377205 -58038 65569 2002 -40030 -173167 13886 160457 153956
21764 153956 -19386 -106627 -17562 118036 -127245 -48388 14283 -22623 35721 -13673 -249319
21753 -249319 102390 5951 124128 422326 -279376 94608 -247809 -39524 255746 -244939
21742 88464 -33045 -25592 68719 -212306 -52999 345770 -305567 67370 136302 245217 -293093
21730 -179723 3892 143965 -269032 -235680 -55384 -199326 -59479 -343631 -158507 -152194 -133128
21719 -133128 -236222 13765 99431 -191933 47557 -59631 25612 -408058 -99763 -501627 15455
21707 -218200 53608 129283 105649 -102836 -266363 -154240 56824 -341408 -345691 -27692 -212156
21696 -212156 -244776 -556043 -162129 98207 -131800 -120567 -133625 283350 -147510 237268
21685 17887 -86230 71983 -68166 -60178 -231331 -210369 -18366 -75251 38217 -271462 30489
21673 -85277 141480 -308571 61943 75220 -182679 -12651 68320 105735 -191552 -33239 -62503
21662 -62503 -148703 -335085 9849 101056 -241945 198144 197331 -192482 95303 266762 39881
21650 -295833 -190514 181300 105824 -44964 41755 84532 -194192 164114 -20587 83983 -139129
21638 5741 -270872 86850 141329 -93630 -299441 -237359 -164358 84636 -37316 -230178 -100089
21626 -54916 7032 158505 -305454 280724 44080 -140439 -80608 -384892 -88864 89612 315845
21615 315845 104054 192336 126279 -235933 -251867 -19622 -88972 -141791 -251449 -190912 -1035
21603 -177210 -73531 68595 -272429 -225786 126972 154616 -335239 -183828 -314440 -156602
21592 -114595 214260 24328 -22474 -141107 -307829 -23071 3999 105029 287350 -453547
21581 107327 -55915 -313328 -142741 80481 80140 -291181 -389943 89510 -132452 -54978 34735
21569 -111491 -407659 -170570 -312755 -20501 226242 -428997 97212 -121144 -106711 -190627
21559 -190627 292717 111353 -215294 -159425 37295 -120675 -83943 53873 -290051 114741
21548 -194411 105053 -332543 -328718 -27488 -252922 -226928 -49202 -59952 88844 210969 -214299
21536 39207 45087 -14027 98665 -36535 -167299 -340406 -109972 -74670 -451307 214985 256887
21525 256887 32523 -261571 23357 -107860 -121106 84147 -209896 -164183 137864 118016 -170637
21513 248250 141592 16451 118947 254472 297928 27358 -15246 -231642 -243316 162736
21502 -155926 1542 -406006 -3083 -211680 -5018 -170111 46067 -127842 -221632 -130160 72294
21490 -120985 200502 -87471 -25751 83647 215500 41123 -122427 -24572 -222860 183595
21479 198858 -62453 -7342 -93646 95485 -22741 314214 -333380 -110804 -59925 -185275 -112608
21468 -112608 -84318 -346221 127646 18678 84342 -304276 -151163 -66477 41460 -19360 3439
21456 127996 62525 -245241 -140159 -221047 104834 262753 -100356 -267906 -36221 -438218
21446 -438218 85682 28058 -133191 -105997 142169 -51609 60929 -124325 451329 234269
21436 234269 390789 657663 367859 415501 195377 233381 269169 -263077 77206 -64529
21425 -181110 -410775 17061 109696 -70843 40037 -225466 -56419 -542161 3164 -173345 42782
21413 -262707 -16905 151539 -193180 -313007 -69004 -70391 139573 171258 -94669 186523 -268532
21401 -34427 21919 -153221 54680 122527 107264 47405 71495 -135799 61008 -178801 -313221
21390 -313221 -43867 249226 276211 -62450 238839 -53691 -71218 -331259 5129 -292419 -286586
21379 -286586 -389129 110726 67949 -127798 -198729 60565 -13494 113352 -127887 146902
21368 70793 -32688 -446254 -270895 -6016 14255 -13955 68186 217308 -111932 92926 -19436
21356 -269671 239145 40643 -386571 -359938 -235892 32027 -98635 -166443 131849 -313131
21345 -356592 -141452 -371354 -214783 40155 -91646 77160 -138701 98282 133272 -25929 161463
21333 96847 -139868 -302897 -75852 33909 -98591 -190762 -408951 70361 195170 -318368 211345
21321 -197237 -50402 63128 203418 -48372 -156053 183576 -24415 -356129 230079 65355
21310 -251439 -420901 -61792 -126318 -17895 -471678 -260365 -181137 -29736 -230821 -105181
21299 30049 -329080 -161577 -93859 -309997 -73083 115512 25841 205555 -89491 -113913 262146
21287 98598 -438385 44854 182910 210107 -32393 -325072 -25087 18927 -111483 10031 -15524
21275 -67639 -111432 -53166 -280553 -294834 -39238 -219484 -258528 23217 -341431 4947 -31544
21263 134276 -236753 -51205 -91171 -22472 -78064 -68561 8309 112592 -7628 -86665 -133910 73636
21250 -233667 -102676 -176664 -209543 -218986 -174424 -109838 -295422 -426036 -46046 822 -108478
21238 155114 106079 21407 -166842 -326187 -36046 229783 71530 -293634 -77800 -21152 152802
21226 407532 35527 -202412 -104183 -40700 -177758 -11772 -118493 -191343 211145 272308 -30555
21214 -16905 11093 -45882 91146 -134727 -127595 -127595 -112777 41537 -115140 -3918 208614 153337
21202 153337 -172240 112367 125303 87332 -88393 46897 -34827 -133166 -151004 -92369 -335195
21191 -335195 34898 -44056 72571 150539 -154474 43343 49612 440334 96167 -369230 75079
21179 162983 -174662 30638 -438543 -76193 -9234 13910 -202956 2478 274896 27440 256966
21168 256966 6698 59459 203059 27174 -201297 -67748 -35527 68818 64432 19629 29104 -96763
21155 -314647 -358683 95417 126998 -574218 126325 28771 -411960 304822 -177976 -339183
21145 -339183 -310073 -47380 -360656 68197 80360 -206659 245128 -89173 -226351 -116371
21135 -116371 141853 232429 -49469 -226007 -1664 248667 -62399 183960 -154416 -280290
21125 -280290 -26439 42810 132447 -94980 83377 50163 -104498 -63563 146064 -71882 -50871
21114 -50871 85815 160251 -72549 -490731 -191043 -43906 -199752 86570 28720 -270300 -59592
21102 -131533 -153323 -304771 -182712 -306988 -72415 -117272 153221 -124574 37268 -40132
21091 -91048 96851 -189021 176016 38916 -167395 -28239 69444 -106414 -322466 -112237
21080 -22595 -140668 21039 -49548 -131295 148953 -187575 97118 152792 95378 140652 -23369
21068 71868 -3156 -193610 -63018 107861 -140501 -25447 -36658 -117467 7173 44772 -186074
21056 36838 -216938 -82385 -237543 -87578 -24584 -424646 -9678 -345428 86095 317888 152415
21044 -211580 112126 -165633 -29684 -100954 177538 168105 349684 -61114 77366 206827 287531
21033 287531 -105649 74456 242254 -58554 -58792 -129746 65877 197499 267055 -150266 97632
21021 -171031 -25741 -100547 -179585 266118 -196122 82906 -235218 -327500 -75986 -419660 107749
21009 238946 90536 -131231 263743 136631 370097 253924 224061 268989 196703 -295127
20998 78692 -122977 175103 -250198 -104582 -160495 -59402 13489 83070 -85067 18674 -308472
20986 -102370 -24774 -10950 -167028 61781 67618 51988 24470 134462 -225699 -43513 -115967
20975 -115967 -147575 -26621 210000 -222018 -2710 -63662 -41258 104736 -194908 15660 -26550
20963 24532 -118494 -42355 -87779 -127187 117403 119690 228573 -109778 75365 -7423 -99209
20952 -99209 -22254 -7439 226464 -81483 -98974 12990 400015 422041 361655 189362 210763
20941 210763 608514 155622 480260 106138 216438 -384670 215095 -85601 -231377 -205837
20931 -205837 38764 106849 87687 -120631 -49634 252321 -192857 -149286 -67559 -90988 -17907
20919 88044 155004 134496 -106786 -80490 258512 -33797 -19948 -223148 -136797 -214293 -176773
20908 -176773 -16265 -314466 -11760 -122214 -278042 -67515 -71550 -217307 -48839 -58675 328784
20896 -234528 -329426 219519 -37508 20215 -141699 -51731 13900 68850 -260673 -20837 -88762
20885 -88762 109722 189034 -59265 103244 218374 -180877 14205 133621 -268038 -81102
20874 -141087 -298862 -61311 -276428 33838 -38915 -58783 39126 -214965 138070 -119132
20863 157736 -407265 74256 -351543 -96140 -102971 -311314 -15492 -217192 -79577 -83616 -385321
20852 -385321 -125476 169017 -28818 -132495 199157 -49437 54885 -40026 -217611 85173
20841 5270 -112930 -60794 -228511 -201304 -174819 -297580 -315695 -121418 -97438 144724 232016
20830 232016 -461912 -94102 -70621 -109394 -41715 -275277 -103116 -110645 177830 -23566 -150749
20819 -150749 -269678 -203527 -39190 127990 -168 -79317 79509 -335167 -200858 -16808 -300180
20808 -300180 14634 -360329 -320173 209205 -74355 -2477 -81696 22656 -223426 -185638 -25870
20796 -117995 -28868 -156292 -310644 -7608 -148209 -191948 68463 119451 18032 -68452 -200720
20785 -200720 -10018 108817 -114361 104397 -214937 11960 28611 19401 -38044 -226406 127479
20773 -207565 116833 -84276 -25698 23062 -264494 -431615 -259568 162725 -136135 94534
20762 -13422 -113413 -93071 62842 170382 -163804 -55274 -229305 35930 68484 -319878 -144970
20750 -39951 -109321 145684 -46499 -72372 -14435 216756 76450 -188640 -150415 26015 -250181
20738 -88090 -159461 129554 -243878 59419 44185 -270804 -312252 182039 -233179 6538 -292505
20726 68832 24764 -392818 301530 43222 -217163 24986 97963 74250 -210781 164782 1160
20714 -238493 -123194 121319 306696 237832 151026 -370951 -152760 90614 -237647 -156147
20704 -156147 109368 -102890 127416 -266040 -75188 25427 -17893 -103413 -71230 -292461
20694 -292461 279392 13004 2063 -33009 -153495 21061 -45367 -249801 -326806 32371 -232489
20682 -110517 -19082 -99595 -123604 -109944 277780 25767 325135 -109606 -159369 -146765 188635
20670 241921 -82297 -116789 99497 95945 346840 -209181 5918 -393355 -426372 -13794 371159
20658 388789 33129 10184 106543 123859 -195074 -102715 16408 333516 211978 -31240 -217801
20647 -217801 174377 -206009 98795 -58154 -109282 -13589 240171 -21687 -202101 -161245 -57864
20635 -491360 -102590 -115968 233207 -113929 -325570 246099 130654 96821 -432175 94285
20624 -153882 35937 217504 -398852 238243 3470 -79706 -241995 177072 7389 -206864 113845
20612 -27453 -255237 -58487 -78897 -190685 -60209 -211812 -47936 -209810 49952 -352571 12002
20600 27598 -40965 -112414 -218979 74857 154645 -565149 -38991 -179378 -197387 -75519 -35238
20588 -221688 151673 85501 331301 201802 -168130 136918 136252 -411199 116697 -42599
20577 47406 192946 97958 -146542 -240489 -16519 58362 36121 -212535 130972 190545 110639
20566 110639 -164981 -58653 -6011 -245835 -98929 -161457 81068 40380 64728 189685 -69497
20554 48617 15042 -393035 -175298 -3877 35267 -517599 -24578 -126504 -236904 -47987 -199076
20543 -199076 -268107 -409542 220201 -233111 49946 -107594 -11306 -196525 -65358 -191936
20533 -191936 84880 -2748 -21257 98088 -31225 260473 61296 27678 -268153 104162 -87000
20521 -35887 -204041 34448 -226822 102962 -165197 -1332 -189559 -39615 -100507 -443678 -285800
20510 -285800 46547 -244281 -331280 -496980 -56825 211761 22402 -321724 21319 -89519 125232
20498 -32830 -145188 77346 -54167 22735 403232 -153425 131252 -279534 77465 63641 26207
20486 -300495 -85238 15906 -181106 -148518 -108546 -252247 56673 -105378 -65960 -321007 -98772
20474 -192023 -96150 90604 174216 281636 -336252 -251052 255271 -301590 -467598 -237904
20464 -237904 -318250 -239017 -106036 -48920 270325 305485 -106077 -397787 -153836 166862
20453 -184058 -12330 -29108 -276512 -16104 -217355 -230312 82304 -181316 -156431 -270971 118889
20441 28701 -226583 -38196 -149134 73671 -64666 -90774 199007 -144362 -84867 109492 221097
20430 221097 -371828 -193533 75233 -14746 -108907 -43991 -62610 -61476 -238784 327509 -195222
20418 20932 -91196 160220 298330 -244709 -41299 -112076 -15506 223000 -135135 -163408 -346211
20407 -346211 74903 -376332 -172449 -111883 163489 35533 -24736 -375654 -86700 -24649 56268
20395 -171023 103207 -166388 36199 -62022 -25868 298466 -36943 -478888 -221312 -202109
20385 -202109 -154656 -27205 43861 75719 57543 -308277 -31517 -160811 -3568 -436394 -143996
20373 146250 100975 -143650 -163968 26006 -213262 -91536 -85016 -127533 14101 110347 114989
20362 114989 57243 -308128 81279 -5038 215262 -193466 -18528 -64493 -212618 -83823 -179160
20351 -179160 -155814 227007 5704 -235183 46507 12254 131499 72766 -112770 204102 -155389
20339 37109 97600 -458804 -335742 86083 -19547 -242269 41782 -16994 -208020 220870 166449
20328 166449 -152925 -5969 -174113 127259 -305135 292862 -3449 -144524 -15511 -585942
20318 -585942 -171787 -9313 142519 -89363 -317621 -48832 -213476 -182373 1546 -190699 37262
20306 -426370 140805 -888 -188753 -174570 -267543 193148 117862 -88219 136226 194034 53172
20294 -212218 -260323 -44295 -158525 24267 -66995 18104 -72735 -12504 53024 -52086 -206092
20283 -206092 -21584 154033 -22503 -271689 -61785 -364949 -56104 -14412 -285588 -76466 -17425
20271 166130 -216230 -149914 -62747 -53932 -116916 69818 166783 75700 -179834 68977 -132213
20259 106434 208542 55165 175432 117801 -8425 -5164 -297196 -67177 -41229 -248914 -157568
20248 -157568 -151277 160771 5755 128891 29250 79783 -35215 -330748 -79034 -38809 -142363
20237 -142363 -145137 -211060 -48444 -125913 -60427 -223495 -72885 -4038 102004 -45788 -60663
20226 -60663 -101581 -79930 -365560 78721 -50302 92280 -1081 -34318 -50475 146336 5407 -197705
20213 -291854 17351 -133440 -138456 -121825 59904 258753 -49125 -57012 55790 -131708 -150894
20202 -150894 -151553 -392022 -250529 -209500 -75700 -56527 -118487 58803 -40320 161827 -136181
20190 -119261 -38509 -136417 365852 169304 232143 61016 -243635 110204 254166 -148055
20179 150187 -87395 167744 -88020 -4886 -214960 -109676 189458 170806 2111 293525 -23278
20167 26756 103886 108718 19073 -6932 29059 375 -73935 389525 -41672 -135998 -306003 277562
20154 -211796 -109653 -321664 154505 320608 335742 66508 250293 303139 228628 264368
20144 264368 347731 411652 250520 -80046 180843 585028 403958 361109 216365 20827
20133 235391 101818 19983 308391 -256392 -141132 -243283 131450 -324028 122473 -49635
20122 -318258 7361 -254529 -95563 68795 -8916 -105713 -20077 300579 -120186 -17206 -68192
20111 -68192 -229786 40956 -263878 -4218 -67422 265166 199967 12200 20822 -42855 -271049
20100 -271049 -68951 -135949 -216082 -257255 -131486 154072 -35714 -300774 292963 -82675 -47099
20089 -47099 52753 109392 -334045 -289269 -30343 -131107 -160813 -229859 -119928 355159 -11176
20077 -39381 -279318 119377 51952 -399358 -44707 -77329 155528 -179385 342290 44975
20066 -119981 -45487 116271 81787 -97216 -167459 243133 87103 111796 12914 -144913 6146
20054 -137695 -118882 -95841 -65756 59743 363243 -220471 -242259 -73596 -272680 -247976 22385
20042 -90181 37332 -29079 10360 -379791 -108038 -67157 6329 -225179 84932 35417 -199785
20030 -292122 142817 -170403 173781 25508 -36424 -97435 121557 -229704 -322350 4650 -38364
20018 -237131 -49654 -212146 -137598 -76312 -188303 -304277 152568 67288 -108165 -177677
20008 -177677 -143720 -167478 224502 160754 -113756 36247 25860 284007 -80515 -15815 -54112
19997 -54112 181365 -33202 411682 293427 565698 230052 -256266 204549 163458 -145707
19986 400238 501638 -43291 -73988 -92370 -214814 144294 170458 -182591 28188 156726
19976 156726 -217096 17639 -73077 188226 -134876 -97128 124632 167862 -154711 237654
19965 -195961 -110890 6869 239805 270303 200061 113078 -27660 70355 208432 121889 108402
19954 108402 -18765 342025 240581 -12593 177210 63303 -42585 67471 -84064 32576 60893
19943 60893 -226023 -266841 -37310 123281 325917 40689 -127077 -104393 -38480 -260825 -72004
19931 -60409 -305650 -100399 -361315 -196071 222269 -143279 -11597 -83665 104264 -222509
19920 -35944 173102 -354473 -13208 163370 -167704 117833 -200703 120236 -327747 15522
19909 -81120 -273326 -149182 -30280 -205681 -122141 123585 -136626 -21242 205108 -199394
19898 209635 -55246 -271264 -223642 -258252 -275262 -73668 -184050 -202519 -243756 -479890 -99863
19886 73310 -327092 65211 -362230 -246926 -114103 -113257 121861 -35720 -27598 -225887 -8155
19874 20582 -341092 369874 36475 -185389 -27933 233505 27408 -199950 275875 240249
19864 240249 -106333 -56699 -45595 -80721 -122756 -114253 -294377 -424594 -160996 -225000 -84103
19852 -173394 -117649 221598 62325 12221 -119087 159869 -30173 214617 -161233 -328180
19842 -328180 231571 50575 -313227 343649 -202845 124901 -183323 -70695 -187641 -28082
19831 -148993 -3093 146029 -228729 -99484 -199533 -174552 -128306 -128958 -207868 88593 40371
19819 -279772 -117280 -64189 208467 291394 269305 226944 -253936 -33990 -220883 -103902
19808 66769 -101504 239725 111401 -81974 -13475 -135948 -89842 -231484 -238915 156936 -23702
19796 -111596 42626 -131445 -59605 8358 -14208 -230798 -105627 -228755 158774 -262418
19785 54147 74288 16151 1934 -173717 -89150 191747 -12705 -45977 -51891 -288917 -205077
19774 -205077 -222114 -45191 -398950 83887 146909 -106366 -118842 -235723 -469074 277198
19763 106860 -99737 -21693 165369 -52285 30939 -275846 -104099 -256616 -56858 -199897
19753 -199897 -146588 -162073 138378 -227286 -98361 -213389 37600 -21444 -174859 -123765 -130612
19742 -130612 282073 -298910 -92721 -70162 228096 -221106 -328223 249705 -250744 203741
19731 -123582 -82545 82154 124506 494011 674794 390381 71297 39904 -176197 172093
19720 -20837 -97587 -46832 -54864 -294497 -109813 10316 -256045 -28849 -154992 -237878 -71478
19708 29320 204115 -72819 321811 17725 -152575 91818 121952 -91469 -284930 -122189 258080
19696 338069 510682 525841 318785 212967 120144 -159361 6926 176729 -5029 35517 56720
19685 56720 -28514 92442 -394773 -97652 -391565 -30320 307057 -283466 10585 -47825 20997
19673 -117141 -31292 165602 224625 -250752 -92701 140070 -231609 -125567 -46806 194332
19662 259533 -35185 1912 -206698 -107991 -16910 -218590 -14843 159740 10913 57267 135670
19651 135670 -66202 -158830 -251577 43933 19728 56375 -104685 64362 29467 44995 -123289
19639 134575 -9451 80031 18773 -121468 119173 31740 -73886 -209924 -150549 -146691 -159843
19628 -159843 175381 -96357 -279904 166927 -337930 -9397 -51853 176351 -106407 -116774
19618 -116774 -20172 73750 59273 51237 -66144 -458665 -247375 -79873 -112220 -380608 26898
19606 -318281 -60360 -100763 -152605 -83296 106444 180650 143639 -86037 -324299 117995 -119739
19594 -379991 -117652 -64155 196889 90187 -89345 31376 -15735 57795 -52236 -78833 -107004
19583 -107004 -41323 -39936 -195931 -61242 -306401 63065 -49442 39032 65563 119038 -120091
19571 -212890 32052 111026 -281916 75203 -75027 -25537 36807 -239423 -175715 -43584 133456
19559 66824 201356 -86650 2817 29395 -142493 -461540 65040 112744 154891 195761 34402
19547 -192416 111395 -10644 -116330 133194 -1065 27051 114322 84312 -238036 -147511 -131602
19536 -131602 -36495 -110406 -126729 94367 -271417 46681 -210305 -50166 24519 -150630 -14034
19524 87790 23266 -40997 -356530 -310128 -19091 -41703 270270 207072 352381 69325 -483351
19512 37490 -229213 -54512 -141109 -249678 -132541 115793 -70445 -204869 254808 -106749
19501 -248661 -334767 86617 171055 -34448 -353430 -197138 11858 -18082 -388050 215902 -16955
19489 -157717 157495 -182475 -152777 -281168 -249680 320250 -52579 -60348 -61575 -88548 114926
19477 -30350 -135435 -244100 36126 -279605 -108551 -177972 86146 28244 -369239 -81017 -73550
19466 -73550 232179 -208112 -174383 -383539 -155304 7025 -149863 -57498 -335853 39356 13179
19454 4367 -279398 77025 -27303 -206005 -227259 -77886 -342176 -124378 -42471 9633 328881
19443 328881 -36837 41040 -186913 -230174 182748 15109 170590 -161595 284042 -337931
19432 1758 -369250 103367 -7530 -114302 -82748 -70097 90154 14337 60258 -7549 230266
19420 -208548 -231510 150784 -172614 36752 -13389 -21106 -182304 -59877 122551 90999 -247486
19408 151780 -510843 -284864 -212967 -246638 53993 -76630 -399215 -198205 -78477 -167060 154980
19396 -75698 -93339 -151065 -89591 1575 21567 -167970 -150973 -378790 86703 133114 -35542
19384 139279 205912 -69084 129908 25809 27580 -134999 -194266 86428 -84634 166653 34879
19372 81666 158527 -56389 97540 31562 517761 -30191 -61779 -221386 -219514 -337467 112271
19360 -323941 -21584 -206617 -187448 238547 14196 129131 121452 -103337 -149916 83314 -87550
19348 150613 -334246 -190110 -329297 -39434 244172 -134024 -436814 151735 -79237 64374
19337 -34681 238860 -161538 13312 153368 -334559 -322989 -349694 -295671 317077 -189012
19326 125700 -255771 -298180 157901 -16718 -41287 110661 122667 -19778 -221603 -229341 -159643
19315 -159643 35982 -128933 -105043 -110285 76387 -45894 -323245 -95737 -303232 -258457 152897
19303 -29468 61687 -2435 77564 -10028 -28383 -279500 -230491 -355444 -28818 -145746 172318
19291 -250604 -171639 180135 -1323 -497099 -115980 -216055 -84722 -200701 24208 -10446 -41799
19280 -41799 -4263 -97088 -7394 -244218 37340 -400752 139896 130626 -95281 24691 223938
19269 223938 -132545 -91224 -328138 -505125 338442 -279236 -242661 -76952 -97087 -230997
19259 -230997 -121603 43207 273184 -73616 -23560 -90090 313256 277251 -78295 -48249 79099
19247 -114381 1538 -250523 -125855 52063 -254179 -279610 -274232 68229 -209572 12892 -211031
19235 101114 183435 -116409 -376744 -93393 186722 96895 -219051 -44161 106779 -225061
19224 -92969 142018 -340599 204540 64871 250819 -37338 -393256 -219101 -102748 -67069
19214 -67069 88534 -44524 -9299 -247794 221038 -166540 418505 -388883 -249563 -238896 194513
19202 -198061 -16568 -87435 -122250 -111773 -152711 12650 -44684 -74436 221355 -10209 46076
19190 -83270 11600 -27519 -13522 21356 -65803 -185142 -241424 -56418 170548 214005 -138423
19178 -133196 -164963 232747 -18768 -45471 91705 197520 315502 62285 -70522 89592 -6701
19166 -55794 80697 -237642 149863 -165607 -148636 -588623 -166005 -599309 -154447 28623
19155 176506 -4587 -106671 -62368 99471 -185228 -48048 -75500 16115 254789 -90844 2321
19143 -46672 -267836 110049 -16062 -254755 -245761 175670 -255215 103834 -418705 158140
19132 -95998 -299356 -117031 186903 -95939 -108733 -233701 147514 -175434 178721 -195443
19121 -230040 7277 97780 -256508 135588 -93127 -253190 -172592 42759 -4615 330380 127861
19109 -339111 -46166 99054 -263625 -60373 -54975 -120367 -188689 31341 -97705 212530 -283839
19097 233315 -23972 165638 16702 -324976 138843 216151 -199256 -245640 -357575 -21378
19086 -145527 -158278 -135513 6075 30183 -176687 52121 85335 -157723 41631 -51112 -314254
19075 -314254 -186811 -140007 -150054 -194258 -56681 -241104 -60888 154552 -255107 -511571
19065 -511571 -15480 -179120 117735 23299 -409859 -563850 187436 -67124 -426810 -118402
19054 68345 -56845 207106 92884 60383 46733 38409 -290786 38112 39732 70205 101819 -125094
19041 -213464 -11005 -173758 28308 -47175 78178 35622 136086 365377 251973 -345875
19030 10248 -132998 -169791 86450 147818 125061 297018 155949 -48767 -37127 -4185 189317
19018 -80882 201601 127591 -30865 -1336 -151956 118616 36672 43359 -166988 -125732 -104982
19007 -104982 121090 -49875 -82578 124482 395908 -39395 38232 -190667 335417 -21479
18996 -28092 -52046 -62342 -119343 -112700 92912 -25510 53930 11727 -15796 -22789 157752 -56985
18983 -8561 -233554 36808 -175674 -23731 69696 -33420 -109177 -145245 204032 -132413 -28951
18971 275568 383361 360336 675277 201254 208333 -103862 -24529 -78914 8650 -108335 -148359
18960 -148359 56525 -193224 -145596 844 -2018 -40190 -150602 -15723 -24032 -95468 311810 -23677
18947 31832 -70923 -257278 2530 -63269 -104250 20248 -269485 92716 -56226 -58992 -59652 -193457
18935 -193457 -124302 242930 -7189 -139900 -183426 -34482 -21200 -7330 -7709 97230 -113262 107283
18922 -341424 68243 -100986 -363785 58445 210574 43731 65310 123725 -114666 178509
18911 -466194 101948 -297950 216938 123228 451169 730558 483442 -91542 223839 -61632
18900 -355006 -200978 -158540 -53100 68936 59897 -81076 -54491 -76383 -256571 360496 -45984
18888 116129 -46554 -72725 3141 -193141 -140456 29742 -37342 -257777 222295 117164 -111889
18876 203084 -15955 -476706 -34412 -173372 -141123 -215820 207935 43391 981 4196 -3844 69786
18863 -187821 -230858 196862 -373774 -84603 -66110 -212924 -332211 -1465 28222 -30103 -193622
18852 -193622 89255 -262263 126599 -76034 86238 -111399 30941 -135227 -140101 127583 149500
18841 149500 -40687 -328425 -225598 -61955 -233014 -220802 -121673 135827 28171 131278
18831 131278 -270507 375678 -338438 -89690 -247896 -259949 -154251 -48595 21552 -158000
18820 50741 -241438 -27492 -73697 9510 -240803 -276501 -63948 83350 83713 -162088 -155034 -158379
18808 -158379 130473 28554 -42902 -57474 -59455 -738 -304599 -9966 53578 -48274 49394 -59950
18795 -149300 110420 7372 133240 176400 115789 13374 25013 151154 -167820 165690 -232852
18783 84191 111755 -60098 -89402 -91980 -170746 227169 96951 101848 312923 -105832 -339326
18772 -339326 11015 -32459 155071 -92840 154657 134326 -173710 -274333 385118 -30216
18761 18331 282310 77253 25992 -165870 -140910 -291404 -71487 16286 -45108 158677 264305
18750 264305 273095 -178176 -3190 -28136 3087 60578 -164299 123997 40341 -225566 37384
18738 328411 402407 -338831 -87796 -307774 -205409 -168055 172350 118093 -480563 262594
18727 11621 -46717 -256782 60618 -13543 15483 -5780 -284901 -102415 -53655 -180590 119392
18715 -270610 56067 -53643 84516 -32328 30162 -301087 -870 -24051 -290245 -16562 55341
18703 64056 -355895 -232771 42271 -257693 -634926 39790 -127872 -112930 50387 -193057
18692 68866 119747 -151990 129498 -217438 -86234 -187192 106263 -107733 89649 -11827
18681 -277744 -367284 -9630 88987 -112926 161548 -74703 -109064 -8305 58795 -260844 -49216
18669 -123466 -99736 42580 169225 25097 58005 -214963 -186662 -100359 264192 -118240 43901
18657 241243 -43261 118794 198846 7200 -228547 -25252 -327904 -8183 -17104 130505 61703
18645 -64955 -7617 -141696 -117252 -147237 103991 -181766 81052 -35715 -56023 -61538 93157
18633 15078 -138691 73004 -123289 -364489 -41744 31230 -58616 -178561 56813 33603 -304959
18621 -39803 170552 -120382 146670 -70402 -279582 -469121 -328854 92645 96884 -267169
18610 154316 196363 -60446 -15492 -195406 230182 -236836 323735 -74918 -28362 -266985
18600 -266985 19599 23509 -133640 160300 169686 -122506 -316516 71126 -117530 -210141 -63152
18588 -166752 25291 -102044 60126 338252 -309992 332663 -9603 -59852 -27 85310 -29379
18576 63406 279475 -1321 264384 -51288 -420931 -269073 -42303 190711 84878 -258363 14494
18564 -54536 -22417 -136534 82399 -7386 -197516 -62896 -326806 -294847 -110471 302263 -122958
18552 -154666 38088 -61988 -128958 -428551 65993 288340 -32048 -36027 -149203 159382 106436
18541 106436 327286 -162286 -143863 -205145 -176453 -227755 17584 -208760 -96839 -99934 -14428
18529 -82994 33456 114499 -27276 -136108 110234 50944 -257019 13899 -148312 -213981 -243535
18518 -243535 -67553 -211841 183718 -183347 76823 -131445 -170125 -313178 48380 169552
18508 169552 -175566 -92511 -51789 -39188 115436 -10937 128225 136885 -21284 -299340 -160609
18497 -160609 -184744 82918 -103869 248061 -228432 111855 -188703 -271651 67190 -125129
18486 -239049 33509 227239 259070 47626 -60178 -74839 -63812 10016 211477 116252 -95660
18474 -310632 2081 -82670 -136460 200096 -56136 -27291 -246235 -42565 -59794 -248218 -187496
18463 -187496 -79352 166933 -189287 11838 -107917 -148707 116993 -60425 267262 -7904 -169008
18452 -169008 -45874 15151 -129971 -196995 -442180 115175 -217087 320236 -158143 300351
18441 58849 -228700 20002 -73050 204744 -174893 167024 120691 -306076 201967 -186879
18430 21363 -145150 297128 -187108 133803 53939 -17960 236640 159266 -114847 -34736
18419 -308354 173861 -120839 257499 71952 141638 132370 33745 220509 -108076 -78320 -103630
18408 -103630 134529 -140699 62637 -62645 18390 212412 -207479 117732 81704 -79170
18397 -65662 -94057 -154597 -134575 -47944 -40747 34301 94596 -109834 345227 203207 -158449
18385 -83503 -164158 -236750 -14732 166244 -76863 87151 60437 -76634 328128 -206367 -294851
18374 -294851 -77642 -206075 -110087 -161791 35127 -53308 -226216 86539 -312435 50445 -89787
18362 -109199 -201737 613964 78969 137530 306096 181918 162180 44906 99458 -41414 -131251
18351 -131251 -119806 44862 -33976 -62779 4619 -256196 -67376 -63462 -449071 35944 -57297
18339 -172185 -227007 -21633 14897 -242994 -257838 82334 11482 -192784 73581 119422 -434825
18327 -36351 -115777 11915 -7607 76560 -195952 102244 -278538 -66091 -77954 -60037 -249027
18316 -249027 -175066 42103 -149124 -183680 -85115 195409 199490 333524 43208 152726 148575
18305 148575 -100632 -124717 -257129 -232221 -278641 89478 348498 -11424 -109377 -10789 -83085
18294 -83085 -212636 -40990 -28476 -13539 185073 -48414 -148950 -129223 -82644 179844 130639
18283 130639 -172000 43608 73045 -26581 -180560 50515 169212 -182691 180208 -41450
18272 -243522 -78367 16998 -207860 1897 -2039 115817 110920 61330 -9044 68547 249909 -16932
18259 77659 124810 -182088 -22927 -143679 46330 -119993 -53329 -156946 -27563 90742 -103386
18247 -48833 146479 257668 65057 -26236 -122033 -468748 107448 -87150 -214551 149169
18236 -95004 -194832 48623 140811 84722 91368 -34552 -169239 309343 -92414 48639 11585
18224 53130 -123403 -10556 -263574 47174 70873 -256912 45616 279786 51639 200689 -178135
18212 181561 24085 -221492 -206208 13973 -190249 156521 17803 85591 -39182 61032 35963
18201 35963 -108276 -161170 23217 -71244 -143676 -215192 68537 126983 -240979 -48371 60358
18189 -428271 220517 -209485 -239233 8349 -159067 58341 89590 63909 -109373 -312609 -32562
18177 -32167 285306 36837 135166 11964 87078 -133469 241643 104050 97167 -270640 -143013
18166 -143013 -113453 39559 232378 -37876 -108225 294946 71454 -63221 63533 -38711 110542
18154 -98892 -113149 214411 -48627 -161859 -109609 -200620 -146129 86483 129409 -269212 496080
18142 -148458 -34030 86355 189226 59445 -148742 -193913 261852 -365312 63784 -29534 -54474
18131 -54474 -910 -3643 11509 -54471 106200 241760 212969 -396704 -35266 98323 -338661
18119 -75481 -51195 -322427 12634 -223838 87347 -215789 -29534 -162988 -321572 81760 183703
18108 183703 69853 185713 -288406 -365 98163 259797 36855 -233859 -241851 -103362 -265960
18097 -265960 3203 100288 -337214 -159502 156608 -105872 -109897 217375 -183239 116087
18086 -182881 92787 224201 -121551 -75670 49842 -84619 27167 -194020 145720 31142 -205313
18074 108879 -67654 -373757 -126114 334866 -143349 -27564 33744 37750 -349433 115930
18063 194289 17432 295870 -171944 -177189 30521 134968 -56393 -93987 232428 204278 12969
18051 -88403 -304954 -148078 235273 -140192 -71498 -34399 288387 -223474 115314 -33780
18040 221941 -12812 -43126 -35614 -44732 -26198 90726 -111989 300697 -152277 64697 -62526
18028 87258 -201681 -30230 -64351 -115623 526170 126866 -358834 -86624 -72123 -320197 6321
18016 76206 317174 266697 -84891 -23556 29863 624442 -9679 -140102 221344 -2543 -30089
18005 -30089 -161312 -173419 86735 -225965 -102215 -64848 -449893 -219293 -118163 -9684 -267246
17994 -267246 -218466 -53941 56179 86175 272077 190704 144839 101896 -78121 162894 -59425
17982 134904 210265 228312 -164515 45471 -108090 -106258 -108519 89207 -4062 -65159 20178 62474
17970 62474 -101472 275010 53417 58943 -50899 76780 43946 108476 -30131 259631 -310395
17958 -111748 34494 -118391 -256539 268474 -325753 194369 -113036 -89506 -166805 122835
17947 106054 -325174 -137623 -5387 -27807 -292250 -123865 -187342 213012 494003 9899 96066
17936 96066 214971 189507 101030 11012 -256185 -208398 82096 128681 -100682 -308716 -68476
17924 385545 -190086 32937 152715 -2032 15625 107656 213654 -15356 -22471 169 464868
17913 464868 187246 -110004 84990 -158027 11363 229730 79907 -16258 -184885 346838
17902 -217850 -254265 202024 -43499 181902 22577 -260230 229544 -10897 -104580 -113409 -95482
17891 -95482 -100623 110713 136804 129706 135065 280987 -71570 90923 -52663 37556 -59174 67933
17878 -14271 67398 217888 -113452 122152 16492 -190782 31377 -17213 -9117 95995 -58310
17866 77934 -34835 248372 180178 49569 307085 224670 -82623 -8101 -38435 14837 -117388
17854 -200734 -12083 -41695 85757 59421 -103356 -73921 -62670 -17626 -215416 150660 -3731
17842 281725 18095 187844 -168063 -259558 -307776 114365 115089 1108 93334 321966 151697
17830 138681 -4013 -24669 -956 120344 -51764 -32210 151672 172864 189684 55522 -84087 -215506
17818 -215506 202304 127484 9282 71899 -118918 -300829 -407508 106358 -83887 -248196
17808 -248196 201955 -355589 163045 -66750 67207 -355825 157563 -178092 -76045 231889
17797 13853 -83732 256385 -141546 199306 168939 206617 -170615 -6895 -43266 44486 76427
17786 76427 364831 -181755 -92972 -1890 -193462 -94282 223568 -51199 -205337 -191795 266292
17774 430924 -119354 225731 215578 -58986 -91588 362552 78164 136122 -212801 379062
17763 25191 -138724 -158765 78738 -112643 142383 38516 -88908 -60491 -85472 67499 -113517
17751 4821 157607 126855 -119467 21465 -43590 -315400 60360 -110008 -57568 85251 24086
17739 211631 304592 -16309 -28134 21756 -35384 246062 -245547 579266 219439 -35437 140097
17727 -118925 79096 122008 84847 -180220 1012 324394 277316 -6578 392728 -95672 -139623
17716 -139623 223245 218983 62673 -190501 115996 -219873 -159583 -24749 -116003 24790 28407
17705 28407 -58359 -196001 57790 197432 24904 7785 2248 73323 7853 -12142 380366 370161
17693 370161 223097 184884 39311 -199756 -34540 236149 91901 27728 370794 283456 82757
17681 8990 -24030 9868 -35731 -231977 66486 201503 156056 34183 -97932 207117 -180281
17669 24352 143416 136358 -75000 101087 -138349 163466 24971 272524 240137 -99048 218211
17657 65967 104361 468697 211733 183490 206541 425638 138439 542633 101806 197295
17647 197295 -127613 409338 248032 -49827 -65525 437069 -36159 604032 93412 172010
17637 172010 27187 -109048 165038 -55216 137572 -15801 287893 210332 242252 42657 93737
17626 93737 -3584 194935 -910 -18544 108057 20500 -180179 193222 204139 113372 -76436
17614 170572 148247 76875 149819 69590 262062 225111 61096 200854 104663 284636 43241
17602 201761 216439 -63237 85348 24090 74324 -159816 193076 94668 431604 -8913 18717
17590 45104 -180704 74142 170397 -19589 26862 -10656 -57348 101498 48415 34943 117684
17579 117684 35421 32334 130101 454259 349626 81922 -122269 65752 -129019 -104062 116750
17567 59139 364150 367738 51785 312005 63154 145451 418530 -8486 -6963 384004 -123212
17555 5603 118089 241022 -290848 288334 -12623 220619 204662 254080 51496 -44010 661604
17543 358492 210163 276475 408805 354614 71643 263722 491947 -130852 206047 430592
17533 430592 165985 255434 195769 182097 347219 433982 207127 441651 748280 1121939
17523 1121939 803763 980033 760219 744204 596033 108122 453731 322874 417624 529155
17513 529155 171437 354513 742129 878696 1118642 913622 825362 742557 767204 183727
17502 93102 347001 128843 371425 705716 546683 209363 286466 389795 310973 189361
17492 189361 441680 424525 339267 445806 36974 370004 265205 -3414 255920 523832
17482 523832 162466 -59759 411029 212463 -3062 392126 -27926 -1353 490446 345596 456488
17471 456488 158993 -10747 156589 134941 131722 337453 247440 421190 124723 184558 24868
17459 -143319 455834 555253 172578 278971 506173 324503 517 75136 411976 387007 404417
17448 404417 386721 303277 421386 544900 686307 391433 500292 82140 166444 322788
17438 322788 503353 566231 333660 422048 257714 406081 303619 411869 85297 601671
17428 601671 380211 509090 243474 18462 318869 290896 249354 318675 835105 490120
17418 490120 74569 387605 54775 220328 456514 484517 553044 73281 653427 100904
17407 -98988 239366 212046 -9030 143708 -338495 29435 145047 444275 -75950 306610 300468
17396 300468 328382 39651 400578 8252 443746 54838 264740 233944 238423 212774 114513
17385 114513 309159 152533 231601 460034 449811 603310 242472 264993 89712 93288 75895
17374 75895 121571 219591 136632 71124 244097 -2550 406791 146768 243968 245080 228747
17363 228747 73222 82994 244929 157906 228355 9682 236795 392441 458499 483610 -64056
17351 33695 528297 15955 115055 65952 89487 231790 340828 193900 -85708 241132 453911
17340 453911 48342 164010 264956 315189 242200 307860 179920 130882 155292 387077 106575
17328 229388 512523 172760 420418 86116 196008 59554 613590 218380 496165 223429
17317 315166 134406 479577 477454 326359 433876 -44439 232768 -13645 213066 133192
17307 133192 188818 329138 59634 239174 268029 322381 370771 181214 193094 357640 461123
17296 461123 238969 468875 344774 165656 408579 401250 566595 207421 66365 171036
17286 171036 245568 501021 526087 533820 427400 335931 333471 481279 265486 407237 331420
17275 331420 642383 561512 200490 176267 298613 649540 276500 280926 548440 226007
17264 621876 78391 209002 491286 279762 215371 102670 717156 253553 499970 -97004
17253 381209 135150 58607 314411 90053 30611 255424 289594 101603 236123 262446
17243 262446 400140 454289 373298 -31726 60845 369425 577650 227808 562162 502523
17233 502523 106604 496098 515960 308064 365484 164230 315751 340254 362058 444941
17223 444941 550152 274369 276477 297513 495228 415464 480229 463282 355648 396045 441301
17212 441301 562788 213865 357540 580554 216958 317619 590934 317724 -63839 683120
17201 251286 294415 427880 480820 239769 520608 264537 448592 538614 670618 313902
17190 253490 184779 168315 422861 491181 443623 478402 669467 597615 635015 442589 622820
17179 622820 591786 423306 343374 472560 528660 333181 650294 536339 650906 278101
17168 339254 396387 506479 127885 470816 469444 563673 544688 222147 422694 512354 287023
17157 287023 510309 538000 380774 382635 299823 505865 835090 315540 529494 657032
17147 657032 663571 274747 362065 697718 424124 503778 481515 815346 584156 123997
17136 470339 544597 146249 476509 626645 660485 587027 309431 872008 777256 462980
17126 462980 656659 648244 793054 368914 817461 194603 753770 570741 365917 570086
17116 570086 586121 278827 593433 553656 457957 447489 755963 685622 526034 675789
17106 675789 570187 352921 765952 590377 723260 509692 443646 411883 613856 459168
17096 459168 805793 817499 346094 607115 472377 654578 690126 539956 626079 802909
17086 802909 655035 744725 491938 750416 518588 596936 406842 689389 588856 815262
17076 815262 885532 696032 797505 555916 864404 618238 567537 626109 576627 723191
17066 723191 929258 887740 707578 688224 710625 802862 729719 712679 677603 827420 817496
17055 817496 660043 1154462 972160 645738 860988 969389 360788 1045078 545386 916094
17045 916094 606274 872279 801900 757391 795466 760974 761815 879307 970214 731824 1217641
17034 1217641 1097626 644748 1161265 930313 749635 1041669 1192549 1171412 968320 849243
17024 849243 1023702 812099 761621 731546 627463 1181726 800972 1074083 887890 1024062
17014 1024062 1164106 1087236 952051 1084974 994951 1142952 1141184 1007961 1344173 1040964
17004 1040964 1157455 878131 1044175 1187300 953937 1218979 958189 1316261 1198986
16995 1198986 896065 1235381 1208008 1264582 1278045 1317564 1501791 1265025 1305145 1321773
16985 1321773 1240776 1222611 1260731 1178562 1372020 1404749 1203572 1345865 1243181 1167520
16975 1167520 1465132 1573596 1507236 1440471 1413395 1049073 1522876 1347876 1558869 1437672
16965 1437672 1529631 1705082 1604583 1339399 1408773 1197131 1190149 1189713 1724129 1524201 1491102
16954 1491102 1368437 1379898 1495544 1496153 1582126 1505919 1607525 1809487 1430697 1751030
16944 1751030 1628966 1906862 1873287 1773881 1822814 1730263 1726257 1862651 1993307 2012304 1765501
16933 1765501 1863992 1828335 1760202 2058753 2182746 2131032 1829939 2058009 2302821 1953836
16923 1953836 2069197 2120238 2198345 2368374 2064689 2226864 2141622 2175646 2103346 2144874
16913 2144874 2132347 2478966 2626690 2387021 2416524 2500373 2496007 2316785 2559963 2562155 2595829
16902 2595829 2497853 2582471 2918320 2850439 2923781 2824790 2566466 3106605 2980912 3056815
16892 3056815 2955755 2630656 3050497 3156179 3011642 2757982 2720646 3226480 3056490 2997599
16882 2997599 3340795 3221453 3470089 3169393 3666179 3645255 3322311 3834540 3773701 3634357
16872 3634357 3577993 3937992 3888884 4028234 3605410 3796526 4058649 4232416 4102417 4182363
16862 4182363 4313862 4307778 3803221 4679123 4120759 4334150 4977193 4445667 4922126 4618443
16852 4618443 4894816 4740371 4947846 4976076 5393978 4880679 5319037 5119186 5156820 5674708
16842 5674708 5757802 5715713 5936559 6140069 6070572 5808148 6547106 6017426 6334305 6362198
16832 6362198 6554707 6757220 6682669 7127441 6769956 7425964 7256741 7462330 7621882 8120426
16822 8120426 7734195 8103014 8039177 8558026 8439820 8331299 8977499 9130277 9049456 9839696
16812 9839696 9494327 9743282 10071785 10282168 10434836 10395462 10867972 11078489 11564340 11608720
16802 11608720 11909178 11906885 12359179 12410931 12919708 13332360 13351505 13910784 14066606 14294780
16792 14294780 14673360 14847477 15554416 15726013 16179365 16984566 17021165 17764385 18377538
16783 18377538 18554294 19243875 19673823 20225989 20744182 21051577 22022292 22336803 23184245
16774 23184245 23425196 24367399 25327482 26153142 26453601 27470101 28344486 29384109 30204739
16765 30204739 30922344 32449381 33334895 34267719 35539222 37048753 38137208 39162927
16757 39162927 40518720 42033306 43171031 45201652 46698660 48722490 50518099 51811599
16749 51811599 54201673 56126796 58401811 60059442 62765418 65176493 67427451 70179704
16741 70179704 72688242 75421395 78067027 80981055 83855686 86457517 89747284 92670680
16733 92670680 95732567 98889886 101604334 104424785 107442856 110252348 112690723 114976239
16725 114976239 117313641 119064910 120969462 122609096 123642907 124057176 124572397 124693089
16717 124693089 124207054 123674767 122591498 121332359 119461869 117768227 115457397 113069723
16709 113069723 110577404 107794268 104726764 101720694 98330509 95607712 92212216 89501676
16701 89501676 85781194 83092478 80139756 76954584 74246025 71493688 68507925 66093107
16693 66093107 63526055 61442844 59001157 56489180 54340616 52237893 50345557 48403377
16685 48403377 46857696 45015568 43493925 41604264 40101569 38936469 37430977 36102321
16677 36102321 35021626 33832617 32387683 31584847 30323713 29521400 28351795 27559530
16669 27559530 26648522 25554246 24879227 24086968 23863669 22791260 22145672 21342378 20871264
16660 20871264 20282422 19762772 18941442 18396147 18186671 17667385 17018449 16740581 16035825
16651 16035825 15975515 15463889 15036882 14755007 14330802 13807892 13531358 13099053 12877720
16642 12877720 12240184 12428255 12076256 12088214 11699172 11177651 11081129 10578773 10794172 10128792
16632 10128792 10184384 9917563 9368184 9200512 9369541 9108881 8905713 8706807 8700168 8182472
16622 8182472 8141290 7938663 7534975 7618599 7545756 7604319 6896374 7184319 7321914 7214248
16612 7214248 6922207 6939988 6639059 6344906 6485982 6267575 6062070 6106443 5950457 5958568
16602 5958568 5663437 5442756 5419294 5246040 5318282 5189821 5485188 5043256 4998861 4967450
16592 4967450 5230975 4927587 5119371 4866838 4715879 4738475 4196149 4360349 4090497 4483587
16582 4483587 4139501 4210990 4341973 3804745 4129711 4105650 4140967 3734247 3726202 3539450
16572 3539450 4052485 3325208 3431852 3759705 3718722 3248335 3295933 3638676 3231647 3247387
16562 3247387 3276470 3203220 2846155 2931143 2980547 3032710 3302105 2800677 3098941 2660340
16552 2660340 2866638 2867930 2633974 2702732 2731608 2872856 2848767 2469398 2656512 2661831 2352974
16541 2352974 2308889 2526382 2120602 2363995 2780316 2363254 2114887 2383101 1929374 2224136
16531 2224136 2087131 2095623 2278408 1965742 2201881 2029429 1895117 2380168 2253110 1946369
16521 1946369 2246016 2216943 2079051 1932643 1726346 1635948 1826394 1842495 2096901 2200045
16511 2200045 1644721 1890267 1766364 1991963 1762829 1904332 1887499 1847696 1455376 1748627
16501 1748627 1423952 1414474 1865956 1802640 1323985 1767791 1517472 1537306 1219769 1631076
16491 1631076 1464971 1697666 1761729 1592224 1489765 1355433 1547275 1564699 1257297 1296772
16481 1296772 1077916 1018892 1473891 1547636 1232365 1299648 1573054 1516918 1404574 1209642
16471 1209642 1311858 1089120 1365860 1363739 910423 1574820 1025769 1139153 1015310 1220895
16461 1220895 1105329 1226962 1089566 766245 1088624 1128769 777012 1433114 1167544 1362250
16451 1362250 1078854 1096120 1071808 1023696 838309 996312 1304432 1056530 1036471 908472
16441 908472 978692 925879 829467 852234 931163 1192150 1278495 1138030 981345 750806 1126945
16430 1126945 817030 716633 964105 701997 863246 569000 1177772 867308 958891 927698
16420 927698 895141 575935 610463 857148 645622 792610 825765 739785 897082 526445
16410 526445 797841 877065 764979 978455 1017938 908722 829199 884740 959083 835555
16400 835555 662714 763492 748509 1001046 723159 397414 642089 606730 858393 930993
16390 930993 791411 872268 639638 740593 684632 769459 877806 801520 582107 540056
16380 540056 772976 529502 629271 694174 545182 525606 798108 622759 542968 911979
16370 911979 541881 526240 508845 605308 493115 535785 877384 493880 581768 482821 526820
16359 526820 845351 742105 490318 622714 551512 493533 782903 846073 514006 488732
16349 488732 335976 737261 321386 410936 771051 543298 342440 365797 507539 682638
16339 682638 539205 474107 539473 326231 516327 660262 514508 657387 840441 284380
16328 317380 598868 234806 718087 582424 891591 267503 432379 490939 516788 632944
16318 632944 356671 127157 767009 516940 403976 143956 573982 339068 341867 425765
16308 425765 436453 660354 466353 539393 394174 193661 650086 457689 279356 607771
16298 607771 671192 516670 219624 528648 88111 596458 432819 29821 304586 466602
16288 466602 257233 547299 165948 361523 365132 278211 453085 511960 611535 292518
16277 216652 394357 263098 240723 511294 78502 279940 125912 609335 230728 318384
16267 318384 252851 448976 320248 125604 558351 435847 510984 294918 231469 308847
16257 308847 116626 296283 84249 252283 318047 274438 396923 271889 269773 366729 -53265
16245 382231 257197 374080 34066 162007 167162 343211 123395 466980 -126494 216328
16234 16850 153161 -213564 14425 358422 287816 42454 506156 362882 -21871 453853
16223 164899 312602 193684 249860 57480 369984 147840 219988 505287 152601 107430
16213 107430 174277 82134 361505 166311 128680 -56046 -31499 398146 138782 268675
16203 268675 313128 -81727 550647 283494 306726 -60705 301294 -5889 341202 208087 335927
16192 335927 173725 193815 226186 365980 237768 7419 150967 173279 134274 174396 -154324
16180 452071 67845 244616 271650 39046 -38931 185792 337562 -70786 76984 646433 144050
16168 271234 25174 130732 180267 -52081 271588 -49178 -18412 269448 68491 323402 298942
16157 298942 183493 221642 398412 -122996 -201199 102437 136049 -6232 201780 120356 793
16145 -55423 402521 -11771 -8780 -24922 44194 192108 151108 281659 345020 222534 -310387
16133 285324 69467 43180 114171 93401 20171 95354 180968 -39455 -126952 192637 55707
16121 167350 209440 394148 339802 279073 143912 -87445 146255 107603 103710 -48613 429768
16109 37760 172364 372044 93935 16270 91390 -63107 -71515 388667 -129933 -111094 -181848
16098 -181848 -67087 241309 15634 55156 -22164 -4420 98578 -278012 262142 -33229 -78313
16087 -78313 201031 268708 59832 282496 255928 172128 117284 311288 349193 175897 -72077
16075 123917 32477 -196950 222267 -35669 157606 162176 128536 -134834 -135621 359856 189403
16064 189403 134120 -210591 155893 -62447 278867 49147 -48502 343554 -12969 -68829 193200
16052 165051 66632 58671 166754 -45885 193315 -275624 -43296 -65948 -52597 6690 128016
16041 128016 -61273 114293 -19527 262489 -173499 -336964 -111939 94026 143007 -209893
16030 97351 -65171 -42416 -163367 83984 76727 -130197 -102645 353681 379422 -20889 -112354
16019 -112354 136827 63610 -367815 15703 -50890 142072 33725 217650 -192880 70604
16008 -141349 137957 138834 -24248 -273160 81127 -289858 267432 83270 -127094 144503 439770
15997 439770 265388 -40819 161335 30569 231736 144531 267275 12096 -173628 147230
15986 184587 350605 592801 1047455 690827 1045603 700269 154105 186096 -43136 198339
15975 352179 -232813 -64541 234701 -96596 -314251 122626 50515 113261 -71033 152446
15964 12868 111067 -68760 103236 -383263 -54401 349844 -3719 277824 149512 -8891 333350
15952 -112317 -138339 6147 183443 161187 -22405 -62579 51 -126193 42588 -95995 -33065 -247312
15940 -247312 11439 197901 -149475 129360 35895 -8152 -97730 157015 -193357 -90936 -506524
15929 -506524 46965 -22379 -204459 -231046 118004 239469 292098 -374890 505 344982 -2956
15917 -382365 -65326 -119545 -115933 -174558 91972 -79687 78636 -45065 -97792 63150 -39746 115446
15904 246764 -31272 340495 -44645 44584 150255 -227179 -74229 92729 -55293 888 358334
15893 358334 -120365 -270748 3405 -142926 -78291 -58223 399895 -19539 -63676 -226832 -288645
15882 -288645 64350 104989 -59095 -79081 -24988 3549 256971 -461318 -192677 136115 -206809
15870 -196300 -106766 311475 -102704 -215824 87213 -160278 -79483 -107144 -86740 43781 -194502
15858 -24317 39515 189654 34392 63660 38398 25095 192031 255597 -126161 -160390 8183
15846 -65222 168781 7652 -267400 45333 -83686 94774 86203 12471 76368 -279739 -84906
15834 -33721 -70059 -169840 343121 -284026 -13865 104389 -188976 -171189 -127821 -148135 -358615
15823 -358615 -39113 -68213 97397 95009 -271095 -99994 -147416 129998 -70331 -552611 -24405
15811 -120302 132599 -82874 28978 -31048 103256 -116233 -124132 -177439 262131 -4540 -118014
15800 -118014 -67662 98267 -124668 -389319 440365 -148199 -106900 -38068 431985 330925
15790 330925 -72150 217508 -24228 57624 84049 -1296 84413 48964 -41334 49663 60865
15779 60865 -77081 157361 -40338 -74238 -57007 135071 -133728 -245158 211964 -239743
15768 -286578 -24694 -100476 -354422 41702 386015 -49287 -225922 -259776 -250440 93127 227191
15757 227191 -147393 410616 43798 31322 59941 144569 -103106 188175 40877 69934 -32598
15745 340558 -190019 -123966 19245 30844 -239138 166328 183545 -34917 -353315 -332981 24102
15733 39963 -90880 483841 254607 -302287 -483523 -32448 -150619 131671 -26382 -252155
15723 -252155 74249 -374838 -146990 68713 -108776 102909 -243203 -32967 -90049 -144677
15713 -144677 -209409 -44035 191515 -82642 86664 -26713 59859 255476 142509 7563 78015
15702 78015 -65699 -257085 -125962 18046 -174303 90583 -71025 -126748 -162359 -168082 27380
15690 -271657 20775 126022 -54064 -202489 91779 -359672 -99330 -175125 -240831 39052 -83113
15678 -176268 -207239 -406202 -80131 80742 210729 -452142 256955 73350 118563 66243 -266791
15666 -77410 -126451 54003 92836 105474 -161608 -346254 277664 -67784 -41689 -153632 -105614
15655 -105614 44610 -48830 135364 -192313 -217308 48152 137303 -240775 139975 90569 89324
15644 89324 -38457 -26096 24999 -24208 -175036 49383 -136967 -87519 33876 -284775 120270
15632 145399 167477 -134893 -76219 160332 27163 -478947 -157297 -114621 72710 -108662
15621 -389032 -64425 5778 -80512 177882 -957 105582 220816 304219 -242600 18651 -112141
15609 45700 -31884 261058 2619 71661 46760 168858 25470 -120374 -102297 14009 -196981
15597 -95916 -181742 66850 115385 -476632 -282010 -329716 -30765 310515 -218995 -135117 158572
15585 -178583 -273872 -292316 24153 -22909 -28904 -10265 -141026 -187840 64212 -332266 81859
15573 116621 123325 114280 183010 -268549 -221114 -100085 -75355 -278815 -57398 -149669 -36338
15561 151148 -231815 111674 -190749 -151969 -71181 -238740 -218866 -224778 -144079 -2130 137937
15549 -138482 -19609 147409 -182131 -281115 565 64865 223329 83238 199876 249652 360424
15538 360424 -16720 -122769 -76316 30360 -133843 -31189 -29873 -14644 57030 -157168 100934
15526 261956 527213 63927 448389 -136652 -39190 263447 252661 260834 -103009 -11909 126561
15514 98356 168604 181067 7447 458671 839 384360 253729 244514 126934 106983 174519 153571
15502 153571 215788 443319 290216 143150 200764 162586 179624 -162253 201638 16571
15491 383090 -63028 57855 -65693 196089 260368 -262624 85834 142024 18433 26545 249107
15480 249107 64326 70219 192675 174748 324505 148851 405465 698392 608457 359448
15470 359448 15609 177179 -6746 -48626 -36904 -139471 -112825 485440 -62870 -42993 203304
15458 67085 129693 -194310 -37767 39841 153025 -29887 112457 -51995 99016 167879 267721
15447 267721 -80385 129746 31555 114214 407310 655144 993542 1092970 1207103 658567
15437 658567 499780 174878 82956 -114173 200581 106489 5072 108077 254202 152343
15427 152343 -434 33993 -43190 138184 -30115 233811 90961 -10331 198295 221915 44762
15415 84035 -234347 89667 209420 -156113 -162576 -390802 67489 376506 -116003 -50034 -180541
15404 -180541 552517 203112 -141042 -101257 60166 -21191 15084 132671 263240 -98826
15393 225100 -37712 74589 375228 -171170 37990 317474 364762 63893 91027 92373 -3248
15381 60863 153240 237854 203655 -246692 -16284 230201 -77298 375550 86101 -76807 343512
15369 208895 193959 78770 1423 -432759 -22181 -6632 396657 201198 235589 53791 165474
15358 165474 103725 172865 285778 13958 -30528 290218 53427 242960 -212959 225659
15347 -50867 -47241 162997 37862 159131 357331 28180 202930 383970 171664 253960 -214462
15335 90246 163001 -229517 471804 17218 198155 385239 -20465 265378 112015 168849
15325 168849 -56348 137993 -96243 125680 106819 237387 241497 178850 -178849 92402 61154
15314 61154 196323 -171515 181037 79245 256373 359519 -142708 -208351 -184431 293981
15303 247337 219460 400913 -83772 -33203 117805 337180 -187997 45667 191145 -60897
15292 92 -155546 55621 -147055 299301 -143684 90763 169008 153815 159578 86030 -126510
15280 124474 227778 41044 -35326 -28536 230088 538369 186455 34512 11314 -407757 -169386
15268 5127 39889 286703 113093 58549 -50407 -85252 286434 114472 21431 20793 227574
15257 227574 -52204 272111 218757 -54054 129979 107655 302396 -39509 195905 19347 24946
15246 24946 71434 170756 299479 456123 1398212 2196433 1431297 1922967 1810405 612093
15235 126151 30924 60724 323068 59466 227661 238571 203072 -116123 117073 -68037 15728
15223 35441 -62039 352779 40934 -316034 97133 -84552 305433 110961 -65186 153794 217207
15212 217207 -140568 71272 247081 65470 121271 185242 128248 34538 -7302 118008 21558
15200 -85979 -48869 251779 -14371 62817 179516 1411 155582 101426 239550 -82009 40116
15188 451456 156608 17913 -279925 48604 90813 242803 -72093 75978 179603 158546 132233
15177 132233 -108995 158715 -101820 288458 114723 487325 56093 281457 8006 -125041
15166 -32986 1737 -66530 271176 -163154 78117 108216 256327 401718 -241420 2107 -238960
15154 295275 32413 113 203315 -97279 46083 53705 -1733 125069 -58055 -148530 -90815 -161805
15142 -161805 -172455 206846 68101 162138 215244 95361 -114189 190371 119763 39697 393147
15131 393147 8339 223211 156108 158455 121860 83329 60602 320222 274260 -109299 182443
15119 312536 286704 333733 447737 251874 -6376 -98649 152559 211862 -88631 2168 6340
15108 6340 62074 -9072 199132 -16976 267810 -134754 226539 125280 -63149 247927 218342
15097 218342 328635 85591 135423 387404 43424 33777 673269 -27798 296116 127230 -45289
15085 200885 -210497 -138033 261217 -106170 195347 291129 103080 295128 -195746 6576
15074 -14595 23813 41268 -262710 358283 197541 93878 251756 79316 283409 -163818
15063 165129 94926 -111698 -39310 143731 274626 226609 506027 574413 686913 278904
15052 284705 69631 176452 206258 340132 512468 295476 792002 462003 222977 301574
15042 301574 302497 231624 84683 320970 258355 93367 634389 356492 260205 278958 413238
15031 413238 578843 604379 664277 953321 663133 791162 540221 354236 683141 189183
15020 414547 769580 530716 742737 544299 474998 382358 691616 351112 28915 694099
15010 694099 673334 580958 263761 474344 391702 575158 644579 73447 458444 403548 611310
14999 611310 749001 481349 335027 390786 466548 357867 28813 386035 506335 282433
14989 282433 -13242 542093 699165 642416 391907 416567 576911 660377 811041 736602
14979 736602 653241 528230 458898 788631 443444 618629 664250 383211 536709 543218
14969 543218 803107 633213 280015 278273 467705 369753 473269 -84999 255715 62195
14958 283837 -52039 349318 391247 345144 175638 261341 404815 382146 469636 58734 284374
14947 284374 117768 582158 61472 395911 568508 495513 836705 746788 345722 291041
14937 291041 522007 436222 572371 778087 742161 720665 485872 1210960 904845 1054506
14927 1054506 876436 1253280 1376353 1562467 1400339 1630175 1401989 1375343 1257996 1587899
14917 1587899 2082301 2387994 2240865 1705980 1417270 1217706 1046635 960626 749479 411819
14907 411819 472531 548728 410414 294547 420640 400691 113549 736065 319308 687115
14897 687115 473265 135162 528020 406132 423800 470785 534371 184854 431465 454250
14887 454250 392028 527354 457135 708449 625643 729706 827629 930088 769507 784525
14877 784525 536085 794122 507841 704857 248733 376778 453511 516144 596473 630990
14867 630990 400543 552520 635093 914927 646015 660629 136874 507890 576369 344578
14857 344578 311364 578336 542334 104643 415489 486000 391599 597916 507206 650672
14847 650672 239337 603017 359069 850024 1196282 993771 983564 1230127 1065369 1078964
14837 1078964 1164540 853275 1128143 559654 494063 660688 247914 526211 413787 319349
14827 319349 576597 660734 735716 428937 488040 504342 608594 700678 681862 734021 847797
14816 847797 1106234 719491 622701 936391 717442 364378 644831 655188 918984 873446
14806 873446 871281 993717 613470 843898 990679 948332 592750 897499 318044 786531
14796 786531 527464 553296 718139 707146 550541 808367 756376 499894 430637 582681
14786 582681 804409 525756 863218 878126 818835 491394 800397 601121 629367 818635
14776 818635 682252 866286 816301 851503 1026967 479775 711873 713931 647155 634861 380355
14765 380355 566901 519211 340651 661571 484371 658465 345556 618186 601554 852071
14755 852071 604172 1046141 827227 578697 558299 696667 841716 545006 511139 646036
14745 646036 903855 653871 694411 841191 615068 583467 510320 726804 646902 1010643
14735 1010643 772266 716685 611416 1148889 958033 1040152 1161837 1244897 1048059 1608054
14725 1608054 1975829 1967529 1541552 943993 829970 1195356 643738 690803 887269 835482
14715 835482 859535 659591 1047526 859504 761948 1257351 1046597 885844 1073981 1209160
14705 1209160 1143677 878786 1000087 1233963 1604192 1715027 1610415 1741283 1247542 1115446
14695 1115446 1351794 945099 1134672 1183710 818870 891099 1004566 1186853 821046 1128120
14685 1128120 1007638 880175 1004484 1025761 1005254 844841 802696 795233 1223495 907540
14675 907540 869999 847117 893005 1026811 1023727 1139217 1278360 846694 1356861 955616
14665 955616 1262583 1348936 1110522 914782 795229 881015 1040401 788520 1406172 806169
14655 806169 1099304 889380 1336009 1275363 1343847 1365663 1537672 1176228 1194244 1103071
14645 1103071 1318536 1218856 1390749 1312191 1313037 1303500 1104050 986829 1121266 1086543 1244955
14634 1244955 1098017 1111870 1290277 1487355 1275339 1116350 1271102 1245213 1307625 1434342
14624 1434342 1348781 1612145 993292 1540902 1154763 1397208 1258833 1699400 1415279 1398818
14614 1398818 1049230 1414299 1455298 1120016 1398819 1380997 1567376 1514164 1067471 1668156
14604 1668156 1470297 1925829 1432616 1506068 1505115 1949794 1684973 1877737 1629856 1558354
14594 1558354 1816812 1747377 1622405 1681622 1938656 1499319 1979254 1689848 1817976 1895500
14584 1895500 1948352 1693292 1750168 1705747 1885077 1699914 2175828 1611078 1951082 1810024
14574 1810024 2002735 2270658 1982536 2370071 2152266 2219533 2062065 2286551 2438418 2088450
14564 2088450 2226787 2436155 2252858 2604377 2800521 2638741 2964480 2891784 3421702 3508172
14554 3508172 3423266 3724674 4394388 4618752 5274335 7170765 10392066 18806075 39810676
14545 39810676 43013731 19815946 8207616 3620930 2600639 2343938 2452433 2857203
14537 2857203 5494482 4568417 2823737 2085622 2251860 2036137 2048818 1971790 2192575
14528 2192575 2147835 2549368 2207070 2113732 2065786 2326707 2304433 2572263 2505876 2525466
14518 2525466 2320491 2570169 2900789 2739317 2544023 2203979 2227486 2627111 2645532 2789627
14508 2789627 2867200 3236425 2823693 2522317 2898505 2934126 2947878 2877776 2741363 3580837
14498 3580837 3264380 2960172 3115195 2898943 3134657 3122538 3407567 3443031 3518835 3367081
14488 3367081 3400159 3947844 3519754 3515524 3558571 3710101 3567104 3745666 3999084 3680504
14478 3680504 3683264 3765517 4140081 4121707 4327856 4289113 4055469 4408632 4213730 4144685
14468 4144685 4473990 4492808 4304348 4457141 4527045 4765705 4858903 5005231 4781581 4739465
14458 4739465 4899912 4753386 4786868 5135459 5400134 5212162 5169959 5550139 5107569 5468201
14448 5468201 5651394 5580957 5934793 5471491 5955543 5918999 5912357 5989695 5923016 6386883
14438 6386883 5834105 6461430 6374041 6187134 6519784 6728420 6494747 6714384 7375255 6934983
14428 6934983 7108780 7468483 7343268 7372383 7580679 7775987 7841572 7969702 8114051 8344491
14418 8344491 8632545 8756458 8775529 8775269 8939649 8646708 8481583 9317594 9254910 9211135
14408 9211135 9673317 9517901 10035282 10106342 10395673 10494518 10722650 10300711 11017569 11033511
14398 11033511 11072355 11194641 11220987 11420674 11451749 11857741 11949410 12244082 12776339 12787935
14388 12787935 13009871 13286286 13756762 14031664 14367032 14412778 14571005 15149241 15282120
14379 15282120 15444051 15772705 15974039 16247041 16491764 16616214 17061357 17741953 17975209
14370 17975209 18070483 18701494 19027214 19737390 20251419 20114329 21028319 21477289 21645880
14361 21645880 22193306 22404439 23174802 23475837 24154795 24831849 25072526 25662250 26410762
14352 26410762 26998584 27566988 28240082 29244943 30003895 30512824 31494351 32146217 33024565
14343 33024565 33872230 34707568 35424175 36803954 37673027 38693399 40156966 41129816 42385387
14334 42385387 43693031 44709188 46306950 47818447 49313916 50831611 52751472 54152434
14326 54152434 55861681 58049797 59864712 61554818 64132189 66278122 68628864 71354662
14318 71354662 73992410 76405040 79290566 81987343 85238117 88102771 92106283 95558656
14310 95558656 99404151 103651297 107918343 112253833 117227742 122779345 127796897 133188908
14302 133188908 139430822 146077527 152896954 160023634 167434572 175400035 183668798 192604322
14294 192604322 201962796 212105946 222238642 233228315 244422975 256463019 269272436
14287 269272436 282400684 296007064 309900460 323739550 338648177 353193726 367742762
14280 367742762 382200177 396705958 410288333 422968282 435191818 445694423 454221315
14273 454221315 460473790 462756609 462975920 460789815 457319043 452356039 448712360 441502101
14265 441502101 430659874 417764831 403467889 387802966 372004619 355871543 339976309
14258 339976309 323741189 308102140 292997016 278306291 264134730 250414508 237605517
14251 237605517 225279597 213875635 202630688 193321316 184964783 175604442 166847320
14244 166847320 159402689 151548651 144280544 137265894 130998966 125076717 119839950 114627477
14236 114627477 109654145 104794174 100503389 96424446 92543587 88622894 85595454 82273964
14228 82273964 78886383 75800267 72913102 70338075 68104229 65016390 62705125 61030282
14220 61030282 58914049 57321904 54989602 53097319 51527122 49767155 48674703 47427715
14212 47427715 45645057 44286329 42994533 41433242 40669396 40051849 39045022 37663050
14204 37663050 36320635 35173519 34123896 33821319 33069539 32000047 31084025 30314312 29312488
14195 29312488 28691316 28386235 27631613 26791604 25791039 25272420 25089332 24330958 23820313
14186 23820313 23106265 22666322 22374657 21465040 21151288 20756938 20381131 19828936 19651303
14177 19651303 19072910 18720188 18480884 17840785 17569834 17160537 16894962 16710237 16141961
14168 16141961 16206408 15654075 15212448 15164167 15061302 14741968 14424001 14396171 13948174 13599876
14158 13599876 13371365 13321791 12919366 12959159 12661294 12292565 12249486 12274633 11759980 11399621
14148 11399621 11119695 11246513 11162016 11025609 10488165 10536237 10375540 10243978 10156761 9859371
14138 9859371 9995872 9445942 9902053 9642256 9554303 9245028 9213521 8730942 8780129 8849603
14128 8849603 8429009 8446580 8187051 8416897 8060883 7707722 7939068 7742000 7649855 7501549
14118 7501549 7534058 7189917 7212574 7127625 7163836 6875708 6611344 6908265 6804866 6919154
14108 6919154 6713170 6281221 6135791 6258123 6070833 6417042 6204384 5663698 5740270 5365772
14098 5365772 5821587 5872414 5755681 5608714 5713339 5498741 5232309 5511823 5658831 5142508
14088 5142508 5258481 5185567 5161829 5168214 4830770 4783321 4911450 4754887 4983751 4625289
14078 4625289 4682094 4428157 4498754 4622591 4658652 4535890 4481903 4300892 4270647 4222271
14068 4222271 4160336 3873749 4002736 4003701 4178126 4045878 4147981 4027990 4243176 4118483
14058 4118483 3842641 3811518 3880047 3652394 3701698 3970327 3483503 3606756 3792434 3538719
14048 3538719 3455672 3179965 3341947 3287145 3462372 3421880 3446193 3671022 3388278 3392027
14038 3392027 3372251 2835788 3004582 3052890 2997754 3254230 2985889 3074970 3143744 2830767
14028 2830767 2847372 3318621 3277425 2828151 2445751 2752860 2790326 2466272 2723850 2369753
14018 2369753 2733411 2705283 2560209 2435190 2636344 2330510 2374185 2832005 2546798 2697208
14008 2697208 2618354 2344270 2282540 2659497 2609347 2291614 2472682 2342650 2345673 2439700
13998 2439700 2261171 2254624 2147843 2110242 2217351 2162123 2301464 2485153 2682065 3638582
13988 3638582 5681453 11506493 30842837 46077487 26855868 13469461 7752393 5452736
13980 5452736 4395625 3897469 3822095 3272982 3138847 2670117 2532965 2572728 2619931 2743130
13970 2743130 2503291 2589751 2466606 2343177 2054461 2450125 2303426 2146782 2201605 2271880
13960 2271880 2343030 1883721 1822674 1994611 1741484 2110794 2401022 1858744 2153348 1628659
13950 1628659 2060255 1752149 1781282 2189745 2131956 1872001 2078339 1709744 1674423 1665574
13940 1665574 1815800 1676233 1648137 1654736 1927832 1599816 1558458 1540472 1689533 1700467
13930 1700467 1411062 1560098 1585444 1471983 1530817 1556139 1429262 1487840 1672178 1532470
13920 1532470 1806969 1566066 1363017 1481444 1297433 1385393 1394696 1416070 1611439 1458470
13910 1458470 1351095 1330030 1575579 1518983 1160873 1529233 1155297 1455661 1277190 1293162
13900 1293162 1405520 1215342 1199080 1402080 1298716 1272146 916542 1474112 1362401 1159683
13890 1159683 1069551 1294754 1064488 870875 1550544 1277042 1070700 1435212 1116818 1114600
13880 1114600 1383904 1135549 1245006 1328773 1065583 1138901 1087148 1186339 1185270 1423845
13870 1423845 1131556 1270787 837137 909636 1224589 1063338 1254946 1214275 1023995 1054642
13860 1054642 761690 795599 898936 1038614 1059594 898048 902764 1239120 883674 953499
13850 953499 960898 988886 676900 1267548 763853 1080692 1219021 1030183 983676 958625
13840 958625 734345 932710 730384 970107 1076438 782751 1093902 849480 1041718 919435
13830 919435 623478 583324 1110012 832881 746739 1263616 739789 970199 827939 890325
13820 890325 881255 593911 849598 948237 860700 860783 1273187 893328 864751 849754 954627
13809 954627 822363 932430 733465 543323 734082 796060 628535 905049 742683 640138
13799 640138 573437 636634 682428 477070 840515 773185 700473 788093 909480 666995 605724
13788 605724 660278 869672 653383 729529 725679 571083 1050476 635349 898795 876158
13778 876158 889156 630535 799438 636181 883323 386817 746694 989777 566177 669942
13768 669942 951722 1056760 801590 658401 1200475 794950 728763 509056 553598 840233
13758 840233 1050563 435978 937319 825770 812835 873204 509714 774581 583724 573636
13748 573636 939867 330826 585622 565649 437119 687236 75465 419830 329631 374981
13738 374981 229503 499519 545292 643500 720484 659140 759399 781395 470262 303629
13728 303629 642430 916320 714344 866349 619276 588849 568447 553781 638948 621437
13718 621437 708419 542812 461310 523823 407628 568599 784408 813441 586211 394050
13708 394050 293225 543676 244346 692673 372925 453965 506092 447357 498405 463213
13698 463213 218548 459932 563429 458089 708316 396208 450542 514359 82497 219364
13688 219364 305115 385956 464442 429615 443590 416937 639937 674495 490999 349632 606524
13677 606524 459305 328430 495831 269377 281719 447198 467409 438357 648369 224551
13666 68644 345471 387241 412825 466075 335870 803182 440166 403492 279153 409209
13656 409209 340650 407716 628931 564312 514089 473648 659910 472960 306549 120529
13645 398664 770024 559352 414769 335466 194455 700164 543862 433228 427995 475544
13635 475544 361674 540396 892026 364474 370412 272456 318276 630172 553723 514638 440535
13624 440535 676085 391762 328754 248015 296339 676795 138457 410862 16331 426266
13614 426266 300948 413338 310833 61506 659934 552815 275633 164373 397247 400506
13604 400506 453459 148427 280943 306480 654113 381556 363189 424314 203392 93717
13593 344901 133907 357227 279839 -14142 585496 346188 268295 78016 93417 521764
13583 521764 359908 134731 299322 525178 269141 339951 364919 414288 -11132 395272
13572 234768 369484 200652 157695 173025 389984 134254 259158 291829 432107 107865
13561 411061 378152 287119 284504 216387 314264 594526 133151 268152 324523 415579 296414
13550 296414 656958 436786 161874 446774 359399 253106 -3549 297629 440048 363239
13540 363239 1961 171715 402339 59946 -61361 36611 561138 256020 270621 235488 276385
13529 276385 40637 252744 59249 342727 121745 201055 242713 446630 530385 253271
13518 265447 255209 450126 108008 446872 315817 457216 424111 151330 290864 143590
13507 235166 265208 677997 392820 406867 62865 382742 214242 198166 413503 -20587
13496 235477 235647 210280 123684 199293 384688 192355 112925 134293 388796 408197 292055
13485 292055 266850 291876 150045 733347 151968 -5955 220967 437626 374721 91601 97123
13474 97123 37535 333936 526517 49889 285878 412842 98272 401141 157462 193315
13464 193315 65085 244905 111979 237700 383968 259990 -137125 126751 256423 145140
13454 145140 418149 283196 278625 170462 295564 485610 95591 62816 169050 51088
13443 174111 132899 153708 191338 396103 106371 216388 107499 85036 328424 -91011
13432 181716 331298 -228100 170770 -64689 466575 397738 250204 231881 49079 302511
13422 302511 33760 148988 380359 206526 215278 92504 410655 363489 118816 145234 42458
13410 -87551 190646 249946 49148 351370 440851 -145982 119298 -142692 178335 242687
13400 242687 57380 68090 263802 6617 114196 137594 182975 95706 145317 52022 313181
13389 313181 290398 -170585 -90459 365555 254075 114682 70428 252225 5475 33194 185943
13378 185943 174355 202662 174165 246450 328911 145105 36660 115038 -70856 178938 -94329
13366 82694 330197 203346 432242 198014 -208848 339128 -92703 396490 327431 387983
13356 387983 156149 343688 76428 210216 212218 80794 169639 201377 -162986 178531 180481
13345 180481 371185 349190 543566 231817 111848 431354 86600 332545 39998 619430
13335 619430 305114 179980 172028 276226 110947 194461 200744 -50716 231030 242945 19060
13323 346449 -48277 187849 322217 205045 366486 -5433 24104 341835 188711 73458
13312 -217935 133390 529665 117365 60858 158757 56481 149488 174119 182351 93676 335758
13301 335758 360163 205242 -50184 224561 16267 137842 314278 76690 37968 -14199 101199
13289 568768 283940 -49102 102306 82563 276643 116743 206591 216864 254494 -91519 -379686
13278 -379686 198238 94318 154732 330962 51082 147629 311972 192367 74948 -98591 187956
13266 95179 202373 339022 544247 28191 -200344 161509 -35074 255423 33083 397070
13256 397070 -164209 318405 83566 343025 286233 342532 219328 22723 115747 2157 414932
13245 414932 90345 173852 41011 119321 -32118 87271 38963 125091 67353 251356 -378292
13233 -89734 438375 117828 -127568 190117 152435 305480 -61808 106416 -46073 297732
13222 -62819 153360 -24926 64270 165025 209715 411200 116866 349248 -165809 129349
13211 210530 215579 133252 20786 -90116 57509 23021 34790 255410 22074 -98914 -109629
13200 -109629 -114693 59926 33335 95149 92688 190302 84563 -46139 124392 176327 -94821 215344
13187 -73556 118749 337543 -93240 87828 233536 23140 -129011 142638 160790 72605 -49567
13175 -108949 111444 68334 192619 39200 41262 -31438 128301 -30609 19677 54106 253423
13164 253423 -176559 -26293 4842 150532 347679 55332 2197 -197129 -10792 133857 225458
13153 225458 -21438 163549 101652 211362 -31456 215840 110128 -51972 61939 -8629 -240593
13142 -240593 151395 -101597 238426 131469 131655 -46792 -125738 364878 64607 -89451 -283262
13131 -283262 4075 84224 26017 -104327 127725 -57709 257045 285241 -9508 142782 206655
13120 206655 317969 355131 184644 238225 -126299 179769 302529 -41982 96419 57596
13110 57596 293206 39197 66811 -141593 -68673 -116435 -37031 -175051 78250 293472 -19432
13098 24364 -119186 114326 86896 -211246 354823 -317998 103175 22869 -49908 -52800 195228
13086 -52625 71719 -43895 47860 194727 -198624 -12686 -180934 -173564 268475 -158454 -18213
13074 37795 99160 -53749 86896 76301 23659 73225 -14447 18800 -57465 -335513 14166
13062 42563 183169 308562 -228541 59067 -63475 192209 75434 57044 191602 199895 -20962
13050 245827 169284 167427 201432 19139 346972 178794 190598 -155350 974 40947 39409 136892
13038 136892 304656 437971 991 51529 37558 40962 15722 35523 216369 -58186 363013
13026 239423 46103 -58326 269058 260088 249038 302486 27558 135849 316411 422010 -62644
13014 312742 -11597 103318 18518 200924 38111 -101247 131069 -5480 -103015 -96479 -290913
13003 -290913 -106895 -151710 -918 14418 -11219 184919 -24751 410742 168571 -141227 -21791
12991 260924 -164895 370831 51528 -111081 15685 101910 2841 345660 81838 -85174 169724
12979 83565 738 -345448 -41536 -79819 -131632 -178553 -92661 -195459 -171 -129626 41892 74777
12967 74777 58464 175575 -128097 9101 162289 -28109 -51591 -224944 148241 -46666 66131
12955 262909 147503 -104308 -143912 -30801 -44125 86816 -90556 46857 -207906 65954 991
12943 187689 50255 25263 -186319 -72649 13031 93295 -34870 175841 -163153 168854 74664
12931 -187707 47614 -7529 79196 1028 35879 276260 85 202503 40236 -234815 -118476 -182438
12919 -182438 42682 168166 134550 -60046 -159383 -201125 -241874 42162 -14432 148793 191681
12908 191681 -139079 156473 147448 -280885 5687 12026 -68237 -42457 50123 879 73856 120554
12896 120554 140395 -55486 -85599 -93665 197056 -81498 148526 -325010 -105662 -190057 360
12884 -208446 -234044 114017 -123506 186441 8319 203562 -50148 374928 117807 -356050
12873 446946 147189 286477 -130113 346784 -41492 146194 24255 -92380 235554 -52508
12862 -102863 10065 -332018 -221683 -25367 9322 -61854 -49287 -157196 232548 -167365 110123
12850 72693 -169531 -198173 -43582 -101572 -129421 157201 81443 -350587 176346 -82926 310404
12838 -264648 -151922 -1672 219082 126128 -266526 189051 47853 -128782 239585 158930
12828 158930 9936 23639 309136 -439150 -104404 -280109 56952 129459 48698 40767 122469
12817 122469 176030 -43483 257135 -332015 -118047 305388 -176502 92619 -7248 -76449 -36864
12805 98098 -13391 -87704 -88299 156693 -137027 113319 217573 69289 -24197 229779 24292
12793 16069 -9238 51875 -311901 -4356 -310352 -16819 -192796 189437 -81934 256577 50153
12781 34074 -24229 91269 -179856 -198090 -65395 -259269 167153 550 -158924 -91661 -324114
12770 -324114 -197814 -344640 79490 253095 176865 24555 -123270 -73882 189818 -37594
12759 -28819 -96566 -89973 -57039 -110867 140832 121592 97690 -8899 146058 117164 -221591
12747 -23697 -26973 -210664 -204577 79257 45997 328820 127634 -146018 -108365 204349 351999
12736 351999 153664 5428 111872 1397 183291 -142891 -123459 -27100 275250 356050 86786
12724 -8274 -51808 208776 -90759 246769 308091 -25471 134772 -28870 21012 171691 370175
12713 370175 171902 263056 162288 139213 220573 94160 400774 422515 264506 -126470
12702 237362 224952 -97580 57123 125088 -1268 220324 120179 -17008 104706 -379383 -192845
12691 -192845 90181 284760 -281173 -221337 -94029 474943 -76533 18832 75851 51946 -100085
12679 239540 442437 262196 101128 130344 174999 105415 99036 -137175 150630 52295 301380
12668 301380 115334 -76844 -132364 -35352 -196624 -123 -236327 7724 191509 -38128 204484
12656 -26138 457483 217148 19530 -4056 103328 259965 316338 -26464 198116 -172712 260955
12644 85719 131371 38299 -139381 -159174 -231063 90845 519070 21562 -116722 -4821 35272
12632 210779 242482 -133918 149810 327322 491844 56177 28475 354245 70350 -251508
12621 117738 161985 -91971 6101 65362 16018 -129847 -335627 -87284 79855 100162 -107720
12609 267853 -13889 22886 -140676 176353 -153940 160866 195288 49258 34656 81086 157715
12598 157715 80235 202706 -157571 -66523 88014 -15258 -309329 18298 16915 95963 25510
12586 174040 158072 -150653 140764 61113 -301870 -135031 -110785 72620 -3562 111545 12031
12574 85017 67936 54890 -105065 -152937 -98502 -195056 -188792 -113606 -44377 9637 210878 -8718
12561 5200 181230 164627 131707 107707 -188460 -161103 429685 139868 -198707 -213452 -219778
12550 -219778 139683 -107722 142236 -58191 45189 156171 124655 26485 146716 -8285 -96177
12539 -96177 128043 126120 72082 -58422 -161242 -363867 -74217 -121959 63331 -41216 213957
12527 -420676 68858 59371 -158842 12404 98005 154483 137566 -11629 -109270 -138426 8987 71347
12515 71347 -86712 182061 50375 -43450 196460 83037 122378 6079 169230 162512 -117188
12503 33031 -358979 78514 -157023 -208821 261927 194742 -231586 -25538 -24711 -50012 -212510
12492 -212510 195181 7355 -47044 -188179 -55379 -63240 -57917 310775 297646 -305213 92176
12480 147472 -214914 -25383 105138 9033 -51474 -324109 43030 251164 -85962 109887 1706
12468 -94375 -172955 -4807 219084 -202200 -308443 -112747 206843 -185171 -114219 -169337 -5655
12456 -92574 -395018 -233493 -108991 138229 160370 -176122 10941 -111216 -236662 -261021
12446 -261021 23593 -267647 101787 -125790 -129400 229629 28811 85016 8485 -459400 -96050
12434 102098 -129916 48917 99305 -7846 -125149 18680 -331881 144274 -23564 -26049 23748
12422 22008 -106480 -185391 79780 -125503 27115 282483 -224515 263505 -149390 61039
12411 -282441 -336125 86914 -37989 -194266 107463 -115498 238917 -94384 154692 -38169
12400 108742 -237769 96338 -66104 382125 -22604 -3705 423702 -82057 144204 146422 -8398
12388 216059 286724 102014 22673 309951 90085 129190 -5850 -232277 149396 100431 5035
12376 198817 289903 123963 3523 -222611 90569 -142612 -9298 219164 -56172 176732 125080
12365 125080 -34540 -109841 -87023 -72712 -18530 88426 150749 204743 38040 171892 -171339
12353 218908 -72729 296399 115126 159855 -43691 32573 77272 -209462 -240556 37909 -85548
12341 51993 92311 203986 -167891 398011 -99190 205578 -51377 57105 489412 -186234
12330 164612 550948 595726 467192 121646 250427 268615 312594 562228 355414 163910
12319 347649 -226603 311447 199542 383658 307051 70390 151232 101858 271865 -9120 303416
12307 160187 43637 20368 26471 -81201 14976 -132151 242339 308040 152752 261773 -94125
12295 260132 -31296 108871 -54011 151949 182042 234045 78266 144247 -1834 -7533 -159038
12284 -159038 -61026 147864 20742 -108951 -337325 97009 47430 344778 133238 71181
12274 71181 210646 -185854 -71922 51971 358226 51813 52647 137884 41164 249104 -179756
12262 -61667 144230 201256 505401 -81276 -140976 174076 349808 248892 -133463 52242
12251 430393 323381 298925 158240 369811 -83275 259759 280068 241838 98518 261684
12241 261684 16947 22588 113616 57506 356639 -115132 92686 35732 229666 -66656 576718
12229 322222 181973 434434 90973 191574 82707 303438 202008 357797 264769 270754
12219 270754 78392 353226 482382 241553 -5915 -244200 -143566 293932 -253737 177862
12208 289182 294938 151702 65282 28963 124967 -9150 196434 142498 -16950 21783 106202
12197 106202 19305 -19119 27221 114014 22719 25954 385021 201416 -28567 288067 110975
12185 318615 -52739 420960 -5389 122034 114543 126812 151476 -149114 -139309 200398 254457
12174 254457 401297 263505 144635 -54591 256382 324588 303400 -52325 418721 291664
12164 291664 162313 494626 315100 77394 523013 -28395 229695 412221 65309 155685
12154 155685 -14907 25331 -435568 -335559 -57123 79493 -180202 -14950 -73022 41143 125608
12143 125608 122581 188656 157298 288795 101335 295734 88548 54495 44893 -103129 224107
12131 186490 163312 163832 242351 -33486 164093 321866 -16888 -126704 510459 69470 56174
12120 56174 528667 228732 -153326 221065 279148 419744 223257 39050 46684 -334797
12109 -219159 -282049 326938 17876 113497 140492 -98555 -129935 114090 129626 325009 -87485
12097 125966 -32199 256199 230626 -232838 -120781 -19326 66765 22235 121142 42060 234124
12086 234124 127039 95028 -110709 530647 47400 143738 78513 262064 206631 -35225 252667
12074 132244 308735 84557 112785 127236 122225 204637 104827 224590 135990 211154 137048
12063 137048 -163563 -27722 150069 -226012 -187175 124743 125319 127798 228424 3160 198175
12052 198175 -113333 -254853 -44513 -163201 293342 -40891 131211 22799 242803 -10834
12041 -38578 266419 2599 -98513 68506 149195 -85660 369710 -76901 -98962 -190077 -125601
12030 -125601 91805 -76664 -149792 33069 -100565 -24225 155324 314042 -229091 -113346
12019 -59115 -135634 29601 317231 -35023 217307 -11547 -23331 -62997 109432 -75810 121058
12007 263145 118199 -57104 156490 347192 -100316 -132225 -33221 -363964 -62773 -163243
11997 -163243 -113612 40113 213386 -97425 77375 -255892 238627 -219450 175693 344284
11987 344284 58062 -53812 25597 -146416 -151816 -165296 -244588 -99103 -185604 -52411 -65968
11976 -65968 42373 -22427 442767 -74116 101508 322818 -173414 -80629 -170582 -101872 1154
11964 -114122 -266439 320485 139927 -113982 -166128 38452 47774 -46455 -142638 19535 156031
11953 156031 -22298 54757 581 -178974 10307 92574 242266 -130810 -124402 -172139 -157074
11942 -157074 9584 -183040 188153 -137474 250175 -135806 22433 6412 -59824 128633 -79548
11930 203493 56905 -393577 11759 48300 228996 -3071 -67158 -153355 152914 -104662 111715
11918 252076 -55446 -122310 191437 195395 -71481 170448 5200 61764 379025 233874 -7315
11906 -83702 -140137 335203 -108910 106776 -63947 255 124586 59399 -248185 -464607 -208153
11894 69064 -165623 89194 -71247 47441 128820 -474758 -36706 -52144 -198140 180588 215939
11883 215939 -313948 -132216 -32477 186161 30184 -56356 190001 -165046 -200300 -33786
11872 -119510 -198959 147746 -115396 -73990 -166290 -44857 -10190 28062 44483 120034 229935
11861 229935 -271415 -178574 -72746 -125267 155938 -35093 -135478 -392938 15663 -9103 77819
11849 -48823 -239184 14063 -103643 -80906 -136621 -194952 -221586 -95070 74104 -44117 246303
11837 -156652 190435 -172928 124209 -146861 17084 -21658 14165 248662 8293 220877
11827 220877 100213 -632091 206910 30224 79151 158578 -209340 -118184 -334317 -254932
11817 -254932 103434 -43806 164034 184869 -61417 -39174 -104030 94300 -33411 -130691 -23089
11805 -330814 -254238 91909 10400 -50595 -264925 -77635 -318456 -162683 -94870 127462 -155377
11793 -62268 -7667 99796 -43083 53011 -182002 109181 110132 -440758 -3843 -107051 -300236
11782 -300236 -182331 -102105 -10579 3130 116519 279050 -155499 -147207 -224631 -235748 -143459
11771 -143459 -172495 33335 -288480 12206 -240356 -207377 -281528 205124 91860 -11363 -220376
11760 -220376 -275610 -185341 -67269 8213 25361 99798 -39095 -135094 172612 55436 -134518
11748 -151162 61485 152001 -415835 440560 -64734 126661 -45474 -129193 83076 10977 -93092
11736 143963 284173 124093 161779 172939 -191258 164377 78759 23650 285492 151152
11726 151152 191749 111403 182068 94217 100832 -166983 -246456 22566 -78066 -36201 -271286
11715 -271286 7724 176213 -178893 316021 -34919 10505 69328 121521 50579 192087 -110499
11703 92930 147601 407725 130981 38151 162452 -223201 -130577 136252 85349 124618 -260658
11691 174883 -126049 -304662 -151492 -2355 278453 121662 142909 124757 -56205 325964
11680 -72629 108737 -26711 -857 123716 84315 -4618 60132 -80765 307032 15506 312750
11669 312750 459523 141957 -209709 -231620 -35486 -208158 151645 99558 3826 -154294
11658 156689 -123957 -353730 112670 -213834 -125981 -130052 33494 -76704 276374 -194922
11647 337001 49722 111775 235867 153688 220671 -136591 258312 342004 -90667 24561 396512
11636 396512 -130842 39463 202970 -59712 248893 76531 -207638 -26467 -142576 -24844
11625 -124095 -138346 -38394 256442 -112565 189710 130475 401826 60754 50729 -270360
11614 -169571 -31060 39844 39891 99329 117712 65046 -121993 291348 427571 -82555 -117384
11603 -117384 132600 164092 -39541 -103747 290590 -292863 -64338 -71902 -149283 118553 -49687
11591 132230 135564 -335934 516753 249492 -24115 93381 259133 -335751 -188670 195722
11580 196701 -160320 101732 -171952 -136746 3156 43535 -40900 341278 -34873 157423 191698
11569 191698 -35600 29826 -234520 263470 213893 219664 -127532 -66469 -258687 -135438 -143950
11558 -143950 -43081 200647 249013 192793 -224847 -14784 206883 329815 100499 -195687
11547 -183718 192087 -297218 41435 -47390 -128747 -175295 -117722 77301 75340 500363 225413
11535 -106494 171857 -31126 281568 52786 259518 186923 -252278 37181 120222 -16240 47899
11523 -90329 -217050 51171 104219 -65678 -146318 -13089 52678 219408 71305 30621 299673
11512 299673 140098 219445 -23394 241093 22837 -116506 183944 180789 -17776 260077 -28856
11500 133256 -115614 152496 100094 288625 227436 172303 -180727 13289 -104091 -16757
11489 -186124 191636 -53629 -33972 177555 -15095 -28982 67163 56992 19505 87187 -88451
11477 -67723 -57287 64730 50624 265699 87527 -60985 -56900 -168460 -86377 19461 -241193
11465 116880 -99151 -383100 171572 45388 15994 -17167 -444313 245793 268479 -52753 78906
11453 -52944 -386979 48654 65428 -54553 193045 -137522 -448727 23810 347660 217536
11443 217536 -46365 -104892 -241346 197380 -79843 27521 105556 -145282 -45880 -105679 85831
11431 -25454 129892 -64884 218296 -265554 230451 196449 51770 -3288 -84591 -201500 98674
11419 -403480 194388 -115302 -84883 304068 86931 -41419 120043 -303079 107310 -19813
11408 -83817 -179066 132992 85834 87428 277141 76403 81535 -25244 67479 8924 -9710 154451
11395 459302 -82585 -39728 6662 -68619 29527 -187879 -14287 -277362 166717 -15224 -145851
11384 -145851 -168486 -53127 108726 26704 -96518 20938 -88850 -118996 -171724 59513 224620
11373 224620 128164 -30870 -189695 20802 -16686 -109604 -401654 71247 -8599 -160820 -208272
11362 -208272 137608 -36862 -138195 -187999 -213879 4963 -91368 -127862 -48524 134816 -118541
11350 171074 -61929 75219 137755 -57840 -2255 -6966 11613 -7850 262936 -224161 -301488 -153339
11338 -153339 27698 8767 18087 -53856 -185874 -128331 -265831 155152 127308 19980 -128995
11326 37862 60482 155831 6705 24053 47981 79293 -358349 161822 -130961 -361331 -91203
11314 -83420 115943 -286573 -111291 -343082 -91467 94247 -175753 117952 39695 417005
11304 417005 -367936 38648 -20181 -9257 176240 -251901 -202266 -37391 75867 -18088 -302656
11293 -302656 -142471 7894 -134595 -88041 157132 -121072 -211508 102987 -41021 -144502
11283 -144502 19942 -69017 34599 27303 44466 -258281 233824 -154494 -125374 -354918 -343064
11272 -343064 -289752 -85645 -296291 -62670 -215048 35799 75405 167140 -157234 224373 133354
11261 133354 130702 132646 55739 54730 93289 -58412 -134191 66487 33778 -85471 -150791 81609
11248 -478948 -18136 -106916 247616 232349 -361575 -203599 129785 -29617 -38752 -199107 113663
11236 241908 30550 171749 83983 157684 -227027 82163 -67087 -146973 83634 -299690 -130322
11224 47001 -126419 164786 -339378 90011 59617 -152371 -123389 -178831 -69214 -275835 782
11212 18000 -32554 -215798 -86413 78650 84193 -24772 -69424 -17009 -93126 69212 90273 255485
11200 255485 -228803 34984 -49413 169246 -239648 -173033 114554 -300902 -134637 -134748 235302
11188 -210381 -218439 332821 -133057 -176115 -77067 -91619 89417 243425 64999 -163603 -399040
11177 -399040 -268173 -158482 -89707 -9362 43206 -140671 -224817 -85639 -115257 -329091 22931
11165 -130651 39001 -215493 74768 277091 82343 -232434 -22172 -229781 64536 -296484
11154 39750 -45056 -116590 -294667 290404 138009 -26766 93459 65898 194119 -19322 -169962
11143 -169962 271018 174148 -139088 -64723 281663 199647 -95529 191856 879 -235362 200193
11131 -55462 97014 -55563 -168048 -197084 -259356 166569 101999 55342 5825 163362 299486
11120 299486 -22604 52002 262084 -189154 60027 60044 150597 -92005 83125 26781 76157 -68142
11107 136613 -95563 -294243 -194189 200374 175734 -16494 -3682 83503 -117622 266238 288792
11096 288792 324559 395846 181623 185996 -109077 37180 280074 126954 -12293 354654 354709
11085 354709 42556 139845 75190 -57877 -19149 -36110 513790 -78760 132245 397246 173487
11073 -100274 127664 68040 163619 40495 256041 462706 497422 618748 199190 328012
11063 328012 158309 201641 695141 165967 552340 475099 504920 840823 907427 761520
11053 761520 429789 455758 430492 716287 690274 475658 293519 719598 650456 748188
11043 748188 512759 551318 447445 425078 348257 596650 467136 432241 387216 786500
11033 786500 550535 112464 664891 445973 593897 515478 921112 750670 469309 407072
11023 407072 767615 455424 676711 766507 863584 803972 543534 228645 450338 167291
11012 341879 246474 423624 590863 320991 808291 353031 382389 733320 519666 514370
11002 514370 440106 395039 794279 598658 537164 563451 534148 500480 641711 428412 394752
10991 394752 572067 464654 391561 540551 415993 523870 664162 656811 992894 960047
10981 960047 886771 930982 767162 940010 1126040 826619 1286312 1566549 1508903 1359719
10971 1359719 1908051 2325945 2112618 2210144 2342134 2577814 2043149 2058595 1579221 1615736
10961 1615736 1486071 1433820 1397422 1494396 1171698 1316925 1352531 1607322 1338743 1380474
10951 1380474 1352450 1554327 1327428 935495 1003157 474351 826850 513637 903671 346496
10940 299540 204309 656189 353111 283680 142668 -88861 74557 -84492 278632 -22759 36672
10928 -27497 -18959 -99526 55383 164671 -142804 -12633 133733 119762 53830 -45909 390933
10916 -277373 72925 -41177 -63233 -92606 -23878 199930 -104381 240359 144756 30407 -234250
10904 371198 -197249 -274890 -109190 -367682 1712 -227093 -17252 -304982 27057 199153
10894 199153 -40557 -163281 212752 -141009 277933 32887 54349 -224272 -23455 -224999
10884 -224999 -134179 57383 134959 61742 -120282 -108555 98934 -9784 79946 -148680 -101073
10873 -101073 59092 -9993 110314 58463 80963 24356 -31465 -22666 104109 -101882 -53977
10862 -53977 395720 -561112 38740 73298 -3610 -90434 -40149 -55069 -24985 261150 365306
10851 365306 -193254 -19548 68610 -390087 31672 -102160 175934 -187221 -103599 468048
10840 -6592 16655 -47979 156517 -264479 -118019 -252738 253194 -22986 -172488 -344905
10830 -344905 222202 -361480 38617 -259341 58084 176144 114335 82800 -226589 6864 -233014
10818 -33764 -143115 -61610 -191031 -256155 176788 -22399 -238306 -65294 -591500 190885
10807 -181226 -196940 -177674 -72752 -88268 -77124 200269 19377 -169327 194072 -395086 145008
10795 -69325 142753 190442 -324780 -131502 47047 -27032 -173945 226988 24296 -116637
10784 82707 112594 -46446 -204278 57706 -101225 269170 96179 96099 -138645 97248 253403
10773 253403 -29786 172238 -2826 12538 183508 249397 114078 137540 40043 2382 -91309
10761 -147881 76949 -195502 10259 16755 -57516 -288446 -90595 -149021 -18387 -105622 -200418
10750 -200418 -198843 67909 57020 265219 -8912 -228587 -119242 442664 -223681 -107371 394848
10738 -174729 158936 -428219 -255447 -170434 -314187 -27031 -58359 296539 -224173 -164211
10728 -164211 76478 -30356 -136955 88736 -311502 152476 92878 376869 319295 142515
10717 100324 -75756 -175142 -262471 -39147 -216524 -236735 -40673 -54723 179501 52111 -214871
10705 -163524 28420 -44272 -65959 200860 -68555 -23032 -99404 -78144 20409 -180357 -98039
10694 -98039 -177652 -281459 27668 -353302 -132523 98185 -366198 -224751 108143 62102
10684 62102 -173548 -262448 226186 -123556 166300 58275 129437 -150321 -98852 -126977 249607
10672 -137987 31302 -119719 -47513 -108779 -25455 1370 -244002 -170391 -26637 57343 83546
10661 83546 -465041 148776 -193085 -72047 -224574 -155848 -51990 5819 157833 30667 -409777
10649 -25674 283111 30449 345446 421386 206290 -70343 -182035 -52971 -215589 -172159 289519
10637 -194494 188030 115922 -42565 188154 -299799 112482 18609 30872 128496 -197417
10626 -67130 206742 -204116 -72148 223239 147613 -87799 -40106 -16463 -69449 -77546 85326
10614 -392405 -270170 -37472 151087 275173 16863 20525 76466 -282347 206796 27252 -143953
10602 -58630 -238970 -353570 -84402 -236571 -87504 -20513 -7599 307440 -56711 70676 261049
10591 261049 -65405 -110035 -87310 134724 -76962 24389 123924 -167214 -211077 -89194 197665
10579 -262653 183328 125887 155141 -268908 -108105 -179634 -102444 -38329 -7364 64065 25112
10567 -42095 38764 -96992 -225180 -145454 -98977 -71327 34021 -149795 -310095 55971 -123673
10555 29083 -43797 -102126 42761 2732 -323504 30402 -160514 -153166 -458355 51970 -36632
10543 220389 -130519 -270744 -127024 -35244 125738 -80801 -104316 25505 177962 -37401
10532 -65779 -116441 -254076 -71049 -48902 -447064 39227 -106759 -169851 48044 -121645 -314631
10521 -314631 172766 -183347 42921 -248162 -335427 -223732 140431 220979 125066 70990
10511 70990 -155747 55287 -363656 -412960 -377808 -147006 56804 -47 46357 92028 129280 135239
10499 135239 -4988 -179876 83611 -371224 -79545 72439 197 -153491 223561 18734 211667
10488 211667 10228 1498 222063 71230 18865 -78658 217562 246252 -57330 7218 651153
10477 651153 -158892 93621 418150 571327 135504 239246 139101 216047 160285 179398
10467 179398 316 -126603 -90520 50940 356963 -86694 120408 26463 -295956 -176947 -174124
10456 -174124 128661 100542 -21537 -709 -187822 -36963 170279 -236278 159892 -106259 -14353
10444 -127266 -105089 -481064 75025 49836 -314660 -189363 -28949 -78842 -70163 -520 -81173
10433 -81173 -172193 93902 -56254 52101 -50848 51418 -1916 -99875 104960 71835 -64372 -65319
10421 -65319 -27692 -174940 -192500 2621 58355 130751 20183 -105489 -203062 59615 -139676
10409 -65884 -302561 -179741 45982 -89885 59198 3599 202448 78027 -245739 -119567 -44455
10397 -17682 -125927 -14050 84176 80917 171002 339633 -83216 161370 -95851 398296 -31645
10385 111049 -105796 -131756 321777 437810 7310 -71641 10421 383262 159252 110655 398682
10374 398682 268553 567107 256149 275481 432059 394867 310434 176404 116745 468038
10364 468038 388224 532186 425682 130613 149636 -40733 195314 641517 415293 -10046
10353 -135646 154941 167679 286202 266903 248628 222909 496940 59168 308236 11090 346541
10342 346541 18980 393306 229328 329598 11172 41081 260966 210313 -38914 35800 250480
10331 250480 -142017 305071 132762 97813 95848 63923 -188306 217816 119807 116725 200775
10320 200775 104100 145412 370209 -24884 -178583 26630 66706 8517 -126695 -101052 -43935
10308 -51794 266607 -93625 230294 -303407 -47839 -111824 278770 -16922 6673 -208081 -371979
10297 -371979 -86780 48188 259553 -101717 -209615 58157 114907 -16353 178114 252515 -10857
10285 315599 -39204 19904 77058 -301097 9938 19456 140247 -194852 121932 -123646 -68237
10274 -68237 167055 -59703 -305948 -166902 -122718 -128640 -231259 29008 -43272 30861 -54872
10262 8967 -208281 130883 -106754 -84659 -267416 -54250 179302 129175 261642 301594 242432
10251 242432 354869 268199 79781 50434 275438 71383 102885 79417 209203 -22977 -117252
10240 -117252 143862 51487 66483 -75625 -86761 -777 155679 -120201 -172423 -56208 -164326
10229 -164326 -208204 220068 297439 -234797 -159193 -320020 -151943 -222853 178917 -313265
10218 164119 -44726 -115074 -225453 191293 149193 219515 30361 307417 -193671 -346722
10208 -346722 -136830 -282164 120697 -76603 -16812 122659 -18178 -391054 -93420 -263469
10198 -263469 249560 -232840 -25614 -250054 23848 -256486 -6261 57071 -115925 -4273 2461
10186 -106522 -285740 -108082 314616 -130396 47740 53214 -231130 -188216 -43855 -262564
10176 -262564 -242487 -295774 -104998 -431284 176949 -220944 -6364 -155600 76641 204696
10166 204696 -66768 169429 -179812 21865 -82601 -63347 -381828 99640 -141020 24495 105430
10155 105430 -18325 -94717 46201 -98080 104383 -128730 330161 -292405 96777 50561 340249
10144 340249 -264673 12684 241862 -27940 131669 -18821 180184 50612 -173645 -88590
10134 -88590 -226254 121128 94734 10245 -233868 -466575 204611 -14535 -74516 -90186 116614
10122 -133144 -212592 133983 -96424 -154617 -211817 -54954 54147 148236 -47862 105987 146049
10111 146049 -251652 165333 -226244 -213400 171292 -364311 180188 -65631 69815 134271
10101 134271 -226894 126320 69141 -105989 64927 24392 -94065 -229310 233790 -249664
10090 -36481 -61831 -59900 457532 -38191 -209782 -153833 313276 -301995 -8008 -91253 -91593 -151211
10078 -151211 286230 -12490 58604 120425 74892 -84851 -290773 -212044 66675 -135839 53249
10066 -428642 -72134 -128221 86207 -175068 -221268 -431822 23843 78382 113525 -87835 -336630
10055 -336630 -885 -111351 -337108 47675 109600 -111336 50003 -115156 -3380 170434 128599
10044 128599 -98998 -123349 162572 26619 -152184 -75378 -19249 81039 -37656 4963 -74744
10032 -62897 162549 -315219 42664 -124051 -81951 4761 -153457 19805 57547 -83356 -124789
10021 -124789 -52526 107808 -135418 -117973 85777 219242 -116674 -56122 -165678 -17953
10010 -483070 -181026 -86437 -205317 -112535 28049 -254483 -19666 -45119 -37613 -211417 -313454
9999 -313454 -96902 318863 229738 40164 196661 68275 -25609 -361272 -117692 172989 -161191
9987 76014 -268904 -149771 -96087 -32586 -195792 27376 -32968 -54021 -258721 251086 59735
9975 12388 -47774 126006 71283 -139488 94613 -345880 214191 120881 19451 -236473 110132
9963 -98695 -224812 31348 -73255 42413 -250204 -38768 -201168 -230335 79777 -147035 39846
9951 22280 -416796 -126134 173092 -71595 -104455 58044 91608 -233698 -23215 -139224 54042
9939 57026 255458 -131070 275373 -150408 186051 -125802 -300004 -34213 -249212 55742
9928 -174957 -378908 168142 -78774 -10330 234782 -238146 54044 -243233 63974 -389522
9917 -263738 76991 -233748 109666 -127733 60799 132754 -44510 26644 -398809 27392 -249974
9905 79553 -193506 -159531 -53102 -80754 266172 379092 -22387 -180719 36131 -109820 -82829
9894 -82829 36891 -155227 -10587 -207360 140852 271164 -219952 5568 -49734 -148784 -84722
9883 -84722 -233104 -210176 -415151 -190807 16692 130917 -228114 -5672 -156064 190885 -89931
9871 -288926 11486 111446 46579 -52819 156011 -252236 -40875 -116809 -193550 -107163 16407
9859 265769 -120054 101253 -134349 -245872 -175712 -10827 -187605 -86898 180438 -127737
9848 -183398 -145642 -133900 -321364 141156 29344 16907 412333 -295837 -223852 -230374 130497
9836 -75383 -50492 -262297 52887 -158253 151428 -8323 -284680 90396 81062 -92170 -273721
9825 -273721 -60011 -88422 251643 9645 -555943 -178148 -45777 -159250 -399173 -407676 -291050
9814 -291050 -70203 138142 -518328 7734 -194722 23040 -164729 35110 -129663 12843 259516
9803 259516 19880 91513 -250335 212473 -162380 34727 -78126 -3460 -341209 -171187 43888
9791 6366 233817 -2497 -233775 -161178 -3268 -211397 93687 -108233 15752 29924 -4455 -210772
9779 -210772 -59001 -109042 -125632 -142916 -100239 84377 -47821 50818 -2672 -41734 124677 19473
9766 -42784 168327 -59475 81700 -31290 14356 302334 -278987 24878 3159 -64971 -65340 -96861
9754 -96861 306755 82164 -322291 -178484 -284692 206095 -150071 -139292 278337 -49097
9743 -137563 44099 -281784 -272710 -165975 39947 -91868 -254228 -38529 -31512 -156708 -20214
9731 -60619 -106029 198836 51168 -194387 -56676 -106946 -195607 128690 -113080 20552 129805
9720 129805 -35291 102439 -76495 -77960 -253538 -351953 -388661 90182 -198277 -214440 -99885
9708 -141859 -373715 -41802 34081 76993 127650 75813 -437408 74072 14368 -208145 149985
9696 -109491 70577 178959 -190270 -9627 1281 -306693 -80778 57236 31307 -91538 127510
9684 -43253 -248623 -257407 -24601 -96144 26005 -89696 -240741 -124901 -213639 -31508 118476
9672 114217 -187270 29732 -33548 -39176 92169 203663 -127942 27497 247610 -345284 -350020
9661 -350020 -282070 -81906 -263498 3688 -136384 -315981 -328276 -296398 -62642 -101829 24643
9649 -159491 85047 -232188 -182794 119315 -7436 91539 -93594 -158453 81144 -130103 -82497
9638 -82497 -251605 46677 -208702 -88550 -39879 -23700 -166583 -219417 -90900 40702 106808
9627 106808 -88487 -322362 -128000 -177981 102043 -33059 -248013 1737 -42196 76037 -6097
9615 296001 -130767 79147 -179745 -114176 97685 160863 136997 -116537 -91913 -346710 -235831
9604 -235831 -165275 -82953 -152620 -207604 211211 21078 9432 -389722 -160363 39382 -208061
9592 283332 216916 -27672 -88132 184493 -270840 -156862 -461006 -312005 -74063 229823
9581 -48354 77222 -194057 -195624 267039 74507 62289 -65696 -494926 -183995 -190108 -371661
9570 -371661 162354 -65271 -286337 -198570 -13899 -54550 -251209 -51622 -100979 -109458 -364091
9559 -364091 -99014 102738 -141645 136705 26784 485215 -71695 -173540 -78992 -145718 -224051
9548 -224051 -59811 -161362 -273208 -112217 -28867 -187350 173150 105539 13731 78813 -107064
9536 -115331 -271881 -159689 475667 -198016 1954 -72199 143871 -92982 -210695 -110975 -282922
9525 -282922 340244 163612 -115539 85836 -153570 98545 -86357 -17237 98474 86747 -74647
9513 27791 102334 -155447 -82412 166361 390702 -153455 -80208 -139793 103266 119449 -326172
9501 -395563 131681 -87133 -215465 265202 309426 -191072 -150453 95638 -237707 -26544 -128972
9490 -128972 81287 117732 -111699 35157 -153721 -373620 -108569 155372 -45377 -239532
9480 -239532 21446 -304359 30652 46060 84491 -133128 -9693 51638 -382583 28145 82163
9469 82163 -66221 -163530 396170 -93110 -87435 -63880 -16056 9783 26924 -166772 -275264 -196052
9457 -196052 -205723 -16521 81681 -121968 -24628 -7910 -185627 153292 -42320 -23511 103232
9445 -58733 -199371 -188500 103197 -31709 120296 38569 -15973 180687 124566 87093 -90832
9433 17128 73123 -46024 102874 47877 -292814 -70813 144216 388681 -405745 -144046 -165298
9422 -165298 -293497 -137659 20635 -179678 -194395 -32589 -66283 -813 119455 -262683 36741
9410 26844 -191784 -280663 -9030 -129447 -201142 -118447 132278 -330921 22283 -309807 -236607
9399 -236607 271044 -165041 27052 47542 251857 -197384 126579 -252099 -47667 -61642
9389 -61642 -282324 -256602 86266 -159872 82885 166453 -157699 198184 -92827 88417 -547974
9377 221904 -14468 -104069 -228693 -180503 -88991 -67804 -365944 98689 -188317 -120807 51352
9365 -84085 -78473 253083 -36400 -86799 -134369 27819 -8347 -23577 -113690 342912 -49549 -111980
9353 -111980 -38071 122983 116583 -171656 -324119 -349090 102198 74915 -263177 -43996 133417
9341 -81141 -204914 165113 -160137 -70674 -109793 -253813 -189212 -250623 -79746 -304157 -143241
9329 22611 -150477 75863 -39037 27503 -94220 -252684 -237168 237191 -525173 -90536 9964
9317 -204204 -182017 294485 76474 -212919 -124310 -48620 -37079 23712 70858 -241518 -115586
9305 95971 -242 -382096 -30813 71316 -147440 207545 -274551 -184446 -155416 -280949 -226092
9294 -226092 -274077 33785 -51784 -219082 -276950 81486 -64907 66091 270255 -85821 -70651
9283 -70651 -106749 1154 -256262 -32025 90001 101321 233818 193224 -76449 -38723 -74698 -29708
9270 203138 -187346 -71490 -66900 238512 -248995 -77344 8666 -110223 -259703 -68227 159407
9258 8855 434932 -236240 95342 242946 -451826 -167753 -15017 -184761 -38471 -103444 160910
9246 31670 187539 140409 -56671 -178137 -29792 183905 287435 25966 -86751 -196818 578328
9234 -164640 -277223 93585 83129 136621 -99836 -331701 -55826 -5641 -212733 255710 -276200
9222 -30678 140539 172148 163482 212018 199713 47735 -47089 -97352 -235946 78507 289958
9211 289958 -111712 110334 -31947 18732 -30189 -80164 -102896 9481 -61949 23342 116446
9200 116446 71722 -160274 -139866 -290280 -159108 -39562 -192156 -18828 84766 -114685 -153743
9189 -153743 188864 -174231 -306215 -206008 -220749 -276733 83806 -39242 44558 -324063 49169
9177 87725 -327743 -220056 -269573 -104688 98382 67420 -348107 246 -12400 -367369 -183071
9165 -205832 -95366 -123353 66709 -235459 -159104 -60963 99050 121322 -122404 -107871 -5865
9153 178379 102414 -12929 -282851 198399 -86237 -15103 -218190 38784 -899 71883 185568
9142 185568 -21932 283623 -38713 -393028 22801 -360423 -133188 187614 108929 -39341 -157845
9131 -157845 41601 -231861 94661 -56628 -4489 61944 28541 -10759 -20110 -123163 -265121
9120 -265121 -60765 -109158 307256 174012 -221112 2095 -186600 298952 -259624 -191244 -237963
9109 -237963 87304 106464 92885 9988 182636 82072 1127 -77832 168688 46498 -108497
9097 -143235 47320 -55783 -41238 -50017 1237 -25232 139643 -219925 -218505 60113 -101373 -112537
9085 -112537 176942 132743 -257431 -88469 -297150 85702 -211444 234358 -136498 -126938 185413
9073 -134486 -28942 -329398 50587 -256001 -35859 -107256 63116 77213 14351 5096 321352
9062 321352 -2007 -43576 -105564 -425356 -287309 -266061 -25613 -7024 279347 -30989 -202576
9051 -202576 48335 183154 204870 135841 27430 -366861 135512 97644 -270552 -182958 -39661
9039 127279 -326022 -430861 -171141 -266353 -37283 -152809 179105 -210158 166879 39275
9028 67016 -6672 -106905 -168751 33749 -67817 -99647 140461 242672 -173010 -94957 -116862
9017 -116862 132436 164695 32746 -94208 -244852 -68180 -324 -345119 -37035 -185281 -117420
9006 -117420 -179780 11251 -140358 -347602 -29386 46174 -222259 -163545 18839 -92174 -181119
8995 -181119 62530 -84714 -91777 -97823 -146610 310676 -171093 -52640 181806 -98405 -70926
8984 -70926 30186 -128285 -136742 -305278 -35784 -440 -45154 -61845 53268 93856 -155780 231289
8971 -276528 -150712 -165218 16588 -190937 -75984 -163345 -75107 -577688 127377 45561 -300404
8959 92132 245185 -153124 143616 -72264 -255543 -197012 -305326 217628 -382847 -417616
8949 -417616 -86964 -82534 -332584 -159276 -208499 136318 -32843 -189353 -33032 78346 -79201
8937 -150596 75856 57198 181193 52866 293900 348138 67659 -19134 188740 -68648 -230627
8926 -230627 304592 339820 364321 411129 651512 1932511 7422315 13905719 4490136 947292
8915 667426 519722 260271 319470 -38107 140349 -177724 94968 -113840 405457 264329
8905 264329 208991 -175629 -52595 -36279 30619 23052 -47341 181160 205829 -203300 -107826
8894 -107826 -214810 332894 28160 269395 75079 24342 -208342 -280217 -364475 -128563 290501
8882 47416 159186 -240767 -89035 47306 -96152 -77060 -164726 -124294 -83067 133445 -120386
8870 -270955 143265 76599 -16431 -107212 -46004 -133604 -62327 -17473 -142576 -127947 -27894
8858 -70609 -151675 -169307 -49680 -122010 -117310 4732 130641 -49463 39493 -266583 -235193 116799
8845 -210581 -149361 -473619 256349 230560 -149360 -71789 110012 -9198 321401 20161 -195169
8833 61344 154225 77541 -165302 -10496 108791 -202935 102808 56015 -53668 110606 -67434
8821 -148641 283975 134137 -83445 47764 -273866 52150 -78405 -148466 -256412 147742 6937
8809 -98722 -165553 -159552 -183504 39341 -151660 -339970 -330880 -71703 -54239 -267184 -342462 49053
8796 -129853 -125063 -260343 -196082 31288 176639 22736 -130803 -22837 3421 -10203 87575
8784 -100184 -63994 -115778 -122219 -146890 -253020 451413 -281449 -120964 -164806 -69759 20668
8772 142375 -171721 -94537 -87178 -32397 -201203 -36072 9267 -201801 137997 -331779 -173844
8761 -173844 -67668 188495 258346 41401 -49247 -54764 -73464 -21160 -89363 -22761 -163241
8750 -163241 219 56597 -247450 -52332 176557 -193419 10988 -241131 -137258 -40 -13777 109618
8737 27214 -108644 36602 261254 124146 -82707 -90554 8343 211639 62104 -309095 -49029
8725 -272808 -114267 -66269 302386 -300604 -397185 76799 -79685 -164613 -202395 -178411 166934
8713 -46679 -45459 -284980 42840 24359 -153693 -365472 237919 -289680 -148716 -76967 -64353
8702 -64353 -268643 48358 205794 -150087 -194523 173238 -290679 -72522 -299453 -252161 -188994
8691 -188994 -47848 -6177 -306120 -72824 -187873 152824 -20115 150396 30543 -102608 317497
8679 321748 60201 -84163 -156516 -197115 172183 -78009 205939 -490436 63739 -8447 -119439
8668 -119439 -85922 164562 197932 -147500 -182605 150746 49713 -99508 -176299 94782 -164717
8656 34458 -176331 110907 -537319 134981 -219935 -11033 61760 -176366 -72572 45034 -292934
8644 10841 3490 195874 202530 -223129 -58669 -97457 -62402 -316752 -184369 -8400 -354158
8633 -354158 -68946 -294276 -89419 215868 -244205 -9162 -90172 97958 229646 -296410 11441
8621 80314 -20259 243201 98744 119744 -344739 -412056 -7009 -130189 88657 -261118 -231441
8610 -231441 -321820 28280 -103790 67337 -10050 -213980 278999 121845 99973 -85402 -27618
8598 136169 238778 -183105 346 287195 23272 19469 184292 -118938 -204382 181738 -402983
8586 175890 -230965 -72520 119306 -19112 202639 -230700 70194 -149473 104065 -292469
8575 -50564 65263 -398998 -17536 64589 -165060 135542 -259972 -260920 -96835 96548 -360773
8563 -38157 -174571 -11170 -67289 -79354 -246582 316431 -32259 -75594 -136992 57815 -120064
8551 -101582 19179 55562 -126277 -366114 126386 -147372 -36052 -249844 -207817 -181464 -77230
8539 7604 -197268 -91360 -94984 -48078 -150330 -119664 44520 107283 108045 -522249 -109516 -7640
8526 -71002 -116438 -78947 4138 -128473 -221714 542 187472 -34132 -390008 188968 -176461
8514 -156561 -320210 228291 -280448 -255929 -92549 100332 68527 23597 -460109 -204475
8503 -193542 66360 137869 86654 -240883 -46743 -57358 -113525 306377 315624 90048 -277775
8491 3196 101353 -29279 81877 79299 -7877 -240351 -3473 74805 -345394 -137858 -319968 190082
8478 65568 -101593 -132344 -36234 24152 -128473 59351 -40185 -145681 -209969 -263819 -86409
8466 187847 63993 -109006 -129856 -110147 -313505 -50212 -115404 90909 -227351 -16956 -136181
8455 -136181 204189 -27400 326255 -189082 43583 102235 32032 -262516 -49015 59242 95957
8444 95957 -31946 7615 -104940 -347832 -324093 269627 -176526 -29198 33610 137181 -119781
8432 -320554 -169659 99256 -58487 137104 -34361 33113 -110748 -266772 -37703 84596 -95811
8420 -147808 101051 -224377 -79515 -414070 -41330 44782 -15798 11951 188935 217352 -22227
8408 -84373 -457546 -176007 117443 308775 14019 -287600 -123791 -52683 -39383 -99591 92963
8396 -105052 111756 -137579 -72177 -46214 -20745 -210518 49714 -92323 44330 208445 -74794
8384 205191 -6849 -28920 -126790 -256132 -239096 -151664 66969 144039 -285755 -142979 151133
8372 43722 -31102 -73656 -24072 -52887 -37037 -11594 61297 -163552 122260 -203429 73335
8360 -17760 -280468 120403 138699 -433170 -113656 -320552 51636 -236766 -4424 -171668 153188
8348 -188510 187809 -1657 -109343 223707 6325 -170335 -183807 84101 517657 -406930 127362
8336 -329079 47749 -242219 303909 -58845 -263184 36132 63948 142362 -124677 -44693 -331176
8325 -331176 -491 134710 -61464 -159874 -331021 58063 86124 173232 208343 -337215 -9190 -43130
8313 -43130 151363 282628 49612 -313175 -194224 392336 51120 -13166 -220489 -78119 -172854
8302 -172854 -49190 132363 -211345 -68746 -278848 306447 20040 -293135 334372 -261824
8291 -141671 -121892 -215486 91690 -31797 168908 -29718 -128557 76096 -196201 181092 -218852
8279 -161013 -109349 117810 -103028 308806 -52351 -3867 -173909 -438100 23539 -381818 -69173
8267 -387933 17681 106092 285534 -252720 -305665 -33663 -69319 116965 -151201 -89360 543036
8255 72389 -132878 39054 -63358 -253529 -158680 -140552 32471 -205907 454679 -128897 -369285
8244 -369285 40215 10601 -224167 -17240 -74689 -407942 -430640 187081 -216512 93103 77887
8233 77887 143685 102680 387110 -32694 -24526 -157140 -79208 233919 167002 -104094 301392
8221 200592 51672 -323115 -118266 197557 -89048 128221 -81645 -94607 61227 161711 -131517
8209 -46169 102372 -23059 -187716 74206 206344 96597 51829 -162531 -299459 -37293 121362
8197 346753 -264823 76874 30223 -87824 -176150 192353 75253 -93522 -101698 -327112 -96294
8185 182756 -211282 59475 -73591 -203611 -132410 -253058 -32065 -121726 90690 168815 74970
8173 9707 -202862 -244625 -104572 -226180 -236007 -138745 -202756 -111953 -128297 6284 -311877 -33216
8160 -37647 -79998 -14738 383022 -71472 284098 244493 165153 -126507 -55302 -138543 -399124
8149 -399124 90836 77380 -28081 121446 107649 -16612 8167 -7821 -369608 -229455 205002
8137 -69968 -122140 -324858 -88668 -116126 -75323 66539 -36733 -112050 -181076 52831 -114450
8125 -326082 -51251 -176270 27536 -13962 -143317 39052 -174477 120738 -241905 -76191 498105
8113 -42794 55896 248085 -432584 79375 284121 -186630 249905 190495 -290676 -56914 -6471
8101 -181026 -239345 121829 11602 -199842 -243497 502731 -267134 -124620 -87288 -265618
8091 -265618 -196629 -97068 -205982 139415 -322680 80685 -236408 275824 91425 66756 -140299
8079 71399 -84638 -138940 54788 -206795 -208044 236011 373277 -115320 -74704 -15392 -48823
8068 -48823 24031 -319253 -26275 -228830 -236487 -24033 184322 -103224 -88518 -27961 -111245
8057 -111245 -214193 -162611 28331 108684 9926 178456 -29696 -53597 124986 38093 -249095
8045 -84119 89206 -52560 14232 139805 197435 -297032 228015 10370 -26946 -150909 -51376
8033 -347720 -168784 190450 9931 -403969 52732 -41806 -200154 -23636 307990 182441 227923
8022 227923 -187577 -241532 -214033 142165 -66695 -57692 246292 471238 95876 8381 -97941
8010 -272556 -394604 22671 55840 206049 203784 17322 110987 -352693 -148988 -202853 97246
7998 -213523 -18776 -20798 -56138 30567 78939 634981 -90774 -235073 38264 -130859 -209358
7987 -209358 -323534 -226642 135419 156111 -337549 -365402 68503 -96017 -14888 -151227 52684
7975 -109129 -14598 -325067 -14520 -117207 5152 -617041 142380 44517 -87749 -129389 -223938
7964 -223938 -62005 -78344 -130845 46157 -151526 119271 -95994 31108 -203881 225716 -143568
7952 -203457 3346 7344 140809 38881 -38196 311691 31258 -483008 -276567 -363501 -76167
7940 232543 186026 -144027 109303 -163345 -69695 115306 12702 -18122 -129748 130179
7929 78175 -66141 116979 -155826 123251 -88070 -273591 277186 85625 -184787 38701 -221200
7917 -305493 -308168 -62478 36570 -163143 -42229 57594 -74878 458950 188486 9355 135866
7906 135866 170932 99110 -138468 -30715 -97136 381850 41851 184778 -73221 -35332 -285504
7895 -285504 -95574 44188 -269264 -82981 11389 -147051 -197136 -599791 2971 -72369 173720
7883 -300032 37462 229049 297198 -145016 -39453 -250107 -46598 -158856 -326246 38085 -33831
7871 -218913 -61729 74641 4539 112754 -435895 -151987 213564 -240861 -128407 -196130 84060
7859 46847 -80768 31326 -97050 -54577 -136225 -94717 167984 57971 -539374 -332303 118731
7847 36068 321325 -525332 -154833 -155984 -3923 153861 5172 -453849 -112763 -145832 -144343
7836 -144343 14082 41131 -143379 -354713 191001 297765 -8068 -53333 299318 -101912 -150887
7825 -150887 66898 96112 97837 -31353 -141943 -87112 -67073 -60787 -127908 -315238 -83845 75522
7812 -190178 -311608 -394574 -190572 -21550 98462 115774 -280219 -40921 147733 37753 -270201
7800 -188671 4453 28019 125409 205959 321290 -74098 -207733 292418 121398 -54818 -114037
7789 -114037 52658 20538 57861 450974 -53825 26544 117749 -22730 -430548 80710 46448
7778 46448 -292109 223994 -319277 -219416 11337 -183556 -42539 -115205 142317 221618 137302
7767 137302 9205 33815 136241 -130038 -153993 -56714 -70446 186780 -121122 60887 -320234
7755 -106210 -191552 11002 -75842 -208481 9288 68905 -24594 -96680 214581 -51524 422915
7743 -943 -117005 302008 59674 -174383 -214388 -136956 -197026 -50280 -66856 27162 -113674
7731 -71751 47095 355732 12037 -22688 -150537 -47892 65120 -704231 -158956 570804 121221
7719 479197 71599 -125185 251507 -432885 87539 154841 -278755 57246 -43508 -1699 -21386
7708 -21386 36893 475 -84755 48547 36280 -207246 -171171 -124793 -53338 -260347 268062 160053
7696 160053 115131 251225 -42957 -14022 -87404 -1843 175581 -162937 -139567 -78452 337617
7684 -267907 33400 139956 -137144 156816 -48536 147104 -480234 -223610 -474754 172848
7673 386903 -306948 270995 87577 14980 455658 -225939 -197364 106499 -93937 99015 336723
7662 336723 -452335 327440 -158495 -218823 28336 26132 -39366 100457 -73685 -12141 96958
7650 -283767 -122482 -64712 -266650 62354 39831 -609 -214101 -60390 321495 17825 -116079
7638 59233 -259883 -5545 -68656 1809 205886 -8855 95885 -184757 -78724 -57959 231276 -150510
7625 -120562 -130595 176460 -101054 -361457 -219104 280111 -264870 35349 20770 46292
7615 46292 -372419 -9531 60391 22900 -61865 48292 -213291 274745 -13983 -99753 -158109
7604 -158109 -214402 -35141 -195806 -109127 -73627 -241396 -203314 98554 -515898 157544 -60418
7592 -159603 10897 304394 228065 -98000 -310467 267289 217095 158093 26288 48106 -190432
7580 138246 44054 -213800 223433 -166295 -31985 66955 148942 -136227 -78363 -25263 92588
7568 100564 -72352 -279961 264147 -46075 135737 -144609 215735 -406 -135630 70324 -58943
7556 66691 184777 27717 207015 41782 113789 60206 -145262 222025 -222041 -192937 -146443
7545 -146443 255362 -91291 -208415 61339 88625 -96655 -43454 -158364 143021 -309872 93939
7533 6237 -42828 -117664 -251277 156662 -331470 154976 1587 88642 23259 -127129 84025
7521 73771 -3031 57543 -66554 -112120 -208228 62027 -56311 -130810 1799 53039 -124967 -166277
7509 -166277 -215661 -25538 -286932 -418590 -128974 18619 -84010 -18636 187974 -147097 -140627
7498 -140627 -100631 -13384 117559 -167862 -294534 -141963 70317 -119337 -292349 37573
7487 175285 290788 -145559 110250 51854 32378 -35111 -403423 -11893 -82019 75199 147447
7476 147447 -219739 -57878 86190 78330 -187307 -40693 -42862 -47517 92248 83368 116227 309087
7464 309087 -124014 -51706 212962 497873 -158157 112935 21182 -81974 159675 -226877
7453 -81595 -39552 -252196 79425 784 132424 83348 1456 -151351 -34955 50841 -11805 -12083
7441 -12083 -419293 -482898 -289001 -329724 -328118 3043 -90337 -171459 -139367 -29361 63424 -242501
7428 351200 176376 -111837 -121981 -58052 -129103 -70367 230946 -44823 183237 34284 -216130
7416 24611 -58645 -169014 -166160 217839 -58725 -22327 -114223 -241821 -91179 -24199 -146998
7405 -146998 -94015 267750 -54342 -106148 -155137 139323 -324853 -172776 190261 89435 -78384
7393 62508 113350 -115822 -106578 109945 -183171 -25447 201377 -117473 -95899 17619 -141708
7381 106104 -6904 -245101 228963 -40607 -70450 -111140 -30822 5428 -233597 81061 -187509
7369 -98102 -114288 -65223 -37427 -241702 146461 106565 88571 -230867 -236516 -132221 -98638
7358 -98638 -243503 -26902 195756 -28127 -109714 286926 54601 -406167 -39444 -63631 -126457
7347 -126457 -9098 59655 251931 325786 191408 260144 -67324 -406542 92885 -248551 60050
7335 68169 -67414 81077 320403 -83048 386436 -122774 -273019 -202648 122031 119353 -74040
7323 132699 -254249 -212562 88319 7432 -12241 -41467 20919 -19960 24775 419992 204492
7311 112180 -62401 -2600 285284 -114991 -104114 -331713 3756 172776 27532 -197119 -102351
7300 -102351 -67264 216723 -13074 90300 -333131 2694 -177186 162534 72312 -120669 196567
7288 -105323 -156060 47133 -32123 64383 229844 -123517 -245066 -209529 -27667 111399 176605
7277 176605 19597 134100 -2335 -212354 -7511 19893 178379 -30269 -251086 -196611 -121876
7266 -121876 -71021 -64890 38662 266285 -41647 -304279 166247 219584 252891 144594 -329412
7254 -50551 137423 -85317 38117 -255134 -18923 -1462 192085 -118459 24417 -291064 -158750
7243 -158750 87049 138781 -10257 -16267 -284599 -525724 71763 -54155 -4932 125660 -418839
7231 1920 -183959 112594 -174303 -52207 -268673 -190148 -11047 -110597 -118792 -87488 -104038
7220 -104038 83355 -80250 -92055 189853 233774 -19416 271103 226926 32171 -102573 -155886
7209 -155886 132967 -50944 198055 -189452 36895 28938 -323652 25526 279417 -72313 196163
7197 -46302 -255914 412600 -69269 14416 62341 -205058 47822 373238 52993 -15511 -26160
7186 -26160 -159361 28034 76447 -119428 -89443 -192258 326648 -15322 246629 -323685 -101799
7174 -194475 -12341 234330 120003 93791 -189943 81881 90578 123109 55496 -45244 18155
7162 -40112 -81819 -10413 -88542 -101828 145612 -186692 117448 -16412 -267258 21936 8372
7150 -65584 115182 -371503 -2480 15894 -95098 -46852 24594 2592 -136172 -287495 -44806
7138 -153230 -128172 232350 90828 -135477 58191 80378 221252 6730 -404349 35618 -53342
7126 -255897 289958 -62619 -224932 -403559 175152 33395 149485 -36354 162032 -359929
7115 -109850 -34114 -6888 1116 -8000 -133739 -247844 -213409 -163822 102054 -89334 -48152 329775
7102 -142116 -214697 -212801 76652 -167141 -59193 -296445 -73858 97762 5744 -244906 -190773
7091 -190773 -94333 113175 164539 -161285 -27413 -62802 112557 -112564 21520 1003 -35293
7079 19257 263644 -133683 -108498 29722 -216345 -236108 -105263 -178030 17778 -87381 -113822
7068 -113822 -36401 24306 -243189 -69231 -35701 188122 -197479 -168861 -10622 204640 -66657
7056 -57509 -107158 -203650 -14705 -165436 -26812 -10346 -239565 29876 -187573 351522 -97499
7044 -165017 273252 -81883 13801 302505 -187988 -183863 -311188 -271384 -484909 17598 -290900
7032 13409 -105054 119085 -146623 35475 -109343 -44495 -95000 -66712 106399 64796 -160399
7020 -248887 -15593 -90565 -228811 -354195 48390 -355470 247783 174085 -294104 -46630 211447
7008 27927 231600 453073 230423 54700 -16129 49371 -175376 -221401 -114343 67449 62668
6997 62668 90194 -134860 -73412 -157231 -175443 48047 -45398 306538 -65865 -250760 283798
6985 40661 -190083 105479 -93980 -28691 32168 -2959 -95377 61215 -142236 291003 78512
6973 7950 120136 -2421 -176 72428 -89730 92019 152547 -81542 -461541 -18379 -100984 -36704
6960 3009 26470 261445 -39986 -21373 -517 -89310 216928 102398 47684 81316 -26299 214637
6947 -414722 127684 -229587 -6437 -73640 -160562 305454 -323201 59215 -172674 -34288 -134824
6936 -134824 -219663 73991 340175 82602 -167854 -124939 -75955 -59417 -26931 -58425 189066
6924 91433 -275917 -87385 -195638 -22548 73471 74894 -353541 30503 -150 240904 -148198
6912 73615 -378101 -37737 100163 -120931 -192663 -393343 -349555 -210556 212351 328295
6902 328295 -208491 -220498 -3169 27001 41938 90679 -264425 -810 194163 19509 40861 -100663
6889 6248 -173147 -126808 11306 132103 150508 -115747 53458 61173 293400 -1795 -178377
6878 -178377 85074 -86396 46624 43710 138212 -302901 -4058 -59264 52249 -102947 -80258 53975
6865 428260 -178231 -391882 -12741 6592 -143865 -81456 -251327 96570 19065 -217040 11668
6853 -54721 238419 233513 89650 89640 294654 48997 -278403 76363 -84485 -89340 -185921 217966
6840 -93261 46774 31862 29499 -120412 -69783 -303454 41718 -180769 -37934 -289875 76315
6828 -95695 -340093 -53034 9891 -288543 -127056 177846 -192872 90261 161980 -1210 10392
6816 379035 -345011 120236 2667 -133765 -63961 -149691 6466 114771 -88348 -144961 132051
6804 506643 -108683 -17835 -141799 217553 132763 -119048 -74596 108914 -231297 -311993
6794 -311993 226459 106771 67907 106295 -153403 -261951 -256375 229932 -29776 -35039 -59890
6783 -59890 33218 10689 22406 -99894 74400 291953 21295 -336191 -111899 155649 -314681
6771 34808 324750 214643 -223920 -244078 -136082 -11592 98539 60418 12033 -104387 -213423
6760 -213423 216808 -247174 -186481 -60295 418256 172738 -59769 -130995 -181894 -167884 39001
6748 95216 102945 -171818 6611 -72076 -141738 -251302 -207922 -34042 -11346 180255 -47236 -4907
6735 16274 168478 -59411 -229507 -19929 396184 133282 -8578 194816 334635 -223926 265045
6723 31502 283162 -259543 2041 -182913 -298042 -273319 -10810 -188098 320445 23969 -30801
6711 141971 18767 -116697 174817 30751 -27658 8706 2862 19617 168163 -4843 101264
6699 61297 -170944 -109587 -64824 -16623 -631758 128235 -101754 221613 96023 -134419 -191941
6688 -191941 255929 326790 7961 -154304 39186 -59866 -332173 246775 -320254 158202 232753
6677 232753 34449 31734 -439807 -230547 113738 -56916 317713 -111042 -91604 -76455 32487
6665 138268 217611 -18539 -463979 -200094 -4331 -282526 -53543 -128463 94589 121180 -176609
6653 -44436 -119593 59471 -31374 -163661 196339 90405 -83895 204214 19946 7041 7060 -78993
6640 78352 210397 178275 -169274 241934 12513 -222826 200019 -204312 -187526 166672
6629 -44930 24174 -64203 280038 -82214 -271817 171039 25340 -396946 -224412 92871 -169953
6617 32776 10191 -213115 -241665 -45053 102164 23645 -1983 -169243 52380 6099 -428289
6605 45306 123009 -81118 128198 -42069 80663 91246 339521 151490 -209468 -96203 -9117
6593 -146021 127136 -87166 -33491 -25318 -23625 -69265 -58687 -25237 -165988 24670 172698
6582 172698 -65643 -61343 211248 18911 77211 26942 90634 -198966 -117359 -188677 -81476
6570 -95918 -193964 -53780 -13873 201061 -127550 222462 -180922 -185103 64138 456916 12833
6558 43179 -50076 -248016 37471 -107745 -116795 165122 109158 -164525 -68226 158108 -102852
6546 -204881 -11816 182262 143918 350891 -148768 -165668 46806 83996 236534 -86356 -59255
6535 -59255 91441 194304 -111402 -23637 -72452 92268 -215168 -13377 242137 -220851 452340
6523 302520 15848 173216 114457 39073 -189094 -17874 151354 127905 91624 -96041 76700
6511 -29631 -347280 -10159 -83955 -125162 -80490 328324 121334 17139 -56537 12821 107259
6500 107259 243975 105204 75126 58431 -189773 -151332 238012 195319 -184559 170965
6489 205503 22802 17538 -106983 59991 314871 -58687 98940 251079 -154057 2894 335357
6478 335357 -176183 93426 -99323 -61428 -123054 -31918 50395 -44945 97340 -261979 -82659
6466 83996 40178 109243 -69248 386970 -352067 -171028 63707 72914 -199406 -9425 8867 -61630
6453 34880 240005 -35135 -198779 -51137 -133361 -151601 -8832 432471 -90873 48518 -237082
6441 -5229 -7902 26602 -43232 123948 79339 -207656 3637 41376 -93324 47116 -34654 103034
6428 -79726 148475 -270479 151190 -89286 -169960 -64668 49858 -48811 596959 -91043 -345906
6417 -345906 -249214 -116951 33512 -110798 -86942 -119529 81212 230385 -203017 -316274 171233
6405 -26370 119560 -11355 113384 120739 -81329 62247 167827 -254747 2840 -343559 75952
6393 -75979 276283 -174657 -319972 -93505 71654 115698 114225 235924 183260 108356 175512
6382 175512 306816 -223893 4607 87185 65008 89892 87281 62122 -77761 -83545 -73872 35807
6369 44259 66495 222799 -9923 52137 -104825 -200309 -77609 206804 -103980 -315040 88882
6357 90299 200752 160168 -138063 -19840 -182000 -41529 -67270 -106338 111920 -186526 -21827
6345 -108200 46180 29447 -215539 -167035 -49566 -74173 98077 -198526 -184478 54375 43784
6334 43784 -195216 36738 172595 -90127 -181240 70763 -61381 -92100 140035 10466 18315
6323 18315 -122726 104702 146163 125780 -265243 121303 -41841 -80175 -153281 -63904 31658
6311 -135230 176660 -259038 103222 -89969 164276 -19249 -179760 242152 106560 -40462
6300 -206636 -205090 -174776 246809 -126148 402998 -12966 98778 133385 -167221 76577 8697
6288 33502 -370547 151176 -211907 -130925 3349 32036 -225290 -86455 139899 11192 -40007
6276 -52876 -340178 209646 -79651 -249700 230863 136982 161490 -94152 -70510 -434664 52112
6264 160018 -165367 256701 -186170 27350 213371 -82214 137972 -101128 -302338 -192166
6254 -192166 -1603 -180030 113381 286996 218895 22190 190419 101214 60624 -166070 -195614
6243 -195614 -116850 -102230 303429 129533 224095 132859 -123785 62273 143358 34441 171634
6232 171634 -270134 375104 60489 -139085 6436 97267 -288897 -132425 152721 45268 11253
6220 19634 22395 89113 78410 -245965 236376 61963 -302279 131717 -277376 66961 -212316
6208 -202673 422063 -261716 -8583 -33597 -17645 -26693 -156833 54421 15492 -69603 -165328
6197 -165328 -163218 43238 73495 5678 -22313 -68589 -27693 -374970 -61387 150600 -55290 -409624
6185 -409624 153204 -17434 184535 227050 -93775 -65020 -97868 -71435 -98765 -181447 -106458
6174 -106458 -139460 373106 51128 -103010 75288 13962 183385 77654 -402658 -337873 -99195
6162 -81965 -56226 -8252 197422 160413 95227 -110786 400423 57785 -51442 6420 -197628
6150 205890 -427252 5411 -70081 -222377 72293 235742 255346 12572 -69107 -19207 -76714
6139 -76714 -456215 -305288 -181665 -19424 -100426 93233 -70901 -92788 -98932 -215128 481689
6127 70530 204021 322255 -95174 137066 -97190 -147073 63026 -221394 21752 -10821 -188396
6116 -188396 163908 -771 344910 -214945 -22039 147990 82883 38203 -214772 -303907 -138011
6104 256564 216983 -78486 -295231 239843 35555 -191897 -265938 196880 144324 144272 16904
6092 67647 -54834 192524 192204 302720 -74324 27466 104256 201098 436676 -208671 119998
6080 -350809 -69463 -41359 68406 107715 -64158 70825 -89715 53744 58890 93796 -84133 -226776
6068 -226776 516246 -23352 11085 190387 311613 330002 -251648 129285 127635 21458 -138688
6056 -137570 77365 -74238 108529 -21459 5488 -81214 170558 239605 -40307 -112568 -90373
6045 -90373 -158542 -7880 1022 -80950 -15467 -41599 45310 -91126 115828 -13206 -165874 17905
6032 83913 149655 -8017 84769 244474 13855 -140022 -266600 77222 -198955 -86142 251981
6020 343489 19901 310044 191368 -97238 83046 -80406 -107829 37706 -152905 1388 -57900
6008 -84394 38446 -177076 -201801 411897 -34488 81702 -178851 30944 128666 -67269 43678
5996 34344 7476 8568 55251 103479 242627 421955 -129448 134175 -462666 10697 -5091
5984 103346 -79178 -284066 324747 -45443 30780 203718 -155514 151716 -163398 -3958 -193008
5973 -193008 25087 -240983 -33059 108885 -155945 -302551 -204130 -196250 -217020 229038 109564
5961 130031 295558 -120314 -43045 -417771 166844 -42539 -100949 22513 -255425 133170
5950 -178639 -161204 -239560 -227022 132024 -65446 135330 6330 -40300 -102123 54327 -203241
5938 85335 -126157 -252503 6148 -39803 -154639 101252 234753 55032 208997 291647 -96077
5926 143082 -17900 219315 -46461 -157378 218820 -215490 -137171 -151467 -259277 67142 -138474
5914 191901 87715 201114 217831 -147788 319115 92609 -131924 -313276 -284198 -151289
5904 -151289 205303 98445 -194894 -66877 -169951 -165010 131232 -29949 -61354 5174 164985
5893 164985 -40790 78671 -52171 -65303 42213 32072 82732 -346836 51450 108975 -186130
5881 101048 145481 -173055 132223 -65414 -30957 -191249 -114945 -120595 109918 -91423 281007
5869 -162089 -117993 -84945 361479 164178 90177 -101408 -188984 -72575 244932 -204082 69517
5857 -1844 -322011 38013 84346 46457 -13267 36992 -76639 188382 46621 39082 -159114 120113
5844 -76140 2467 -51622 -123370 107641 54249 -54314 -207200 -120353 -167859 216952 -19945
5832 107558 130629 129183 -29778 199764 -128429 79038 160011 185618 -328707 98997 270094
5821 270094 139787 2793 -157239 -7386 -223198 97335 231602 200729 105722 -71829 -16229
5809 -75481 147006 -110213 2186 3836 204063 -54775 98814 182364 49006 431657 139102
5797 138563 73290 101735 119551 -56454 93671 -138776 -1370 120466 110991 126263 -305463
5785 272463 -186845 -81099 102614 147985 -212186 -37633 210477 -122699 -200649 -19360 -139565
5774 -139565 -149041 -181365 -31144 -15321 -80425 -14970 160744 137188 155772 -40816 -16509 159160
5761 -16318 -4897 -19919 47678 -213501 195016 -3269 -29376 -18632 47308 317498 178778
5750 178778 64593 109888 -177433 -221587 -166016 25585 97714 -335868 -403840 41229 332498
5739 332498 -14580 178631 -400761 33329 113133 -110371 188029 -205345 526441 131182
5728 155962 -208267 -133655 -96517 -165646 -21752 195064 -23462 110637 231911 -179857 -112005
5717 -112005 -382371 62634 249453 -28091 249018 130186 -10945 303621 -173988 -186301
5707 -186301 -114122 -166220 372719 -131999 -51416 42605 -86360 -116932 -145331 208963 -219269
5695 117232 104033 -28998 123047 -308841 -157107 207687 291772 42523 17229 -36932 61071
5683 65214 -104046 -133825 490810 -246430 102891 -12009 -244664 43708 -15276 85438 -97120
5671 39488 -139620 142906 245919 -369798 -263177 192996 70245 -96305 201299 161098
5661 161098 -30274 -118921 217504 -24735 -341119 236725 87535 -163452 140187 146728 -287636
5649 7857 251432 -65914 -154708 304385 317100 -260851 182647 -296182 224143 -15191 39362
5637 8915 118405 26839 -204043 -264678 -39301 299829 -4302 196174 233557 -115310 -54619
5625 -31579 -112960 -200901 19231 20876 500457 254018 -11244 -242782 -12289 -306307 42769
5613 -169326 11324 -172441 -139157 -267996 64084 27689 -497965 -150515 -320220 131758
5602 245664 60426 159473 113998 104940 112762 25793 -14223 276107 61461 -304930 -291704 -5911
5589 132390 -189527 224414 197950 -185533 -157815 -23840 186970 -42437 -7261 -52601 -258775
5578 -258775 60670 -334406 -97782 -66561 78942 372763 109946 157271 -62480 44568 -198263
5566 74777 46006 164074 16611 -72266 -91553 36580 25296 114235 265935 -71978 -279650
5555 -279650 26140 -72089 -75274 -75822 -277229 157263 82050 38626 235351 -124518 -45551
5543 195490 -18338 37897 -253721 -233004 -451675 -156231 -36908 42886 -390274 -198686 -272609
5532 -272609 66421 19125 -122417 -165926 -6729 557827 -147160 127250 98852 -197705 3581
5520 500474 29432 -80937 90181 -51485 -178029 -9929 142864 265240 -315004 80367 -253271
5508 -106737 -92228 45664 -44206 -103029 -86855 -68257 -63865 31622 395922 -115662 40711
5496 106944 -69165 175319 -116053 -279196 -51214 282031 -221219 -99632 -94814 13443 234570
5485 234570 -52264 -25910 222262 -34204 24703 86623 32257 -53734 -42376 -22439 -57665
5474 -57665 -74951 63923 34919 188638 194780 2418 240021 139361 322866 -47530 -72380
5463 -72380 -30113 -18666 -78891 -785 -246281 -161585 -145271 -98570 -96067 129466 124455 230291
5451 230291 -59465 181264 165018 332610 -12681 54601 149082 -15681 -43608 -117039 -30567
5439 122656 101442 -39651 31974 -64472 -21070 152515 -163345 -149043 134059 357377 288105
5428 288105 -64286 -264548 -120938 296867 -53574 15320 77490 -68525 30861 -14733 17623
5416 76360 186031 -331326 -219253 -145957 401531 140208 173804 -24242 222824 143454 -133327
5404 49357 -113674 -139457 -281002 -131525 157694 77556 -327287 -77079 85820 -68758 -181346
5393 -181346 193859 154910 -184938 -78528 67463 117406 -179870 220178 -152540 -199995 -14720
5381 -22088 -122534 -99241 -20024 -102840 -35072 -55914 -179312 182338 283046 232067 243067
5370 243067 -155091 -413351 -70473 210830 180578 -66167 343672 166318 77649 45536 27031
5359 27031 20552 -212589 -101741 40125 142001 -201345 -133915 -191336 -55681 -30213 27120
5347 -17133 344882 200545 136062 81661 -63609 -178207 196526 137260 10854 63545 4373
5335 -71850 219410 109410 -9088 86987 -8756 -172374 -195981 -36615 175393 -5354 -12271 -16244
5323 -16244 -165182 -57423 226351 -196812 -202278 19806 52164 280178 -217771 -18302 -161248
5312 -161248 156349 -380622 150712 97741 54986 -34138 84983 -180730 138509 -131154
5301 -266895 -173426 294208 29381 -241536 -102946 -357421 175225 -39149 92522 227710
5291 227710 -101670 250182 219961 -145524 -127310 154700 8753 -102077 50181 -227179 -80342
5279 -81396 382154 65969 91608 267969 26875 -297907 263087 355633 281634 36174 11509
5267 21372 -54919 10575 5349 -26560 -350522 73886 150040 -47689 -48694 137283 161913 129203
5255 129203 347740 164269 13475 56376 212311 198621 77813 60036 285573 -71747 -366516
5244 -366516 -174020 169675 -91515 -100648 331198 -47734 -552026 227222 400554 -202462
5233 -76796 203285 -232742 -114239 295704 -156176 -71160 -300412 373254 -216455 -75934
5222 110141 64642 -74697 -120634 -38774 98086 356676 96824 89471 -54289 11642 162276
5211 162276 -144130 -128814 -140640 63689 278829 -220561 -267783 327843 -86838 -270570 -42617
5199 -356291 -53879 148966 -231085 541258 140413 163772 -26180 -108327 -8263 124183 -9036
5187 9280 -162454 135640 135780 138675 -176164 33706 -276983 56296 -301316 78248 -83971 -115566
5175 -115566 -108031 -84329 406968 -52427 -119766 45104 10904 -189260 -27469 -92901 246968
5163 -198637 -58292 102817 62765 -52406 -185184 345889 -24024 128558 7379 138054 177456
5152 177456 400986 222987 -100287 -199674 94788 -96227 -195454 106828 -155435 27408 -105849
5140 -31479 -178056 -257881 -175073 105558 2645 21915 -169023 115987 -181794 45099 -301827
5128 -297780 262130 -136928 -194942 42997 372223 -163422 133358 33130 289391 -141550
5117 -74066 153483 1903 104633 102967 -190190 207352 -250760 -5645 -57604 -56011 254903
5105 -240619 330000 56153 46038 220858 -272220 96767 144779 63903 -167349 187265 176929
5094 176929 -35987 225983 -102762 123212 -139376 -270006 -119357 48930 -59622 -105022
5084 -105022 187554 -176119 -221491 -131434 170026 -190295 -132461 -396468 -101816 15044
5073 282255 -79804 -68223 42608 -152544 -153452 -190564 -13766 -114759 199634 47704 215242
5062 215242 -161972 -252085 189402 -90293 185184 231270 17181 187842 7311 -32870 50168
5050 237642 -421462 -167639 144746 -22490 111012 -36256 139906 15201 -76394 359801
5039 46028 -53241 81737 149632 142880 -61050 268094 -2682 281248 15089 -60800 -182588 -52490
5026 18888 -206972 -84755 -118521 -179846 -2141 -161361 -1826 88759 -177029 -77296 321833
5014 122587 172770 211392 302695 -139924 309910 -254770 17192 408102 153964 -239385
5003 -228298 245623 -176455 -164108 -144045 64670 -15493 2095 -181154 -70418 -256598 -77701
4991 147372 -52610 243347 130248 485887 105547 -249221 -23591 -84069 67073 41485 7941
4979 -17898 -234969 99873 39784 67525 207545 232790 -297610 107365 49196 -133214 316916
4967 56644 64941 -157041 153825 -45956 51155 -226790 126060 40425 -100703 -155742 -66029
4955 216550 124204 -30523 -142819 -3241 -155543 -89415 75363 296840 355596 242663 63072
4943 120133 161939 174250 5361 -28698 -97415 89608 202259 133978 -8012 369913 111363
4931 260357 356993 -26157 -70221 -76309 -91249 124804 23201 -87687 -239764 117821 53981
4919 99812 30292 -109355 -131883 -228036 -67537 33099 -50315 126670 -3807 107024 -191932
4907 226277 207758 -67961 190121 66018 90416 -153842 111734 -186009 -188293 -127326 -251200
4896 -251200 55664 121087 131787 18109 129997 -124020 135033 20736 194096 27812 -7525
4884 261598 -57028 -1803 402864 -22187 -17505 52164 240301 64529 231795 -67738 -95012
4873 -95012 312201 88574 -130347 -89714 77676 -54879 -140320 -293392 29637 209513 -87632
4861 172664 79114 -248770 368688 172541 -353049 99898 -149206 197090 -234163 77276
4850 -203627 272260 -70235 292128 -202143 -60940 351991 -264385 192735 177303 -7962 -2679
4838 5406 -152493 -13061 -230332 142602 -312879 -194312 148363 -300081 125826 154815
4828 154815 -81115 -186317 42202 234647 -168334 93143 -266264 -183015 -44365 101433 -436090
4816 -193316 -156657 132865 -118007 -19482 -125125 218050 -118954 178268 -191647 -294864
4806 -294864 45570 152174 -33131 47821 210685 165265 -214304 -525139 -11129 93341 -53735
4794 -88430 109071 -5916 -81435 -142082 27972 66002 171363 109592 -80010 -94929 110855
4782 34224 64473 -50295 119945 218346 -102654 63388 157434 -190393 -212049 87673 -67007
4770 67433 158334 -401600 -71760 320864 98530 253549 76703 210173 98605 211390 -12453
4758 20016 -47332 102385 75192 11417 -156354 -72040 -91180 97085 129779 -236839 -58304
4746 24442 -180956 -171073 205176 206447 -16247 -10780 -122344 -12506 55930 -59887 118791 101749
4734 101749 -134978 -100312 -138546 -30412 132140 -9858 -252310 -440631 -21582 76018 212757
4723 212757 -34074 84294 83846 183478 -26972 54419 -36324 19236 -114190 268741 133154
4711 5818 117760 238434 80600 100497 -74130 219174 -19433 553600 -140871 -358498 12334
4699 -9172 195550 162892 -112380 4302 -120375 61672 -204035 -157089 286158 241303 -65112
4687 184532 -124728 44010 159537 -223137 -47265 -30512 304319 -213224 -227028 -81592 269356
4675 149817 273958 272149 109368 -39468 -42727 52031 151002 45081 159755 161428 -141913
4663 4866 -28471 12047 -34096 178346 -331348 368931 231700 97668 -94051 270744 15745
4651 -142713 47098 -252345 -61687 195348 -215652 104929 130098 78576 52637 35095 -125122
4639 169791 -132735 12764 187892 248943 147277 -230577 -289039 231264 -206880 79294
4628 -175606 189589 -88808 470878 -146581 290719 67497 -87398 -51969 92172 278903 -83194
4616 1426 38558 47483 247635 -203253 -319264 -237159 199667 240646 146715 -162632 -46537
4604 331101 145149 -251111 280063 -180775 84714 -89051 14048 -37984 31738 -273582 309785
4592 177504 140063 237738 210694 -38691 -222667 80290 24207 14708 -117839 -34932 -189992
4581 -189992 33214 234069 279166 -55977 -63895 151726 210993 -101731 -169006 245514 -46708
4569 -10281 -89885 -95560 222810 -128366 -88518 138887 195782 -165882 108555 -180756 160156
4557 36120 107520 -88847 35089 -66157 -161524 62493 -51654 16448 -2500 -115009 -155440 -25432
4544 316562 -28549 -78022 -152745 64725 27569 -8371 -17358 76407 -289423 377401 -150006
4532 -119124 -115355 35797 -15742 -13224 54212 60216 212086 102833 210097 300581 72711 81945
4520 81945 -4943 -137277 -197026 33850 226426 205691 118745 365402 -232390 -347025 179273
4508 26799 -134412 238231 -106618 3894 -150746 104329 57803 274436 164984 -220918
4497 -16893 105984 312077 161300 -920 -97676 96322 66228 115996 87551 -165262 -88419
$$ [...]
##END NTUPLES=NMR SPECTRUM
##END=
