
##TITLE=AC1325_PERAH11154_6608673_tQbYA64zly
##JCAMPDX= 6.0         $$ Bruker NMR JCAMP-DX V2.0
##DATA TYPE= NMR SPECTRUM
##DATA CLASS= NTUPLES
##ORIGIN= BRUKER
##OWNER= Administrator
$$ 1.72 TOPSPIN		Version 2.1
$$ 2012-08-01 16:31:44.703 -0500  Administrator@TOPSPIN
$$ Compression mode = diff/dup
##.OBSERVE FREQUENCY= 400.02188249412
##.OBSERVE NUCLEUS= ^1H
##.ACQUISITION MODE= SIMULTANEOUS (DQD)
##.ACQUISITION SCHEME= undefined
##.AVERAGES= 64
##.DIGITISER RES= 22
##SPECTROMETER/DATA SYSTEM= spect
##.PULSE SEQUENCE= noesygpps1d.comp
##.SOLVENT NAME= COFFEE_meoh
##.SHIFT REFERENCE= INTERNAL, COFFEE_meoh, 1, 14.96232
##AUDIT TRAIL= $$ (NUMBER, WHEN, WHO, WHERE, PROCESS, VERSION, WHAT)
$$ ##TITLE= Audit trail, TOPSPIN		Version 2.1
$$ ##JCAMPDX= 5.01
$$ ##ORIGIN= Bruker BioSpin GmbH
$$ ##OWNER= Administrator
$$ $$ C:\Bruker\TOPSPIN/data/COFFEE/nmr/AC1325_PERAH11154_6608673_tQbYA64zly/12/pdata/1/auditp.txt
$$ ##AUDIT TRAIL=  $$ (NUMBER, WHEN, WHO, WHERE, PROCESS, VERSION, WHAT)
(   1,<2012-08-01 16:31:39.921 -0500>,<Administrator>,<TOPSPIN>,<go>,<TOPSPIN 2.1>,
      <created by zg
	started at 2012-08-01 16:20:09.671 -0500,
	POWCHK enabled, PULCHK disabled,
       configuration hash MD5:
       6B 1B 68 BB D9 2E 58 E2 7F 35 AD 54 07 DF 0E 41
       data hash MD5: 64K
       BA 21 25 04 68 50 88 6F 3E AD 7E 5C 12 FD 6F 70>)
(   2,<2012-08-01 16:31:42.843 -0500>,<Administrator>,<TOPSPIN>,<proc1d>,<TOPSPIN 2.1>,
      <Start of raw data processing
       efp LB = 0.3 FT_mod = 6 PKNL = 1 PHC0 = 0 PHC1 = 0 SI = 128K 
       data hash MD5: 128K
       DB 11 53 24 F6 43 5D 7B 3D 83 70 DF F5 D1 B8 98>)
(   3,<2012-08-01 16:31:43.906 -0500>,<Administrator>,<TOPSPIN>,<proc1d>,<TOPSPIN 2.1>,
      <pk PHC0 = -1.334839 PHC1 = 0 
       data hash MD5: 128K
       7E B7 D3 25 E5 CD A7 D7 2B 83 4D 12 56 25 31 C9>)
(   4,<2012-08-01 16:31:44.375 -0500>,<Administrator>,<TOPSPIN>,<proc1d>,<TOPSPIN 2.1>,
      <abs ABSG = 1 
       data hash MD5: 128K
       EF F3 0A 27 24 AE FA 55 BF E0 85 E9 13 D8 85 5C>)
(   5,<2012-08-01 16:31:44.453 -0500>,<Administrator>,<TOPSPIN>,<proc1d>,<TOPSPIN 2.1>,
      <abs ABSG = 2 
       data hash MD5: 128K
       23 42 19 85 B0 A7 12 EC AE 80 C4 AD 7C 5C 52 F8>)
(   6,<2012-08-01 16:31:44.500 -0500>,<Administrator>,<TOPSPIN>,<proc1d>,<TOPSPIN 2.1>,
      <abs ABSG = 3 
       data hash MD5: 128K
       26 0C BB 35 14 FA 93 4B 3C 4B 07 A0 A9 34 1A FE>)
(   7,<2012-08-01 16:31:44.562 -0500>,<Administrator>,<TOPSPIN>,<proc1d>,<TOPSPIN 2.1>,
      <abs ABSG = 4 
       data hash MD5: 128K
       7E A8 6A E9 75 27 BD 03 37 F7 29 D9 B9 BB E1 C9>)
(   8,<2012-08-01 16:31:44.625 -0500>,<Administrator>,<TOPSPIN>,<proc1d>,<TOPSPIN 2.1>,
      <abs ABSG = 5 
       data hash MD5: 128K
       FA 26 DA 2F FE A8 43 F6 E9 B0 44 77 D1 1D 6D E7>)
$$ ##END=
$$ 
$$ $$ hash MD5
$$ $$ 89 F0 9D 6D 02 00 E9 73 15 01 07 0F C7 1E 9E CB
##$RELAX= 
##$RELAX= 
##$RELAX= 
##$RELAX= 
##$RELAX= 
##$RELAX= 
##$RELAX= 
##$RELAX= 
$$ Bruker specific parameters
$$ [...]
##$TP07= 0
##$TPNAME0= <>
##$TPNAME1= <>
##$TPNAME2= <>
##$TPNAME3= <>
##$TPNAME4= <>
##$TPNAME5= <>
##$TPNAME6= <>
##$TPNAME7= <>
##$TPOAL= (0..7)
0.5 0.5 0.5 0.5 0.5 0.5 0.5 0.5
##$TPOFFS= (0..7)
0 0 0 0 0 0 0 0
##$TUNHIN= 0
##$TUNHOUT= 0
##$TUNXOUT= 0
##$USERA1= <user>
##$USERA2= <user>
##$USERA3= <user>
##$USERA4= <user>
##$USERA5= <user>
##$V9= 5
##$VALIST= <valist>
##$VCLIST= <CCCCCCCCCCCCCCC>
##$VD= 0
##$VDLIST= <DDDDDDDDDDDDDDD>
##$VPLIST= <PPPPPPPPPPPPPPP>
##$VTLIST= <TTTTTTTTTTTTTTT>
##$WBST= 1024
##$WBSW= 4
##$XGAIN= (0..3)
0 0 0 0
##$XL= 0
##$YL= 0
##$YMAX_a= 15982260
##$YMIN_a= -9750578
##$ZGOPTNS= <>
##$ZL1= 120
##$ZL2= 120
##$ZL3= 120
##$ZL4= 120
##$ABSF1= 14.96232
##$ABSF2= -5.595861
##$ABSG= 5
##$ABSL= 3
##$ALPHA= 0
##$AQORDER= 0
##$ASSFAC= 0
##$ASSFACI= 0
##$ASSFACX= 0
##$ASSWID= 0
##$AUNMP= <proc_prof1d_extract.lims>
##$AXLEFT= 0
##$AXNAME= <>
##$AXNUC= <1H>
##$AXRIGHT= 0
##$AXTYPE= 0
##$AXUNIT= <>
##$AZFE= 0.1
##$AZFW= 0.1
##$BCFW= 0
##$BC_mod= 0
##$BYTORDP= 0
##$COROFFS= 0
##$CY= 15
##$DATMOD= 1
##$DC= 0
##$DFILT= <>
##$DTYPP= 0
##$F1P= 0
##$F2P= 0
##$FCOR= 0.5
##$FTSIZE= 131072
##$FT_mod= 6
##$GAMMA= 0
##$GB= 0
##$INTBC= 1
##$INTSCL= 1
##$ISEN= 128
##$LB= 0.3
##$LEV0= 0
##$LPBIN= 0
##$MAXI= 10000
##$MC2= 0
##$MEAN= 0
##$ME_mod= 0
##$MI= 0
##$NCOEF= 0
##$NC_proc= -2
##$NLEV= 6
##$NOISF1= 0
##$NOISF2= 0
##$NSP= 0
##$NTH_PI= 0
##$NZP= 0
##$OFFSET= 14.96232
##$PC= 1
##$PHC0= -1.334839
##$PHC1= 0
##$PH_mod= 1
##$PKNL= yes
##$PPARMOD= 0
##$PPDIAG= 0
##$PPIPTYP= 0
##$PPMPNUM= 2147483647
##$PPRESOL= 1
##$PSCAL= 4
##$PSIGN= 0
##$PYNMP= <proc.py>
##$REVERSE= no
##$SF= 400.020009108331
##$SI= 131072
##$SIGF1= 0
##$SIGF2= 0
##$SINO= 400
##$SIOLD= 131072
##$SPECTYP= <>
##$SREGLST= <1H.CDCl3>
##$SSB= 0
##$STSI= 131072
##$STSR= 0
##$SW_p= 8223.68421052631
##$SYMM= 0
##$S_DEV= 0
##$TDeff= 65536
##$TDoff= 0
##$TI= <>
##$TILT= no
##$TM1= 0
##$TM2= 0
##$TOPLEV= 0
##$USERP1= <user>
##$USERP2= <user>
##$USERP3= <user>
##$USERP4= <user>
##$USERP5= <user>
##$WDW= 1
##$XDIM= 131072
##$YMAX_p= 414830721
##$YMIN_p= -14936
##$CURPLOT= <Network HP LaserJet P1505>
##$CURPRIN= <$Network HP LaserJet P1505>
##$DFORMAT= <normdp>
##$LAYOUT= <+/1D_H.xwp>
##$LFORMAT= <normlp>
##$PFORMAT= <normpl>
##$SURQMSG= 1
$$ End of Bruker specific parameters
$$ ---------------------------------
##NTUPLES= NMR SPECTRUM
##VAR_NAME=  FREQUENCY,     SPECTRUM/REAL,   SPECTRUM/IMAG
##SYMBOL=    X,             R,               I
##VAR_TYPE=  INDEPENDENT,   DEPENDENT,       DEPENDENT
##VAR_FORM=  AFFN,          ASDF,            ASDF
##VAR_DIM=   131072,        131072,          131072
##UNITS=     HZ,            ARBITRARY UNITS, ARBITRARY UNITS
##FACTOR=    0.0627417313425164, 1,          1
##FIRST=     8223.62146879497, -3540,        -58456
##LAST=      0,             -1484,           -59824
##MIN=       0,             -14936,          0
##MAX=       8223.62146879497, 414830721,    0
$$ Real data points
##PAGE= N=1
##DATA TABLE= (X++(R..R)), XYDATA
$$ [...]
60939E073244n37730m40666l65461l08578k65083k31217k04915j84240j66951
$$ 5073244 4535514 4094848 3729387 3420809 3155726 2924509 2719594 2535354 2368403
60930B368403j51545j37507j24448j11871r9708q8376p8304o9996o4249o1496
$$ 2368403 2216858 2079351 1954903 1843032 1743324 1654948 1576644 1506648 1442399 1380903
60920A380903o0921o0810n9820n7564n4261n0380m6449m2675l8754l4483l0352
$$ 1380903 1319982 1259172 1199352 1141788 1087527 1037147 990698 948023 909269 874786 844434
60909H44434k7045k4472k1895j8962j6142j4015j2540j1194r648q075o847n969
$$ 844434 817389 792917 771022 752060 735918 721903 709363 698169 688521 680446 673599 667630
60897F67630n000l688k449j823j532p04Q61K360L193L814M929O400P495P743P052
$$ 667630 662630 658942 656493 654670 653138 652434 653295 655655 658848 662662 667591 673991 681486 689229 696281
60882F96281N379K978O01j188k665m367o208p819r400j1386j3376j4254j3518
$$ 696281 701660 704638 705239 704051 701386 697019 690811 682992 673592 662206 648830 634576 621058
60869F21058j1827j0135q859p989p403o868o143n330m735m239l269j590L22J917
$$ 621058 609231 599096 590237 582248 574845 567977 561834 556504 551769 547530 544261 542671 542993 544910
60855E44910L207M484N684O428O621O745P506R188J1391J3424J5039J6602J8460
$$ 544910 548117 552601 558285 564713 571334 578079 585585 594773 606164 619588 634627 651229 669689
60842F69689K0389K1879K2764K3100K2667K1056J8316J5025J1636Q211M932K434
$$ 669689 690078 711957 734721 757821 780488 801544 819860 834885 846521 854732 859664 862098
60830H62098J295J383J969K287J904O99j157l240n028o124o525o701p291q446
$$ 862098 863393 864776 866745 869032 870936 871635 870478 867238 862210 856086 849561 842860 835569 827123
60816H27123r590j0076j0016j0151j0896j1895j2546j2691j2605j2590j2734j2828
$$ 827123 817533 807457 797441 787290 776394 764499 751953 739262 726657 714067 701333 688505
60804F88505j2454j1308r580p828o354m989l541k199j280p16r4Q68K048L109L906
$$ 688505 676051 664743 655163 647335 640981 635992 632451 630252 628972 628256 628162 629030 631078 634187 638093
60789F38093M677N783P171Q314Q872R243J0074J1257J1947J1673J0894J0226R564
$$ 638093 642770 648553 655724 664038 672910 682153 692227 703484 715431 727104 737998 748224 757788
60776G57788Q513P265O476O367O540O704P028P631Q187Q394Q458Q779R230R170
$$ 757788 766301 773566 780042 786409 792949 799653 806681 814312 822499 830893 839351 848130 857360 866530
60762H66530Q182O620N274M617M428M091L154J624j32j610k347k166j413q10p87
$$ 866530 874712 881332 886606 891223 895651 899742 902896 904520 904388 902778 900431 898265 896852 896042 895255
60747H95255r94p68j80k23j630l723m965m764m283n058p091q788q821p608o681
$$ 895255 894261 893493 893313 893090 891460 887737 882772 878008 873725 868667 861576 852788 843967 836359 829678
60732H29678o940p906q489q071o813n304m125l480l088k578k084k188l064l967
$$ 829678 822738 814832 806343 798272 791459 786155 782030 778550 775462 772884 770800 768612 765548 761581
60718G61581m001l209k439k180k112j907j912k529l321l335k279q59O5L20L11
$$ 761581 757580 754371 751932 749752 747640 745733 743821 741292 737971 734636 732357 731498 731563 731883 732194
60703G32194M53R04J566K104K164J722J123O07p0j279l060n102p137r066j0773
$$ 732194 732647 733551 735117 737221 739385 741107 742230 742837 742767 741488 738428 733326 726189 717123 706350
60688G06350j2048j2769j2994j2888j2642j2429j2335j2312j2218j1854j1004
$$ 706350 694302 681533 668539 655651 643009 630580 618245 605933 593715 581861 570857
60677E70857r585p932o633n881n121l645j518M18J459J741J952K602L623M507
$$ 570857 561272 553340 546707 540826 535705 532060 530542 530960 532419 534160 536112 538714 542337 546844
60663E46844M749M327L834L947M705N443N519M966M306L941L867L923M124M656
$$ 546844 551593 555920 559754 563701 568406 573849 579368 584334 588640 592581 596448 600371 604495 609151
60649F09151N569O541P092P063O788O610O411N880N136M739N005N648O326P173
$$ 609151 614720 621261 628353 635416 642204 648814 655225 661105 666241 670980 675985 681633 687959 695132
60635F95132Q529J0300J1963J3150J3924J4458J4759J4792J4674J4502J4134J3267
$$ 695132 703661 713961 725924 739074 752998 767456 782215 797007 811681 826183 840317 853584
60623H53584J1766R757P493N213L134J287o59l149o119q883j0841j2121j3122
$$ 853584 865350 875107 882600 887813 890947 892234 891575 888426 882307 873424 862583 850462 837340
60610H37340j3705j3410j2374j1325j0528r381p484n421l957k980j940r65p44
$$ 837340 823635 810225 797851 786526 775998 766617 759133 753712 749755 746775 744835 743870 743126
60597G43126j403k286k847l145l389l588l705l620k854j007J411L237L979M376
$$ 743126 741723 739437 736590 733445 730056 726468 722763 719143 716289 715282 716693 719930 723909 728285
60583G28285N269O532P443P676P444O988O377N634M794L914L177K721K319J541
$$ 728285 733554 740086 747529 755205 762649 769637 776014 781648 786442 790356 793533 796254 798573 800114
60569H00114L88o08j081j294j703k480l589m852n842o232o439p294q769r777r664
$$ 800114 800502 799894 798813 797519 795816 793336 789747 784895 779053 772821 766382 759088 750319 740542 730878
60554G30878r176r218r367q560o767m942l549k131l73J379K835M221N799P519
$$ 730878 721702 712484 703117 694557 687790 682848 679299 677168 676795 678174 681009 685230 691029 698548
60540F98548R413J1711J4392J7109J9771K2761K6315L0069L3316L5333L5329L2640
$$ 698548 707961 719672 734064 751173 770944 793705 820020 850089 883405 918738 954067 986707
60528I86707K7247J9754J0753P17r269j7429k2489k4669k5021k4089k1717j7909
$$ 986707 1013954 1033708 1044461 1045178 1035909 1018480 995991 971322 946301 922212 900495 882586
60516H82586j3260q447l823L70L761O086P429Q079Q320Q390Q511Q699Q732Q535
$$ 882586 869326 860879 857056 857426 861187 867273 874702 882781 891101 899491 908002 916701 925433 933968
60502I33968Q551R487J1641J4722J8364K2538K7256L2266L7446M3303N0511N8874
$$ 933968 942519 952006 963647 978369 996733 1019271 1046527 1078793 1116239 1159542 1210053 1268927
60490A268927O7280P4863Q1801Q8800R6387J05105J15988J30258J48755J72006
$$ 1268927 1336207 1411070 1492871 1581671 1678058 1783163 1899151 2029409 2178164 2350170
60480B350170K00303K32692K65508K92318L05746K99711K70855K19117J47709
$$ 2350170 2550473 2783165 3048673 3340991 3646737 3946448 4217303 4436420 4584129
60471D584129O2530k8668j17077j93998k52756k90489l08174l09007k96884k75963
$$ 4584129 4646659 4617991 4500914 4306916 4054160 3763671 3455497 3146490 2849606 2573643
60461B573643k50471k23941j98407j74561j52572j32697j15202r9989q6509p4191
$$ 2573643 2323172 2099231 1900824 1726263 1573691 1440994 1325792 1225803 1139294 1065103
60451A065103o3091n3919m7171m2235l7714l2670k7395k2822j9399j6742j4277
$$ 1065103 1002012 948093 900922 858687 820973 788303 760908 738086 718687 701945 687668
60440F87668j1996j0437r950j0114j0079r455q558p779p087o348n728n451n332
$$ 687668 675672 665235 655285 645171 635092 625637 617079 609300 602213 595865 590137 584686 579354
60427E79354n009m442l834l223k504j715r76k36N39J144J470J834K573L450L994
$$ 579354 574345 569903 566069 562846 560342 558627 557651 557415 557954 559098 560568 562402 564975 568425 572419
60412E72419M186M233L960L169K470K792L970M761M505L941L984M426M492L974
$$ 572419 576605 580838 584798 587967 590437 593229 597199 601960 606465 610406 614390 618816 623308 627282
60398F27282L249K567K023J880K358L280M364N613P018Q107Q278P480O127M579
$$ 627282 630531 633098 635121 637001 639359 642639 647003 652616 659634 667741 676019 683499 689626 694205
60384F94205L049J859J258J031O57j68j376k712l763m017l290k077j109o75n40
$$ 694205 697254 699113 700371 701402 702059 701891 700515 697803 694040 690023 686733 684656 683547 682872 682332
60369F82332m25j53N07J624K737L160K837K521K875L675M207M293M480N190O014
$$ 682332 681907 681754 682261 683885 686622 689782 692619 695140 698015 701690 705897 710190 714670 719860 725874
60354G25874O257O019O166P020P690P282O418O520P749Q691Q496Q154Q827R855
$$ 725874 732131 738150 744316 751336 759026 766308 772726 779246 786995 795686 804182 812336 821163 831018
60340H31018R708Q399P522P759P791O238L664J776J301J677K510M231P075J0258
$$ 831018 840726 849125 856647 864406 872197 878435 882099 883875 885176 886853 889363 893594 900669 910927
60326I10927J2709J4268J5553J6722J6894J4988J0829N173j068p205j2514j6241
$$ 910927 923636 937904 953457 970179 987073 1002061 1012890 1018063 1016995 1009790 997276 981035
60314I81035j8169j8839j8856j8262j6880j5044j3446j2298j1124r563p906o672
$$ 981035 962866 944027 925171 906909 890029 874985 861539 849241 838117 828554 820648 813976
60302H13976n897n183m309l437k759k121j198J24J611K914L790M168M095L781
$$ 813976 808079 802896 798587 795150 792391 790270 789072 789196 790807 793721 797511 801679 805774 809555
60288H09555L491L266K785J791O60J84O98J669K434K970L637M380M700M460M154
$$ 809555 813046 816312 819097 820888 821548 821732 822430 824099 826533 829503 833140 837520 842220 846680 850834
60273H50834M233M539M675M670M884N412N978O420O998P999R293J0470J1336J2112
$$ 850834 855067 859606 864281 868951 873835 879247 885225 891645 898643 906642 915935 926405 937741 949853
60259I49853J3238J5009J7379K0023K2663K5408K8607L2152L5259L7414L9385
$$ 949853 963091 978100 995479 1015502 1038165 1063573 1092180 1124332 1159591 1197005 1236390
60248A236390M2646M7635N3298N8662O4139P0646P8080Q5613R3148J01271J09777
$$ 1236390 1279036 1326671 1379969 1438631 1502770 1573416 1651496 1737109 1830257 1931528 2041305
60237B041305J17278J22598J25739J27060J26380J23387J18196J10849J00879
$$ 2041305 2158583 2281181 2406920 2533980 2660360 2783747 2901943 3012792 3113671
60228C113671Q8141P3611N8649M3722K8496J2866k782j7955l1931m3454n1426
$$ 3113671 3201812 3275423 3334072 3377794 3406290 3419156 3416374 3398419 3366488 3323034 3271608
60217C271608n5996n8249n8845n7484n3685m7341l8558k7667j5561l267R028K1925
$$ 3271608 3215612 3157363 3098518 3041034 2987349 2940008 2901450 2873783 2858222 2854955 2863983 2885908
60205B885908L5635M9644O3654P8080R2993J07329J19690J29374J36121J39362
$$ 2885908 2921543 2971187 3034841 3112921 3205914 3313243 3432933 3562307 3698428 3837790
60195C837790J38542J33762J25417J13430R7619P8714N8245L7376J6324n079k6703
$$ 3837790 3976332 4110094 4235511 4348941 4446560 4525274 4583519 4620895 4637219 4632140 4605437
60184D605437m7999o7970q5286r8864j08474j14414j16687j14918j09058r9610
$$ 4605437 4557438 4489468 4404182 4305318 4196844 4082430 3965743 3850825 3741767 3642157
60174C642157q7154p2238n5730l8629k1216l064J5832L4461N1672O7066Q0597
$$ 3642157 3555003 3482765 3427035 3388406 3367190 3364126 3379958 3414419 3466091 3533157 3613754
60163C613754R1769R9802J04079J03964R8709Q8319P4259N8443M1704K4019N965
$$ 3613754 3705523 3805325 3909404 4013368 4112077 4200396 4274655 4333098 4374802 4398821 4404786
60152D404786j1051k6125l9234m9932n6638n8109n4948m8883m0828l0425j7295
$$ 4404786 4393735 4367610 4328376 4278444 4221806 4163697 4108749 4059866 4019038 3988613 3971318
60141C971318j913J4817L2353N0698P0153R0989J13113J36122J59866J84821K11473
$$ 3971318 3969405 3984222 4016575 4067273 4137426 4228415 4341528 4477650 4637516 4822337 5033810
60130E033810K39423K67544K95078L22022L48187L72231L92008M05738M12554
$$ 5033810 5273233 5540777 5835855 6157877 6506064 6878295 7270303 7676041 8088595
60121H088595M12099M04020L88034L64240L33141K95445K52026K03979J52328
$$ 8088595 8500694 8904714 9292748 9656988 9990129 10285574 10537600 10741579 10893907
60112A0893907R7473L9312k1728q3908j44767k02341k55227l01560l38824l65097
$$ 10893907 10991380 11030692 11008964 10925056 10780289 10577948 10322721 10021161 9682337 9317240
60102I317240l80045l84336l78676l63955l41827l14182k82222k46661k08675
$$ 9317240 8937195 8552859 8174183 7810228 7468401 7154219 6871997 6625336 6416661
60093F416661j69843j31070r2318n3653j5985J9474N1980Q1063J05878J25107
$$ 6416661 6246818 6115748 6023430 5969777 5953792 5973266 6025246 6106309 6212187 6337294
60083F337294J37416J41967J38697J28294J11788R0203O4753L7169R340j7544
$$ 6337294 6474710 6616677 6755374 6883668 6995456 7085659 7150412 7187581 7196921 7179377
60073G179377m3115o7160q9249j09166j27136j43316j57317j68595j77056j82974
$$ 7179377 7136262 7069102 6979853 6870687 6743551 6600235 6442918 6274323 6097267 5914293
60063E914293j86398j86903j83992j77628j68347j56718j42838j26610j08612
$$ 5914293 5727895 5540992 5357000 5179372 5011025 4854307 4711469 4584859 4476247
60054D476247r0102p1734n2824l2582j1756P956K6114M4144O3410Q3473J02624
$$ 4476247 4386145 4314411 4261587 4229005 4217249 4225205 4251319 4295463 4358873 4442346 4544970
60043D544970J19413J33143J43370J49584J51147J47294J37498J22155J02477
$$ 4544970 4664383 4797526 4940896 5090480 5241627 5388921 5526419 5648574 5751051
60034E751051P9524N3782K5905k784l1058n8513q5032j09893j31828j49556j61881
$$ 5751051 5830575 5884357 5910262 5907478 5876420 5817907 5732875 5622982 5491154 5341598 5179717
60023E179717j67951j68093j63878j56712j46649j33307j17467j00791q4143o7139
$$ 5179717 5011766 4843673 4679795 4523083 4376434 4243127 4125660 4024869 3940726 3873587
60013C873587m9439l1553j4088L127K0716L9004N7923P7422R7627J18530J39588
$$ 3873587 3824148 3792595 3778507 3781634 3802350 3841354 3899277 3976699 4074326 4192856 4332444
60002D332444J59695J77620J92523K03773K10287K10552K03610J89770J70003
$$ 4332444 4492139 4669759 4862282 5066055 5276342 5486894 5690504 5880274 6050277
59993F050277J45159J16203Q4798N2785K1087j0388m1794p2757j02477j29843
$$ 6050277 6195436 6311639 6396437 6449222 6470309 6459921 6418127 6345370 6242893 6113050
59983F113050j53308j71272j82723j87421j85588j77856j65263j48851j29229
$$ 6113050 5959742 5788470 5605747 5418326 5232738 5054882 4889619 4740768 4611539
59974D611539j06996q3405n9959l7350j5292O514K7769M7990O6967Q4530J00246
$$ 4611539 4504543 4421138 4361179 4323829 4308537 4315051 4342820 4390810 4457777 4542307 4642553
59963D642553J13617J24370J32345J37144J38039J34322J25984J14126J00361
$$ 4642553 4756170 4880540 5012885 5150029 5288068 5422390 5548374 5662500 5762861
59954E762861Q5581O9684N2816L6322K1825R714n82q992j4342j5541j2470n355
$$ 5762861 5848442 5918126 5970942 6007264 6029089 6038803 6038221 6029229 6014887 5999346 5986876 5981521
59942E981521O009K2047M2808O7936R7005J29645J65520K04239K45179K87453
$$ 5981521 5987530 6009577 6052385 6120321 6217326 6346971 6512491 6716730 6961909 7249362
59932G249362L30173L72313M11882M45604M70093M83056M82561M65532M28378
$$ 7249362 7579535 7951848 8363730 8809334 9279427 9762483 10245044 10710576 11138954
59923A1138954L69755K92022J99737R7614r533j15792k14485k99799l68090m17996
$$ 11138954 11508709 11800731 12000468 12098082 12088549 11972757 11758272 11458473 11090383 10672387
59913A0672387m49852m64912m64780m51473m27840l97337l62951l26418k88498
$$ 10672387 10222535 9757623 9292843 8841370 8413530 8016193 7653242 7326824 7038326
59904G038326k49635k10236j70723j31679r3671n6782k0559J5317N0502Q4224
$$ 7038326 6788691 6578455 6407732 6276053 6182382 6125600 6105041 6120358 6170860 6255084
59894F255084J15803J44816J70960J93654K11458K21928K22584K12218J90866
$$ 6255084 6370887 6515703 6686663 6880317 7091775 7313703 7536287 7748505 7939371
59885G939371J58720J15903O3654N023n6117j16341j72682k22215k62524k92536
$$ 7939371 8098091 8213994 8277648 8282671 8226554 8110213 7937531 7715316 7452792 7160256
59875G160256l12427l22868l24671l18928l07002k90408k70817k49778k28080
$$ 7160256 6847829 6524961 6200290 5881362 5574360 5283952 5013135 4763357 4535277
59866D535277k05657j82470j59242j36941j15976r6417p8748o3793n1973m3164
$$ 4535277 4329620 4147150 3987908 3850967 3734991 3638574 3559826 3496033 3444060 3400896
59856C400896l7259l4292l3958l5402l7601l9686m0861m0474l8319l4601k9477
$$ 3400896 3363637 3329345 3295387 3259985 3222384 3182698 3141837 3101363 3063044 3028443 2998966
59845B998966k2979j5537q244k343J431K753J199l601j1240k0295k9235l7296
$$ 2998966 2975987 2960450 2952206 2949863 2951294 2954047 2955246 2951645 2940405 2920110 2890875 2853579
59833B853579m4254m9546n2286n2181m9867m6085m1025l4807k8046k1353j4604
$$ 2853579 2809325 2759779 2707493 2655312 2605445 2559360 2518335 2483528 2455482 2434129 2419525
59822B419525p383J64P596J5012K2638K9608L4241L6130L7214M0122M5863N3488
$$ 2419525 2412142 2412306 2419902 2434914 2457552 2487160 2521401 2557531 2594745 2634867 2680730 2734218
59810B734218O1566O9197P5689P9908Q0380P6161O7624N6371M4226L2371K1395
$$ 2734218 2795784 2864981 2940670 3020578 3100958 3177119 3244743 3301114 3345340 3377711 3399106
59799C399106J1665L287m023j0204j4235j4886j2157p191q83O755J5783K5935
$$ 3399106 3410771 3414058 3410035 3399831 3385596 3370710 3358553 3351362 3350479 3357234 3373017 3398952
59787C398952L7295N0478O5651Q2226R9976J19680J42169J67540J96070K29080
$$ 3398952 3436247 3486725 3552376 3634602 3734578 3854258 3996427 4163967 4360037 4589117
59777D589117K67805L11616L57888M02931M41899M67681M70976M42520L76720
$$ 4589117 4856922 5168538 5526426 5929357 6371256 6838937 7309913 7752433 8129153
59768H129153K75167J48087J1889j16391k23946l03573l52940l74104l72730l55687
$$ 8129153 8404320 8552407 8564296 8447905 8223959 7920386 7567446 7193342 6820612 6464925
59758F464925l28451k94766k57862k20673j85000j51575j20970r3541o8632m5129
$$ 6464925 6136474 5841708 5583846 5363173 5178173 5026598 4905628 4812087 4743455 4698326
59748D698326k2984l105J4488L1241M8284O5112Q0807R5750J11253J27976J45522
$$ 4698326 4675342 4672237 4686725 4717966 4766250 4831362 4912169 5007919 5119172 5247148 5392670
59737E392670J63413J81728K00900K21363K43426K67269K93062L21307L52769
$$ 5392670 5556083 5737811 5938711 6160074 6403500 6670769 6963831 7285138 7637907
59728G637907L87828M26060M66632N08854N52012N94836O35280O70584O97440
$$ 7637907 8025735 8451795 8918427 9427281 9979293 10574129 11209409 11879993 12577433
59719A2577433P12468P13196O98688O69440O27283N75962N21478M70909M30307
$$ 12577433 13289901 14003097 14701785 15371225 15998508 16574470 17095948 17566857 17997164
59710A7997164M03540L92634L98311M19635M53516M95122N38955N79489O11228
$$ 17997164 18400704 18793338 19191649 19611284 20064800 20559922 21098877 21678366 22289594
59701B2289594O28846O27704O04397N57172M86407L95053K88362J72883N5575
$$ 22289594 22918440 23546144 24150541 24707713 25194120 25589173 25877535 26050418 26105993
59692B6105993n6511j56605k39189l00790l39810l55865l49739l23613k80528
$$ 26105993 26049482 25892877 25653688 25352898 25013088 24657223 24307484 23983871 23703343
59683B3703343k23289j54016p4559J3309J08307K09752L16972M28895N44213O61348
$$ 23703343 23480054 23326038 23251479 23264788 23373095 23582847 23899819 24328714 24872927 25534275
59673B5534275P77858Q89870R91964J076861J135003J155220J126928J042344
$$ 25534275 26312133 27202003 28193967 29270828 30405831 31561051 32687979 33730323
59665C3730323Q97683O94034M38680J45721j65293m72240p53535r91184j173463
$$ 33730323 34628006 35322040 35760720 35906441 35741148 35268908 34515373 33524189 32350726
59656C2350726j295904j359771j369641j332369j257279j155748j039883r21767
$$ 32350726 31054822 29695051 28325410 26993041 25735762 24580014 23540131 22618364
59648B2618364q13880p29211o79290o70395p00162p57273q25036q86904r30641
$$ 22618364 21804484 21075273 20395983 19725588 19025426 18268153 17443117 16556213 15625572
59639A5625572r49701r42877r13391q67210q10565p48229o83561o19298n57597
$$ 15625572 14675871 13732994 12819603 11952393 11141828 10393599 9710038 9090740 8533143
59630H533143m99722m46319l97888l54604l15973k81244k49992k21938j96488
$$ 8533143 8033421 7587102 7189214 6834610 6518637 6237393 5987401 5765463 5568975
59621E568975j72976j51172j31124j12738r5909q0831o7722n6554m7416m0772
$$ 5568975 5395999 5244827 5113703 5000965 4905056 4824225 4756503 4699949 4652533 4611761
59611D611761l6777l4832l4495l6479m1848n0372o0384p0186p8863q5966r1245
$$ 4611761 4574984 4540152 4505657 4469178 4427330 4376958 4316574 4246388 4167525 4081559 3990314
59600C990314r4818r6900r7261r5529r1876q6840q0576p3093o5037n7360n0129
$$ 3990314 3895496 3798596 3701335 3605806 3513930 3427090 3346514 3273421 3208384 3151024 3100895
59589C100895m2572l4456k6500j9244j2325n266J777Q382J4337J9407K3296K6149
$$ 3100895 3058323 3023867 2997367 2978123 2965798 2960532 2962309 2970691 2985028 3004435 3027731 3053880
59577C053880K8517L0425L1166L0366K8677K6986K5539K4376K4028K5196K8052
$$ 3053880 3082397 3112822 3143988 3174354 3203031 3230017 3255556 3279932 3303960 3329156 3357208
59566C357208L2389L8080M4925N2385O0052O8145P7107Q6898R7184J08004J19821
$$ 3357208 3389597 3427677 3472602 3524987 3585039 3653184 3730291 3817189 3914373 4022377 4142198
59555D142198J33027J47820J64345J82407K01199K19726K37613K54999K71612
$$ 4142198 4275225 4423045 4587390 4769797 4970996 5190722 5428335 5683334 5954946
59546E954946K86403K98197L06336L10421L09855L04126K93437K78645K60642
$$ 5954946 6241349 6539546 6845882 7156303 7466158 7770284 8063721 8342366 8603008
59537H603008K40185K18190J95328J70858J42742J10126P5682M4310J9271M35
$$ 8603008 8843193 9061383 9256711 9427569 9570311 9680437 9756119 9800429 9819700 9820135
59527I820135j3374k1624k2504j5128K8K2275N0835Q3864J18402J51383J79776
$$ 9820135 9806761 9785137 9762633 9747505 9747533 9769808 9820643 9904507 10022909 10174292 10354068
59516A0354068J99771K07183J99349J76023J38221Q7024K4045m7654j23823k00081
$$ 10354068 10553839 10761022 10960371 11136394 11274615 11361639 11385684 11338030 11214207 11014126
59506A1014126k72576l38024l93643m37067m66557m81604m83251m73410m53928
$$ 11014126 10741550 10403526 10009883 9572816 9106259 8624655 8141404 7667994 7214066
59497G214066m26734l94430l59819l24753k90066k56543k25059j95765j68154
$$ 7214066 6787332 6392902 6033083 5708330 5418264 5161721 4936662 4740897 4572743
59488D572743j42158j18336r6730p6547n7363l9620k3445p838Q269K4889M1559
$$ 4572743 4430585 4312249 4215519 4138972 4081609 4041989 4018544 4010706 4018975 4043864 4085423
59477D085423N8362P5718R3784J12646J32526J53145J73507J92965K11983K31063
$$ 4085423 4143785 4219503 4313287 4425933 4558459 4711604 4885111 5078076 5290059 5521122
59467E521122K49354K65009K76348K81899K79780K68136K46123K13897J71960
$$ 5521122 5770476 6035485 6311833 6593732 6873512 7141648 7387771 7601668 7773628
59458G773628J21397O4558M625n5595j13882j67876k15001k53365k82262l01829
$$ 7773628 7895025 7959583 7964208 7908613 7794731 7626855 7411854 7158489 6876227 6574398
59448F574398l12642l15755l12456l03880k91083k75347k57862k39214k19701
$$ 6574398 6261756 5946001 5633545 5329665 5038582 4763235 4505373 4266159 4046458
59439D046458k00145j81772j65138j49715j34799j20407j07003r4727q3317p2672
$$ 4046458 3846313 3664541 3499403 3349688 3214889 3094482 2987479 2892752 2809435 2736763
59429B736763o3074n4720m7240l9890l2312k4923j8366j2711p426k181K770P064
$$ 2736763 2673689 2618969 2571729 2531839 2499527 2474604 2456238 2443527 2436101 2433920 2436690 2443754
59417B443754J0781J4290J7772K1189K4655K8548L3133L7843M0837L9731L3539
$$ 2443754 2454535 2468825 2486597 2507786 2532441 2560989 2594122 2631965 2672802 2712533 2746072
59406B746072K4240J5953J2153J3669J9112K6683L5401M5201N6216O7786P7971
$$ 2746072 2770312 2786265 2798418 2812087 2831199 2857882 2893283 2938484 2994700 3062486 3140457
59395C140457Q4567Q7007Q7121Q7961R2067J00756J14194J31653J52051J74736
$$ 3140457 3225024 3312031 3399152 3487113 3579180 3679936 3794130 3925783 4077834 4252570
59385D252570J99733K27250K57403K90478L26923L66765M09481M54546N01345
$$ 4252570 4452303 4679553 4936956 5227434 5554357 5921122 6330603 6785149 7286494
59376G286494N48094N91252O26475O49983O59139O52667O30958N95841N49867
$$ 7286494 7834588 8425840 9052315 9702298 10361437 11014104 11645062 12240903 12790770
59367A2790770M96212M39124L83121L31052K83571K40826K03415J70861J40377
$$ 12790770 13286982 13726106 14109227 14440279 14723850 14964676 15168091 15338952 15479329
59358A5479329J08528P3560L5048q015n7111j12269j71295k30841k87318l37090
$$ 15479329 15587857 15661417 15696465 15688450 15631339 15519070 15347775 15116934 14829616 14492526
59348A4492526l77360m07371m28257m41756m49791m54813m59176m63716m67695
$$ 14492526 14115166 13707795 13279538 12837782 12387991 11933178 11474002 11010286 10542591
59339A0542591m70166m70565m67962m60896m48584m31563m10863l87139l60925
$$ 10542591 10072425 9601860 9133898 8673002 8224418 7792855 7381992 6994853 6633928
59330F633928l33025l04243k75182k46589k19400j94106j70478j48180j27223
$$ 6633928 6300903 5996660 5721478 5474889 5255489 5061383 4890905 4742725 4615502
59321D615502j07658q9237p1747n5292m0002k5690j1997J255J3924K5612L5905
$$ 4615502 4507844 4418607 4346860 4291568 4251566 4225876 4213879 4215134 4229058 4254670 4290575
59310D290575M4781N2667N9721O5243O8135O7925O4954N9728N2499M3395L2499
$$ 4290575 4335356 4388023 4447744 4512987 4581122 4649047 4714001 4773729 4826228 4869623 4902122
59299D902122J9929O308o969j8568k8227l6439m3234m7900m9808m8816m4929l8262
$$ 4902122 4922051 4928359 4921390 4902822 4874595 4838156 4794922 4747022 4697214 4648398 4603469 4565207
59287D565207k9472j9453q373M357J8981L4813N1001O7307Q3888J00780J17788
$$ 4565207 4535735 4516282 4507909 4512266 4531247 4566060 4617061 4684368 4768256 4869036 4986824
59276D986824J34399J49567J62054J71185J76910J79052J76997J70251J58588
$$ 4986824 5121223 5270790 5432844 5604029 5780939 5959991 6136988 6307239 6465827
59267F465827J41319J17159Q5558M8183Q860k7929n8637q1567r6838j05523j08720
$$ 6465827 6607146 6724305 6809863 6858046 6866906 6838977 6780340 6698773 6601935 6496412 6387692
59256F387692j07477j03273r7904r2741q8421q5248q3377q2591q2511q3226q5135
$$ 6387692 6280215 6176942 6079038 5986297 5897876 5812628 5729251 5646660 5564149 5480923 5395788
59245E395788q7949r0437r1422r0558q7876q3191p6419o7972n8232m6889l3261
$$ 5395788 5307839 5217402 5125980 5035422 4947546 4864355 4787936 4719964 4661732 4614843 4581582
59234D581582j7096J321K1702M4042O8448R5083J24261J56344J91420K29055K68375
$$ 4581582 4564486 4565807 4587509 4631551 4699999 4795082 4919343 5075687 5267107 5496162 5764537
59223E764537L08472L48603L87605M22839M50111M65293M65901M50573M17612
$$ 5764537 6073009 6421612 6809217 7232056 7682167 8147460 8613361 9063934 9481546
59214I481546L65340K94295K08013J11092P312r9624k04403l00489l82350m46747
$$ 9481546 9846886 10141181 10349194 10460286 10467598 10367974 10163571 9863082 9480732 9033985
59204I033985m92249n18600n26910n19778n00561m72558m38802m02067l64546
$$ 9033985 8541736 8023136 7496226 6976448 6475887 6003329 5564527 5162460 4797914
59195D797914l27578k91962k58489k27927k00567j76139j54313j35091j18453
$$ 4797914 4470336 4178374 3919885 3691958 3491391 3315252 3160939 3025848 2907395
59186B907395j03927r0867p9092o8810n9935n1951m4519l7746l1635k5848k0231
$$ 2907395 2803468 2712601 2633509 2564699 2504764 2452813 2408294 2370548 2338913 2313065 2292834
59175B292834j5064j0432n932j413K650O118R779J4246J8896K2951K6967L2051
$$ 2292834 2277770 2267338 2261406 2259993 2262643 2268761 2278540 2292786 2311682 2334633 2361600 2393651
59163B393651L7898M3057M7110N1163N6023O1207O6157P1067P5993Q0272Q3588
$$ 2393651 2431549 2474606 2521716 2572879 2628902 2690109 2756266 2827333 2903326 2983598 3067186
59152C067186Q6475Q8954Q9813Q8180Q4877Q0947P5599O7076N5210M1820K8476
$$ 3067186 3153661 3242615 3332428 3420608 3505485 3586432 3662031 3729107 3784317 3826137 3854613
59141C854613J5094J042j3234k6262l6757m4456m9990n4110n6895n7700n5937
$$ 3854613 3869707 3870749 3857515 3831253 3794496 3750040 3700050 3645940 3589045 3531345 3475408
59130C475408n1771m5838l8652l0564k1972j2987l082Q288K0711L3013M4526N5663
$$ 3475408 3423637 3377799 3339147 3308583 3286611 3273624 3270542 3278830 3299541 3332554 3377080 3432743
59118C432743O7099P8876R0638J02341J14245J26378J38579J51111J64767J79998
$$ 3432743 3499842 3578718 3669356 3771697 3885942 4012320 4150899 4302010 4466777 4646775
59108D646775J96198K12276K27740K42704K56739K68340K75780K77853K73275
$$ 4646775 4842973 5055249 5282989 5525693 5782432 6050772 6326552 6604405 6877680
59099F877680K59956K35823K00387J54944J01488M2206k0014q1580j39262j90840
$$ 6877680 7137636 7373459 7573846 7728790 7830278 7872484 7852470 7770890 7631628 7440788
59089G440788k34768k69825k95475l12066l20406l21522l16826l07830k95504
$$ 7440788 7206020 6936195 6640720 6328654 6008248 5686726 5369900 5062070 4766566
59080D766566k80405k63590k46562k30015k13475j96687j80568j66175j53290
$$ 4766566 4486161 4222571 3976009 3745994 3532519 3335832 3155264 2989089 2835799
59071B835799j40879j28544j16822j06293r7109q9200q2303p5939o9824o4214
$$ 2835799 2694920 2566376 2449554 2343261 2246152 2156952 2074649 1998710 1928886 1864672
59061A864672n9432n5194n0893m6420m2204l8550l5309l2268k9478k7222k5716
$$ 1864672 1805240 1750046 1699153 1652733 1610529 1571979 1536670 1504402 1474924 1447702 1421986
59050A421986k4741k3518k1389j8802j7187j7350j8456j9039j8580j7519j6063
$$ 1421986 1397245 1373727 1352338 1333536 1316349 1298999 1280543 1261504 1242924 1225405 1209342
59039A209342j3913j1083q232o000m518l649l157k541j258O66K657M433O389Q834
$$ 1209342 1195429 1184346 1176114 1170114 1165596 1161947 1158790 1156249 1154991 1155657 1158314 1162747 1169136 1177970
59025A177970J1253J2726J2916J2329J1624J1019J0330R321P870O017M067K524
$$ 1177970 1189223 1201949 1214865 1227194 1238818 1249837 1260167 1269488 1277358 1283375 1287442 1289966
59013A289966J679J349J175J176J711K839M069M952N655O598P756Q668Q958Q563
$$ 1289966 1291645 1292994 1294169 1295345 1297056 1299895 1303964 1308916 1314571 1321169 1328925 1337593 1346551 1355114
58999A355114P525N919L948J871r9j686k564k770k767k771k330j053O49K104L325
$$ 1355114 1362639 1368558 1372506 1374377 1374278 1372592 1370028 1367258 1364491 1361720 1359390 1358337 1358986 1361090 1364415
58984A364415M746O322P722R088J0689J1989J2151J1549J1574J2792J4301J5278
$$ 1364415 1369161 1375483 1383205 1392293 1402982 1414971 1427122 1438671 1450245 1463037 1477338 1492616
58972A492616J6128J7573J9462K1145K2386K3380K4357K5580K7127K8483K8976
$$ 1492616 1508744 1526317 1545779 1566924 1589310 1612690 1637047 1662627 1689754 1718237 1747213
58961A747213K8834K8967K9502K9552K8843K8505K9536L1444L3181L4628L6307
$$ 1747213 1776047 1805014 1834516 1864068 1892911 1921416 1950952 1982396 2015577 2050205 2086512
58950B086512L8371M0736M3610M7066N0623N3987N7681O2201O7164P1988P6840
$$ 2086512 2124883 2165619 2209229 2256295 2306918 2360905 2418586 2480787 2547951 2619939 2696779
58939B696779Q2092Q7546R3068R9326J06908J15194J23190J31107J40113J50835
$$ 2696779 2778871 2866417 2959485 3058811 3165719 3280913 3404103 3535210 3675323 3826158
58929C826158J63055J76517J91116K06621K23158K41707K63165K87108L12445
$$ 3826158 3989213 4165730 4356846 4563467 4786625 5028332 5291497 5578605 5891050
58920E891050L39027L67743L99254M33590M70699N10409N51924N94339O37370
$$ 5891050 6230077 6597820 6997074 7430664 7901363 8411772 8963696 9558035 10195405
58911A0195405O80530P21732P57591P84923Q00766Q01238P81788P38982O71154
$$ 10195405 10875935 11597667 12355258 13140181 13940947 14742185 15523973 16262955 16934109
58902A6934109N77622M58997L18916J64451L979j54897l05474m41535n57886o51096
$$ 16934109 17511731 17970728 18289644 18454095 18458074 18303177 17997703 17556168 16998282 16347186
58892A6347186p19507p63194p84278p86455p73531p48551p14252o73550o29158
$$ 16347186 15627679 14864485 14080207 13293752 12520221 11771670 11057418 10383868 9754710
58883I754710n83136n37096m92455m50239m11054l75314l43208l14481k88780
$$ 9754710 9171574 8634478 8142023 7691784 7280730 6905416 6562208 6247727 5958947
58874E958947k66076k46248k28465k11792j96279j82455j69859j57210j44222
$$ 5958947 5692871 5446623 5218158 5006366 4810087 4627632 4457773 4300563 4156341
58865D156341j32103j21724j12433j03315r4593q6904p9924p2740o5239n8183
$$ 4156341 4024238 3902514 3790081 3686766 3592173 3505269 3425345 3352605 3287366 3229183
58855C229183n2030m6437m0899l5329k9908k4761j9758j4493q541j927M824J1223
$$ 3229183 3177153 3130716 3089817 3054488 3024580 2999819 2980061 2965568 2957027 2955100 2959924 2971147
58843B971147J7264K3215K9286L5589M2187M8941N5621O2245O9130P6474Q4179
$$ 2971147 2988411 3011626 3040912 3076501 3118688 3167629 3223250 3285495 3354625 3431099 3515278
58832C515278R2116J00231J08351J16374J24797J34569J46105J58879J72338J86779
$$ 3515278 3607394 3707625 3815976 3932350 4057147 4191716 4337821 4496700 4669038 4855817
58822D855817K02878K20717K39889K60434K83082L08478L36705L67754M02001
$$ 4855817 5058695 5279412 5519301 5779735 6062817 6371295 6708000 7075754 7477755
58813G477755M39770M80581N23271N66839O10747O54220O95508P31988P60512
$$ 7477755 7917525 8398106 8921377 9488216 10098963 10753183 11448691 12180679 12941191
58804A2941191P77202P77322P56201P10621O39242N42176M21148K80223J25689
$$ 12941191 13718393 14495715 15251916 15962537 16601779 17143955 17565103 17845326 17971015
58795A7971015l5067j94281l43880m76422n86926o73500p36073p75356p93269
$$ 17971015 17935948 17741667 17397787 16921365 16334439 15660939 14924866 14149510 13356241
58786A3356241p93086p78200p51342p15494o74381o31006n86512n41592m98081
$$ 13356241 12563155 11784955 11033613 10318119 9643738 9012732 8426220 7884628 7386547
58777G386547m57834m20714l85398l51869l21661k95690k73228k53148k34890
$$ 7386547 6928713 6507999 6122601 5770732 5449071 5153381 4880153 4627005 4392115
58768D392115k18036k02077j87026j73346j61043j49523j38418j27878j18015
$$ 4392115 4174079 3972002 3784976 3611630 3450587 3301064 3162646 3034768 2916753
58759B916753j08872j00716r3555q6579p9071p1660o5548o0670n5856n0696m5928
$$ 2916753 2807881 2707165 2613610 2527031 2447960 2376300 2310752 2250082 2194226 2143530 2097602
58748B097602m1924l8186l4553l1499k8905k5871k2229j8967j6652j4690j2679
$$ 2097602 2055678 2017492 1982939 1951440 1922535 1896664 1874435 1855468 1838816 1824126 1811447
58737A811447j1263j0864j0764j0270r878j0353j1534j2810j4066j5347j6326
$$ 1811447 1800184 1789320 1778556 1768286 1758408 1748055 1736521 1723711 1709645 1694298 1677972
58726A677972j6891j7726j9463k1756k3798k5305k6533k7723k9095l0838l2715
$$ 1677972 1661081 1643355 1623892 1602136 1578338 1553033 1526500 1498777 1469682 1438844 1406129
58715A406129l4047l4442l4068l3092l1530k9794k8456k7239k5226k2501k0522
$$ 1406129 1372082 1337640 1303572 1270480 1238950 1209156 1180700 1153461 1128235 1105734 1085212
58704A085212k0149k0359j9704j8194j6797j5899j5214j4702j4466j4144j3234
$$ 1085212 1065063 1044704 1025000 1006806 990009 974110 958896 944194 929728 915584 902350
58693I02350j1932j0871j0255r774r138q183o711m707k484k88J860L678M471L865
$$ 902350 890418 879547 869292 859518 850380 842197 835486 830779 828295 828007 829867 833545 838016 841881
58679H41881K251J49k269m660o214o437n690m470k758p23O24L92r23j864j607
$$ 841881 844132 844281 842012 837352 831138 824701 819011 814541 811783 811060 811684 812076 811153 809289 807682
58664H07682n34N87J364J741J696J136m2j750l594n056n749n372l815j650k9O81
$$ 807682 807148 807735 809099 810840 812536 813672 813630 811880 808286 803230 797481 792109 788294 786644 786615 787296
58648G87296J667M117P264R260R845J0597J2368J4155J5008J5523J6578J7916
$$ 787296 788963 793080 800344 809604 819449 830046 842414 856569 871577 887100 903678 921594
58636I21594J9017K0237K2076K4176K6034K7916L0232L2793L5459L8779M3134
$$ 921594 940611 960848 982924 1007100 1033134 1061050 1091282 1124075 1159534 1198313 1241447
58625A241447M8091N3378N9642O7353P5866Q4450R3524J03866J15453J27993J41801
$$ 1241447 1289538 1342916 1402558 1469911 1545777 1630227 1723751 1827617 1943070 2071063 2212864
58614B212864J57105J73205J89307K05395K21171K34877K44286K48110K45282
$$ 2212864 2369969 2543174 2732481 2937876 3159047 3393924 3638210 3886320 4131602
58605D131602K33612K10712J76076J31235P8489K0865l7198r0798j36651j73604
$$ 4131602 4365214 4575926 4752002 4883237 4961726 4982591 4945393 4854595 4717944 4544340
58595D544340k01427k20077k29933k31810k26787k16556k03428j89090j73821
$$ 4544340 4342913 4122836 3892903 3661093 3434306 3217750 3014322 2825232 2651411
58586B651411j57569j41213j25813j11393r7557q4718p3445o3251n3391m4459
$$ 2651411 2493842 2352629 2226816 2115423 2017866 1933148 1859703 1796452 1743061 1698602
58576A698602l7730l3229k9816k7014k5217k4287k3342k2074k1025k0423j9920
$$ 1698602 1660872 1627643 1597827 1570813 1545596 1521309 1497967 1475893 1454868 1434445 1414525
58565A414525j9613k0054k1097k1894k2237k2802k3863k4830k5368k5881k6498
$$ 1414525 1394912 1374858 1353761 1331867 1309630 1286828 1262965 1238135 1212767 1186886 1160388
58554A160388k6546k5574k4074k2615k0966j8623j5863j3685j2832j3084j3526
$$ 1160388 1133842 1108268 1084194 1061579 1040613 1021990 1006127 992442 979610 966526 953000
58543I53000j3496j3272j3538j4192j4299j3499j2683j2678j2966j2507j1248
$$ 953000 939504 926232 912694 898502 884203 870704 858021 845343 832377 819870 808622
58532H08622r953q962q066p287o932p047p493q220q918q864p906p022p110p784
$$ 808622 798669 789707 781641 774354 767422 760375 752882 744662 735744 726880 718974 711952 704842 697058
58518F97058q178q212q114p433n834m244l835m276m240l318k146j003K57J232
$$ 697058 688880 680668 672554 665121 659287 655043 651208 646932 642692 639374 637228 636225 636482 637714
58504F37714J319R49J089J690J975K036K676L752M314M379M989O353P486Q004
$$ 637714 639033 639982 641071 642761 644736 646772 649448 653200 657514 661893 666882 673235 680721 688725
58490F88725Q678R799J0410R844Q722P744O624M850K651N24j417l206m831o565
$$ 688725 697403 707202 717612 727456 736178 743922 750546 755396 758047 758571 757154 753948 749117 742552
58476G42552q657j0461j0784r507q008p559q067q621q592p787o347m883m211m522
$$ 742552 733895 723434 712650 703143 695135 687576 679509 670888 662296 654509 648162 643279 639068 634546
58462F34546n189n482n087l990k441r56R5Q05J289J295Q37O28J071J357N92o31
$$ 634546 629357 623875 618788 614798 612357 611401 611496 612301 613590 614885 615722 616350 617421 618778 619370 618739
58446F18739r69k71M34O21O69P18M97L49J156L041N083O428O842O347N307M691
$$ 618739 617770 617499 617933 618554 619223 619941 620438 620787 621943 624984 630067 636495 643337 649684 654991 659682
58430F59682N147N946N852M836L817L063K142J220R62J239J271R81R04Q74K48
$$ 659682 664829 670775 676627 681463 685280 688343 690485 691705 692667 693906 695177 696158 697062 697936 698184
58415F98184o81r05l31J61K62M08N45K62J62J443L928O019O785O735O459N959
$$ 698184 697503 696598 696267 696428 696690 697098 697643 697905 698067 699510 703438 709457 716242 722977 729436 735395
58399G35395N480N442N450M677L333K358J846J287J121K199L792M170L200K489
$$ 735395 740875 746317 751767 756444 759777 762135 763981 765268 766389 768588 772380 776550 779750 782239
58385G82239K779L253L552M241N052M892M099M341N681O175N176M614N791P185
$$ 782239 785018 788271 791823 796064 801116 806008 810107 814448 820129 826304 831480 836094 841885 849070
58371H49070P034O091O120P163P973Q115Q177Q660R599J0617J0794R473P504O529
$$ 849070 856104 862195 868315 875478 883451 891566 899743 908403 918002 928619 939413 948886 956390 962919
58357I62919O760O896O414O194O581O696O255O213O831P009O325N897O417P036
$$ 962919 969679 976575 982989 989183 995764 1002460 1008715 1014928 1021759 1028768 1035093 1040990 1047407 1054443
58343A054443P028O849O699N891M493L878M692N931O823P784Q840R113Q806R664
$$ 1054443 1061471 1068320 1075019 1080910 1085403 1089281 1093973 1099904 1106727 1114511 1123351 1132464 1141270 1150934
58329A150934J2328J5169J6740J7524J8150J7969J6690J5603J5794J6632J7125
$$ 1150934 1163262 1178431 1195171 1212695 1230845 1248814 1265504 1281107 1296901 1313533 1330658
58318A330658J7199J6843J5781J4769J5285J7098J8162J7750J7406J8001J8268
$$ 1330658 1347857 1364700 1380481 1395250 1410535 1427633 1445795 1463545 1480951 1498952 1517220
58307A517220J7438J6711J6845J6737J5840J5542J6690J8112J9006K0307K2242
$$ 1517220 1534658 1551369 1568214 1584951 1600791 1616333 1633023 1651135 1670141 1690448 1712690
58296A712690K3198K2644K2550K4078K5562K5579K5423K6433K7521K7567K7745
$$ 1712690 1735888 1758532 1781082 1805160 1830722 1856301 1881724 1908157 1935678 1963245 1990990
58285A990990K9294L1237L2507L3972L6382L8632M0113M2163M5236M7386M7734
$$ 1990990 2020284 2051521 2084028 2118000 2154382 2193014 2233127 2275290 2320526 2367912 2415646
58274B415646M8483N1180N3919N4820N5296N7061N8807N8794N7962N7650N7040
$$ 2415646 2464129 2515309 2569228 2624048 2679344 2736405 2795212 2854006 2911968 2969618 3026658
58263C026658N5824N6359N9981O4035O5912O7034O9535P2060P2755P3474P7017
$$ 3026658 3082482 3138841 3198822 3262857 3328769 3395803 3465338 3537398 3610153 3683627 3760644
58252C760644Q2592Q7947R3511J00565J07794J13427J18514J24443J29863J33614
$$ 3760644 3843236 3931183 4024694 4125259 4233053 4346480 4464994 4589437 4719300 4852914
58242D852914J37772J44022J50177J54387J59366J68072J78554J87721J96909
$$ 4852914 4990686 5134708 5284885 5439272 5598638 5766710 5945264 6132985 6329894
58233F329894K08759K22051K34709K48559K65716K83622K99268L15041L34746
$$ 6329894 6538653 6760704 6995413 7243972 7509688 7793310 8092578 8407619 8742365
58224H742365L57240L79757M03894M32230M62902M93832N28370N70110O16569
$$ 8742365 9099605 9479362 9883256 10315486 10778388 11272220 11800590 12370700 12987269
58215A2987269O65006P19807P86325Q62438R44627J037249J146584J271136J408268
$$ 12987269 13652275 14372082 15158407 16020845 16965472 18002721 19149305 20420441 21828709
58206B1828709J565296J753199J974890K232151K539040K915611L374243L927601
$$ 21828709 23394005 25147204 27122094 29354245 31893285 34808896 38183139 42110740
58198D2110740M605518N447853O485245P746422R285448J1189314J3568515J6568184
$$ 42110740 46716258 52164111 58649356 66395778 75681226 86870540 100439055 117007239
58190A17007239K0388789K5239625L1148112L7611340M3224771M5660572M2420079
$$ 117007239 137396028 162635653 193783765 231395105 274619876 320280448 362700527
58183C62700527L2269571J6424324j643906j7879308k9562650l6079059l8309711
$$ 362700527 394970098 411394422 409750516 391871208 362308558 326229499 287919788
58176B87919788l7570473l4988041l1402226k7424788k3462190j9753888j6440814
$$ 287919788 250349315 215361274 183959048 156534260 133072070 113318182 96877368
58169I6877368j3594786j1210950r230863p593554o251341n149335m225143l434181
$$ 96877368 83282582 72071632 62840769 55247215 48995874 43846539 39621396 36187215
58161C6187215k752928k155670j608587j087041n76272m9162N41527J246302K099756
$$ 36187215 33434287 31278617 29670030 28582989 28006717 27957555 28499082 29745384 31845140
58152C1845140L086640M063466M695950M551676L373874J331883j007636l001665
$$ 31845140 34931780 38995246 43691196 48242872 51616746 52948629 51940993 48939328
58144D8939328m275707m822904m849142m570347m128406l612790l089775k601278
$$ 48939328 44663621 39840717 34991575 30421228 26292822 22680032 19590257 16988979
58136A6988979k163844j784015j467862j213951j009660q41866p05010n95304
$$ 16988979 14825135 13041120 11573258 10359307 9349647 8507781 7802771 7207467
58128G207467n05284m29593l69581l26355k94456k67580k45718k31032k20840
$$ 7207467 6702183 6272590 5903009 5576654 5282198 5014618 4768900 4537868 4317028
58119D317028k10156j97935j85658j72616j57476j42030j28754j16695j03823
$$ 4317028 4106872 3908937 3723279 3550663 3393187 3251157 3122403 3005708 2901885
58110B901885r1429q2391p7138p4834p6061q0633q4990q5666q3419q0569p6617
$$ 2901885 2810456 2728065 2650927 2576093 2500032 2419399 2334409 2248743 2165324 2084755 2008138
58099B008138p0197o3053n7941n4278m9748m4615m0783l8132l5405l3253l2760
$$ 2008138 1937941 1874888 1816947 1762669 1712921 1668306 1627523 1589391 1553986 1520733 1487973
58088A487973l2451l0377k7749k6946k7237k6235k4324k3812k4668k4853k4230
$$ 1487973 1455522 1425145 1397396 1370450 1343213 1316978 1292654 1268842 1244174 1219321 1195091
58077A195091k4475k5544k5705k4708k3791k2924k1075j8814j7634j7107j5617
$$ 1195091 1170616 1145072 1119367 1094659 1070868 1047944 1026869 1008055 990421 973314 957697
58066I57697j3425j2167j1729j0604q925q219q396p902o727o460p439q456r190
$$ 957697 944272 932105 920376 909772 900847 892628 884232 876330 869603 863143 855704 847248 838058
58053H38058j0349j1542j1583j0805j0585j0688r645p621o369o272n940m857m019
$$ 838058 827709 816167 804584 793779 783194 772506 762861 755240 748871 742599 736659 731802 727783
58040G27783l754l223k273j704j490p94J73K88m60r58r65j182j506j213p63j308
$$ 727783 724029 720806 718533 716829 715339 714545 714718 715006 714546 713588 712623 711441 709935 708722 707959 706651
58024G06651k496k808k009j308j065m54O33J328J406J266O14q71j950j154M97
$$ 706651 704155 701347 699338 698030 696965 696511 697144 698472 699878 701144 701758 700887 698937 697783 698280
58009F98280N75j153k703l328m283n929o907o711o546o806o274m676l643m153
$$ 698280 698855 697702 694999 691671 687388 681459 674552 667841 661295 654489 648215 643539 639896 635743
57995F35743n114n500n800o284n926m315k839k699l183l113k493j689m46J132
$$ 635743 630629 625129 619329 613045 607119 602804 599965 597266 594083 590970 588477 586788 586342 587474
57981E87474J987J564Q02O96R75J078J302K043K943L642M377N071M888L511J959
$$ 587474 589461 591025 591827 592523 593498 594576 595878 597921 600864 604506 608883 613954 618842 622353 624312
57966F24312J319J543K054K634K999K502J068l33r07j111j871l340m932o063o446
$$ 624312 625631 627174 629228 631862 634861 637363 638431 638098 637191 636080 634209 630869 625937 619874 613428
57951F13428o142n546m922l959k426q97MQ19K548M890O512P001P168P376P045
$$ 613428 607286 601740 596818 592859 590433 589536 589540 590359 592907 597797 604309 611310 618478 625854 632899
57936F32899O043N098M427L329J485o00k815n669q917j1397j2701j3670j4661
$$ 632899 638942 644040 648467 651796 653281 652681 649866 644197 635280 623883 611182 597512 582851
57923E82851j4900j4088j3151j2522j1187q465n441l486k448j452m97o2J88J070
$$ 582851 567951 553863 540712 528190 517003 508538 503097 499611 497163 495711 495214 495152 495340 496410
57909D96410K718M592O301P719Q722R328R712R791R282Q403P769P434O835N916
$$ 496410 499128 503720 510021 517740 526462 535790 545502 555293 564575 572978 580747 588181 595016 600932
57895F00932N330N228M889L946K930K189J335K27o24j142k048l533m697n001n128
$$ 600932 606262 611490 616379 620325 623255 625444 626779 627006 626382 625240 623192 619659 614962 609961 604833
57880F04833n703o238o189n957n911n487m274l062k665k542j667j30J272K440
$$ 604833 599130 592892 586703 580746 574835 569348 565074 562012 559347 556805 555138 555008 556280 558720
57866E58720L845N368O387O812P125P495P576P170O511N975N776N738N255L897
$$ 558720 562565 567933 574320 581132 588257 595752 603328 610498 617009 622984 628760 634498 639753 643650
57852F43650K105P70k9r88k192k777k366j768j705j772j383q30o25n92l56j36
$$ 643650 645755 646525 646496 645508 643316 640539 638173 636405 634700 632928 631545 630715 630090 629498 629142 629006
57836F29006k82o61j117j817k586k615j595m21j43q04j889l172m491n433n954
$$ 629006 628724 628063 626946 625129 622543 619928 618333 617912 617769 616965 615076 611904 607413 601980 596026
57821E96026o604p565q220q263q262q524q382p426o354n702m866l437k411k646
$$ 596026 589422 581857 573637 565374 557112 548588 540206 532780 526426 520724 515858 512421 510010 507364
57807E07364l095k182j68J376K005K592L384L582K993K704L705N839Q316J0490
$$ 507364 504269 502087 501919 503295 505300 507892 511276 514858 517851 520555 524260 530099 538415 548905
57793E48905J1968J2672J2811J2364J0847Q224N578M070L605L468L752M937O396
$$ 548905 560873 573545 586356 598720 609567 617791 623369 627439 631044 634512 638264 643201 649597
57780F49597O671N358L528K122R67l40j627k636l548m579n574o306o745o848o524
$$ 649597 656268 661626 665154 667276 668243 667903 666276 663640 660092 655513 649939 643633 636888 630040 623516
57765F23516n913n298m635l550j899k6J462K064J743J217J527K895M359M982N031
$$ 623516 617603 612305 607670 604120 602221 602195 603657 605721 607464 608681 610208 613103 617462 622444 627475
57750F27475N428O411P452Q155Q550Q670Q527Q312Q098P512O359N221M758M744
$$ 627475 632903 639314 646766 654921 663471 672141 680668 688980 697078 704590 710949 716170 720928 725672
57736G25672M497L982L702L697L582L435L754M504N065N274N746O929Q424R520
$$ 725672 730169 734151 737853 741550 745132 748567 752321 756825 761890 767164 772910 779839 788263 797783
57722G97783R999J0254J0888J2162J3659J4649J4996J5342J6047J6557J6394J6192
$$ 797783 807782 818036 828924 841086 854745 869394 884390 899732 915779 932336 948730 964922
57710I64922J6895J8276J9259J9520J9833K0887K2573K4593K6927K9571L2375
$$ 964922 981817 1000093 1019352 1038872 1058705 1079592 1102165 1126758 1153685 1183256 1215631
57699A215631L5294L8342M1353M4240M7313N0899N4920N9408O5082P2670Q1894
$$ 1215631 1250925 1289267 1330620 1374860 1422173 1473072 1527992 1587400 1652482 1725152 1807046
57688A807046R1941J02785J15177J29467J45290J62331J80503J99221K17244K33337
$$ 1807046 1898987 2001772 2116949 2246416 2391706 2554037 2734540 2933761 3151005 3384342
57678C384342K46349K54594K55823K48025K29941K01225J63248J19918P6845L9055
$$ 3384342 3630691 3885285 4141108 4389133 4619074 4820299 4983547 5103465 5180310 5219365
57668E219365R080j3863l4268n9315r4984j41212j90747k33277k61158k72224
$$ 5219365 5228445 5214582 5180314 5120999 5026015 4884803 4694056 4460779 4199621 3927397
57658C927397k68874k55445k35864k12735j87868j63026j39631j18226r8868q1932
$$ 3927397 3658523 3403078 3167214 2954479 2766611 2603585 2463954 2345728 2246860 2164928
57648B164928o7873n6345m6356l7303k9123k1636j4552q061k578K162O915J1884
$$ 2164928 2097055 2040710 1994354 1957051 1927928 1906292 1891740 1883679 1881101 1883263 1890178 1902062
57636A902062J6758K1711K7436L4025M0856M7777N5369O3772P2334Q0835R0112
$$ 1902062 1918820 1940531 1967967 2001992 2042848 2090625 2145994 2209766 2282100 2362935 2453047
57625B453047J00955J13250J26683J41360J57033J72371J85761J96274K03164
$$ 2453047 2554002 2667252 2793935 2935295 3092328 3264699 3450460 3646734 3849898
57616C849898K04775J98657J82762J56401J20480P7183K9288k0356o8653j12111
$$ 3849898 4054673 4253330 4436092 4592493 4712973 4790156 4819444 4799088 4730435 4618324
57606D618324j47760j74347j92129k01582k03270j98803j90703j80725j69164
$$ 4618324 4470564 4296217 4104088 3902506 3699236 3500433 3309730 3129005 2959841
57597B959841j56095j42337j28736j15469j02767r1442q2016p3969o6538n9637
$$ 2959841 2803746 2661409 2532673 2417204 2314437 2222995 2140979 2067010 2000472 1940835
57587A940835n3382m7383m1313l5649l1064k7489k4470k1974k0145j8577j6578
$$ 1940835 1887453 1840070 1798757 1763108 1732044 1704555 1680085 1658111 1637966 1619389 1602811
57576A602811j4001j1241q634o354m669l760l369l024k465j598l43J222K782M159
$$ 1602811 1588810 1577569 1568935 1562581 1557912 1554152 1550783 1547759 1545294 1543696 1543353 1544575 1547357 1551516
57562A551516N463O736P778Q540R256J0050J0815J1647J2796J4064J4944J5621
$$ 1551516 1556979 1563715 1571493 1580033 1589289 1599339 1610154 1621801 1634597 1648661 1663605 1679226
57550A679226J6978J9278K1619K3255K4549K6090K7742K9364L1550L4767L8424
$$ 1679226 1696204 1715482 1737101 1760356 1784905 1810995 1838737 1868101 1899651 1934418 1972842
57539A972842M1874M5608N0369N5613O0215O4424O9788P7181Q6075R5828J06392
$$ 1972842 2014716 2060324 2110693 2166306 2226521 2290945 2360733 2437914 2523989 2619817 2726209
57528B726209J17474J28188J38155J47994J58016J66837J71904J71055J63150
$$ 2726209 2843683 2971871 3110026 3258020 3416036 3582873 3754777 3925832 4088982
57519D088982J47660J24383R3716N7048J6844k3678o1197r3088j17865j35148
$$ 4088982 4236642 4361025 4454741 4511789 4528633 4504955 4443758 4350670 4232805 4097657
57509D097657j45328j49208j47738j42002j33326j23079j12249j01284r0445q0043
$$ 4097657 3952329 3803121 3655383 3513381 3380055 3256976 3144727 3043443 2952998 2872955
57499B872955p0318o1291n2881m4904l7001k9046k1684j5909j1846q435m651m94
$$ 2872955 2802637 2741346 2688465 2643561 2606560 2577514 2555830 2539921 2528075 2519640 2514989 2514495
57487B514495L515P237J0821J4202J7319K0447K3727K6865K9824L3395L8248M3823
$$ 2514495 2518010 2525247 2536068 2550270 2567589 2588036 2611763 2638628 2668452 2701847 2740095 2783918
57475B783918M9054N4006N9890O7403P5952Q4689R3605J03244J13844J25081J36396
$$ 2783918 2832972 2886978 2946868 3014271 3090223 3174912 3268517 3371761 3485605 3610686 3747082
57464C747082J47168J56709J64115J68066J66878J58906J42911J18196Q5032M5479
$$ 3747082 3894250 4050959 4215074 4383140 4550018 4708924 4851835 4970031 5055063 5100542
57454E100542L304l7554p4457j05812j30026j45734j53130j54182j51145j45187
$$ 5100542 5103846 5066292 4991835 4886023 4755997 4610263 4457133 4302951 4151806 4006619
57444D006619j36567j25565j13016j00146q8130p7578o8301n9727n1542m3858
$$ 4006619 3870052 3744487 3631471 3531325 3443195 3365617 3297316 3237589 3186047 3142189
57434C142189l6912l0864k5743k1310j7083j2841q991o075l987k042J95K458M255
$$ 3142189 3105277 3074413 3048670 3027360 3010277 2997436 2988445 2982370 2978383 2976341 2976536 2978994 2983249
57421B983249N501O638Q137R889J1148J1357J1006J1233J2431J3813J4531J4688
$$ 2983249 2988750 2995388 3003525 3013414 3024562 3035919 3046925 3058158 3070589 3084402 3098933 3113621
57409C113621J4888J5395J6279J7738J9544K0750K0778K0399K0759K1694K2097
$$ 3113621 3128509 3143904 3160183 3177921 3197465 3218215 3238993 3259392 3280151 3301845 3323942
57398C323942K1749K1694K2603K3821K4330K3988K3412K3249K3813K4904K5781
$$ 3323942 3345691 3367385 3389988 3413809 3438139 3462127 3485539 3508788 3532601 3557505 3583286
57387C583286K5823K5334K5193K5682K6227K6398K6416K6483K6311K5742K5214
$$ 3583286 3609109 3634443 3659636 3685318 3711545 3737943 3764359 3790842 3817153 3842895 3868109
57376C868109K5234K5782K6624K7713K8944K9877L0188L0058K9787K9313K8551
$$ 3868109 3893343 3919125 3945749 3973462 4002406 4032283 4062471 4092529 4122316 4151629 4180180
57365D180180K7960K8273K9612L1187L2048L1995L1667L1701L1959L1880L1554
$$ 4180180 4208140 4236413 4266025 4297212 4329260 4361255 4392922 4424623 4456582 4488462 4520016
57354D520016L1809L2958L4044L4050L3375L3219L3765L4042L3690L3634L4561
$$ 4520016 4551825 4584783 4618827 4652877 4686252 4719471 4753236 4787278 4820968 4854602 4889163
57343D889163L5724L6041L5709L5798L6662L7553L7822L7717L7877L8438L8944
$$ 4889163 4924887 4960928 4996637 5032435 5069097 5106650 5144472 5182189 5220066 5258504 5297448
57332E297448L8990L8722L8636L8879L9081L9007L9100L9935M1254M2219M2529
$$ 5297448 5336438 5375160 5413796 5452675 5491756 5530763 5569863 5609798 5651052 5693271 5735800
57321E735800M2764M3411M4235M4892M5531M6361M7115M7454M7615M8138M9088
$$ 5735800 5778564 5821975 5866210 5911102 5956633 6002994 6050109 6097563 6145178 6193316 6242404
57310F242404M9983N0423N0486N0615N1308N2760N4578N5973N6489N6456N6546
$$ 6242404 6292387 6342810 6393296 6443911 6495219 6547979 6602557 6658530 6715019 6771475 6828021
57299F828021N7053N7778N8456N9135O0135O1739O3807O5726O6966O7678O8465
$$ 6828021 6885074 6942852 7001308 7060443 7120578 7182317 7246124 7311850 7378816 7446494 7514959
57288G514959O9566P0603P1257P1770P2501P3368P4034P4343P4266P3555P1892
$$ 7514959 7584525 7655128 7726385 7798155 7870656 7944024 8018058 8092401 8166667 8240222 8312114
57277H312114O9302O6174O2757N8767N3544M6741L8894L1235K4702J9209J4157
$$ 8312114 8381416 8447590 8510347 8569114 8622658 8669399 8708293 8739528 8764230 8783439 8797596
57266H797596R484N804L678L162M098O208Q802J1106J3139J5759J9439K3485K6863
$$ 8797596 8807080 8812884 8816562 8819724 8823822 8830030 8838832 8849938 8863077 8878836 8898275 8921760 8948623
57253H948623K9396L1620L3865L5935L7533L8513L8783L8425L7786L7216L6721
$$ 8948623 8978019 9009639 9043504 9079439 9116972 9155485 9194268 9232693 9270479 9307695 9344416
57242I344416L6187L5781L5804L6268L6878L7303L7274L6607L5374L3949L2614
$$ 9344416 9380603 9416384 9452188 9488456 9525334 9562637 9599911 9636518 9671892 9705841 9738455
57231I738455L1281K9826K8378K6937K5025K2302J9414J7586J7312J7951J8836
$$ 9738455 9769736 9799562 9827940 9854877 9879902 9902204 9921618 9939204 9956516 9974467 9993303
57220I993303K0169K2435K5353K8009K9984L1747L3865L6228L8346M0100M1719
$$ 9993303 10013472 10035907 10061260 10089269 10119253 10151000 10184865 10221093 10259439 10299539 10341258
57209A0341258M3187M4108M4292M4025M3618M3006M2023M0707L9079L6925L4232
$$ 10341258 10384445 10428553 10472845 10516870 10560488 10603494 10645517 10686224 10725303 10762228 10796460
57198A0796460L1516K9245K7093K4349K0978J7729J5154J3022J0781Q095M894
$$ 10796460 10827976 10857221 10884314 10908663 10929641 10947370 10962524 10975546 10986327 10994422 10999316
57187A0999316J385j855m384o603r483j3283j7167k0373k3230k6456k9933l2895
$$ 10999316 11000701 10998846 10994462 10987859 10978376 10965093 10947926 10927553 10904323 10877867 10847934 10815039
57175A0815039l5153l7401m0168m3027m5107m6059m6191m5798m4774m3029m0950
$$ 10815039 10779886 10742485 10702317 10659290 10614183 10568124 10521933 10476135 10431361 10388332 10347382
57164A0347382l9198l8044l7244l6549l5896l5018l3433l1264k9605k9515l0944
$$ 10347382 10308184 10270140 10232896 10196347 10160451 10125433 10092000 10060736 10031131 10001616 9970672
57153I970672l3186l6087m0060m5151n0926n7304o4611p2677q0623q7804r4182
$$ 9970672 9937486 9901399 9861339 9816188 9765262 9707958 9643347 9570670 9490047 9402243 9308061
57142I308061r9507j02938j03815j02174r8130r1558q2935p3743o5356n8016n1770
$$ 9308061 9208554 9105616 9001801 8899627 8801497 8709939 8627004 8553261 8487905 8429889 8378119
57131H378119m7851m8160n3461o2866p4946q8450j01814j12895j19868j22049
$$ 8378119 8330268 8282108 8228647 8165781 8090835 8002385 7900571 7787676 7667808 7545759
57121G545759j19523j12397j01188q7903p6044o8686o6509o7855p0507p2966p4044
$$ 7545759 7426236 7313839 7212651 7124748 7048704 6980018 6913509 6845654 6775147 6702181 6628137
57110F628137p2236o6069n4785l8178j6141J1040M2350P6841J14978J58932K11952
$$ 6628137 6555901 6489832 6435047 6396869 6380728 6391768 6434118 6510959 6625937 6784869 6996821
57099F996821K77945L61188M65525N93825P48651R33027J149651J399379J680625
$$ 6996821 7274766 7635954 8101479 8695304 9443955 10376982 11526633 12926012 14606637
57090A4606637J989236K317594K653817K981859L280958L524357L682323L731830
$$ 14606637 16595873 18913467 21567284 24549143 27830101 31354458 35036781 38768611
57082C8768611L664991L486467L203943K825275K364475J842705J276575O66806
$$ 38768611 42433602 45920069 49124012 51949287 54313762 56156467 57433042 58099848
57074E8099848L935p11872j455575k178364k821535l333955l685912l873720l913257
$$ 58099848 58103783 57391911 55936336 53757972 50936437 47602482 43916570 40042850 36129593
57065C6129593l828700l645713l390634l090083k768238k444636k134188j847278
$$ 36129593 32300893 28655180 25264546 22174463 19406225 16961589 14827401 12980123
57057A2980123j589221j361213j162783r92829q48765p26648o23012n35692m62668
$$ 12980123 11390902 10029689 8866906 7874077 7025312 6298664 5675652 5139960 4677292
57048D677292m01467l50062l07136k71096k40024k13040j90503j72329j57117
$$ 4677292 4275825 3925763 3618627 3347531 3107507 2894467 2703964 2531635 2374518
57039B374518j43385j30651j18811j07624r7262q8384q1091p4685o8807o3775
$$ 2374518 2231133 2100482 1981671 1874047 1776785 1688401 1607310 1532625 1463818 1400043
57029A400043n9410n4752m9515m4675m0877l7384l3397k9348k6050k3469k1238
$$ 1400043 1340633 1285881 1236366 1191691 1150814 1113430 1080033 1050685 1024635 1001166 979928
57018I79928j9560j8570j7533j5754j3689j2221j1237r801p387m146l40L843Q352
$$ 979928 960368 941798 924265 908511 894822 882601 871364 861563 854176 850030 849690 853533 861885
57005H61885J3738K1060L0717M2087N5170P1978R5448J27539J68471K15345K58149
$$ 861885 875623 896683 927400 969487 1024657 1096635 1192083 1319622 1488093 1703438 1961587
56994A961587K77889K53925J78555O6258n2516j48595k08043k33232k34216k20171
$$ 1961587 2239476 2493401 2671956 2738214 2685698 2537103 2329060 2095828 1861612 1641441
56984A641441j96920j68806j40216j14984r5317q1687p3279o8293o4509o0267
$$ 1641441 1444521 1275715 1135499 1020515 925198 843511 770232 701939 637430 577163
56974E77163n4971m8643m1425l3776k6557k0354j4884r577m496k34L036N854Q772
$$ 577163 522192 473549 432124 398348 371791 351437 336553 326976 322480 322246 325282 331136 339908
56961C39908J1888J5241J9312K4560L0423L4970L5856L1702K2727J0514k467j3484
$$ 339908 351796 367037 386349 410909 441332 476302 512158 543860 566587 577101 574634 561150
56949E61150k0703k4220k5466k5322k3487k0008j6371j3991j2284r579n613j682
$$ 561150 540447 516227 490761 465439 441952 421944 405573 391582 379298 369719 364106 362424
56937C62424J618N260J0001J5210K0159K5257L0988L6285L8856L6672K8780J5621
$$ 362424 364042 369302 379303 394513 414672 439929 470917 507202 546058 582730 611510 627131
56925F27131n14j5910k7405l4117l6950l7002l4990l1620k7584k3253j8899j5101
$$ 627131 626617 610707 583302 549185 512235 475233 440243 408623 381039 357786 338887 323786
56913C23786j2359j0587r304q187p082n833m462l254k295j326k95L58M32M95J209
$$ 323786 311427 300840 291536 283349 276267 270434 265972 262718 260423 259097 258802 259160 259592 260087 261296
56898B61296K479L790M957O081P105P980R016J0550J2525J4788J7518K0915K4644
$$ 261296 263775 267565 272522 278603 285708 293688 302704 313254 325779 340567 358085 379000 403644
56885D03644K7924K9788K9030K4496J6103N441n066j3453j8707k0662j9981j7790
$$ 403644 431568 461356 490386 514882 530985 536426 531360 517907 499200 478538 458557 440767
56873D40767j4841j1291p438l942q93K594P261J2754J8500K4770L2154M0539M9523
$$ 440767 425926 414635 407197 403255 402362 404956 412217 424971 443471 468241 500395 540934 590457
56860E90457N9094O8616P5285P4761O3936M3037J5763j1982l4333m8161n4219
$$ 590457 649551 718167 793452 868213 932149 975186 990949 978967 944634 896473 842254
56849H42254n5221n2974m7824m0227l1438k2497j3502m232N199J4622K4227L4517
$$ 842254 787033 734059 686235 646008 614570 592073 578571 574339 579538 594160 618387 652904
56837F52904M6153N9898P6148R4251J11887J24576J25900J09997P5845K9551j8444
$$ 652904 699057 758955 835103 929354 1041241 1165817 1291717 1401714 1477559 1507110 1488666
56826A488666n8812q6649j01265j04834j01081r3455q3500p1383n7825m4539l2763
$$ 1488666 1429854 1343205 1241940 1137106 1036025 942570 859070 787687 729862 685323 652560
56815F52560k2313j2349k182Q784K0930L3932M7205O0867P4911Q6797R0969Q2118
$$ 652560 630247 617898 615716 624500 645430 679362 726567 787434 862345 949142 1040111 1122229
56803A122229N9141K6061j0150m2550o6506q0702q6444q5825q0579p2233o2405
$$ 1122229 1181370 1207431 1197281 1154731 1088225 1007523 921079 835254 754675 682442 620037
56792F20037n2288m2305l2609k3528j5313p877j079N311J2083K0297K9953L9385
$$ 620037 567749 525444 492835 469307 453994 446117 445038 450349 462432 482729 512682 552067
56780E52067M6267M8773M5522L5459J8911j386k1123l6623m6275n0382n0246m7361
$$ 552067 598334 647107 692629 728088 746999 745613 724490 687867 641592 591210 540964 493603
56768D93603m2905l7688l2454k7893k4200k1013j7970j5121j2563j0096p658n697
$$ 493603 450698 413010 380556 352663 328463 307450 289480 274359 261796 251700 244042 238345
56756B38345m669m304l911l233k606k275k051j738j469j422j449j291j041j071
$$ 238345 233676 229372 225461 222228 219622 217347 215296 213558 212089 210667 209218 207927 206886 205815
56742B05815j396j501r70j64R0n11j383j797j666j469j703k582l854m684m220
$$ 205815 204419 202918 201948 201784 201874 201363 199980 198183 196517 195048 193345 190763 186909 182225 178005
56727A78005k702j526j670k448k517j726j098j125j149n82J11J13o77j649k183
$$ 178005 175303 173777 172107 169659 167142 165416 164318 163193 162044 161462 161573 161686 161009 159360 157177
56712A57177k017j385r26j154j770j973j505q58l72K21J023J468J119M54K93P16
$$ 157177 155160 153775 152849 151695 149925 147952 146447 145589 145217 145438 146461 147929 149048 149502 149795 150511
56696A50511J097J044P46M98L33J34j87o32j049j143p82j79L53P01Q88Q57N66
$$ 150511 151608 152652 153398 153896 154229 154363 154176 153544 152495 151352 150570 150391 150744 151445 152333 153190 153756
56679A53756K79M63J314K528L561M032L877L242K360J534J049R88J166J360J482
$$ 153756 154035 154498 155812 158340 161901 165933 169810 173052 175412 176946 177995 178983 180149 181509 182991
56664A82991J433R75R8p09r32p92r58j462j641j283j105j643k396k672k570k434
$$ 182991 184424 185399 185497 184788 183856 183064 182106 180644 179003 177720 176615 174972 172576 169904 167334 164900
56648A64900j924o13R52J717J501R48L26o57j884k603k398j668r52m55k54l69
$$ 164900 162976 162363 163315 165032 166533 167481 167807 167150 165266 162663 160265 158597 157645 157190 156936 156567
56632A56567m86k60J14K11J81N34J240J753J931K126K361K265J876J688J802J880
$$ 156567 156081 155821 155935 156146 156327 156861 158101 159854 161785 163911 166272 168537 170413 172101 173903 175783
56616A75783J980K487L098K889J685M49p9j72k31j01K88M66K27J1M1j11n83o94
$$ 175783 177763 180250 183348 186237 187922 188371 188292 188120 187889 187788 188076 188542 188769 188780 188821 188710 188127 187433
56598A87433q3M99K80l51n72l91l67n07l88k0J80P6r8j31J29P89J503J484N18
$$ 187433 187350 187849 188129 187778 187206 186815 186448 185941 185553 185533 185713 185789 185691 185560 185689 186478 187981 189465 189983
56579A89983m88n54J50P36R07J068J383J529J400J400J921K880L821M310M245
$$ 189983 189495 188941 189091 189827 190734 191802 193185 194714 196114 197514 199435 202315 206136 210446 214691
56564B14691M004M107M664N353O020O862P793Q201P660O604N882N862O224O344
$$ 214691 218695 222802 227466 232819 238839 245701 253494 261695 269355 275959 281841 287703 293927 300271
56550C00271N760M564L481L140L158K530J009o00j690k629l828m928n457n701
$$ 300271 306031 310595 314076 317216 320374 322904 323913 323313 321623 318994 315166 310238 304781 299080
56536B99080o182o794p089o998o677o073n245m713m825n093m829m130l624l524
$$ 299080 292898 286104 279015 272017 265340 259267 254022 249309 244484 239391 234562 230432 226808 223284
56522B23284l499l301k927k327j476p01m70r02j619k062j843j097n60q13j428
$$ 223284 219785 216484 213557 211230 209754 209053 208583 207681 206062 204000 202157 201060 200500 199687 198259
56507A98259j373m39M28M67K3j78j9K71O41R61Q45K78j40p0M5j82m57m88n82r09
$$ 198259 196886 196447 196875 197342 197365 197187 197168 197439 198080 199041 199886 200164 200024 199954 199999 199817 199360 198872 198290 197381
56487A97381r55l72L01M87M46N72N93L28M88J690L250L950L575K780K028J553
$$ 197381 196426 196054 196355 196842 197288 197860 198453 198781 199269 200959 204209 208159 211734 214514 216542 218095
56471B18095J806K802L538L114K083J624J861K055K035K197K455K398K271K530
$$ 218095 219901 222703 226241 229355 231438 233062 234923 236978 239013 241210 243665 246063 248334 250864
56457B50864K699J922N12l18k84k12m39l23M01J071J210J073Q05R6r00j337q61
$$ 250864 253563 255485 255997 255679 255395 255183 254744 254421 254822 255893 257103 258176 258981 259077 258177 256840 255979
56440B55979j63O8j6j8lj28k32k24l67q20j305j503j415j170q66o76p61j052j401
$$ 255979 255816 255884 255868 255850 255847 255719 255487 255263 254896 254076 252771 251268 249853 248683 247817 247141 246380 245328 243927
56421B43927j832k228k115j378q12j227k215k730k637k706l174l394l010k346
$$ 243927 242095 239867 237752 236374 235562 234335 232120 229390 226753 224047 220873 217479 214469 212123
56407B12123j469N1K070L530L693L026K381K029J821J692J572J280Q46N25L66
$$ 212123 210654 210705 212775 216305 219998 223024 225405 227434 229255 230947 232519 233799 234645 235170 235536
56392B35536K08J51L92O03J98o31r76l66P74K019L376M618N111M718M123L747
$$ 235536 235744 235895 236287 236890 237088 236457 235481 235115 235889 237908 241284 245902 251013 255731 259854 263601
56376B63601L191K206J400J312J484J253R59J470K734L714L747L230K796K431
$$ 263601 266792 268998 270398 271710 273194 274447 275406 276876 279610 283324 287071 290301 293097 295528
56362B95528J798J048P53J117J634J837J943K377K893K807K105J554J538J543
$$ 295528 297326 298374 299127 300244 301878 303715 305658 308035 310928 313735 315840 317394 318932 320475
56348C20475J171Q98J203J680J744J631J849K141J978J633J770K296K573K567
$$ 320475 321646 322544 323747 325427 327171 328802 330651 332792 334770 336403 338173 340469 343042 345609
56334C45609K755L099L118K869K869L138L337L777N158P197Q600Q589P632O568
$$ 345609 348364 351463 354581 357450 360319 363457 366794 370571 375729 382926 391526 400115 407747 414315
56320D14315N949O231P572R178R821R289Q520Q167P960P562P074O342M823K564
$$ 414315 420264 426495 434067 443245 453066 462355 470875 479042 487002 494564 501638 507980 512803 515367
56306E15367M62q41j584k171k562k710k863l044k980k742k760l028k996k488j890
$$ 515367 515829 514988 513404 511233 508671 505961 503098 500054 497074 494332 491572 488544 485548 483060 481170
56291D81170j235J7J899L538M226M303M564N402O827Q679J0508J1822J2745J3900
$$ 481170 479935 479952 481851 485389 489615 493918 498482 503884 510711 519390 529898 541720 554465 568365
56277E68365J5491J7047J8274J9423K0749K2171K3656K5361K7364K9763L2959
$$ 568365 583856 600903 619177 638600 659349 681520 705176 730537 757901 787664 820623
56266H20623L7092M1463M5330M9143N4044O0250O7041P4240Q2436R1589J00696
$$ 820623 857715 899178 944508 993651 1047695 1107945 1174986 1249226 1331662 1423251 1523947
56255A523947J09151J17397J25770J33715J40384J45089J46907J44985J39533
$$ 1523947 1633098 1750495 1876265 2009980 2150364 2295453 2442360 2587345 2726878
56246B726878J31435J20583J05737Q6499O4410M1610J9381j555k0431l6765n0559
$$ 2726878 2858313 2978896 3084633 3171132 3235542 3277152 3296533 3294978 3274547 3237782 3187223
56235C187223o1626o9463p4108p6383p7065p6566p5553p4768p4103p2907p1482
$$ 3187223 3125597 3056134 2982026 2905643 2828578 2752012 2676459 2601691 2527588 2454681 2383199
56224B383199p1095p2242p4048p5737p7426p9126q0200q0379q0133p9533p7928
$$ 2383199 2312104 2239862 2165814 2090077 2012651 1933525 1853325 1772946 1692813 1613280 1535352
56213A535352p5234p2283o9400o5826o1182n6243n1616m6896m1868l7317l3813
$$ 1535352 1460118 1387835 1318435 1252609 1191427 1135184 1083568 1036672 994804 957487 923674
56202I23674l0776k7505k4249k1506j9201j7175j5545j4097j2304j0355r061q377
$$ 923674 892898 865393 841144 819638 800437 783262 767717 753620 741316 730961 721900 713523
56190G13523p328n803m861m727m088k235k91P30J493K831M012L993L281L206M162
$$ 713523 706195 700392 695531 690804 686716 684481 684190 684920 686413 689244 693256 697249 700530 703736 707898
56175G07898N705P583R592J1133J1864J2142J2266J2092J1922J2533J3794J4409
$$ 707898 713603 721186 730778 741911 753775 765917 778183 790275 802197 814730 828524 842933
56163H42933J3752J2628J1609J0101P926O216N694N492M829M487N389P055Q639
$$ 842933 856685 869313 880922 891023 898949 905165 910859 916351 921180 925667 931056 938111 946750
56150I46750J0226J2024J3563J4916J7327K1392K5931K9959L4315M0100M6951
$$ 946750 956976 969000 982563 997479 1014806 1036198 1062129 1092088 1126403 1166503 1213454
56139A213454N4406O3462P5244Q9387J05343J23795J44781J65502J81825J91072
$$ 1213454 1267860 1331322 1406566 1495953 1601296 1725091 1869872 2035374 2217199 2408271
56129B408271J91959J83393J65792J42998J20770J03315R2080Q6406Q3394P8028
$$ 2408271 2600230 2783623 2949415 3092413 3213183 3316498 3408578 3494984 3578378 3656406
56119C656406O5872M6173K1738l349k5008l9899m7315n0352n3984o2103p6571
$$ 3656406 3722278 3768451 3790189 3786840 3761832 3721933 3674618 3624266 3570282 3508179 3431608
56108C431608r7323j21684j44718j62035j71927j74237j68845j56664j40545j23275
$$ 3431608 3334285 3212601 3067883 2905848 2733921 2559684 2390839 2234175 2093630 1970355
56098A970355j05713q8218p2373n9583m9268m0316l3100k8254k4788k1342j8202
$$ 1970355 1864642 1776424 1704051 1644468 1595200 1554884 1521784 1493530 1468742 1447400 1429198
56087A429198j6171j4623j2532j0232q470o818m804l170k241o64K288M828N324
$$ 1429198 1413027 1398404 1385872 1375640 1367170 1360352 1355548 1352378 1350137 1349473 1351761 1356589 1361913
56074A361913N165O503Q726R825R951J0741J2235J3251J3942J5246J6617J6849
$$ 1361913 1367078 1373581 1382307 1392132 1402083 1412824 1425059 1438310 1452252 1467498 1484115 1500964
56062A500964J6511J7047J8240J8872J9093J9835K0836K1418K2171K3665K4757
$$ 1500964 1517475 1534522 1552762 1571634 1590727 1610562 1631398 1652816 1674987 1698652 1723409
56051A723409K4509K4302K5588K7070K6898K6151K7134K9582L1652L3358L5859
$$ 1723409 1747918 1772220 1797808 1824878 1851776 1877927 1905061 1934643 1966295 1999653 2035512
56040B035512L8523L9899M0553M1920M3453M3910M4166M5611M7228M7559M8001
$$ 2035512 2074035 2113934 2154487 2196407 2239860 2283770 2327936 2373547 2420775 2468334 2516335
56029B516335N0624N4202N6088N6636N8012O0054O1296O2679O6026P0104P2396
$$ 2516335 2566959 2621161 2677249 2733885 2791897 2851951 2913247 2975926 3041952 3112056 3184452
56018C184452P3595P6043P8993P9974P9727Q1194Q4622Q8297R2953J00444J09011
$$ 3184452 3258047 3334090 3413083 3493057 3572784 3653978 3738600 3826897 3919850 4020294 4129305
56007D129305J14933J18307J22300J27505J31983J36022J41716J48496J54233
$$ 4129305 4244238 4362545 4484845 4612350 4744333 4880355 5022071 5170567 5324800
55998E324800J59905J68080J77842J86535J95318K07276K21364K34287K47000
$$ 5324800 5484705 5652785 5830627 6017162 6212480 6419756 6641120 6875407 7122407
55989G122407K62905K80976K97412L13036L31955L54021L75946L98679M25963
$$ 7122407 7385312 7666288 7963700 8276736 8608691 8962712 9338658 9737337 10163300
55980A0163300M56718M86945N18175N55589N98906O44183O93555P53644Q25155
$$ 10163300 10620018 11106963 11625138 12180727 12779633 13423816 14117371 14871015 15696170
55971A5696170R04095R92410J096795J217799J351634J502307J680199J889557
$$ 15696170 16600265 17592675 18689470 19907269 21258903 22761210 24441409 26330966
55963B6330966K130703K414465K760778L183859L694670M318768N095229O056860
$$ 26330966 28461669 30876134 33636912 36820771 40515441 44834209 49929438 55986298
55955E5986298P229690Q656778J0409972J2583680J5304439J8755607K3160628
$$ 55986298 63215988 71872766 82282738 94866418 110170857 128926464 152087092
55948A52087092K8661898L5046686M1340102M5533149M4969368L7634982K3680800
$$ 152087092 180748990 215795676 257135778 302668927 347638295 385273277 408954077
55941D08954077N876644j1637175k5426289l4072634l7993507l8420314l6573710
$$ 408954077 414830721 403193546 377767257 343694623 305701116 267280802 230707092
55934B30707092l3399232k9588091k5614544k1776208j8259893j5178028j2563738
$$ 230707092 197307860 167719769 142105225 120329017 102069124 86891096 74327358
55927G4327358j0384792q589318p129680n951607m993850m209575l571333l052644
$$ 74327358 63942566 55353248 48223568 42271961 37278111 33068536 29497203 26444559
55919B6444559k622682k261285j961742j715036j505716j325140j174202j049924
$$ 26444559 23821877 21560592 19598850 17883814 16378098 15052958 13878756 12828832
55911A2828832r41987q44788p60839o89755o25089n64432n12090m69148m30347
$$ 12828832 11886845 11042057 10281218 9591463 8966374 8401942 7889852 7420704 6990357
55902F990357l93087l60550l33722l08745k84251k63342k46366k29327k11214
$$ 6990357 6597270 6236720 5902998 5594253 5310002 5046660 4800294 4570967 4359753
55893D359753j95701j83959j72755j61175j52275j46408j39726j30964j23281
$$ 4359753 4164052 3980093 3807338 3646163 3493888 3347480 3207754 3076790 2953509
55884B953509j17593j10499j00831r2135q6426q1032p3962o7226o2629n9021n5730
$$ 2953509 2835916 2725417 2624586 2532451 2446025 2364993 2291031 2223805 2161176 2102155 2046425
55873B046425n4284n4792n4676n2710n0511m8824m6303m3034m1171m0893l9713
$$ 2046425 1992141 1937349 1882673 1829963 1779452 1730628 1684325 1641291 1600120 1559227 1519514
55862A519514l6914l4708l3916l2459k9197k5457k1607j6003q529j609L140N749
$$ 1519514 1482600 1447892 1413976 1381517 1352320 1326863 1305256 1289253 1280724 1279115 1282255 1288004
55850A288004M897j592j2205k1851k7783l1611l4491l4669l1411k7098k3395j9126
$$ 1288004 1292901 1291309 1279104 1257253 1229470 1197859 1163368 1128699 1097288 1070190 1046795 1027669
55838A027669j3900j0178r415r567q753q309r839j2184j3708j5051j7231j9323
$$ 1027669 1013769 1003591 994176 984609 975856 967547 957708 945524 931816 916765 899534 880211
55826H80211k0336k1257k3105k4768k4764k3567k2433k1520k0650k0324k0511
$$ 880211 859875 838618 815513 790745 765981 742414 719981 698461 677811 657487 636976
55815F36976j9977j8101j5891j4147j2344j0226q716q089p138n194l171j588N30
$$ 636976 616999 598898 583007 568860 556516 546290 537574 529485 522347 517153 513982 512394 512924
55802E12924L579O131P015O949O865O294M634K462L74k053m990p497q912r817
$$ 512924 516503 522634 529649 536598 543463 549757 554391 556853 557227 555174 550184 542687 533775 523958
55788E23958j0756j1383j1574j1892j2190j1368r264p180n794m204j831L82J421
$$ 523958 513202 501819 490245 478353 466163 454795 445531 438351 432557 428353 426522 426904 428325
55775D28325J165p48n001j0605j4778j5990j5448j4646j3341j1119q973p782o809
$$ 428325 429490 428742 423741 413136 398358 382368 366920 352274 338933 327814 318841 311059 304250
55762C04250n257l949l966m862n575o007o412o388n773n470o194p249p587p193
$$ 304250 298993 295044 291078 286216 280641 274634 268222 261834 256061 250591 244397 237148 229561 222368
55748B22368o481n391l954k792k163j567j014j440k990m187l856k791k405k696
$$ 222368 215887 210496 206542 203750 201587 200020 199006 197566 194576 190389 186533 183742 181337 178641
55734A78641k542j281Q89L238M677M444L115J973J119m76k810m399m628m693n363
$$ 178641 176099 174818 175707 178945 183622 188066 191181 193154 194273 193797 190987 186588 181960 177267 171904
55719A71904n605m574l277k874k780j980r32o29p46k37R64K171L161M082M813
$$ 171904 166299 161725 158448 155574 152794 150814 149882 149253 148507 148270 149234 151405 154566 158648 163461
55704A63461N418O358P426P336N371K570L30j173k232k425j408P4J154K099L509
$$ 163461 168879 175237 182663 189999 195370 197940 198270 197097 194865 192440 191032 191106 192260 194359 197868
55689A97868N064O125O836P490P549O412M464K506P23p99j420q53p0k52j418k840
$$ 197868 202932 209057 215893 223383 230932 237344 241808 244314 245037 244238 242818 241965 241895 241643 240225 237385
55673B37385m122n026n076m266l466l219k892j869p16j80J42J060K419L452L833
$$ 237385 233263 228237 223161 218895 215429 212210 209318 207449 206733 206553 206695 207755 210174 213626 217459
55658B17459L613K815J954K050L146L768K898J559J294J915K027J059n52k487
$$ 217459 221072 223887 225841 227891 231037 234805 237703 239262 240556 242471 244498 245557 245005 242518
55644B42518m564o108o577o526o855p521p936q172q688r283r354q807p995p097
$$ 242518 237954 231846 225269 218743 211888 204367 196431 188259 179571 170288 160934 152127 144132 137035
55630A37035o329o132o357n962m487l038k876l726m507m890n008m474l084j786
$$ 137035 130706 124574 118217 112255 107768 104730 101854 98128 93621 88731 83723 79249 76165 74379
55616G4379j546j788j330l35J43J7Q6M26M56M03J073K146K262R74o42j543j729
$$ 74379 72833 71045 69715 69380 69523 69540 69626 70052 70508 70911 71984 74130 76392 77366 76724 75181 73452
55599G3452j522r90l93k23m62o24n96o98q19m07N03J104R00L00m8M2L54N57L99
$$ 73452 71930 70940 70547 70324 69862 69238 68642 67944 67125 66718 67221 68325 69225 69525 69477 69519 69873 70430 70829
55580G0829k4k52m6K41K56J86K96M51O33J313K625L782M225M694O075P782Q395
$$ 70829 70805 70553 70507 70748 71004 71190 71486 71937 72570 73883 76508 80290 84515 89209 95284 103066 111461
55563A11461P588O179M616K624K72j868l649n353o744p202o863o595o677o516
$$ 111461 119049 125228 129844 132468 132740 130872 127223 121870 115126 107924 101061 94466 87789 81273
55549H1273n800m973m325l569k623k000j989k153j860r70J80J019J045M14J11
$$ 81273 75473 70500 66175 62606 59983 57983 55994 53841 51981 51011 51191 52210 53255 53669 53780
55534E3780R28K419L474L725L624L366K763K099K051K546K682K022J218R82J202
$$ 53780 54708 57127 60601 64326 67950 71316 74079 76178 78229 80775 83457 85479 86697 87679 88881
55519H8881J315R74L8j472l092m071m130l687l253k991k904k917k706j929p93
$$ 88881 90196 91170 91208 89736 86644 82573 78443 74756 71503 68512 65608 62691 59985 58056 57263
55504E7263O9L15J16l21r04j353j343j118j396k400l435l673l044k191j709j656
$$ 57263 57332 57647 57763 57442 56538 55185 53842 52724 51328 48928 45493 41820 38776 36585 34876 33220
55488C3220j671j517j484k016k939l461l116k353j768j279n52K41P10R78J384
$$ 33220 31549 30032 28548 26532 23593 20132 17016 14663 12895 11616 11064 11305 12015 12993 14377
55473A4377J735J556R88O94Q97J110Q97L52j86n27o93r04j396j982k054j314k45
$$ 14377 16112 17668 18656 19350 20247 21357 22254 22606 22420 21893 21200 20296 18900 16918 14864 13550 13305
55456A3305N22R41J199J131N78l5j44J65L56K33j4k61m49l82q6Ql00n24k36K31
$$ 13305 13827 14768 15967 17098 17676 17641 17497 17662 18018 18251 18237 17976 17527 17145 17059 17067 16767 16243 16007 16238
55436A6238L92M29O92R07O79K85J54M4m11p47k91O61J263J331J226Q81M4q84j265
$$ 16238 16630 17059 17751 18658 19337 19622 19776 19820 19409 18662 18371 19032 20295 21626 22852 23733 23777 22893 21628
55417B1628j280j413j288k25J302K065J823J416J229R31P39J352K436K635J553
$$ 21628 20348 18935 17647 17422 18724 20789 22612 24028 25257 26188 26927 28279 30715 33350 34903
55402C4903L92J22J79l22j144j457j011j99M64M96l02j396j958j967k156k726
$$ 34903 35295 35417 35596 35274 34130 32673 31662 31463 31927 32423 32121 30725 28767 26800 24644 21918
55386B1918k905k154r67r5K93L81L02K68N34Q89P74J00n79q41p71n03pN61R72
$$ 21918 19013 16859 15892 15797 16090 16471 16773 17041 17575 18464 19238 19338 18759 17918 17147 16644 16637 17198 18170
55367A8170J304J625J507O09m80r62j154j874k750k550j197ML89O39J086J008
$$ 18170 19474 21099 22606 23215 22735 21773 20619 18745 15995 13445 12248 12252 12641 13280 14366 15374
55351A5374J96k68K74Q94N83k46p63j099j640j953j548r19p01n76k7M67J84m70
$$ 15374 15570 15302 15576 16470 17053 16807 16044 14945 13305 11352 9804 8885 8184 7608 7581 8048 8232 7762
55333G762n35l0J86j49m07j32M17P67O63J38l98m04J00M14J61r2K28P59P86K94
$$ 7762 7227 7197 7383 7234 6827 6695 7112 7879 8542 8680 8282 7878 7978 8392 8553 8461 8689 9448 10234 10528
55313A0528k14m72m20R9R26J363J080P63J103J634J423N63jP3J50k70q90j145
$$ 10528 10314 9842 9422 9521 10447 11810 12890 13653 14756 16390 17813 18376 18375 18448 18598 18328 17438 16293
55295A6293q26j01O22Q49M72OM2N64J112J348J161N32l00q19q06o39o77p21n20
$$ 16293 15467 15366 15988 16837 17309 17315 17357 17921 19033 20381 21542 22074 21774 20955 20149 19510 18833 18112 17592
55276A7592l42m61n13o2N48O33K22p4p8j38l35l46j79k81o80p17L4R93J175L45
$$ 17592 17250 16789 16276 16214 16762 17395 17617 17543 17465 17327 16992 16646 16467 16186 15506 14789 14823 15816 16991 17336
55256A7336p13j108p54l03k36l60k60MQ6K6J79N44P19N85M12K46j40n08j73Q75
$$ 17336 16623 15515 14761 14458 14222 13862 13602 13606 13692 13718 13897 14441 15160 15745 16157 16403 16263 15755 15582 16457
55236A6457J634J378O56L68M97M22M8j92j31n2k02n51q59p39K0Q89R21K5o76l50
$$ 16457 18091 19469 20125 20493 20990 21412 21460 21268 21137 21085 20883 20332 19473 18734 18754 19643 20564 20589 19913 19563
55216A9563L54K93m97r57o16q7l3l31l78K12J149J578Q56n15j226p12J89N33M89
$$ 19563 19917 20210 19713 18756 18140 18053 18020 17689 17311 17523 18672 20250 21106 20591 19365 18653 18842 19375 19864
55197A9864N95N72j13j008j086k17P11J008P36J86l23k91M94J362J488J027P69
$$ 19864 20459 21031 20918 19910 18824 18607 19318 20326 21062 21248 20925 20634 21128 22490 23978 25005 25774
55180B5774P52K72q22j793k186k329k431k137j351o43l91j77M03R95J087Q21O65
$$ 25774 26526 26798 25976 24183 21997 19668 17237 15100 13749 13106 12715 12538 12941 13936 15023 15844 16509
55163A6509O17L59r6m24n51p12r24q56l13L50N40J41k77j28M36P28M91K44M59
$$ 16509 17126 17485 17389 16965 16414 15702 14778 13922 13609 13959 14499 14640 14363 14235 14671 15399 15890 16134 16593
55144A6593Q22P65L72J82K71J37m70j121j265q27j28N03R57J312J714K152K473
$$ 16593 17415 18180 18552 18734 19005 19142 18672 17551 16286 15459 15331 15834 16791 18103 19817 21969 24442
55127B4442K653K865L064K820J956J073R76J594J999J492L76m77n59j99j49q04
$$ 24442 27095 29960 33024 35844 37800 38873 39849 41443 43442 44934 45310 44833 44274 44075 43926 43122
55111D3122j769k357k443k426k401j924q78J7O0m94q32o28j05N21J098J306R27
$$ 43122 41353 38996 36553 34127 31726 29802 28924 28941 29001 28507 27675 27047 26942 27463 28561 29867 30794
55094C0794K56k50m82m71l4P85J343J138O65P32J160J029J63n20k97M47Q81O78
$$ 30794 31050 30800 30318 29847 29813 30598 31941 33079 33744 34476 35636 36665 36828 36308 36011 36458 37339 38017
55076C8017J14l63m07N7P76J462K089K654K850K371J394L66n06j164j345q86j61
$$ 38017 38131 37768 37361 37418 38194 39656 41745 44399 47249 49620 51014 51380 50874 49710 48365 47479 47318
55059D7318L09M99O60P33N88N41R18J291R13j79j187j575j421q96j79K76J58p4
$$ 47318 47627 48126 48786 49519 50107 50648 51566 52857 53770 53591 52404 50829 49408 48512 48333 48609 48767 48693
55041D8693K16P71Q55N52O20J059J038L20l60n59p03j014j068q46j079j914k311
$$ 48693 48909 49680 50535 51087 51707 52766 53804 54124 53764 53205 52502 51488 50420 49574 48495 46581 44270
55024D4270j518k52L89L81L06K31m6k03J48O84Q47P32P13O01M7n53m26M33J257
$$ 44270 42752 42500 42889 43270 43576 43807 43761 43558 43706 44390 45237 45969 46682 47283 47330 46777 46351 46784 48041
55005D8041J529J328Q10Q4m79m86j37qk09l31k27k58o51j088j139p50j61L83P11
$$ 48041 49570 50898 51708 51792 51313 50827 50690 50682 50473 50142 49915 49657 49006 47918 46779 46029 45868 46251 46962
54986D6962P66O67N64M32J81j23k76k02L4L59O97R40J014Q97N40k9m18r2R16J859
$$ 46962 47728 48395 48959 49391 49572 49449 49173 48971 49005 49364 50061 51001 52015 52912 53452 53423 53005 52913 53829 55688
54966E5688K118J881J632J428J112R52J346K069K486K517K761L574M653N644O546
$$ 55688 57806 59687 61319 62747 63859 64811 66157 68226 70712 73229 75990 79564 84217 89861 96407
54951I6407P234P243O556O120O969Q955J0853J1658J1295J0121Q325N978L289
$$ 96407 103641 110884 117440 123560 130529 139484 150337 161995 173290 183411 191736 197714 201003
54938B01003M66k472n487q278j0435j1737j2144j1732j0831r983r406q646p211
$$ 201003 201469 198997 193510 185232 174797 163060 150916 139184 128353 118370 108964 100318 93107
54925I3107n425m173l755l497k680j403k95J91m5q21j563j524n43O96J513K021
$$ 93107 87682 83509 79754 76257 73577 72174 71879 72070 72025 71204 69641 68117 67574 68270 69783 71804
54909G1804K699L561M248M704N237O076P358R198J1217J2320J1713R987Q400P111
$$ 71804 74503 78064 82312 87016 92253 98329 105687 114885 126102 138422 150135 160122 168522 175633
54895A75633M968J230l251o945r118j0115j0666j1221j1637j1296r807p710o034
$$ 175633 180601 181831 178580 171635 162517 152402 141736 130515 118878 107582 97775 90065 84031
54882H4031n140m490l692l045k830k678k135j374q14m38L6N22O53L69K0j63l50
$$ 84031 78891 74401 70709 67664 64834 62156 60021 58647 57833 57395 57431 57953 58606 58975 58995 58832 58482
54865E8482p40j102r04nQ93Q69qn68j3R09Q79k05j218j477j399j415j233o48j88
$$ 58482 57742 56640 55736 55731 56624 57493 57485 56917 56904 57813 58692 58487 57269 55792 54393 52978 51745 51097 50909
54846E0909l21o72o93n55p30j112j271j266j468j755j536o11M87J114J126Q26
$$ 50909 50588 49916 49223 48668 47938 46826 45555 44289 42821 41066 39530 38919 39406 40520 41646 42472
54830D2472N79N25N80O81R88J601K137J988J179N07N70J026J129O65M5k93j92
$$ 42472 43051 43576 44156 44837 45825 47426 49563 51551 52730 53237 53807 54833 55962 56627 56672 56379 56187
54813E6187K52P04Q12O86Q93J663K386K325J577R93J203K074L020L568L688L810
$$ 56187 56439 57143 57955 58641 59534 61197 63583 65908 67485 68478 69681 71755 74775 78343 82031 85841
54797H5841M446N573O602P082P313Q071R770J2051J4017J4758J3860J1553Q405
$$ 85841 90287 95860 102462 109544 116857 124928 134698 146749 160766 175524 189384 200937 209342
54784B09342M928J585j175l297n327p615r437r648q262o616n799n648n547n328
$$ 209342 214270 215855 214680 211383 206056 198441 189004 179356 171094 164478 158679 153031 147484 142156
54770A42156m921m009k640j614j469j593j023K51J424J988K125K361L245M974
$$ 142156 137235 133226 130586 128972 127503 125910 124887 125138 126562 128550 130675 133036 136281 141255
54756A41255O931Q102Q523R585J2237J5546J7962J9316K0414K1132K0365J7849
$$ 141255 148186 156288 164811 174396 186633 202179 220141 239457 259871 281003 301368 319217
54744C19217J4572J1126O857J224m983j0471j4743j7957k0038k0653j9869j8263
$$ 319217 333789 344915 351772 352996 348013 337542 322799 304842 284804 264151 244282 226019
54732B26019j6474j4933j3851j3117j2257j0783q697o557n027m336m104l769l185
$$ 226019 209545 194612 180761 167644 155387 144604 135907 129350 124323 119987 115883 112114 108929
54719A08929k688k509k468k328k158k058j811j201m82j33k85o52r43r58o04p7
$$ 108929 106241 103732 101264 98936 96778 94720 92909 91708 91226 91093 90808 90156 89213 88255 87651 87574
54703H7574J72kj55J13N25O20N57Q17J315J440R25J32n27q49o24K92J528K291
$$ 87574 87746 87744 87589 87702 88227 88847 89404 90221 91536 92976 93901 94033 93506 92657 92033 92325 93853 96144
54685I6144K064R84l44j159r10K25J322J672J531J536J745J858K000K447K777
$$ 96144 98208 99192 98848 97689 96779 97004 98326 99998 101529 103065 104810 106668 108668 111115 113892
54670A13892K319J421J227K054K848K639J679P94L87N19J234K274K969K979K681
$$ 113892 116211 117632 118859 120913 123761 126400 128079 128873 129260 129779 131013 133287 136256 139235 141916
54655A41916K521K477K597L377M988O636P437P705Q540J0299J2175J3447J4482
$$ 141916 144437 146914 149511 152888 157876 164512 171949 179654 188194 198493 210668 224115 238597
54642B38597J6190J8893K1986K4504K5633K4826K1701J6233Q955Q97o802j3305
$$ 238597 254787 273680 295666 320170 345803 370629 392330 408563 417518 418415 411613 398308
54630C98308j8233k1671k3961k5282k5389k4033k1616j9072j6953j5045j3089
$$ 398308 380075 358404 334443 309161 283772 259739 238123 219051 202098 187053 173964
54619A73964j1292r814q306o564n049m113l206j714k41L4q78j742j863j845k291
$$ 173964 162672 152858 144552 137988 132939 128826 125620 123906 123665 123699 122821 121079 119216 117371 115080
54604A15080k826k842k426j975j559j160j003j149j255j104r66j044j126j108
$$ 115080 112254 109412 106986 105011 103452 102292 101289 100140 98885 97781 96815 95771 94645 93537
54590I3537j343k026k691k802k444k026j695j443j404j596j708j545j278r90l54
$$ 93537 92194 90168 87477 84675 82231 80205 78510 77067 75663 74067 72359 70814 69536 68546 68192
54575F8192P13J504J207j04j505k130j769r12l83o12j020o62L75Q80K26o54o25
$$ 68192 68905 70409 71616 71512 70007 67877 66108 65196 64813 64201 63181 62519 62894 63774 64000 63346 62721
54558F2721P7N43P82J502K627L186K713J802J149Q78R44J362J884K115K138K417
$$ 62721 62798 63341 64123 65625 68252 71438 74151 75953 77102 77980 78924 80286 82170 84285 86423 88840
54542H8840K939L221L291L868N162O347O745O849P448Q308Q574Q247Q317R312
$$ 88840 91779 95000 98291 102159 107321 113668 120413 127262 134710 143018 151592 159839 168156 177468
54528A77468J0485J0636R265O609L062r32m688p589r594j1073j2103j2311j1577
$$ 177468 187953 198589 207854 214463 217525 216593 211905 204316 194722 183649 171546 159235 147658
54515A47658j0443r488q611p402n974m921m475m264l932l533l196k871k632k657
$$ 147658 137215 127727 119116 111714 105740 100819 96344 92080 88148 84615 81419 78548 75916 73259
54501G3259k745k310j221j46L35M56O64P99M98O4J12N44O18O5m97m34J47P01Q81
$$ 73259 70514 68204 66983 66837 67172 67628 68292 69091 69589 69653 69765 70309 70927 70992 70495 70061 70208 70909 71790
54482G1790P63O72Q59J148J037M61J82Q43J867K051J181K46o1j55m64m91L47J550
$$ 71790 72553 73225 74084 75232 76269 76730 76912 77755 79622 81673 82854 83100 83039 82884 82420 81929 82276 83826
54464H3826K059J618Q76K73l58j090j551j553j442j532j572j201o22m13p37j100
$$ 83826 85885 87503 88379 88652 88294 87204 85653 84100 82658 81126 79554 78353 77731 77318 76581 75481
54448G5481r89m90j70m28j108j672j664j083l78m9j92m16l45j21j77m97m81K26
$$ 75481 74492 74002 73832 73404 72296 70624 68960 67877 67499 67450 67258 66842 66497 66376 66199 65702 65221 65447
54430F5447J047J065J63q23j111p46k74q0k36o44r20n14O63J828J989J066k7m30
$$ 65447 66494 67559 67722 66899 65788 65042 64768 64688 64452 63808 62888 62374 63037 64865 66854 67920 67893 67463
54412F7463j64K02L66N28R55J648K388K919L060K766K225J783J670J793J898J944
$$ 67463 67299 67501 67867 68395 69350 70998 73386 76305 79365 82131 84356 86139 87809 89602 91500 93444
54396I3444K178K726L225L138K400J470O65k32j421k466k719k224j750j791k052
$$ 93444 95622 98348 101573 104711 107111 108581 109246 109014 107593 105127 102408 100184 98434 96643 94591
54381I4591k046j772j506j331j251j421j805j915j365n67k55m64o00n13o84j222
$$ 94591 92545 90773 89267 87936 86685 85264 83459 81544 80179 79612 79357 78893 78293 77780 77096 75874
54365G5874j419p92R9M96M88N78O73L34j86j66L68N67J06k18L49J423K150K373
$$ 75874 74455 73663 73762 74258 74746 75324 75997 76331 76145 75979 76347 76914 77020 76802 77151 78574 80724 83097
54347H3097K502K598K379J915J650J637J392P53L12O20J330J594J119M52J86K96
$$ 83097 85599 88197 90576 92491 94141 95778 97170 97923 98235 98855 100185 101779 102898 103350 103536 103832
54331A03832L47Q2m72j238k143k949l357l317l099k884k601k169j775j655j768
$$ 103832 104179 104261 103789 102551 100408 97459 94102 90785 87686 84802 82201 80032 78257 76602 74834
54316G4834j911k039k167k134j707j018n37n71r45j342j630j775j583q80J14P55
$$ 74834 72923 70884 68717 66583 64876 63858 63321 62750 61805 60463 58833 57058 55475 54595 54709 55464
54300E5464N37m03j382j813j690j396j156q51l36L19R92J564J669Q11q76k231
$$ 55464 56001 55598 54216 52403 50713 49317 48161 47310 46974 47293 48285 49849 51518 52329 51453 49222
54284D9222k062n23R55J233N55q5j64M4O4k35n92n79K5Q99J352J039M01J77N49
$$ 49222 47160 46637 47592 48825 49380 49295 49131 49175 49239 49004 48412 47833 47858 48757 50109 51148 51549 51726 52275
54265E2275R51Q15K22k27j25L65Q32J026Q85L64m30r54o11M11J092P04k95q92
$$ 52275 53226 54041 54263 54036 53911 54276 55108 56134 57019 57383 56953 55999 55388 55799 56891 57595 57300 56408
54247E6408p89n13m12j90M37J161J488J332R70O41M19K68N9l69r89j523j718j524
$$ 56408 55619 55106 54694 54504 54941 56102 57590 58922 59892 60533 60952 61220 61279 60910 59921 58398 56680 55156
54229E5156j020l35L38P97R70Q46M09j91n34l26J11J73k26n53m02L4L40L23Mm87
$$ 55156 54136 53801 54139 54936 55906 56752 57161 56970 56436 56110 56221 56394 56168 55615 55213 55247 55587 55910 55914 55427
54209E5427q53p58j98N30J257J949K338K030J141L98L25O88Q83N25l90j505k126
$$ 55427 54574 53816 53618 54148 55405 57354 59692 61722 62863 63261 63586 64274 65157 65682 65292 63787 61661
54192F1661j749p79k12m16p18m76R7N30Q64J199J119K53q58j233o45J96O13N65
$$ 61661 59912 59133 58921 58505 57787 57311 57408 57938 58802 60001 61120 61373 60515 59282 58637 58833 59446 60011
54174F0011L73K65K36M8n09j232j568j283p74m37j21M13R32J086J012J010R82
$$ 60011 60384 60649 60885 60933 60424 59192 57624 56341 55567 55130 55009 55422 56354 57440 58452 59462 60444
54157F0444P02M20N59R68J131R81R17J066J121Q56L21m66j421k036j726o49K89
$$ 60444 61146 61566 62125 63093 64224 65205 66122 67188 68309 69165 69486 69020 67599 65563 63837 63188 63477
54140F3477L40m39j434j974j710r24l86m62o08k16K93K0q77j193l69P22J003N14
$$ 63477 63817 63378 61944 59970 58260 57336 56950 56488 55880 55664 55957 55977 55100 53907 53538 54260 55263 55777
54122E5777J1j40j12q6j12k37l89l36m7J55L9j67j80r4q0J1L63P02N76O5k56j08
$$ 55777 55788 55648 55536 55450 55338 55101 54712 54376 54329 54484 54523 54356 54176 54082 54002 54013 54376 55078 55654 55719 55463 55355
54100E5355P9k32r16j313j035m46j64k76k72J88Q35J209J247J125Q62M58J98K78
$$ 55355 55434 55202 54286 52973 51938 51492 51328 51052 50780 50968 51803 53012 54259 55384 56246 56704 56902 57180
54082E7180K48m92j615k009j203k6N20M22K10n0o20j147q08N11J804K100J519
$$ 57180 57428 56936 55321 53312 52109 52083 52603 53025 53235 53185 52565 51418 50610 51121 52925 55025 56544
54065E6544Q87O24M78K20L6J69N06Q09J056J324J463J228P64N97J058J879K392
$$ 56544 57431 58055 58533 58753 58789 58958 59464 60273 61329 62653 64116 65344 66108 66705 67763 69642 72034
54048G2034K101J083K4k31N55J711K405K559K716L064L214L014K888L110L313
$$ 72034 74135 75218 75242 75011 75566 77277 79682 82241 84957 88021 91235 94249 97137 100247 103560
54033A03560L145K906L020L386L721M117M609M638L748K541K158K830L664L822
$$ 103560 106705 109611 112631 116017 119738 123855 128464 133102 136850 139391 141549 144379 148043 151865
54019A51865L300K511J765J303J311J661J969J990J676R53r3r77j182q27n11o24
$$ 151865 155165 157676 159441 160744 162055 163716 165685 167675 169351 170304 170211 169234 168052 167225 166714 166090
54003A66090j170k087l145l715l331k419j869j864j813j374q81o95p84j006j191
$$ 166090 164920 162833 159688 155973 152642 150223 148354 146490 144677 143303 142422 141727 140943 139937 138746
53988A38746j022m66k03q42j741j639n59P1n99j781k415k466k290j796j033o67
$$ 138746 137724 137258 137055 136213 134472 132833 132274 132345 131746 129965 127550 125084 122794 120998 119965 119298
53972A19298r54j022j51Q84Q37j29p16m26n5k83p61q29m42p4j00m62o75k47O81
$$ 119298 118344 117322 117171 118055 118892 118763 118047 117621 117566 117283 116522 115693 115251 115177 115077 114615 113940 113693 114374
53953A14374J315J147O35M98P18P99O79P32J015J290J716K776M308N362N310M633
$$ 114374 115689 116836 117471 117969 118687 119486 120165 120897 121912 123202 124918 127694 132002 137364 142674 147307
53937A47307M243M375M481M038L120K126J211J69j074k077k285j770j185r10o63
$$ 147307 151550 155925 160406 164444 167564 169690 170901 171070 169996 167919 165634 163864 162679 161769 161106
53922A61106j42M60Q39J086J440J967K785M118N631O281N551M352L980M439M778
$$ 161106 160964 161424 162263 163349 164789 166756 169541 173659 179290 185571 191122 195474 199454 203893 208671
53907B08671M796N244O246O680N695L998K928K807K868K469J654P20j74q83j222
$$ 208671 213467 218711 224957 231637 237332 241330 244258 247065 249933 252402 254056 254776 254602 253719 252497
53892B52497j209j140j306j741k297k874l529m369n376o305o829o770o291n764
$$ 252497 251288 250148 248842 247101 244804 241930 238401 234032 228656 222351 215522 208752 202461 196697
53878A96697n515n536n512n205m748m441m288l998l461k896k480k150j966k230
$$ 196697 191182 185646 180134 174929 170181 165740 161452 157454 153993 151097 148617 146467 144501 142271
53864A42271k970l640l675l178k659k348k150k054k146k293k275k187k223k180
$$ 142271 139301 135661 131986 128808 126149 123801 121651 119597 117451 115158 112883 110696 108473 106293
53850A06293j666q16l12n09j020j363j555j824k006j706q93l0M54N43M48K25k15
$$ 106293 104627 103811 103499 102990 101970 100607 99052 97228 95222 93516 92623 92593 93047 93590 94038 94263 94048
53833I4048q10j236j262j080j080j285j317r27l09K27N97Q16Q54Q42J076J509
$$ 94048 93238 92002 90740 89660 88580 87295 85978 85051 84742 84969 85566 86382 87236 88078 89154 90663
53817I0663J593R98K80K69R29J362R80J95j87J30Q38J500J915K180K533L095L681
$$ 90663 92256 93254 93534 93803 94732 96094 97074 97269 97082 97212 98050 99550 101465 103645 106178 109273 112954
53800A12954L985L898L630L516L806M504N242N504N151M622M385M329M001L337
$$ 112954 116939 120837 124467 127983 131789 136293 141535 147039 152190 156812 161197 165526 169527 172864
53786A72864K829K873L249L299K586J358M13L28P20O01l53j297j400j125j564
$$ 172864 175693 178566 181815 185114 187700 189058 189471 189799 190519 191120 190767 189470 188070 186945 185381
53771A85381k714l282k479j206r79k082l362l662k970k102j670j551j272p09k65
$$ 185381 182667 179385 176906 175700 174721 172639 169277 165615 162645 160543 158873 157322 156050 155341 155076
53756A55076l91j017j655k015k321k940l816m390m157l271k472k285k419k162
$$ 155076 154685 153668 152013 149998 147677 144737 140921 136531 132374 129103 126631 124346 121927 119765
53742A19765j323m77k26n73j151j703k099k224k100j911j655j096l19J26K7k6
$$ 119765 118442 117965 117739 117166 116015 114312 112213 109989 107889 105978 104323 103227 102908 103034 103061 103035
53726A03035M90J070P47m86j520j375j03J483K538K645K083J632J701J769J155
$$ 103035 103525 104595 105342 104856 103336 101961 101858 103341 105879 108524 110607 112239 113940 115709 116864
53711A16864J82j32N24J376J721J737J942K466L114L660L747L020J674M64r8k03
$$ 116864 117046 116914 117438 118814 120535 122272 124214 126680 129794 133454 137201 140221 141895 142359 142261 142058
53695A42058j67Q7O53J193J301J056Q63R55J281J603J532Q11j72n21J55J224J805
$$ 142058 141891 141978 142631 143824 145125 146181 147044 147999 149280 150883 152415 153226 153054 152533 152688 153912 155717
53678A55717J734J402J080Q95J156K006K845K766J638L08m47o99r30j181j058
$$ 155717 157451 158853 159933 160828 161984 163990 166835 169601 171239 171547 171100 170401 169471 168290 167232
53663A67232l87M15P71N56J72N0J59Q1m85j360k021k057j470o05J86Q32J409J774
$$ 167232 166845 167260 168031 168587 168759 168809 168968 169049 168564 167204 165183 163126 161656 161051 161237 162069 163478 165252
53645A65252J562O96k62n67r1N80Q36O31L91N30J020J361J012Q5n75k33R12J924
$$ 165252 166814 167510 167248 166681 166590 167170 168006 168637 169028 169558 170578 171939 172951 173036 172461 172228 173140 175064
53627A75064K179J831J403J256J499J974K256K003J410J061J226J572J667J394
$$ 175064 177243 179074 180477 181733 183232 185206 187462 189465 190875 191936 193162 194734 196401 197795
53613A97795Q65K25k55j53P62K271L792M706M748M302M243N043O090O307N449
$$ 197795 198660 198885 198630 198477 199239 201510 205302 210008 214756 219058 223301 228344 234434 240741 246190
53598B46190M401M040M272M359L883L145K768L043L577L675L248L135M086N537
$$ 246190 250591 254631 258903 263262 267145 270290 273058 276101 279678 283353 286601 289736 293822 299359
53584B99359O064N094L567K676K575K636K481K250K141K106J942J540J105J119
$$ 299359 305423 310517 314084 316760 319335 321971 324452 326702 328843 330949 332891 334431 335536 336655
53570C36655J786K571K721K249J907K110K450K430K080J611J020L69m0j02j35
$$ 336655 338441 341012 343733 345982 347889 349999 352449 354879 356959 358570 359590 359959 359919 359817 359682
53555C59682l57o06p57q91q22r9J107J804J396N05L4J4J1P3M45P76N67J60M15
$$ 359682 359325 358719 357962 357071 356249 356150 357257 359061 360457 360962 360996 361010 361021 361094 361539 362315 362882 363042 363457
53536C63457J461K506K886K655K184J792J837K511L485M219M632N039N518N869
$$ 363457 364918 367424 370310 372965 375149 376941 378778 381289 384774 388993 393625 398664 404182 410051
53522D10051O183O825P833Q818R534J0102J0639J1150J1811J2832J4013J4910
$$ 410051 416234 423059 430892 439710 449244 459346 469985 481135 492946 505778 519791 534701
53510E34701J5520J6264J7168J7675J7542J7360J7830J8864J9867K0627K1486
$$ 534701 550221 566485 583653 601328 618870 636230 654060 672924 692791 713418 734904
53499G34904K2735K4164K5305K5921K6161K6296K6390K6279K5846K5137K4191
$$ 734904 757639 781803 807108 833029 859190 885486 911876 938155 964001 989138 1013329
53488A013329K3043K1971K1442K1512K1618K1272K0722K0498K0567K0504K0366
$$ 1013329 1036372 1058343 1079785 1101297 1122915 1144187 1164909 1185407 1205974 1226478 1246844
53477A246844K0688K1518K2067K1613K0271J8663J7237J6172J5565J5291J4793
$$ 1246844 1267532 1289050 1311117 1332730 1353001 1371664 1388901 1405073 1420638 1435929 1450722
53466A450722J3525J1583R665Q256P110N603L633J805O82n8j355l687o572r191
$$ 1450722 1464247 1475830 1485495 1493751 1500861 1506464 1510097 1511902 1512584 1512526 1511171 1507484 1500912 1491721
53452A491721j1183j2671j3879j5035j6273j7367j7837j7712j7784j8685k0009
$$ 1491721 1480538 1467867 1453988 1438953 1422680 1405313 1387476 1369764 1351980 1333295 1313286
53441A313286k0935k1369k1847k2464k2692k2317k1798k1578k1573k1536k1362
$$ 1313286 1292351 1270982 1249135 1226671 1203979 1181662 1159864 1138286 1116713 1095177 1073815
53430A073815k0829j9617j7877j6308j5359j4630j3388j1345q791o286m488l852
$$ 1073815 1052986 1033369 1015492 999184 983825 969195 955807 944462 935671 929385 924897 921045
53418I21045m097m199l267j373P20K432L818N218O836Q532R952J0881J1503J2297
$$ 921045 916948 912749 909482 908109 908829 911261 915079 920297 927133 935665 945617 956498 968001 980298
53404I80298J3617J5459J7569J9627K1375K2777K4023K5205K6119K6699K7469
$$ 980298 993915 1009374 1026943 1046570 1067945 1090722 1114745 1139950 1166069 1192768 1220237
53393A220237K9115L1558L4009L5960L7658L9423M1107M2581M4220M6400M8715
$$ 1220237 1249352 1280910 1314919 1350879 1388537 1427960 1469067 1511648 1555868 1602268 1650983
53382A650983N0240N0572N0332N0527N1553N2803N3271N2657N1689N1136N0778
$$ 1650983 1701223 1751795 1802127 1852654 1904207 1957010 2010281 2062938 2114627 2165763 2216541
53371B216541M9799M8126M6458M4872M2288L7930L2582K7646K3461J9433J5430
$$ 2216541 2266340 2314466 2360924 2405796 2448084 2486014 2518596 2546242 2569703 2589136 2604566
53360B604566J1950Q935N536J354l008p016j1094j5770k0521k4293k6917k9295
$$ 2604566 2616516 2625451 2630987 2632341 2629333 2622317 2611223 2595453 2574932 2550639 2523722 2494427
53348B494427l2240l5735l9383m3047m6670m9831n1802n2077n0779m8629m6517
$$ 2494427 2462187 2426452 2387069 2344022 2297352 2247521 2195719 2143642 2092863 2044234 1997717
53337A997717m4883m3532m2190m1075m0579m0490m0045l9011l8099l7873l7681
$$ 1997717 1952834 1909302 1867112 1826037 1785458 1744968 1704923 1665912 1627813 1589940 1552259
53326A552259l6325l3618l0668k8577k7370k6278k4584k2044j8915j5813j3317
$$ 1552259 1515934 1482316 1451648 1423071 1395701 1369423 1344839 1322795 1303880 1288067 1274750
53315A274750j1621j0672j0481j0871j1136j0660r814r460r452q642o727n025
$$ 1274750 1263129 1252457 1241976 1231105 1219969 1209309 1199495 1190035 1180583 1171941 1165214 1160189
53303A160189m672m946m449l209k421k377k068p96R26K358L485M518N352N954
$$ 1160189 1155517 1150571 1146122 1142913 1140492 1138115 1136047 1135251 1136177 1138535 1142020 1146538 1151890 1157844
53289A157844O706P860R141J0246J1348J2770J4556J6664J9113K1641K3527K4219
$$ 1157844 1164550 1172410 1181551 1191797 1203145 1215915 1230471 1247135 1266248 1287889 1311416 1335635
53277A335635K3958K3481K3268K3202K2788K1576J9639J7752J6750J6524J5954
$$ 1335635 1359593 1383074 1406342 1429544 1452332 1473908 1493547 1511299 1528049 1544573 1560527
53266A560527J4051J0945P586M791K763J232j95j670k959l796m401n358o932q819
$$ 1560527 1574578 1585523 1593109 1597900 1600663 1601895 1601700 1600030 1597071 1593275 1588874 1583516 1576584 1567765
53252A567765j0624j2228j3617j4802j6020j7584j9381k0870k1828k2661k3792
$$ 1567765 1557141 1544913 1531296 1516494 1500474 1482890 1463509 1442639 1420811 1398150 1374358
53241A374358k5032k5802k5665k4604k3081k1911k1532k1265j9965j7605j5561
$$ 1374358 1349326 1323524 1297859 1273255 1250174 1228263 1206731 1185466 1165501 1147896 1132335
53230A132335j4947j5336j5633j5505j5285j5020j4506j3972j3849j4002j3871
$$ 1132335 1117388 1102052 1086419 1070914 1055629 1040609 1026103 1012131 998282 984280 970409
53219I70409j3299j2574j1738j0577r298q541q536q876r285j0035j1313j2700
$$ 970409 957110 944536 932798 922221 912923 904382 895846 886970 877685 867650 856337 843637
53207H43637j3663j4244j4831j5491j5992j6382j7105j8333j9485j9713j8891
$$ 843637 829974 815730 800899 785408 769416 753034 735929 717596 698111 678398 659507
53196F59507j7772j7109j6861j6517j5897j5173j4354j3372j2750j3315j4945
$$ 659507 641735 624626 607765 591248 575351 560178 545824 532452 519702 506387 491442
53185D91442j6241j5997j4614j3419j3014j2953j2776j2580j2458j2097j1169
$$ 491442 475201 459204 444590 431171 418157 405204 392428 379848 367390 355293 344124
53174C44124r843q664q151q434r104r340q593p132n789n152n152n350n330m919
$$ 344124 334281 325617 317466 309032 299928 290588 281995 274863 269074 263922 258770 253420 248090 243171
53160B43171m297l898m049m665n387n822n627m668l374k551k536k788k673k303
$$ 243171 238874 234976 230927 226262 220875 215053 209426 204758 201384 198833 196297 193509 190836 188533
53146A88533k112j956j384n84l39q82j552j708j478j262j061o64j84jk75p77j143
$$ 188533 186421 184465 183081 182497 182158 181276 179724 178016 176538 175276 174215 173551 173367 173366 173091 172314 171171
53129A71171j137p63j97L82Q47J019P08mo92j046j191j358j477j406j250j080
$$ 171171 170034 169271 169074 169456 170303 171322 172030 172026 171334 170288 169097 167739 166262 164856 163606 162526
53113A62526n47N80J696J812Q02l66p28k17O26J324J648J607J415J253R95M63
$$ 162526 161979 162559 164255 166067 166869 166503 165775 165558 166184 167508 169156 170763 172178 173431 174426 174889
53097A74889j43n18q36j482k244k478k137j902k106k231j853j350j158r89m09
$$ 174889 174746 174228 173392 171910 169666 167188 165051 163149 161043 158812 156959 155609 154451 153462 153053
53082A53053K59K93l93j230j786k103k321k423k318j930j318q46j000j718k262
$$ 153053 153312 153605 153212 151982 150196 148093 145772 143349 141031 139101 137783 136937 135937 134219 131957
53067A31957k062j336o40j39J96J75k27m66l8O52Q01L82R6J75N7n67j179j241
$$ 131957 129895 128559 127919 127780 127976 128151 127924 127458 127420 128072 128873 129255 129351 129526 129583 129016 127837 126596
53049A26596r46p75p72p65r21j463k078k087j287k59K87K19r1l02l98m80m65k17
$$ 126596 125650 124875 124103 123338 122417 120954 118876 116789 115502 115243 115530 115749 115658 115356 114958 114478 114013 113796
53031A13796Q6j6o60j344j443r57m42k91l86m96o29q42j002r30o36l04j04q4r2
$$ 113796 113882 113866 113206 111862 110419 109462 109020 108729 108343 107847 107218 106376 105374 104444 103808 103504 103400 103316 103224
53012A03224J19N46P36K56n95r87n38K36O76P22O21K85m75j326j602j111k63O12
$$ 103224 103343 103889 104625 104881 104286 103299 102761 102997 103673 104395 105016 105301 104826 103500 101898 100787 100524 101136
52994A01136J587K587K994K241N98r67j654j377n55L74J160J674J829J634J297
$$ 101136 102723 105310 108304 110545 111143 110176 108522 107145 106590 106964 108124 109798 111627 113261 114558
52979A14558J123J154J078O51J81K34Q72J537J788J802J872J832J369O86L37M77
$$ 114558 115681 116835 117913 118564 118745 118979 119851 121388 123176 124978 126850 128682 130051 130737 131074 131551
52963A31551P59R97J448K309L267L794L657L007K276K020K576L580M120L606K341
$$ 131551 132310 133307 134755 137064 140331 144125 147782 150789 153065 155085 157661 161241 165361 168967 171308
52948A71308J018n4r44j570j670j289q55p41r23j214j523j830k073k171k081j819
$$ 171308 172326 172272 171328 169758 168088 166799 165944 165203 164280 163066 161543 159713 157640 155469 153388 151569
52932A51569j481j259j280j387j242p01%M97P13Q73J093J056M00n84j022n46K6
$$ 151569 150088 148829 147549 146162 144920 144219 144219 144716 145429 146302 147395 148451 148851 148267 147245 146699 146725
52915A46725k65j013q37N72J801J640P46N35J095J349R25N35N48M40n9l63j22
$$ 146725 146460 145447 144610 145182 146983 148623 149369 149904 150999 152348 153273 153808 154356 154796 154737 154374 154252
52898A54252J61J15K27Q48J328R91K95J37N10P74Q42J071J291J031N30M67P57
$$ 154252 154413 154528 154755 155603 156931 157922 158217 158354 158864 159638 160480 161551 162842 163873 164403 164870 165627
52881A65627O55J48P2O22Q48K17m38j98N44Q14N18K66K38J13r9l2L35O41P33O59
$$ 165627 166282 166430 166502 167124 167972 168189 167751 167553 168097 168911 169429 169695 169933 170046 169947 169915 170250 170891 171624 172283
52861A72283K25p32j691j820j061j42N20J209J994K276J673P42K81L89O90J102
$$ 172283 172508 171776 170085 168265 167204 167062 167582 168791 170785 173061 174734 175476 175757 176146 176836 177938
52845A77938J789K600L108L157K921K585K252K081K105J984J381N17L4K49P99
$$ 177938 179727 182327 185435 188592 191513 194098 196350 198431 200536 202520 203901 204418 204452 204701 205500
52830B05500J042O43k11r36j016n89m02r41j807k351k643l188l834l767k763j685
$$ 205500 206542 207185 206974 206038 205022 204433 204031 203090 201283 198932 196289 193101 189267 185500 182737 181052
52814A81052j373j702k162k727l446l711k802j089R7l6r75j768k087k176k204
$$ 181052 179679 177977 175815 173088 169642 165931 163129 162040 162137 162101 161126 159358 157271 155095 152891
52799A52891k169k154k239k241j862j182o97p75j237j628j769j842j967j949j600
$$ 152891 150722 148568 146329 144088 142226 141044 140347 139572 138335 136707 134938 133096 131129 129180 127580
52784A27580j151j041j377j784j905j770j574j298p97j11N05Q04O58R4o01r60
$$ 127580 126429 125388 124011 122227 120322 118552 116978 115680 114883 114772 115277 116081 116739 116833 116232 115272
52768A15272q24o04q06j271j361q23j54J16O3L5j0l84j011j368j243j122j557
$$ 115272 114448 113844 113038 111767 110406 109583 109429 109545 109608 109643 109633 109249 108238 106870 105627 104505 102948
52751A02948k357k770k404j641j114j052j281j592j864j997j967j896j824j536
$$ 102948 100591 97821 95417 93776 92662 91610 90329 88737 86873 84876 82909 81013 79189 77653
52737G7653q99j95J67K11K51K73k0n29o77k77N9j91o25m80L06J060J228P43k15
$$ 77653 76754 76559 76726 76937 77188 77461 77441 76912 76235 75958 76017 75826 75201 74721 75027 76087 77315 78058 77843
52718G7843j270j803j464o84j57J52P27J391J270K25o36m21K01j4j015j471o44
$$ 77843 76573 74770 73306 72622 72465 72617 73344 74735 76005 76230 75594 75173 75374 75360 74345 72874 72230
52701G2230O16R93K51p04r41k94P13J385J348P68K35K80R63J895K619K929K879
$$ 72230 72846 73839 74090 73386 72445 72151 72864 74249 75597 76365 76600 76880 77843 79738 82357 85286 88165
52684H8165K622K308K096K138K406K541K024O74j013k180k320j701j044q72j166
$$ 88165 90787 93095 95191 97329 99735 102276 104300 104974 103961 101781 99461 97760 96716 95844 94678
52669I4678j545j689j632j740k316l152l572l128k137j283q01m21j05k75r77j429
$$ 94678 93133 91444 89812 88072 85756 82604 79032 75904 73767 72484 71683 71262 71157 70882 69905 68476
52653F8476q93K63J028J018O59K38m28j213j510j129p23p57p10J24J447K276K159
$$ 68476 67583 67846 68874 69892 70551 70789 70361 69148 67638 66509 65786 65029 64319 64443 65890 68166 70325
52636G0325J489Q03M04N98J542K815L579L399K532J429L08p23j497j877j824j396
$$ 70325 71814 72617 73021 73619 75161 77976 81555 84954 87486 88915 89223 88500 87003 85126 83302 81906
52620H1906q34n53p54j147j271r66l33M75J093R65K8r14j057o22l91m81l48J43
$$ 81906 81072 80519 79765 78618 77347 76381 76048 76523 77616 78581 78609 77695 76638 76016 75625 75144 74796 74939
52602G4939N62P81J119J466J252N45K91R70J811J898J328P70M89M45P63J343J566
$$ 74939 75501 76282 77401 78867 80119 80664 80955 81925 83736 85634 86962 87732 88221 88666 89429 90772 92338
52585I2338J094N51O90J250J438J206J141J298J129O34N92J345K135K115J500
$$ 92338 93432 93983 94673 95923 97361 98567 99708 101006 102135 102769 103361 104706 106841 108956 110456
52570A10456J165J423J672J220J49o69l81R67K321K572J576J59q45j224j136o66
$$ 110456 111621 113044 114716 115936 116085 115416 115035 116002 118323 120895 122471 122630 121785 120561 119425 118759
52554A18759J15R17J367J420J340J356J378J150O09M0j72O2M10M72J59k77n97
$$ 118759 118874 119791 121158 122578 123918 125274 126652 127802 128411 128451 128279 128341 128751 129223 129382 129105 128508
52537A28508q33j113j324j179o78k56k09k26J48O45N49j19m32M5M48j9o05J3J595
$$ 128508 127675 126562 125238 124059 123381 123125 122916 122690 122838 123483 124032 123913 123481 123526 123974 123955 123350 123363 124958
52518A24958K500J975J045P45O66K4q70j108n99k7J49l5n13j085j164l38R39J792
$$ 124958 127458 129433 130478 131223 131889 131913 131043 129935 129336 129309 129458 129423 128910 127825 126661 126323 127262 129054
52500A29054J918J592J025L77J17N65J148R42o0r16j019p54p19r72j216j220q47
$$ 129054 130972 132564 133589 133966 134083 134648 135796 136738 136678 135762 134743 133989 133270 132298 131082 129862 129015
52483A29015j60M10L95m8l01j27J22K40M28P15P00K28k26k25pk4k49l78l94m64
$$ 129015 128855 129265 129660 129612 129311 129184 129306 129546 129974 130689 131389 131617 131391 131166 131159 131135 130886 130508 130114 129650
52463A29650m38lP49J309J365J062O69K99k0j92k27l20n74p55m87K62J047J389
$$ 129650 129212 129209 129958 131267 132632 133694 134363 134662 134642 134450 134223 133903 133329 132574 132087 132349 133396 134785
52445A34785J264J038R70R12N53j46q40j082p44j89N9j58n51q74j233j679j833
$$ 134785 136049 137087 138057 138969 139522 139376 138536 137454 136710 136521 136580 136422 135871 134997 133764 132085 130252
52428A30252j415q85r27j392j449q89m44n82q08o28l64m12l67K77J125J430J209
$$ 130252 128837 127952 127025 125633 124184 123295 122851 122269 121461 120833 120469 120057 119690 119967 121092 122522 123731
52411A23731R83P67K65j95Q2J020J742J748J285O69O4p7O09J472J333K15m02N28
$$ 123731 124714 125481 125746 125551 125633 126653 128395 130143 131428 132097 132161 132084 132693 134165 135498 135713 135311 135839
52393A35839K289L447L445K590J288J0n23kQ39R71L91J41R90K503L549L514K879
$$ 135839 138128 141575 145020 147610 148898 148908 148385 148383 149222 150193 150584 150725 151715 154218 157767 161281 164160
52376A64160K543K649K421J363K60K54J239J969J792J353J340J498J325J036J075
$$ 164160 166703 169352 171773 173136 173396 173650 174889 176858 178650 180003 181343 182841 184166 185202 186277
52361A86277J299J275J036R51J134J485K027K685L035K755K141J769J837K166
$$ 186277 187576 188851 189887 190838 191972 193457 195484 198169 201204 203959 206100 207869 209706 211872
52347B11872K541K755K604K225K086K309K367J896J280J020R56P55P04J260K085
$$ 211872 214413 217168 219772 221997 224083 226392 228759 230655 231935 232955 233911 234666 235370 236630 238715
52332B38715K322J730R15M43L77N91R95J368J489J535J864K439K843K854K633
$$ 238715 241037 242767 243682 244125 244502 245093 246088 247456 248945 250480 252344 254783 257626 260480 263113
52317B63113K429K472K997L927M682M793M625M897N632O189O273O276O612P299
$$ 263113 265542 268014 271011 274938 279620 284413 289038 293935 299567 305756 312029 318305 324917 332216
52303C32216Q262R364J0162J0270J0094J0438J1321J1966J2171J2681J3759J4412
$$ 332216 340478 349842 360004 370274 380368 390806 402127 414093 426264 438945 452704 467116
52291D67116J3883J3073J3389J4739J5823J6192J6713J7839J8626J8064J6554
$$ 467116 480999 494072 507461 522200 538023 554215 570928 588767 607393 625457 642011
52280F42011J5359J5025J5020J4661J3744J2495J1324J0625J0420J0242R649Q742
$$ 642011 657370 672395 687415 702076 715820 728315 739639 750264 760684 770926 780575 789317
52268G89317P756O448M459K230Q06N44O52L23l07p49j092j680k325k631k896l755
$$ 789317 797073 803521 807980 810210 811016 811560 812212 812535 812228 811479 810387 808707 806382 803751 800855 797100
52252G97100n016n648n147m168l524l204k710j852p87L09J252J903K538L729N520
$$ 797100 792084 786436 781289 777121 773597 770393 767683 765831 765044 765353 766605 768508 771046 774775 780295
52237G80295P155Q071Q725R842J1261J2150J2237J2132J2408J2921J3181J2932
$$ 780295 787450 795521 804246 814088 825349 837499 849736 861868 874276 887197 900378 913310
52225I13310J2243J1265J0177R128Q210P468O906O293N198L421J359l05j273j844
$$ 913310 925553 936818 946995 956123 964333 971801 978707 985000 990198 993619 994978 994673 993400 991556
52211I91556k566l791n470p163q362q970r362r928j0689j1459j2064j2262j1825
$$ 991556 988990 985199 979729 972566 964204 955234 945872 935944 925255 913796 901732 889470 877645
52198H77645j0957j0270r993r591q584p386o730o521n959m746l512k937k939l009
$$ 877645 866688 856418 846425 836834 828250 820864 814134 807613 801654 796908 793396 790459 787520 784511
52184G84511k875k615k321j918j333p68o78j306k159k331j540m85R3K15J61k73
$$ 784511 781636 779021 776700 774782 773449 772681 772003 770697 768538 766207 764667 764182 764275 764490 764651 764378
52168G64378j273k203k244j719j836l033m384m903m606m023l456l129l378m081
$$ 764378 763105 760902 758658 756939 755103 752070 747686 742783 738177 734154 730698 727569 724191 720110
52154G20110m390l661k338j442j390j816k275k616k727k483k068j968k481l391
$$ 720110 715720 712059 709721 708279 706889 705073 702798 700182 697455 694972 692904 690936 688455 685064
52140F85064m189m531m409m066l770l668l748l867l799l412k866k559k691l054
$$ 685064 680875 676344 671935 667869 664099 660431 656683 652816 649017 645605 642739 640180 637489 634435
52126F34435l347l529l646l596l366l263l446l414k577j301p23j313k198k220
$$ 634435 631088 627559 623913 620317 616951 613688 610242 606828 604251 602950 602227 600914 598716 596496
52112E96496j187K00J286J896K112K170K466L347M716O077P035P671Q383R368
$$ 596496 595309 595509 596795 598691 600803 602973 605439 608786 613502 619579 626614 634285 642668 652036
52098F52036J0323J0878J1305J2455J4725J7368J9225J9920J9946J9823J9774
$$ 652036 662359 673237 684542 696997 711722 729090 748315 768235 788181 808004 827778
52087H27778K0099K1076K2283K2759K2091K0836J9622J8395J6996J5789J5109
$$ 827778 847877 868953 891236 913995 936086 956922 976544 994939 1011935 1027724 1042833
52076A042833J4474J3011J0623Q221O647N794M882L418J714L99m53j410k829m357
$$ 1042833 1057307 1070318 1080941 1089162 1095809 1101603 1106485 1109903 1111617 1112016 1111563 1110153 1107324 1102967
52062A102967n634p048r003j0770j1117j0120r242r290r374q510p187o422o174
$$ 1102967 1097333 1090285 1081282 1070512 1059395 1049275 1040033 1030743 1021369 1012859 1005672 999250 993076
52049I93076n704n045m801m814m222k832j398m13M74J617K785L704M472N141N497
$$ 993076 987372 982327 977526 972712 968490 965658 964260 963847 964321 965938 968723 972427 976899 982040 987537
52034I87537N539N607N842O008O089O369O759O675O036N612N836N930M935L138
$$ 987537 993076 998683 1004525 1010533 1016622 1022991 1029750 1036425 1042461 1048073 1053909 1059839 1064774 1067912
52020A067912J600N67o40k221l416l720l720m240n220o074o728p641r034j0662
$$ 1067912 1069512 1070079 1069439 1067218 1063802 1060082 1056362 1052122 1046902 1040828 1034100 1026459 1017425 1006763
52006A006763j2304j3971j5624j7155j8626k0065k1091k1320k1128k1327k1871
$$ 1006763 994459 980488 964864 947709 929083 909018 887927 866607 845479 824152 802281
51995H02281k1759k0683j9869k0516k1977k2601k1959k1060k0528j9862j8783
$$ 802281 780522 759839 739970 719454 697477 674876 652917 631857 611329 591467 572684
51984E72684j8026j8144j8478j8143j7287j6602j6152j5537j4756j4082j3379
$$ 572684 554658 536514 518036 499893 482606 466004 449852 434315 419559 405477 392098
51973C92098j2439j1691j1663j1870j1214r595q157p658p458o661n451m659m466
$$ 392098 379659 367968 356305 344435 333221 323626 315469 307811 300353 293692 288241 283582 279116
51960B79116m283l762l234l025k866k246j224n59r08k030k929k861k091j494j595
$$ 279116 274833 271071 267837 264812 261946 259700 258476 257917 257009 254979 252050 249189 247098 245604 244009
51945B44009k183k764l052k991k631k104j610j312j325j759k577l388l641l171
$$ 244009 241826 239062 236010 233019 230388 228284 226674 225362 224037 222278 219701 216313 212672 209501
51931B09501k406j976k076k308k132j477q47p60j067j105n96o2j39p12j115j003
$$ 209501 207095 205119 203043 200735 198603 197126 196279 195519 194452 193347 192751 192689 192550 191838 190723 189720
51915A89720n96j94J08K13L3k28k42j01k89q92j342j209q00o11n56l34j63n16
$$ 189720 189124 188930 189038 189251 189284 189056 188814 188713 188424 187532 186190 184981 184181 183570 183014 182680 182517 182001
51897A82001j167j289o71j57m88j254j499j058n89m74m40l44n36j095j336p71
$$ 182001 180834 179545 178874 178717 178229 176975 175476 174418 173829 173355 172915 172571 172035 170940 169604 168833
51881A68833kJ0o56j013o07J3L96Q02J377J512P50k23k60P82J912K250J857J303
$$ 168833 168831 168841 168185 167172 166565 166578 166974 167776 169153 170665 171415 171192 170932 171714 173626 175876 177733 179036
51863A79036R66Q45P39N07L12N21J155J666J564J097Q77R74Q74L15l78q36j053
$$ 179036 180002 180847 181586 182093 182405 182926 184081 185747 187311 188408 189285 190259 191133 191448 191070 190234 189181
51846A89181j135j023o69j99K73P58J254J631J757J554J062N87O26J311K103K456
$$ 189181 188046 187023 186354 186155 186428 187186 188440 190071 191828 193382 194444 195031 195657 196968 199071 201527
51830B01527K557K852L090K588J505Q91J222J680J406O79K03q6n68q79l21P21
$$ 201527 204084 206936 210026 212614 214119 215010 216232 217912 219318 219997 220200 220114 219546 218667 218346 219067
51814B19067J008K16m86j45N55L66o52j196n55N89J300J513J625J577J047K58
$$ 219067 220075 220291 219805 219660 220215 220581 219929 218733 218178 218767 220067 221580 223205 224782 225829 226087
51798B26087j03K16P64J046J053J001J052J393K131K827K679J543L38j6K83L88
$$ 226087 225984 226200 226964 228010 229063 230064 231116 232509 234640 237467 240146 241689 242027 242011 242294 242682
51782B42682N6j79Q8O68J180J386J150O33M44J066K056K403J785R04N23P23J275
$$ 242682 242738 242559 242647 243315 244495 245881 247031 247664 248108 249174 251230 253633 255418 256322 256845 257568 258843
51765B58843K070K988L753M293M728M857M095K271j0k046l664m823n183m591l546
$$ 258843 260913 263901 267654 271947 276675 281532 285627 287898 287888 285842 282178 277355 272172 267581 264035
51750B64035k742k364k206k182k209j921j075o7M37K77j00k90k34q0J2m1j36j06
$$ 264035 261293 258929 256723 254541 252332 250411 249336 249269 249706 249983 249883 249593 249359 249279 249291 249250 249114 249008
51732B49008j56p93k021k998k963k230j731j799j949j825j674j814k168k429k409
$$ 249008 248852 248059 246038 243040 240077 237847 236116 234317 232368 230543 228869 227055 224887 222458 220049
51717B20049k098j599j084o35k42j9j76n71p20n74q50j959l034k851j556n42o20
$$ 220049 217951 216352 215268 214633 214391 214372 214196 213625 212905 212331 211481 209522 206488 203637 202081 201539 200919
51700B00919j167j371j291j327j319q95k01L05N86R24J300J354J015P91J341K817
$$ 200919 199752 198381 197090 195763 194444 193549 193348 193653 194239 195163 196463 197817 198832 199623 200964 203781
51684B03781M670O023O404O061N448M556L098J279k32j233k332l988n666o445
$$ 203781 208451 214474 220878 226939 232387 236943 240041 241320 241088 239855 237523 233535 227869 221424
51670B21424o164n462m845m309l803l574l768m069l919l123k054j315j152j281
$$ 221424 215260 209798 204953 200644 196841 193267 189499 185430 181511 178388 176334 175019 173867 172586
51656A72586j302j201j177j138p60k31l04j250k161j888n22P32J058Q34P47P81
$$ 172586 171284 170083 168906 167768 167008 166777 166473 165223 163062 161174 160652 161384 162442 163276 164023 164804
51640A64804N02Nj02L73P94M73m45j136j129q09q19j199j413j130o40m01n01p35
$$ 164804 165306 165311 165209 165582 166376 166849 166404 165268 164139 163330 162511 161312 159899 158769 158129 157728 157227 156492
51622A56492r97j296j427j019L9J301K076K048J503J010Q77R86J096J139J127
$$ 156492 155495 154199 152772 151753 151792 153093 155169 157217 158720 159730 160607 161593 162689 163828 164955
51607A64955R54N64K50M64J192J899K148K062J975J967J981K100K419K791L025
$$ 164955 165909 166473 166723 167187 168379 170278 172426 174488 176463 178430 180411 182511 184930 187721 190746
51592A90746L203L466L654L509L118K756K397J763R03K22j33n24j279k201k812
$$ 190746 193949 197415 201069 204578 207696 210452 212849 214612 215515 215737 215604 215080 213801 211600 208788
51577B08788k839k324j497p01j90J42O07J210J604J725K000K715L522L974M221
$$ 208788 205949 203625 202128 201427 201237 201379 201986 203196 204800 206525 208525 211240 214762 218736 222957
51562B22957M640N012M697L632K567K088J931J449M97m44q28m82L27J073J324
$$ 222957 227597 232609 237306 240938 243505 245593 247524 248973 249470 249026 248198 247716 248043 249116 250440
51547B50440J103Q04P24Q68J227J892K666K865J975L58j044j683j789j785j732
$$ 250440 251543 252347 253071 253939 255166 257058 259724 262589 264564 264922 263878 262195 260406 258621 256889
51532B56889j498j128q05n78l81k14j39j03M6L22M43mj120k318k600j510J83J066
$$ 256889 255391 254263 253458 252880 252499 252285 252146 252043 252089 252411 252854 252850 251730 249412 246812 245302 245485 246551
51514B46551M92p84j534j324o75k34k35n84j052j298j081o05m11p52j310j573
$$ 246551 247043 246259 244725 243401 242726 242492 242257 241673 240621 239323 238242 237637 237226 236474 235164 233591
51498B33591j427j165j083j127r49l21M93Q79N78M3j45p4k00m37j37Q48J794K129
$$ 233591 232164 230999 229916 228789 227840 227519 228012 228891 229469 229512 229367 229293 229093 228656 228519 229367 231161 233290
51480B33290K192K468K672K377K084K658L835M272L385K170J828K272K572K312
$$ 233290 235482 237950 240622 242999 245083 247741 251576 255848 259233 261403 263231 265503 268075 270387
51466B70387J852J566J483J553J744J859J641J075L60l30q06q20m15k26r62k518
$$ 270387 272239 273805 275288 276841 278585 280444 282085 283160 283520 283190 282384 281564 281149 280923 279961 277443
51450B77443l976m562m435m304m494m624m170l273k770l308m515n379n411n015
$$ 277443 273467 268905 264470 260166 255672 251048 246878 243605 240835 237527 233012 227633 222222 217207
51436B17207m651m133l176k140j653j680j595j100n00q8K37N89Q71J004J087J248
$$ 217207 212556 208423 205247 203107 201454 199774 198179 197079 196579 196491 196728 197317 198188 199192 200279 201527
51420B01527J564K082K608K655K036J292R39N23p94k749m080m223l959m042m173
$$ 201527 203091 205173 207781 210436 212472 213764 214703 215226 214432 211683 207603 203380 199421 195379 191206
51405A91206l896l534l495l421k949k619l055l735l601k643j826j607j606j656
$$ 191206 187310 183776 180281 176860 173911 171292 168237 164502 160901 158258 156432 154825 153219 151563
51391A51563k122k950l381k950k067j333r18p94j000j315j344j126j134j463j598
$$ 151563 149441 146491 143110 140160 138093 136760 135842 135048 134048 132733 131389 130263 129129 127666 126068
51376A26068j288r73j048j284j341j265j117p13j77j07o41j021o60j36l33j077
$$ 126068 124780 123807 122759 121475 120134 118869 117752 117039 116862 116755 116114 115093 114433 114297 113964 112887
51360A12887j475j240q03l50K97R04R34N65O94J553K208J893J131R07J319J705
$$ 112887 111412 110172 109369 109019 109316 110220 111154 111719 112413 113966 116174 118067 119198 120105 121424 123129
51344A23129J791J880K029J807J095N30P32J503K119K276K300K477K619K443K079
$$ 123129 124920 126800 128829 130636 131731 132261 132993 134496 136615 138891 141191 143668 146287 148730 150809
51329A50809J826J605R68k47j560k355k545k631l070l753m191m111l786l608l468
$$ 150809 152635 154240 155208 154961 153401 151046 148501 145870 142800 139047 134856 130745 126959 123351 119883
51314A19883k874j765q43p63j253j480j153p62p80j153j636k065k149j538m07
$$ 119883 117009 115244 114401 113638 112385 110905 109752 108990 108210 107057 105421 103356 101207 99669 99262
51299I9262N01P33O43O87P28M29J6K9M86Q94R09N89Q6m47o53k32N68J038P41n1
$$ 99262 99763 100496 101139 101826 102554 102983 102999 103028 103514 104408 105317 105906 105992 105545 104892 104660 105228 106266 107007 106956
51279A06956p18q76n49K5O87J368J847J688P70j86k50M57P83J26p73j111j249
$$ 106956 106238 105362 104813 104838 105525 106893 108740 110428 111198 111012 110762 111219 112002 112128 111355 110244 108995
51262A08995j766k090j286J67P25n6r83j083p52o66o74m06j03p3n0K07L26k0l91
$$ 108995 107229 105139 103853 104020 104745 104689 103706 102623 101871 101205 100531 100125 100022 99949 99899 100106 100432 100412 100021
51243A00021k56Q0J14J40P48J569J647R47N29R60J472J116J73k58K50R76R84K03
$$ 100021 99765 99845 99959 100099 100847 102416 104063 105010 105539 106499 107971 109087 109260 109002 109252 110228 111212 111415
51225A11415o00p24j94M04O09M36J69L7Q6K25L29M28P85J535K338K700K556K230
$$ 111415 110815 110091 109897 110301 110910 111346 111515 111552 111638 111863 112192 112620 113405 114940 117278 119978 122534 124764
51207A24764J795J105M33M37J135J589J060J7n41l23K35P64J166J311J197J166
$$ 124764 126559 127664 128097 128534 129669 131258 132318 132335 131794 131471 131706 132470 133636 134947 136144 137310
51191A37310J399J440Q49K0l94n11q65j204p65K99Q45L99k38m33o72j448k140
$$ 137310 138709 140149 140998 141018 140624 140113 139248 138044 137279 137578 138423 138822 138584 138151 137479 136031 133891
51174A33891j926j174q64j145j409j503j821k208j895p47K84M05k9k32j43k62
$$ 133891 131965 130791 129927 128782 127373 125870 124049 121841 119946 119199 119483 119888 119859 119627 119484 119222
51158A19222o52p56k55M25O03J22n20o77j30P73J425J465J018M71K9m29j017j547
$$ 119222 118570 117814 117559 117984 118587 118709 118189 117512 117382 118155 119580 121045 122063 122534 122563 122134 121117 119570
51140A19570j693j420j026p49n73n02p16j186j411r62k34j46r80j968k185j561
$$ 119570 117877 116457 115431 114682 114109 113607 112891 111705 110294 109332 109098 108952 107972 106004 103819 102258
51124A02258p40k43j44l02m91l88J65Q90J325J349J204J028P33L55J92L86P05
$$ 102258 101518 101275 101131 100829 100338 99950 100115 101005 102330 103679 104883 105911 106644 106999 107191 107577 108282
51107A08282Q89J014J247J428J254P33J80k13m93n71j47Q03J708J999J810J779
$$ 108282 109171 110185 111432 112860 114114 114847 115027 114814 114321 113750 113603 114406 116114 118113 119923 121702
51091A21702K072K139J557P25L67O34J098J421J531J282N44k24k23O05J250R22
$$ 121702 123774 125913 127470 128195 128562 129196 130294 131715 133246 134528 135072 134848 134625 135230 136480 137402
51075A37402J26n5N53J178J363J416J565J499J080Q31J152J610J574J248J305
$$ 137402 137528 137473 138026 139204 140567 141983 143548 145047 146127 146958 148110 149720 151294 152542 153847
51060A53847J677J456K04j288j887j493j072j413k229k585k028j090o48q96j142
$$ 153847 155524 156980 157184 155896 154009 152516 151444 150031 147802 145217 143189 142099 141451 140555 139413
51045A39413o44N64J776K419K466K161J660J072N65K40L2j33j73M3N12J099J671
$$ 139413 138769 139333 141109 143528 145994 148155 149815 150887 151452 151692 151724 151591 151418 151461 151973 153072 154743
51028A54743K054K072J728J289J019Q65O39L94M17P66J087J025O48L05J77J80
$$ 154743 156797 158869 160597 161886 162905 163770 164409 164803 165220 165986 167073 168098 168746 169051 169228 169408
51012A69408K51M90R60J495J883K121K374K695K971L191L545M088M461M245L616
$$ 169408 169659 170149 171109 172604 174487 176608 178982 181677 184648 187839 191384 195472 199933 204178 207794
50997B07794L292L677M317M492M159L978M444N356O218O858P414P959Q441Q853
$$ 207794 211086 214763 219080 223572 227731 231709 236153 241509 247727 254585 261999 269958 278399 287252
50983B87252R205R380R321R403J0315J2340J4934J7211J8825K0242K2140K4745
$$ 287252 296457 305837 315158 324561 334876 347216 362150 379361 398186 418428 440568 465313
50971D65313K7794L0961L4102L7130L9955M2701M5790M9459N3293N6508N8783
$$ 465313 493107 524068 558170 595300 635255 677956 723746 773205 826498 883006 941789
50960I41789O0520O2079O3047O2591O0386N6823N2331M6976M0850L4412K8094
$$ 941789 1002309 1064388 1127435 1190026 1250412 1307235 1359566 1406542 1447392 1481804 1509898
50949A509898K1832J5365Q862K792k794q257j3422j7150j8369j7423j5820j4635
$$ 1509898 1531730 1547095 1555957 1558749 1555955 1547698 1534276 1517126 1498757 1481334 1465514 1450879
50937A450879j3617j2099j0284r189r495j0965j3063j5648j8819k2419k6061k9549
$$ 1450879 1437262 1425163 1414879 1405690 1396195 1385230 1372167 1356519 1337700 1315281 1289220 1259671
50925A259671l2989l6491m0012m3407m6411m8520m9236m8607m7283m5853m4263
$$ 1259671 1226682 1190191 1150179 1106772 1060361 1011841 962605 913998 866715 820862 776599
50914G76599m2073l9108l5655l2118k8769k5750k3052k0462j7821j5320j3297
$$ 776599 734526 695418 659763 627645 598876 573126 550074 529612 511791 496471 483174
50903D83174j1691r996p916n800m224l284k556j640n48L86Q42Q67R03J356J999
$$ 483174 471483 461487 453571 447771 443547 440263 437707 436067 435519 435905 436747 437614 438517 439873 441872
50888D41872K172J722J428J991L031L622L685M040N058O044O311O148O184O387
$$ 441872 444044 445766 447194 449185 452216 455838 459523 463563 468621 474665 480976 487124 493308 499695
50874D99695O394O436P151Q559R960J0907J1669J2617J3774J5129J6876J9022
$$ 499695 506089 512525 519676 528235 538195 549102 560771 573388 587162 602291 619167 638189
50862F38189K1206K3294K5758K9104L3176L7460M1848M6660N2103N8203O5183
$$ 638189 659395 682689 708447 737551 770727 808187 850035 896695 948798 1007001 1072184
50851A072184P3282Q2086R0598R8256J05542J13228J21245J28692J34729J39064
$$ 1072184 1145466 1227552 1318150 1416406 1521948 1635176 1756421 1885113 2019842 2158906
50841B158906J41641J42268J40527J35718J26871J13341R5729P5821N5393L5279
$$ 2158906 2300547 2442815 2583342 2719060 2845931 2959272 3055001 3130822 3186215 3221494
50831C221494J5802k303j8005l0866m1128m8848n3403n4081n0843m4369l5719
$$ 3221494 3237296 3234993 3216988 3186122 3144994 3096146 3042743 2988662 2937819 2893450 2857731
50820B857731k6230j7496j1035p855q257j1838j7714k5148l4096m4831n7016o9559
$$ 2857731 2831501 2814005 2802970 2795115 2786858 2775020 2757306 2732158 2698062 2653231 2596215 2526656
50808B526656q1458r2294j01679j08939j13717j16271j16651j14279j09075j02323
$$ 2526656 2445198 2352904 2251225 2142286 2028569 1912298 1795647 1681368 1572293 1469970
50798A469970r5411q8157p9581p0087o1414n4303m7681m0710l4254k9395k5566
$$ 1469970 1374559 1286402 1206821 1136734 1075320 1021017 973336 932626 898372 868977 843411
50787H43411k1340j6455j1845q044m802k120m81J59O97J773L009L725L872L839
$$ 843411 822071 805616 793771 785727 780925 778805 778324 778483 779180 780953 783962 787687 791559 795398
50773G95398L727L354K762K314K266K504K768K939L073L140K896K045N09j546
$$ 795398 799125 802479 805241 807555 809821 812325 815093 818032 821105 824245 827141 829186 829695 828149
50759H28149l928o461q776j0350j0916j0674r995r010p639n824l523p22K389N434
$$ 828149 824221 817760 808984 798634 787718 777044 767049 758039 750400 744576 741053 740331 742720 748154
50745G48154Q329J1390J4739J7871K0278K2349K5114K9110L3918L8852M3681M8572
$$ 748154 756483 767873 782612 800483 820761 843110 868224 897334 931252 970104 1013785 1062357
50733A062357N3689N9093O4818P0811P6807Q2265Q6451Q8712Q8874Q7190Q3841
$$ 1062357 1116046 1175139 1239957 1310768 1387575 1469840 1556291 1645003 1733877 1821067 1904908
50722A904908P8635P1447O2641N2633M1257K8043J3101k573j7653l0906m1222
$$ 1904908 1983543 2054990 2117631 2170264 2211521 2239564 2252665 2250092 2232439 2201533 2160311
50711B160311m7932n1184n1682m9829m5640l9496l2527k5878j9986j4834j0570
$$ 2160311 2112379 2061195 2009513 1959684 1914044 1874548 1842021 1816143 1796157 1781323 1770753
50700A770753p586o162o429q540j2675j8866k6868l6014m5193n3200n9299o3428
$$ 1770753 1763167 1757005 1750576 1742036 1729361 1710495 1683627 1647613 1602420 1549220 1489921 1426493
50688A426493o5813o6615o5934o3871o0490n5979n0824m5537m0211l4649k8978
$$ 1426493 1360680 1294065 1228131 1164260 1103770 1047791 996967 951430 911219 876570 847592
50677H47592k3653j8788j3982r071m505o21L091P455J2503J7316K0986K3494K5651
$$ 847592 823939 805151 791169 782098 777593 776972 780063 787518 800021 817337 838323 861817 887468
50664H87468K8286L1319L3612L4043L2823L1333L0402K9262K6669K2679J8681
$$ 887468 915754 947073 980685 1014728 1047551 1078884 1109286 1138548 1165217 1187896 1206577
50653A206577J5804J3942J2465J1310J1005J1861J3503J5294J7074J9210K1829
$$ 1206577 1222381 1236323 1248788 1260098 1271103 1282964 1296467 1311761 1328835 1348045 1369874
50642A369874K4277K5786K6577K7726K9826L2347L4563L6437L8115L9157L9019
$$ 1369874 1394151 1419937 1446514 1474240 1504066 1536413 1570976 1607413 1645528 1684685 1723704
50631A723704L7918L6423L4397L1116K6371K0671J4473P916J473m036q236j1386
$$ 1723704 1761622 1798045 1832442 1863558 1889929 1910600 1925073 1932989 1934462 1930426 1922190 1910804
50619A910804j3491j4054j3029j1323r633p388l557J684O801J0357J2123J2755
$$ 1910804 1897313 1883259 1870230 1858907 1849274 1841886 1838329 1840013 1846814 1857171 1869294 1882049
50607A882049J2829J2391J1179R031O112K650j491o806j3624k1789l0873m0385
$$ 1882049 1894878 1907269 1918448 1927479 1933591 1936241 1934750 1927944 1914320 1892531 1861658 1821273
50595A821273m9502n7005o2008o4705o6074o6757o6565o4989o1943n7970n3903
$$ 1821273 1771771 1714766 1652758 1588053 1521979 1455222 1388657 1323668 1261725 1203755 1149852
50584A149852n0357m7350m4371m0974l7222l3498l0013k6730k3603k0556j7321
$$ 1149852 1099495 1052145 1007774 966800 929578 896080 866067 839337 815734 795178 777857
50573G77857j3693r983o829m444k383j92K081M187O094P800R082R943J1033J3116
$$ 777857 764164 754181 747352 742908 740525 740333 742414 746601 752695 760495 769577 779520 790553 803669
50559H03669J6084J9017K1295K3275K5664K8619L1749L4700L7354L9573M1154
$$ 803669 819753 838770 860065 883340 909004 937623 969372 1004072 1041426 1080999 1122153
50548A122153M1977M2005M1063L8940L5795L2297K9200K6868K5274K4362K4233
$$ 1122153 1164130 1206135 1247198 1286138 1321933 1354230 1383430 1410298 1435572 1459934 1484167
50537A484167K5052K6856K9552L3006L7119M1795M6901N2295N7916O3810P0034
$$ 1484167 1509219 1536075 1565627 1598633 1635752 1677547 1724448 1776743 1834659 1898469 1968503
50526A968503P6528Q3063Q9294R4844R9420J02816J04834J05224J03898J01118
$$ 1968503 2045031 2128094 2217388 2312232 2411652 2514468 2619302 2724526 2828424 2929542
50516B929542R7170R1760Q4051P3535O0621M6115L0362J3361m476k2239l9199
$$ 2929542 3026712 3118472 3202523 3276058 3336679 3382794 3413156 3426517 3422041 3399802 3360603
50505C360603n5084o9532q1821r1418r8336j02621j03752j00974r4027q3297o9617
$$ 3360603 3305519 3235987 3154166 3062748 2964412 2861791 2758039 2657065 2563038 2479741 2410124
50494B410124n4244l8686k3919r844L922J6879K7706L5494M0221M1778L9175L1220
$$ 2410124 2355880 2317194 2293275 2283431 2287353 2304232 2331938 2367432 2407653 2449431 2488606 2519826
50482B519826J7833M04j9006l8675n7580p5100r0348j01965j08846j11161j10300
$$ 2519826 2537659 2538063 2519057 2480382 2422802 2347702 2257354 2155389 2046543 1935382 1825082
50471A825082j07569j03276r7290r0101q2755p5864o9268o2698n6313n0377m4761
$$ 1825082 1717513 1614237 1516947 1426846 1344091 1268227 1198959 1136261 1079948 1029571 984810
50460I84810l9161l3576k8334k3698j9659j6102j3005j0406q245o252m100j667
$$ 984810 945649 912073 883739 860041 840382 824280 811275 800869 792624 786372 782272 780605
50448G80605Q19L076N153P415J0008J2481J4161J4836J4987J5347J6309J7752
$$ 780605 781424 784500 789653 797068 807076 819557 833718 848554 863541 878888 895197 912949
50436I12949J9247K0444K1344K2232K3351K4594K5613K6209K6474K6646K6903
$$ 912949 932196 952640 973984 996216 1019567 1044161 1069774 1095983 1122457 1149103 1176006
50425A176006K7274K7627K7734K7509K7134K6799K6417K5814K5297K5561K6980
$$ 1176006 1203280 1230907 1258641 1286150 1313284 1340083 1366500 1392314 1417611 1443172 1470152
50414A470152K9229L1822L4685L7899M1182M4041M6295M8090M9507N0510N1134
$$ 1470152 1499381 1531203 1565888 1603787 1644969 1689010 1735305 1783395 1832902 1883412 1934546
50403A934546N1293N0469M8050M4041L9026L3328K6741J9096J0643J605q163j8723
$$ 1934546 1985839 2036308 2084358 2128399 2167425 2200753 2227494 2246590 2257233 2258838 2250675 2231952
50391B231952k9632m0305n0519o0213o8908p5747q0071q1757q1092p8441p4047
$$ 2231952 2202320 2162015 2111496 2051283 1982375 1906628 1826557 1744800 1663708 1585267 1511220
50380A511220o7945o0226n1343m2004l2581k2923j2863k807O397J3994J9632K3328
$$ 1511220 1443275 1383049 1331706 1289702 1257121 1234198 1221335 1218528 1224925 1238919 1258551 1281879
50368A281879K5198K5026K2111J5945P190k476j1668k0070k7827l4737m0448m4817
$$ 1281879 1307077 1332103 1354214 1370159 1377349 1374873 1363205 1343135 1315308 1280571 1240123 1195306
50356A195306m7650m8568m7718m6061m4326m2137l8931l5313l2478l0497k8298
$$ 1195306 1147656 1099088 1051370 1005309 960983 918846 879915 844602 812124 781627 753329
50345G53329k5320k2249j9812j7852j5888j3871j1898r906p956o328m929l244
$$ 753329 728009 705760 685948 668096 652208 638337 626439 616533 608577 602249 597320 594076
50333E94076j184N97J752K875M544O285P278P747Q739J0592J2413J3254J3181
$$ 594076 592892 593489 595241 598116 602660 608945 616223 623970 632709 643301 655714 668968 682149
50320F82149J2931J2904J2919J2803J2862J3567J4946J6490J7771J8846J9781
$$ 682149 695080 707984 720903 733706 746568 760135 775081 791571 809342 828188 847969
50309H47969K0135J9486J8361J7845J8031J7639J5672J2805J0508R120P654N344
$$ 847969 868104 887590 905951 923796 941827 959466 975138 987943 998451 1007571 1015225 1020569
50297A020569K636L92j217k682m315n866o924p445p732p995q225q600r689j1807
$$ 1020569 1023205 1023597 1022380 1019698 1015383 1009517 1002593 995148 987416 979421 971196 962596 952907 941100
50283I41100j4286j5957j6453j6536j6963j7570j7771j7409j6678j5699j4769
$$ 941100 926814 910857 894404 877868 860905 843335 825564 808155 791477 775778 761009
50272G61009j4643j5793j7498j8322j7571j5820j4024j2648j1638j0722r499p630
$$ 761009 746366 730573 713075 694753 677182 661362 647338 634690 623052 612330 602831 595201
50260E95201n277l127j798j303j056m33O52J643J948J776K054L310M944N935N963
$$ 595201 589924 586797 584999 583696 582640 582207 582859 584502 586450 588226 590280 593590 598534 604469 610432
50245F10432N451M792M073L412K989K728K374J875J246K22j394l088m050m216
$$ 610432 615883 620675 624748 628160 631149 633877 636251 638126 639372 639594 638200 635112 631062 626846
50231F26846m308m689m928m714m536m946n665n963n584m888m273l904l782l724
$$ 626846 622538 617849 612921 608207 603671 598725 593060 587097 581513 576625 572352 568448 564666 560942
50217E60942l334k325p86R67K628L886M425M266L933L980M388M595M086K879J569
$$ 560942 557608 555283 554497 555464 558092 561978 566403 570669 574602 578582 582970 587565 591651 594530 596099
50202E96099Q58Q75R96N25m32j140j262j253j581k154k709l264l810m079m067
$$ 596099 596957 597832 598828 599353 598921 597781 596519 595266 593685 591531 588822 585558 581748 577669 573602
50187E73602m343n219o062o102n651n717o574p517p999q199q306q092p503p031
$$ 573602 569259 564040 557978 551876 546225 540508 533934 526417 518418 510219 501913 493821 486318 479287
50173D79287o898o492n116l034j167rO95J307J901K441K884K915K037J37k148
$$ 479287 472389 465897 460781 457747 456580 456571 457266 458573 460474 462915 465799 468714 470751 470888 468740
50158D68740l890m650m738m732m832m758m269l645l429l683l753l026j715o67
$$ 468740 464850 460200 455462 450730 445898 441140 436871 433226 429797 426114 422361 419335 417620 416953
50144D16953l94n91o03j45N77J201J483J355R35N36N22J063J992K974L813M552
$$ 416953 416559 415968 415365 415220 415797 416998 418481 419836 420771 421307 421829 422892 424884 427858 431671 436223
50128D36223N275N808N860N455N069N139N535N733N484N011M556M017L229K404
$$ 436223 441498 447306 453166 458621 463690 468829 474364 480097 485581 490592 495148 499165 502394 504798
50114E04798J985K066K210J897J051O1o69j090j423j746j825j476q87m16j17J94
$$ 504798 506783 508849 511059 512956 514007 514068 513399 512309 510886 509140 507315 505839 504952 504536 504419 504613
50098E04613N09O87J014K125M017N641O068N752N997P282Q744R357R048Q457Q197
$$ 504613 505122 505809 506823 508948 512965 518606 524674 530426 536423 543705 552449 561806 570854 579311 587508
50083E87508Q630R838J1465J2811J3444J3595J3856J4692J6329J8617K0896K2438
$$ 587508 596138 605976 617441 630252 643696 657291 671147 685839 702168 720785 741681 764119
50071G64119K3257K4091K5366K6718K7855K9263L1424L3908L5929L7484L8974
$$ 764119 787376 811467 836833 863551 891406 920669 952093 986001 1021930 1059414 1098388
50060A098388L9978L9349L6640L2615K8089K3122J7795J3017R910Q730Q874R677
$$ 1098388 1138366 1177715 1214355 1246970 1275059 1298181 1315976 1328993 1338903 1347633 1356507 1366184
50048A366184J0720J1514J1414R889O620J490n271j2925k0505k7441l3663l9072
$$ 1366184 1376904 1388418 1399832 1409721 1416341 1417831 1412560 1399635 1379130 1351689 1318026 1278954
50036A278954m3075m4967m4748m3332m1691l9898l7356l3939l0419k7594k5404
$$ 1278954 1235879 1190912 1146164 1102832 1061141 1021243 983887 949948 919529 891935 866531
50025H66531k3323k1233j9382j7716j5857j3709j1570r626p813o161m764l412
$$ 866531 843208 821975 802593 784877 769020 755311 743741 734115 726302 720141 715377 711965
50013G11965j853m21J95k2k10L11J342K386L249L755L450K205O00p69k010l440
$$ 711965 710112 709691 709886 709864 709654 709965 711307 713693 716942 720697 724147 726352 726952 726183 724173 720733
49997G20733m759n380n331n237n531o163o944p694q173q302q452q981r642r799
$$ 720733 715974 710594 705263 700026 694495 688332 681388 673694 665521 657219 648767 639786 630144 620345
49983F20345r200q145o973n880n089m709m437l867l071k421j871j002J64J051
$$ 620345 611145 603000 596027 590147 585058 580349 575912 572045 568974 566553 564682 563680 563844 564895
49969E64895J454J944K987M182M846N068N570O614P578P789P456P470Q437J0067
$$ 564895 566349 568293 571280 575462 580308 585376 590946 597560 605138 612927 620383 627853 636290 646357
49955F46357J1693J3194J5126J7921K1293K4741K8373L2707L7671M2335M5779
$$ 646357 658050 671244 686370 704291 725584 750325 778698 811405 849076 891411 937190
49944I37190M7786M8428M7365M4139L9057L3347K8355K4758K2591K1726K2022
$$ 937190 984976 1033404 1080769 1124908 1163965 1197312 1225667 1250425 1273016 1294742 1316764
49933A316764K3159K4575K5629K5676K3982J9820J2984M158n511j5232k4722l3544
$$ 1316764 1339923 1364498 1390127 1415803 1439785 1459605 1472589 1476747 1471236 1456004 1431282 1397738
49921A397738m0793m5762m8722n0584n1906n2560n2327n1371m9981m8207m5954
$$ 1397738 1356945 1311183 1262461 1211877 1159971 1107411 1055084 1003713 953732 905525 859571
49910H59571m3241m0233l7123l4099l1305k8713k6194k3724k1475j9574j7892
$$ 859571 816330 776097 738974 704875 673570 644857 618663 594939 573464 553890 535998
49899E35998j6124j4093j1913r935q447p477o808o280n929n788n686n480n318
$$ 535998 519874 505781 493868 483933 475486 468009 461201 454921 448992 443204 437518 432038 426720
49886D26720n452n781n868n510n000m665m343l610k491j693j865k773l390k950
$$ 426720 421268 415487 409619 404109 399109 394444 390101 386491 384000 382307 380442 377669 374279 371329
49872C71329j756q40q85j675k467k656k052q84L10J024J196J170J182J158J076
$$ 371329 369573 368733 367848 366173 363706 361050 358998 358114 358424 359448 360644 361814 362996 364154 365230
49857C65230J210J728K371K724K640K190J585J302J875L171M264M502M246M100
$$ 365230 366440 368168 370539 373263 375903 378093 379678 380980 382855 386026 390290 394792 399038 403138
49843D03138L885L191K482K664L660M436M559M773N711P046Q344R937J2196J4664
$$ 403138 407023 410214 412696 415360 419020 423456 428015 432788 438499 445545 453889 463826 476022 490686
49829D90686J6692J8559K1154K4736K8677L2305L5329L7398L7873L6357L3174
$$ 490686 507378 525937 547091 571827 600504 632809 668138 705536 743409 779766 812940
49818H12940K9140K4912K0658J6333J2205R067P724Q309J0196J2532J4463J4977
$$ 812940 842080 866992 887650 903983 916188 925255 932979 941288 951484 964016 978479 993456
49806I93456J3142Q801K647m708j3215k2562l1353l7896m1671m3475m4126m3547
$$ 993456 1006598 1015399 1018046 1013338 1000123 977561 946208 908312 866641 823166 779040 735493
49794G35493m1304l7573l3328k9672k7089k5172k3062k0300j7256j4629j2666
$$ 735493 694189 656616 623288 593616 566527 541355 518293 497993 480737 466108 453442
49783D53442j1061r534q179p276o898o811o593n907m761l544k665k198j888j501
$$ 453442 442381 432847 424668 417392 410494 403683 397090 391183 386422 382878 380213 378015 376127 374626
49769C74626j022n94l39k28j02R1J52j25n28n31R8R89J630J922K056K164K231
$$ 374626 373604 373010 372671 372443 372341 372432 372584 372459 371931 371400 371498 372487 374117 376039 378095 380259 382490
49752C82490K214K014J523R40Q05J467K605L520L758L307K436J591J291J730K532
$$ 382490 384704 386718 388241 389181 389986 391453 394058 397578 401336 404643 407079 408670 409961 411691 414223
49737D14223L109L189K903K586K597L087L682L734L111K428K199K130J711J054
$$ 414223 417332 420521 423424 426010 428607 431694 435376 439110 442221 444649 446848 448978 450689 451743
49723D51743N99K72l19j012j161o66j92k18l95j55M96J038J014M17k16j76O52
$$ 451743 452342 452614 452295 451283 450122 449456 449264 449046 448651 448496 448992 450030 451044 451461 451245 451069 451721
49706D51721J517J757J774K426L510L784K761J577J542K502L303L359L022K737
$$ 451721 453238 454995 456769 459195 462705 466489 469250 470827 472369 474871 478174 481533 484555 487292
49692D87292K552K377K133J688J124R62J603K550K771J906O76r6l79o98j320k027
$$ 487292 489844 492221 494354 496042 497166 498128 499731 502281 505052 506958 507634 507538 507159 506461 505141 503114
49676E03114k492k555k177j420n01K58P05R98J376J797J924J546Q82L42M4j39
$$ 503114 500622 498067 495890 494470 493969 494227 494932 495930 497306 499103 501027 502573 503455 503797 503841 503702
49660E03702k00N6N34P21L27j99j59M93J091J079N31k04r44j578j810j453q34
$$ 503702 503502 503558 504092 504813 505140 504941 504782 505275 506366 507445 507976 507772 506828 505250 503440 501987 501153
49643E01153n22o55q46q67r89j354j422n95P43J401Q25j48l55L10R95J114R16
$$ 501153 500631 499976 499130 498263 497274 495920 494498 493903 494646 496047 496872 496724 496369 496679 497674 498788 499704
49626D99704Q36Q03M60k34q26p73L9J181K081K545K768K814K519K009J934K715
$$ 499704 500540 501343 501803 501569 500743 499970 500009 501190 503271 505816 508584 511398 513917 515926 517860 520575
49610E20575L807M283L995L620L649L936M359N181O456P640Q228Q415Q727R290
$$ 520575 524382 528665 532660 536280 539929 543865 548224 553405 559861 567501 575729 584144 592871 602161
49596F02161R802J0094J0337J0744J1324J1922J2336J2521J2757J3421J4578J5943
$$ 602161 611963 622057 632394 643138 654462 666384 678720 691241 703998 717419 731997 747940
49584G47940J7275J8567J9763K0691K1422K2384K3859K5622K7275K8663K9818
$$ 747940 765215 783782 803545 824236 845658 868042 891901 917523 944798 973461 1003279
$$ [...]
##END NTUPLES=NMR SPECTRUM
##END=
