
##TITLE=AC1326_CRIAH12155_6535781_QMejfoLb3n
##JCAMPDX= 6.0         $$ Bruker NMR JCAMP-DX V2.0
##DATA TYPE= NMR SPECTRUM
##DATA CLASS= NTUPLES
##ORIGIN= BRUKER
##OWNER= Administrator
$$ 1.72 TOPSPIN		Version 2.1
$$ 2012-07-17 22:49:55.109 -0500  Administrator@TOPSPIN
$$ Compression mode = diff/dup
##.OBSERVE FREQUENCY= 400.02188249412
##.OBSERVE NUCLEUS= ^1H
##.ACQUISITION MODE= SIMULTANEOUS (DQD)
##.ACQUISITION SCHEME= undefined
##.AVERAGES= 64
##.DIGITISER RES= 22
##SPECTROMETER/DATA SYSTEM= spect
##.PULSE SEQUENCE= noesygpps1d.comp
##.SOLVENT NAME= COFFEE_meoh
##.SHIFT REFERENCE= INTERNAL, COFFEE_meoh, 1, 14.96076
##AUDIT TRAIL= $$ (NUMBER, WHEN, WHO, WHERE, PROCESS, VERSION, WHAT)
$$ ##TITLE= Audit trail, TOPSPIN		Version 2.1
$$ ##JCAMPDX= 5.01
$$ ##ORIGIN= Bruker BioSpin GmbH
$$ ##OWNER= Administrator
$$ $$ C:\Bruker\TOPSPIN/data/COFFEE/nmr/AC1326_CRIAH12155_6535781_QMejfoLb3n/12/pdata/1/auditp.txt
$$ ##AUDIT TRAIL=  $$ (NUMBER, WHEN, WHO, WHERE, PROCESS, VERSION, WHAT)
(   1,<2012-07-17 22:49:50.218 -0500>,<Administrator>,<TOPSPIN>,<go>,<TOPSPIN 2.1>,
      <created by zg
	started at 2012-07-17 22:38:20.015 -0500,
	POWCHK enabled, PULCHK disabled,
       configuration hash MD5:
       6B 1B 68 BB D9 2E 58 E2 7F 35 AD 54 07 DF 0E 41
       data hash MD5: 64K
       DC 80 FF F4 0B 7E 6A 48 E0 17 DC 05 24 AE 7F FB>)
(   2,<2012-07-17 22:49:53.125 -0500>,<Administrator>,<TOPSPIN>,<proc1d>,<TOPSPIN 2.1>,
      <Start of raw data processing
       efp LB = 0.3 FT_mod = 6 PKNL = 1 PHC0 = 0 PHC1 = 0 SI = 128K 
       data hash MD5: 128K
       56 3C C9 1D BF 5D 74 51 D9 85 3B 24 05 FC 0D 43>)
(   3,<2012-07-17 22:49:54.359 -0500>,<Administrator>,<TOPSPIN>,<proc1d>,<TOPSPIN 2.1>,
      <pk PHC0 = 1.087646 PHC1 = 0 
       data hash MD5: 128K
       A8 26 F5 64 01 7D 5E 0D 44 70 C0 AA 8B 1C F0 76>)
(   4,<2012-07-17 22:49:54.593 -0500>,<Administrator>,<TOPSPIN>,<proc1d>,<TOPSPIN 2.1>,
      <abs ABSG = 1 
       data hash MD5: 128K
       39 DD BF FB 35 E0 DB B5 6E 85 88 88 75 E5 9F FC>)
(   5,<2012-07-17 22:49:54.671 -0500>,<Administrator>,<TOPSPIN>,<proc1d>,<TOPSPIN 2.1>,
      <abs ABSG = 2 
       data hash MD5: 128K
       21 E2 BC 86 99 3C 1B 22 21 D1 17 76 EB 80 0C 98>)
(   6,<2012-07-17 22:49:54.734 -0500>,<Administrator>,<TOPSPIN>,<proc1d>,<TOPSPIN 2.1>,
      <abs ABSG = 3 
       data hash MD5: 128K
       D3 B5 1A C7 12 D5 34 3F 3A 97 8A 0C 41 6A 00 5B>)
(   7,<2012-07-17 22:49:54.968 -0500>,<Administrator>,<TOPSPIN>,<proc1d>,<TOPSPIN 2.1>,
      <abs ABSG = 4 
       data hash MD5: 128K
       94 37 C7 2D 31 D5 EA AB 3D 42 85 16 4B 64 B8 59>)
(   8,<2012-07-17 22:49:55.015 -0500>,<Administrator>,<TOPSPIN>,<proc1d>,<TOPSPIN 2.1>,
      <abs ABSG = 5 
       data hash MD5: 128K
       C6 B7 2D CE E9 41 D8 51 1E D6 C9 98 BD 55 1F 60>)
$$ ##END=
$$ 
$$ $$ hash MD5
$$ $$ 07 85 0C 70 E1 B2 46 3C FD 4E 1A D3 29 27 C5 BD
##$RELAX= 
##$RELAX= 
##$RELAX= 
##$RELAX= 
##$RELAX= 
##$RELAX= 
##$RELAX= 
##$RELAX= 
$$ Bruker specific parameters
$$ [...]
##$TP07= 0
##$TPNAME0= <>
##$TPNAME1= <>
##$TPNAME2= <>
##$TPNAME3= <>
##$TPNAME4= <>
##$TPNAME5= <>
##$TPNAME6= <>
##$TPNAME7= <>
##$TPOAL= (0..7)
0.5 0.5 0.5 0.5 0.5 0.5 0.5 0.5
##$TPOFFS= (0..7)
0 0 0 0 0 0 0 0
##$TUNHIN= 0
##$TUNHOUT= 0
##$TUNXOUT= 0
##$USERA1= <user>
##$USERA2= <user>
##$USERA3= <user>
##$USERA4= <user>
##$USERA5= <user>
##$V9= 5
##$VALIST= <valist>
##$VCLIST= <CCCCCCCCCCCCCCC>
##$VD= 0
##$VDLIST= <DDDDDDDDDDDDDDD>
##$VPLIST= <PPPPPPPPPPPPPPP>
##$VTLIST= <TTTTTTTTTTTTTTT>
##$WBST= 2048
##$WBSW= 25
##$XGAIN= (0..3)
0 0 0 0
##$XL= 0
##$YL= 0
##$YMAX_a= 12145672
##$YMIN_a= -9435077
##$ZGOPTNS= <>
##$ZL1= 120
##$ZL2= 120
##$ZL3= 120
##$ZL4= 120
##$ABSF1= 14.96076
##$ABSF2= -5.597422
##$ABSG= 5
##$ABSL= 3
##$ALPHA= 0
##$AQORDER= 0
##$ASSFAC= 0
##$ASSFACI= 0
##$ASSFACX= 0
##$ASSWID= 0
##$AUNMP= <proc_prof1d_extract.lims>
##$AXLEFT= 0
##$AXNAME= <>
##$AXNUC= <1H>
##$AXRIGHT= 0
##$AXTYPE= 0
##$AXUNIT= <>
##$AZFE= 0.1
##$AZFW= 0.1
##$BCFW= 0
##$BC_mod= 0
##$BYTORDP= 0
##$COROFFS= 0
##$CY= 15
##$DATMOD= 1
##$DC= 0
##$DFILT= <>
##$DTYPP= 0
##$F1P= 0
##$F2P= 0
##$FCOR= 0.5
##$FTSIZE= 131072
##$FT_mod= 6
##$GAMMA= 0
##$GB= 0
##$INTBC= 1
##$INTSCL= 1
##$ISEN= 128
##$LB= 0.3
##$LEV0= 0
##$LPBIN= 0
##$MAXI= 10000
##$MC2= 0
##$MEAN= 0
##$ME_mod= 0
##$MI= 0
##$NCOEF= 0
##$NC_proc= -2
##$NLEV= 6
##$NOISF1= 0
##$NOISF2= 0
##$NSP= 0
##$NTH_PI= 0
##$NZP= 0
##$OFFSET= 14.96076
##$PC= 1
##$PHC0= 1.087646
##$PHC1= 0
##$PH_mod= 1
##$PKNL= yes
##$PPARMOD= 0
##$PPDIAG= 0
##$PPIPTYP= 0
##$PPMPNUM= 2147483647
##$PPRESOL= 1
##$PSCAL= 4
##$PSIGN= 0
##$PYNMP= <proc.py>
##$REVERSE= no
##$SF= 400.020009734278
##$SI= 131072
##$SIGF1= 0
##$SIGF2= 0
##$SINO= 400
##$SIOLD= 131072
##$SPECTYP= <>
##$SREGLST= <1H.CDCl3>
##$SSB= 0
##$STSI= 131072
##$STSR= 0
##$SW_p= 8223.68421052631
##$SYMM= 0
##$S_DEV= 0
##$TDeff= 65536
##$TDoff= 0
##$TI= <>
##$TILT= no
##$TM1= 0
##$TM2= 0
##$TOPLEV= 0
##$USERP1= <user>
##$USERP2= <user>
##$USERP3= <user>
##$USERP4= <user>
##$USERP5= <user>
##$WDW= 1
##$XDIM= 131072
##$YMAX_p= 410528313
##$YMIN_p= -11826
##$CURPLOT= <Network HP LaserJet P1505>
##$CURPRIN= <$Network HP LaserJet P1505>
##$DFORMAT= <normdp>
##$LAYOUT= <+/1D_H.xwp>
##$LFORMAT= <normlp>
##$PFORMAT= <normpl>
##$SURQMSG= 1
$$ End of Bruker specific parameters
$$ ---------------------------------
##NTUPLES= NMR SPECTRUM
##VAR_NAME=  FREQUENCY,     SPECTRUM/REAL,   SPECTRUM/IMAG
##SYMBOL=    X,             R,               I
##VAR_TYPE=  INDEPENDENT,   DEPENDENT,       DEPENDENT
##VAR_FORM=  AFFN,          ASDF,            ASDF
##VAR_DIM=   131072,        131072,          131072
##UNITS=     HZ,            ARBITRARY UNITS, ARBITRARY UNITS
##FACTOR=    0.0627417313425164, 1,          1
##FIRST=     8223.62146879497, 1234,         -63816
##LAST=      0,             2515,            -63473
##MIN=       0,             -11826,          0
##MAX=       8223.62146879497, 410528313,    0
$$ Real data points
##PAGE= N=1
##DATA TABLE= (X++(R..R)), XYDATA
$$ [...]
$$ plain form
63924 5094747 5050357 4969123 4852171 4702175 4523219 4320059 4097999 3863210 3622157 3380216
63914 3380216 3141149 2908075 2684279 2472707 2275222 2092885 1926578 1776713 1642650
63905 1642650 1523196 1417657 1325733 1246375 1177447 1116885 1063681 1017447 977459 942535 911531
63894 911531 883506 857497 832547 808045 783929 760579 738577 718407 700190 683710 668691
63883 668691 654990 642671 632158 624256 619674 618442 620103 624405 631400 640842 652170 665331 680914
63870 680914 699036 718730 739053 760313 783410 808303 833913 859328 884210 908113 930330
63859 930330 950623 969297 986265 1000700 1011891 1019856 1024754 1026247 1023843 1017469 1007405 994024
63847 994024 977902 959691 939524 916975 891959 865268 837747 809397 779812 749198 718331
$$ packed form
63924E094747m4390q1234j16952j49996j78956k03160k22060k34789k41053k41941
63914C380216k39067k33074k23796k11572j97485j82337j66307j49865j34063
63905A642650j19454j05539r1924p9358o8928o0562n3204m6234l9988l4924l1004
63894I11531k8025k6009k4950k4502k4116k3350k2002k0170j8217j6480j5019
63883F68691j3701j2319j0513p902m582j232J661M302O995R442J1328J3161J5583
63870F80914J8122J9694K0323K1260K3097K4893K5610K5415K4882K3903K2217
63859I30330K0293J8674J6968J4435J1191P965M898J493k404o374j0064j3381
63847I94024j6122j8211k0167k2549k5016k6691k7521k8350k9585l0614l0867
$$ plain form
63836 718331 687701 657341 627420 598451 570832 544670 520157 497753 477825 460255 444452
63825 444452 429586 414965 400506 386789 374405 363256 352745 342572 333028 324579 317484 311772
63813 311772 307178 302995 298425 293336 288439 284554 281850 279924 278392 277129 276074 275067 273930 272554
63799 272554 270842 268618 265750 262369 258914 255842 253293 251170 249467 248282 247404 246163 244012 241163
63785 241163 238397 236277 234772 233609 232652 231793 230674 228867 226368 223770 221839 220926 220855 221344 222303 223604
63769 223604 224726 224994 224232 222946 221799 221100 220871 221065 221486 221695 221317 220441 219556 219167 219485 220312 221076 221205
63751 221205 220636 219907 219608 219941 220838 222182 223655 224762 225385 226147 227805 230426 233506 236747 240265 244057
63735 244057 247708 250769 253165 255198 257338 259950 262959 265834 268198 270405 273187 276789 280818 284925
$$ packed form
63836G18331l0630l0360k9921k8969k7619k6162k4513k2404j9928j7570j5803
63825D44452j4866j4621j4459j3717j2384j1149j0511j0173r544q449p095n712
63813C11772m594m183m570n089m897l885k704j926j532j263j055j007j137j376
63799B72554j712k224k868l381l455l072k549k123j703j185q78j241k151k849
63785B41163k766k120j505j163r57q59j119j807k499k598j931r13p1M89R59J301
63769B23604J122K68p62j286j147o99k29J94M21K09l78q76q85l89L18Q27P64J29
63751B21205n69p29k99L33Q97J344J473J107O23P62J658K621L080L241L518L792
63735B44057L651L061K396K033K140K612L009K875K364K207K782L602M029M107
$$ plain form
63721 284925 289201 293860 298862 303993 308975 313425 317031 319857 322155 323794 324214 323020 320301 316308
63707 316308 311351 306214 302084 299509 297695 295426 292579 290253 289371 289594 289824 289509 289147 289546 290909 292865
63691 292865 295228 298308 302259 306465 310040 312846 315529 318491 321335 323512 325027 326186 327015 327358 327296
63676 327296 327037 326566 325824 325140 325024 325506 326135 326679 327473 328919 330971 333277 335486 337192 337884 337329 335925
63659 335925 334257 332285 329312 324874 319396 313789 308577 303691 299002 294744 291316 288841 287070 285702
63645 285702 284760 284674 285856 288070 290361 291875 292760 293939 295987 298606 301332 304303 307971 312412 317415
63630 317415 323027 329409 336147 342354 347732 353090 359510 367263 375876 385047 395056 406287 418735
63617 418735 432236 446992 463477 481753 501148 520961 541351 563148 586757 611788 637990
$$ packed form
63721B84925M276M659N002N131M982M450L606K826K298J639M20j194k719l993
63707C16308m957n137m130k575j814k269k847k326q82K23K30l15l62L99J363J956
63691B92865K363L080L951M206L575K806K683K962K844K177J515J159Q29L43o2
63676C27296k59m71p42o84j16M82O29N44P94J446K052K306K209J706O92n55j404
63659C35925j668j972k973m438n478n607n212m886m689m258l428k475j771j368
63645B85702r42q6J182K214K291J514Q85J179K048K619K726K971L668M441N003
63630C17415N612O382O738O207N378N358O420P753Q613R171J0009J1231J2448
63617D18735J3501J4756J6485J8276J9395J9813K0390K1797K3609K5031K6202
$$ plain form
63606 637990 665934 696176 728024 759790 790096 818183 842910 862334 874819 880203 879670 874883
63594 874883 867547 859238 850998 843149 835779 829060 822650 815038 804175 788887 769361 746377 720681
63581 720681 693256 665524 638721 613255 589117 566753 547063 530492 516636 504962 495533 488695
63569 488695 484320 481900 481236 482497 485525 489668 494562 500580 508119 516800 525859 535021 544473 554176
63555 554176 563879 573872 585198 598950 615675 635472 658272 683946 712475 744159 779332 817697
63543 817697 858115 898940 938208 973500 1002128 1021818 1031390 1031213 1023478 1011750 999378 987925
63531 987925 977349 967523 958864 951459 944357 936062 925126 910051 889477 863108 831983 797398
63519 797398 760058 720789 681354 643726 608784 576408 546602 519844 496444 476217 458752
$$ packed form
63606F37990K7944L0242L1848L1766L0306K8087K4727J9424J2485N384n33m787
63594H74883p336q309q240p849p370o719o410p612j0863j5288j9526k2984k5696
63581G20681k7425k7732k6803k5466k4138k2364j9690j6571j3856j1674r429o838
63569D88695m375k420o64J261L028M143M894O018P539Q681R059R162R452R703
63555E54176R703R993J1326J3752J6725J9797K2800K5674K8529L1684L5173L8365
63543H17697M0418M0825L9268L5292K8628J9690R572j77p735j1728j2372j1453
63531I87925j0576r826q659p405p102q295j0936j5075k0574k6369l1125l4585
63519G97398l7340l9269l9435l7628l4942l2376k9806k6758k3400k0227j7465
$$ plain form
63508 458752 443530 429881 417414 406416 397277 389605 382491 375685 369871 365613 362458 359323 355517
63495 355517 351259 347429 344871 343722 343413 343369 343566 344160 344862 345142 345001 345064 345912 347639 350065 353031 356432
63478 356432 360233 364450 368915 373199 377048 380647 384140 387068 388771 389119 388336 386248 382478 377361 371975
63463 371975 367038 362391 357810 353730 350761 348866 347437 345997 344600 343684 343659 344468 345592 346739 348416
63448 348416 351369 355559 360266 365259 371101 378100 385707 393500 402136 412634 425074 438764 453569
63435 453569 470462 490677 514677 542012 571792 603067 634719 664933 691064 710733 723601
63424 723601 731857 738560 745676 753897 763820 776477 792783 813175 837905 867052 899999 935355
63412 935355 971700 1007960 1042716 1073580 1097889 1114063 1122083 1122883 1117802 1108586 1097187 1085035
$$ packed form
63508D58752j5222j3649j2467j0998r139p672p114o806n814m258l155l135l806
63495C55517m258l830k558j149l09m4J97N94P02K80j41O3Q48J727K426K966L401
63478C56432L801M217M465M284L849L599L493K928J703L48p83k088l770n117n386
63463C71975m937m647m581m080k969j895j429j440j397r16k5Q09J124J147J677
63448C48416K953M190M707M993N842O999P607P793Q636J0498J2440J3690J4805
63435D53569J6893K0215K4000K7335K9780L1275L1652L0214K6131J9669J2868
63424G23601Q256O703P116Q221R923J2657J6306K0392K4730K9147L2947L5356
63412I35355L6345L6260L4756L0864K4309J6174Q020Q00n081r216j1399j2152
$$ plain form
63400 1085035 1072581 1059782 1046746 1033479 1019153 1002234 981613 957233 929421 898005 862666
63389 862666 824034 783972 744703 707897 674499 644862 618788 595743 575346 557599 542570
63378 542570 530116 520073 512474 507375 504593 503886 505320 509241 515832 524757 535316 546932 559580
63365 559580 573691 589588 607110 625951 646267 668648 693512 720809 750365 782116 815850
63354 815850 851070 887360 924552 962103 998430 1031237 1058572 1079463 1093716 1101417 1102689 1097797
63342 1097797 1087590 1073909 1059297 1045800 1033830 1022268 1009607 994878 977644 957525 933956
63331 933956 906438 874989 840435 804206 767770 732261 698648 668006 641309 619027 601136
63320 601136 587482 577825 571491 567270 563794 559790 553852 544347 530090 511344 489979 468461 448577
$$ packed form
63400A085035j2454j2799j3036j3267j4326j6919k0621k4380k7812l1416l5339
63389H62666l8632m0062l9269l6806l3398k9637k6074k3045k0397j7747j5029
63378E42570j2454j0043p599n099k782p07J434L921O591Q925J0559J1616J2648
63365E59580J4111J5897J7522J8841K0316K2381K4864K7297K9556L1751L3734
63354H15850L5220L6290L7192L7551L6327L2807K7335K0891J4253P701J272m892
63342A097797j0207j3681j4612j3497j1970j1562j2661j4729j7234k0119k3569
63331I33956k7518l1449l4554l6229l6436l5509l3613l0642k6697k2282j7891
63320F01136j3654r657o334m221l476m004n938r505j4257j8746k1365k1518j9884
$$ plain form
63307 448577 430939 415383 401574 389323 378666 369853 363140 358446 355219 352735 350471 348151 345630
63294 345630 342967 340479 338385 336429 334168 331666 329519 328050 326817 325169 322973 320470 317697 314538
63280 314538 311246 308429 306431 305085 304201 303983 304701 306111 307498 308337 308759 309353 310529 312146 313798 315418
63264 315418 317409 320054 322961 325368 327036 328611 330993 334522 338839 343375 347751 351832 355653 359390
63250 359390 363210 367105 370952 374836 379237 384765 391726 399988 409270 419484 430775 443291 456948
63237 456948 471461 486657 502771 520276 539305 559346 579715 600304 621562 643734 666399
63226 666399 688952 711220 733341 755266 776813 798157 819917 842681 866634 891584 916976
63215 916976 941840 965074 985987 1004367 1019959 1032106 1040060 1043374 1041768 1034812 1022042 1003450
$$ packed form
63307D48577j7638j5556j3809j2251j0657q813o713m694l227k484k264k320k521
63294C45630k663k488k094j956k261k502k147j469j233j648k196k503k773l159
63280C14538l292k817j998j346q84k18P18J410J387Q39M22N94J176J617J652J620
63264C15418J991K645K907K407J668J575K382L529M317M536M376M081L821L737
63250C59390L820L895L847L884M401N528O961Q262R282J0214J1291J2516J3657
63237D56948J4513J5196J6114J7505J9029K0041K0369K0589K1258K2172K2665
63226F66399K2553K2268K2121K1925K1547K1344K1760K2764K3953K4950K5392
63215I16976K4864K3234K0913J8380J5592J2147P954L314j606o956j2770j8592
$$ plain form
63203 1003450 979779 952407 923005 893164 864110 836641 811226 788132 767595 750080 736301
63192 736301 726733 721075 718496 718411 720812 725874 733717 744653 759183 777342 798335 821157 845308
63179 845308 870634 896775 923347 950493 978670 1007781 1036917 1065126 1092137 1118164 1143228
63168 1143228 1166795 1187898 1205450 1218526 1226489 1228840 1224983 1214216 1196061 1170662 1139009 1102733
63156 1102733 1063439 1022039 978825 934271 889535 845952 804313 765020 728690 696047 667179
63145 667179 641449 618343 597961 580456 565393 552094 540336 530298 521974 515073 509438 505091
63133 505091 501766 498803 495724 492705 490233 488481 487278 486569 486600 487635 489694 492562 495849 499045 501797
63118 501797 504240 506838 509780 512796 515707 518833 522544 526606 530408 533712 536767 539746 542483 544829
$$ packed form
63203A003450k3671k7372k9402k9841k9054k7469k5415k3094k0537j7515j3779
63192G36301r568n658k579q5K401N062P843J0936J4530J8159K0993K2822K4151
63179H45308K5326K6141K6572K7146K8177K9111K9136K8209K7011K6027K5064
63168A143228K3567K1103J7552J3076P963K351l857j0767j8155k5399l1653l6276
63156A102733l9294m1400m3214m4554m4736m3583m1639l9293l6330l2643k8868
63145F67179k5730k3106k0382j7505j5063j3299j1758j0038q324o901n635m347
63133E05091l325k963l079l019k472j752j203p09L1J035K059K868L287L196K752
63118E01797K443K598K942L016K911L126L711M062L802L304L055K979K737K346
$$ plain form
63104 544829 546888 548785 550625 552673 555115 557458 558753 558762 558435 558766 559579 560019 559962 560213 561335 562969 564451
63087 564451 565541 566264 566535 566357 566127 566274 566700 566949 567087 568063 570916 575642 581136 586353 591337 596902
63071 596902 603529 610985 619014 627908 638164 649975 663276 677908 693380 708918 724381 740968
63059 740968 760423 783476 809535 837867 868484 901734 937667 976234 1017754 1062650 1110739
63048 1110739 1161157 1213039 1266100 1320411 1375718 1431135 1485671 1539077 1591992 1645223 1699083
63037 1699083 1753499 1808377 1863505 1918333 1972312 2025270 2076892 2125719 2169215 2204965 2231485
63026 2231485 2247732 2252438 2244466 2223721 2191367 2149074 2098193 2039641 1974531 1904860 1833433 1762976
63014 1762976 1695485 1632590 1576124 1527725 1487952 1456411 1432817 1417394 1410115 1410335 1417488 1431583
$$ packed form
63104E44829K059J897J840K048K442K343J295Rl27L31Q13M40n7K51J122J634J482
63087E64451J090P23K71j78k30J47M26K49J38R76K853M726N494N217M984N565
63071E96902O627P456Q029Q894J0256J1811J3301J4632J5472J5538J5463J6587
63059G40968J9455K3053K6059K8332L0617L3250L5933L8567M1520M4896M8089
63048A110739N0418N1882N3061N4311N5307N5417N4536N3406N2915N3231N3860
63037A699083N4416N4878N5128N4828N3979N2958N1622M8827M3496L5750K6520
63026B231485J6247M706p972k0745l2354m2293n0881n8552o5110o9671p1427p0457
63014A762976o7491o2895n6466m8399l9773l1541k3594j5423p279K20P153J4095
$$ plain form
63002 1431583 1452521 1479460 1511339 1547618 1587977 1631640 1677625 1725324 1774261 1823530 1872245
62991 1872245 1920454 1968912 2017866 2066651 2114467 2160792 2204709 2244341 2277369 2301820 2316185
62980 2316185 2319218 2310069 2288505 2254745 2209180 2152417 2085474 2009849 1927573 1841197 1753361 1666116
62968 1666116 1580728 1498216 1419804 1346661 1279372 1217823 1161509 1109916 1062833 1020414 982685
62957 982685 948913 917754 888229 860339 834530 810878 789041 768667 749333 730291 710843
62946 710843 691128 672183 655032 639889 626208 613285 600746 588684 577474 567319 557946 548823
62934 548823 539682 530728 522426 515270 509609 505359 501838 498214 494235 490283 486694 483394 480384 478162
62920 478162 477229 477382 477856 478100 478036 477606 476519 474664 472510 470749 469603 468615 467126 464835 461873 458527
$$ packed form
63002A431583K0938K6939L1879L6279M0359M3663M5985M7699M8937M9269M8715
62991A872245M8209M8458M8954M8785M7816M6325M3917L9632L3028K4451J4365
62980B316185L033r149k1564l3760m5565n6763o6943p5625q2276q6376q7836q7245
62968A666116q5388q2512p8412p3143o7289o1549n6314n1593m7083m2419l7729
62957I82685l3772l1159k9525k7890k5809k3652k1837k0374j9334j9042j9448
62946G10843j9715j8945j7151j5143j3681j2923j2539j2062j1210j0155r373r123
62934E48823r141q954q302p156n661m250l521l624l979l952l589l300l010k222
62920D78162r33J53M74K44o4m30j087j855k154j761j146r88j489k291k962l346
$$ plain form
62904 458527 455085 451906 449410 447812 446944 446446 446031 445367 443960 441605 439036 437553 437666 438402 438393 437411 436417
62887 436417 436165 436309 435964 434805 433351 432415 432420 433165 434144 435090 436102 437202 438037 438350 438504 439082 440006 440612
62869 440612 440607 440368 440108 439373 437823 435967 434590 433755 433004 432326 432280 433102 434293 435258 435943 436603 437219 437448
62851 437448 437093 436504 436465 437556 439486 441244 442117 442454 443128 444387 445628 446222 446078 445391 444397 443610 443693 444597
62833 444597 445240 444621 443078 441865 441601 441785 441939 442491 444082 446475 448736 450339 451573 452960 454821 457458
62817 457458 461153 465715 470464 475031 479828 485287 490930 495802 499734 503586 508121 513208 518326 523340
62803 523340 528484 533984 540134 547480 556421 566701 577648 588928 600859 614030 628864 645467
62791 645467 663673 683257 704293 727300 752916 781579 813644 849626 890056 935255 985509
$$ packed form
62904D58527l442l179k496j598q68m98m15o64j407k355k569j483J13P36rr82r94
62887D36417k52J44l45j159j454r36NP45R79R46J012J100Q35L13J54N78R24O06
62869D40612nk39k60p35j550j856j377q35p51o78m6Q22J191R65O85O60O16K29
62851D37448l55n89l9J091J930J758Q73L37O74J259J241N94j44o87r94p87Q3R04
62833D44597O43o19j543j213k64J84J54N52J591K393K261J603J234J387J861K637
62817D57458L695M562M749M567M797N459N643M872L932L852M535N087N118N014
62803E23340N144N500O150P346Q941J0280J0947J1280J1931J3171J4834J6603
62791F45467J8206J9584K1036K3007K5616K8663L2065L5982M0430M5199N0254
$$ plain form
62780 985509 1041276 1102923 1170349 1243212 1321300 1404180 1490546 1578445 1666191 1752538 1835768
62769 1835768 1913120 1981528 2038752 2083501 2114695 2130977 2131047 2114510 2082453 2037126 1980786 1914816
62757 1914816 1840250 1759074 1674399 1589043 1504399 1421076 1340160 1263109 1190546 1122012 1057179
62746 1057179 996751 941805 892666 848933 810263 776387 746383 718697 692428 668257 647598
62735 647598 630983 617644 606510 597021 588964 582135 576445 571941 568470 565697 563746 563379 565094 568371
62721 568371 572285 576595 581736 587997 595400 604190 614705 626680 639492 653394 669844 690098 713936
62708 713936 740280 768784 800265 835725 875561 919873 969130 1024103 1085207 1152174 1224528
62697 1224528 1302203 1385359 1473568 1565535 1659822 1755500 1851706 1946703 2037759 2121819 2195980
$$ packed form
62780I85509N5767O1647O7426P2863P8088Q2880Q6366Q7899Q7746Q6347Q3230
62769A835768P7352O8408N7224M4749L1194J6282P0j6537l2057m5327n6340o5970
62757A914816p4566q1176q4675q5356q4644q3323q0916p7051p2563o8534o4833
62746A057179o0428n4946m9139m3733l8670l3876l0004k7686k6269k4171k0659
62735F47598j6615j3339j1134r489q057o829n690m504l471k773j951l67J715L277
62721E68371L914M310N141O261P403Q790J0515J1975J2812J3902J6450K0254K3838
62708G13936K6344K8504L1481L5460L9836M4312M9257N4973O1104O6967P2354
62697A224528P7675Q3156Q8209R1967R4287R5678R6206R4997R1056Q4060P4161
$$ plain form
62686 2195980 2257498 2303944 2333484 2344803 2336989 2310017 2265297 2205231 2132231 2048572 1956917
62675 1956917 1860069 1760025 1658102 1556289 1457650 1364827 1278638 1198585 1124228 1055595 992718
62664 992718 935482 883767 837352 795824 758791 725838 696176 668909 644035 622480 604563
62653 604563 589022 574236 559927 546825 535038 523777 512606 502017 492590 484282 476765 469924
62641 469924 463845 458752 455005 452719 451347 450074 448681 447594 447085 446924 446840 446818 446780 446424 445608 444540 443451
62624 443451 442358 441236 440153 439192 438467 438182 438372 438726 439061 439927 442178 445921 450391 454974 459880 465603
62608 465603 472182 479263 486657 494626 503803 514813 527780 542215 557684 574434 593068 613889
62596 613889 637136 663624 694296 729018 766603 806169 847713 891076 935118 978328 1019489
$$ packed form
62686B195980O1518M6446K9540J1319p814k6972m4720o0066p3000q3659r1655
62675A956917r6848j00044j01923j01813r8639r2823q6189q0053p4357o8633o2877
62664I92718n7236n1715m6415m1528l7033l2953k9662k7267k4874k1555j7917
62653F04563j5541j4786j4309j3102j1787j1261j1171j0589r427q308p517o841
62641D69924o079n093l747k286j372j273j393j087n09j61q4k2l8l56q16j068j089
62624D43451j093j122j083r61p25k85J90L54L35Q66K251L743M470M583M906N723
62608D65603O579P081P394P969R177J1010J2967J4435J5469J6750J8634K0821
62596F13889K3247K6488L0672L4722L7585L9566M1544M3363M4042M3210M1161
$$ plain form
62585 1019489 1057278 1089876 1115640 1133765 1143880 1145606 1139060 1125126 1104536 1077228 1043495 1005281
62573 1005281 965295 924995 884379 843673 804167 767122 732717 700529 670440 642698 617479
62562 617479 594766 574385 556008 539379 524615 511906 500886 490837 481703 474353 469440 466377
62550 466377 463877 461224 458532 456014 453592 451368 449982 450064 451433 453115 454294 455120 456448 458851 462114
62535 462114 465651 469029 471896 473875 475070 476513 479542 484674 491510 499718 509555 521260 534592 549412
62521 549412 566248 585820 608247 633260 661013 692168 727139 765705 807494 852585 901423
62510 901423 954207 1010297 1068073 1125441 1180632 1232539 1280226 1322324 1357148 1383236 1399498
62499 1399498 1405152 1400183 1385965 1364822 1338636 1308196 1274103 1237803 1201298 1166191 1133643 1105139
$$ packed form
62585A019489L7789L2598K5764J8125J0115J726o546j3934k0590k7308l3733l8214
62573A005281l9986m0300m0616m0706l9506l7045l4405l2188l0089k7742k5219
62562F17479k2713k0381j8377j6629j4764j2709j1020j0049r134p350m913l063
62550D66377k500k653k692k518k422k224j386Q2J369J682J179Q26J328K403L263
62535D62114L537L378K867J979J195J443L029N132O836Q208R837J1705J3332J4820
62521E49412J6836J9572K2427K5013K7753L1155L4971L8566M1789M5091M8838
62510I01423N2784N6090N7776N7368N5191N1907M7687M2098L4824K6088J6262
62499A399498N654m969j4218k1143k6186l0440l4093l6300l6505l5107l2548k8504
$$ plain form
62487 1105139 1082602 1067446 1059826 1058964 1063913 1073953 1088660 1108011 1132267 1161381 1194472 1229967
62475 1229967 1266089 1300956 1332352 1357913 1375872 1385591 1387276 1381307 1367838 1346784 1317904 1280981
62463 1280981 1236308 1185236 1130092 1073255 1016171 959296 902981 848255 796622 749245 706568
62452 706568 668787 636376 609803 588721 571715 557086 543909 532292 522724 515321 509702 505423
62440 505423 502409 500941 501231 502965 505311 507477 509288 511095 513098 514918 515919 515788 514584 512351 508956
62425 508956 504348 498768 492612 486164 479465 472327 464595 456601 449269 443409 438825 434524 429919 425425
62411 425425 421623 418323 414977 411711 409235 407720 406355 404257 401399 398406 395794 393772 392557 392446
62397 392446 393401 394825 396002 396880 398265 400990 404813 408477 411001 412687 414589 417295 420616 424218 428005
$$ packed form
62487A105139k2537j5156p620q62M949J0040J4707J9351K4256K9114L3091L5495
62475A229967L6122L4867L1396K5561J7959R719J685n969j3469k1054k8880l6923
62463A280981m4673n1072n5144n6837n7084n6875n6315n4726n1633m7377m2677
62452G06568l7781l2411k6573k1082j7006j4629j3177j1617r568p403n619m279
62440E05423l014j468K90J734K346K166J811J807K003J820J001j31j204k233l395
62425E08956m608n580o156o448o699p138p732p994p332n860m584m301m605m494
62411D25425l802l300l346l266k476j515j365k098k858k993k612k022j215j11
62397C92446R55J424J177Q78J385K725L823L664K524J686J902K706L321L602L787
$$ plain form
62382 428005 431919 435861 439889 444090 448354 452761 458120 465415 474587 484462 494112 503657 513514 523653
62368 523653 534133 545723 559291 574906 592092 610668 630913 653298 678621 707985 742001
62357 742001 780270 822253 868315 919167 974472 1032711 1092212 1151582 1209219 1263163 1311459
62346 1311459 1352081 1382865 1402561 1412044 1413518 1408312 1396245 1377162 1351847 1320981 1284487 1242810
62334 1242810 1198038 1152678 1107769 1063083 1018819 976171 936445 900469 868730 841232 817125
62323 817125 795182 774815 756075 738718 721910 705035 688094 671051 653386 634694 615340
62312 615340 596109 577523 559913 543881 530123 518697 508866 499843 491536 484479 479109 475186 471903
62299 471903 468545 465139 462499 461576 462646 465015 467501 469248 470229 471040 472252 473955 475882 477947 480474
$$ packed form
62382D28005L914L942M028M201M264M407N359P295R172R875R650R545R857J0139
62368E23653J0480J1590J3568J5615J7186J8576K0245K2385K5323K9364L4016
62357G42001L8269M1983M6062N0852N5305N8239N9501N9370N7637N3944M8296
62346A311459M0622L0784J9696R483J474n206j2067j9083k5315l0866l6494m1677
62334A242810m4772m5360m4909m4686m4264m2648l9726l5976l1739k7498k4107
62323H17125k1943k0367j8740j7357j6808j6875j6941j7043j7665j8692j9354
62312F15340j9231j8586j7610j6032j3758j1426r831r023q307p057n370l923l283
62299D71903l358l406k640r23J070K369K486J747R81Q11J212J703J927K065K527
$$ plain form
62284 480474 483758 487473 490813 493418 495965 499508 504262 509402 514119 518421 522733 527168 531695 536678
62270 536678 542609 549395 556568 564266 573415 584694 597854 612458 628897 648217 671190 698004
62258 698004 728780 763960 804092 849437 899763 954332 1012133 1072247 1133886 1195852 1256021
62247 1256021 1311599 1359974 1399284 1428468 1447180 1455748 1454898 1445280 1427253 1401105 1367309 1326516
62235 1326516 1279472 1227154 1170919 1112394 1053191 994837 938858 886668 839178 796656 759114
62224 759114 726733 699614 677185 658334 642278 629018 618693 610898 604984 600718 598076 596608
62212 596608 595596 594836 594651 594999 595232 595031 595011 595888 597291 597918 596754 593873 590112 586256 582521 578646
62196 578646 574510 570650 567989 567001 567408 568822 571331 575174 580143 585712 591651 598211 605730 614329 623916
$$ packed form
62284D80474L284L715L340K605K547L543M754N140M717M302M312M435M527M983
62270E36678N931O786P173P698R149J1279J3160J4604J6439J9320K2973K6814
62258F98004L0776L5180M0132M5345N0326N4569N7801O0114O1639O1966O0169
62247A256021N5578M8375L9310K9184J8712Q568q50r618j8027k6148l3796m0793
62235A326516m7044n2318n6235n8525n9203n8354n5979n2190m7490m2522l7542
62224G59114l2381k7119k2429j8851j6056j3260j0325p795n914m266k642j468
62212E96608j012p60j85L48K33k01k0Q77J403O27j164k881l761l856l735l875
62196E78646m136l860k661r88M07J414K509L843M969N569N939O560P519Q599R587
$$ plain form
62181 623916 634287 645144 656126 666744 676288 684063 689926 694484 698630 703062 708330 715113 724162
62168 724162 736131 751668 771468 795972 825135 858719 896575 938309 982778 1028223 1072814
62157 1072814 1114866 1152707 1184792 1210001 1227713 1237685 1240145 1235914 1226057 1211274 1191710 1167278
62145 1167278 1138057 1104556 1067862 1029461 990686 952413 915388 880599 848935 820654 795591
62134 795591 773872 756019 742325 732428 725550 720820 717368 714560 712355 711252 711703 713734 717178 722032
62120 722032 728311 735656 743391 751069 758883 767262 775947 783578 788550 790328 789693 787694 784784 781138
62106 781138 777262 773677 770155 765793 759933 752729 744901 737264 730458 724802 720361 717346 716321 717776
62092 717776 721573 727095 733776 741236 749141 757420 766483 776754 788086 800098 812911 826919 841931
$$ packed form
62181F23916J0371J0857J0982J0618R544P775N863M558M146M432N268O783R049
62168G24162J1969J5537J9800K4504K9163L3584L7856M1734M4469M5445M4591
62157A072814M2052L7841L2085K5209J7712R972K460m231r857j4783j9564k4432
62145A167278k9221l3501l6694l8401l8775l8273l7025l4789l1664k8281k5063
62134G95591k1719j7853j3694r897o878m730l452k808k205j103M51K031L444M854
62120G22032O279P345P735P678P814Q379Q685P631M972J778o35j999k910l646
62106G81138l876l585l522m362n860p204p828p637o806n656m441l015j025J455
62092G17776L797N522O681P460P905Q279R063J0271J1332J2012J2813J4008J5012
$$ plain form
62079 841931 857336 873295 890990 911315 933847 957458 981409 1005472 1029539 1053623 1077866
62068 1077866 1101986 1125050 1146437 1166853 1187855 1210465 1234713 1260361 1287298 1315033 1342326
62057 1342326 1367684 1389986 1408402 1422034 1430097 1432473 1429863 1423232 1413092 1399283 1381395 1359283
62045 1359283 1333092 1302822 1268109 1228686 1185075 1138705 1091229 1043781 996835 950650 905684
62034 905684 862594 821958 784127 749333 717820 689817 665351 644104 625424 608565 593057
62023 593057 578895 566233 554936 544614 535132 526718 519371 512429 505114 497361 489772 482843 476658
62010 476658 471270 466883 463522 460955 459210 458762 459894 462121 464698 467619 471679 477501 484755 492429
61996 492429 499655 506142 511963 517183 521713 525388 528089 529790 530526 530310 529084 526747 523261 518609 512655
$$ packed form
62079H41931J5405J5959J7695K0325K2532K3611K3951K4063K4067K4084K4243
62068A077866K4120K3064K1387K0416K1002K2610K4248K5648K6937K7735K7293
62057A342326K5358K2302J8416J3632Q063K376k610o631j0140j3809j7888k2112
62045A359283k6191l0270l4713l9423m3611m6370m7476m7448m6946m6185m4966
62034I05684m3090m0636l7831l4794l1513k8003k4466k1247j8680j6859j5508
62023E93057j4162j2662j1297j0322r482q414p347o942p315p753p589o929o185
62010D76658n388m387l361k567j745m48J132K227K577K921M060N822P254P674
61996D92429P226O487N821N220M530L675K701J701P36k16j226k337l486m652n954
$$ plain form
61981 512655 505228 496577 487644 479564 472807 466986 461559 456431 451771 447534 443431 439216 434865 430636
61967 430636 427070 424643 423207 422026 420555 418865 417177 415415 413653 412515 412490 413114 413472 413403 413575 414465
61951 414465 415912 417720 419978 422656 425560 428976 433806 440663 449233 458849 469346 480995 493913
61938 493913 507889 522675 538127 554153 570656 587470 604329 620983 637273 652800 666675
61927 666675 678048 686962 694266 700593 705724 709007 709963 708431 704593 699016 692247 684316 675173 665693
61913 665693 657546 651731 647895 645483 644974 647404 653170 661869 672934 685776 699564 713474 727034
61900 727034 739750 750533 758036 761502 760983 756943 750068 741188 730868 719183 706291 692974 680018
61887 680018 667284 654107 640691 628396 618367 610278 602762 594766 586233 577623 569113 560400 551220
$$ packed form
61981E12655p427q651q933q080o757n821n427n128m660m237m103m215m351m229
61967D30636l566k427j436j181j471j690j688j762j762j138k5O24L58o9J72Q90
61951D14465J447J808K258K678K904L416M830O857Q570R616J0497J1649J2918
61938D93913J3976J4786J5452J6026J6503J6814J6859J6654J6290J5527J3875
61927F66675J1373Q914P304O327N131L283R56j532l838n577o769p931r143r480
61913F65693q147n815l836k412n09K430N766Q699J1065J2842J3788J3910J3560
61900G27034J2716J0783P503L466n19m040o875q880j0320j1685j2892j3317j2956
61887F80018j2734j3177j3416j2295j0029q089p516p996q533q610q510q713r180
$$ plain form
61874 551220 541853 532860 524429 516395 509001 503077 499120 496676 495143 494709 495917 498569 501925 505877
61860 505877 511158 518199 526522 535566 545637 557683 572358 589576 608768 629419 651496 675435
61848 675435 701555 729475 758270 787122 815550 843084 869020 892494 912591 928538 940140
61837 940140 947873 952062 952091 947044 937229 924524 911054 898033 885997 875501 867102 861083 857742
61824 857742 857781 861928 870144 881336 893748 905520 915123 921576 924328 922924 916940 906253 891104
61811 891104 871792 848558 821954 793143 763632 734755 707394 681922 658267 636271 616113
61800 616113 598175 582436 568287 555156 543048 532227 522650 514056 506442 500048 494848 490329 485881
61787 485881 481319 476953 473231 470308 467982 466028 464452 463250 462084 460538 458695 457091 455990 455099
$$ packed form
61874E51220r367q993q431q034p394n924l957k444j533m34J208K652L356L952
61860E05877N281P041Q323R044J0071J2046J4675J7218J9192K0651K2077K3939
61848F75435K6120K7920K8795K8852K8428K7534K5936K3474K0097J5947J1602
61837I40140P733M189K9n047r815j2705j3470j3021j2036j0496q399o019l341
61824H57742L9M147Q216J1192J2412J1772R603O453K752j404n984j0687j5149
61811H91104j9312k3234k6604k8811k9511k8877k7361k5472k3655k1996k0158
61800F16113j7938j5739j4149j3131j2108j0821r577q594p614o394n200m519m448
61787D85881m562m366l722k923k326j954j576j202j166j546j843j604j101q91
$$ plain form
61773 455099 454153 453389 453163 453398 453774 454219 454839 455570 456284 457125 458335 459792 461129 462357 463958 466199 468651
61756 468651 470603 471821 472781 474157 476198 478532 480528 481839 482560 482879 482717 481851 480296 478346 476241
61741 476241 473963 471394 468587 465863 463650 462151 461091 459907 458351 456849 456050 456065 456436 456846 457546 458877
61725 458877 460633 462210 463378 464625 466602 469368 472342 474936 477059 478997 480976 483002 484996 486822
61711 486822 488193 488803 488678 488190 487582 486595 484753 481932 478466 474809 471297 468183 465615 463451 461304
61696 461304 458905 456364 454014 452034 450259 448310 445914 443162 440414 437872 435333 432570 429884 427974
61682 427974 427097 426585 425443 423288 420509 417617 414743 411782 408765 405950 403665 402110 401198 400539 399741
61667 399741 398774 397839 396876 395504 393691 392154 391648 391941 392031 391472 390972 391402 392669 394062 395375 397067 399329
$$ packed form
61773D55099r46p64k26K35L76M45O20P31P14Q41J210J457J337J228J601K241K452
61756D68651J952J218R60J376K041K334J996J311P21L19j62q66j555j950k105
61741D76241k278k569k807k724k213j499j060j184j556j502p99J5L71M10P00J331
61725D58877J756J577J168J247J977K766K974K594K123J938J979K026J994J826
61711D86822J371O10j25m88o08r87j842k821l466l657l512l114k568k164k147
61696D61304k399k541k350j980j775j949k396k752k748k542k539k763k686j910
61682D27974q77n12j142k155k779k892k874k961l017k815k285j555r12o59p98
61667C99741r67r35r63j372j813j537n06K93R0n59n00M30J267J393J313J692K262
$$ plain form
61650 399329 401648 403511 405064 406764 408759 410975 413457 416165 418611 420276 421397 422817 424939 427259
61636 427259 429122 430438 431316 431392 430120 427625 424766 422245 420070 417945 415794 413644 411303 408498 405253
61621 405253 401909 398844 396334 394544 393428 392671 391952 391214 390490 389528 387930 385703 383343 381135 378612
61606 378612 374994 370170 364932 360167 355997 351902 347560 343282 339515 336164 332717 329000 325455 322485
61592 322485 319787 316720 313206 309895 307343 305408 303657 302057 300853 299886 298487 296220 293466 290999
61578 290999 289141 287626 286233 285185 284743 284613 284108 282860 281102 279248 277439 275640 273979 272814 272559
61563 272559 273455 275352 277589 279349 280359 281090 282052 283066 283490 283103 282427 282245 283041 284831 287155 289201
61547 289201 290308 290529 290540 290865 291428 291892 292223 292715 293574 294659 295603 296199 296685 297527 298828 300137 301012 301626
$$ packed form
61650C99329K319J863J553J700J995K216K482K708K446J665J121J420K122K320
61636D27259J863J316Q78P6j272k495k859k521k175k125k151k150k341k805l245
61621D05253l344l065k510j790j116p57p19p38p24r62j598k227k360k208k523
61606C78612l618m824n238m765m170m095m342m278l767l351l447l717l545k970
61592C22485k698l067l514l311k552j935j751j600j204r67j399k267k754k467
61578B90999j858j515j393j048m42j30n05j248j758j854j809j799j661j165k55
61563B72559Q96J897K237J760J010P31R62J014M24l87o76j82P96J790K324K046
61547B89201J107K21J1L25N63M64L31M92Q59J085R44N96M86Q42J301J309Q75O14
$$ plain form
61529 301626 302490 303795 305384 307213 309259 311017 311703 311126 309859 308392 306648 304533 302362 300392 298461
61514 298461 296532 295087 294487 294356 294219 294320 295125 296272 296844 296722 296864 298004 299618 300518 300095 298725 297217
61497 297217 296166 295727 295743 296029 296483 296949 297226 297401 298001 299412 301205 302397 302469 301814 301091 300464 299714 298873
61479 298873 298442 298958 300466 302443 304213 305439 306256 306992 307816 308631 309201 309427 309537 309918 310561 310846 310238
61462 310238 309162 308748 309511 310717 311233 310681 309478 308233 307475 307629 308722 310209 311477 312446 313410 314497
61446 314497 315594 316572 317257 317409 317148 317161 318073 319781 321801 324008 326516 329076 331238 333091 335227 337983
61430 337983 341127 344238 346899 348674 349543 350304 351887 354177 356124 357131 357683 358455 359508 360616 361780
61415 361780 363043 364268 365420 366689 368053 369110 369547 369380 368551 366875 364688 362943 362163 361742 360780 359203
$$ packed form
61529C01626Q64J305J589J829K046J758O86n77j267j467j744k115k171j970j931
61514B98461j929j445o00j31j37J01Q05J147N72j22J42J140J614R00m23j370j508
61497B97217j051m39J6K86M54M66K77J75O00J411J793J192P2o55p23o27p50q41
61479B98873m31N16J508J977J770J226Q17P36Q24Q15N70K26J10L81O43K85o08
61462C10238j076m14P63J206N16n52j203j245p58J54J093J487J268R69R64J087
61446C14497J097R78O85J52k61J3R12J708K020K207K508K560K162J853K136K756
61430C37983L144L111K661J775Q69P61J583K290J947J007N52P72J053J108J164
61415C61780J263J225J152J269J364J057M37j67q29j676k187j745p80m21r62j577
$$ plain form
61399 359203 357525 355880 353983 351884 350069 348796 347842 347026 346517 346456 346579 346440 345846 344979 344230 343977 344408
61382 344408 345367 346385 346947 346852 346387 346108 346357 346987 347588 347983 348404 349268 350822 352918 355091 356996 358852
61365 358852 361144 363761 365843 366913 367778 369646 372534 375287 377199 378844 381090 384004 387135 390390
61351 390390 394173 399024 405460 413777 423535 433463 442339 449894 456607 462824 468403 473079 476834 479846
61337 479846 482344 484569 486803 489318 492146 494808 496435 496462 495180 493311 491217 488856 486395 484270 482602
61322 482602 481103 479743 478970 478970 479204 479024 478455 478111 478633 480456 483739 488233 493481 499355 506150 514014
61306 514014 522741 532340 543321 555957 569577 582948 595102 605450 613381 618290 620006 618940 615780
61293 615780 611096 605084 597689 589133 580199 571623 563322 554772 546088 538029 530821 523806 516642 510039
$$ packed form
61399C59203j678j645j897k099j815j273r54q16n09o1J23j39n94q67p49k53M31
61382C44408R59J018N62r5m65k79K49O30O01L95M21Q64J554K096K173J905J856
61365C58852K292K617K082J070Q65J868K888K753J912J645K246K914L131L255
61351C90390L783M851O436Q317R758R928Q876P555O713O217N579M676L755L012
61337D79846K498K225K234K515K828K662J627K7j282j869k094k361k461k125j668
61322D82602j499j360p73%K34j80n69l44N22J823L283M494N248N874O795P864
61306E14014Q727R599J0981J2636J3620J3371J2154J0348P931M909J716j066l160
61293F15780m684o012p395q556q934q576q301q550q684q059p208p015p164o603
$$ plain form
61279 510039 504803 500778 497365 494523 492633 491855 492230 494006 497186 501097 505055 509157 513851 519019 524104
61264 524104 528854 533344 537583 541766 546662 553013 560704 569070 577730 586493 594791 602049 608442 614483
61250 614483 619984 624275 627403 630188 632920 634857 635249 634245 632480 630360 627953 625112 621496 617012
61236 617012 612389 608807 606700 605401 604107 602719 601478 600332 599135 598183 598085 599192 601318 603922 606441
61221 606441 608628 610735 613294 616610 620500 624544 628510 632590 637221 642551 648089 653113 657459 661498
61207 661498 665191 667771 668746 668678 668409 668060 667560 667759 670028 674742 680978 687830 695392 704415 715636 729460
61191 729460 745600 762840 779705 795445 809887 822488 832339 839206 843776 846656 847869 847553 846400
61178 846400 844978 843249 841080 838613 835774 832050 827229 821784 816084 809802 802660 795145 787768 780024
$$ packed form
61279E10039n236m025l413k842j890p78L75J776L180L911L958M102M694N168N085
61264E24104M750M490M239M183M896O351P691Q366Q660Q763Q298P258O393O041
61250F14483N501M291L128K785K732J937L92j004j765k120k407k841l616m484
61236F17012m623l582k107j299j294j388j241j146j197r52r8J107K126K604K519
61221F06441K187K107K559L316L890M044L966M080M631N330N538N024M346M039
61207F61498L693K580R75o8k69l49n00J99K269M714O236O852P562R023J1221J3824
61191G29460J6140J7240J6865J5740J4442J2601R851O867M570K880J213l16j153
61178H46400j422j729k169k467k839l724m821n445n700o282p142p515p377p744
$$ plain form
61164 780024 770876 760166 748860 737916 727423 716840 705621 693602 681210 669405 659094 650478
61152 650478 643146 636845 631925 628944 627961 628371 629362 630369 630982 630544 628223 623693 617493 610410 602746
61137 602746 594602 586667 580076 575360 572001 569170 566503 564131 562503 562373 564409 568443 573561 579272
61123 579272 586273 595599 607421 621078 636035 652304 670027 689205 709825 731938 755474 780170
61111 780170 805605 831109 855771 878946 900891 922631 945037 968032 990704 1011937 1030823
61100 1030823 1046684 1059081 1067914 1073271 1074951 1072299 1064815 1052887 1037644 1020091 1000766 980209
61088 980209 959194 938138 916736 894624 872121 849905 828194 806774 785679 765389 746401
61077 746401 728931 712983 698358 684712 671980 660632 651224 643840 638186 633964 630806 628198 625944
$$ packed form
61164G80024r148j0710j1306j0944j0493j0583j1219j2019j2392j1805j0311q616
61152F50478p332o301m920k981r83M10R91J007O13m38k321m530o200p083p664
61137F02746q144p935o591m716l359k831k667k372j628j30K036M034N118N711
61123E79272P001R326J1822J3657J4957J6269J7723J9178K0620K2113K3536K4696
61111G80170K5435K5504K4662K3175K1945K1740K2406K2995K2672K1233J8886
61100A030823J5861J2397Q833N357J680k652p484j1928j5243j7553j9325k0557
61088I80209k1015k1056k1402k2112k2503k2216k1711k1420k1095k0290j8988
61077G46401j7470j5948j4625j3646j2732j1348r408p384n654m222l158k608k254
$$ plain form
61064 625944 624433 624061 624696 626196 628906 633014 637928 643173 649449 657779 667885 678539 689371 701122
61050 701122 714126 727796 741850 756781 772746 789183 806147 825006 847035 872058 899058
61039 899058 927478 957346 988706 1021532 1055810 1091436 1128521 1167835 1210153 1255026 1301144
61028 1301144 1348226 1397429 1449409 1503080 1557050 1611350 1667029 1725041 1786529 1853446 1927840
61017 1927840 2010892 2103232 2205584 2318586 2443047 2581464 2738967 2922449 3139821 3400595
61007 3400595 3715516 4094338 4545379 5079136 5712198 6468059 7377286 8477506 9804446
60998 9804446 11368586 13130980 14999031 16842437 18509980 19842655 20706230 21053701
60990 21053701 20976802 20685637 20410862 20298138 20368362 20545164 20694802 20647516 20226140 19309139
$$ packed form
61064F25944j511l72O35J500K710M108M914N245O276Q330J0106J0654J0832J1751
61050G01122J3004J3670J4054J4931J5965J6437J6964J8859K2029K5023K7000
61039H99058K8420K9868L1360L2826L4278L5626L7085L9314M2318M4873M6118
61028A301144M7082M9203N1980N3671N3970N4300N5679N8012O1488O6917P4394
61017A927840Q3052R2340J02352J13002J24461J38417J57503J83482K17372K60774
61007C400595L14921L78822M51041N33757O33062P55861R09227J100220J326940
60998I804446J564140J762394J868051J843406J667543J332675Q63575L47471
60990B1053701p6899k91165k74775j12724P0224J76802J49638m7286m21376r17001
$$ plain form
60980 19309139 17898145 16128435 14205276 12316660 10583787 9062158 7764219 6677848
60972 6677848 5778083 5036610 4427557 3928038 3517432 3178377 2897316 2662898 2464780
60963 2464780 2294584 2146706 2017183 1902636 1800797 1710787 1631804 1562236 1500710 1447097
60953 1447097 1401530 1363120 1330500 1302891 1279572 1258743 1238144 1216949 1196253 1177589 1161425
60942 1161425 1147285 1134713 1123729 1114388 1106223 1098477 1090923 1084116 1078538 1073827 1069338 1065151 1061811
60929 1061811 1059200 1056513 1053495 1050885 1049332 1048634 1048404 1048812 1050052 1051537 1052231 1051593 1049826 1047407 1044669
60914 1044669 1041667 1038211 1034120 1029410 1024004 1017354 1008934 999175 989245 979686 969862 959107 947817
60901 947817 936920 926685 916590 906075 895006 883612 872282 861280 850456 839495 828516
$$ packed form
60980A9309139j410994j769710j923159j888616j732873j521629j297939j086371
60972F677848q99765p41473o09053m99519m10606l39055k81061k34418j98118
60963B464780j70196j47878j29523j14547j01839r0010p8983o9568o1526n3613
60953A447097m5567l8410l2620k7609k3319k0829k0599k1195k0696j8664j6164
60942A161425j4140j2572j0984r341q165p746p554o807n578m711m489m187l340
60929A061811k611k687l018k610j553o98k30M08J240J485O94o38j767k419k738
60914A044669l002l456m091m710n406o650q420r759r930r559r824j0755j1290
60901I47817j0897j0235j0095j0515j1069j1394j1330j1002j0824j0961j0979
$$ plain form
60890 828516 818039 808176 798398 788337 778203 768013 757042 744692 731465 718364 705649 692942
60878 692942 680367 668756 658626 649560 640841 632237 623989 616371 609499 603357 597812 592642 587594
60865 587594 582447 577213 572380 568710 566491 565113 563701 562061 560641 559569 558101 555183 550437 544569
60851 544569 538904 534455 531195 528173 524462 520013 515493 511413 507646 503800 499723 495440 490825 485642
60837 485642 479943 474159 468647 463353 458112 453141 448868 445242 441619 437597 433652 430667 429018 428443
60823 428443 428591 429250 430181 431216 432489 434152 435853 437027 437758 438765 440298 441569 441644 440529 438956 437445
60807 437445 436087 435032 434606 434827 435207 435244 434940 434652 434510 434130 433005 431149 429226 427897 427178 426567 425753
60790 425753 424911 424295 423821 423117 421741 419268 415482 410707 405854 401870 399085 397049 394982 392394 389372
$$ packed form
60890H28516j0477r863r778j0061j0134j0190j0971j2350j3227j3101j2715j2707
60878F92942j2575j1611j0130r066q719q604q248p618o872o142n545n170n048
60865E87594n147n234m833l670k219j378j412j640j420j072j468k918m746n868
60851E44569n665m449l260l022l711m449m520m080l767l846m077m283m615n183
60837D85642n699n784n512n294n241m971m273l626l623m022l945k985j649n75
60823D28443J48O59R31J035J273J663J701J174P31J007J533J271P5j115j573j511
60807D37445j358j055m26K21L80L7l04k88j42l80j125j856j923j329p19o11q14
60790D25753q42o16m74p04j376k473l786m775m853l984k785k036k067k588l022
$$ plain form
60775 389372 386245 383019 379406 375572 372449 370875 370590 370582 370346 370204 370419 370694 370855 371402 372891 375085 377185
60758 377185 378713 379826 380891 382165 383844 386057 388660 391179 393142 394557 396017 398175 401054 404036
60744 404036 406698 409390 412612 416027 418538 419284 418140 415382 411464 407096 402823 398377 393069 387111
60730 387111 381805 378007 375014 371595 367604 363887 360881 358103 354979 351519 348014 344574 341219 338189
60716 338189 335883 334505 333768 332999 331644 329743 327820 326332 325438 325233 325785 326819 327771 328442 329260 330555
60700 330555 331850 332288 331607 330392 329441 329176 329536 330123 330467 330374 330075 329998 330518 331953 334479 337867 341515
60683 341515 344973 348269 351611 355063 358694 362724 367155 371515 375315 378618 381845 385166 388451 391748
60669 391748 395411 399669 404221 408274 410956 411796 410997 409213 407043 404842 402869 401231 399604 397460 394864
$$ packed form
60775C89372l127l226l613l834l123j574k85qk36j42K15K75J61N47J489K194K100
60758C77185J528J113J065J274J679K213K603K519J963J415J460K158K879K982
60744D04036K662K692L222L415K511P46j144k758l918m368m273m446n308n958
60730C87111n306l798k993l419l991l717l006k778l124l460l505l440l355l030
60716C38189k306j378p37p69j355j901j923j488q94k05N52J034R52O71Q18J295
60700C30555J295M38o81j215r51k65L60N87L44r3k99p7N20J435K526L388L648
60683C41515L458L296L342L452L631M030M431M360L800L303L227L321L285L297
60669C91748L663M258M552M053K682Q40p99j784k170k201j973j638j627k144k596
$$ plain form
60654 394864 392662 391538 391174 390676 389559 388039 386645 385977 386539 388235 390113 391104 391020 390440 389724 388628
60638 388628 386875 384595 381956 378757 374732 370084 365440 361261 357499 353892 350517 347850 346196 345291
60624 345291 344688 344413 344838 345936 347158 348137 349018 349828 350076 349476 348716 348910 350339 352108 353038 352629 351230
60607 351230 349645 348575 348288 348741 349932 351845 354049 355864 357173 358579 360421 362127 363058 363579 364589
60592 364589 366261 367952 369275 370524 371939 373184 373750 373507 372708 371784 371191 371083 371140 371042 371071 371836 373465
60575 373465 375590 378145 381567 386001 390876 395696 400819 407029 414558 422993 432064 442050 453253 465245
60561 465245 476834 486685 493948 498307 499700 498221 494286 488628 481960 474800 467725 461534 456935 454212
60547 454212 453373 454398 457124 461180 466385 473080 481699 492105 503657 515822 528427 541429 554782
$$ packed form
60654C94864k202j124l64m98j117j520j394o68N62J696J878R91q4n80p16j096
60638C88628j753k280k639l199m025m648m644m179l762l607l375k667j654r05
60624C45291o03k75M25J098J222R79Q81Q10K48o00p60J94J429J769R30m09j399
60607C51230j585j070k87M53J191J913K204J815J309J406J842J706R31N21J010
60592C64589J672J691J323J249J415J245N66k43p99r24n93j08N7r8K9P65J629
60575C73465K125K555L422M434M875M820N123O210P529Q435R071R986J1203J1992
60561D65245J1589R851P263M359J393j479l935n658o668p160p075o191m599k723
60547D54212q39J025K726M056N205O695Q619J0406J1552J2165J2605J3002J3353
$$ plain form
60534 554782 568386 581732 593664 602961 609184 612618 613383 611130 605772 598118 589512 581053 573271 566317
60520 566317 560248 555150 551081 547826 544879 541890 539065 536907 535616 535029 535118 536191 538549 542226 547106
60505 547106 553100 560237 568892 579925 594225 612040 633060 657222 685035 716915 752540 791110
60493 791110 831954 874495 917738 960074 999614 1034551 1063219 1084086 1095894 1097859 1089735 1071706
60481 1071706 1044296 1008450 965759 918528 869501 821257 775556 733033 693624 657453 625211
60470 625211 597401 573525 552530 533976 518131 504798 492904 481673 471518 463086 455944 449008
60458 449008 441992 435588 430297 425847 421813 418090 414585 411052 407469 404147 401232 398475 395680 393069
60444 393069 391064 389903 389510 389469 389224 388603 388056 388031 388251 388090 387501 386965 386547 385779 384655 383994 384393 385310
$$ packed form
60534E54782J3604J3346J1932R297O223L434P65k253n358p654q606q459p782o954
60520E66317o069n098m069l255k947k989k825k158j291n87Q9J073K358L677M880
60505E47106N994P137Q655J1033J4300J7815K1020K4162K7813L1880L5625L8570
60493G91110M0844M2541M3243M2336L9540L4937K8668K0867J1808J965q124j8029
60481A071706k7410l5846m2691m7231m9027m8244m5701m2523l9409l6171l2242
60470F25211k7810k3876k0995j8554j5845j3333j1894j1231j0155q432p142o936
60458D49008p016o404n291m450m034l723l505l533l583l322k915k757k795k611
60444C93069k005j161l93m1k45o21n47k5K20j61n89n36m18p68j124o61L99R17
$$ plain form
60426 385310 385656 384971 383674 382454 381779 381729 382010 382214 382216 382127 381848 381125 380248 380204 381707 384299 386834 388610
60408 388610 389670 390164 390011 389361 388997 389898 392312 395408 398064 399995 401876 404245 406624 408137 408787 409574
60392 409574 411300 413721 416066 417982 419763 421894 424552 427427 429993 432141 434417 437282 440300 442637
60378 442637 444383 446708 450401 454871 458951 462225 465072 467865 470704 473723 477056 480476 483415 485375
60364 485375 486157 485897 485157 484743 485111 485992 486866 487635 488574 489890 491770 494695 499138 504827 510785 516303
60348 516303 521599 527334 533717 540314 546510 551807 555708 557672 557452 555371 552097 548148 543745 539103
60334 539103 534568 530337 526249 522063 517838 513827 510114 506584 503113 499510 495396 490558 485474 481074
60320 481074 477853 475471 473385 471571 470380 469961 470123 470710 471873 473965 477308 482108 488543 496883 507429
$$ packed form
60426C85310L46o85j297j220o75n0K81K04Kq9k79p23q77m4J503K592K535J776
60408C88610J060M94j53o50l64R01K414L096K656J931J881K369K379J513O50P87
60392D09574J726K421K345J916J781K131K658K875K566K148K276K865L018K337
60378D42637J746K325L693M470M080L274K847K793K839L019L333L420K939J960
60364D85375P82k60p40m14L68Q81Q74P69R39J316J880K925M443N689N958N518
60348E16303N296N735O383O597O196N297L901J964k20k081l274l949m403m642
60334E39103m535m231m088m186m225m011l713l530l471l603m114m838n084m400
60320D81074l221k382k086j814j191m19J62N87J163K092L343M800O435Q340J0546
$$ plain form
60305 507429 520273 535195 551856 570008 589381 609411 629122 647098 661472 670296 672391 667890
60293 667890 657773 642975 624255 602886 581024 561097 544655 531673 520932 511374 503216 497517
60281 497517 494576 493294 492362 491426 490546 489180 486691 483504 480722 478677 476804 474891 473333 471988 469926
60266 469926 466787 463448 460779 458492 455842 452772 449709 446783 443950 441453 439478 437672 435605 433519
60252 433519 432096 431689 432115 432930 433576 433650 433494 434150 436202 438973 441271 442620 443299 443572 443576 443699 444364 445424
60234 445424 446257 446542 446598 447032 448270 450236 452279 453724 454817 456711 460067 464063 467375 469775 472107
60219 472107 474909 477873 480635 483366 486477 490220 494688 499771 505145 510739 517070 524589 532815 540809
60205 540809 548474 556643 565689 574817 583046 590275 596932 603084 608472 613121 617458 621888 626541 631222
$$ packed form
60305E07429J2844J4922J6661J8152J9373K0030J9711J7976J4374Q824K095m501
60293F67890j0117j4798j8720k1369k1862j9927j6442j2982j0741r558q158n699
60281D97517k941j282r32r36q80j366k489l187k782k045j873j913j558j345k062
60266D69926l139l339k669k287k650l070l063k926k833k497j975j806k067k086
60252D33519j423m07M26Q15O46P4j56O56K052K771K298J349O79K73MJ23O65J060
60234D45424Q33K85N6M34J238J966K043J445J093J894L356L996L312K400K332
60219D72107K802K964K762K731L111L743M468N083N374N594O331P519Q226P994
60205E40809P665Q169R046R128Q229P229O657O152N388M649M337M430M653M681
$$ plain form
60191 631222 635367 638215 639387 639146 637961 635983 633204 629865 626308 622586 618580 614408 610272 605918
60177 605918 600730 594532 587946 581733 576148 571172 566955 563577 560710 558090 556069 554965 553932 551499
60163 551499 547527 543706 541473 540215 538422 535963 534044 533246 532947 532847 533724 536079 538963 540986 541892
60148 541892 542459 543308 544498 546012 547903 549971 551838 553373 554777 556331 558321 561113 565016 570037 575846
60133 575846 581889 587589 592702 597497 602255 606595 609779 611750 613319 615099 616774 617723 617904 617843 618272
60118 618272 619969 623315 627604 631412 634122 636514 639412 642483 644970 646849 648343 648937 648003 646061 644326
60103 644326 643137 641833 640072 638194 636177 633309 629278 624786 620718 617335 614582 612575 611363 610725
60089 610725 610582 611265 613006 615481 618106 620526 622639 624382 625736 626730 627285 627132 625969 623609 620074
$$ packed form
60191F31222M145K848J172k41j185j978k779l339l557l722m006m172m136m354
60177F05918n188o198o586o213n585m976m217l378k867k620k021j104j033k433
60163E51499l972l821k233j258j793k459j919p98k99j00Q77K355K884K023R06
60148E41892N67Q49J190J514J891K068J867J535J404J554J990K792L903N021N809
60133E75846O043N700N113M795M758M340L184J971J569J780J675R49J81o1M29
60118F18272J697L346M289L808K710K392K898L071K487J879J494N94r34j942j735
60103F44326j189j304j761j878k017k868m031m492m068l383k753k007j212o38
60089F10725j43O83J741K475K625K420K113J743J354R94N55j53j163k360l535
$$ plain form
60074 620074 615673 610882 605919 600587 594743 588649 582511 575957 568483 560263 552003 544135 536672 529730
60060 529730 523523 517827 512141 506524 501708 498138 495411 492916 490617 488961 488321 488769 490165 492275 494952
60045 494952 498283 502347 506874 511394 515740 520170 524987 530288 535998 541840 547337 552091 555981 558880
60031 558880 560474 560750 560300 559607 558259 555565 551722 547588 543349 538241 531730 524188 516189 507868 499353
60016 499353 491233 484146 478279 473477 469420 465559 461399 457148 453579 450982 448754 446283 443715 441428
60002 441428 439244 436685 433799 431332 430161 430726 432736 435242 437275 438637 439842 441242 442600 443706
59988 443706 444950 446964 449972 453697 457621 461153 463927 466157 468389 470685 472443 473209 473229 472879 471939
59973 471939 469881 466641 462767 458993 455889 453707 452265 451060 449638 447742 445202 442145 439395 438097
$$ packed form
60074F20074m401m791m963n332n844o094o138o554p474q220q260p868p463o942
60060E29730o207n696n686n617m816l570k727k495k299j656o40M48J396K110K677
60045D94952L331M064M527M520M346M430M817N301N710N842N497M754L890K899
60031E58880J594K76m50o93j348k694l843m134m239n108o511p542p999q321q515
60016D99353q120p087n867m802m057l861m160m251l569k597k228k471k568k287
60002D41428k184k559k886k467j171N65K010K506K033J362J205J400J358J106
59988D43706J244K014L008L725L924L532K774K230K232K296J758P66K0l50r40
59973D71939k058l240l874l774l104k182j442j205j422j896k540l057k750j298
$$ plain form
59959 438097 438625 440211 441898 443444 445016 446516 447687 448565 449350 450050 450662 451436 452573 453846 454931 455919
59943 455919 457141 458619 460047 461182 461966 462389 462535 462623 462742 462695 462301 461730 461322 461243 461554 462379 463747 465496
59925 465496 467566 470122 473123 476096 478707 481368 484914 489801 495915 502834 509879 516153 521169 525421
59911 525421 529796 534308 537849 539424 539301 538681 538368 538010 536671 534014 530745 527845 525515 523145 520297
59896 520297 517371 515140 513949 513605 513819 514520 515886 518273 521949 526743 532198 538172 545008 552792 560755
59881 560755 567776 573401 578106 582727 587888 593744 599799 605069 608817 611219 613024 614553 615269 614364 611529
59866 611529 607096 601643 595611 589247 582801 576681 571306 566832 563176 560236 557874 555780 553804 552537
59852 552537 553060 555854 560330 565753 572179 579944 588582 596939 604185 610051 614104 615639 614624 612251
$$ packed form
59959D38097N28J586J687J546J572J500J171Q78P85P00O12P74J137J273J085R88
59943D55919J222J478J428J135P84M23J46Q8J19m7l94n71m08p9L11Q25J368J749
59925D65496K070K556L001K973K611K661L546M887O114O919P045O274N016M252
59911E25421M375M512L541J575j23o20l13l58j339k657l269k900k330k370k848
59896E20297k926k231j191l44K14P01J366K387L676M794N455N974O836P784P963
59881E60755P021N625M705M621N161N856O055N270L748K402J805J529P16r05k835
59866F11529m433n453o032o364o446o120n375m474l656k940k362k094j976j267
59852E52537N23K794M476N423O426P765Q638Q357P246N866M053J535j015k373
$$ plain form
59838 612251 610047 608685 607973 607657 607676 607607 606400 603086 597761 591661 586161 581658 577473 572807 567739 563217
59822 563217 560094 558274 556864 555147 553240 551689 550622 549649 548621 547996 548115 548406 547817 545923 543179
59807 543179 540167 537081 534013 531171 528588 525986 523213 520447 517750 514781 511370 508070 505681 504318
59793 504318 503331 502162 500903 499915 499121 497940 495983 493721 492243 492214 493182 494087 494352 494198 494053 494087 494365
59776 494365 495030 496058 497117 497877 498318 498668 499214 500148 501311 502071 501859 500917 500189 500387 501539 503464 506147
59759 506147 509390 512600 515317 517648 519937 522372 525177 528761 533283 538310 543256 547902 552255 556243
59745 556243 559907 563602 567625 571855 576004 579951 583575 586646 589222 591744 594349 596458 597573 598110
59731 598110 598881 599944 600612 600475 599898 599486 599539 600043 600823 601687 602648 603885 605241 606065 605941 605302 604859 604669
$$ packed form
59838F12251k204j362p12l16J9o9j207l314n325o100n500m503m185m666n068m522
59822E63217l123j820j410j717j907j551j067r73j028o25J19K91n89j894k744
59807E43179l012l086l068k842k583k602k773k766k697k969l411l300k389j363
59793E04318r87j169j259r88p94j181j957k262j478k9R68R05K65j54j45L4K78
59776D94365O65J028J059P60M41L50N46R34J163P60k12r42p28J98J152J925K683
59759E06147L243L210K717K331K289K435K805L584M522N027M946M646M353L988
59745E56243L664L695M023M230M149L947L624L071K576K522K605K109J115N37
59731E98110P71J063O68j37n77m12N3N04P80Q64R61J237J356Q24j24o39m43j90
$$ plain form
59713 604669 604346 603962 604026 604601 605157 605450 605912 606951 608424 610101 612131 614614 617020 618612 619391 620264 622120
59696 622120 624934 627874 630213 632027 633939 636365 639133 641750 643696 644425 643481 640927 637564 634447 632161
59681 632161 630516 628830 626506 623577 620703 618361 616059 612812 608354 603290 597948 591861 584846 577831
59667 577831 571927 567130 562739 558629 555268 552665 550223 547741 545798 544901 544828 545013 545220 545621 546513 548080
59651 548080 550240 552714 555328 558049 560556 562175 562659 562600 562496 561762 559398 555444 550994 546848 542966
59636 542966 539223 535760 532430 528828 525207 522592 521495 521156 520566 519619 518703 517695 516145 514156 512343
59621 512343 510916 509354 507049 503885 500131 496073 491859 487537 483238 479387 476631 475351 475274 475748 476398
59606 476398 477408 479194 481867 484969 487719 489593 490737 491723 492845 493789 494072 493714 493354 493721 495071 497091
$$ packed form
59713F04669l23l84O4N75N56K93M62J039J473J677K030K483K406J592P79Q73J856
59696F22120K814K940K339J814J912K426K768K617J946P29r44k554l363l117k286
59681F32161j645j686k324k929k874k342k302l247m458n064n342o087p015p015
59667E77831n904m797m391m110l361k603k442k482j943q97p3J85K07M01Q92J567
59651E48080K160K474K614K721K507J619M84n9j04p34k364l954m450m146l882
59636E42966l743l463l330l602l621k615j097l39n90r47r16j008j550j989j813
59621E12343j427j562k305l164l754m058m214m322m299l851k756j280p7M74O50
59606D76398J010J786K673L102K750J874J144R86J122R44K83l58l60L67J350K020
$$ plain form
59590 497091 499205 500894 501812 501846 501239 500555 500217 500034 499414 498105 496424 494644 492567 489983 487209 484735
59574 484735 482521 480113 477346 474514 471870 469404 467146 465291 463921 462933 462340 462292 462707 463143 463218 462895
59558 462895 462346 461853 461968 463296 465785 468462 470250 470930 471041 471029 471014 471408 473138 476830 482028 487736 493623
59541 493623 500228 507989 516789 526770 538895 553913 571056 588474 604741 618955 629435 633700
59529 633700 630688 622425 612693 604262 597844 593212 590353 589530 590905 594332 599186 604313 608515 611183
59515 611183 612349 612196 610741 607824 603211 596795 588906 580217 571165 561751 552118 542949 534809 527483
59501 527483 520489 514014 508689 504537 500829 497087 493638 490979 489074 487620 486668 486538 487185 488003 488470
59486 488470 488872 490114 492720 496242 499888 503444 507159 510964 514573 518361 523334 529864 537105 544089
$$ packed form
59590D97091K114J689R18L4o07o84l38j83o20j309j681j780k077k584k774k474
59574D84735k214k408k767k832k644k466k258j855j370r88n93m8M15M36P5l23
59558D62895n49m93J15J328K489K677J788O80J11j2j5L94J730L692N198N708N887
59541D93623O605P761Q800R981J2125J5018J7143J7418J6267J4214J0480M265
59529F33700l012q263r732q431o418m632k859q23J375L427M854N127M202K668
59515F11183J166j53j455k917m613o416p889q689r052r414r633r169q140p326
59501E27483o994o475n325m152l708l742l449k659j905j454r52j30O47Q18M67
59486D88470M02J242K606L522L646L556L715L805L609L788M973O530P241O984
$$ plain form
59472 544089 550750 557349 563483 568334 571538 573213 573476 572538 571005 569510 568198 567027 566386 566932 569009
59457 569009 572498 576954 581736 586496 591875 599068 608296 618388 628434 638976 650767 663052 674087
59444 674087 682836 689190 693004 693995 692221 687693 679891 668794 656069 644011 633381 623305 613118
59431 613118 603218 594272 586739 581174 577880 576180 575019 574291 574703 576561 579813 585088 593379 604712
59417 604712 618357 634243 652885 674024 696925 721993 750253 780746 810112 835252 854701
59406 854701 866742 868351 857860 837725 813371 789958 771099 759280 755501 758500 765404 773166
59394 773166 778814 779009 770736 752979 727578 698535 670273 645705 625308 608196 593963 582896
59382 582896 574748 568649 564429 562595 562541 562322 561133 560646 562718 566807 570945 574229 577022 579492 581518
$$ packed form
59472E44089O661O599O134M851L204J675K63r38j533j495j312j171o41N46K077
59457E69009L489M456M782M760N379P193R228J0092J0046J0542J1791J2285J1035
59444F74087Q749O354L814R91j774m528p802j1097j2725j2058j0630j0076j0187
59431F13118r900q946p533n565l294j700j161p28M12J858L252N275Q291J1333
59417F04712J3645J5886J8642K1139K2901K5068K8260L0493K9366K5140J9449
59406H54701J2041J609j0491k0135k4354k3413j8859j1819l779K999O904P762
59394G73166N648J95q273j7757k5401k9043k8262k4568k0397j7112j4233j1067
59382E82896q148o099m220j834n4k19j189m87K072M089M138L284K793K470K026
$$ plain form
59367 581518 583602 586447 589889 593417 597431 602733 609034 615275 621371 628387 636836 645953 654873 663634
59353 663634 672727 682443 692934 704279 716272 728656 741636 755666 770649 785826 800489 814428
59341 814428 827733 840596 853168 865117 875400 882970 887639 889821 889580 886466 880227 871125 859588
59328 859588 846029 831043 815336 799414 783630 768481 754490 741795 730154 719310 709187
59317 709187 699850 691510 684417 678593 673865 670300 668197 667432 667189 666692 665907 665299 665375 666805 670491 676916
59301 676916 685665 695965 707304 719079 730002 738323 742421 741004 733442 720602 704885 688632
59289 688632 672644 656741 641442 628279 618491 611956 607463 603725 600247 597505 596178 596158 596740 597855
59275 597855 600468 605358 612124 619908 628485 638033 648406 659392 671220 684025 697072 709209 719797
$$ packed form
59367E81518K084K845L442L528M014N302O301O241O096P016Q449R117Q920Q761
59353F63634R093R716J0491J1345J1993J2384J2980J4030J4983J5177J4663J3939
59341H14428J3305J2863J2572J1949J0283P570M669K182k41l114o239r102j1537
59328H59588j3559j4986j5707j5922j5784j5149j3991j2695j1641j0844j0123
59317G09187r337q340p093n824m728l565k103p65k43m97p85o08P6J430L686O425
59301F76916Q749J0300J1339J1775J0923Q321M098j417p562j2840j5717j6253
59289F88632j5988j5903j5299j3163r788o535m493l738l478k742j327k0N82J115
59275E97855K613M890O766P784Q577R548J0373J0986J1828J2805J3047J2137J0588
$$ plain form
59262 719797 728650 735424 739743 741623 741135 738005 732209 724542 715840 706051 694970 683526 673267 664570
59248 664570 656298 647427 638339 630380 624659 621368 619795 618995 618734 619675 622298 626025 629857 633513 637331
59233 637331 641394 645485 649659 654042 658123 660943 662038 661746 660644 659131 657411 655365 652508 648496
59219 648496 643576 638209 632593 626991 622136 618759 616863 615861 615143 614165 612480 610168 607831 605775 603744
59204 603744 601843 600872 601100 601494 601074 600266 599973 600021 599646 598848 598046 596948 595138 593393 592993 593905 594985
59187 594985 595791 596820 598037 598677 598712 599167 600642 602660 604803 607342 610379 613369 615921 618290 620756
59172 620756 623316 626215 629972 634673 639971 645916 652994 661252 670227 679818 690284 701210 711427
59159 711427 720209 727674 733834 738122 740173 740259 738698 735495 730701 724399 716385 706781 696906 688413 681352
$$ packed form
59262G19797Q853O774M319J880m88l130n796p667q702r789j1081j1444j0259q697
59248F64570q272q871r088p959n721l291j573q00k61R41K623L727L832L656L818
59233F37331M063M091M174M383M081K820J095k92j102j513j720k046k857m012
59219F48496m920n367n616n602m855l377j896j002p18r78j685k312k337k056k031
59204F03744j901r71K28L94m20q08k93M8l75p98q02j098j810j745m00R12J080
59187E94985Q06J029J217O40L5M55J475K018K143K539L037K990K552K369K466
59172F20756K560K899L757M701N298N945P078Q258Q975R591J0466J0926J0217
59159G11427Q782P465O160M288K051Q6j561l203m794o302q014r604r875q493p061
$$ plain form
59144 681352 674235 666236 658169 650913 644144 637227 630258 623452 616468 609141 602163 596195 590871 585377
59130 585377 579573 574034 569402 566154 564456 563798 563300 562892 563701 566723 571514 576724 581648 586844 593393
59115 593393 601841 611684 621776 631420 640979 651133 661711 671782 680741 688716 696040 703031 710140
59102 710140 717520 724446 729942 733924 736962 739060 739670 738899 737617 736303 734748 732942 731146 729032 726046
59087 726046 722815 720796 720161 719419 717593 715313 713060 709772 704305 697110 689354 681303 672719 664034 655936
59072 655936 648352 640889 633811 627570 621767 615565 608882 602400 596652 591739 587645 584142 580628 576700
59058 576700 572660 568975 565584 562234 559142 556770 555224 554306 553846 553545 552854 551474 549729 548139 546908
59043 546908 546004 545312 544502 543286 541976 541244 541206 541449 542063 543708 546311 548751 550384 551951 554323 557257
$$ packed form
59144F81352p117p999q067p256o769o917o969o806o984p327o978n968n324n494
59130E85377n804n539m632l248j698o58m98m08Q09L022M791N210M924N196O549
59115E93393Q448R843J0092R644R559J0154J0578J0071Q959P975P324O991P109
59102G10140P380O926N496L982L038K098O10p71j282j314j555j806j796k114k986
59087G26046l231k019o35p42j826k280k253l288n467p195p756q051q584q685q098
59072F55936p584p463p078o241n803o202o683o482n748m913m094l503l514l928
59058E76700m040l685l391l350l092k372j546r18m60l01o91j380j745j590j231
59043E46908r04o92q10j216j310p32l8K43O14J645K603K440J633J567K372K934
$$ plain form
59027 557257 560185 563419 567672 573068 579508 587461 597490 609364 622412 636263 650514 664140 676116
59014 676116 686311 695106 702433 707843 711113 712143 710738 707263 703149 699953 698132 697307 697402 698740 701288
58999 701288 704545 708147 712080 716446 721418 727150 733295 738908 743197 746081 747758 748223 747667 746785 746054
58984 746054 745018 742751 738763 733201 726689 720335 715263 711782 709518 708637 710028 713860 718955 724339
58970 724339 730517 738371 747614 757307 767196 777481 787873 797894 807668 817449 826865 835511 843711
58957 843711 851591 857952 861234 861279 859034 854901 848540 839945 829411 816581 800925 783255 765592
58944 765592 749320 734483 720994 709294 699418 690472 681667 673214 665761 659526 654390 650344 647337
58931 647337 644967 642640 640001 637168 634679 633061 632226 631444 630167 628630 627319 626191 624858 623221 621435
$$ packed form
59027E57257K928L234M253N396O440P953J0029J1874J3048J3851J4251J3626J1976
59014F76116J0195Q795P327N410L270J030j405l475m114l196j821q25R5J338K548
58999G01288L257L602L933M366M972N732O145N613M289K884J677M65n56q82p31
58984G46054j036k267l988n562o512o354n072l481k264q81J391L832N095N384
58970G24339O178P854R243R693R889J0285J0392J0021R774R781R416Q646Q200
58957H43711P880O361L282M5k245m133o361q595j0534j2830j5656j7670j7663
58944G65592j6272j4837j3489j1700r876q946q805q453p453o235n136m046l007
58931F47337k370k327k639k833k489j618q35p82j277j537j311j128j333j637j786
$$ plain form
58916 621435 619571 617845 616870 617063 618036 619115 620226 621693 623489 625457 628075 632227 638236 645724 654339
58901 654339 664019 674559 685607 697125 709391 722483 736117 749861 763190 775603 787199 798929
58889 798929 811798 826053 841616 858873 878204 898866 919225 938176 955752 972193 986986
58878 986986 999026 1007388 1011865 1012991 1011515 1007620 1000746 990359 976668 960412 942302 923108 903976
58865 903976 886174 870519 857122 845426 834355 822985 811376 800325 790074 779907 769328
58854 769328 758879 749224 740109 730917 721660 712617 703471 693642 683247 673070 663827 655916 649441
58841 649441 643896 638264 632029 625753 620148 615077 610004 604848 599715 594431 589061 584436 581379 579791
58827 579791 579038 578650 578084 576621 574398 572871 573318 575422 578109 580982 584015 586736 588977 591743 595943
$$ packed form
58916F21435j864j726r75J93R73J079J111J467J796J968K618M152O009P488Q615
58901F54339R680J0540J1048J1518J2266J3092J3634J3744J3329J2413J1596J1730
58889G98929J2869J4255J5563J7257J9331K0662K0359J8951J7576J6441J4793
58878I86986J2040Q362M477J126j476l895o874j0387j3691j6256j8110j9194j9132
58865I03976j7802j5655j3397j1696j1071j1370j1609j1051j0251j0167j0579
58854G69328j0449r655r115r192r257r043r146r829j0395j0177r243p911o475
58841F49441n545n632o235o276n605n071n073n156n133n284n370m625l057j588
58827E79791p53l88n66j463k223j527M47K104K687K873L033K721K241K766M200
$$ plain form
58812 595943 600807 604886 608103 611379 614664 616999 618361 619801 621633 622866 622686 621287 619079 616187
58798 616187 612906 609625 606155 602070 597680 593703 590058 586080 581864 578159 574948 571452 567758 565177
58784 565177 564541 565240 566364 567874 570220 573610 578079 583577 589608 595339 600283 604386 607445 608989 608749
58769 608749 606624 602333 595821 587909 579824 572208 565208 559198 554518 550780 547472 544986 544023 544135 544092
58754 544092 543633 543673 544704 546235 547977 550395 553713 557332 560636 563594 566337 568898 571633 575200 579960
58739 579960 585839 592609 599695 606090 611396 616625 622965 630011 636403 641929 647676 654181 660878 667428
58725 667428 674161 680849 686414 690341 693356 696233 698921 701188 703248 705376 707726 710771 715172 721007
58711 721007 727805 735219 742837 749583 754442 757640 759866 760480 757901 751802 743394 733324 720891 705828
$$ packed form
58812E95943M864M079L217L276L285K335J362J440J832J233j80j399k208k892
58798F16187l281l281l470m085m390l977l645l978m216l705l211l496l694k581
58784E65177o36O99J124J510K346L390M469N498O031N731M944M103L059J544k40
58769F08749k125m291o512p912q085p616p000o010m680l738l308k486r63J12m3
58754E44092m59M0J031J531J742K418L318L619L304K958K743K561K735L567M760
58739E79960N879O770P086O395N306N229O340P046O392N526N747O505O697O550
58725F67428O733O688N565L927L015K877K688K267K060K128K350L045M401N835
58711G21007O798P414P618O746M859L198K226O14k579o099q408j0070j2433j5063
$$ plain form
58697 705828 689390 672938 656655 640346 624388 609202 594722 581074 569004 559027 550851 544001
58685 544001 538253 533170 528096 523000 518523 514827 511217 507161 502912 498880 495166 491982 489737 488550
58671 488550 488358 489454 492095 495678 499329 503256 508452 515154 522768 531246 541184 552413 563690 573824
58657 573824 581870 586406 586309 582567 577742 573229 568425 562837 557329 552761 548933 545540 542783 540440 537664
58642 537664 534342 531387 529173 526966 524404 522178 520706 519566 518856 519613 522149 525296 528070 530736 533563
58627 533563 535983 537870 540280 543902 547937 551468 554896 559180 564626 571142 578621 586366 593217 598932
58613 598932 604399 609929 614560 617616 619665 621225 621877 621451 620770 620275 619120 616505 612863 609023 605330
58598 605330 602213 600285 599113 597158 593720 589717 585913 581892 577596 574329 573192 573880 575996 580105
$$ packed form
58697G05828j6438j6452j6283j6309j5958j5186j4480j3648j2070r977q176o850
58685E44001n748n083n074n096m477l696l610m056m249m032l714l184k245j187
58671D88550j92J096K641L583L651L927N196O702P614Q478R938J1229J1277J0134
58657E73824Q046M536r7l742m825m513m804n588n508m568l828l393k757k343k776
58642E37664l322k955k214k207k562k226j472j140p10P57K536L147K774K666K827
58627E33563K420J887K410L622M035L531L428M284N446O516P479P745O851N715
58613E98932N467N530M631L056K049J560O52m26o81m95j155k615l642l840l693
58598F05330l117j928j172j955l438m003l804m021m296l267j137O88K116M109
$$ plain form
58584 580105 586453 594049 602120 611186 621631 632576 643219 653856 664515 674092 682113 689865 698416
58571 698416 706912 714279 721281 729390 738915 749770 762855 778937 797211 816608 837612 861181
58559 861181 886775 913018 939535 966471 992750 1016322 1035750 1050437 1059920 1064189 1064199 1061019 1055067
58546 1055067 1047002 1038415 1030500 1022822 1014385 1005141 995468 985034 973101 959141 942397 922024 898591
58533 898591 874308 850891 828418 807020 787977 771886 757516 744052 732948 725797 721647 718266
58521 718266 714924 712173 709974 707946 706602 706466 706594 705577 703438 701095 698730 696077 693568 691751 690230
58506 690230 688440 686674 685232 683523 681161 678830 676899 674547 671597 669696 670028 671198 671245 670459 670337
58491 670337 670964 671452 671972 673303 675181 677038 679650 684250 690762 698567 708062 719727 732618 745636
$$ packed form
58584E80105O348P596Q071R066J0445J0945J0643J0637J0659R577Q021P752Q551
58571F98416Q496P367P002Q109R525J0855J3085J6082J8274J9397K1004K3569
58559H61181K5594K6243K6517K6936K6279K3572J9428J4687R483M269J0l180n952
58546A055067q065q587p915p678q437r244r673j0434j1933j3960j6744k0373k3433
58533H98591k4283k3417k2473k1398j9043j6091j4370j3464j1104p151m150l381
58521G18266l342k751k199k028j344j36J28j017k139k343k365k653k509j817j521
58506F90230j790j766j442j709k362k331j931k352k950j901L32J170M7p86j22
58491F70337O27M88N20J331J878J857K612M600O512P805R495J1665J2891J3018
$$ plain form
58477 745636 759390 774973 791807 808507 824876 841049 855596 866510 873370 876663 875948 870677
58465 870677 862008 851797 840560 828327 816558 807066 799865 794111 790438 790289 793725 799809 808333
58452 808333 819161 830892 842274 853956 866603 878252 885957 889151 888992 885378 877371 865915 853364
58439 853364 840708 827780 815727 806541 800334 795581 791932 790423 791088 792725 794970 798484 803270 808856
58425 808856 815769 824730 834807 844517 854250 865320 877098 887404 895340 901378 905062 905167 901947
58412 901947 896933 890637 882601 873419 864496 856074 847518 839070 831351 823785 815719 808393 803521 800707
58398 800707 798573 797480 798518 800789 802645 804811 809199 815148 819973 822954 825766 829185 832363 835257
58384 835257 838898 843270 847650 852843 860489 870356 880873 891824 903807 915712 925708 934237 942966
$$ packed form
58477G45636J3754J5583J6834J6700J6369J6173J4547J0914O860L293p15n271
58465H70677q669j0211j1237j2233j1769r492p201n754l673j49L436O084Q524
58452H08333J0828J1731J1382J1682J2647J1649P705L194j59l614q007j1456j2551
58439H53364j2656j2928j2053r186o207m753l649j509O65J637K245L514M786N586
58425H08856O913Q961J0077R710R733J1070J1778J0306P936O038L684J05l220
58412I01947n014o296q036r182q923q422q556q448p719p566q066p326m872k814
58398H00707k134j093J038K271J856K166M388N949M825K981K812L419L178K894
58384H35257L641M372M380N193P646R867J0517J0951J1983J1905R996Q529Q729
$$ plain form
58371 942966 951352 957455 961697 966482 972406 978192 984071 991797 1001392 1011234 1021273 1032887 1045680
58358 1045680 1057797 1069315 1082011 1095845 1108924 1120733 1132088 1142224 1149393 1154037 1157908 1160660
58346 1160660 1161093 1161118 1164149 1169840 1174820 1178598 1184182 1192743 1202284 1212031 1223565 1236905 1249986 1262903
58332 1262903 1278372 1297028 1316359 1335092 1354498 1374575 1393169 1409781 1426135 1442081 1455064
58321 1455064 1464465 1472365 1479328 1483754 1486291 1490404 1497475 1505426 1513114 1521844 1531824 1541570 1551701 1564845
58307 1564845 1580891 1596860 1612289 1630079 1651125 1672940 1694519 1717584 1741981 1764922 1786023
58296 1786023 1808097 1831828 1854680 1876250 1899427 1925055 1950670 1975772 2002976 2032731 2062406
58285 2062406 2091841 2124106 2159599 2195299 2231039 2270183 2312700 2354175 2393410 2434311 2478364
$$ packed form
58371I42966Q386O103M242M785N924N786N879P726R595R842J0039J1614J2793
58358A045680J2117J1518J2696J3834J3079J1809J1355J0136P169M644L871K752
58346A160660M33K5L031N691M980L778N584Q561R541R747J1534J3340J3081J2917
58332A262903J5469J8656J9331J8733J9406K0077J8594J6612J6354J5946J2983
58321A455064R401P900O963M426K537M113P071P951P688Q730R980R746J0131J3144
58307A564845J6046J5969J5429J7790K1046K1815K1579K3065K4397K2941K1101
58296A786023K2074K3731K2852K1570K3177K5628K5615K5102K7204K9755K9675
58285B062406K9435L2265L5493L5700L5740L9144M2517M1475L9235M0901M4053
$$ plain form
58274 2478364 2522189 2564806 2610209 2660156 2711302 2762251 2816518 2875709 2936654 2998195 3063740
58263 3063740 3134148 3205316 3275927 3350294 3430299 3512009 3593575 3678697 3768697 3859119 3948079
58252 3948079 4040021 4137126 4235207 4332398 4433704 4542346 4654828 4769221 4889903 5019379
58242 5019379 5154006 5292751 5441366 5602800 5772437 5948047 6135121 6337019 6549532
58233 6549532 6770909 7007210 7261797 7529911 7809959 8109462 8433338 8777412 9140339
58224 9140339 9530228 9952224 10401740 10877716 11390009 11945771 12542100 13180808 13876368
58215 13876368 14640095 15471498 16375271 17371061 18475921 19694354 21037819 22536764 24221300
58206 24221300 26109696 28230540 30636928 33385765 36528267 40141347 44348433 49294778
$$ packed form
58274B478364M3825M2617M5403M9947N1146N0949N4267N9191O0945O1541O5545
58263C063740P0408P1168P0611P4367Q0005Q1710Q1566Q5122R0000R0422Q8960
58252C948079R1942R7105R8081R7191J01306J08642J12482J14393J20682J29476
58242E019379J34627J38745J48615J61434J69637J75610J87074K01898K12513
58233F549532K21377K36301K54587K68114K80048K99503L23876L44074L62927
58224I140339L89889M21996M49516M75976N12293N55762N96329O38708O95560
58215A3876368P63727Q31403R03773R95790J104860J218433J343465J498945J684536
58206B4221300J888396K120844K406388K748837L142502L613080M207086M946345
$$ plain form
58198 49294778 55130206 62033955 70222358 79909501 91304212 104689405 120484112 139212346
58190 139212346 161451487 187773671 218497008 253194891 290327356 327368926 361246041
58183 361246041 388612435 406017196 410528313 400884977 378320678 346217332 308820003
58176 308820003 269995919 232645274 198615202 168793897 143320090 121899279 104072095
58169 104072095 89325023 77129471 67007600 58580013 51540525 45618991 40594024
58162 40594024 36310151 32649191 29498705 26763717 24383408 22310829 20490476 18872095
58154 18872095 17428528 16141377 14983211 13929190 12971535 12106657 11320148 10597866 9939027
58145 9939027 9344608 8803963 8305377 7848878 7436361 7059103 6706498 6377593 6073302
$$ packed form
58198D9294778N835428O903749Q188403R687143J1394711J3385193J5794707J8728234
58190A39212346K2239141K6322184L0723337L4697883L7132465L7041570L3877115
58183C61246041K7366394J7404761M511117r643336k2564299l2103346l7397329
58176C08820003l8824084l7350645l4030072k9821305k5473807k1420811j7827184
58169A04072095j4747072j2195552j0121871q427587p039488n921534n024967
58162D0594024m283873l660960l150486k734988k380309k072579j820353j618381
58154A8872095j443567j287151j158166j054021r57655q64878p86509p22282o58839
58145I939027n94419n40645m98586m56499m12517l77258l52605l28905l04291
$$ plain form
58136 6073302 5786680 5511597 5252118 5013134 4790066 4577326 4378319 4197310 4029487
58127 4029487 3868679 3717257 3579017 3449614 3323419 3202973 3092499 2988524 2885966
58118 2885966 2787518 2698199 2616057 2536569 2460887 2391686 2326005 2260083 2196399 2138330 2082699
58107 2082699 2025114 1968031 1916067 1867718 1819030 1771211 1727388 1685793 1643242 1601665 1564329
58096 1564329 1529126 1492345 1455686 1422927 1392848 1361966 1331309 1304188 1280005 1256315 1234354
58085 1234354 1216591 1201230 1184773 1167692 1152269 1137309 1120183 1101690 1083885 1065554 1044733
58074 1044733 1023142 1003359 984200 963638 943508 926444 910970 894571 878843 866487 855809
58063 855809 843483 830354 819350 809888 799634 789704 782769 777655 770853 761931 752790 743260 732141
$$ packed form
58136F073302k86622k75083k59479k38984k23068k12740j99007j81009j67823
58127D029487j60808j51422j38240j29403j26195j20446j10474j03975j02558
58118B885966r8448q9319q2142p9488p5682o9201o5681o5922o3684n8069n5631
58107B082699n7585n7083n1964m8349m8688m7819m3823m1595m2551m1577l7336
58096A564329l5203l6781l6659l2759l0079l0882l0657k7121k4183k3690k1961
58085A234354j7763j5361j6457j7081j5423j4960j7126j8493j7805j8331k0821
58074A044733k1591j9783j9159k0562k0130j7064j5474j6399j5728j2356j0678
58063H55809j2326j3129j1004r462j0254r930o935n114o802q922r141r530j1119
$$ plain form
58050 732141 720990 712156 704466 695317 685507 677594 671084 663826 656634 651844 648573 643957 638009 632915
58036 632915 628616 623394 617694 613156 608824 602468 594694 587769 581463 574002 565960 559036 552042 542390
58022 542390 530801 520461 512244 504735 498075 493579 490118 485021 478282 472145 466988 461424 455946 452497
58008 452497 450618 447774 443458 439433 436036 431711 426224 421034 416446 411487 406511 402955 400637 398126
57994 398126 395491 393900 393062 392041 392077 395485 402092 409693 417532 426258 434954 441514 445819 449487 452530
57979 452530 453166 450877 446968 442290 436962 431913 428099 424643 420360 416430 414842 415000 414821 414350 415121
57964 415121 416660 417021 416339 416465 417422 417587 417114 417725 419192 419493 418485 418008 418148 416803 413396 409850 407376
57947 407376 405332 403636 403339 404286 405064 405758 408032 412131 416612 421359 427911 436364 444900 453041 462507
$$ packed form
58050G32141j1151q834p690r149r810p913o510p258p192m790l271m616n948n094
58036F32915m299n222n700m538m332o356p774o925o306p461q042o924o994r652
58022E42390j1589j0340q217p509o660m496l461n097o739o137n157n564n478l449
58008D52497j879k844m316m025l397m325n487n190m588m959m976l556k318k511
57994C98126k635j591q38j021L6L408O607P601P839Q726Q696O560M305L668L043
57979D52530O36k289l909m678n328n049l814l456m283l930j588J58j79m71P71
57964D15121J539L61o82J26R57J65m73O11J467L01j008m77J40j345l407l546k474
57947D07376k044j696k97R47P78O94K274M099M481M747O552Q453Q536Q141R466
$$ plain form
57932 462507 474046 486031 496975 506922 515668 522073 525920 528185 528867 526781 521995 516172 510050 502900
57918 502900 494893 487599 481598 475933 470396 466041 462914 459563 455387 451310 447741 444135 440889 439237
57904 439237 438779 437465 434498 430941 427141 422127 416095 410850 407060 403544 399956 397658 397145 397125 397017
57889 397017 397864 399862 401463 402034 402992 405134 407140 408022 408856 410708 412799 414059 414697 415006 414378 412764
57873 412764 411427 411083 410780 409702 408574 408300 408681 409334 410421 411667 412167 411963 412350 413945 415870 417381
57857 417381 418801 420441 422241 424832 429077 434163 438110 440592 443116 445986 447509 446938 445745 444855 443017
57842 443017 439228 434651 430677 427029 423176 419772 417208 414404 410487 406155 402174 398087 393718 390374
57828 390374 389165 389456 390159 391178 392563 393706 394571 396222 399047 401885 403962 406116 409024 411809 413559
$$ packed form
57932D62507J1539J1985J0944R947Q746O405L847K265O82k086m786n823o122p150
57918E02900q007p294o001n665n537m355l127l351m176m077l569l606l246j652
57904D39237m58j314k967l557l800n014o032n245l790l516l588k298n13k0j08
57889C97017Q47J998J601N71R58K142K006Q82Q34J852K091J260O38L09o28j614
57873D12764j337l44l03j078j128k74L81O53J087J246N00k04L87J595J925J511
57857D17381J420J640J800K591M245N086L947K482K524K870J523n71j193q90j838
57842D43017l789m577l974l648l853l404k564k804l917m332l981m087m369l344
57828C90374j209K91P03J019J385J143Q65J651K825K838K077K154K908K785J750
$$ plain form
57813 413559 414612 415124 413964 410394 405388 400022 394033 387232 380788 375676 371259 366781 362891 360340
57799 360340 358596 357202 357125 359243 362728 366362 370163 374318 377891 380261 382575 386076 390041 393028 395221
57784 395221 397866 401228 404720 408341 412505 417024 421510 426101 430731 434597 437463 440460 444306 447807
57770 447807 449536 449950 450335 450529 449270 446102 441443 435413 428083 420304 412890 405413 397086 388274 379969
57755 379969 372323 364974 358398 353759 351780 352701 356776 363771 372486 381755 391373 401309 410734 418786
57741 418786 425564 431461 436258 439724 442289 444214 445003 444544 443859 443715 443550 442794 442128 442192 442151 441004 439338
57724 439338 438369 438105 437915 437995 438690 439104 438054 435921 434062 432924 432095 431607 431599 431150 429114 425892 422977
57707 422977 420935 419090 416953 414625 411996 408815 405566 403255 402365 402777 404321 406585 408685 410147 411590
$$ packed form
57813D13559J053N12j160l570n006n366n989o801o444n112m417m478l890k551
57799C60340j744j394p7K118L485L634L801M155L573K370K314L501L965K987K193
57784C95221K645L362L492L621M164M519M486M591M630L866K866K997L846L501
57770D47807J729M14L85J94j259l168m659o030p330p779p414p477q327q812q305
57755C79969p646p349o576m639j979R21M075O995Q715R269R618R936R425Q052
57741D18786O778N897M797L466K565J925P89m59o85j44j65p56o66O4m1j147j666
57724D39338r69k64j90Q0O95M14j050k133j859j138q29m88qm49k036l222k915
57707D22977k042j845k137k328k629l181l249k311q90M12J544K264K100J462J443
$$ plain form
57692 411590 413707 416179 418372 420278 421792 422002 420443 418271 416865 416135 415551 415996 418924 424297 431017
57677 431017 438940 448882 461114 475546 493105 515261 542429 574476 612570 658677 712891 772546
57665 772546 833732 891950 941166 974207 985475 973232 939755 890478 832766 773743 718216
57654 718216 668647 626408 591895 563881 540386 520565 504828 493238 484956 479148 475211 472077
57642 472077 468602 464928 462426 461994 463299 465731 469056 472884 476447 479250 481382 483089 484639 486456
57628 486456 488688 490757 492018 492654 493242 493753 493771 493320 492643 491619 490355 489890 491120 493283 494630 494419
57612 494419 493268 491886 490654 490128 490696 491825 492833 494173 496753 500206 503209 505400 507588 510088 512238
57597 512238 513625 514528 514974 514637 513790 513105 512365 510650 508015 505735 504658 504479 504853 505897 507284 508131
$$ packed form
57692D11590K117K472K193J906J514K10j559k172j406p30n84M45K928N373O720
57677D31017P923R942J2232J4432J7559K2156K7168L2047L8094M6107N4214N9655
57665G72546O1186N8218M9216L3041J1268j2243l3477m9277n7712n9023n5527
57654G18216m9569m2239l4513k8014k3495j9821j5737j1590q282n808l937l134
57642D72077l475l674k502m32J305K432L325L828L563K803K132J707J550J817
57628D86456K232K069J261O36N88N11J8m51o77j024j264m65J230K163J347k11
57612D94419j151j382j232n26N68J129J008J340K580L453L003K191K188K500K150
57597E12238J387R03M46l37q47o85p40j715k635k280j077j79L74J044J387Q47
$$ plain form
57581 508131 508346 508951 510560 512527 514107 515459 516921 518190 518866 519135 519410 519804 520331 521126 522194 523383
57565 523383 524691 526129 527424 528513 530178 533330 537717 542156 546007 549564 553055 556223 558964 561577
57551 561577 564392 567889 572848 579307 585647 590041 592743 595624 599417 602902 605124 606967 609869 614147
57537 614147 619226 624596 629879 634648 638717 642135 644856 647081 649837 654160 659653 664906 669429 674072
57523 674072 679393 684908 690269 695914 702093 708390 714719 721704 729469 737120 744025 750692 757786 765114
57509 765114 772104 778455 783811 787623 789897 791333 792434 793212 794015 795588 797895 799931 801210 802424 804125
57494 804125 805802 806919 807940 809516 811600 814091 817532 822258 827487 832108 835941 839600 843550 847854
57480 847854 852406 856993 861485 866200 871542 877173 882273 886758 891322 896119 900536 904620 909505 915825
$$ packed form
57581E08131K15O05J609J967J580J352J462J269O76K69K75L94N27P95J068J189
57565E23383J308J438J295J089J665L152M387M439L851L557L491L168K741K613
57551E61577K815L497M959O459O340M394K702K881L793L485K222J843K902M278
57537F14147N079N370N283M769M069L418K721K225K756M323N493N253M523M643
57523F74072N321N515N361N645O179O297O329O985P765P651O905O667P094P328
57509G65114O990O351N356L812K274J436J101P78Q03J573K307K036J279J214J701
57494H04125J677J117J021J576K084K491L441M726N229M621L833L659L950M304
57480H47854M552M587M492M715N342N631N100M485M564M797M417M084M885O320
$$ plain form
57466 915825 922834 929776 936984 944736 952138 958301 963818 969958 976977 984278 991691 999551 1007857 1016311
57452 1016311 1024873 1033522 1041736 1048992 1055528 1061981 1068601 1075424 1082856 1091349 1100759 1110604 1120700 1131022
57438 1131022 1141312 1151352 1161345 1171464 1181365 1190634 1199404 1208098 1216952 1226252 1236560 1248035 1259838
57425 1259838 1270845 1280797 1290328 1300096 1310320 1320951 1331852 1342882 1354016 1365207 1376135 1386520
57413 1386520 1396819 1407985 1420261 1432784 1444704 1456140 1467684 1479530 1491528 1503551 1515373
57402 1515373 1526630 1537320 1547935 1558806 1569841 1581136 1593227 1606301 1619755 1632995 1646225
57391 1646225 1660064 1674856 1690618 1707092 1723574 1739335 1754537 1770101 1786473 1803273 1820377
57380 1820377 1838245 1856655 1874146 1889647 1903875 1918324 1933529 1949131 1964935 1980898 1996564
$$ packed form
57466I15825P009O942P208P752P402O163N517O140P019P301P413P860Q306Q454
57452A016311Q562Q649Q214P256O536O453O620O823P432Q493R410R845J0096J0322
57438A131022J0290J0040R993J0119R901R269Q770Q694Q854R300J0308J1475J1803
57425A259838J1007R952R531R768J0224J0631J0901J1030J1134J1191J0928J0385
57413A386520J0299J1166J2276J2523J1920J1436J1544J1846J1998J2023J1822
57402A515373J1257J0690J0615J0871J1035J1295J2091J3074J3454J3240J3230
57391A646225J3839J4792J5762J6474J6482J5761J5202J5564J6372J6800J7104
57380A820377J7868J8410J7491J5501J4228J4449J5205J5602J5804J5963J5666
$$ plain form
57369 1996564 2011514 2026145 2041250 2056976 2072834 2088481 2103979 2119539 2135507 2152301 2169943
57358 2169943 2188020 2206411 2225535 2245514 2265750 2285861 2306374 2327780 2349442 2370228 2389921
57347 2389921 2409437 2429863 2451636 2474275 2496568 2517532 2537537 2557925 2579264 2600718 2621498
57336 2621498 2642006 2662941 2684205 2705495 2727197 2749765 2772787 2795480 2817675 2839663 2861645
57325 2861645 2883938 2907006 2930626 2953697 2975663 2997372 3019786 3042666 3065393 3088256 3111825
57314 3111825 3135774 3159477 3183222 3207695 3232756 3257813 3282974 3308704 3334731 3360450 3386143
57303 3386143 3412706 3440378 3468641 3497138 3525754 3554081 3581730 3608950 3636171 3663322 3690340
57292 3690340 3717800 3746130 3774834 3803487 3832898 3864077 3896598 3929255 3961842 3994908 4028224
$$ packed form
57369A996564J4950J4631J5105J5726J5858J5647J5498J5560J5968J6794J7642
57358B169943J8077J8391J9124J9979K0236K0111K0513K1406K1662K0786J9693
57347B389921J9516K0426K1773K2639K2293K0964K0005K0388K1339K1454K0780
57336B621498K0508K0935K1264K1290K1702K2568K3022K2693K2195K1988K1982
57325B861645K2293K3068K3620K3071K1966K1709K2414K2880K2727K2863K3569
57314C111825K3949K3703K3745K4473K5061K5057K5161K5730K6027K5719K5693
57303C386143K6563K7672K8263K8497K8616K8327K7649K7220K7221K7151K7018
57292C690340K7460K8330K8704K8653K9411L1179L2521L2657L2587L3066L3316
$$ plain form
57281 4028224 4060980 4093298 4126055 4159343 4192558 4225914 4260349 4295817 4331136 4365737 4400268
57270 4400268 4435261 4470517 4506089 4542629 4580419 4619132 4658769 4699672 4741469 4783203 4824722
57259 4824722 4866618 4908450 4948517 4986068 5022558 5059907 5098469 5137372 5175962 5214153 5252086
57248 5252086 5290163 5328872 5368028 5406668 5444034 5480115 5514995 5548459 5580579 5611828 5642179
57237 5642179 5670781 5697003 5721087 5743392 5763800 5782503 5800644 5819470 5839294 5859892 5881462
57226 5881462 5904569 5929473 5956002 5983822 6012521 6041737 6071625 6102879 6135944 6170376 6205193
57215 6205193 6239597 6273226 6306081 6338406 6370407 6401974 6432913 6463405 6493874 6524518 6555409
57204 6555409 6586914 6619320 6652113 6684331 6715764 6747097 6778721 6810037 6840161 6868669 6895452
$$ packed form
57281D028224L2756L2318L2757L3288L3215L3356L4435L5468L5319L4601L4531
57270D400268L4993L5256L5572L6540L7790L8713L9637M0903M1797M1734M1519
57259D824722M1896M1832M0067L7551L6490L7349L8562L8903L8590L8191L7933
57248E252086L8077L8709L9156L8640L7366L6081L4880L3464L2120L1249L0351
57237E642179K8602K6222K4084K2305K0408J8703J8141J8826J9824K0598K1570
57226E881462K3107K4904K6529K7820K8699K9216K9888L1254L3065L4432L4817
57215F205193L4404L3629L2855L2325L2001L1567L0939L0492L0469L0644L0891
57204F555409L1505L2406L2793L2218L1433L1333L1624L1316L0124K8508K6783
$$ plain form
57193 6895452 6920451 6943835 6965970 6986978 7006815 7025837 7044693 7063520 7081889 7099743 7117739
57182 7117739 7136401 7155460 7174226 7192092 7208522 7223252 7236711 7249557 7261503 7271258 7277993 7282327
57170 7282327 7285425 7287644 7288463 7287273 7283863 7278436 7271403 7262783 7251663 7236746 7217679 7195410 7170956
57157 7170956 7144237 7114397 7080876 7043951 7004588 6963982 6922944 6881603 6840025 6799034 6759937
57146 6759937 6723434 6689422 6657924 6629614 6605223 6584953 6568606 6555732 6545473 6536751 6528703 6520439
57134 6520439 6510390 6496549 6477483 6452466 6420719 6381491 6335298 6284409 6231742 6179875 6131367
57123 6131367 6089215 6056210 6033874 6021889 6017959 6018102 6017838 6013769 6004238 5989157 5970184 5951025 5936381
57110 5936381 5930010 5934210 5951006 5982821 6031748 6099286 6187501 6299991 6441727 6619177 6841325
$$ packed form
57193F895452K4999K3384K2135K1008J9837J9022J8856J8827J8369J7854J7996
57182G117739J8662J9059J8766J7866J6430J4730J3459J2846J1946R755O735M334
57170G282327L098K219Q19j190l410n427p033q620j1120j4917j9067k2269k4454
57157G170956k6719k9840l3521l6925l9363m0606m1038m1341m1578m0991l9097
57146F759937l6503l4012l1498k8310k4391k0270j6347j2874j0259q722q048q264
57134F520439j0049j3841j9066k5017l1747l9228m6193n0889n2667n1867m8508
57123F131367m2152l3005k2336j1985l930J43k64m069r531j5081j8973j9159j4644
57110E936381o371M200J6796L1815M8927O7538Q8215J12490J41736J77450K22148
$$ plain form
57099 6841325 7119965 7468458 7900703 8431522 9077017 9853471 10775768 11856595 13106122
57090 13106122 14531598 16137010 17922241 19880620 21995382 24237079 26562673 28916161
57082 28916161 31231773 33439153 35464811 37225498 38621446 39545252 39909605 39675906
57074 39675906 38862921 37533695 35775612 33685600 31361187 28894460 26368778 23858044
57066 23858044 21425944 19123712 16988127 15041430 13292870 11741157 10377655 9189317
57058 9189317 8160171 7272011 6506026 5844960 5273912 4779590 4349936 3974784 3646073
57049 3646073 3357000 3101384 2873985 2670867 2488972 2325621 2178586 2046213 1927015
57040 1927015 1819289 1721419 1632491 1552292 1480662 1417114 1361297 1313637 1275163 1246840 1229491
$$ packed form
57099F841325K78640L48493M32245N30819O45495P76454R22297J080827J249527
57090A3106122J425476J605412J785231J958379K114762K241697K325594K353488
57082B8916161K315612K207380K025658J760687J395948R23806L64353k33699
57074C9675906q12985j329226j758083k090012k324413k466727k525682k510734
57066B3858044k432100k302232k135585j946697j748560j551713j363502j188338
57058I189317j029146q88160p65985o61066n71048m94322m29654l75152l28711
57049C646073k89073k55616k27399k03118j81895j63351j47035j32373j19198
57040A927015j07726r7870q8928q0199p1630o3548n5817m7660l8474k8323j7349
$$ plain form
57029 1229491 1224098 1231003 1248193 1271241 1295651 1318081 1333918 1334937 1312458 1264044 1195885 1118208
57017 1118208 1039619 965695 899953 843664 795589 753846 717861 687642 662121 639751 620228
57006 620228 604098 590902 579097 567769 557198 547582 538278 528479 517888 506579 494832 483234
56994 483234 472410 462709 454422 447952 443239 439469 436055 433573 433070 434779 438237 443243 449770 457062
56980 457062 463555 467606 467820 463154 453569 440336 425088 408873 392705 378267 366926 358400 351552
56967 351552 346189 342948 341657 341262 341542 343694 348864 357086 368008 381657 397932 415935 434131
56954 434131 450661 463328 469967 469370 461772 448472 431337 412443 393504 375487 359087 345284
56942 345284 334890 327805 323414 321646 322936 327314 334346 343980 356697 372761 391952 413941 438080
$$ packed form
57029A229491n393O905J7190K3048K4410K2430J5837J019k2479m8414o8159p7677
57017A118208p8589p3924o5742n6289m8075m1743l5985l0219k5521k2370j9523
57006F20228j6130j3196j1805j1328j0571r616r304r799j0591j1309j1747j1598
56994D83234j0824r701q287o470m713l770l414k482n03J709L458N006O527P292
56980D57062O493M051K14m666r585j3233j5248j6215j6168j4438j1341q526o848
56967C51552n363l241j291l95K80K152N170Q222J0922J3649J6275J8003J8196
56954D34131J6530J2667O639n97p598j3300j7135j8894j8939j8017j6400j3803
56942C45284j0394p085m391j768J290M378P032R634J2717J6064J9191K1989K4139
$$ plain form
56929 438080 462638 484870 501959 511484 511347 500483 480153 453925 425890 398888 374127 351699
56917 351699 331301 312937 297109 284158 273702 265197 258602 253760 249578 244867 239837 235696 232811
56904 232811 230394 228110 226772 226968 228009 228876 229472 230422 232179 234889 238680 243619 249691 257038 265933
56889 265933 276483 288856 303721 321694 342067 362733 381598 397341 408574 413339 410402 400762
56877 400762 387168 372268 357687 344566 334190 327703 325486 327043 331541 338419 347639 359619 375227
56864 375227 395741 422430 455975 496328 542815 593641 645248 692942 732559 761003 775228
56853 775228 772327 751962 718208 677838 636815 598749 565632 538557 517930 504160 498152 500375
56841 500375 509981 526004 549088 580876 622031 672232 731712 800900 877987 958051 1034752 1101569
$$ packed form
56929D38080K4558K2232J7089R525j37j0864k0330k6228k8035k7002k4761k2428
56917C51699k0398j8364j5828j2951j0456q505o595m842m182m711n030m141k885
56904B32811k417k284j338J96J041Q67N96R50J757K710L791M939O072P347Q895
56889B65933J0550J2373J4865J7973K0373K0666J8865J5743J1233M765k937r640
56877D00762j3594j4900j4581j3121j0376o487k217J557M498O878R220J1980J5608
56864C75227K0514K6689L3545M0353M6487N0826N1607M7694L9617K8444J4225
56853G75228k901k0365l3754m0370m1023l8066l3117k7075k0627j3770o008K223
56841E00375R606J6023K3084L1788M1155N0201N9480O9188P7087Q0064P6701O6817
$$ plain form
56829 1101569 1151298 1176484 1172193 1138527 1080570 1006689 926530 848511 777612 715604 663367
56818 663367 621995 591589 570568 557225 551226 553008 562681 580361 606798 642686 687583 739747
56806 739747 796261 852662 902999 940957 961030 959204 934137 888639 829272 763575 697596 635645
56794 635645 580764 534379 496227 465580 442210 425832 415477 410254 410180 415588 426223 441616
56782 441616 461802 486803 515472 545219 572557 593673 605132 604818 592251 568130 534267 494132
56770 494132 452365 412803 377144 345641 318303 294942 274861 257397 242434 229914 219298
56759 219298 210034 202160 195968 191416 188133 185574 182999 179961 176986 175017 173873 172135 169000 165378
56745 165378 162596 160933 160030 159835 160235 160467 159857 158696 157674 156907 156168 155570 155272 155026 154661 154531 154834
$$ packed form
56829A101569M9729K5186m291l3666n7957p3881q0159p8019p0899o2008n2237
56818F63367m1372l0406k1021j3343n999J782R673J7680K6437L5888M4897N2164
56806G39747N6514N6401N0337L7958K0073j826k5067m5498n9367o5697o5979o1951
56794F35645n4881m6385l8152l0647k3370j6378j0355n223p4N408J0635J5393
56782D41616K0186K5001K8669K9747K7338K1116J1459l14j2567k4121l3863m0135
56770D94132m1767l9562l5659l1503k7338k3361k0081j7464j4963j2520j0616
56759B19298r264p874o192m552l283k559k575l038k975j969j144j738l135l622
56745A65378k782j663r03j95M00K32o10j161j022p67p39n98k98k46l65j30L03
$$ plain form
56728 154834 155058 154786 154524 154974 155935 156758 157506 158850 160933 163047 164402 164886 165163 166130 167919 169383 169260
56711 169260 167872 166865 167144 168142 169397 171478 174609 177742 179997 181903 184101 185870 186250 185786 185709 186041
56695 186041 185910 185305 185062 185373 185618 185528 185313 184825 183710 182410 181907 182432 183278 183829 183994 183738 183065 182445
56677 182445 182491 183230 184186 184900 184882 183554 181077 178791 177933 178255 178736 179168 180029 181218 182091 182575 183177 183993
56659 183993 184637 184995 185155 184777 183573 182185 181569 181587 181245 180271 179411 179180 179271 179360 179573 180066 180765 181571 182236
56640 182236 182292 181813 181886 183439 185928 188132 189850 191693 193569 194802 195619 197048 199084 200364 200060 198970
56624 198970 198176 197639 196637 194781 192120 188869 185454 182323 179453 176520 173620 171262 169642 168573 168021
56609 168021 168011 168081 167688 167131 167222 167997 168663 168910 169358 170544 172265 174089 175665 176416 175868 174558 173798 174176
$$ packed form
56728A54834K24k72k62M50R61Q23P48J344K083K114J355M84K77R67J789J464j23
56711A69260j388j007K79R98J255K081L131L133K255J906K198J769L80m64p7L32
56695A86041j31o05k43L11K45r0k15m88j115j300n03N25Q46N51J65k56o73o20
56677A82445M6P39R56P14j8j328k477k286q58L22M81M32Q61J189Q73M84O02Q16
56659A83993O44L58J60l78j204j388o16J8l42r74q60k31R1Q9K13M93O99Q06O65
56640A82236N6m79P3J553K489K204J718J843J876J233Q17J429K036J280l04j090
56624A98970p94n37j002j856k661l251l415l131k870k933k900k358j620j069n52
56609A68021j0P0l93n57R1P75O66K47M48J186J721J824J576P51n48j310p60L78
$$ plain form
56591 174176 175014 175529 175796 176310 177301 178725 180336 181544 181868 181693 181977 183097 184607 186137 187745 189280
56575 189280 190280 190733 191198 191918 192551 193045 194094 196394 200047 204906 210865 217503 224093 230413 237236
56560 237236 245747 256694 269996 284720 299377 312638 323765 332250 337518 339571 339504 338625 337369
56547 337369 335735 334194 333174 332091 330125 327701 325918 324594 322211 317927 312458 306803 301266 295973
56533 295973 291151 286550 281557 276235 271301 266831 261974 256258 250287 244909 240530 237391 235525 234222
56519 234222 232487 230213 228054 226130 223924 221489 219485 217861 215795 213217 211133 210061 209400 208727 208439
56504 208439 208642 208690 208349 208161 208084 207089 204821 202426 200997 200313 199813 199605 199666 199211 197818 196229 195185 194441
56486 194441 193664 193217 193139 192530 191035 189959 190709 192932 195283 197237 198959 200143 200346 200106 200476 201643
$$ packed form
56591A74176Q38N15K67N14R91J424J611J208L24j75K84J120J510J530J608J535
56575A89280J000M53M65P20O33M94J049K300L653M859N959O638O590O320O823
56560B37236Q511J0947J3302J4724J4657J3261J1127Q485N268K053o7q79j256
56547C37369j634j541j020j083j966k424j783j324k383m284n469n655n537n293
56533B95973m822m601m993n322m934m470m857n716n971n378m379l139j866j303
56519B34222j735k274k159j924k206k435k004j624k066k578k084j072o61o73k88
56504B08439K03M8l41j88p7r95k268k395j429o84n00k08O1m55j393j589j044p44
56486A94441p77m47p8o09j495j076P50K223K351J954J722J184K03k40L70J167
$$ plain form
56470 201643 202968 204128 205329 206568 207559 208235 208682 208781 208487 208219 208422 209021 209734 210565 211580 212589 213493
56453 213493 214533 215827 217109 218241 219423 220608 221418 222018 223341 225912 229087 231866 233843 234983 235262
56438 235262 235047 235040 235380 235479 235142 234949 235079 234816 233866 233146 233390 233846 233282 231592 229579 227843 226673 226392
56420 226392 226946 227660 228090 228553 229291 229847 229940 230146 230992 232036 232615 232770 232779 232520 231999 231740 231900 231829 231216 230864
56400 230864 231523 232812 234103 235529 237233 238555 238984 239125 239715 240590 241628 243722 247489 251828 255180
56385 255180 257673 260654 264610 268911 273283 278131 283516 288942 294198 299473 304658 309132 312046 312379
56371 312379 309403 303785 297615 292498 288103 283322 278133 273434 269745 267073 265474 264772 264290 263692 263486
56356 263486 263901 264076 263353 262517 262689 263754 265023 266545 268520 270220 270962 271454 272772 274551 275649 276016
$$ packed form
56470B01643J325J160J201J239R91O76M47R9k94k68K03N99P13Q31J015J009R04
56453B13493J040J294J282J132J182J185Q10O00J323K571L175K779J977J140K79
56438B35262k15pL40R9l37j93J30k63r50p20K44M56n64j690k013j736j170k81
56420B26392N54P14M30M63P38N56R3K06Q46J044N79J55Rk59n21k59J60p1o13l52
56400B30864O59J289J291J426J704J322M29J41N90Q75J038K094L767M339L352
56385B55180K493K981L956M301M372M848N385N426N256N275N185M474K914L33
56371C12379k976n618o170n117m395m781n189m699l689k672j599p02m82n98k06
56356B63486M15J75p23q36J72J065J269J522J975J700P42M92J318J779J098L67
$$ plain form
56340 276016 276410 276787 276569 276200 276819 278551 280548 282591 285239 288501 291744 294860 298277 301851 304969
56325 304969 307721 310779 314163 317224 319766 322091 324066 325248 325899 326826 328280 329923 331663 333527 334997
56310 334997 335526 335557 336015 337045 338297 340093 343116 347092 350943 354233 357502 361314 365787 370844 375995
56295 375995 380241 383068 385215 387598 390048 392052 394121 397230 401390 405904 410542 415359 419989 424327
56281 424327 429312 435710 442740 449249 455565 462747 470623 478274 485942 494753 504846 515423 526398
56268 526398 538411 551411 564820 578932 594659 612083 630662 650551 672341 695924 721204
56257 721204 749481 782386 819777 860485 904836 954609 1010741 1073000 1141819 1218448 1303105
56246 1303105 1394680 1492370 1595991 1704595 1816375 1929873 2043666 2154968 2260286 2357405
$$ packed form
56340B76016L94L77k18l69O19J732J997K043K648L262L243L116L417L574L118
56325C04969K752L058L384L061K542K325J975J182O51R27J454J643J740J864J470
56310C34997N29L1M58J030J252J796L023L976L851L290L269L812M473N057N151
56295C75995M246K827K147K383K450K004K069L109M160M514M638M817M630M338
56281D24327M985O398P030O509O316P182P876P651P668Q811J0093J0577J0975
56268E26398J2013J3000J3409J4112J5727J7424J8579J9889K1790K3583K5280
56257G21204K8277L2905L7391M0708M4351M9773N6132O2259O8819P6629Q4657
56246A303105R1575R7690J03621J08604J11780J13498J13793J11302J05318R7119
$$ plain form
56236 2357405 2445049 2520735 2580923 2623347 2647516 2653044 2639533 2608173 2561526 2501469 2429112
56225 2429112 2346717 2257649 2164191 2067236 1968322 1870022 1774104 1681179 1592294 1508902 1430991
56214 1430991 1357244 1287406 1222598 1163042 1107497 1055335 1007213 963311 922852 885722 852571
56203 852571 822896 795026 768500 744533 723755 705431 689288 675983 665222 655492 646182 637995
56191 637995 630783 623200 615145 608402 604041 601157 598813 597201 596158 594618 592361 590476 589384 588319
56177 588319 587324 587647 589506 591540 593163 595346 598406 601291 603875 607652 613185 619037 624237 629672 636090
56162 636090 642867 649806 657991 667802 678115 688461 699888 712774 726016 739416 754588 772450
56150 772450 792132 813501 838370 867956 901624 939568 984299 1037854 1099807 1169741 1249477
$$ packed form
56236B357405Q7644P5686O0188M2424K4169N528j3511l1360m6647o0057p2357
56225B429112q2395q9068r3458r6955r8914r8300r5918r2925q8885q3392p7911
56214A430991p3747o9838o4808n9556n5545n2162m8122m3902m0459l7130l3151
56203H52571k9675k7870k6526k3967k0778j8324j6143j3305j0761r730r310q187
56191F37995p212p583q055o743m361k884k344j612j043j540k257j885j092j065
56177E88319r95L23J859K034J623K183L060K885K584L777N533N852N200N435O418
56162F36090O777O939Q185R811J0313J0346J1427J2886J3242J3400J5172J7862
56150G72450J9682K1369K4869K9586L3668L7944M4731N3555O1953O9934P9736
$$ plain form
56139 1249477 1340936 1443516 1555005 1672974 1793504 1910479 2018162 2113442 2194866 2261757
56129 2261757 2315813 2361411 2402398 2439770 2473236 2502659 2526487 2541102 2543807 2535159 2517349 2492217
56117 2492217 2461675 2427337 2387876 2338846 2276764 2201607 2114524 2016195 1909318 1799986 1694187
56106 1694187 1594782 1503456 1422987 1355293 1299344 1253212 1216337 1187938 1165449 1146694 1131813
56095 1131813 1121226 1113729 1108350 1105879 1106641 1108827 1110869 1113325 1116783 1120282 1123583 1128413 1135520 1143074
56081 1143074 1149974 1158042 1168769 1180626 1191951 1203769 1217258 1231086 1243889 1256876 1271385 1286370
56069 1286370 1300854 1316289 1333784 1351572 1367957 1384324 1402560 1422035 1441830 1463203 1487049
56058 1487049 1511551 1535172 1559294 1585036 1610371 1633484 1656101 1680246 1704548 1727137 1749414
$$ packed form
56139A249477R1459J02580J11489J17969J20530J16975J07683R5280Q1424O6891
56129B261757N4056M5598M0987L7372L3466K9423K3828J4615K705q648j7810k5132
56117B492217l0542l4338l9461m9030o2082p5157q7083r8329j06877j09332j05799
56106A694187r9405r1326q0469o7694n5949m6132l6875k8399k2489j8755j4881
56095A131813j0587p497n379k471P62K186K042K456L458L499L301M830P107P554
56081A143074O900Q068J0727J1857J1325J1818J3489J3828J2803J2987J4509J4985
56069A286370J4484J5435J7495J7788J6385J6367J8236J9475J9795K1373K3846
56058A487049K4502K3621K4122K5742K5335K3113K2617K4145K4302K2589K2277
$$ plain form
56047 1749414 1773488 1798585 1823404 1849354 1877999 1907966 1937832 1969302 2004078 2040413 2076242
56036 2076242 2112798 2151598 2191084 2230035 2271050 2316619 2364911 2413509 2463988 2518474 2574993
56025 2574993 2630789 2687138 2746301 2806850 2866706 2927713 2992556 3060281 3129386 3201924 3279800
56014 3279800 3360588 3441969 3526732 3618375 3715578 3816156 3922271 4036055 4154322 4273653
56004 4273653 4396676 4527263 4663796 4803583 4949522 5105683 5270620 5441875 5622442
55995 5622442 5815648 6018582 6228271 6449421 6687987 6942187 7208408 7490713 7795378
55986 7795378 8121222 8464988 8831146 9226359 9649511 10097705 10576977 11096468 11657590
55977 11657590 12260147 12913249 13628380 14408103 15254325 16181119 17206226 18337594 19583274
$$ packed form
56047A749414K4074K5097K4819K5950K8645K9967K9866L1470L4776L6335L5829
56036B076242L6556L8800L9486L8951M1015M5569M8292M8598N0479N4486N6519
56025B574993N5796N6349N9163O0549N9856O1007O4843O7725O9105P2538P7876
56014C279800Q0788Q1381Q4763R1643R7203J00578J06115J13784J18267J19331
56004D273653J23023J30587J36533J39787J45939J56161J64937J71255J80567
55995E622442J93206K02934K09689K21150K38566K54200K66221K82305L04665
55986G795378L25844L43766L66158L95213M23152M48194M79272N19491N61122
55977A1657590O02557O53102P15131P79723Q46222R26794J025107J131368J245680
$$ plain form
55968 19583274 20967277 22520381 24264330 26223409 28444085 30986065 33905784 37272713
55960 37272713 41195815 45814742 51277522 57750026 65430697 74526691 85237461 97809633
55952 97809633 112609351 130119160 150885086 175457236 204197308 236837785 272037154
55945 272037154 307361969 339717214 365783854 382271223 386392602 376850373 354744181
55938 354744181 323453962 287383736 250490679 215516319 183989763 156530438 133142635
55931 133142635 113484192 97092128 83491558 72214788 62829316 54982635 48401194
55924 48401194 42852455 38135567 34099863 30637630 27653918 25061527 22798216 20822543
55916 20822543 19091428 17559409 16196328 14985983 13907947 12936987 12058195 11266218
$$ packed form
55968A9583274J384003J553104J743949J959079K220676K541980K919719L366929
55960C7272713L923102M618927N462780O472504P680671R095994J0710770J2572172
55952I7809633J4799718J7509809K0765926K4572150K8740072L2640477L5199369
55945B72037154L5324815L2355245K6066640J6487369M121379r542229k2106192
55938C54744181l1290219l6070226l6893057l4974360l1526556k7459325k3387803
55931A33142635j9658443j6392064j3600570j1276770r385472p846681o581441
55924D8401194n548739m716888m035704l462233k983712k592391k263311j975673
55916B0822543j731115j532019j363081j210345j078036r70960q78792p91977
$$ plain form
55908 11266218 10550495 9895690 9294927 8748184 8248601 7783631 7348670 6947024 6577301
55899 6577301 6232626 5911261 5616319 5345519 5091974 4854525 4637098 4438489 4252571
55890 4252571 4077897 3917586 3770492 3631775 3501519 3383557 3276122 3172465 3070509
55881 3070509 2973380 2880633 2787390 2692436 2599360 2509511 2421199 2335858 2257523 2185842 2116411
55870 2116411 2048123 1983615 1922645 1861953 1801762 1745809 1694655 1645264 1597297 1553570 1514137
55859 1514137 1476091 1439400 1406782 1377572 1347761 1316532 1286843 1259183 1230706 1201175 1173841
55848 1173841 1149481 1125078 1099476 1075070 1052824 1030676 1008048 987162 968646 950266 931122
55837 931122 912907 896086 878910 861080 844541 829921 815885 802430 791002 781053 770335 758892
$$ packed form
55908A1266218p15723o54805o00763n46743m99583m64970m34961m01646l69723
55899F577301l44675l21365k94942k70800k53545k37449k17427j98609j85918
55890D252571j74674j60311j47094j38717j30256j17962j07435j03657j01956
55881C070509r7129r2747r3243r4954r3076q9849q8312q5341p8335p1681o9431
55870B116411o8288o4508o0970o0692o0191n5953n1154m9391m7967m3727l9433
55859A514137l8046l6691l2618k9210k9811l1229k9689k7660k8477k9531k7334
55848A173841k4360k4403k5602k4406k2246k2148k2628k0886j8516j8380j9144
55837I31122j8215j6821j7176j7830j6539j4620j4036j3455j1428r949j0718j1443
$$ plain form
55825 758892 748918 740472 731274 720866 710979 701652 691114 679703 669703 660971 650974 639573 629499
55812 629499 621508 613331 604130 595846 589281 583018 577107 573767 573331 573373 573006 574282 578225 583132 587947
55797 587947 593694 600359 605939 609831 613736 617931 620009 618693 615683 612422 608161 602505 596739 591189
55783 591189 584241 575390 566456 558439 549830 539297 527457 514974 501682 488797 479324 474853 474228
55770 474228 476198 480853 487554 494137 499129 502207 501736 494895 481504 465040 448630 432503 416304
55757 416304 401050 387409 374603 362378 351766 342891 334497 326677 321476 319678 319578 319996 321707
55744 321707 324668 326752 326874 326722 327723 328754 328559 328021 328179 328134 326716 324303 321395 317440 312640 308887
55728 308887 307199 306050 303764 300690 297511 293425 287789 281840 277033 273131 269487 266623 265070 264123
$$ packed form
55825G58892r974q446r198j0408r887r327j0538j1411j0000q732r997j1401j0074
55812F29499p991q177r201q284o565o263n911l340m36M2l67J276L943M907M815
55797E87947N747O665N580L892L905M195K078j316l010l261m261n656n766n550
55783E91189o948q851q934q017q609j0533j1840j2483j3292j2885r473m471o25
55770D74228J970M655O701O583M992L078m71o841j3391j6464j6410j6127j6199
55757D16304j5254j3641j2806j2225j0612q875q394p820n201j798j00M18J711
55744C21707K961K084J22j52J001J031j95n38J58m5j418k413k908l955m800l753
55728C08887j688j149k286l074l179m086n636n949m807l902l644k864j553r47
$$ plain form
55714 264123 263233 263221 264800 267350 270376 274580 280221 285990 290744 294743 297910 298653 295994 291351 286623
55699 286623 281848 276122 269551 262838 256163 249741 244399 240487 237319 234542 232662 231438 229428 226226
55685 226226 223559 223053 224424 226819 230189 234200 237629 240236 243571 248539 253773 257717 260592 262856
55671 262856 263515 261803 259085 257312 256718 256505 256463 256422 255485 253414 251576 250960 250582 249357 248195 248543 250111
55654 250111 251786 253607 256026 258306 259480 260059 261031 261969 261805 260658 259358 257882 255829 253586 251486
55639 251486 248567 243791 237843 232141 226691 220422 213142 205681 198602 192113 186766 182878 179688 176334
55625 176334 173241 171414 170796 170417 169715 168761 167734 167066 167368 168305 168336 166567 164024 162136 160874 159440
55609 159440 157811 156335 154732 152784 151180 150422 149690 148071 146122 144850 143968 142551 140752 139452 138774
$$ packed form
55714B64123q90j2J579K550L026M204N641N769M754L999L167P43k659m643m728
55699B86623m775n726o571o713o675o422n342l912l168k777j880j224k010l202
55685B26226k667n06J371K395L370M011L429K607L335M968N234L944K875K264
55671B62856O59j712k718j773n94k13m2m1r37k071j838o16l78j225j162L48J568
55654B50111J675J821K419K280J174N79R72R38j64j147j300j476k053k243k100
55639B51486k919m776n948n702n450o269p280p461p079o489n347l888l190l354
55625A76334l093j827o18l79p02r54j027o68L02R37L1j769k543j888j262j434
55609A59440j629j476j603j948j604p58p32j619j949j272q82j417j799j300o78
$$ plain form
55594 138774 138249 137961 138258 138816 139114 139335 139752 139889 139373 138964 139631 141303 143470 146193 149353 151839 152832
55577 152832 153071 153691 154662 155680 157570 161228 166073 171133 176822 183866 191230 196989 200796 203674 205779
55562 205779 206220 204891 202651 199773 195828 191130 186738 182984 179330 175668 172420 169466 166341 163403
55548 163403 161442 160199 158580 156322 154127 152198 150072 147936 146750 146877 147774 149163 151290 153844 155809
55533 155809 156678 156821 156493 155448 153736 151933 150337 148664 146642 144222 141238 137589 133680 129953 126085
55518 126085 121320 115447 108726 101234 93087 85068 78131 72577 68542 66883 68460 72757 78191 83634
55504 83634 88687 92880 95777 97792 99744 101651 102960 103812 104958 106382 107119 106594 105301 104024 103199
55489 103199 103099 103885 105331 106979 108453 109258 108801 107309 106155 106336 107088 107037 106221 105826 106305 107062 107820
$$ packed form
55594A38774n25k88K97N58K98K21M17J37n16m09O67J672K167K723L160K486R93
55577A52832K39O20R71J018J890L658M845N060N689P044P364N759L807K878K105
55562B05779M41j329k240k878l945m698m392l754l654l662l248k954l125k938
55548A63403j961j243j619k258k195j929k126k136j186J27Q97J389K127K554J965
55533A55809Q69J43l28j045j712j803j596j673k022k420k984l649l909l727l868
55518A26085m765n873o721p492q147q019o937n554m035j659J577M297N434N443
55504H3634N053M193K897K015J952J907J309Q52J146J424P37n25j293j277q25
55489A03199j00P86J446J648J474Q05m57j492j154J81P52n1q16l95M79P57P58
$$ plain form
55472 107820 108940 110327 111194 111092 110302 109094 107452 105514 103538 101509 99465 97906 97131 96598 95830 95465
55456 95465 96248 97451 97609 96568 95464 94831 94183 93540 93906 95791 98361 100434 101529 101724 101304 100719 100257
55439 100257 99835 99572 100102 101502 102483 101849 100257 99200 98675 97488 95689 94842 95628 96773 96912 96149 95282
55422 95282 94733 94797 95854 97677 99401 100604 101713 103066 104502 106049 108081 110432 112282 113215 113543 113342
55406 113342 112184 110131 108108 106864 106281 105968 105766 105464 104851 104231 104112 104279 104000 103212 102545 102129 101413
55389 101413 100349 99612 99379 99000 98287 98004 98593 99448 100001 100576 101513 102315 102343 101702 100849 99898 98838 97866
55371 97866 97055 96197 95351 95059 95694 97024 98598 100108 101321 102243 103375 105133 106938 107688 107149 106085
55355 106085 105012 103833 102836 102884 104115 105424 105772 105232 104338 103281 102319 102125 102910 103716 103306 101548 99455
$$ packed form
55472A07820J120J387Q67j02p90j208j642j938j976k029k044j559p75n33p68l65
55456I5465P83J203J58j041j104o33o48o43L66J885K570K073J095J95m20n85m62
55439A00257m22k63N30J400R81o34j592j057n25j187j799q47P86J145J39p63q67
55422I5282n49O4J057J823J724J203J109J353J436J547K032K351J850R33L28k01
55406A13342j158k053k023j244n83l13k02l02o13o20j19J67k79p88o67m16p16
55389A01413j064p37k33l79p13k83N89Q55N53N75R37Q02K8o41q53r51j060r72
55371I7866q11q58q46k92O35J330J574J510J213R22J132J758J805P50n39j064
55355A06085j073j179r97M8J231J309L48n40q94j057r62j94P85Q06m10j758k093
$$ plain form
55338 99455 98072 97574 97281 96425 95061 94105 94115 94379 93827 92507 91365 90820 90591 90802 91989 93878 95311
55321 95311 95809 96163 97041 97963 98213 97934 97776 98026 98547 99043 99102 98488 97544 96818 96264 95492 94681 94384 94395 93858
55301 93858 92653 91682 91569 92045 92887 94379 96449 98293 99376 100018 100664 101343 102107 103151 104236 104904 105438
55284 105438 106579 108029 108429 107261 105654 104778 104475 104036 103272 102210 100751 99340 98997 99960 101101 101402
55268 101402 101155 101076 101115 100906 100548 100174 99453 98286 97321 97037 96934 96309 95280 94459 94178 94538 95558 96773
55250 96773 97400 97401 97655 98553 99300 99189 98684 98506 98514 98269 97917 97690 97212 96156 94982 94253 93806 93373 93372 94246
55230 94246 95513 96271 96271 95888 95542 95663 96645 98184 99229 99189 98615 98235 98062 98039 98596 99741 100431 99850 98675
55211 98675 98132 98341 98551 98478 98443 98572 98794 99315 100277 101243 101724 101861 102023 102197 102440 103297 104946 106434 106663
$$ packed form
55338I9455j383m98k93q56j364r56J0K64n52j320j142n45k29K11J187J889J433
55321I5311M98L54Q78R22K50k79j58K50N21M96N9o14r44p26n54p72q11k97J1n37
55301I3858j205r71j13M76Q42J492K070J844J083O42O46O79P64J044J085O68N34
55284A05438J141J450M00j168j607q76l03m39p64j062j459j411l43R63J141L01
55268A01402k47p9L9k09l58l74p21j167r65k84j03o25j029q21k81L60J020J215
55250I6773O27JK54Q98P47j11n05j78Qk45l52k27m78j056j174p29m47m33jQ74
55230I4246J267P58%l83l46J21R82J539J045m0n74l80j73k3N57J145O90n81j175
55211I8675n43K09K10p3l5J29K22N21R62R66M81J37J62J74K43Q57J649J488K29
$$ plain form
55192 106663 105726 104453 103033 101019 98410 95866 93941 92743 92173 91989 91903 92026 92861 94446 96049 97131
55176 97131 97991 98976 99807 100299 100968 102198 103514 104423 105198 105996 106032 104670 102686 101422 101250 101782 102887
55159 102887 104386 105366 105078 104075 103351 102756 101462 99557 97940 96923 96149 95715 96112 97149 98060 98650
55143 98650 99310 99927 99855 99031 98219 98051 98560 99544 100631 101145 100685 99734 99011 98547 98097 97970 98488 99113 99224
55124 99224 99344 100374 101934 102765 102623 102420 102543 102467 102156 102461 103744 105234 106172 106564 106518 105896 104978 104524
55106 104524 104727 105006 105194 105996 107802 109872 111299 112089 112690 113027 112721 111955 111515 111940 112902 113505 113191 112347
55088 112347 111798 111748 111684 111454 111712 112741 113680 113750 113568 114186 115319 115784 115413 115192 115567 115898 115775 115679 116008
55069 116008 116431 116554 116442 116174 115650 115077 114952 115334 115745 115901 115915 115757 115210 114391 113672 113157 112872 113181 114116
$$ packed form
55192A06663r37j273j420k014k609k544j925j198n70j84q6J23Q35J585J603J082
55176I7131Q60R85Q31M92O69J230J316R09P75P98L6j362j984j264j72N32J105
55159A02887J499R80k88j003p24n95j294j905j617j017p74m34L97J037R11N90
55143I8650O60O17p2q24q12j68N09R84J087N14m60r51p23m64m50j27N18O25J11
55124I9224J20J030J560Q31j42k03J23p6l11L05J283J490R38L92m6o22r18m54
55106A04524K03K79J88Q02J806K070J427P90O01L37l06p66m40M25R62O03l14q44
55088A12347n49n0o4k30K58J029R39P0j82O18J133M65l71k21L75L31j23r6L29
55069A16008M23J23j12k68n24n73j25L82M11J56J4j58n47q19p19n15k85L09R35
$$ plain form
55050 114116 114572 113416 111312 110227 111017 112671 114067 115136 116020 116411 116349 116475 116915 116933 116268 115726 115772 115622
55032 115622 114573 113284 112796 113076 113474 113946 114789 115590 115485 114255 112408 110414 108601 107599 108048 109716
55016 109716 111436 112101 111560 110599 110251 110967 112250 113186 113393 113276 113328 113575 113779 113812 113585 112931 111835 110615
54998 110615 109772 109704 110508 111799 112926 113620 114261 115132 115745 115506 114799 114630 115255 115896 115815 115060 114139 113627 114025
54979 114025 115291 116528 116854 116499 116297 116332 116132 116047 117072 119084 120602 120777 120489 120868 121782 122490 122814 122914
54961 122914 122723 122376 122478 123234 123914 123870 123454 123268 123184 122842 122487 122490 122509 122007 121251 121054 121695 122725 123630 124169
54941 124169 124265 124017 123635 123108 122282 121445 121281 121864 122381 122345 122431 123429 124971 126120 126810 127873 129789 132191
54923 132191 134539 136726 139040 141897 145571 149935 154678 159901 166052 172959 179495 184631 188348 191012
$$ packed form
55050A14116M56j156k104j085P90J654J396J069Q84L91o2J26M40J8o65n42M6j50
55032A15622j049j289m88K80L98M72Q43Q01j05j230j847j994j813j002M49J668
55016A09716J720O65n41r61l48P16J283R36K07j17N2K47K04L3k27o54j096j220
54998A10615q43o8Q04J291J127O94O41Q71O13k39p07j69O25O41q1p55r21n12L98
54979A14025J266J237L26l55k02L5k00q5J025K012J518J75k88L79R14P08L24J00
54961A22914j91l47J02P56O80m4m16j86q4l42l55LJ9n02p56j97O41J030R05N39
54941A24169R6k48l82n27q26q37j64N83N17l6Q6R98J542J149O90J063J916K402
54923A32191K348K187K314K857L674M364M743N223O151O907O536N136L717K664
$$ plain form
54909 191012 192422 192085 190021 186620 182048 176469 170578 165196 160456 155926 151435 147278 143796 141205
54895 141205 139627 138836 138173 137211 136303 136057 136495 137207 138021 138947 139626 139450 138262 136578 135233 135056 136588
54878 136588 139653 143405 147219 151315 156224 161965 168169 174596 181002 186768 191283 194474 196456 196940
54864 196940 195561 192553 188506 183636 177958 171995 166610 162107 158064 154003 149720 145087 140154 135470
54850 135470 131746 129164 127438 126419 126060 125832 124838 122720 120085 117951 117098 117724 119210 120310 120212 119414
54834 119414 118993 119080 118836 117983 117457 118148 119734 121218 122073 122309 122003 121369 120960 121094 121283 120896 120187 119980
54816 119980 120353 120471 119942 119579 120244 121511 122240 122181 122206 122919 123889 124533 124953 125307 125012 123479 121377 120236
54798 120236 120719 121992 122979 123547 124189 125171 126434 127882 129281 130148 130127 129345 128203 127055 126300 126372 127272
$$ packed form
54909A91012J410l37k064l401m572n579n891n382m740m530m491m157l482k591
54895A41205j578p91o63r62r08k46M38P12Q14R26O79j76j188j684j345j77J532
54878A36588L065L752L814M096M909N741O204O427O406N766M515L191J982M84
54864A96940j379l008m047m870n678n963n385m503m043m061m283m633m933m684
54850A35470l724k582j726j019l59k28r94k118k635k134q53O26J486J100r8p98
54834A19414m21Q7k44q53n26O91J586J484Q55K36l06o34m09J34J89l87p09k07
54816A19980L73J18n29l63O65J267P29n9K5P13R70O44M20L54k95j533k102j141
54798A20236M83J273R87N68O42R82J263J448J399Q67k1p82j142j148p55P2R00
$$ plain form
54781 127272 128380 129127 129634 130352 131318 132176 132812 133543 134699 136349 138431 140879 143622 146718 150432 154958
54765 154958 159973 164744 168823 172578 176897 182315 188459 194438 199663 204022 207263 208710 207934 205341
54751 205341 201599 196739 190465 183182 175925 169236 162836 156605 151161 147117 144332 142313 140819 139725
54737 139725 138740 137687 136716 135949 135286 134788 134817 135445 136197 136733 137331 138332 139603 141006 142972 146036 150109
54720 150109 154714 159682 165170 171176 177423 183484 188703 192302 193937 193930 192613 189831 185455 180062 174561
54705 174561 169371 164344 159357 154644 150675 147842 146044 144534 142664 140877 140284 140992 141647 141185 140188
54690 140188 139801 139936 139515 138062 136125 134335 132878 131778 130924 129952 128734 127817 127730 128051 127929 127351 127064
54673 127064 127355 127734 127918 128271 129028 129730 129747 128956 127734 126638 126165 126462 127225 128116 129117 130123 130515 129750
$$ packed form
54781A27272J108P47N07P18R66Q58O36P31J156J650K082K448K743L096L714M526
54765A54958N015M771M079L755M319N418O144N979N225M359L241J447p76k593
54751B05341l742m860o274p283p257o689o400o231n444m044k785k019j494j094
54737A39725r85j053r71p67o63m98K9O28P52N36N98J001J271J403J966L064M073
54720A50109M605M968N488O006O247O061N219L599J635pj317k782m376n393n501
54705A74561n190n027m987m713l969k833j798j510j870j787n93P08O55m62r97
54690A40188l87J35m21j453j937j790j457j100q54r72j218r17q7L21j22n78k87
54673A27064K91L79J84L53P57P02J7p91j222j096m73K97P63Q91J001J006L92p65
$$ plain form
54655 129750 128205 126786 125823 125040 124531 124873 126092 127313 127811 127792 127800 127853 127601 126985 126319 125880 125683 125526 125142
54636 125142 124493 123999 124292 125626 127660 129757 131320 131893 131347 130119 129074 128946 129861 131249 132123 131723
54620 131723 130220 128695 128152 128624 129394 129849 129821 129321 128436 127368 126194 124657 122642 120799 120199 121261
54604 121261 123329 125388 126946 128103 129032 129616 129590 128975 128307 128260 129055 130376 131764 132840 133235 132824 132072
54587 132072 131655 131635 131584 131563 132168 133308 133888 133265 132250 131904 132048 131826 131147 130557 130087 129262 128065 127020
54569 127020 126427 126311 126888 128248 129753 130621 131002 131653 132628 133153 132827 132110 131574 131386 131586 132163 132810 133201
54551 133201 133521 134104 134717 134942 135150 136224 138283 140492 142145 143220 143857 144090 144190 144508 144934 145235 145797
54534 145797 147184 148986 150131 150378 150474 150701 150404 149317 148220 147693 147168 145897 144160 142815 142173 141863
$$ packed form
54655A29750j545j419r63p83n09L42J219J221M98j9QN3k52o16o66m39j97j57l84
54636A25142o49m94K93J334K034K097J563N73n46j228j045j28R15J388Q74m00
54620A31723j503j525n43M72P70M55k8n00q85j068j174j537k015j843o00J062
54604A21261K068K059J558J157R29N84k6o15o68m7P95J321J388J076L95m11p52
54587A32072m17k0n1k1O05J140N80o23j015l46J44k22o79n90m70q25j197j045
54569A27020n93j16N77J360J505Q68L81O51R75N25l26p17n36j88K00N77O47L91
54551A33201L20N83O13K25K08J074K059K209J653J075O37K33J00L18M26L01N62
54534A45797J387J802J145K47R6K27k97j087j097n27n25j271j737j345o42l10
$$ plain form
54518 141863 141445 140746 139925 139447 139642 140226 140718 141271 142351 143619 144060 143393 142392 141537 140408 138834 137600
54501 137600 137309 137410 137126 136648 136640 137096 137461 137492 137347 137198 137291 137983 139174 140095 140109 139373 138324 137075 135772
54482 135772 134979 135034 135489 135789 136152 137155 138747 140301 141407 142094 142462 142584 142607 142622 142620 142829 143747 145528 147675
54463 147675 149638 151305 152655 153450 153668 153730 153856 153668 152895 151956 151335 150861 150166 149340 148525 147361 145585
54446 145585 143844 143150 143685 144849 146215 147799 149485 150868 151677 151923 151701 151188 150637 149979 148773 147022
54430 147022 145629 145419 146013 146377 146208 146053 146263 146722 147491 148822 150412 151504 151975 152533 153488 154052 153430
54413 153430 152068 151188 151301 151829 152067 152001 152052 152467 153241 154374 155863 157432 158609 159156 159249 159143 158957 158957 159682
54394 159682 161321 163215 164508 165218 166082 167366 168487 168963 169025 168972 168576 167637 166603 165999 165576 164657 163228
$$ packed form
54518A41863m18o99q21m78J95N84M92N53J080J268M41o67j001q55j129j574j234
54501A37600k91J01k84m78qM56L65L1j45j49R3O92J191R21J4p36j049j249j303
54482A35772p93N5M55L00L63J003J592J554J106O87L68J22K3J5kK09R18J781K147
54463A47675J963J667J350P95K18O2J26j88p73r39o21m74o95q26q15j164j776
54446A45585j741o94N35J164J366J584J686J383Q09K46k22n13n51o58j206j751
54430A47022j393k10N94L64j69j55K10M59P69J331J590J092M71N58R55N64o22
54413A53430j362q80J13N28K38o6N1M15P74J133J489J569J177N47R3j06j86%P25
54394A59682J639J894J293P10Q64J284J121M76O2n3l96r39j034o04m23r19j429
$$ plain form
54377 163228 162117 162024 162748 163482 163661 163428 163289 163434 163553 163439 163449 163998 164830 165358 165589 166044 166773 167226 167242
54358 167242 167379 168017 168966 170269 172505 175719 178887 181150 182929 185031 187303 189005 190098 191148 192159
54343 192159 192331 190962 188024 184019 179890 176858 175607 175605 175661 175038 173656 171620 169192 166983 165478 164440
54327 164440 163363 162288 161585 161155 160554 159798 159293 159055 158689 158182 158031 158505 159356 160352 161471 162475 162876
54310 162876 162497 161602 160363 158721 156898 155517 154922 154779 154547 154020 153278 152469 151839 151681 152064 152779 153654
54293 153654 154687 155834 156929 157913 158901 159951 160868 161290 160888 159576 157767 156256 155621 155786 156388 157367
54277 157367 158787 160208 160786 160205 159197 158852 159524 160562 161145 161242 161617 162819 164438 165632 166215 166714 167333
54260 167333 167542 166953 166076 165777 166376 167659 169314 170914 171848 171853 171455 171414 171880 172430 172675 172527 172139 171903 172149
$$ packed form
54377A63228j111r3P24P34J79k33j39J45J19j14J0N49Q32N28K31M55P29M53J6
54358A67242J37O38R49J303K236L214L168K263J779K102K272J702J093J050J011
54343A92159J72j369k938m005m129l032j251kN6o23j382k036k428k209j505j038
54327A64440j077j075p03m30o01p56n05k38l66n07j51M74Q51R96J119J004M01
54310A62876l79q95j239j642j823j381n95j43k32n27p42q09o30j58L83P15Q75
54293A53654J033J147J095R84R88J050R17M22m02j312j809j511o35J65O02R79
54277A57367J420J421N78n81j008l45O72J038N83R7L75J202J619J194N83M99O19
54260A67333K09n89q77k99N99J283J655J600R34Nl98m1M66N50K45j48l88k36K46
$$ plain form
54241 172149 172465 171800 169755 167313 165686 164810 163725 162142 160821 160412 160649 160765 160271 159297 158547 158770 159960
54224 159960 161255 161954 162232 162461 162401 161776 161173 161472 162632 163909 165075 166495 168057 168981 168816 167866 166562
54207 166562 165089 163718 162779 162211 161740 161488 161724 162077 161791 160826 159926 159483 159145 158716 158613 159137 160012 160917
54189 160917 161858 162724 163099 162773 161928 160662 158950 157189 156056 155603 155180 154501 154090 154409 155261 156391 157887
54172 157887 159554 160629 160695 160302 160139 160152 160008 159859 159945 159855 158967 157470 156300 156108 156718 157543 158179 158619 159154
54153 159154 160015 161013 161648 161663 161272 160780 160325 160063 160250 160912 161758 162528 163116 163273 162705 161687 161040 161181 161621
54134 161621 161783 161851 162361 163284 164030 164232 164063 163847 163681 163489 163261 163222 163730 164891 166308 167459 168275 169083
54116 169083 170055 171148 172550 174571 176924 178676 179250 179071 178942 179121 179299 179094 178337 177192 176229 176035 176510
$$ packed form
54241A72149L16o65k045k442j627q76j085j583j321m09K37J16m94r74p50K23J190
54224A59960J295O99K78K29o0o25o03K99J160J277J166J420J562R24j65r50j304
54207A66562j473j371r39n68m71k52K36L53k86r65r00m43l38m29j03N24Q75R05
54189A60917R41Q66L75l26q45j266j712j761j133m53m23o79m11L19Q52J130J496
54172A57887J667J075O6l93j63J3j44j49Q6r0q88j497j170j92O10Q25O36M40N35
54153A59154Q61R98O35J5l91m92m55k62J87O62Q46P70N88J57n68j018o47J41M40
54134A61621J62O8N10R23P46K02j69k16j66j92k28l9N08J161J417J151Q16Q08
54116A69083R72J093J402K021K353J752N74j79j29J79J78k05p57j145r63j94M75
$$ plain form
54099 176510 176926 176899 176896 177466 178390 178938 178692 177753 176517 175563 175499 176515 178231 180221 182397 184635 186379 187034
54081 187034 186574 185485 184305 183504 183568 184800 187135 190336 194230 198591 203077 207541 212218 217406 223155
54066 223155 229389 236029 242774 249008 254107 257576 258800 257222 253097 247700 242335 237384 232613 228007
54052 228007 223848 220311 217577 216174 216537 218242 220196 221791 223456 225883 229081 232513 235992 239991
54038 239991 244942 250511 255941 261110 266800 273713 281534 289286 296410 303028 309310 315035 319756 323117
54024 323117 325102 326309 327717 329655 331265 331574 330912 330455 330476 330030 328375 325701 322154 317275 310968 304137
54008 304137 297642 291359 284970 278994 274167 270246 266265 261734 256907 252116 247546 243497 240263 237799
53994 237799 235930 234686 234040 233646 233331 233504 234554 236115 237560 239000 241105 243982 246827 248727 249391
$$ packed form
54099A76510M16k7lN70R24N48k46r39j236r54o4J016J716J990K176K238J744O55
54081A87034m60j089j180q01O4J232K335L201L894M361M486M464M677N188N749
54066B23155O234O640O745O234N099L469J224j578m125n397n365m951m771m606
54052B28007m159l537k734j403L63J705J954J595J665K427L198L432L479L999
54038B39991M951N569N430N169N690O913P821P752P124O618O282N725M721L361
54024C23117J985J207J408J938J610L09o62m57K1m46j655k674l547m879o307o831
54008C04137o495o283o389n976m827l921l981m531m827m791m570m049l234k464
53994B37799j869j244o46l94l15J73J050J561J445J440K105K877K845J900O64
$$ plain form
53979 249391 249056 248033 246347 243678 239801 235277 231317 228631 226735 224770 222553 220337 218069 215669
53965 215669 213741 213093 213563 214085 214080 214132 215071 216928 219051 220869 222320 223805 225904 228935 232602 236193
53949 236193 239190 241691 244266 247433 251133 254753 257933 261339 266134 272559 279587 286292 292910 300074
53935 300074 307544 314450 320443 325931 331397 337155 343568 350831 358597 366462 374695 383890 394059 404797
53921 404797 416317 429549 445011 462126 479757 496810 512123 524377 532563 536417 536367 533359 528641
53908 528641 523221 517411 511113 504476 497863 491322 484649 478010 471914 466488 461277 455908 450426 444776
53894 444776 438420 430809 421955 412364 402629 393186 384117 375040 365440 355269 345039 335347 326585 319038
53880 319038 312821 307578 302595 297413 292097 286922 282098 277788 274020 270488 266807 263079 259800 257109
$$ packed form
53979B49391l35j023j686k669l877m524l960k686j896j965k217k216k268k400
53965B15669j928o48M70N22nN2R39J857K123J818J451J485K099L031L667L591
53949B36193K997K501K575L167L700L620L180L406M795O425P028O705O618P164
53935C00074P470O906N993N488N466N758O413P263P766P865Q233R195J0169J0738
53921D04797J1520J3232J5462J7115J7631J7053J5313J2254Q186L854n0l008m718
53908E28641n420n810o298o637o613o541o673o639o096n426n211n369n482n650
53894D44776o356p611q854r591r735r443r069r077r600j0171j0230r692q762p547
53880C19038o217n243m983n182n316n175m824m310l768l532l681l728l279k691
$$ plain form
53866 257109 254480 251351 247718 243931 240206 236588 233167 230112 227590 225700 224298 222935 221295 219751
53852 219751 219061 219342 219724 219308 218205 217295 217160 217570 217953 218053 218054 218226 218619 219122 219712 220450 221210 221648 221606
53833 221606 221344 221131 220788 219982 218868 218055 217976 218580 219626 220880 221989 222589 222755 223082 224148 226044 228485
53816 228485 231092 233440 235087 235904 236372 237327 239272 241954 244694 247246 250202 254312 259479 264847 269984
53801 269984 275474 281979 289189 296221 302702 308803 314413 319073 322763 326064 329307 332143 334169 335514
53787 335514 336460 336927 336694 335897 334956 334097 333132 331588 328992 325165 320345 314901 308957 302522 295919 289718
53771 289718 284139 278869 273614 268541 263984 259967 256236 252679 249478 246858 244738 242644 240108 237271
53757 237271 234906 233572 232820 231626 229577 227246 225303 223723 222077 220265 218597 217373 216738 216883 217996
$$ packed form
53866B57109k629l129l633l787l725l618l421l055k522j890j402j363j640j544
53852B19751o90K81L82m16j103r10j35M10L83J00JJ72L93N03N90P38P60M38m2
53833B21606k62k13l43q06j114q13p9O04J046J254J109O00J66L27J066J896K441
53816B28485K607K348J647Q17M68R55J945K682K740K552K956M110N167N368N137
53801B69984N490O505P210P032O481O101N610M660L690L301L243K836K026J345
53787C35514R46M67k33p97r41q59r65j544k596l827m820n444n944o435o603o201
53771B89718n579n270n255n073m557m017l731l557l201k620k120k094k536k837
53757B37271k365j334p52j194k049k331j943j580j646j812j668j224o35J45J113
$$ plain form
53742 217996 219852 221638 222462 222086 221026 219936 219127 218764 219129 220193 221192 221359 221137 221892 224107 226648
53726 226648 228313 229363 230711 232246 233066 233106 233341 234305 235435 236201 236979 238328 240092 241741 243108 244348
53710 244348 245565 246906 248729 251319 254626 258520 262963 267683 272008 275365 277805 279778 281629 283523
53696 283523 285666 288283 291395 294746 297891 300417 302330 304202 306591 309227 311135 311684 311214 310423 309489
53681 309489 308063 305905 303214 300421 297891 295780 294075 292726 291779 291296 291179 291184 291109 290833 290267 289475 288761
53664 288761 288445 288581 289024 289629 290168 290218 289508 288308 287170 286343 285669 284952 284164 283421 283005 283177 283625 283483
53646 283483 282353 281053 280765 281721 283347 285367 287907 290675 293021 294913 296965 299301 301251 302427 303353
53631 303353 304689 306496 308553 310701 312608 313920 314952 316556 319012 321739 324383 327382 331035 334922
$$ packed form
53742B17996J856J786Q24l76j060j090q09l63L65J064R99J67k22P55K215K541
53726B26648J665J050J348J535Q20M0K35R64J130P66P78J349J764J649J367J240
53710B44348J217J341J823K590L307L894M443M720M325L357K440J973J851J894
53696B83523K143K617L112L351L145K526J913J872K389K636J908N49m70p91r34
53681C09489j426k158k691k793k530k111j705j349r47m83j17Np5k76n66p92p14
53664B88761l16J36M43O05N39N0p10j200j138q27o74p17p88p43m16J72M48j42
53646B83483j130j300k88R56J626K020K540K768K346J892K052K336J950J176R26
53631C03353J336J807K057K148J907J312J032J604K456K727K644K999L653L887
$$ plain form
53617 334922 338758 342977 347848 352797 357379 362083 367329 372409 376565 380473 385430 391349 396895 401551
53603 401551 406310 412084 418454 424365 429257 433050 435708 437319 438171 438303 437322 435004 431813 428506 425395
53588 425395 422270 418897 415319 411730 408247 404888 401705 398839 396431 394523 393099 392163 391629 391216 390649
53573 390649 389954 389270 388414 387008 385065 383102 381545 380405 379630 379294 379246 379082 378798 379009 380165 381934 383749
53556 383749 385454 386937 387640 387164 386105 385602 386116 387219 388502 390039 391972 394273 397076 400739 405302
53541 405302 410168 414568 418257 421782 426199 432414 440402 449032 456951 463791 470462 478310 488043 499392
53527 499392 511534 523780 535993 548454 561422 574916 588794 602794 616617 630383 644982
53516 644982 661438 679736 698854 718223 738577 760887 784992 809907 835106 860779 887016
$$ packed form
53617C34922L836M219M871M949M582M704N246N080M156L908M957N919N546M656
53603D01551M759N774O370N911M892L793K658J611Q52J32r81k318l191l307l111
53588D25395l125l373l578l589l483l359l183k866k408j908j424r36n34m13n67
53573C90649o95o84q56j406j943j963j557j140p75l36m8j64k84K11J156J769J815
53556C83749J705J483P03m76j059n03N14J103J283J537J933K301K803L663M563
53541D05302M866M400L689L525M417O215P988Q630P919O840O671P848R733J1349
53527D99392J2142J2246J2213J2461J2968J3494J3878J4000J3823J3766J4599
53516F44982J6456J8298J9118J9369K0354K2310K4105K4915K5199K5673K6237
$$ plain form
53505 887016 913518 940122 966977 993947 1020255 1044955 1067597 1088458 1108318 1127956 1147623
53494 1147623 1167058 1186071 1204953 1224104 1243524 1262873 1281810 1300082 1317617 1334861 1352641
53483 1352641 1371227 1389798 1407252 1423344 1438622 1453495 1467802 1481042 1492524 1501523 1507753 1511495
53471 1511495 1512849 1511268 1506404 1499047 1490413 1480724 1469292 1455898 1441205 1425822 1409845 1393442
53459 1393442 1377050 1360655 1343606 1325462 1306433 1286759 1266355 1245373 1224435 1203804 1182955
53448 1182955 1161510 1140127 1119847 1100919 1082925 1065856 1050402 1037181 1026182 1017066 1009641 1003883
53436 1003883 999773 997254 996215 996405 997411 998806 1000364 1002181 1004597 1008032 1012949 1019942 1029576 1041882
53422 1041882 1056085 1071119 1086509 1102615 1120081 1139253 1160099 1182406 1205923 1230476 1256102
$$ packed form
53505H87016K6502K6604K6855K6970K6308K4700K2642K0861J9860J9638J9667
53494A147623J9435J9013J8882J9151J9420J9349J8937J8272J7535J7244J7780
53483A352641J8586J8571J7454J6092J5278J4873J4307J3240J1482Q999O230L742
53471A511495J354j581m864p357q634r689j1432j3394j4693j5383j5977j6403
53459A393442j6392j6395j7049j8144j9029j9674k0404k0982k0938k0631k0849
53448A182955k1445k1383k0280j8928j7994j7069j5454j3221j0999r116p425n758
53436A003883m110k519j039J90J006J395J558J817K416L435M917O993R634J2306
53422A041882J4203J5034J5390J6106J7466J9172K0846K2307K3517K4553K5626
$$ plain form
53411 1256102 1283072 1311786 1342623 1375745 1410911 1447583 1485387 1524380 1564889 1607298 1652096
53400 1652096 1699693 1749854 1801595 1854049 1907331 1962100 2018460 2075677 2132889 2189639 2245790
53389 2245790 2301402 2356643 2411343 2464619 2515412 2563436 2609185 2653039 2694825 2734254 2771082
53378 2771082 2804542 2833251 2856158 2873368 2885702 2893734 2897509 2896848 2891462 2880824 2864254 2841191
53366 2841191 2811282 2774404 2730845 2681566 2628114 2572190 2515176 2457944 2401074 2345056 2290133
53355 2290133 2236005 2182237 2129266 2078575 2031338 1987099 1944363 1902237 1860811 1820040 1779211
53344 1779211 1737863 1696513 1656020 1616761 1578921 1542992 1509329 1477475 1446665 1416992 1389592
53333 1389592 1365557 1345000 1327204 1311314 1296728 1283082 1270065 1257299 1244385 1231105 1217522
$$ packed form
53411A256102K6970K8714L0837L3122L5166L6672L7804L8993M0509M2409M4798
53400A652096M7597N0161N1741N2454N3282N4769N6360N7217N7212N6750N6151
53389B245790N5612N5241N4700N3276N0793M8024M5749M3854M1786L9429L6828
53378B771082L3460K8709K2907J7210J2334Q032L775o61n386j0638j6570k3063
53366B841191k9909l6878m3559m9279n3452n5924n7014n7232n6870n6018n4923
53355B290133n4128n3768n2971n0691m7237m4239m2736m2126m1426m0771m0829
53344A779211m1348m1350m0493l9259l7840l5929l3663l1854l0810k9673k7400
53333A389592k4035k0557j7796j5890j4586j3646j3017j2766j2914j3280j3583
$$ plain form
53322 1217522 1203825 1190193 1176896 1164416 1153166 1143107 1133875 1125408 1118278 1113171 1110215 1109090
53310 1109090 1109757 1112601 1117638 1124038 1130962 1138626 1147894 1158916 1170951 1183737 1198173 1215109 1234126
53297 1234126 1254208 1275210 1297833 1322372 1348302 1375064 1402578 1430854 1459668 1488709 1517537
53286 1517537 1545292 1570942 1593992 1614556 1632735 1648337 1661295 1671819 1679911 1685129 1686984 1685294
53274 1685294 1680113 1671708 1660611 1647259 1631509 1613000 1592117 1569998 1547345 1523682 1498130 1470520
53262 1470520 1441465 1411684 1381651 1351690 1322062 1292966 1264515 1236593 1208761 1180634 1152338
53251 1152338 1124328 1096785 1069631 1043096 1017640 993084 968441 942986 917077 891548 866687
53240 866687 842334 818654 796300 775801 757138 739883 723596 708166 693902 681173 669893
$$ packed form
53322A217522j3697j3632j3297j2480j1250j0059r232q467p130n107k956j125
53310A109090O67K844N037O400O924P664R268J1022J2035J2786J4436J6936J9017
53297A234126K0082K1002K2623K4539K5930K6762K7514K8276K8814K9041K8828
53286A517537K7755K5650K3050K0564J8179J5602J2958J0524Q092N218J855j690
53274A685294n181q405j1097j3352j5750j8509k0883k2119k2653k3663k5552k7610
53262A470520k9055k9781l0033k9961k9628k9096k8451k7922k7832k8127k8296
53251A152338k8010k7543k7154k6535k5456k4556k4643k5455k5909k5529k4861
53240H66687k4353k3680k2354k0499j8663j7255j6287j5430j4264j2729j1280
$$ plain form
53229 669893 659588 650000 641254 633230 625130 616066 605859 594986 583900 572624 560865 548262
53217 548262 534640 520225 505577 491166 477126 463501 450578 438871 428829 420633 414138 408927
53205 408927 404456 400136 395280 389335 382411 375313 368594 361825 354335 346447 339214 333014 327220 321410
53191 321410 316034 311584 307929 304911 302809 301617 300543 298933 297147 295798 294569 292658 290040 287445
53177 287445 285177 282904 280677 279326 279445 280490 281264 281058 280148 279322 279060 279054 278467 276772 274284 271813 269899
53160 269899 268498 267219 265672 263741 261744 260223 259411 258991 258546 258031 257691 257708 258138 258942 259843 260416 260600
53143 260600 260902 261769 262971 263937 264547 265178 266033 266829 267248 267408 267730 268428 269177 269371 268795 267993 267697 267900
53125 267900 267829 266943 265630 264804 265128 266739 269287 272005 274184 275901 277948 280734 283616 285595 286328 286138
$$ packed form
53229F69893j0305r588q746q024q100r064j0207j0873j1086j1276j1759j2603
53217E48262j3622j4415j4648j4411j4040j3625j2923j1707j0042q196o495n211
53205D08927m471m320m856n945o924p098o719o769p490p888p233o200n794n810
53191C21410n376m450l655l018k102j192j074j610j786j349j229j911k618k595
53177B87445k268k273k227j351J19J045P74k06r10q26k62on87j695k488k471j914
53160B69899j401j279j547j931j997j521q12m20m45n15l40J7M30Q04R01N73J84
53143B60600L02Q67J202R66O10O31Q55P96M19J60L22O98P49J94n76q02k96K03
53125B67900p1q86j313q26L24J611K548K718K179J717K047K786K882J979P33j90
$$ plain form
53109 286138 285461 284683 284033 283124 281045 277520 273630 270768 269154 267988 266701 265252 263451 261024 258414
53094 258414 256625 255990 255788 255348 254835 254589 254384 253912 253508 253693 254229 254265 253485 252601 252511 253293 254325 255190 256004
53075 256004 256807 257099 256424 255185 254296 253967 253438 252190 250856 250426 250904 251291 250712 249153 247265 245903 245670
53058 245670 246414 247191 247112 246200 245146 244460 244290 244818 246152 247861 249245 250140 250940 251722 251950 251295 250280
53041 250280 249721 249796 249915 249354 247910 246105 244796 244398 244464 244335 244089 244466 245832 247675 249317 250617 251668
53024 251668 252169 251630 250143 248538 247658 247672 248182 248847 249734 251043 252696 254383 255951 257435 258670 259257
53008 259257 259120 258813 258922 259380 259728 259836 259911 259918 259593 259095 259138 260124 261461 262035 261341 259979 259005 258818 258757 257938
52988 257938 256448 255389 255654 257007 258627 260134 261648 263162 264454 265500 266452 267304 268003 268803 270005
$$ packed form
53109B86138o77p78o50r09k079l525l890k862j614j166j287j449j801k427k610
53094B58414j789o35k02m40n13k46k05m72m04J85N36L6p80q84r0P82J032Q65Q14
53075B56004Q03K92o75j239q89l29n29j248j334m30M78L87n79j559j888j362k33
53058B45670P44P77p9r12j054o86j70N28J334J709J384Q95Q00P82K28o55j015
53041B50280n59P5J19n61j444j805j309l98O6j29k46L77J366J843J642J300J051
53024B51668N01n39j487j605q80J4N10O65Q87J309J653J687J568J484J235N87
53008B59257j37l07J09M58L48J08P5Pl25m98M3R86J337N74o94j362r74j87o1q19
52988B57938j490j059K65J353J620J507J514J514J292J046R52Q52O99Q00J202
$$ plain form
52973 270005 271463 272865 274421 276635 279403 282015 284110 285936 287536 288458 288634 288797 289478 290144 289929 288883
52957 288883 287917 287725 288292 289235 290057 290112 288863 286324 282992 279344 275639 272158 269206 266789 264583 262400
52941 262400 260524 259446 259394 260221 261603 263166 264444 264990 264670 263796 262847 262080 261490 261016 260543 259767 258407
52924 258407 256702 255389 254978 255280 255789 256229 256492 256346 255669 254840 254468 254793 255634 256735 257807 258364 258064
52907 258064 257206 256479 256198 256129 255961 255515 254574 253055 251395 250286 249956 250170 250927 252459 254394 255680 255750
52890 255750 255252 255175 255699 256353 256875 257379 257958 258657 259658 260935 261833 261512 259901 257900 256521 256074 256163 256240
52872 256240 256086 255963 256342 257472 259220 261346 263698 265984 267633 268320 268559 269371 271177 273271 274568 274716
52856 274716 274250 273763 273207 272153 270570 269032 268090 267613 266897 265308 262674 259217 255403 251844 249010 246818
$$ packed form
52973B70005J458J402J556K214K768K612K095J826J600R22J76J63O81O66k15j046
52957B88883r66j92N67R43Q22N5j249k539l332l648l705l481k952k417k206k183
52941B62400j876j078n2Q27J382J563J278N46l20q74r49p67n90m74m73p76j360
52924B58407j705j313m11L02N09M40K63j46o77q29l72L25Q41J101J072N57l00
52907B58064q58p27k81o9j68m46r41j519j660j109l30K14P57J532J935J286P0
52890B55750m98p7N24O54N22N04N79O99J001J277Q98l21j611k001j379m47Q9P7
52872B56240j54j23L79J130J748K126K352K286J649O87K39Q12J806K094J297J48
52856B74716m66m87n56j054j583j538r42m77p16j589k634l457l814l559k834k192
$$ plain form
52840 246818 244660 242046 239169 236728 235216 234460 233895 233183 232430 231814 231236 230548 229958 229879 230367 231126 232096
52823 232096 233555 235401 236852 237308 237138 237063 237069 236641 235882 235605 236232 237258 238065 238712 239633 240970 242536 244095
52805 244095 245412 246267 246671 246824 246698 245910 244207 241876 239450 237214 235197 233474 232187 231285 230441 229355
52789 229355 228154 227466 227926 229466 231275 232593 233347 233823 234040 233949 233981 234822 236593 238770 240901 242841 244260
52772 244260 244591 243762 242480 241452 240680 239793 238731 237774 237159 236947 237117 237561 238031 238218 237817 236708 235270
52755 235270 234338 234412 235051 235493 235749 236427 237591 238546 238896 239068 239561 240420 241757 243999 247134 250263 252484
52738 252484 253764 254607 255380 256404 258089 260379 262513 263941 265089 266686 268685 270417 271418 271582 270895
52723 270895 269631 268452 267631 266532 264489 261908 259778 258416 257447 256786 256680 256873 256661 255945 255401 255433 255676
$$ packed form
52840B46818k158k614k877k441j512p56n65p12p53o16n78o88n90p9M88P59R70
52823B32096J459J846J451M56j70p5Om28p59k77O27J026Q07O47R21J337J566J559
52805B44095J317Q55M04J53j26p88j703k331k426k236k017j723j287r02q44j086
52789B29355j201o88M60J540J809J318P54M76K17r1L2Q41J771K177K131J940J419
52772B44260L31q29j282j028p72q87j062r57o15k12J70M44M70J87m01j109j438
52755B35270r32P4O39M42K56O78J164R55L50J72M93Q59J337K242L135L129K221
52738B52484J280Q43P73J024J685K290K134J428J148J597J999J732J001J64o87
52723B70895j264j179q21j099k043k581k130j362r69o61j06J93k12p16n44L2K43
$$ plain form
52706 255676 255768 255887 256177 256307 256086 255984 256504 257334 257620 257014 256061 255596 255937 256684 257212 257384 257727 258763 260236
52687 260236 261318 261591 261526 261824 262566 263226 263321 262830 262031 261179 260383 259660 259012 258412 257821 257213 256568 255764 254625
52668 254625 253178 251792 250805 250129 249536 249264 249873 251421 253277 254912 256368 257686 258506 258777 259365 261232
52652 261232 264219 267249 269578 271250 272472 273295 273925 274636 275153 274724 273094 270936 269047 267507 265979
52637 265979 264514 263609 263515 263799 263703 262938 262104 262275 263988 266697 269393 271635 273738 275953 277907 279012
52621 279012 279127 278534 277364 275335 272189 268355 265012 263319 263495 264713 265868 266339 266052 265254 264463 264278
52605 264278 264891 265850 266603 267103 267656 268421 269441 270929 273025 275337 277191 278357 279134 279679 279720 279072 278083
52588 278083 277340 277161 277492 278082 278616 278873 278864 278741 278519 278056 277341 276646 276348 276642 277443 278498 279625 280891
$$ packed form
52706B55676R2J19K90J30k21j02N20Q30K86o06r53m65L41P47N28J72L43J036J473
52687B60236J082K73o5K98P42O60R5m91p99q52p96p23o48o00n91o08o45q04j139
52668B54625j447j386r87o76n93k72O09J548J856J635J456J318Q20K71N88J867
52652B61232K987L030K329J672J222Q23O30P11N17m29j630k158j889j540j528
52637B65979j465r05r4K84r6p65q34J71J713K709K696K242K103K215J954J105
52621B79012J15n93j170k029l146l834l343j693J76J218J155M71k87p98p91j85
52605B64278O13R59P53N00N53P65J020J488K096K312J854J166P77N45M1o48r89
52588B78083p43j79L31N90N34K57rj23k22m63p15o95k98K94Q01J055J127J266
$$ plain form
52570 280891 282376 283778 284543 284545 284264 283986 283238 281522 279302 277564 276470 275211 273333 271526 270729 270954
52554 270954 271419 271549 271433 271393 271506 271519 271065 269961 268444 267114 266506 266628 266898 266619 265627 264516 264100 264639
52536 264639 265749 267019 268382 269746 270744 271213 271597 272367 273251 273565 273192 272729 272669 272936 273203 273277 273124 272978
52518 272978 273403 274777 276616 277916 278295 278417 279162 280791 283001 285350 287503 289512 291998 295554 299723
52503 299723 303008 304212 303400 301368 298677 295606 292611 290209 288479 287020 285329 283076 280269 277424
52489 277424 275340 274349 273971 273516 272814 272078 271408 270891 270957 272025 273765 275194 275676 275514 275493 276154 277673 280056
52471 280056 283078 286117 288342 289238 288936 288111 287580 287939 289335 291485 294004 296797 300092 303915 307576
52456 307576 309944 310413 309414 307803 305866 303188 299431 294887 290238 286071 282784 280652 279611 279036 278062
$$ packed form
52570B80891J485J402P65Kk81k78p48j716k220j738j094j259j878j807p97K25
52554B70954M65J30j16m0J13J3m54j104j517j330o08J22K70k79r92j111m16N39
52536B64639J110J270J363J364R98M69L84P70Q84L14l73m63o0K67K67P4j53j46
52518B72978M25J374J839J300L79J22P45J629K210K349K153K009K486L556M169
52503B99723L285J204q12k032k691l071k995k402j730j459j691k253k807k845
52489B77424k084r91l78m55p02p36o70n17O6J068J740J429M82j62k1O61J519K383
52471B80056L022L039K225Q96l02q25n31L59J396K150K519K793L295L823L661
52456C07576K368M69r99j611j937k678l757m544m649m167l287k132j041n75r74
$$ plain form
52441 278062 276352 274432 273159 272858 273107 273343 273409 273349 272967 272023 270803 270028 270045 270484 270922 271474 272374 273350
52423 273350 273906 274115 274693 276284 278931 282094 284916 286628 287133 287250 288093 290248 293710 298392 304280 311158
52407 311158 318610 326428 334821 344186 354654 365597 375422 382233 385047 384170 380230 373457 364342 354322
52393 354322 344915 336557 329111 323120 319398 317539 316107 314501 313492 313586 314002 313905 313631 313971 315019 316491
52377 316491 318557 321485 324908 328276 331711 335728 340352 345217 350324 355958 361900 367343 371669 374889
52363 374889 377274 378967 379966 380244 379855 379090 378387 377904 377382 376607 375828 375511 375924 377098 378851 380639 381841
52346 381841 382548 383675 385928 389046 392456 396178 400547 405403 410316 415372 421091 427706 435190 443853
52332 443853 454229 466259 479208 492534 506394 521270 537573 555592 575281 596024 617147
$$ packed form
52441B78062j710j920j273l01K49K36O6o0l82r44j220p75J7M39M38N52R00R76
52423B73350N56K09N78J591K647L163K822J712N05J17Q43K155L462M682N888O878
52407C11158P452P818Q393R365J0468J0943R825O811K814q77l940o773r115j0020
52393C54322r407q358p446n991l722j859j432j606j009R4M16r7k74L40J048J472
52377C16491K066K928L423L368L435M017M624M865N107N634N942N443M326L220
52363C74889K385J693R99K78l89p65p03m83n22p75p79l17M13J174J753J788J202
52346C81841P07J127K253L118L410L722M369M856M913N056N719O615P484Q663
52332D43853J0376J2030J2949J3326J3860J4876J6303J8019J9689K0743K1123
$$ plain form
52321 617147 638762 661494 685225 708679 730650 751149 770995 790706 810249 829551 848633
52310 848633 867310 885205 902123 918132 933309 947678 961411 974727 987458 998989 1008858 1017286
52298 1017286 1024848 1031657 1037111 1040525 1041815 1041432 1039780 1036885 1032481 1026206 1017787 1007358 995764 984362
52284 984362 974364 966246 959721 954168 949264 945448 943739 944915 948919 955185 963292 972932 983473 994233
52270 994233 1005312 1017610 1031805 1047674 1064575 1081977 1099241 1115423 1129888 1142914 1155272
52259 1155272 1167337 1178951 1189916 1200270 1210193 1219903 1229503 1238724 1246997 1254006 1259908 1264836 1268525
52246 1268525 1270680 1271258 1269996 1266106 1259083 1249623 1239162 1228604 1217969 1207099 1196092 1185060 1174051
52233 1174051 1163365 1153546 1144925 1137455 1131007 1125523 1120879 1116959 1113908 1112018 1111361 1111784 1113182 1115422
$$ packed form
52321F17147K1615K2732K3731K3454K1971K0499J9846J9711J9543J9302J9082
52310H48633J8677J7895J6918J6009J5177J4369J3733J3316J2731J1531R869Q428
52298A017286P562O809N454L414J290l83j652k895m404o275q419j0429j1594j1402
52284I84362r998q118o525n553m904l816j709J176M004O266Q107R640J0541J0760
52270I94233J1079J2298J4195J5869J6901J7402J7264J6182J4465J3026J2358
52259A155272J2065J1614J0965J0354R923R710R600R221Q273P009N902M928L689
52246A268525K155N78j262l890p023r460j0461j0558j0635j0870j1007j1032j1009
52233A174051j0686r819q621p470o448n484m644l920l051j890o57M23J398K240
$$ plain form
52219 1115422 1118034 1120394 1122385 1124643 1128056 1133100 1139507 1146394 1152861 1158809 1165075 1172465 1180776 1189106
52205 1189106 1196964 1204568 1212125 1219312 1225588 1230697 1234814 1238525 1242599 1247429 1252712 1258046 1263694 1270232
52191 1270232 1277441 1284195 1289620 1293837 1297409 1300575 1303320 1305601 1307063 1306891 1304415 1299667 1293031 1284651
52177 1284651 1274599 1263434 1252110 1241333 1231352 1222326 1214475 1207773 1201752 1195917 1190307 1185566 1182385
52164 1182385 1180888 1180561 1180815 1181523 1182934 1185153 1187962 1191141 1194690 1198504 1201986 1204286 1205004 1204533 1203605
$$ packed form
52219A115422K612K360J991K258L413N044O407O887O467N948O266P390Q311Q330
52205A189106P858P604P557P187O276N109M117L711M074M830N283N334N648O538
52191A270232P209O754N425M217L572L166K745K281J462j72k476m748o636q380
52177A284651j0052j1165j1324j0777r981r026p851o702o021n835n610m741l181
52164A182385j497l27K54P08J411K219K809L179L549L814L482K300P18m71r28
$$ [...]
##END NTUPLES=NMR SPECTRUM
##END=
