
##TITLE=AC1327_PERAH12156_6535886_6jgkElnn9o
##JCAMPDX= 6.0         $$ Bruker NMR JCAMP-DX V2.0
##DATA TYPE= NMR SPECTRUM
##DATA CLASS= NTUPLES
##ORIGIN= BRUKER
##OWNER= Administrator
$$ 1.72 TOPSPIN		Version 2.1
$$ 2012-07-17 22:00:29.015 -0500  Administrator@TOPSPIN
$$ Compression mode = diff/dup
##.OBSERVE FREQUENCY= 400.02188249412
##.OBSERVE NUCLEUS= ^1H
##.ACQUISITION MODE= SIMULTANEOUS (DQD)
##.ACQUISITION SCHEME= undefined
##.AVERAGES= 8
##.DIGITISER RES= 22
##SPECTROMETER/DATA SYSTEM= spect
##.PULSE SEQUENCE= zg30
##.SOLVENT NAME= COFFEE_meoh
##.SHIFT REFERENCE= INTERNAL, COFFEE_meoh, 1, 14.98509
##AUDIT TRAIL= $$ (NUMBER, WHEN, WHO, WHERE, PROCESS, VERSION, WHAT)
$$ ##TITLE= Audit trail, TOPSPIN		Version 2.1
$$ ##JCAMPDX= 5.01
$$ ##ORIGIN= Bruker BioSpin GmbH
$$ ##OWNER= Administrator
$$ $$ C:\Bruker\TOPSPIN/data/COFFEE/nmr/AC1327_PERAH12156_6535886_6jgkElnn9o/10/pdata/1/auditp.txt
$$ ##AUDIT TRAIL=  $$ (NUMBER, WHEN, WHO, WHERE, PROCESS, VERSION, WHAT)
(   1,<2012-07-17 22:00:21.828 -0500>,<Administrator>,<TOPSPIN>,<go>,<TOPSPIN 2.1>,
      <created by zg
	started at 2012-07-17 21:59:15.296 -0500,
	POWCHK enabled, PULCHK disabled,
       configuration hash MD5:
       6B 1B 68 BB D9 2E 58 E2 7F 35 AD 54 07 DF 0E 41
       data hash MD5: 64K
       E7 FA 49 97 4A 03 C2 89 44 2E 0F 21 8A 68 03 D8>)
(   2,<2012-07-17 22:00:24.875 -0500>,<Administrator>,<TOPSPIN>,<proc1d>,<TOPSPIN 2.1>,
      <Start of raw data processing
       efp LB = 0 FT_mod = 6 PKNL = 1 PHC0 = 0 PHC1 = 0 SI = 32K 
       data hash MD5: 32K
       B3 03 30 B2 26 E2 AD 8B 92 92 F5 67 67 0C 25 22>)
(   3,<2012-07-17 22:00:25.187 -0500>,<Administrator>,<TOPSPIN>,<proc1d>,<TOPSPIN 2.1>,
      <pk PHC0 = 177.7148 PHC1 = 0 
       data hash MD5: 32K
       20 A5 27 BD C4 47 0D 94 E6 8B 59 48 51 95 FC 3E>)
(   4,<2012-07-17 22:00:25.234 -0500>,<Administrator>,<TOPSPIN>,<proc1d>,<TOPSPIN 2.1>,
      <abs ABSG = 1 
       data hash MD5: 32K
       84 F6 45 65 1D F3 B2 9F 74 E6 56 05 EC 73 BF 5E>)
(   5,<2012-07-17 22:00:25.265 -0500>,<Administrator>,<TOPSPIN>,<proc1d>,<TOPSPIN 2.1>,
      <abs ABSG = 2 
       data hash MD5: 32K
       CA C4 C3 49 0A 4E 8B 0E 43 C3 C4 D2 70 28 4E 1B>)
(   6,<2012-07-17 22:00:25.296 -0500>,<Administrator>,<TOPSPIN>,<proc1d>,<TOPSPIN 2.1>,
      <abs ABSG = 3 
       data hash MD5: 32K
       2C 82 A9 7F 4B 2B 89 43 E8 12 5C 8D 8C EE F3 65>)
(   7,<2012-07-17 22:00:25.328 -0500>,<Administrator>,<TOPSPIN>,<proc1d>,<TOPSPIN 2.1>,
      <abs ABSG = 4 
       data hash MD5: 32K
       2F 43 B3 8A AB 22 CB AF ED B1 64 10 CF B4 5F D5>)
(   8,<2012-07-17 22:00:25.359 -0500>,<Administrator>,<TOPSPIN>,<proc1d>,<TOPSPIN 2.1>,
      <abs ABSG = 5 
       data hash MD5: 32K
       58 69 C7 D6 F2 F3 37 1F 19 A5 FD F4 29 66 A4 C5>)
$$ ##END=
$$ 
$$ $$ hash MD5
$$ $$ 48 86 63 D2 69 5D 48 F0 69 CB C1 6F 07 6B 3F 59
##$RELAX= 
##$RELAX= 
##$RELAX= 
##$RELAX= 
##$RELAX= 
##$RELAX= 
##$RELAX= 
$$ Bruker specific parameters
$$ --------------------------
$$ [...]
150 150 150 150 150 150 150 150
##$TP07= 0
##$TPNAME0= <>
##$TPNAME1= <>
##$TPNAME2= <>
##$TPNAME3= <>
##$TPNAME4= <>
##$TPNAME5= <>
##$TPNAME6= <>
##$TPNAME7= <>
##$TPOAL= (0..7)
0.5 0.5 0.5 0.5 0.5 0.5 0.5 0.5
##$TPOFFS= (0..7)
0 0 0 0 0 0 0 0
##$TUNHIN= 0
##$TUNHOUT= 0
##$TUNXOUT= 0
##$USERA1= <user>
##$USERA2= <user>
##$USERA3= <user>
##$USERA4= <user>
##$USERA5= <user>
##$V9= 5
##$VALIST= <valist>
##$VCLIST= <CCCCCCCCCCCCCCC>
##$VD= 0
##$VDLIST= <DDDDDDDDDDDDDDD>
##$VPLIST= <PPPPPPPPPPPPPPP>
##$VTLIST= <TTTTTTTTTTTTTTT>
##$WBST= 2048
##$WBSW= 25
##$XGAIN= (0..3)
0 0 0 0
##$XL= 0
##$YL= 0
##$YMAX_a= 503513
##$YMIN_a= -643310
##$ZGOPTNS= <>
##$ZL1= 120
##$ZL2= 120
##$ZL3= 120
##$ZL4= 120
##$ABSF1= 14.98509
##$ABSF2= -5.573092
##$ABSG= 5
##$ABSL= 3
##$ALPHA= 0
##$AQORDER= 0
##$ASSFAC= 0
##$ASSFACI= 0
##$ASSFACX= 0
##$ASSWID= 0
##$AUNMP= <proc_prof1d_extract_pilot.lims>
##$AXLEFT= 0
##$AXNAME= <>
##$AXNUC= <1H>
##$AXRIGHT= 0
##$AXTYPE= 0
##$AXUNIT= <>
##$AZFE= 0.1
##$AZFW= 0.1
##$BCFW= 0
##$BC_mod= 0
##$BYTORDP= 0
##$COROFFS= 0
##$CY= 15
##$DATMOD= 1
##$DC= 0
##$DFILT= <>
##$DTYPP= 0
##$F1P= 0
##$F2P= 0
##$FCOR= 0.5
##$FTSIZE= 32768
##$FT_mod= 6
##$GAMMA= 0
##$GB= 0
##$INTBC= 1
##$INTSCL= 1
##$ISEN= 128
##$LB= 0
##$LEV0= 0
##$LPBIN= 0
##$MAXI= 10000
##$MC2= 0
##$MEAN= 0
##$ME_mod= 0
##$MI= 0
##$NCOEF= 0
##$NC_proc= -8
##$NLEV= 6
##$NOISF1= 0
##$NOISF2= 0
##$NSP= 0
##$NTH_PI= 0
##$NZP= 0
##$OFFSET= 14.98509
##$PC= 1
##$PHC0= 177.7148
##$PHC1= 0
##$PH_mod= 1
##$PKNL= yes
##$PPARMOD= 0
##$PPDIAG= 0
##$PPIPTYP= 0
##$PPMPNUM= 2147483647
##$PPRESOL= 1
##$PSCAL= 4
##$PSIGN= 0
##$PYNMP= <proc.py>
##$REVERSE= no
##$SF= 400.02
##$SI= 32768
##$SIGF1= 0
##$SIGF2= 0
##$SINO= 400
##$SIOLD= 32768
##$SPECTYP= <>
##$SREGLST= <1H.CDCl3>
##$SSB= 0
##$STSI= 32768
##$STSR= 0
##$SW_p= 8223.68421052631
##$SYMM= 0
##$S_DEV= 0
##$TDeff= 65536
##$TDoff= 0
##$TI= <>
##$TILT= no
##$TM1= 0
##$TM2= 0
##$TOPLEV= 0
##$USERP1= <user>
##$USERP2= <user>
##$USERP3= <user>
##$USERP4= <user>
##$USERP5= <user>
##$WDW= 1
##$XDIM= 32768
##$YMAX_p= 472518851
##$YMIN_p= -793423
##$CURPLOT= <Network HP LaserJet P1505>
##$CURPRIN= <$Network HP LaserJet P1505>
##$DFORMAT= <normdp>
##$LAYOUT= <+/1D_H.xwp>
##$LFORMAT= <normlp>
##$PFORMAT= <normpl>
##$SURQMSG= 1
$$ End of Bruker specific parameters
$$ ---------------------------------
##NTUPLES= NMR SPECTRUM
##VAR_NAME=  FREQUENCY,     SPECTRUM/REAL,   SPECTRUM/IMAG
##SYMBOL=    X,             R,               I
##VAR_TYPE=  INDEPENDENT,   DEPENDENT,       DEPENDENT
##VAR_FORM=  AFFN,          ASDF,            ASDF
##VAR_DIM=   32768,         32768,           32768
##UNITS=     HZ,            ARBITRARY UNITS, ARBITRARY UNITS
##FACTOR=    0.250966925370066, 1,           1
##FIRST=     8223.43324360094, -280254,      -122633
##LAST=      0,             96575,           53710
##MIN=       0,             -793423,         0
##MAX=       8223.43324360094, 472518851,    0
$$ Real data points
##PAGE= N=1
##DATA TABLE= (X++(R..R)), XYDATA
$$ [...]
23847 234420 -67140 -129377 -149844 71110 -300696 5118 -58080 -256853 -161928 122816 -422885
23835 79927 196918 95141 152030 326681 -40912 408288 78434 -22105 -338374 155147 176669
23824 176669 -73296 145640 57540 -146935 -20473 -78671 -141787 -239998 190695 -166869 -162198
23813 -162198 -172827 111966 -43485 161967 -38061 242674 -131439 -218580 36105 100479 49542
23801 -75028 331482 173928 84428 221123 -223442 -63870 -233008 -156018 359208 -34566
23790 185703 6372 -92001 -137864 91519 -40256 -27042 228731 -7402 349691 -196283 -13 -130353
23778 -130353 119481 214454 -213958 -461369 -82507 -329531 -67696 105218 -106393 -317109
23768 -317109 -92626 13334 230906 85652 -184519 78448 103591 -15570 -39768 -74971 -269958
23757 -269958 -35757 -33560 -52858 172104 -11959 18536 92917 -71188 -15775 -208056 -233585
23746 -233585 -127110 -149262 -88199 -18299 -73922 -124734 10579 339657 195407 -149070 19261
23734 118935 -73336 -107622 14359 44065 -37265 -60061 -130754 80911 -81115 394924 92007
23722 86590 14094 -211564 -409363 -124797 1137 146794 60353 84302 -116097 -85255 -75211
23711 -75211 56203 83911 21819 -70912 -138426 -88017 198392 -171050 -53821 -228702 -64267
23699 150725 -204509 -56704 124759 -51235 198749 396695 9785 -24066 99639 187244 -189128
23687 -21493 -355594 -59597 56787 246256 118261 -103162 -141802 259851 143299 21256
23676 -217441 -28002 -97969 -160162 300487 18533 -45756 -139112 33612 40304 145347 92177
23665 92177 280030 91334 -213506 72061 -235173 44800 191633 -7178 -221947 196758 -202350
23653 -268184 -105942 -141663 339856 -152836 123210 122307 76597 -120171 -98355 -89223 286843
23641 -216448 -239317 -260011 180386 -265741 -314653 235914 206263 -114439 166428 -83391
23630 73207 -314671 242341 -74856 -126855 -309645 241840 -280372 -79919 -168823 -88381 -253450
23619 -253450 -6591 -13914 -123023 -288144 -71067 -139780 -178887 -359385 643191 11031 -3124
23607 -14273 24089 -79663 -63592 -11599 296985 501675 73042 203304 -63996 173717 -82309
23595 60839 -159396 -256696 19288 120453 19685 -39028 -133972 -391883 -234197 -113246 156624
23583 233310 165568 -84276 -10990 103694 -492131 100715 -88650 -117921 -66426 -32986 154874
23571 -202166 42806 106993 -324972 93779 207417 42551 242447 -11862 -69485 10367 -103001
23559 -60486 -166579 -113725 84100 195367 -350559 -214060 -152581 -53080 403980 -72279 440204
23547 -98866 -79875 498655 205188 138616 -113671 152225 -89042 -73291 220254 -99848 -60264
23536 -60264 -174190 141534 15008 -83872 -52038 119747 -39308 -183946 -307624 53412 422390
23525 422390 -149289 -132015 -235429 -231519 333457 74186 1825 -38896 5001 294506 -22686
23513 188156 173407 -212272 158758 127044 139380 -160615 131117 -95016 -45917 -24151 245822
23501 17306 183212 -52510 -153752 -10240 -120722 135902 3924 -189739 -152669 -316208 164942
23489 -23156 -139572 -132357 74474 -24083 -132179 -183475 -27318 -313633 -247628 -259824 148277
23477 -33474 198149 103760 -107465 -215406 76606 182550 22394 108043 283273 -330450
23466 96392 23051 -271878 -45480 -139047 -38005 -25211 -83897 -98557 -6098 108860 -294516
23454 157211 37162 -16682 -171592 300398 173923 -93708 -197707 13244 24320 206881
23444 206881 25934 -120689 -27285 -122235 128331 -415739 -305499 -76438 -140369 -207724 -185287
23433 -185287 -6423 113089 -141677 13392 -261087 -146713 -264211 -48950 -40184 87688 -25701
23421 -135068 381976 -100854 -40190 -21195 23561 -5437 11959 -166016 -66426 189037 119557
23410 119557 -88295 -107304 25615 -137675 143332 216033 -62215 110798 131029 55425 -299673
23398 177947 108324 -171371 -56724 -167391 283460 -153963 -301406 -57567 21744 -86613
23387 150811 -112590 102962 -36253 -391829 149127 -190886 -303226 29298 -471225 277369
23376 58945 282881 -74474 83663 83265 -69192 -194026 235112 -181943 -151383 76858 210278
23365 210278 -17292 -16165 -3689 -79663 239932 -95014 -63085 88717 -64744 194828 81799
23353 233151 -92900 -203517 -34953 82809 -52777 103383 150848 -954 -141394 180182 167396
23342 167396 -37347 -250995 -186087 -347206 -71735 -317753 55190 284245 -280474 323000
23331 55849 -127945 -44559 29650 -88074 156709 -80256 -32009 -107624 -140849 156511 218535
23320 218535 290766 -80071 -202750 121042 40879 -193847 -78179 1267 57982 -105069 -540268
23309 -540268 141690 -161483 -222080 149178 146012 -12977 -58131 -278237 -328577 124177 119165
23298 119165 -339000 -201947 141506 -135822 139534 -15352 261832 160638 44895 -117357
23287 1514 -6497 104580 -20518 -125007 150761 241891 -120000 129455 -159956 -84466 252279
23275 403476 -237577 34656 144532 10507 43682 -124009 398249 -117984 123000 -11667
23264 -121804 127634 207274 -210823 -122852 65325 -141651 -96551 117085 264160 16279
23253 -113478 -115172 59146 145670 -277688 -301118 -57029 -216130 -18145 -143727 -15028 -50214
23242 -50214 -405555 -58219 341515 -292043 46081 -349900 -14529 -71211 -217024 69617 -37283
23230 -31704 121437 335192 253812 -206427 98196 243301 214520 -143364 45184 -98869 -59744
23219 -59744 -55801 340426 48138 -66619 -415484 180909 -346273 83768 -62642 234550 -257655
23207 145651 -225899 -391609 21160 98473 221140 -62718 1953 -271724 -79349 115462 32737
23195 -137189 -5335 9974 26513 -245147 72091 -331508 -28690 210474 31659 64660 -94338
23183 34653 21506 -165297 146781 -91134 25592 166642 -3069 102391 -91787 45886 -364068
23171 6149 154070 -332324 -239647 -2578 128876 121677 -82998 -6148 -501848 364368 -225896
23159 120502 -184147 281673 -39713 105462 35136 -79455 50978 -26890 -127819 37785 -169979
23147 -43932 -188439 98016 52051 305676 7229 -276120 -42457 77026 144719 -328276 94897
23135 29609 176654 108359 -67972 423222 -144566 -299029 265127 356558 228063 120220
23125 120220 292761 232801 97772 -76584 773 -305957 83692 -45805 268373 127857 -148077
23113 -529947 29214 -345127 -194085 -149237 164708 -133441 4293 62024 137684 -58239 -36028
23102 -36028 253703 246747 21873 28222 21805 117159 -89096 68844 -3059 -15965 52107 30470
23090 30470 424044 235797 -44471 190 -51008 -37656 -17203 -151066 8717 8756 -38918 271110
23077 -123246 219498 -104395 202249 -14703 27932 176480 91606 -464260 269496 227876
23067 227876 249440 -32303 -220208 431685 45175 216199 230782 97283 -16159 -186483 -79222
23055 -67022 40275 117528 -198189 -60182 -174485 -68557 127822 136829 221005 192387 -158181
23043 -365387 -174410 73791 30779 195594 -215489 198716 225795 -107317 54383 91630
23033 91630 -75422 137902 -131166 -51372 170662 324502 -149566 208581 -63193 378232
23022 -86813 153322 94554 -198873 -201719 -81242 -36681 133970 25696 48604 20293 141475
23011 141475 72852 152670 23267 126901 -368412 99349 76171 -102061 -310323 -78391 270203
22999 -204674 -181604 130111 78752 -166015 -154729 -355688 93312 -464184 -393652 91235 -18562
22987 -282429 -147805 -106214 -213360 -225253 -7419 -41334 202685 105907 36674 -211263 -60853
22975 -347280 323369 -41169 -508640 -11956 -60680 -339080 -150278 -176764 -143410 262389
22964 -300567 -223460 -193050 88854 10305 78843 -5607 19765 -30131 -107493 42502 -234111
22952 -224569 -122047 -214935 -240175 -118877 -108044 35763 283256 6074 -190528 -149839 20540
22940 -7884 -239941 -42235 -41522 -135941 -446072 204760 -73828 10160 333606 -28629 155544
22928 27017 -27816 -221262 -143144 -123229 -114327 84731 -24509 -171058 4958 -23299 -199231
22917 -199231 19279 -332158 -17304 -179994 6479 -233337 -145875 -5084 83343 -42152 -170884
22906 -170884 35416 181256 216264 149342 -30726 -137421 -100390 -289902 50299 -111171 44874
22894 -82929 -2334 -22601 193009 -323558 -165520 -130450 -101686 206162 -72780 -107296 -240739
22883 -240739 -238487 31696 43897 -152378 -77318 -83635 225705 -50008 24103 -121190 24582
22871 -1830 -171973 -104642 152557 43074 91223 -102896 -259037 241046 -105009 -205034
22861 -205034 10002 59981 -48394 34550 205562 96881 210656 -174769 61800 -81903 -202263
22850 -202263 -58908 35554 -29485 212293 -248202 19548 36086 93864 -345100 -17039 -194234
22839 -194234 44753 -204011 75240 19590 -146942 59327 -119328 212134 191173 -107365
22828 6257 -53681 -36176 328091 -69353 105761 6925 -231870 165593 -363195 92474 12980
22816 -307500 -168374 -330756 -19014 84175 -219521 52787 -81654 -163481 356505 195876
22806 195876 -127374 -18733 7659 29520 -304272 -351954 -29731 237279 160919 -34485 62080
22794 -48702 347151 235984 -84866 -285222 41350 -175424 -32814 -153560 61333 68231 222728
22783 222728 31779 -177762 64681 -347561 -200048 -165330 32426 275526 10607 -45581 29102
22771 -110368 114348 -79978 -299134 254225 -210072 152214 -395449 -45491 -66153 -27341
22760 -30857 -71667 227963 -132665 385326 -10796 -316068 -171394 -1278 -126497 44863 -65161
22748 338978 -7551 -346865 -49435 19560 -121215 56063 -92274 -101989 -193785 47048 114551
22737 114551 -78858 -89143 -78927 -73372 49616 -28999 -143263 441341 -278469 282903 175083
22726 175083 -139252 94069 238332 -391182 -242393 107486 292371 -106941 -56724 236371
22715 -182234 -190030 -306281 250694 -150130 -6677 -229368 167292 60703 98996 11630 -551133
22703 135077 -112205 -66754 -115064 9139 -425705 -686 144925 -135871 -55619 -123537 30561
22691 -127878 -269066 -75041 -81146 466563 -433723 110754 -20157 -54341 -45139 -97537 -314107
22680 -314107 -253355 115240 -293391 -48756 -20754 136405 97182 254356 40958 138148 -316647
22668 95084 24813 -360373 94168 59507 102506 148079 -348666 168128 86697 -250709 -208979
22657 -208979 936 -5044 -83597 -14579 -451522 127203 -130031 -119830 121313 -46475 134434
22645 -20086 180298 -9241 -213328 71042 -179005 87448 -193545 326023 223610 -42717 186818
22633 -414594 84143 48973 -14785 18288 -70053 -99322 -329892 155502 38991 271974 185000
22622 185000 55424 -108849 -356226 -96108 -34213 -224458 -97823 103212 72762 -84263 -194829
22611 -194829 -290674 -39620 -105462 -54514 -129846 80531 -92354 -260820 135692 -38165 -223293
22600 -223293 -77970 -19446 -16725 -131050 -125231 -153309 99168 -56268 45037 -308753 201470
22588 159344 -137160 -39059 -87211 -108948 21234 4334 -236404 -172554 331459 -12848 310387
22576 -36390 -14009 179470 123670 131668 -1827 -401740 82722 133868 -161454 25360 -153519
22564 -140408 198919 11858 84567 -249129 1645 -350430 -67880 -206112 -190881 21757 159400
22553 159400 112459 92987 109016 219907 -94381 -144326 117688 83872 -182749 141647 -100304
22541 -103524 -112220 -109706 -102660 234317 -119461 31146 66953 5970 61952 54709 -417280 187280
22528 189168 -150830 43763 -147577 211489 -67827 -21505 -172887 378013 66189 84758
22518 84758 -277477 26274 155970 148275 38533 -331291 101298 -4820 -38394 -148909 -342782
22507 -342782 -29134 -29517 -170109 -20112 236749 -255564 -128628 225795 -119220 70687 -29793
22495 -212376 -174555 -156791 -67912 269738 84120 128727 272935 -65662 -190604 9728 19851
22484 19851 -119278 5433 182582 112234 179420 -44767 -94515 166501 -253002 -183416 146368
22472 -179773 26833 78627 -250909 -59722 237413 99275 -29083 70449 281634 15307 272348
22461 272348 -199378 -193910 18418 -166294 153933 17619 297080 170547 -94884 -140945 -158302
22450 -158302 -345678 -75615 -95790 -23091 -26341 -60412 -88421 -75278 -242041 -28416 -198372
22439 -198372 183258 -212612 65400 -231694 33623 202267 82776 -145870 174730 173008
22429 173008 82258 15900 -223106 -108797 -176987 22 -432 -198836 12689 -287792 -59953 81179
22416 -233401 -166234 -4066 -52417 181131 96747 113342 -89764 -97177 -84954 40219 -171080
22404 -189815 -166569 -61987 88900 75850 -63540 -247810 -142203 -301726 -207433 -100894 -165977
22393 -165977 -102780 -284385 55519 269096 -71017 -448400 -73049 6259 -51362 -11782 40224
22381 -4931 90369 -103863 162581 69998 -114600 -74495 -274478 -139621 370069 -190204
22370 -302 101123 187171 32314 76342 -242084 -98649 25900 126013 -186157 136736 22854
22358 -74707 39298 -484859 -380949 -135782 -224590 171258 148214 96310 -257346 -199905 39637
22346 306374 -143467 -19368 -51670 -270696 113691 -138972 156147 231224 -126543 -36034
22335 438265 -126192 11101 -238534 77805 231641 -197235 -21077 -136328 -258394 232904
22324 -167133 -368686 -73068 -114901 -206959 -289023 40195 154467 -285404 182336 76701 174049
22313 174049 13168 47976 204285 87769 -64357 20432 -118563 218781 256189 244602 11203
22301 210521 256244 161014 24969 -61294 -15088 -69610 29352 82527 -11791 -143725 -186318
22290 -186318 322114 67058 235555 -16319 27060 110058 358543 -15892 -78523 31192 202515
22279 202515 -47294 -30092 -181778 -115665 -38342 321809 320898 420034 -152914 -18635 -166408
22268 -166408 -35516 268106 156043 -19732 -94430 -76449 -111401 61889 -227076 -114335 -78641
22257 -78641 26124 -181245 -59975 113142 -195280 -132351 49672 -34870 201148 -151446 -49189
22245 -218190 -71548 -84542 73207 352325 -56554 166277 222715 -64631 -224736 277765 107942
22233 147337 252784 82874 87389 -177720 138258 -129223 -223385 24421 -20545 95124 68495
22222 68495 -14512 182375 63210 -196248 -395449 61423 59346 -158223 -13306 -251165 -137970
22211 -137970 58858 -110375 -192948 9531 -167661 33504 426959 -96624 -102979 -153897 -94873
22200 -94873 -159862 -127882 51387 -96052 -119489 10610 -162245 -217620 -290204 -165846 -132762
22189 -132762 232387 -49585 -98316 -121056 -14138 -6131 139743 8434 -9574 393858 195990
22177 -45937 -259787 -49745 -290197 123737 -80511 -44419 -160674 -198823 -356530 -324046 -46633
22165 -321266 220446 -79005 9288 214679 134073 -124139 -287175 -111487 56529 -18797 113017
22153 92974 44690 229299 -154413 -118235 232113 -148590 18754 -145079 -391630 -17008
22142 -296148 22748 -150487 45509 -67395 -47222 240417 -44688 227085 77175 103641 -54219
22130 23502 -95176 -154656 60730 -333299 -93292 90377 -229427 170050 171322 148823 43678
22118 51805 -232702 111240 -221221 242842 -96942 45649 -139734 30563 -359558 -15393
22107 -210707 -227539 293850 121648 -268947 -62520 21184 38647 126035 -92305 -87744 153872
22095 -29180 66368 -93270 -183987 -303817 -169251 -300479 -59137 206703 -207868 -170830 57361
22083 -246844 321291 -150852 61265 7508 -8075 27826 -48252 109717 -18241 -186615 -320858
22072 -320858 1963 53656 97190 21335 -13658 145976 -61080 82812 65219 201352 -42547
22060 -79999 -223086 -185086 300155 25616 -78442 -66902 273383 293954 -133468 -141288 -206059
22049 -206059 303448 175911 -101437 97338 -3414 14522 100788 -168829 143563 11420 39594
22038 39594 -242271 203566 -164413 145607 -202803 -134020 41293 23348 224160 -55232
22027 125237 -37788 -34306 10257 129894 -152719 -190983 16364 212074 -7332 -39999 -79714
22016 -79714 33909 -117385 134284 175141 32213 17928 -291269 348527 61448 -94239 114593
22004 -210124 -42402 -111284 -196020 99442 337325 89970 13658 -277403 171094 252021 -19276
21992 101513 -134752 -410737 -475496 -102576 136469 -64462 176026 198142 -234672 -72464
21981 346434 -136722 362288 -35276 130163 17675 -78644 -39086 -51846 27499 -151182 34515
21969 84852 -114182 -26560 -108218 -107974 -33280 -144999 18598 -94033 -329167 228616 4857
21957 177305 245952 -17972 -179286 -31666 -22710 -189275 -92286 -189544 40960 -49487 -15926
21945 -349005 33893 -264729 -129319 214993 -81683 187229 -229402 -46827 -76413 361200
21934 -114036 226243 87154 210369 78910 303601 -151670 -81230 212888 236843 243057 218220
21923 218220 23699 -26938 202150 -88410 181450 46925 84570 117133 -60262 -307001 21810
21911 -70329 -124587 -29197 -52859 -22730 -36070 -119382 -12310 100540 151607 -137223 -100581
21900 -100581 -118904 -185327 -282024 279637 135088 -138150 -105775 -271174 -60787 -27964 -86376
21889 -86376 161538 -169906 -43608 -337913 -41692 -230261 -307553 46017 58400 176119 40209
21877 36109 -39678 197772 -234522 -271458 85114 -153077 -187074 -304981 -282925 -134857 -189340
21866 -189340 -209663 96315 -31512 -223497 263344 -26249 -29636 34110 105661 -193089 -212786
21855 -212786 16518 -6509 83370 -93092 74877 155552 -166436 -199 97110 39234 -138059 -940
21842 48776 127115 -231557 371416 -72824 -162774 -145560 215151 -123979 -54092 -44353 -88324
21831 -88324 -260549 -200275 100810 -327672 -95147 -121707 -69320 85172 82303 -330440 -303507
21820 -303507 -167349 128251 -231270 -257015 71951 -48283 -76485 -190193 4294 163798 -74271
21808 -135500 305027 -60517 -258205 8909 -9407 -268237 88212 -103463 -126260 81748 -190394
21796 -142349 11272 68958 83515 -218908 56987 -42800 11419 -372445 142319 -310224 162297
21784 -75908 206880 -212471 -362954 47183 -171031 -133535 -97352 123431 21025 34921 41336
21773 41336 5248 126465 -25982 83330 124529 -51236 -51582 153582 -293856 -39764 68756 -6341
21760 4863 -217167 -439049 84636 -263265 181233 -48690 -390841 -85215 -69696 -97949 114571
21748 21242 -189028 91029 231241 9645 -217857 63433 -89687 -113016 -251803 49362 -127115
21736 -33974 -364638 84566 64268 179395 -31967 74202 13585 -15051 -115557 119197 133365
21725 133365 25662 -128717 -185402 -115932 70984 285879 941 175767 -406721 108539 -39428
21713 25151 49990 72208 -230436 -82712 -181535 -53582 -122764 97290 -210797 349969 77359
21701 -108686 145323 -241733 63986 132688 -426548 67929 -73658 18736 243552 -139497
21690 -41263 -306683 -107706 21188 -93371 28827 220711 74953 -52097 -150686 -368861 67050
21678 169812 -53789 81658 -47549 152163 -49429 11545 -405618 -223362 47369 -100488 -125970
21667 -125970 144513 -545965 178571 78647 45157 -207912 89231 -74070 -59252 526 -163614
21655 -431961 -95395 -74619 -132146 91075 -335765 -163250 -142923 160310 167493 -56926 -59690
21644 -59690 8638 14983 -93793 -192494 78637 -106435 86260 -60212 178806 -383662 27748
21632 -208309 271865 -449072 -105546 -160700 90894 -198364 2188 19331 278483 -96934 -283486
21621 -283486 -258569 90045 -229496 -17414 -122141 307152 -223670 -70115 -22876 4703 -415049
21609 -138541 -123845 -128973 7520 -21597 59663 -84855 -225268 -315523 -59942 239745 -110837
21597 52160 -43205 -39454 38017 -235317 -189068 -120278 112184 -8948 265853 -140833 59477
21585 113699 35453 -365609 31779 198450 -148559 -71464 -18169 197618 -283210 82006
21574 248485 -100334 177475 -79162 210735 -168940 -66464 57417 298197 62418 -59216
21563 206691 -421941 -101945 363268 -49480 88877 42079 40654 -364928 -369999 -354342 16204
21551 -220221 66988 -324768 87625 -793423 263078 195278 290249 -358677 -206797 -226767
21541 -226767 238860 -21960 180237 14870 -27246 -85739 125329 -162706 -134886 -157074 92023
21529 -341959 86590 14385 -135668 -113551 -88359 -251981 -18264 134677 -103698 306292
21518 -26792 -221610 -359364 61740 305651 -347819 -226681 -168152 88512 -90744 -113618 -2275
21506 52279 -13089 -209213 -198132 51755 39124 -227785 -72562 461816 -287320 -60325 167975
21494 82954 -192250 35662 -308937 89599 377758 -132527 133380 -193805 -160511 -22320
21483 87996 -179838 -754400 -55554 -166775 -120710 176318 166321 19325 -457954 -10295 178949
21471 -50381 53548 -377358 -57490 219301 28260 -133560 3162 -131827 -159021 -130953 -228623
21460 -228623 289952 111720 -91700 -146909 162917 -421278 -142802 -100866 -382801 -112214
21449 153919 -24780 137130 -396626 418672 -47950 253607 232340 -160919 130391 199418
21439 199418 26903 65345 76863 321861 133780 -67059 132768 35969 -11028 209969 -15586
21427 97286 190382 -332799 133269 71537 -222541 331308 -32799 79455 147334 -173436 -200470
21416 -200470 -97395 -128696 -122232 123636 -9016 56413 -52056 -101080 132598 11793 -137080
21404 -222553 -240568 41215 -90427 -150607 -208704 -96205 231419 -32775 46716 12725 -75447
21392 98206 -63828 -111240 -107410 -151869 -29916 246239 32585 37344 -90309 -270855 5933 393112
21380 393112 60165 30238 -38784 204088 -341143 -218100 22929 -24970 -186950 139638
21369 -103360 172221 -87796 -253480 25451 116915 183737 252223 11027 3282 160155 -155930
21357 -65785 -174268 -348295 -357782 -258938 -206259 -249015 -262893 -121157 278826 168449 -65130
21345 -390283 206085 -250973 -39050 34376 71410 -307668 -23534 -54988 -75877 111134 -158213
21333 383580 -166727 -105488 -124144 -146524 -46904 -238172 159038 183064 94844 -201388 62905
21321 -86440 -228465 -95859 -55718 -28418 -64342 -84676 -157716 84304 -54433 58318 -8075 253264
21308 121108 106473 161618 48694 -48964 -231660 -24014 -262722 -337069 191527 124684 -260994
21296 -15644 -71805 -372794 -189869 107513 -81033 80685 14416 254824 -64766 -171108 -148998
21285 -148998 -211792 -117922 -142974 -143286 188093 28962 -143691 125798 110427 -262869 -282513
21274 -282513 -163104 168288 302 56487 -175054 47139 -11687 -79135 7989 311218 -12329
21262 -410148 -215642 -79917 -44747 -64324 65776 -62315 -192867 73962 -67586 224001 -53210
21250 -235485 -157571 -256151 -9954 -17442 -244205 56138 -9640 -329522 89590 17429 150256
21239 150256 -41547 -52746 -99796 232 -25874 -5468 102382 260692 -152277 253449 -115368
21227 123553 107851 -22642 55133 126443 -172312 40727 309680 34270 89150 247839 88498
21215 -234656 41900 -313788 -347117 -240963 43601 -42871 -105625 -147412 -217785 232246 -190189
21203 -142597 184532 -52853 59427 52961 298865 -103752 -278124 165270 52601 44743 50789
21192 50789 -135773 79916 -157032 -154270 134427 136983 -358845 -62099 -15966 141355 -101804
21180 58772 -180090 158758 -37007 -146194 99346 123281 69606 63469 -7227 -52593 100396
21168 343541 -208599 -77046 39858 -241268 -71600 -384393 -228819 -128141 -382978 -238032
21158 -238032 -247763 -56742 128211 99038 -220115 -418275 -222078 -35322 200282 -276331
21147 264838 105524 -117318 -508089 68016 251496 -133854 85452 -155357 -123672 -101242
21137 -101242 -153903 -252983 65336 -253040 110412 9578 -32414 143697 -99813 342278 -61250
21125 29715 -23970 91546 -192504 97754 -71310 306267 -259040 -91068 -308505 -47467 -303416
21114 -303416 376298 21776 -137169 108654 -208022 42330 35139 -130079 254302 -180090
21103 -132930 -70847 131823 248561 143919 138348 -27883 6819 -178024 -386513 277824 -359452
21091 -381570 -170303 79659 50761 35359 -57510 -309798 -152531 -35546 -292393 -28670 -231171
21080 -231171 226475 -23868 -110720 -346024 -296744 -50102 -91759 -127073 -237948 -162969 188951
21068 58406 -134124 -171657 152223 -9055 263884 -68625 -160786 -146979 12085 -180831 26402
21056 -296641 -365116 -150886 259096 -77643 -144655 -120461 148447 -8062 -127303 -277465 24019
21044 70654 -84021 237526 435201 -313052 -8129 -244767 104107 -72564 104849 99374 61946
21033 61946 -239832 -181319 -30593 -366688 64260 -54768 19068 -10987 51372 -4586 -81261
21022 -81261 56635 -58230 230444 23862 -299056 -144820 -33434 -260067 73145 -7698 -62703
21011 -62703 243699 -49728 -121793 -130650 -152003 180320 -151381 -97181 -38566 -108575 -71726
21000 -71726 -51233 13592 -17381 -338038 -23942 -107125 -125097 -34206 -110816 -45204 -362541
20989 -362541 6023 190261 -208017 -364757 214957 49022 -71840 3564 -70924 -208680 -328674
20978 -328674 -113906 28845 -42566 149950 -62197 -147869 -325073 115754 -213911 93071
20967 -222164 76313 207258 5853 -208006 -147453 -113998 112786 -55085 156503 -143345 -242115
20956 -242115 3013 -175567 173111 -144018 168283 -39815 -278244 -19645 -322595 18246
20945 -2099 10310 30471 -213201 -184756 33365 -160340 -259449 2885 157413 -56142 -50272 -165491
20933 -165491 155285 130812 -99746 -21685 37414 97504 195718 98221 16446 -71000 114423
20921 70237 -139414 -12963 -276674 35060 -169152 314018 9515 -47028 205297 -77900 4047
20909 -552535 -23788 236699 228938 46731 -30946 -218046 -156347 227024 222752 -39981 -407750
20898 -407750 -11503 -147431 -215265 265701 -268463 -287364 -152182 -508640 -111227 -126311
20888 -126311 -76475 11831 -157404 -87888 -162873 -72372 49062 -72474 -97767 85348 -13520
20876 -15467 238343 -190837 92933 -16047 -130967 -144480 -73929 -69067 123331 175260 -442440
20864 -119749 -21400 -176362 -117091 61705 -84638 72393 -274631 -256951 21597 360818 155202
20852 62265 5899 -201575 -78029 43414 -245103 -113661 -199396 60604 -9136 -34139 -14528
20840 -85252 209884 -57814 29636 -255475 -106181 3818 -56534 -198041 50420 156323 -59096
20828 -383367 -87932 -8831 -28450 -52166 -241798 242856 95703 -115206 -123500 -170333 -263050
20817 -263050 -115658 -230310 -178720 114429 -169742 86568 15967 106937 -299926 348962
20806 -90230 -143337 -255267 44924 -219783 -49562 36536 210844 185349 77721 -33206 70659
20794 237884 168089 -20212 -51742 -210282 -227828 197536 260164 156104 -9686 -181193 -153774
20783 -153774 112514 -310200 -237445 175845 -36498 -144643 105442 273765 -13799 -244069
20773 -244069 -135132 -110528 -222699 -72392 -142603 142866 162291 -45505 66872 208561 185476
20762 185476 250483 43562 -24576 51197 316927 -401403 -191276 -212125 58272 -179617 -224033
20751 -224033 64235 22316 104679 -313337 -152160 -153775 -54096 -62555 -17203 -21600 -228701
20740 -228701 -218950 -27393 -9597 -342744 -140662 68538 91604 -57700 -33588 116421 707 -256437
20727 -207356 105434 -119579 -14478 125670 -63347 -127481 -132040 -29930 -110839 -106156 -301905
20716 -301905 38802 105725 -51831 -241131 136200 -417022 -31708 -304874 125953 -52795
20705 -362006 -277081 -169004 -191988 281475 -474284 12961 69451 53500 -185056 -94336 -284417
20694 -284417 -141120 103375 -117413 -16458 -48528 217078 162264 74286 125112 -374828
20683 -230508 -236519 101100 85883 80128 95653 -342704 -190474 -251203 -212237 -39400 88800
20671 -158196 243883 -271537 160862 -129695 -57875 81840 -308226 -122845 -121253 -33173
20660 101382 -196523 237863 -190971 57167 -15260 -76710 60974 191118 -43109 97160 -295319
20648 -47553 94606 195348 117657 -324620 408056 123778 142493 -72042 -69679 -284011 52058
20636 -51902 -214212 -291492 -175019 -134509 -3090 -67167 -274468 98417 -65353 9031 -136510
20624 168387 -151689 -117199 -155526 -44947 151625 -154407 39401 70823 58565 -197446 -145568
20613 -145568 122745 -250896 85031 -355921 88478 -344279 346591 317311 -118379 208924
20602 2042 176355 110777 70201 -45891 196384 250040 50684 -26968 52463 -47292 132403
20590 -39660 52789 -7192 45126 67011 -54542 -54300 99275 66753 222758 -144037 297481 178597
20578 178597 26955 22603 131382 -253777 -48789 -85597 31402 120388 -204444 176283 35336
20566 -53218 -76300 27877 -122750 -361788 -93202 -71881 38516 -180235 -101003 284266 -223725
20554 143145 -158788 -442176 -62350 -428505 -159221 -39657 30080 -61215 330833 -130922
20543 -297761 154633 142979 -99056 -84876 -122422 195725 -29698 280653 -75671 -59823 -50130
20532 -50130 -150683 -46231 51116 89720 96359 130821 372578 -76632 -326323 -139902 154100
20520 -346648 -30613 28927 -17408 149340 -80277 -41040 -58459 -174455 -310210 -74739 -158212
20509 -158212 -98841 109314 88868 -154328 -301489 26532 1667 -68432 207668 76896 -321818
20497 -130468 -50131 50683 -92230 -191826 -48347 -187639 -6875 -70749 49530 4162 136330
20486 136330 -185372 11375 -151079 30332 -135282 -113791 -344122 -103456 -45179 91118
20475 -274304 -26755 -29004 119495 -181084 37052 38939 -89299 51997 99420 -61038 -43696
20464 -43696 -55912 -304466 -145651 229835 -147101 58677 42005 -63013 -78404 39748 -20562
20452 -54997 -72333 191742 264870 -323616 -87166 -468241 4391 -33549 -177979 -41623 105584
20440 -41048 311228 49728 -176876 89364 -44926 55284 -22562 -272755 -18371 -89241 -74946
20429 -74946 30886 -443303 66041 -296961 -109495 -308849 -283829 -12521 281066 -68540 79320
20417 -84461 85079 -233115 11909 127531 34696 -217520 -169964 20307 27004 -22239 87956
20405 32398 141883 -54171 -8102 63942 26337 272052 138386 -188155 17312 -439573 96353
20393 -14636 38 -34967 -121749 -143093 -267671 92930 184930 -111605 271202 49974 -239145
20381 -233581 258236 -271801 -42720 123416 -42183 -56996 483130 -9892 12586 190199 -12180
20369 -101337 -100404 92628 104922 -338389 -162280 -58780 3186 -240040 -180523 -35146 -5910 59912
20356 -80007 -182773 -75789 -124417 -25118 -110042 267253 -67956 -565392 200543 23008 2525
20344 -216118 -260107 6085 40132 108168 -90370 128166 -235289 228238 53112 102784 -74932
20332 236207 -340399 -65145 96753 70501 269631 63330 -123524 -335219 33008 260179
20322 260179 255789 -130525 -85559 192016 -232518 -203991 -244149 -5552 11802 168369 156165
20311 156165 -148401 38911 -200629 65643 79927 -161749 4935 -92135 -71447 66771 175113
20300 175113 -70646 122246 258749 274090 -22910 325440 -24953 -77672 -19438 -106208 -209317
20289 -209317 -114114 -69763 39307 125913 -94024 -288284 7072 175242 268161 180986 35726
20277 65389 404258 -94896 -172062 -95279 -242617 -129626 -326157 -186032 -83161 134786
20266 200651 175306 -19228 -381987 -411020 72405 158621 362748 -58415 82100 9187 -181115
20254 -49244 129442 96737 -260984 185387 103363 -187059 39267 -266798 64920 -257224
20243 -54610 -319183 -69748 -328871 -134589 -117932 -316583 148222 -169827 -152623 -85681
20233 -85681 -13512 53028 9874 -81823 -393296 78830 152024 -163689 117712 15589 -236859
20221 -160623 -236355 46599 219721 129610 -32737 -341940 -284266 177296 16328 32835 202717
20210 202717 -146021 -89934 -99332 46514 -183594 -261248 -185696 163096 231285 76847 -195310
20198 79804 98657 -79667 -244247 166609 -11189 4554 253227 42577 -122022 49025 -216069
20186 -359345 -251429 -520461 44732 -26930 -113658 -178054 28658 53876 -91991 -114780 -126424
20175 -126424 -327404 12009 -23549 -251804 507596 252366 -27169 -38454 -105200 52648 -158685
20163 62376 88620 46418 -93513 -179390 5782 85034 34226 51466 -112918 -15408 -31399 -24438
20151 -24438 -429733 -53866 -457404 131381 -6973 238322 -310734 195568 -63305 109740
20140 -8213 -13737 216034 49399 153968 -154527 -76551 -181150 23829 256494 194167 -186315
20128 -162980 66126 -188666 294316 28604 -4183 -30342 -358924 -41986 350821 -194804 27026
20116 -18552 -57673 -121107 -174346 -219305 -460685 -43756 -232888 -137820 -66187 -502596 -30079
20104 -119414 56898 82338 -72174 -134571 -40702 -266409 -55547 -182025 -277165 -94495 -66811
20093 -66811 -202891 310450 -82185 -424730 -34772 49193 161963 -401279 -17844 179028
20082 78706 172092 68145 -82123 -35309 -151646 67438 264393 -163476 -100235 -86942 -124535
20071 -124535 56262 -185721 138248 -112495 10766 -123862 -324417 -70559 151194 -236915
20060 101352 -25249 -136115 213204 -287826 146464 -208506 -2768 -50881 128652 -137802
20049 -97400 -82625 -108789 -93647 -370113 199801 -60436 -311760 45964 -32121 -133564 41625
20037 -189361 -11940 -319593 -322194 62211 98365 84091 52937 73302 28101 42853 -264082
20025 3382 57388 -142230 -181987 21795 88120 -35803 47081 290845 -113383 -177074 16051
20013 -23249 -123377 -147963 254492 -103274 72936 -83598 -74303 -576105 -239127 248693 181980
20002 181980 31772 5461 207065 -139427 24964 1952 145791 -220666 -246874 -32032 26556
19990 -405967 -94193 -47953 -197072 -3301 -166069 -199688 -493595 -53737 388815 13844 -142359
19978 -114454 -103178 -40013 -228117 -150862 -37700 74848 -92998 -174496 -230212 247089 235709
19967 235709 -271699 -265911 172790 -280433 142737 -270334 53030 110530 -139814 206848
19956 -31508 42521 -297536 54481 40388 -4054 -73178 46003 295432 -6693 -140180 -236287
19945 -236287 85435 -193743 -214600 -636535 -152132 -93849 -91228 -73210 182696 -60681 -214036
19934 -214036 -67507 114895 -126907 109383 52389 -177708 -5019 -195625 226938 68718
19923 -30141 17012 106700 252133 162834 -162792 -359329 -60500 -19246 134225 67439 -87351
19911 61450 -149862 -147185 8778 -277715 -146187 21762 145142 -282166 -21021 -80285 -83397
19900 -83397 5190 -336276 -8047 -58117 -35608 -111599 -228857 10706 -174324 -231483 -190251
19889 -190251 -142490 -171001 -148157 -232878 12914 165790 -80223 -82135 -216855 -155044 253016
19877 -198743 -110205 51253 20754 -158091 64128 -403041 -62034 117683 -97542 -145736 -1970
19865 -241029 -378439 -51701 98221 161795 -534853 7196 -18332 -192426 -154494 -113736 -130405
19854 -130405 -385231 -72876 117134 140056 -291100 250001 115194 -161614 -105498 92189
19843 159279 -571812 -112787 -19527 126975 -72769 -287707 45298 17915 -7154 -116613 -2367
19831 -111190 10609 134152 -260555 105549 -553240 12297 -163977 71829 -147574 -255125
19821 -255125 77751 -193246 -68020 37167 98537 271852 31348 -133207 -401547 -81887 -43608
19810 -43608 -221666 -280271 -15146 256660 45820 -169541 -455102 -154358 228607 -60533
19799 -267244 -230300 -160691 -10711 -67787 91019 -67956 -29824 -138611 -93482 -332191 -38000
19787 126429 -361875 118731 -432157 -107199 -12302 196338 -250771 33609 -41500 -96835
19777 -96835 438414 84983 24833 17393 46719 -76733 -11679 1735 -114897 -2003 -285219 -374617
19765 -374617 -34989 -43868 108717 -251687 -109055 54565 280200 243323 -178783 -363579
19755 -363579 136735 -271784 51994 -136457 -107754 299569 88781 -14778 192093 -12869
19744 379586 -246881 31096 29683 176144 23958 -151337 -99641 -203262 105043 98585 -171265
19732 1305 136469 -25718 -217468 -427566 -269106 -38494 -161372 -134370 -35953 -67214 -79457
19721 -79457 -315027 141019 -9291 -135190 -4045 -136057 155097 36578 80637 -115252 -110586
19710 -110586 -139785 215160 -178685 -372039 22885 -66542 53185 77397 40238 30785 -126078
19698 359655 -127223 120944 108620 -153300 18205 -510985 211447 43385 144983 -62346
19687 -124998 87978 -109966 -54091 82453 -2602 -360252 -176368 -214783 293185 134088 -21199
19675 -10620 55229 -114431 234154 125811 -105930 507348 -332418 -118594 53285 -323490
19664 214983 -102531 159975 -152919 -8562 126777 -24689 30831 -145072 67736 -272634
19653 -229110 70348 209453 28608 327924 110494 -227712 -35694 -312661 -107378 -315409
19643 -315409 132534 155784 -41287 -72804 -33742 78308 312423 -17504 -165112 6409 -230402
19631 -106116 -103478 136463 44769 -34228 -49080 358434 -66569 -365611 -95765 -331315 -152340
19619 -433592 -269273 -390358 95675 -71454 204998 48075 99063 -44427 -196251 -186305 -162474
19608 -162474 -126705 -162477 -100354 -196137 -60755 -37987 -20291 162567 -15518 -204602 -55765
19596 -305299 570324 -168062 -81513 -116635 93535 -433827 -168 85559 76228 77360 30453 -144654
19583 -158616 -89611 -194771 90239 111132 19532 -42516 -405517 -200877 -206273 -191300 -235960
19572 -235960 135513 -54082 -30906 -25270 80622 389217 196537 123132 -18382 -263405 -144679
19561 -144679 304813 -169914 325651 -125283 221746 -313956 -189907 -22746 -96302 -93637
19551 -93637 -231116 -177590 -91254 53141 -257715 -265547 -205744 -87512 -217223 -371389 -130329
19539 -462369 -238986 -323111 -248029 54115 5095 -36496 -248947 -74161 -48890 -7670 96137
19527 -306527 156689 -195895 -169119 -119031 140282 -270662 -1768 -31359 -202501 -176162 -22676
19515 196147 37858 131374 -274375 -12213 55451 208554 75190 -68733 -148146 -67746 133615
19503 148200 122447 -33661 178108 -27259 66424 189987 117841 151347 143092 -93537 241721
19491 -58828 -59345 -157682 -76474 -244658 265443 -98910 40079 -101893 -82628 152397 126979
19480 126979 142814 -342646 -124034 153577 -240080 -167178 107944 284748 84627 -157895
19469 -273706 -102500 -665635 -47550 -217998 -29836 -249047 23246 -114593 -40347 8444 40896
19458 40896 -58643 -20452 82480 355999 36780 3450 8176 313177 -416315 135655 -67158
19446 -229090 -64519 5762 13974 -27396 -5548 37281 166715 -205170 -319972 -331497 201229
19434 -284418 192036 -208722 -38273 67291 161430 -68429 243128 -239613 -249925 -247064 -32065
19422 165026 -9498 39330 -42197 117334 101096 -53313 -114897 237087 -101471 219977 -129027
19410 -348390 85813 -95242 -74393 -239047 -59453 -164639 103445 64047 -361647 -49374 15664
19398 -259756 73273 -42983 54384 -123738 108815 32454 -43701 -61958 -351166 -32254 -27894
19387 -27894 293261 -46958 -374441 -133838 -94966 7538 -28907 -204030 -186802 -71824 -191899
19376 -191899 -74248 12473 -113177 86973 -163898 -198165 121064 -122853 -10209 -101697 -136791
19365 -136791 -386806 -138657 -341425 26718 -152969 -56917 -95371 -50462 -390742 50663
19354 -16139 146483 -65739 -85974 121758 -218945 -68625 -162782 -129776 -18057 82272 -39372
19342 -227981 -155281 -319727 -4341 3137 47587 -93094 113005 -340579 -207653 -20114 -314680
19331 -314680 -227325 230984 31449 -60111 114947 180567 -18867 -452721 -120432 -103535 -369504
19320 -369504 30501 -76117 61977 -89298 -196096 -271431 -489419 -1285 153660 128252 -180615
19308 49393 90388 -95265 333049 204814 87706 -135850 -163338 -170046 227784 293172 162372
19297 162372 -498614 -108708 267551 -264569 71552 -47346 223335 -1450 -82244 -351435
19287 -351435 -104951 -140005 115936 289596 -161725 -98289 -104440 -241676 416262 -147920
19276 69057 56080 -162064 -459401 -170958 -19648 49999 -130464 164638 -66225 51181 -153493
19264 29931 -125838 -145085 -71008 -226217 184648 -42429 -131932 -28015 -19164 -22499 -182628
19253 -182628 234994 88145 7362 210352 97793 -103113 -313647 -318315 -111893 -290584 2601
19241 -332907 -280407 -122176 -89338 -58483 -38874 216723 25618 -464713 255745 266519 216673
19230 216673 44613 426897 53163 -239252 -32636 254521 -328562 -8333 135205 -42003 -183844
19219 -183844 -29904 160785 140403 47790 184403 -252003 -159265 -412911 -177988 -137324
19209 -137324 -43021 -212391 -226953 -72954 49567 -39242 -147777 300455 -111549 50503 143679
19198 143679 76849 229168 163997 -302967 -334811 -285813 -138396 90936 -337413 138333
19187 -149290 26965 -206040 -89980 -336689 189061 -178601 109851 -6494 175997 -441669
19176 -95427 -191932 314442 81669 -24714 -18071 -329692 115923 -13165 41995 -137228 -2035
19164 226114 -84222 -33763 92690 -329308 -301494 -512 -109157 179118 27588 44019 28909
19153 28909 44447 45656 92199 -175452 222724 -21029 -275374 129544 -236585 -94863 27015
19141 44006 -201505 -172792 -270973 -114006 120559 -69406 78200 162511 -96658 -88203 102527
19129 -172002 -65692 -13320 -188156 46623 -307177 -245324 33434 -14545 -161804 -342722 -52515
19117 -77704 161527 -4274 -259768 242222 -125436 -13385 -144890 -11826 -361175 -212675
19107 -212675 -23982 267460 85177 -96390 -47186 19313 9375 -127942 91818 168738 -69077
19095 55576 -230627 -32789 4047 22774 29313 116701 64441 -195542 -235809 49715 -390698
19083 -123154 -28723 206138 52386 100442 -227502 -12076 113953 21121 118339 116344 21625
19071 -270137 -105887 -380092 -154827 -11355 107917 -154616 -16888 -98089 -401 -25869 -336952
19060 -336952 -119510 265263 -12903 26755 84367 -221066 20992 -187984 -310754 28461
19049 -146449 195927 -67572 110690 114524 111569 257403 -77234 90930 -118332 -79181 13202
19037 -187344 147404 -220214 164083 15886 47278 37456 -170424 71865 -317388 217080
19026 180393 -120592 -52838 -179927 -170638 32692 -121615 209148 120794 120499 198643 249349
19015 249349 20963 -275669 -20871 11025 101857 -53938 141346 -54943 -232542 -134718 -284541
19004 -284541 -46119 -75199 50294 -242284 -454586 -145264 243161 48253 17649 11667 -112411
18992 -91116 -193494 -167673 -467656 59613 -76711 -121218 -182051 -246104 67718 -121145 -210246
18981 -210246 -154745 -194920 -142311 303364 -160666 89222 83373 174779 -352635 7720 -180200
18969 -256892 -99839 212744 -29270 1508 117372 72693 55156 -209573 -51805 43144 160123
18958 160123 -142496 -100107 39478 -384884 -362260 -195201 35455 -22648 98354 -189149 225983
18946 32823 -138141 63826 -2757 -41517 178536 -173646 -205182 80920 153095 344646 151282
18934 6234 -54416 -189905 -299422 -104464 95311 50293 5211 -45084 -286319 -98292 106872
18922 125669 132153 -347300 158682 -60061 39227 -194762 -59540 32167 -52091 7172 133830
18911 133830 -227546 99606 -20036 -265855 120103 122356 3301 -227182 207960 -23626 -195817
18900 -195817 218239 -205018 -63656 -107506 -479926 -217696 154918 4835 268556 181863
18890 181863 223798 -282776 -192463 18980 -263968 -159733 -334099 -162826 -3500 174279
18879 -17899 -75588 -150213 -118553 1376 -67878 187112 -64833 135590 103971 -54411 65756
18867 -162866 -309243 -281344 -205088 -82070 -205716 269839 -54404 75469 -232919 74303 -284868
18855 -3851 -275318 -199355 -92752 -123610 -89490 -100710 102826 -73735 33373 -53987 -2163 136748
18842 189708 -26014 -29344 454 -108847 -864 -2522 99501 -172822 72306 -52380 81430 -137856
18829 -31487 239197 -181427 -205108 119324 475654 -74986 -221696 59609 -124303 -153453
18819 -153453 -156386 79202 -129752 71235 -362907 283336 142377 152281 -307821 -221337 65046
18807 -34054 -144549 -267217 259280 172949 -61270 -361058 435688 116574 274770 -339317
18796 -114911 -278332 -104830 -61001 -24881 191502 225655 112039 -77738 -184898 34712
18785 127319 14402 9885 -247202 -344123 187666 353468 44044 209600 -62027 -246116 -281922
18774 -281922 -267776 64243 -127442 -347017 -291787 293317 136723 -99247 71555 -231038
18763 -79247 136766 27657 100344 -179001 340891 90457 -211088 10586 -157494 -4549 182970
18751 73553 103607 -41288 69130 -143795 -204627 -241115 116094 -50345 -85460 -53803 -88129
18740 -88129 71328 -108930 116791 29451 -291297 -168990 -349032 221031 129118 -12149
18729 90785 176431 -255365 -63487 -24670 3072 183763 -263795 -560001 -18818 -151504 102291
18717 86232 -98556 53549 -16664 -112590 -94678 33534 -73820 -6417 128577 -275815 -35127
18705 -103195 210419 47707 -269563 -308987 73303 -289061 -380889 109870 -52167 -245317
18695 -245317 -436777 31426 169194 148961 27486 166567 -236077 -41133 -190515 -229875
18685 -229875 67894 127151 230656 37418 132285 -120917 112690 -378021 -109946 -359854
18675 -359854 429457 -227813 -43192 -154792 55410 -206114 46898 75368 -250435 -145868
18665 -145868 -228851 47953 132871 -132014 58751 -141454 -188098 -151585 -45672 -280758 -127131
18653 49912 -196805 -14996 -36947 27688 193251 -42681 -416422 -3349 -164875 -101813 254014
18641 -96733 -179068 161781 106570 21537 -15476 -233656 -157671 132508 158705 -101252 -170789
18630 -170789 -530887 -109552 40904 267249 -344319 -31129 -193990 49303 -55104 17527
18619 -40234 124090 -336161 -180320 223056 3313 35042 303552 -216824 216081 -3436 172142
18607 58032 -89813 -9420 122897 148606 -269053 38121 -75359 -36714 -197484 -190548 233070
18595 258665 -154786 -187708 -239954 -82996 -63017 -74487 17085 -91139 -135038 181508 251899
18584 251899 185711 -129620 -47358 -128615 5624 -167367 -117340 -183625 -187999 131531 -128619
18572 -9955 67873 -94603 -138905 -65673 -297588 -99763 349862 218453 -112936 63831 233926
18561 233926 -66259 -7669 75782 167873 -227226 40315 -93783 50429 -210844 81144 -163913
18549 213288 -228331 163810 -122784 -159080 -398599 69666 -203653 -194707 129837 19260
18538 -222462 -256057 -11688 -284666 -136761 237121 -180715 -116971 -122931 -17651 -231302 -386359
18527 -386359 -195291 9856 -279490 17927 -81814 207342 130494 -213569 337787 60058 61049
18516 61049 -281467 -155940 18637 -388850 -67499 -17736 139440 -123394 -279344 1439 -63264
18504 50042 -14488 -137081 -68182 -481665 98506 -300457 -111257 -193812 -18617 -184201 181715
18492 34467 -119388 75661 64564 53253 392203 -32953 -139521 153452 445039 75062 229260
18481 229260 -132881 -437574 -75155 -356623 233513 -339140 -3516 164416 -6717 91433 -117215
18469 -143545 86151 -35957 -283095 373120 -187987 -30683 -75658 -99246 -241922 -103416
18458 186431 31406 380380 -89825 -50594 -5705 -86877 243391 194340 -258622 32356 190235
18447 190235 475297 105254 36114 99702 30446 -606160 -59401 58778 189498 130016 -71881
18435 -166215 -178527 -213620 379595 333245 -101886 -118951 -190910 -164833 -28823 -228128 -71272
18423 -321079 -118161 -148977 -142180 -43240 -243834 -209345 303565 -191263 176542 -101248
18412 -92132 129319 -25627 -151745 259408 -352651 153154 -211955 -195613 71851 97561
18402 97561 -32646 173969 -239315 191851 -153728 -83376 179338 249985 -49570 -93304 109735
18390 -61687 -119532 170187 -80197 -111960 -168055 -404461 141262 -235840 33321 36175 54951
18379 54951 -114543 -204154 -123877 188835 -402261 -25749 -114959 38623 -110816 -213111 69163
18367 81742 -178513 -135598 -158634 -12600 17681 199389 -325360 347887 -9233 -132936 69673
18355 188090 -109908 -330994 -22241 88267 -83857 -379882 -89477 -167926 -152262 241048 -13802
18343 -51824 -385737 -38777 -429445 -123558 -35120 -72178 39073 -228714 7637 43467 40546
18332 40546 -29326 -168748 299478 -106593 195475 -152315 135337 52412 -76861 -212678
18322 -212678 300057 -204261 178512 410641 156086 -78640 98920 25186 -53599 103889
18311 -15597 62952 47715 -17938 -64955 47812 -6309 216232 -83168 4797 -163644 46890 375953
18299 375953 -64415 28392 49066 34347 137796 -256173 170836 141098 -123031 468261
18288 -110319 -204079 -414869 -244238 97843 -308056 272366 5169 -148933 122685 -195024
18277 8957 162854 3734 -129878 2489 41706 -159714 -20316 85155 -265911 -1602 193352
18265 -258903 -172330 -176471 -258102 36717 157714 -164374 -19697 255517 -27166 55361 -173338
18253 -514 48431 39288 159227 -298781 68015 -301777 7525 274909 -57471 -176837 149185
18241 -260278 -205670 -94474 144335 -61109 187122 91930 -186201 216100 -213072 -171342
18231 -171342 -138252 -48869 51044 113329 -71864 -15579 121490 -110747 69752 -143455 -26479
18219 148752 -142069 67813 27665 50148 -68414 -2692 385106 212576 -62822 -130477 -419583
18208 -419583 -35433 157551 21894 27746 -140685 -176983 10058 -238848 63054 -208887 -119284
18197 -119284 -37008 -234442 -269375 66954 -217259 -51253 -191858 164352 251077 41661 118631
18186 118631 -113926 -188846 -25296 160229 -189577 109480 60111 -179859 -96263 16597
18175 -115223 -351090 138826 -21876 103786 -74531 34451 -361865 -293285 -187081 -124822
18165 -124822 -42103 -74788 103432 -57970 -74875 -170658 -114480 267267 -220002 -75186 -91625
18154 -91625 6488 151348 131859 210875 -326350 45607 219776 -16943 -282436 -425663 -41414
18142 317186 86829 -55164 -18317 344105 -110043 -234748 -176708 15359 389815 104300
18131 -22340 -155535 192305 -118769 -40588 139644 -59702 85782 85291 200556 -56816 -13340
18119 227774 -139502 68351 -291093 -352889 -150985 -58476 27946 -95961 -334260 -205297
18109 -205297 -126647 116741 -26521 -204102 -49079 -205085 -202314 6238 -120612 280689 183533
18098 183533 -216688 -235853 10840 -185772 69752 140483 34060 89940 401332 81351 143479
18087 143479 -124594 159586 65671 96848 -22177 -23997 -256789 33494 -68867 133605 -1388
18075 -5547 -224266 -44145 6004 154723 7031 -204476 -89205 -177529 -174501 -43640 -219456 -17950
18062 136772 -90621 229348 109892 -127010 205934 -181768 199673 9724 -52719 429218
18051 257376 -87778 20802 -29425 184558 78289 145346 61952 -218378 105340 -89073 48253
18039 -105388 -42436 -33312 72092 -59917 389929 -102866 -105043 47936 196783 20144 -37915
18027 195244 -33416 251456 76752 -228469 -381596 -41506 -242540 121576 240768 141949
18017 141949 -44208 55774 125076 -186319 262748 40503 100771 11814 -7293 68896 -36762
18005 -269973 -175225 235735 -113493 -229262 169847 -102498 -166504 -268394 -267060 -189925
17995 -189925 -105730 24209 -243931 -264894 245170 -56719 291787 191221 -162987 -157957 78566
17983 -20799 -13140 253631 142655 -32949 -267270 106477 303409 -197454 -163816 -235472 150362
17971 159298 214097 239079 234936 15423 -233124 51112 -414813 -104060 -199157 -121311 47871
17959 -49847 142259 -134941 -172623 141533 -174794 -95107 -79534 -136627 -128057 -239862 -118907
17947 105665 142943 -185644 -16615 -175717 -211351 116907 -60041 -56362 307439 -73751 -115637
17936 -115637 -106635 -54691 -183457 -220231 -229900 215586 22345 -286 37395 -175440 52940 -152507
17923 132258 -302112 89582 154857 -48809 90556 -325579 -162621 -132766 -100585 191063 -67906
17911 -38611 76371 -125658 -75192 -249250 94301 179950 161295 176000 51990 -61389 -103213
17900 -103213 -49685 21568 -238023 26023 457239 59085 96074 -298571 341646 -104058
17889 -152178 -33435 -131178 -159896 -194192 29605 150027 115171 202389 252265 124923 -376474
17877 -80159 66164 48127 -233417 -275180 -221878 -247191 -99966 -10232 1161 95962 174963 -77299
17864 -78707 100437 -75684 98672 64322 236905 115041 208392 108159 57594 238274 150519
17853 150519 47999 293423 -125601 69828 -41345 -144723 -7499 -244815 -428410 160927
17842 256326 -39973 -109814 136810 -92852 -114487 114138 237735 -37862 14663 99529 27485
17830 -158314 246978 264938 -70830 -84666 -167660 -119560 -78689 -275926 800 86457 51934
17819 51934 30222 189765 231909 -130074 -39377 -37035 -86939 124044 -226061 63025 271050
17808 271050 -233467 82595 -9109 -215525 -8524 20970 -76182 -110091 75292 -184147 296954
17796 46674 -125799 -267291 133118 119141 -352233 86581 -150170 391019 -104733 -124349
17786 -124349 305101 -248366 84368 7429 -181811 -424463 63129 -7283 289879 109794 11398
17774 12881 -47285 -150530 -253380 -32104 195618 -217139 -55068 103160 -168231 35127
17763 -141870 474779 21164 107824 -260562 -123437 64227 149127 15679 69611 99098 80904
17752 80904 47618 -11133 22457 -89834 -226605 130930 92034 48953 -109874 -132431 -304931
17741 -304931 -8251 127526 -44583 -61303 -183721 -3177 157932 183099 -197988 -87170 274752
17729 -68970 36661 89868 2837 105158 -206322 -13809 68609 86716 -293570 59760 -20399
17717 238256 43058 -117739 -140269 270007 -307833 -60221 169172 160589 54065 134096 193488
17706 193488 -54889 251161 133051 -163511 -100664 3869 -67479 -185308 21969 -129104 -360695
17695 -360695 113792 263159 -91903 -205015 -210145 247800 -114423 172117 35408 109785
17685 109785 42032 -184581 -279976 95072 -124471 187928 90190 23176 -300201 29899 258843
17674 258843 -81773 -132934 -120716 12400 343430 -229427 -47431 55440 267893 101446 140213
17663 140213 -111936 359286 246110 -326315 149645 -31816 7698 239890 -214327 73110
17652 -315319 -13049 337232 364833 -71287 173104 141522 171785 93283 278476 -166860 -52718
17640 -296069 175584 -207039 -226383 194661 -120411 119468 112531 99441 152680 4357 -68527
17628 96447 51105 -23878 -65281 460343 -383998 218928 302623 -204362 122459 -237160
17617 -136921 -34314 485711 -315305 96552 -153215 -164688 -15438 -40192 -188400 33784 -1505
17605 221575 144957 158688 18693 247086 -33704 208947 47618 -39460 317621 49040 45091
17594 45091 -50089 -20126 -170985 300152 169502 202887 2656 -304845 -260776 278175 354492
17583 354492 -270597 -79859 -8864 110973 265393 199837 -333703 -362568 10842 78351 -178739
17571 -108329 161006 122231 244681 10489 158670 164943 29993 245834 107885 32802 -63914
17559 69113 39694 -204150 73431 114771 117204 -30351 235457 -68121 -308144 -25303 123858
17547 310467 275903 283017 38992 148621 -20343 -107842 222838 -27516 -38757 108122 17906
17535 -71998 252002 -120475 -89584 -132011 -54467 648448 -40355 63063 91940 223329 194040
17524 194040 199086 17126 -65281 158516 -174375 180511 336044 263625 80312 136357 56593
17512 98616 -206425 221171 -7781 5770 -171832 81266 170596 -162819 -53573 458815 206649
17500 -12518 158167 109773 -345183 29139 32662 312882 64682 24078 3563 198351 -335169
17488 -21579 91522 90253 34984 -222106 195593 393709 -114653 389142 58558 22137 455368
17477 455368 195225 159476 220154 192396 19424 -158563 420842 -92946 -93299 272303 -4804
17465 -111652 81535 10988 -395944 87283 -129140 209732 129998 71967 164703 112265 -206644
17453 308128 151149 252720 22615 138207 -75528 576205 542718 68213 702803 116643
17442 20194 199216 173572 257218 469552 365197 133859 426561 210352 303115 163056
17432 163056 204089 -291876 -69627 183316 392202 -327569 350322 409161 164211 485428
17422 485428 52753 -231020 295394 328503 376155 -181675 315557 512681 329639 94144
17411 55976 44852 376356 157504 216261 156292 50287 118650 78766 -243411 270083 -74578
17399 358738 -73829 -32476 157392 68479 -15084 -1080 308168 462895 436892 41631 -29317
17387 -117654 133674 340426 48705 -113245 150492 411731 -229345 112142 -70525 207479
17376 209912 155719 140312 392672 255907 414824 91412 510219 355343 248736 362515
17366 362515 -95522 20988 48108 266065 80877 77908 20878 -14868 143244 218561 185906
17355 185906 227673 332018 -14501 413147 6862 -83852 408797 264274 257847 -69624 -83064
17344 -83064 172939 280125 87445 396685 6905 -74343 185197 -90119 129473 202594 -102170
17332 -16160 269276 202642 57798 308713 -202283 133434 -4641 -195725 28416 342673 162842
17320 -167387 213039 425646 187244 220125 229392 -289848 60315 136115 393621 195130
17309 204010 -48124 378989 26396 166683 349320 -13548 236880 155822 182580 -163025
17298 119395 311290 272820 260990 243943 159762 93639 165302 -164910 168418 320497 -73959
17286 29869 51612 -47447 182801 335881 140835 378438 81580 55905 210327 25216 286283
17275 286283 -201911 441055 14892 110642 529710 426752 208261 105353 19815 330976
17265 330976 461983 114967 360436 374387 370635 360282 25822 40981 351893 -109661 310533
17253 32919 176451 280869 417597 495650 261699 512147 372628 51650 312572 147667
17242 91740 280908 240888 251247 235006 41424 5050 229042 218408 185651 145731 367611
17231 367611 168796 -21473 424002 431882 307101 136853 -172073 79271 304951 9947 -1356
17219 344565 348638 253246 -1301 12970 112624 -128391 421437 370607 163490 221353 154604
17208 154604 112872 281923 394018 -5706 -89120 505913 95923 -18203 69323 441767 376896
17197 376896 514823 313083 502308 324921 90035 162732 73739 140818 -140221 324545
17186 261080 332792 176643 143754 582381 512756 -27790 125485 163443 566384 231598
17175 352715 247904 109157 347627 170508 29872 283320 225565 596336 313798 159704
17165 159704 143487 372189 102497 147542 182044 335634 185240 34102 193464 173337
17155 173337 271630 74533 188905 391543 363241 398475 261669 416098 313149 428184
17145 428184 112010 246523 264579 318151 706783 181304 229671 515509 229166 41480
17134 231391 -64486 392929 152394 619226 332364 500893 432457 48855 161804 199767
17124 199767 413409 437482 260091 143628 201468 333510 102549 321317 182524 399376
17114 399376 101735 130738 594013 408410 312159 495701 268817 417792 405651 772401
17104 772401 517714 584424 518076 548120 402238 40947 -13180 298884 251761 628512 821089
17093 821089 471450 59888 388805 557085 188437 680501 532235 297733 590398 531864
17083 531864 420174 143446 459661 653850 500551 581250 282999 498172 444444 365489
17073 365489 372395 273477 449898 464233 232324 126540 778375 709848 239132 724349
17063 724349 633137 604992 486081 274121 303164 464397 698093 664575 67340 276867
17053 276867 587466 367899 254797 145222 487174 445500 204546 374199 594761 504004
17043 504004 473585 245585 612127 549753 373230 417459 738482 548628 771249 822463
17033 822463 494730 581826 805897 615050 842530 816105 480057 638097 481047 951685
17023 951685 353286 417006 839483 537139 677850 756745 544473 503266 720987 818370
17013 818370 844770 813753 472507 905524 657889 619725 905990 844892 696846 561843
17003 561843 642064 572942 1101326 608511 612814 881547 625388 557719 1033207 464193
16992 749946 994515 916130 726185 850730 729426 736003 830137 846204 929720 1039171 884036
16981 884036 779604 814902 864944 867288 876842 929966 885478 873555 966952 526891 1330245
16970 1330245 840153 853851 1102210 1237153 1157889 926372 730482 943884 1107684 1005396
16960 1005396 1113153 709782 1227383 771148 1138329 1263618 1313372 1304787 932860 1080696
16950 1080696 1171845 1235919 1011999 1137245 1043022 756034 1225528 985715 1034613 1094757
16940 1094757 1395939 1316654 1364007 1073813 1349626 1181568 1361397 1214417 1527383 1613306
16930 1613306 1236594 1633063 1609014 1153196 1277324 1477683 1523264 1715475 1586907 1493407
16920 1493407 1410236 1309610 1619493 1228458 1363964 1308166 1742359 1703162 1556167 1590370
16910 1590370 1575207 1226960 1521201 1579703 1655462 1477726 1596753 1700463 1786516 1589212
16900 1589212 1891452 1662380 2033341 1829060 2365248 1975548 1915489 1762099 1820193 1709550
16890 1709550 2121111 2374464 1900810 2079474 2445327 2088320 1959257 2279242 2127798
16881 2127798 1944900 2085221 2332400 2241404 2261321 2418758 2697235 2393996 2377586 2460878
16871 2460878 2349725 2389930 2571264 2533928 2494527 2705317 2646911 2589814 2797711 2822540
16861 2822540 2718510 3041950 2920316 2735443 2960882 2631492 3123470 3276205 2989224
16852 2989224 3129716 3298288 3259475 3239168 3644146 3334270 3531133 3593379 3475736 3451714
16842 3451714 3398414 3824425 3676845 4365347 3941225 4291769 3954762 4319017 4043795 4363482
16832 4363482 4363865 4688691 4407841 4643939 4566604 5115424 4858272 4724016 5009636 5170786
16822 5170786 5133523 5119224 5556300 5551711 5891122 5649258 5740470 5987091 6095250 6099785 6115569
16811 6115569 6464881 6606949 6704857 6860617 7149912 7468269 7157323 7743359 8000983 7851012
16801 7851012 7978936 8307089 8415573 8503346 8574842 9099429 9374243 9640906 9712266 9704660
16791 9704660 10297636 10647766 10620897 10840684 11165061 11671671 11577851 12027683 12507316 12983352
16781 12983352 12989467 13751941 14043627 14413305 14813783 15593939 16073497 16708929 17032686 17709488
16771 17709488 18038005 18925679 19336520 19999762 20963335 21395769 22195496 23141488 23731387
16762 23731387 25001924 25841357 26726840 27883830 29190649 30509746 31491838 32879234
16754 32879234 34465424 36197721 37652491 39708286 41182396 43475595 44901789 47493530
16746 47493530 49801407 52390552 55161515 58346974 61323269 64962967 68027786 72141422
16738 72141422 76474171 80561744 85282132 90607074 95522131 101474192 107482450 114141267
16730 114141267 120761413 127770343 135219285 142587876 150231729 157881757 165772027 172890433
16722 172890433 179693745 186272423 191717217 196508078 199655445 201729138 202599967 201864961
16714 201864961 199401082 196043115 191720126 185884443 178878339 171733406 164462417 156379459
16706 156379459 148198802 140445668 132243272 125007220 117535176 110352756 104340275 97848561
16698 97848561 91734632 86436419 80995314 76141895 71899120 67750212 64016908 60211154
16690 60211154 57063271 53989794 51169237 48440257 46129954 43714474 41452909 39568213
16682 39568213 37422719 35444295 34086538 32482539 31325813 29715892 28377949 26888412
16674 26888412 26182602 24748546 23968071 22920473 22040168 21366883 20488620 19587110 19119495
16665 19119495 18584224 17463241 17258686 16542588 15662169 15326944 14620411 14433266 13813731
16656 13813731 13495816 13087913 12645206 12309888 11751895 11735614 11221465 10818919 10168960
16647 10168960 10136886 9826812 9728118 9310625 9232421 8530885 8589936 8447981 8262494 8037960
16637 8037960 7492331 7648522 7556228 7301061 7007618 6897354 6650433 6457136 6568594 6517838
16627 6517838 6544553 6165343 5940525 5659480 5433292 5670417 5446160 5615587 5124043 4942590
16617 4942590 5242357 4864801 4560780 4536746 4864979 4673489 4354714 4208907 4335062 4169068
16607 4169068 4097306 3994177 3902334 3805744 3332782 3824446 3514911 3694386 3401819 3235546
16597 3235546 3444321 3218808 3248170 3392279 3082196 3103981 3250197 3054915 3057107 3018744
16587 3018744 2888049 2732321 2994508 2363619 2868768 2532996 2346147 2287809 2343144 2666626
16577 2666626 2377777 2595384 2399802 2443601 2102514 2060194 2321760 2352245 1947033 2285729
16567 2285729 2199597 2048277 2126154 2194177 1746735 1994043 2009550 1836285 2308698 1387508
16557 1387508 1667621 1689490 1948562 1976848 1612858 1567151 1477859 1522392 1588202 2087804
16547 2087804 1505769 1371938 1475072 1427264 1394937 1658865 1631569 1403465 1534454 1509879
16537 1509879 1192103 1448114 1271853 1300516 1114793 1176263 1179896 1134129 1197485 1364218
16527 1364218 1365887 1224623 1250918 1509828 887391 1307024 1095369 959598 1060157 1028076
16517 1028076 1304846 1070902 1106555 908872 1185916 1046156 1115953 1124629 1111069 1028374
16507 1028374 1133158 909031 997169 840367 800695 1021287 913772 1246671 857716 814503
16497 814503 1361101 856889 882134 362492 870201 947899 855869 747804 719304 730503
16487 730503 513207 898847 632331 737920 703215 761918 638412 896043 471543 1046213
16477 1046213 630263 750478 760828 610463 537764 736513 652173 549944 756965 593271
16467 593271 965027 563311 599223 508238 349314 514277 631229 500748 661318 793800
16457 793800 536076 668387 682519 759770 519430 774644 468050 268258 641011 304763
16446 656151 444194 715568 740410 285921 363260 540173 294723 502327 450158 356577
16436 356577 582089 361494 517972 277768 728533 344416 358877 556091 506773 544020
16426 544020 460392 331206 573269 413926 286490 351966 519734 386177 350514 566969
16416 566969 392040 339967 218521 715053 332693 212606 593288 432911 324982 316407
16406 316407 374206 433738 404301 232667 242054 571419 455027 436015 467243 516057 465999
16395 465999 230785 571967 466951 222505 378326 246621 148568 570389 165868 495259
16385 495259 81086 320843 306745 81318 490618 579606 -55801 178860 363191 54623 405078
16374 405078 85462 -213054 106339 345010 -286838 185894 529787 187400 242782 374982
16364 374982 294794 483507 279609 -155257 374468 274276 374192 500218 375071 346152
16354 346152 44021 118187 503462 423214 346887 -69936 -89792 198430 73363 164679 416547
16343 416547 19526 105156 105971 385838 253025 319058 232027 351949 393305 339780 -84645
16331 173222 209634 156870 263347 47050 83211 5005 372935 251564 258008 88862 202421
16320 202421 240569 520935 154269 -115860 193489 224543 209026 70034 681936 223833
16309 258530 372668 183951 63333 365714 426886 317200 117988 271081 -47571 81980
16298 287226 262445 191683 220274 212711 205389 132468 126818 342274 158116 92827 -465608
16286 109535 315475 212013 338668 138279 15511 291480 -152163 336136 203625 544984
16276 544984 -133010 -99447 509264 155841 262538 69896 86685 134974 260033 299606
16266 299606 47692 -51558 166643 489701 158471 -10776 149197 -77630 430375 262738
16256 262738 100027 303379 -193259 242892 -74453 -98240 -69705 -58828 72027 12175 163558
16245 163558 127617 354490 -61763 9778 24679 151789 76703 62348 105848 291498 187780
16234 187780 -48262 -4235 65422 28051 377365 187537 -18884 200934 63813 97566 9844
16222 214478 496182 4497 -59687 250858 129214 129850 199990 -83453 213034 262846 -53718
16210 76245 -163684 -8944 -57506 70728 409915 81521 41440 -29813 -84326 274419 -136726
16198 128476 136413 107850 92998 -102748 65129 149844 18738 -39984 -17754 -103507 191737
16186 -8590 204831 84057 198703 -195129 -180962 346779 34409 247095 -280635 57682 -37790
16174 174083 -116830 175662 90264 -39862 -284381 81584 -26683 300049 343294 469969
16164 469969 -34047 -153007 -183080 2192 73007 -132764 211347 -402205 182650 178217 -372570
16152 174268 11665 9599 322884 103323 -137259 246004 -293552 -391616 193861 267726
16142 267726 -206914 -230369 2397 -204861 191951 159237 256220 -194433 169525 44713 108863
16131 108863 453093 168198 -35003 25302 419365 306370 72102 110953 90528 15576 -103589
16119 83298 -109849 7666 -101975 -152018 -59319 35169 140953 30456 -145630 125771 -75310
16107 -172289 105528 -335356 -257996 491636 30371 -120330 -72610 210512 244881 166068
16097 166068 -5420 -122226 258764 -82077 -56916 -141914 -294075 35249 876 174854 39494
16085 -7935 -262273 186640 -212131 175726 -209253 182100 -147166 -91744 -281106 -48084
16074 -133697 86506 -101033 -244922 286082 -242805 -385050 83256 -186214 -242172 74949
16063 20031 -207964 -268828 270818 -33958 -174616 -275119 120937 125999 -178205 40757 -151255
16051 175061 93639 237836 -99503 -11932 -101923 23701 -233229 155768 -285581 265533
16040 -274432 95125 1225 -125251 -114074 79527 334338 -245941 52926 -260123 99616 -145636
16028 -460255 192181 132982 -174241 448843 -407767 -145967 -43605 -80460 -65108 -140055
16018 -140055 -31773 -163398 -51880 8937 92204 -403011 -363917 -312257 -365168 267287 142380
16007 142380 78582 55708 33240 -149423 -110113 -37600 389243 -160941 54893 -27601 -9195
15995 -249095 -24867 161763 158224 -96780 -261503 282443 -103799 37421 152500 207678 -57633
15983 228918 276784 467076 192856 186524 57884 -1958 95572 57140 -257372 -260481 188708
15971 -11634 126749 -50606 37116 -40941 258495 -4304 -143367 108289 78119 314246 -100974
15959 244053 28853 302461 -39049 -61017 49137 -263606 -76582 150602 -59673 -11996 260620
15947 -183136 -149733 85991 -71315 -320476 1292 -256112 -17634 -108004 -97576 -100554 -287882
15936 -287882 -337951 -135827 -43684 -352693 173164 -142850 131158 50702 -160189 175554
15925 42196 53023 56996 -271303 46175 -63068 -153811 15194 209405 -17215 238267 2308
15913 -4323 -205213 34044 -89148 -206578 -49283 -21574 28104 188198 -225485 -219528 -238165
15902 -238165 16940 -124832 -158470 -17545 -297961 -162368 269645 -139640 -41442 -220127
15892 -220127 -31629 -21575 -200538 -72716 376489 -69125 -254077 -53049 15357 151160 217758
15881 217758 59592 -28865 -88303 -379838 -20487 -52568 -57006 -315153 -432908 18860 147370
15870 147370 -153528 -223800 -199519 -165247 -261865 82697 231190 198665 -11583 -73172 -62643
15859 -62643 -6182 207872 -244216 39117 -296320 -114561 175621 72971 5485 -102251 134362
15847 -224722 27672 -25666 69076 166575 26511 -242409 -84721 -384935 211516 -119722 -94657
15836 -94657 57133 21470 -40244 -169761 -117512 -73697 158453 -72683 -204745 161265 -267507
15824 -304638 -173315 -33787 106494 -101659 -66081 -82252 -43878 117084 -8768 -260880 -31887
15812 25591 -420537 -107402 -180561 47855 -73793 -31194 -291900 -255473 -81307 -101433 -204
15800 -93770 -64407 -106597 -137657 187960 75837 90068 -258524 -16640 -182260 -259609 -61380
15788 75774 -69755 -66884 146894 38925 434745 -148060 -285729 39304 102662 34476 -311909
15776 77758 -214342 -278820 -39037 464999 -381153 -103042 -3193 48674 -162020 162300 -64607
15764 -196558 106125 337076 -213097 245229 91145 -93484 66727 -106602 288727 -68639
15753 -84929 158773 337909 -31556 -72668 -233739 -34962 -118493 -31101 158282 29270 -66489
15741 -7751 -187003 145263 -281755 -1331 45696 156712 114131 77521 -199378 12352 -426578
15729 1614 192940 65913 -218720 4206 148119 -263588 -30139 -205327 -115662 -179979 117358
15717 -219948 -63798 142541 -443 -265484 -59238 126429 -196308 -210516 50955 -216205 6783
15705 39302 -44776 87112 11942 -260217 -217494 165933 307686 -270767 -77590 -54874 -16760
15693 -357604 179229 53585 399515 -1961 -104163 101188 49628 -113240 205755 234197
15683 234197 192389 186459 2393 53269 -164924 -171126 116969 -29200 57315 333083 284479
15672 284479 70707 -9962 139551 360681 23326 184569 -95030 -9177 -34780 131509 56803
15660 258884 19524 111203 13783 198185 -321016 -80641 -318502 249409 141972 241311
15650 241311 -101839 -4952 -119965 280066 101685 -55120 146172 -47497 -458068 -170860
15639 -149834 -48437 -273252 -98206 196453 -77321 -127338 -67526 -339065 181880 -58895 -123886
15628 -123886 -317769 -82295 -363694 91460 16580 -119699 -112284 239266 -19414 -173069 -93005
15617 -93005 76044 -18427 -387165 -82200 -3736 508052 -60507 -35472 -116074 -59021 -179029
15606 -179029 -298442 32663 -127075 238568 -176867 -225140 -1479 -72496 -118695 -157517 -136367
15595 -136367 -189444 126947 -36083 -226507 -40956 -3350 22014 112914 135265 75159 -81106
15583 -294169 -115676 -48150 -64290 179371 -123573 123356 111064 -42663 31115 -141466
15572 -154222 -117205 -84673 131017 227324 221147 30960 -2596 44437 292656 -116304 144608
15560 173614 316114 -292810 -196692 -188374 -180458 -73915 -144988 85839 122340 -149876 40014
15548 341682 29688 541133 -82911 -168218 -211086 -61156 293699 -210552 -227759 -107711 112245
15536 224574 26683 428349 -99509 -60244 322578 -82765 262356 -99472 -444251 -102461
15525 -128130 -299644 55563 -361361 118710 -168757 239310 -83308 -171665 126236 52192
15514 307233 224057 161633 -42739 166362 -36155 195193 366900 -95687 159876 -477002
15503 -175132 -98036 -243312 146567 -136696 127672 -163447 -362248 363691 58095 -38808
15492 -89058 199732 208295 -112087 -141146 -83165 -128938 111064 -262783 -105897 135615 313154
15481 313154 220439 74577 -80508 -120916 -67647 22312 -38639 343889 29853 16631 190600
15470 190600 51111 22042 84879 -158809 -122498 -40972 -43683 185752 128528 -260029 88758
15458 53596 263315 102373 -91442 -228856 264495 -29757 -46031 -169848 -85998 -49703 6337
15446 -152682 -173027 -257215 -68859 88059 278786 -241143 11138 -31693 -1731 54042 -13063
15434 154333 -2874 -76560 -125110 304434 -52277 84232 463865 95838 17207 -21569 -64808
15423 -64808 -184911 -39052 -175978 -6309 -201596 -152121 -155462 400807 -449947 116453 -225610
15411 259851 287726 140700 -481899 -182596 237488 -467185 -91293 480001 -93179 95544
15400 -343373 121156 210973 174065 70944 -42933 14884 -5278 332072 111284 258960 17232
15388 -310127 -29422 -126348 20645 -142797 160674 -70814 -110454 -108778 344877 89881 31188
15376 -32589 -122309 130500 361064 -37256 -81666 337653 -298892 -69243 263444 -340535
15365 -49398 169034 -32926 13613 67910 -351917 182919 71209 -347209 109328 -376521
15354 137055 -14963 242699 -117254 -380214 180095 -232404 108790 82152 -55907 58628
15343 371836 94184 -188411 -27649 150789 461563 152188 -78025 101243 -23314 -161717
15333 -161717 106066 169334 167495 193892 -281296 -97405 -336769 190781 -205200 -69410 7448
15321 143431 197531 -11026 39232 -188678 -62996 -125419 -94548 138686 105293 -135064 176123
15309 6005 305843 -36346 23515 25950 23964 -108107 58036 77470 83955 54875 -112121 5282
15296 53585 297935 84972 -38088 100001 -2043 224739 -290871 485865 450912 -24275 -62340
15285 -62340 216772 48948 -3891 265243 -47732 -346711 -39351 -285803 303171 -192565 -38936
15273 8938 -176614 -193233 259102 110514 -129839 -209887 326787 -203720 -115673 99091 145043
15262 145043 -120841 62337 -287081 166531 8600 -74481 109753 -125136 -142350 300229
15251 -8676 -72887 301363 1046332 1585787 1301073 1516643 838063 237006 -150946 224339
15240 -265378 -58018 90062 17589 78589 204105 8675 196932 207379 113149 -11740 -76958
15229 -76958 153624 86050 -193730 305077 -64078 132685 72892 -92911 276427 71592 -65253
15217 -18984 155501 49347 301165 35877 -402518 164546 -69693 200712 214914 93256 216603
15206 216603 -66833 -22862 -75935 375295 68796 92998 -104480 100240 -79149 382911 127732
15194 -89827 82825 114137 -8169 -197142 334790 280203 197588 -78962 97385 42412 -224340
15182 313661 107449 153780 -323812 210966 203877 142384 125949 -75341 -82630 -59436 119280
15170 30863 347111 -246079 -91220 151680 -336343 181467 90730 365992 -183352 -137847
15160 -137847 101776 187184 84943 330146 96327 -152839 33392 260530 -267623 56234
15149 158089 149880 113351 -14416 112907 310240 134409 46638 103736 129801 458190 348005
15138 348005 16025 138744 6581 -48021 75535 137416 174305 486 43783 380693 327890 218665
15126 218665 151572 -214477 -14772 315340 -39374 148220 -251194 -175099 341011 7059 541689
15115 541689 257852 255920 103653 282366 -11394 369691 198780 180618 117004 -25224 116617
15103 80385 348310 239754 -57727 139595 322730 86884 141590 -85904 71023 562547 -23408
15091 56822 -150025 223120 125188 -81733 269032 89159 237247 37679 118146 -184650 126199
15079 25131 369228 133634 16152 326763 -90140 356394 -251252 -232050 25615 259238
15069 259238 254230 188782 89034 21268 384687 170715 204546 106778 207632 -86607 -186539
15058 -186539 345976 53813 208549 217828 374608 178005 249257 -160998 514315 137758
15047 215281 460348 -36707 222788 200837 272412 286973 262861 215101 -58750 144108 197293
15036 197293 357816 262818 180526 5906 282819 54603 164323 15772 201661 254503 -25811
15024 -255241 276502 452943 152814 96577 205342 146295 380671 183744 -265758 200047
15013 31525 516143 371078 545505 353581 457015 168233 79198 119196 279341 318214
15003 318214 1971 -89155 383345 58205 136000 -85558 -8306 593160 73110 27783 454070
14992 454070 -60083 101786 223918 -81651 100212 438396 40667 195732 398259 563528
14982 563528 383718 3638 -104964 401815 507307 234582 278809 184909 146101 116247 154898
14971 154898 249189 -19164 164346 335982 224929 445871 311643 409387 417696 -169847
14960 368519 152523 264988 284720 503825 -108660 656334 597532 238188 333429 371501
14950 371501 651657 218864 83184 273796 151064 372686 124633 417202 466525 7864
14939 407194 -77394 293895 110022 649588 263493 593574 144721 414895 122533 492864
14929 492864 272783 744817 277389 190208 105499 286671 365056 105536 237072 240436
14919 240436 233774 -113830 287683 382667 186154 244566 268278 302256 75989 488848 576396
14908 576396 544489 714408 70409 282415 114044 53131 538650 -58438 510951 435240
14898 435240 470525 -29332 412818 101329 534176 201593 461373 650127 486296 556367
14888 556367 426011 220233 250440 416714 319451 174761 299599 398853 402973 594170
14878 594170 186737 512467 481047 100422 -37308 418676 598585 631740 211787 326075
14868 326075 349961 312643 468885 685026 786895 315399 718592 434900 561192 243709
14857 540049 292897 512465 458121 624873 336274 313640 674602 395918 293041 543830
14847 543830 135711 610174 624989 188654 499102 430669 646460 250861 370099 518974
14837 518974 324190 600019 808739 480425 501262 396346 277972 547367 670264 247080
14826 399372 462684 431337 387938 582266 532252 195795 309010 24686 520188 327785
14816 327785 512319 501624 322004 448304 389403 494305 597375 565148 548756 672393
14806 672393 652685 648202 555056 415373 789544 513985 716889 428210 70626 738315
14796 738315 406469 357710 684051 478893 764387 543419 637309 780190 615164 447831
14786 447831 440259 578752 783258 902628 495955 614318 518941 471254 645269 596122
14776 596122 415116 513147 676796 528738 562076 922566 621854 492931 520459 622608
14766 622608 808001 478249 763917 831390 358680 569824 603913 524518 525105 840755 807013
14755 807013 605258 650785 527572 650784 609159 682152 371759 602308 943020 527943
14745 527943 818073 439009 663957 677880 561046 859276 736971 512321 452340 589906
14735 589906 698074 898036 848672 682014 627285 702432 743733 1054173 1017203 1133149
14725 1133149 780805 777576 875331 783576 872705 933583 601837 842597 863879 753399 1049162
14714 1049162 761855 1130800 1029615 792436 1011744 908718 1008502 713672 1027475 944345
14704 944345 1457261 548269 687583 942318 1098087 1002747 666574 998704 927417 867053
14694 867053 1020755 726223 755819 924521 1294697 656674 1089432 508514 929081 1077429
14684 1077429 1007282 750276 692522 1065310 944141 1055194 902552 789043 1501547 1204248
14674 1204248 1136490 967080 959097 1179705 1354974 1406066 1155436 936050 1193252 1169720
14664 1169720 1223526 1066719 983949 1115908 810846 1383917 857857 971704 1387690 928608
14654 928608 834955 1431224 1166246 1211018 1262662 1399745 1356601 896622 1018718 1525057
14644 1525057 1164873 1369645 1303487 1054310 1385846 939341 1500617 1501300 1304785 1306868
14634 1306868 1123479 1723427 1054289 1267423 1576115 1358283 1558964 1622419 1366514 1771604
14624 1771604 1577331 1574194 1434558 1171448 1290145 1399571 1424895 1771949 1609169 1069064
14614 1069064 1722649 1793805 1691126 1500738 1535761 1511625 1931947 1581683 1560710 1902823
14604 1902823 1619658 1655401 1456382 1834865 2105641 1872549 1630104 1750702 1664655 1725644
14594 1725644 1936183 1499397 1640171 1625468 1933989 1643322 1856536 1859253 1876091 1758862
14584 1758862 2016835 2141891 2278150 2104040 2129214 2078992 2373536 2189344 2324856 2514083
14574 2514083 2584942 2506852 2279574 2433326 2517259 2224403 2391780 2618019 2578827 2365802
14564 2365802 2831994 2819568 2675345 2868066 2972240 2951817 3312484 3384843 3452931 3869068
14554 3869068 3636662 3875950 4559336 5442760 6168669 7895846 11568659 20168343 43738823
14545 43738823 51044942 18926516 7677182 4210769 2769737 2370806 2128912 2123319 2244332
14536 2244332 2100754 2174760 2036337 2244893 2195761 2441070 2554258 2554532 2588733 2391140
14526 2391140 2583872 2463879 2515412 2610356 2456559 2518360 2519892 2560513 2665441 2688875 2764772
14515 2764772 2842266 3284087 2901474 2698649 3042983 2919604 2865480 3159538 2866240 3354422
14505 3354422 3228901 3102566 3220088 3424799 3070458 3291897 3360762 3256868 3511903 3682178
14495 3682178 3691023 3374824 3737712 3671338 3799592 4098908 3952964 3585740 3592275 3879855
14485 3879855 3988081 3795010 3634269 3677366 3980287 4570394 4065271 4186859 4116442 4107778
14475 4107778 4543301 4662401 4559429 4590110 4480746 4768433 4389091 4670310 4795561 4641500
14465 4641500 4990763 4956074 4765215 5116012 5037118 5343114 5169040 5430053 4997832 5554781
14455 5554781 5294464 5405980 5628741 5656989 5976508 6076229 5737214 6108351 5963666 6276264
14445 6276264 6301975 5855039 6275030 6024854 6167833 6409436 6309595 6573053 6931077 6953866
14435 6953866 6963880 6941432 7371680 6918199 7220673 7479317 7688038 7675005 7521474 7875590
14425 7875590 8083615 7946718 8076414 8148974 8452159 8463801 8638293 8734641 8771048 9097233
14415 9097233 9219484 9378667 9544943 9707481 9767383 10008073 10076904 9971875 10578377 10257252
14405 10257252 10888867 10740508 10999029 11327175 11214498 11300975 11414974 11594960 11981832
14396 11981832 12527632 12328637 12340964 12541290 12878968 13113941 13308277 13484436 13809567
14387 13809567 14061467 14255794 14272499 15083137 15071903 15423346 15728392 15804429 16205682 16320684
14377 16320684 16794159 17315629 17732568 17874705 18073751 18626021 18842402 19418758 19876329
14368 19876329 19894188 20348256 21210786 21363525 21576315 22257494 22448871 23361635 23570446
14359 23570446 24263513 24834133 25328368 25975738 26626868 27271838 27992188 28252852 29086495
14350 29086495 29781919 30676410 31281113 32042423 33057556 33987630 34662612 35758873 36717894
14341 36717894 37614620 38318763 39720146 40911975 42023531 42689826 44287683 46012397
14333 46012397 46973265 48340603 49933344 51659185 53123429 54578688 56068791 58407454
14325 58407454 60300495 62428948 64332582 66606589 69131064 71219568 74256565 76887528
14317 76887528 79504145 82245203 85402494 89035654 92525484 95876424 99805493 104239214
14309 104239214 108486383 112560844 117735905 122425658 127252048 133269469 139147512 145462152
14301 145462152 152019404 158955435 166236505 174194341 182001225 191054068 200186988 209759550
14293 209759550 220232634 230900687 242244258 254114766 266025774 279030298 292100189
14286 292100189 305741927 319828028 334226783 348952377 363551036 378631492 392723544
14279 392723544 407102438 420340120 433118573 444921780 455115839 463550515 469377803
14272 469377803 471990114 472518851 472026793 470635664 465033159 458945156 450514255 441045013
14264 441045013 429394696 416087499 401920594 387200920 371858954 356137507 340342998
14257 340342998 324691736 309111659 295473048 280856813 266889315 254174134 241471940
14250 241471940 229632433 218131372 207272974 197281346 187848995 179012673 170915904
14243 170915904 162434273 154840583 148029152 141223701 134678928 129426070 123696201 118456895
14235 118456895 113261301 108453154 104369226 99876193 97093372 92340214 88891566 85421312
14227 85421312 82160239 79418648 76058513 73559029 70718262 68453827 66018726 64221259
14219 64221259 62028368 59675352 57703089 55765287 54256739 52959556 51685529 49638625
14211 49638625 47880212 46598794 44983645 44321595 43696725 42148958 40717398 39610071
14203 39610071 38234931 36937698 36574135 36055322 34476899 33810669 32865854 31878498 31045112
14194 31045112 30608962 29981951 29033353 28624187 27914320 26758780 26553713 25216231 25021918
14185 25021918 24630682 24129837 23729761 23190917 22676264 22091914 21481338 21052612 20958628
14176 20958628 20418514 19879537 19431504 18987981 18607401 18743992 18009249 17749136 17136188
14167 17136188 17222406 16970715 16518466 16042173 15838113 15711510 15221292 14835991 14961573
14158 14961573 14283339 13836820 13923414 13475285 13737990 13405597 12947891 12869769 12406572 12327041
14148 12327041 12204131 12163452 11885827 11938195 11359189 11133493 11235340 10859116 10867613 10657029
14138 10657029 10557760 10564319 10387437 10430554 9993583 9768620 9936731 9211171 9083235 9154347
14128 9154347 9145226 9071187 9162591 8817331 9253660 8650517 8625954 8448644 8320215 7904725
14118 7904725 7875036 7540835 7873494 7714297 7450035 7271154 7537334 7110395 6955643 7032188
14108 7032188 6921050 6833179 7121093 6709096 6564780 6460669 6591995 6651296 6191877 6160855
14098 6160855 5867683 6103550 6114973 6152550 5600763 5931700 5885402 5930242 5709547 5691203
14088 5691203 5335030 5405302 5146689 5673556 5376073 5411628 5086689 4853089 5337962 5262629
14078 5262629 4875007 4806917 4893962 4572134 4694578 4951618 4932197 4280930 4654277 4498198
14068 4498198 4523782 4651134 4182689 4216435 4268146 4195412 4041507 4256917 4374647 4143751
14058 4143751 4292286 4266388 4249622 3894309 4089735 3985005 4022946 4051961 3515950 4048047
14048 4048047 3891424 3633473 3855573 3401495 3594483 3696746 3227493 3852250 3275971
14039 3275971 3613348 3477351 3313337 3469480 3132609 3343408 3175109 3176352 3343411 3044035
14029 3044035 2691439 3490986 2741621 3273847 2873902 3218427 3011967 2771760 2991829
14020 2991829 2538162 2788632 3104786 2771823 2981163 2474375 2938933 2582998 2865512
14011 2865512 2261594 2803392 2368101 2630767 2490601 2360173 2403753 2498404 2301130 2497835
14001 2497835 2331634 2497414 2163149 2391184 2213160 2002260 2365766 2239060 2403176
13992 2403176 2636741 2515254 2861064 3697979 6163805 12923364 34054073 52203628
13984 52203628 24370846 12367315 8058089 6211941 5148348 4045530 3835161 3485533
13976 3485533 3612885 3011227 2948432 2600664 2581858 2890579 2361609 2818812 2644734 2475461
13966 2475461 2253851 2349109 2224271 2285614 2050102 2482433 2196057 2428163 2365098 2598774
13956 2598774 2166913 2223826 1955969 2143262 2178555 1899798 2044940 2168851 1681222 1998902
13946 1998902 2043171 1941608 1669182 1910984 1898964 2097210 2129506 1811924 1931531 1877023
13936 1877023 1956647 2061335 1767940 1712213 1604139 1733937 1760102 1517896 1607030 1758535
13926 1758535 1793998 1635705 1629892 1597644 1632855 1642635 1813761 1638027 1883596 1830316 1603276
13915 1603276 1590072 1433841 1418421 1434642 1887999 1652942 1831444 1451090 1490677 1564072
13905 1564072 1279967 1587291 1182626 1484560 1430767 1510820 1418833 1058533 1441552 1480020
13895 1480020 1476922 1382927 1428005 1711132 1204743 1151466 1231847 1189254 1351274 1297513 1176577
13884 1176577 1137676 1284110 1134264 1151408 1296430 1272902 1048571 1187181 1176326 1196891
13874 1196891 1402094 1056583 1308269 1187896 1362490 1047364 1100197 1031670 1186369 1135531
13864 1135531 1077392 1160179 1151509 886490 1045699 1278628 1285621 1088084 701410 1334342
13854 1334342 1300711 1241421 754014 853643 1129472 778140 1216763 794261 1089863 1297341
13844 1297341 1152122 1039239 1132548 987101 724366 1026404 1156031 1061678 1283699 1211858
13834 1211858 928998 894271 899123 1042895 677882 494489 686382 1084955 619055 824751
13824 824751 960267 1123939 1142160 1015660 1051259 1210697 768625 912519 989059 825701
13814 825701 1276150 794998 782981 962043 883485 1007269 859795 926422 1005022 823493
13804 823493 908377 1138120 368237 1004977 1051562 709119 985785 1221481 486936 1059248
13794 1059248 812146 1000909 952641 669476 718061 1096486 735466 1082223 1089818 756505
13784 756505 949624 744298 667087 1107428 756130 1022901 879933 693046 833091 631602
13774 631602 974286 634388 812043 555165 1043102 783300 606722 673012 469793 923435
13764 923435 532316 524421 620411 742112 706028 636569 963520 725120 883635 712809
13754 712809 606118 730724 961052 267193 636399 604329 754611 981215 767144 729890
13744 729890 634085 402050 759532 581024 474774 672466 674322 642027 492774 320632
13734 320632 785472 634630 501273 699449 414599 639350 841899 527362 642154 856238
13724 856238 725169 752979 549131 390280 650860 588430 517479 842050 466172 549603
13714 549603 423813 555172 687475 483658 591896 307727 552678 571241 591876 755185
13704 755185 717815 774760 561565 594298 610102 330558 600020 528741 474572 754977 666598
13693 666598 759602 437197 212333 639475 944748 433705 672743 489654 547115 503850
13683 503850 609094 179080 434182 690877 385470 190111 566791 611080 575993 675637
13673 675637 628610 706711 276989 576668 414351 183618 334183 1089026 355437 671099
13663 671099 452711 266268 599738 621582 433515 611209 386177 431670 203598 404966
13653 404966 406853 901298 257993 623244 315074 724333 666898 321744 291741 613822
13643 613822 558614 417300 271035 326148 517482 372891 245950 527274 234329 459608
13633 459608 222348 208365 574435 450506 559528 339352 333907 346394 550021 490339
13623 490339 591853 378044 395221 411917 369270 412304 605330 511816 226166 110041
13612 800632 679005 515737 415420 680487 681638 768035 368961 707018 333165 398071
13602 398071 596209 273358 361151 260832 404239 408532 188861 540788 494254 318597
13592 318597 390023 511180 -15634 127556 446121 427424 572961 600383 326859 76301
13581 169878 409027 286648 53843 417240 594486 316201 218049 390650 652285 109780
13570 67617 307676 291104 -15214 299252 111398 312508 219190 422937 314495 95955
13559 536849 451306 434422 270350 459024 388577 319574 163484 476465 566250 -6285 509761
13547 575276 566091 98339 445287 672549 511669 68602 615617 787873 -52832 432304
13536 -87680 390099 93201 566236 153222 314936 -44183 379953 45824 71520 -103225
13525 233161 359335 499401 372966 13824 404096 268144 545526 186248 544222 183829
13514 318939 -50672 245152 491377 213768 371498 391834 406215 245391 -9119 276889
13503 344438 437460 219598 359552 85402 277154 393308 375320 204262 144175 -17146
13492 178991 149604 252869 295785 254081 400938 641262 301778 -137474 259211 317434
13482 317434 523472 277878 187589 21240 285402 234581 -47385 335444 293124 393937
13472 393937 148295 -21368 451355 416547 -126099 472278 500762 319010 181960 123830
13462 123830 271047 73507 72843 11015 267656 302185 32967 73914 -175004 -132202 299234
13450 123061 318484 208627 181673 316661 220505 135826 40580 566850 323772 211652
13440 211652 186110 430467 97948 74981 66877 375689 3697 313327 155261 210069 417129
13429 417129 240785 467562 -14599 94089 96704 65926 123333 50387 432321 -281352 153818
13417 152527 442302 226012 266228 117454 47414 236502 176730 270907 182524 166391 240636
13406 240636 186669 162006 272417 96306 45060 255864 280046 367079 166830 94277 353594
13395 353594 464118 150857 -12113 120159 -47330 273740 46221 -143758 203020 86346
13384 437044 297440 248822 56395 437616 161326 558141 431598 189629 299197 257748
13374 257748 506480 128427 237707 351880 255924 437585 -11527 6671 457639 296603
13364 296603 192949 30265 2940 169988 37913 259871 399418 237285 195217 131386 180068
13353 180068 496594 36063 42907 283010 413614 360250 141859 12960 430943 391203 434735
13342 434735 290600 421879 303932 599887 391099 150494 240914 -117138 150580 164525
13332 164525 83127 344256 -292526 119464 133166 -9353 463771 259756 281562 51022 22445
13320 372987 8275 274614 204082 213525 463349 413538 218174 384835 457731 201940 360306
13309 360306 -119346 411704 437517 257007 159031 281683 11023 -14162 205415 269707
13299 269707 170893 36710 45704 545892 -124230 48378 67052 133287 137420 277198 12235
13287 326471 688415 219445 114853 394416 347076 126011 39520 206782 272353 433418
13277 433418 37727 281050 209602 146343 -61064 138550 229901 287342 -87603 -69288 23506
13265 230320 49067 245991 271768 -35431 100969 11201 328691 238407 183641 202568 303531
13254 303531 146668 -51068 59020 54757 -146012 -12708 64581 50661 364892 161270 17381
13242 131419 111189 -27251 400606 75995 289276 55652 29786 -110775 1059 -41592 4470
13230 -209972 453361 225538 320045 35800 57429 -121275 338982 72964 -135543 211838
13219 143054 458063 -56661 422329 -96914 372125 346079 373824 -110717 67154 220355
13209 220355 120359 89142 411595 222470 21792 -5587 380877 90238 127290 189831 -165046
13197 152874 135361 -10253 27886 129542 37733 398598 -116626 -56439 136561 -102595
13186 16616 34596 346432 203757 151926 -12545 76490 50728 14435 -383641 107437 1859
13174 161701 340535 296714 231765 244437 -268903 203725 -4366 82182 246116 23005 -52260
13162 7365 29230 159483 -142518 -46500 -10946 -36030 -122189 -115783 121956 134127 -143266
13150 -43939 -35581 -180743 -148117 427330 191759 6470 103631 -336232 -50752 153386 16931
13138 310984 249345 -109755 208223 -113712 144275 411609 281451 189000 76217 -143051
13127 314939 259695 170817 172297 -150268 286305 312691 210293 258152 62882 336093 70594
13115 -226933 365959 -150043 46509 126080 394372 130223 -8282 -89923 -152713 186925 229704
13104 229704 246200 -360644 23740 201601 132738 -242132 -181540 114992 28550 36325 401503
13093 401503 191617 -304285 342745 172603 -214861 -39744 4581 25832 255949 -753 186101
13081 -128629 -131441 -62091 112875 125087 19473 -62128 142847 95923 165933 154779 178276
13070 178276 450545 -239228 348253 128810 327938 -155757 116897 150266 3274 -194102
13059 381830 60219 277629 362965 480459 94604 -457570 295401 42543 19171 225323
13049 225323 252593 -25618 103288 303772 31046 201165 -355130 80768 89522 92436 205274
13038 205274 56705 228986 288726 126176 42357 116205 59133 154982 -55395 -12721 116611
13026 -253981 99629 221213 313585 -67192 186015 -95420 207011 -29916 300119 6765 -166770
13014 72853 -206502 260768 358190 39462 174134 -116981 -114419 66615 184000 156089 228907
13003 228907 124095 -55244 130571 -11277 160743 282193 -156123 294479 115694 238602
12993 238602 58047 118228 162286 -55743 201984 181682 42452 -84264 -405772 221726 -17460
12981 255885 115218 8659 -119357 -82969 -95973 144059 373068 81431 396270 -203638
12970 153445 58980 56431 144261 -124840 283952 189549 6617 -38385 126639 60762 114600
12959 114600 170658 57208 147844 189274 114198 43367 209071 159422 -43373 27741 203815
12948 203815 58518 314401 -139513 99476 18076 370706 130162 -75318 62 13430 146352
12937 146352 143229 -24367 119987 318633 74577 270680 -5305 202347 176205 -12171 -142767
12926 -142767 332169 469654 224620 46070 212262 356002 -233555 -5116 296526 258530
12916 258530 19044 -19166 83578 213485 25034 -308440 -148424 363605 85642 -188571
12905 -66229 157893 206447 -86740 -115870 -79451 76910 -316996 151390 100002 -35641 93577
12893 -135927 -343833 379654 -324069 -144201 260391 -34998 73917 281924 80590 -68965
12882 -22293 50610 121067 -89680 103304 42200 113985 -182254 303767 182109 385647 -174709
12870 9874 207117 -33879 170346 43392 88926 -112801 16321 139698 -79581 190309 245651
12859 245651 -286943 -217844 39166 412238 15814 -270438 -138891 -265802 73460 63096
12849 63096 -151668 264633 205483 158287 -73110 -334109 61684 155544 -109832 -66939 21929
12837 -161675 -36678 -72473 -237202 176850 -60578 71371 33580 -180544 291131 -90355 42916
12825 157426 245775 101234 210861 76816 303384 359151 124698 329268 179428 82425
12814 41597 -111410 -7862 110929 -85005 103169 -154222 -256487 -73012 -15536 32627 9156
12802 89135 -255437 -8746 -165538 150182 203675 -363063 94384 -56617 63736 -7830 -20572
12791 -20572 419130 18672 15636 250206 -82213 -9730 -116416 48423 -254529 366063 296296
12780 296296 38273 272513 176329 -106893 248574 27687 194520 -104632 -313547 267348
12769 70437 131867 138841 198019 -312486 -179154 483430 -320192 -93491 -102025 -145374 239855
12757 293621 48026 -22714 -229687 203249 -229138 -175787 149705 -197491 139926 51966
12746 181275 -278127 129439 -332420 89466 223002 -51449 154331 189344 124267 74564
12736 74564 19423 391224 -51838 290261 261072 -9918 -96654 172033 -36020 -54211 187526
12724 121443 -123612 150150 134704 -125840 -53404 -240818 258991 -128581 3925 21146
12714 21146 195368 -181497 -176079 106557 -14215 185819 -39792 349767 -82126 56522 14872
12702 251191 380295 291593 476980 199638 280969 -127386 41823 124596 121461 70068 -63876
12690 151447 -154943 250646 116573 295213 92365 -51786 114261 -39291 369915 205428
12680 205428 421163 20943 49001 -18998 57339 223431 -219676 120073 248412 81818
12669 56291 -267711 161476 31218 64716 144474 303012 -114914 22832 15579 134933 300905
12658 300905 -189922 212831 382977 -1934 151486 108732 70623 287624 295596 294605 -72272
12646 177354 313468 265674 269095 21197 -14070 72664 -92550 -43596 403103 -73148 -155069
12635 -155069 182533 65972 -37806 181006 332618 328348 352134 65226 466629 396069 134845
12623 -17134 271632 207494 190813 57931 13621 255399 137433 28427 117400 -508 76008
12611 141878 -99529 208369 236596 23128 -105635 -88982 387787 75128 85998 -152802 -75169
12599 474468 -23785 62145 84667 283884 48832 263642 -839 -134049 -158090 145133 260880
12588 260880 62659 16681 34641 199761 210274 146397 388370 293719 399928 3607 -114549
12576 20277 -217447 -99235 -19356 -219669 -74915 -176720 -243016 179852 -95139 182207 78365
12564 261466 26285 105083 55203 304922 103684 -65760 -110885 8694 -190105 -240311 -71109
12552 189534 190148 467846 113933 100619 -92705 -218146 82825 -241254 61336 -363488 111220
12540 64492 71102 -101714 -191185 20675 -305556 -98874 194191 -287951 328735 -77939 -275936
12529 -275936 175220 -296345 -17675 201955 -165113 -367699 -184514 44111 87643 114103
12519 114103 -206505 266177 -214516 -206076 -423644 400426 155522 -165466 -58290 170098
12508 -243255 188113 -54990 115561 -72854 -101861 91674 -191427 -239712 -12025 -336373 -5208
12496 517574 247720 135018 128628 -451351 -361354 106017 1796 40250 -89018 131626 134457
12485 134457 419 -16253 90649 -208563 77821 -114417 -26299 -83186 -66372 53575 216329
12474 216329 85201 -258157 -118110 -279755 185268 158614 165369 916 -173221 -134178 59482
12462 -153527 -75198 71625 128226 211576 -194352 52867 -93213 -623 23180 -123203 203770
12450 -29255 143046 144468 -195081 62690 115869 50520 274444 38456 -77217 -167512 -80313
12438 -39481 -149609 17664 -313080 184910 124992 136156 -90248 -70175 -19124 -61803 71351
12426 -159105 50031 47709 31780 243602 115849 36883 65043 -127851 90961 -350570 6280
12414 -189254 435712 267204 60878 273381 99651 -169456 215964 -224753 319196 182399
12404 182399 81686 57856 57733 15833 402741 -26112 246227 177942 -220783 -7839 63405
12392 -211798 99488 -249785 330603 12363 526647 -54376 -275898 123799 220264 -51657
12381 -188816 -137033 -9886 243756 -58123 -32403 -187799 -219807 -194579 263064 36191 133288
12370 133288 92720 -216235 -133117 -239849 254008 16377 528617 111039 -201720 -21016
12359 30172 -73259 123903 151834 125842 -202462 -344500 361193 -95223 20036 -69121 53049
12347 -90208 86945 19033 77193 166782 198882 -216365 -222079 -112538 -4879 -287178 3510 -6688
12334 416068 -134297 200113 35817 95618 -140076 112998 241749 -267168 -38816 44763
12323 -83965 302951 -170385 -104373 455627 -73916 59054 242031 40177 -357276 65850 107688
12312 107688 153929 92733 274041 335225 164303 31643 103544 314676 -79720 16409 43575
12301 43575 5598 37711 343156 -78771 52307 218919 -186052 267132 -156696 -41207 -171984
12290 -171984 -241546 249654 77318 125181 155149 -342752 152144 109535 -64486 63307 -129673
12278 -119445 44425 -184152 -80402 93359 103035 -130410 238506 214529 407099 120343 -611
12266 216338 343670 326884 -147366 188885 407272 56021 110204 -35032 -92890 27331 87347
12255 87347 28463 81408 81435 82906 -257021 -283033 265161 407337 221881 31594 485203
12244 485203 162644 245404 126837 -162415 105812 239815 -214308 192806 205471 488433
12234 488433 61779 489255 224668 63155 167575 -83633 275871 50116 345390 -35175
12223 -124740 407625 64171 174683 254199 -30216 94037 345805 113368 -6349 152241 137788
12212 137788 269620 201667 213202 66270 286139 262136 264755 275922 364517 -73713 -321001
12201 -321001 368030 287853 271390 295893 210613 -67381 242228 282537 -44588 144385 160806
12190 160806 256798 259010 -59005 2327 -51152 -110617 206392 497075 -117898 240352 353734
12179 353734 164361 -11663 79992 151634 -23788 -105234 -25956 -93949 -196178 -160757 151490
12167 366181 289411 267819 142480 -137551 -302192 -103103 -82525 -25279 -58790 117619
12156 210739 -98741 310339 100665 87332 52182 132121 272997 342332 231889 286884 217420
12145 217420 17867 159850 -255520 14553 44068 31676 -63056 276380 152036 146514 8921
12133 -89797 -22222 258438 -52375 308859 169461 -63755 -215660 -1725 27765 -392432 140449
12121 170377 171243 34842 197773 103309 -285541 -127052 -192285 -113684 56242 -40893 375269
12109 306196 187609 -270022 9119 133721 -23015 -42129 196209 86072 14972 -50203 -100596
12098 -100596 -136709 310817 -277173 -13008 212283 -16164 16311 172592 113831 109110 87833
12087 87833 -375227 -190811 32614 -185198 71564 203086 -363702 58147 204117 366056
12077 366056 1649104 1340662 249588 -8264 18048 308208 11604 24704 287431 70516
12066 -123989 244543 -59204 -32696 138678 45493 176760 183760 22109 -131393 170478 120438
12055 120438 205364 -46584 358250 117073 139786 13903 -20786 -2805 -72557 -250808 -49590
12043 -6174 -350097 -37039 29964 -178095 -399499 -124072 -75728 103691 -201846 202946
12032 -46235 -193445 222082 -17591 -194609 -277304 11501 9348 -98901 -72442 147880 -161149
12020 84809 299425 362252 49767 -77071 550783 -233797 -16938 -215361 17643 143907 -82602
12008 67484 -106796 -36317 -50327 -37085 341172 77184 45369 -122911 -40101 -52807 -260825
11997 -260825 96595 -503 76585 63216 -30996 8749 -20312 103426 -29605 242310 -143021
11985 104075 -196295 53829 317410 29271 23662 -12443 -242786 -68023 -32125 198192 304587
11974 304587 -59510 -15449 -220924 -182315 -49588 160923 -141347 43050 118570 113161 -368297
11962 97931 9999 64695 -117477 166492 -43153 70036 -187497 -247112 29910 -57071 -40394
11951 -40394 27177 -201219 154552 310055 119062 -71806 -112838 -212358 -13558 313139 -102375
11939 -148059 -25365 -38135 -136660 -154287 -57016 92623 -81388 71122 -283424 -136685 -236553
11928 -236553 110527 -232195 -188974 -107918 -167819 66358 -72868 -142206 96387 8198 -51242
11916 -23283 -97904 -424 -289634 -7137 48807 131771 298450 -349059 -239846 -23742 -69140
11905 -69140 9147 26165 -113371 -7030 -71852 83836 -19756 29236 183600 -358702 18530
11893 -32420 -208836 240639 -161051 172092 141854 -8001 -61924 -41102 -176948 170814 -268824
11881 57914 -18537 -119599 -49781 88017 202191 -77426 203855 -148877 -514249 44439 -88635
11869 -989 63082 140917 -74996 255931 -264346 -103775 25668 -60456 161692 -26882 141940
11857 -57663 -91573 285136 -152525 39625 -10272 198177 -154781 -45925 7695 -168475 -15275
11845 -266364 -206545 -43048 285965 277436 -279353 -324089 22225 -149858 123634 -65513 -98472
11834 -98472 998 81979 -130373 -271030 -125348 33359 89944 -292898 -117825 393815 -50792
11822 -3969 116353 150189 172770 -256615 -56686 31525 -124846 -37433 -199100 408698 -299911
11810 139266 21145 -25476 -235913 -287135 -128802 124982 32506 -53662 -68250 116923 145006
11799 145006 -212743 235156 34625 146189 -202667 20397 -340034 18179 -219024 75732
11788 -21314 49026 23744 -120754 213655 -172794 258780 -157778 -283938 181000 131276
11778 131276 124064 69123 149194 -27580 -35169 50417 7537 -100011 -17922 -89426 -64600 -39172
11766 -39172 65096 -202871 135771 128532 -76296 -114981 -2030 -252123 -65452 -341669 158613
11754 -340086 -29531 97728 128142 -81133 -798 -69427 116240 -82674 131062 -46691 -36226
11743 -36226 88296 283642 156275 39723 -101793 208816 -66824 -125168 139324 -27973 -165645
11732 -165645 102643 248343 -441471 -160536 61898 -43502 -166172 -141985 -156180 13964
11721 -60821 62917 -364892 -132395 127013 284875 132379 130632 -461 -246118 86364 79259
11710 79259 41202 124422 179005 102700 -85619 -34604 114647 7216 -101662 157011 42510
11698 152041 -79952 90255 -307113 -108809 15946 18232 -21729 -18086 126720 -219522 -172586
11687 -172586 74845 13779 118242 33581 2256 18806 134695 -61879 88104 51929 176473
11676 176473 -41543 148331 61226 24483 117272 -131526 103916 -22537 154748 58331 29998
11665 29998 -238162 -100946 -183986 64019 -190008 -288147 298134 -103164 24834 57475 33506
11654 33506 -59530 57096 -4273 -82292 -36536 -68849 50829 -123216 -285868 -88434 110606
11642 220467 -362842 241117 156899 -40474 44550 -312023 190600 262011 470296 36981
11631 284852 -70061 212025 102545 4092 186501 20075 49796 -61126 85389 163460 -229441
11619 315126 140461 26690 -224509 187010 -125995 104101 31241 -117100 -98022 238751
11608 -100822 -42019 3706 -53831 -146867 171496 23301 264439 -57586 145771 233205 100749
11596 157449 64040 207619 74496 97582 247122 -7912 316850 131974 -197694 71346 63652
11585 63652 385137 -11727 152406 16982 328072 93961 400749 -299072 190613 -77479
11574 -90948 -50642 -133702 -68582 378667 -378597 60208 -63562 50538 -22081 15517 -73231
11562 194 91342 -143413 188698 82713 316210 11930 157589 -32649 256080 82739 18705
11550 37370 54649 -32218 -162899 -56782 -30813 -100164 341773 46175 -109511 -64517 94422
11538 396098 211315 -144624 228444 155146 -171104 50477 -61611 344157 -44613 -4496 255205
11526 177707 204223 34921 350028 105767 172902 250261 133047 -57558 303625 151710
11515 -205398 77073 90817 -112116 85470 46912 -5999 280537 252194 219945 254961 -12941
11503 98464 191832 171011 387222 138373 276802 -48052 283033 48887 225647 242470 71134
11491 109683 176228 153097 -18425 18842 244227 -18254 169140 -1785 235463 40259 101122
11480 101122 236194 175392 196576 98876 -5939 449981 12740 126212 53004 298182 179773
11469 179773 109192 -68329 -28752 277368 -28126 186297 303685 65805 -47264 -21361 53486
11457 205658 248275 -22702 69281 -110292 91531 334715 265460 161576 -78350 185926 259890
11446 259890 -128422 240988 -173218 -57437 67495 221633 214388 248672 -245268 149092
11435 119121 -282178 -110397 -123140 -241549 22664 187591 -82977 355500 -99630 -62330
11425 -62330 148305 -108042 -52363 111870 259224 224354 -10074 734 210129 36170 124201
11414 124201 -299512 95585 -171476 -116840 -227693 -66043 -311768 -5594 141303 -265245
11403 -171481 20986 666 182087 -79655 309962 231704 -176927 95507 136972 -201168 58571
11391 269448 -17278 122221 -108253 -234739 192358 -253855 460347 -36332 -47119 -278025
11381 -278025 -38495 -70582 252645 -291296 -24736 101993 -90655 107389 -76758 247021
11370 404501 75578 -276604 102372 47299 6213 -22091 -124732 139259 -236131 -40804 102144
11358 -153789 30088 -43697 138877 140808 -84119 160381 89575 38632 -69122 88084 -277262
11346 26045 107573 47819 -96431 303271 -145321 319492 -13081 178536 216932 47826 -342390
11334 23031 -37102 -116703 -233705 2599 -222620 115916 111437 179026 -179813 230886 -139890
11322 71352 -177751 155074 126444 -136250 -104405 162869 90043 -131626 290678 192767
11312 192767 -132726 -13794 156935 117449 -59803 -52941 -81366 200442 -10682 -14629 27083
11300 -1629 3808 -199106 203099 -267113 55700 141199 -58093 217877 -132205 32852 68719
11289 68719 -83367 -134103 -26908 57329 217128 129240 -180535 97374 230207 72276 45088
11278 45088 118639 103196 -364 -197073 -229735 -582937 19646 -145994 -146413 10834 -78522 -198426
11266 -198426 -20991 -110346 -75719 204604 249272 50217 -88937 -331634 -58445 1837 -178356
11254 51536 -258288 253930 34684 81176 -110950 -203879 -17915 -131692 301853 -84254 131217
11242 -39803 -8396 174469 -148802 -214188 -47452 148859 -52124 -283678 26409 49337 -156113
11230 -220769 -314548 96482 334326 78952 111160 -183361 153394 202974 5520 123832 44067
11218 -68953 -301621 -94662 9476 -38188 -28949 -26458 246372 -25130 18777 -60150 -130634 -176256
11206 -176256 8679 292 -269302 -342911 43428 228697 -7063 -164751 436854 -133139 -197823
11195 -197823 -41214 102912 126868 -39786 -199261 149312 -56323 -142693 156836 113585 -14109
11183 -86785 -463239 17410 -89942 116482 85401 86361 -131419 65976 -400884 -249181 149812
11171 -206184 -45011 173893 249651 -53261 137281 303 10949 -455312 52933 -62666 -46699
11160 -46699 180706 31367 275327 -79780 -12846 6629 -107708 164217 134982 95542 -372444
11148 -128623 403328 -282573 -119083 -183347 -264436 374659 -98984 169900 -73518 -324614
11138 -324614 596596 -180694 51891 -49637 -51595 89235 170204 -64457 175183 101355 167985
11127 167985 56953 129919 39788 -54333 325197 -27168 42910 121933 1433 -181375 134864
11115 -211379 -35024 -223700 123551 97452 -87129 67492 227534 604443 411443 -5424 278441
11103 305256 242257 101188 -178381 80355 105318 -155833 -202207 139391 149683 199203 80240
11091 141170 282041 168375 -136 -151616 204894 105666 363327 324469 49871 160370 80400
11080 80400 145489 198168 51312 97009 250261 513606 442690 266249 416751 216215 363290
11069 363290 306848 618418 359405 406596 303456 611002 305548 327078 486394 535503
11059 535503 460873 329192 845397 602565 546152 1022476 544385 873528 473166 978583
11049 978583 793657 635398 770375 621588 591702 1055740 1025364 1052316 792318 607601
11039 607601 909891 743554 657567 759781 818636 920050 715997 907914 679361 423800
11029 423800 569834 935677 970278 543942 568936 656623 499793 678610 495538 505831
11019 505831 613825 732925 421616 616491 189383 383941 632081 367399 660000 470671
11009 470671 448755 594036 506771 722850 497959 512654 518233 615647 359159 674612 624470
10998 624470 618656 448493 762040 579627 624801 606040 699468 612480 566792 815400 943169
10987 943169 1023834 613533 959920 877914 1421419 1015052 1159727 1372382 1484656 1385628
10977 1385628 1764158 2007955 2124312 2550748 2818288 2994487 2614098 2828509 2409902
10968 2409902 2179841 2135736 1995721 1492591 1503691 1837611 1234120 1674392 1759907 1748862
10958 1748862 1737370 1371807 1441926 1501407 1437699 723433 1368625 678048 608194 783840
10948 783840 459968 371843 463863 226792 -165600 267452 686740 180852 448750 -10419
10937 202661 -154832 127652 72740 -146594 -258533 131891 -34083 168967 175164 138561
10927 138561 400451 44455 -119855 -135345 -103190 -127843 -59045 -155551 -96875 310201 -253977
10915 -62252 611 105350 260112 381934 160921 126930 209903 179527 13535 142140 12622
10903 54615 -11189 -261744 181404 12536 68321 45128 149494 -163205 -291623 -129565
10892 129438 85550 -248010 -116372 358619 -186011 -34583 -72485 -55768 -124697 -55635 -75708
10881 -75708 205199 -205529 -310376 224411 20862 -185146 120001 -21220 286414 -168518
10870 191752 205990 -215888 -152949 -319596 -217764 293668 88738 -14020 -110024 155821
10859 -242648 80051 18912 39987 -111278 -84878 154961 -68548 232128 -326226 235248
10848 -267523 92600 -33782 -109973 -19370 -270603 -121620 257361 -157149 -411108 -35026
10837 -69386 19688 143712 -34018 15235 336654 5240 -260864 -15307 -170615 43563 -324826
10825 -67355 -144165 -100029 -333842 -279417 229719 165203 -47054 -223094 1427 -367982 3098
10813 -70524 -39168 -584332 -111434 -301452 215996 -120167 100873 111294 190276 -311314
10802 -32074 -293078 126529 3274 106848 -319557 -280060 -106443 -131555 454343 -266047
10791 305772 117919 122370 -139579 150069 95660 -301049 221252 123347 3028 44351 -140525
10779 -147775 -328698 113858 587333 -139263 250531 -233296 148282 -372338 185147 334931
10769 334931 -180473 -5903 -191587 49523 -6909 -113291 291289 295728 105886 -474697 -2975
10757 9211 -154048 -64982 -209663 -166053 -6538 130413 -24686 81176 125498 -240548 -43193
10745 163585 26778 -94310 -269279 280731 59809 -213342 124986 -157492 24673 -192500
10734 67727 8514 15891 289080 -224993 43700 1844 260600 78902 -166523 31503 -191064
10722 5650 -93085 -238629 -534384 -101175 138428 -51086 9054 -113160 -213045 -13793 -168610
10711 -168610 -51863 269949 -68964 -365952 109084 58249 -218345 -116263 -46886 -184245
10701 -184245 -102568 -194 32786 -207079 -176456 -156271 157065 2887 4079 151364 -169551
10689 -204560 51309 -186494 -41991 -191201 180103 257639 -194123 89854 -24961 -299999
10679 -299999 119043 34584 -356560 -206599 -10439 -342735 -259021 -62320 -323130 -153384
10668 -91844 197606 -229549 -3050 -413111 -94113 -167934 281514 -5798 159823 315811 -5191
10656 164699 -34807 -51835 39161 -61678 -305620 189954 67208 -145881 -1739 155723 -191487
10644 -166854 -154704 -183227 -103782 -168984 73429 14174 -175442 -212994 160152 -81559 -178365
10633 -178365 264450 -153748 95318 -23572 -144692 101783 345743 -90641 -256445 -34208
10622 -145316 -241220 -174282 69907 -198516 -58135 -413179 187055 -103763 -170801 41671 69571
10611 69571 -222892 243201 -47976 322219 -76146 -20452 45477 40649 -87345 -121106 -145691
10600 -145691 -194025 -247914 181474 -58713 23407 -449274 31759 -144188 258197 -193506
10589 -120900 -224799 -116003 -151951 55262 -47908 81195 -290511 155007 -52274 -28421 -280673
10578 -280673 -114803 -66152 -322732 61033 91356 -179292 143682 129961 -147009 36168
10567 -321381 -198569 -113290 -303045 63500 156340 -44981 222230 312500 -191425 -220381 -263759
10556 -263759 -158655 -95627 -207347 6626 256481 203879 -41796 -329606 138314 228766 -145100
10544 -192451 33956 193014 -202980 -201689 -110025 -241370 242249 -49535 -158619 55504 -197554
10532 -51644 -63888 209112 -332998 -76652 -53563 -40702 249811 -28689 135 6638 35046 112974
10520 112974 -254012 64038 -116761 204922 109545 -35765 329201 -60757 -305448 75019
10509 -12521 -106339 -256775 324416 7370 -107678 -186647 171213 -77465 -39486 -97200 -524649
10498 -524649 -43928 7838 -72752 -242891 -139305 -91564 30018 -121532 -169791 -104618 25104
10486 -77204 -66470 163813 83327 152419 265390 427091 120167 241093 113623 6447 472017
10475 472017 104773 2770 20294 63770 -90716 -103451 -17795 -60600 -16731 106000 556905
10464 556905 86118 -338164 333658 117828 9010 -186196 -356198 21103 -7255 204513 96363
10452 -209598 -250207 237210 2593 14330 -118745 311175 75029 94261 -344949 -9382 -242589
10441 -242589 104923 61054 -277654 -96272 -101600 -361132 -65963 69915 -150206 36262 -39174
10429 35389 21586 236858 -6912 -256115 149224 -263005 -7596 -11799 -82312 58128 240790
10418 240790 87298 69560 194286 -139740 -83907 121945 87756 52735 288801 -5093 -177719
10407 -177719 145865 -17683 72878 41371 224799 21495 -109685 202305 -420589 -249625
10397 -249625 -20405 139915 5812 275030 192945 -59571 6271 258252 102047 130776 211336
10386 211336 132102 267960 83546 321401 -251099 422559 376863 100879 510240 182569
10375 203111 -120184 321696 454126 109378 103069 71116 252161 621424 525546 294974
10365 294974 654899 646648 238039 2382 460865 65804 123705 415701 -48758 226020 158006
10354 158006 40965 171054 440379 315621 305353 237745 117738 346600 243712 615811
10344 615811 482847 436150 291973 367317 81199 191584 352940 382085 -354856 319733
10333 261483 174437 -126559 53121 -201044 97629 257225 92460 269785 199532 229719 341072
10322 341072 -85723 -52798 14372 174666 353707 -82075 64200 394945 -99436 141548 33383
10310 -37887 128929 -73767 -197737 -407791 -71324 35408 87421 58254 -167265 224801 -210566
10298 39840 -93875 -25230 -141180 87133 -156516 -170965 124801 -29687 292662 12342 -278227
10286 -205319 -141588 -276988 301318 -32328 -91486 10732 233735 -744 -352576 90465 -204210
10274 -85247 -163980 -7590 85377 -68902 80744 3851 207 22639 -260961 -88127 168334 211351
10262 211351 393883 415599 709607 182753 103383 175188 311041 -2592 91684 -210000 243556
10250 52519 -261548 -39018 122190 -174979 -216905 -21618 -191588 -322251 -23972 -77269 -38556
10238 -201303 13398 -5590 291688 333103 -477148 8327 -217 -201242 167750 -230673 -152945
10227 -152945 73162 50826 199272 -233709 -115583 -115199 32496 -16530 -131323 -124755 -244328
10216 -244328 -60536 116877 -17435 15335 -294274 42743 -137963 53291 -101662 -20687 -62088
10205 -62088 -55537 28148 -99882 -115051 402584 -115051 181113 235565 113127 3835 44907
10194 44907 -150409 -232723 416195 130234 52730 -220892 -206804 64601 176976 -142889
10183 102244 -244894 -273896 51570 271418 -35005 45871 -43004 -111940 -166124 -76612 1006
10171 139350 -209141 -321949 57216 136957 -198957 -83783 -19722 -170689 -102594 40963 29692
10160 29692 -160008 -28894 -247921 -272726 -141704 12601 -71372 232829 161793 -288366 76441
10148 -169270 -85141 -409424 -89094 -41021 1467 -75498 -372789 -86302 -88054 134176 76371
10137 76371 -77590 12401 53371 -27606 -180001 -456935 17548 -242610 -153249 -149519 -154146
10126 -154146 -145383 244498 150239 23691 40090 123790 -25824 -314568 -293183 52830 -233845
10114 -130250 -27457 99973 -160461 184224 58876 -145141 14777 -36254 -325620 -340071 216255
10102 -247423 -193111 -235028 -170480 -220714 -39705 125708 84389 56933 -171101 -437339 -20285
10090 117710 65108 -3127 662 -48409 -108303 44180 -164458 -211609 -136085 -253646 -282027 164254
10077 -71669 -72101 -63653 213029 -74338 -189681 -289888 -305124 -92041 78316 134680 -273079
10065 -271375 -60903 -10670 -284089 -316542 9561 89219 -228300 133727 -16593 -68629 203045
10053 -220388 220308 118585 -48911 233384 111859 97978 106568 -146395 -84737 128762
10042 292196 57879 76940 110741 -20346 -192950 -25182 224911 -68991 -48948 -327854 -224198
10031 -224198 64758 49214 -43539 57130 -121636 26692 -171570 15487 -313816 182845 -97179
10019 -153746 297497 -121047 -257327 -2522 -166458 -200255 73361 -376345 -102125 -63115
10009 -63115 82969 114749 164171 -257714 15193 -9057 -51539 66612 -62503 44602 7408 90616
9997 90616 -216548 -51928 -208296 -27967 -114281 145978 47044 -125009 12769 -299500 88619
9985 -130963 -92250 21254 89650 -106185 10305 -59236 -189752 208301 115179 -184585 -347653
9974 -347653 -333722 -316928 -173187 -3487 -47177 289367 -131230 -156932 -188247 -208987 -190574
9963 -190574 -7639 3706 -98930 -186299 347815 -259140 -100135 -84032 -110345 -66334 86222
9951 -95904 121343 -135917 -139638 -146932 -521356 -74898 -128400 -148200 -212729 378 -142688 73863
9938 -284016 -106024 90917 -85156 -166332 276582 9241 -243050 -183129 119568 -111090 99515
9926 34892 84749 39020 -152466 91772 -106725 32400 -88599 -24277 135165 -264317 272976
9914 -161519 7915 -77793 45004 -387564 -26252 -152781 -369579 -235290 57340 -3739 -112262
9903 -112262 -156189 47728 -39024 -243312 1061 -113650 -30786 -182675 58807 -43755 -271189
9892 -271189 -101454 -128571 -128364 -192473 -7661 -168603 26288 -31466 -36176 44172 -14105 14152
9879 -478498 -344156 -120485 171568 -149141 87976 -142405 -167470 27595 14559 -65754 -124241
9868 -124241 -254065 -197441 -87679 -37954 -270731 210505 -163048 -622425 -90039 -268358
9858 -268358 66676 -29239 -39935 10205 -192778 -461870 -181602 -209615 -36022 83937 -368187
9846 -12877 274525 -219033 -70810 -111811 358622 247150 -236728 -636110 -290788 -194424
9836 -194424 -265006 -106888 -60691 -159527 -107543 -17894 -161383 -77427 209754 25960 -208314
9824 -85397 941 -145273 28586 120263 41686 146235 -533700 184142 -521 -49459 -37990 -185237
9812 -185237 -176216 -257684 -134622 308231 -189197 -27632 176589 -339199 -371306 -9135 52858
9800 197412 -210567 -106643 108628 -98051 90277 -206514 -158783 -98957 -96963 21308 -466738
9788 22938 -319177 -158071 -44313 191662 -106796 -46620 -219938 -55392 -161817 -53855 -95005
9777 -95005 225200 85950 108974 -252765 -27673 83946 -380931 -24867 221353 -30420 -91820
9766 -91820 -208586 -141697 196560 -394559 -323411 -66154 -6206 -7379 315515 113453 125501
9755 125501 -171741 155738 -79172 -170197 -165622 -180553 -350488 -257790 -105685 -176931 83636
9743 -87842 -286365 -13297 -47341 83333 -98461 242980 -303293 80652 -105714 -61420 -198806
9732 -198806 -169723 -77001 -13990 43145 78099 -84766 -64015 -190213 -223 167278 36300 -195903
9719 48596 -283424 -42321 -424212 209677 143628 -116691 5136 -203914 -211820 -99740 -273885
9708 -273885 -72448 -95314 -275114 -50026 265129 -216092 197061 -223822 -30724 30972 47381
9697 47381 -10011 51700 -162722 -312393 -168263 -231435 -233153 121415 -143274 143776 -153234
9685 -173065 248747 136929 -270731 -67829 -78961 139979 -15808 -121921 457178 -304963
9674 -113541 -133329 -155958 61919 -312730 21695 21306 113615 9577 -38771 -46529 4625 -56216
9661 -282288 -39289 -252804 285520 161938 214585 156347 -142907 -125553 -194055 -101949 -139632
9650 -139632 5604 -174361 114758 239138 -116047 -125322 -236700 251283 -274822 183305
9639 20037 -181336 25192 -103642 -160028 -132097 -132133 40078 -413528 82295 42411 -73283 -69000
9627 -69000 -255884 21766 233120 -149555 -120892 -21063 51903 180475 -160428 32659 198413
9616 198413 42124 18961 -106461 250004 182487 -79426 -228838 -181928 101087 26959 -286231
9604 -69999 -72707 -66030 -41232 -45315 176614 -268404 161927 8820 188281 -192100 113454
9592 -169094 -237233 -13082 103241 -9336 -49985 182447 15235 1479 -261249 -41953 178988
9580 -336926 -64933 89921 231157 -269550 -123962 -67541 -228994 -176567 -90779 -371225 -101216
9568 77294 -60551 -337069 77100 -100666 219195 102638 -161818 -463585 36356 -245998
9557 39044 49340 -67862 -260794 390055 14061 -431726 167868 -57895 59328 -51236 -211344
9546 -211344 -190992 116909 -73950 -292335 198294 114222 -329063 129440 199419 -113103
9535 76708 -43731 -201725 -111051 -292277 -96617 -418334 2781 32144 -327397 -80166 7950
9523 102128 100914 1779 -129409 66044 40936 -280011 -64988 62924 36840 -85425 57022 -295338
9510 45540 55332 -301987 -152115 -267952 -121590 -370686 -330619 -188480 35386 -84738 -216781
9499 -216781 264333 206996 11736 158261 268640 -207490 -4750 54232 54265 56495 -98441 -93022
9487 -93022 -243189 -316437 549430 175817 -457718 -200711 112512 -236320 103220 -303614
9476 6488 -298886 -145701 -155968 49613 -56500 -198748 193949 -263509 -42236 -279892 -136333
9464 -12235 -216236 -205813 -148715 225567 -62253 -307266 -276197 -69406 151433 179518 -234902
9452 14871 217573 6203 -64535 184083 -242629 160921 85455 12825 -37169 -72227 -224055
9441 -224055 -11055 140641 56031 -29954 -15716 2824 -335030 -116749 -160247 -156388 -115480
9430 -115480 -226688 -86405 -152413 -289917 23914 2604 -195848 52526 -156720 -236902 -99491
9418 42007 72505 15158 -42984 -160322 19786 -105324 18394 145765 -131976 -170282 -112314
9407 -112314 34326 -129640 -166140 316394 -54959 -210258 -313549 -312575 73257 302060 112270
9395 65594 48772 -62457 221152 -271691 142286 266653 321216 257420 96817 -253737 169809
9383 -54838 194796 -32132 -104838 -34673 1522 56751 20149 -165178 13421 -213637 156713
9371 166256 212108 216313 -467771 -165147 -105012 5191 -168962 -152169 -118850 -82089 13202
9359 -76555 -284347 57782 -220267 -5566 -53955 -84656 -185279 97540 -219058 196739 -98472
9347 -157575 -24586 -90299 -185852 -72544 149176 -51816 -171861 -61736 -125694 -247660 -69687
9335 -69058 -177117 109835 52195 -190028 -155988 85816 65297 202721 49663 -115798 -187839
9324 -187839 -227458 239245 314674 -207701 -145427 370260 -241988 -166186 -211227 -244852 -276860
9313 -276860 113712 76562 125369 -39968 243575 -256518 177913 44080 -3017 -11736 -11581 117228
9300 -255341 172404 -81031 -10518 -284910 9344 -67652 185158 -130930 79906 -164426 -280708
9289 -280708 -404 99388 73455 -208727 -171635 -250740 -274085 -218104 29681 -216165 26766 284257
9277 284257 -258322 42517 -32809 -126351 -262553 -216408 24514 -226313 -25536 87971 128114
9266 128114 39297 -6709 14885 277983 69169 -6643 9781 -63309 -206350 102873 157547 -76985
9253 179590 104880 198143 -246169 -105538 170696 -173619 196179 -322721 -131633 64727
9242 66007 127310 131752 -337948 -372792 -37129 50663 -76319 -124591 -131398 16170 -192891 42299
9229 73135 -168917 -172706 14386 -326215 -139025 -143846 -106513 -282236 286391 39505 113138
9218 113138 -102071 -7917 -216831 -159429 -204572 -198186 -175370 -372330 156554 -101983 -78250
9207 -78250 -237025 -12194 56901 81250 10696 -182502 -234697 88416 -49685 179154 115347
9196 115347 -213233 102979 -146682 -80815 -125230 -120105 116801 -408450 -95784 -65870 -21573
9184 -199678 -99490 -235879 -351410 303828 -314746 72520 174783 -137482 175352 -217543
9173 11278 152566 -184397 147584 -353155 64098 -93975 129572 -92997 325424 -33668 -372997
9162 -372997 52629 -424633 20218 -230893 -78523 78790 -23815 20779 40305 44085 13983
9150 -423272 -249258 -352920 46367 -103992 39600 190654 -165831 37737 128354 289228
9140 289228 111739 -94884 355696 -7478 -83876 -4999 95152 31325 -146071 -130633 26402
9128 183872 117395 50740 -98435 -360285 -606906 -61539 42922 170166 -9036 381789 -303535
9116 -213806 -413602 -39891 -60142 -249334 -62793 127482 -21358 48512 -28208 -129301 -217842
9105 -217842 11397 56339 -206549 23899 -366373 56933 -183461 -109635 -64165 -31669 38934
9093 20526 -50148 -112997 -12126 -201108 -148584 -178628 -301003 -12809 14726 -126775 -67731
9082 -67731 56432 -6494 -246491 -25160 14608 -102125 13265 -347445 -184309 -76805 86160
9070 147672 -225608 -121034 -248332 -122762 -96015 48901 145895 -37789 17781 -10186 131714
9058 -254529 91520 -187386 -194455 -336646 -171671 136631 -444363 133742 148259 -407103
9047 -301685 -142735 -58656 -41197 -56159 -240467 -308023 -3045 -197123 4392 54564 -318717
9035 82751 -200063 23081 36150 -42369 -131273 125738 -44238 21500 -221635 -68016 -175141
9024 -175141 -10157 4560 -245874 121667 43377 -35530 -106692 90504 218998 -63358 -397065
9013 -397065 39171 271164 -75647 -37183 129298 -73188 12372 -131438 -218694 76041 -172703
9001 46178 -437304 83159 18791 -2371 112841 -243362 142838 17740 -188550 78087 -193357
8989 -32842 88766 214056 -146263 -208384 -167654 -1433 105721 -5392 123886 -84983 -385119
8978 -385119 -94028 164835 191425 -281847 161365 176713 -50480 -9706 -440721 -119187 69385
8966 -130256 -37329 -11222 -303049 188931 61508 -19366 -80311 -69346 207168 73011 -74764
8954 97899 -26756 -117430 33370 120594 184242 130088 77001 233106 1969 129150 -78475 47821
8941 -33196 -62862 -84338 -263461 -127652 -351727 -171337 109824 -27453 -74288 35770 69560
8930 69560 -320750 -81837 -10059 280711 185917 259925 471736 1764460 8249141 2828908
8919 468172 379547 -38939 202930 176247 -334189 -276196 2833 -138043 122178 -75875 -39250
8908 -39250 93796 -204616 187747 -13558 147571 -150042 -579693 68488 -89084 -72255 -302413
8897 -302413 -56328 -117417 -190368 -304883 -101655 65050 19950 -363539 -100759 64605 -44173
8885 47593 175052 -156205 -69549 -164085 172155 97333 -204177 -120745 -118170 -31247 -211673
8874 -211673 -17060 -67469 -87368 -135494 -243204 -249600 -125950 -271503 288725 66057 -218974
8862 -23534 -95249 92978 -251493 -243345 152411 71385 114911 -26229 -45430 35640 37858 41786
8850 41786 -22095 51063 14129 -151304 -222301 178997 -188489 -22101 -171040 -16249 -81797
8839 -81797 152004 34867 -212790 -123724 -62152 -133222 99673 251651 -140801 35906 83508
8828 83508 -167558 -142333 -426407 -147614 -157762 -144495 97307 -3269 46856 56738 -3211 127631
8815 88608 -165902 -244040 50703 -17258 -301781 104031 -125747 -354748 -68346 -187905 220816
8803 239569 -218973 -134118 -102736 68765 36580 -203255 -421869 198704 134562 25949 -290581
8791 6588 165353 54691 61248 -69685 41649 64900 -161589 -390948 266376 17770 -220452
8779 -19793 -355378 142025 -541841 91422 209321 -107233 244056 -337500 -76852 -187960
8769 -187960 38420 140116 -54613 -167073 -141494 -105771 -307488 64608 111133 77551 -93384
8757 14089 -82168 157663 -345351 179547 -37789 -41319 -93241 -335947 -203756 -253711 -104922
8745 -249958 -121022 54444 98239 207410 -84936 -92879 75950 4186 -89614 187795 127492
8734 127492 -122827 60844 -174223 321002 185412 -116227 -238682 -91755 -281858 -32645
8723 76653 -268616 -119952 -74543 20315 58984 -23336 151382 -218737 -294858 50582 -98438
8711 -114622 -162899 242820 -194139 15704 -331091 5978 -190690 147350 -49412 -181795 -55358
8699 -9237 85534 -59229 -201956 153566 -164091 235837 -367084 169201 -72179 377155 341413
8688 341413 -78759 78830 277058 116146 -201580 -311559 -184598 -220159 -20518 165952
8677 171131 72825 -83868 -475138 -277608 35591 -298107 309945 -151532 27518 -7485 -362307
8666 -362307 48154 -108832 -291498 -259076 -111857 -74395 -292736 -180954 114459 -47027
8655 186100 -196889 -465572 -47878 -355298 -45157 31771 -8379 -104472 -223332 -141059 -118431
8644 -118431 172142 125576 -184367 -354505 -83646 5834 51983 155845 -355631 -35922 3686
8632 81552 58513 25485 -91336 52439 -93730 -70969 -152698 -109119 -14375 -81616 -253617 -292824
8620 -292824 126618 -210450 192190 57507 -107194 -381667 -211186 -116844 -297844 204088
8609 92415 -71684 210047 -363069 -117795 -182148 163762 -24943 203385 -273994 46509 -20358
8597 -18121 271190 -129275 27076 60910 -214324 140780 -154780 97555 -159298 -343689
8587 -343689 49895 -51420 -12849 5022 -215489 -55113 -314964 129538 -46536 -180278 222817
8575 241644 -239910 -368784 -376554 -134873 85536 -212808 -31847 51755 160436 -240122 66612
8563 86844 -68966 117523 -78032 257201 -453623 31976 188433 -238460 -161122 287540 -5968
8551 -74977 -399316 -339171 -86787 39521 -39304 -146850 55313 -110495 -117190 -166196 175334
8539 166943 192312 -525675 111830 170754 -290139 61778 -172764 2124 -189561 -65691 72200
8527 348784 50918 -276440 -78889 49227 224082 271977 -218899 201680 62933 -352366 -137736
8515 -285202 -339691 140554 114085 84540 34302 68486 203925 -400758 5102 350138 -36669
8503 220876 77778 77081 -38695 -162150 -289858 -244895 -21249 413571 -285359 1700 60624
8492 60624 -229864 230443 -194851 -233390 -310543 186523 -208416 319725 -407 313863 -135386
8480 304937 -326844 76343 -140055 -208985 -129788 244226 199110 131613 209125 13251 181993
8469 181993 -101501 -123377 115481 -112437 -252744 257428 88756 -85818 -131323 95527 -187049
8457 192502 94325 -336480 -140807 -137565 -239023 39674 76485 -45639 -32283 -326440 -179735
8446 -179735 162109 36048 358250 -73411 34956 -378121 -92744 -147788 -134745 -2070 133263
8434 -404150 227274 -7198 290527 258831 -119167 -1120 261643 -10241 88566 -79720 169152
8422 70686 8247 273272 -155787 -8790 -61976 -110193 314488 57670 205654 190295 -97041
8410 -78063 99678 -89435 -229507 -333025 -43250 -255491 -29002 -158731 141841 -62131 -64254
8399 -64254 63179 -355429 -184361 98911 -46781 -202575 109607 80175 -215546 -232827 2682
8387 -88938 -303475 -366943 -104707 -98398 -228987 -68467 -133892 -193713 151673 -292746 -85180
8375 -177715 -241458 -126374 -218684 -132311 -140646 46407 84855 19083 -98932 -149919 -317666
8364 -317666 339255 59729 154040 239836 -81208 150581 43044 242791 -53509 -193268 -290542
8353 -290542 285515 -284076 -81774 -366777 28845 -52669 84028 169514 -127329 53311 -147819
8341 -14034 -256874 -443496 -133370 -15420 247554 -268608 17889 -83120 29026 -75957 267677
8329 74411 125721 65531 98408 -76536 -61408 -51093 378838 -100534 84260 66288 169310
8318 169310 12101 13423 -54422 118100 212698 68290 12032 -70054 149826 230176 -828 -88767
8306 -88767 -389045 214087 26648 -195441 -35652 -364143 -48660 67756 -54971 231680 -273962
8294 -134337 94128 -36332 107322 40253 -317245 -247906 -284618 -324625 -236846 -14828 -394776
8283 -394776 -204264 -81075 4595 -43457 145461 -170314 203808 323337 -124821 -322763
8273 -322763 -273889 41581 39049 -29120 -99075 -269198 452008 162760 -16294 51927 184922
8262 184922 -291244 -120685 84601 296961 -4844 -112336 -129447 -13642 -395421 173625 222408
8251 222408 -143883 301689 285753 21692 -212819 -94530 79010 9353 -126480 -128632 -243306
8240 -243306 -404683 -55394 -124609 -47263 291538 -146925 319245 -146504 65545 -146912
8229 -144222 -73191 93695 45350 221944 50460 -108497 66125 -50393 -251928 -185288 -149766
8218 -149766 28089 -88813 -78006 -301316 -13778 252259 188016 -159831 -95046 -237788 -54726
8206 -127624 -225328 -293814 -7419 20572 157982 -2437 194396 50386 142878 -268772 -332273
8195 -332273 -139245 -40477 -242524 -49087 -589675 77020 -183881 -76196 -345181 -253150 95401
8183 -5768 -55888 -299279 -315057 63841 -128531 227844 -154779 -209251 9958 -142252 -62556
8171 -103304 166264 -24330 -88034 164970 -194971 323755 -85511 5027 410572 -15537 -65594
8160 -65594 77274 -74494 -60993 13130 252822 -144090 -117752 99548 28954 53055 -74477
8148 16236 -41594 -137648 -196375 -105852 74392 28950 -10955 341690 178516 -13674 -182414
8137 -182414 98480 272619 -16431 -132611 -70596 -96240 -94314 -27617 53260 -242003 17503
8125 105289 119564 18726 186178 -69896 -33265 -128761 -59664 283562 259986 188035 52393
8113 46718 220012 -208115 -31807 -215473 44925 -93970 84199 94394 298802 29515 120335
8102 120335 -184761 -50514 179317 -171136 25655 131262 -16879 -457289 -194063 -227286
8092 -227286 -302046 61066 -67034 23361 142184 -40098 144214 -181995 244566 132606 -19743
8080 -191294 -72210 38542 23630 -169821 -124812 5982 -58479 -134389 -205309 -178427 141309
8068 -150364 -21948 -5271 -110876 123920 -144602 -190252 -171936 -205694 11036 35895 -372798
8056 -119968 90592 -92587 -76380 -436039 23820 -31 -284944 42868 80747 -58436 -1360 -303260
8044 -303260 -158832 -174021 4640 -317786 -329877 262893 -100579 97983 -164476 51142 172789
8033 172789 -42326 -277839 293110 -178664 -260047 -135251 311793 -168115 -8483 -339697
8023 -339697 -121519 -165027 -192928 -16212 -334668 13100 -213110 -122651 -207027 165607 -123144
8011 -418078 -363359 78710 82744 -195070 157414 -193615 272282 -175323 172688 97544 -342545
7999 -169137 454977 -288050 -162788 -108030 -183536 61132 7573 72972 39015 285899 -145923
7987 302308 -285449 146936 139023 -22722 -34751 -197955 36664 133475 28319 133199 125074
7976 125074 -45015 204853 120453 -70481 162148 -847 -6962 78191 -190952 8312 -246875 148928
7963 -481640 -157207 -211132 250268 -106450 -125864 425651 22489 -377612 -76774 175550
7952 -221855 -261659 66503 -200257 25810 -65032 343275 -253268 104480 11078 63030 -192329
7940 -234074 -347995 -200782 157116 61121 -122329 251206 -1691 229445 -355 64991 186781
7929 186781 -337440 18634 -14944 303845 44305 -251360 -303980 -25411 -157016 -41400 25037
7917 -267371 -105183 115243 31868 -170209 -52075 -56541 -110940 178014 -55344 -233827 58457
7905 -379368 -312961 -197715 155353 122228 8692 -171791 83373 -210643 -53834 -123351 80192
7893 -270661 -388055 -89203 -124063 -115567 -147934 151161 -34807 -466976 154847 -49010 -540218
7882 -540218 -67706 -24552 119416 145893 138976 -2294 -158595 48153 -57422 -139719 303968
7870 -4637 -76869 -261828 -64892 -145173 -192563 -466532 -17897 194855 -41311 164841 -194279
7858 356519 -182164 69970 -244338 183504 96415 84000 -76016 -225659 -336205 111738
7847 139948 -61977 -231010 -302557 36660 96565 -74227 60264 307762 103747 -150007 113523
7835 96756 61331 -64006 -30003 167547 -38375 -199937 -20590 -283304 -492567 -310889 78413
7823 370867 -26967 -61106 -234869 -88904 -65547 38734 -52802 -116088 172874 73879 217239
7812 217239 -479280 -13123 -282350 -78401 116234 219846 -137574 -31098 114908 -155653
7801 225675 303519 -62681 105191 -13168 -183091 -139648 -32181 -39698 172652 129562 272677
7790 272677 -312830 94699 -9694 229297 -86026 -165471 -151331 -181640 55203 567 -161779 -198112
7778 -198112 83327 -121462 -34866 128126 94874 -180309 11710 50706 229781 61145 335983
7767 335983 -299381 533122 11708 145084 127402 -252925 -25088 -267083 25676 130615
7757 130615 -274357 -8778 -145165 2060 -526101 -69063 14968 -850 268215 84293 142463 -131546
7744 -210423 4849 157210 -226582 159153 213669 72050 239712 16126 119510 -313597 22486
7732 -156589 -325565 -186465 221241 -239962 47837 93798 9110 -213403 -203679 122285 117172
7721 117172 58620 91716 1926 85634 -242344 171758 -178110 72660 4074 312691 -5070
7709 229524 134316 -86067 -209895 76241 -269660 -218200 193144 -54644 -46089 -276514 -242508
7698 -242508 -143385 -62399 -282012 -17483 182665 5882 -206475 56132 25165 -96566 -337709
7687 -337709 -119376 -182 -50455 27862 -37177 251746 226588 -98685 -35199 -324191 -139712
7675 139791 110488 -157249 341990 -1705 336711 61196 -367250 35976 53130 -264742 -13434
7663 -27532 -26222 272142 -199132 -111546 -11889 -164140 148537 -221784 300376 -430613 205547
7651 -173842 -254830 -69224 39882 101136 -198521 155123 -429137 172657 203013 -268190 -10776
7639 -36950 110265 -190299 337138 -63904 -34079 -282680 -36952 -288344 147068 -176748
7628 10511 -150618 56903 -49163 -156819 -31452 -10896 -90475 74665 105056 -54252 -53490 23312
7615 198029 278365 110593 10517 213103 185387 -75801 -38105 50848 -182901 -151647 -178108
7604 -178108 -103131 -4216 -238667 -347570 -34380 105388 91867 -43062 169910 -147516 241074
7592 453888 42757 -324455 84053 80013 32455 50108 -79187 22356 -243409 -78237 -106046
7581 -106046 85028 -133874 162014 -52526 137451 127350 -207104 -274049 -101275 -31173 201776
7569 -150218 -292730 -78002 -115176 91735 140417 -205277 -327885 159796 78377 -109234 -141470
7558 -141470 -239095 -277650 -316658 -378157 118511 -286414 -165624 -74858 -25816 -110089 54736
7546 82723 -42922 108384 272029 -65460 138390 -152310 166368 -155401 -210180 -81537 -178902
7535 -178902 -163037 -82746 169709 -134689 -28104 256318 -202251 238728 159458 -133167
7524 -257723 -106527 9715 137280 -138909 -39381 -44403 109830 68191 70333 -217771 -253672
7513 -253672 -2372 70721 149781 4708 40038 -99270 22960 -28185 -130512 -157261 21802 -44556
7500 186597 -144059 46533 -200786 258640 24004 -113550 -111406 129119 -74655 -146600 56086
7488 -92350 -245054 233350 77791 -388707 98290 -116678 216493 -239711 271900 -403159
7477 -235311 204419 48856 15521 96490 387994 -1397 37069 -245954 -225740 -7284 -153726
7466 -153726 51808 -123695 -240792 -62854 135870 -115339 39852 143373 -188432 -124080
7456 -124080 111620 -717 201441 103480 18833 -182632 62833 48338 -265527 84797 11704
7444 -179167 -65255 5527 252041 -61500 -80656 -172854 75041 46980 -143139 -114213 -76961
7433 -76961 212806 327864 170225 110728 -168208 -140486 -446777 278632 -2756 -62841 202757
7421 105614 -316645 -176123 -17805 -126977 -63130 184757 165810 93573 185168 74794 -80092
7409 -70392 238912 16406 -32545 -44570 45622 -274953 -33642 213077 -163464 128755 -35997
7397 104952 -96839 -41380 109483 208551 -247654 -304201 -229694 -389675 -115950 -92253 -54041
7386 -54041 195580 -70308 -254080 -76460 410761 -170245 46508 79706 -92579 35400 -31210
7374 191126 -130991 28151 -335099 -119626 -205024 47702 -98059 179853 128598 48962 -193501
7362 135886 -14372 41751 -372481 -134883 -197210 -88619 10534 -310794 286982 -79794 164290
7350 137246 -162276 -254004 23562 -80271 -473149 139119 -235737 2586 -38155 -149433 -46072
7338 -122 -69970 78523 -27051 -552609 -159597 -122104 -221736 180565 -137894 141248 -148992
7326 -19993 -16279 -28269 103660 -352298 -104406 -151299 63432 -139310 -150301 -38319 -9905
7314 -494980 89863 -139090 -148438 53736 -3588 25968 -188774 196400 177722 180960 102809 146796
7302 146796 -103855 -186820 -19181 -219636 -120460 173820 -15767 2547 -41719 -252638 546949
7290 -171304 -253862 -464167 170803 -140914 251432 -158642 99052 -75291 -259777 443570
7279 115695 36617 216764 227004 -36792 -272289 -215419 137920 159514 -41900 -12922 170168
7267 -15137 107795 -62349 -44474 -44618 -84618 93509 77670 -161567 -236175 -243768 -148942 -25708
7254 73510 -9413 55840 53447 178604 -38859 -49028 -135003 196151 76931 -29169 -49825 -97282
7242 -97282 131431 -239528 174223 133202 135204 -152108 -22815 289322 51212 260172 69916
7230 -13100 -3940 63559 -111967 -181166 -4147 -164821 -206482 48238 -49644 -10531 -302926 -183709
7218 -183709 -157107 -203946 -237795 -14227 138272 233624 -34252 -72962 246734 -177824 244624
7206 -139584 -2179 222779 35412 -82922 30110 12008 36622 27278 -84642 -101336 -222013 -197416
7194 -197416 120888 247447 130264 219467 24669 -122365 29850 142780 -146191 -42991
7183 41208 -201658 -70259 49286 197216 115443 191664 194000 -72779 -401008 329642 130170
7171 5660 -126945 -115586 -367096 -16557 247490 -369842 114196 82616 -203005 -110930 -232647
7160 -232647 -359012 66253 1406 173054 -18176 67496 -105276 10834 -329033 -314249 -362886
7149 -362886 112476 32149 176224 41 -40057 78475 113800 24016 24258 48434 116070 13507
7136 214737 -10336 -196722 -3522 -131754 225094 85047 123973 237177 -84408 -151691 19292
7124 -101182 102276 196010 -233678 -75179 73522 -116476 38249 -72611 -8181 22787 354278
7113 354278 -273467 280798 -213894 -230615 -21410 -25196 101124 224795 -22110 163014 -65664
7101 -244997 -56413 159686 -41650 41538 -205405 -384165 -113220 -275996 -193954 -134503 -78448
7090 -78448 377114 -139501 -72293 -163603 -187873 127394 10797 -135627 162835 -158028 -47649
7078 -54832 -205984 -115731 207903 159432 -110301 31686 121659 107360 -187487 60409 2947
7066 91208 -176827 97850 439765 59960 -269360 -256410 -36988 60765 163693 80521 166834
7055 166834 -59469 183199 -59901 -179503 89336 -116832 -3997 -72230 -297090 -95424 -39742
7043 308399 5945 27786 12115 -95339 6512 15628 -6055 17097 -58776 -159629 -178680 90903
7030 271760 117180 -304054 248443 -504106 -288915 -246262 2541 50310 -24467 -62160 -60780
7019 -60780 -142109 97569 -27460 13187 13116 -266102 164065 -65075 -340233 -132755 -142639 -50751
7006 48646 -101271 161575 82360 62504 -1365 -96447 -40135 332358 -40385 17603 277140
6995 277140 -107699 185900 106440 52518 25374 -121890 -243285 15412 -80853 -113124 117536
6983 37146 -52485 -103038 -292684 -412672 28525 113398 -147904 66941 232033 -12701 -174740
6972 -174740 160904 174758 -137440 -85994 -225007 -196974 -251652 -60817 84572 36443 -361063
6960 -284571 135859 -26779 -24177 42503 4342 -59867 -90523 -120401 68894 344438 37392 -110066
6947 -100750 41345 -176802 6564 164440 -110619 -141427 -176453 277703 92719 -1742 -173645
6936 -173645 -322752 119592 242866 187650 9822 -321121 98617 128463 -206139 -184880 -68558
6924 -201856 708 110654 183924 -207138 -355913 127050 153752 208500 72173 -159704 -158721
6913 -158721 -105433 -10454 196956 98451 153223 -306164 -9749 -55674 -264722 98035 99222
6902 99222 15329 -95613 -67242 327788 373008 -41223 -166648 79162 170188 -83784 -159827
6891 -159827 164035 82681 -327418 152049 -58081 -219238 -249285 -1733 299809 46833 232711
6880 232711 122991 -76171 16593 -308868 7523 -88312 81141 105467 234263 194370 88806
6868 -6183 -170201 142768 76532 -257144 -76133 -31045 -38290 -229373 -289193 187973 -19293
6856 -41896 266502 29220 -9214 125214 -142813 264065 82625 -377 -25056 15416 117419
6845 117419 57977 36920 91065 199640 -55914 -3472 56172 -2293 -57262 107983 419826
6834 419826 -182228 79637 -134693 -226273 159967 72333 -128450 -22441 -70768 -38951 -304192
6823 -304192 123594 -82225 -64898 227656 69029 220600 -210010 155651 -57335 -140271 51215
6811 139687 103426 -169766 72301 -72022 33915 66324 -242484 -31562 79996 -241447 91822
6799 75733 145082 -264206 -273006 298041 -261003 39125 -51768 -109752 24557 45769 43353 -48175
6786 15243 264307 11522 65417 -155233 137148 -36136 35103 -498781 -4829 -185555 -324757
6775 -324757 90801 -162205 46047 -394241 -253812 -363280 -123578 -41961 -6569 59816 150759
6764 150759 -16588 -37076 268948 -92245 -221931 -222337 204347 -209447 -284865 -90442 129761
6752 134807 -17823 -77291 107588 -20732 -10758 66018 19267 160472 6156 372052 -36192
6740 -54673 -241920 7188 102846 172481 159345 219019 151862 105118 134704 141750 93871 433329
6728 433329 -8802 -76571 -15103 -219892 280106 -219062 54014 135138 -382577 -260621 181465
6716 -288306 165981 49254 -320519 -152531 26697 74997 -219965 -35801 -70260 58896 38532
6705 38532 -2266 -428210 319154 -140974 98451 400102 -229261 51319 238327 221179 104617
6693 -93901 275717 -266658 403096 -101168 -188539 196236 25678 -16963 -158377 -49653 -176249
6682 -176249 -108305 -17474 -172175 125749 150886 197043 -115850 50753 154256 -196947 -57585
6670 -298273 97674 135167 30392 -336021 86445 43920 193871 352307 -133456 -320551 13366
6658 3675 -217550 -226330 -233818 -40633 64994 -145535 20558 -374680 -475406 -59757 -145900 93016
6645 -128947 -96282 50353 -91114 6080 -132205 -96212 -272909 -123201 163110 13425 -22169
6633 -113929 45395 15776 -59002 398346 112287 49075 -80698 -197287 81476 59813 11766
6621 84204 54200 -241553 369570 -150952 -428254 -167320 158596 -144709 192798 202307
6611 202307 74225 -139079 125161 310893 -112759 -249442 49557 -49594 197534 99071
6601 99071 -271259 215139 -72021 123215 96796 -224618 211118 -12219 -67060 -190196 -354237
6590 -354237 -37252 -27256 -289790 -73028 -297810 -34364 114906 -403488 -76007 -281584 12090
6578 299035 106972 -104108 58424 -68265 29273 465475 -18104 218024 89222 146198 72217
6566 194919 31700 81313 -152449 114893 85992 119648 -198574 -147338 21931 327420 -114487
6554 -271976 -109073 61567 -232073 -208986 106095 237459 -174362 -43074 -26883 49932 182485
6543 182485 35124 172069 81380 278797 104675 -42095 -364283 129870 -208423 248080
6532 -142824 -176426 -356078 -153258 -18243 137300 -47751 -79682 -80640 7335 -14665 31813 76694
6520 76694 10945 -281174 -226843 90175 149626 -148850 93383 -5396 53288 -19865 32593 -97415
6507 -125660 -194823 -271369 102528 12235 -184660 113796 -264633 61904 -52029 198549 219508
6496 219508 70318 129004 240620 -189978 67678 -23522 168205 143097 -313651 -336071 66595
6484 -94448 -221830 363317 -124507 320375 17236 -131336 293100 38975 -179329 107698
6473 185655 -36897 25487 -120217 105105 -239982 -269982 -99403 134547 -353903 -66319 -190242
6462 -190242 198669 62984 283700 218087 -313636 -68347 33908 67598 86452 -16384 -164010
6451 -164010 74431 14428 70689 -46231 41747 287161 22565 61277 33797 -228214 29027
6439 -66479 -154796 -130050 -17787 101430 69288 -232041 -179203 -324006 -10181 287566 -227791
6427 131143 87309 -46434 -20240 -120453 80310 75600 73690 -170696 -77652 56885 -151841
6415 81855 64993 137229 103397 135515 209854 19105 -225396 -251893 93602 124116 -183823
6403 -81407 190058 230646 106504 91901 11730 20406 26736 110957 88584 60667 -133249 263717
6390 -43899 111336 147503 -323360 26961 -210281 491998 -131312 -107901 106717 -171485
6379 -70536 65130 -104721 -196482 -87783 65737 -142899 186529 176735 269064 194096 -181831
6367 20941 68179 147737 264490 -141705 -158028 -136103 -27446 -65385 -245850 160230 194643
6356 194643 51362 -271550 33991 294305 -82066 36878 7273 228656 -14369 44 116715 74741
6344 74741 88514 -115594 122741 292337 -344226 64159 -31890 -173364 85194 -42533 -48595
6333 -48595 -231482 -142274 -48561 68599 -9846 -254842 -4920 -82482 -86209 -267134 -27365 80230
6320 117 -143638 5127 -208889 -91337 62259 -121436 -92273 299220 -237770 178723 -116553
6308 16212 205690 -85010 92800 295901 160085 30144 54175 162218 -198211 86047 4272
6296 -84802 -100208 199779 195900 -66677 -83662 129951 -216177 197296 330890 208117 -497190
6284 199821 77778 -120692 -306323 -74614 289021 120980 149054 -132025 91030 -5538 138530
6272 88523 -319350 -162814 182025 -66256 299919 -66195 47158 455929 -32979 167197 -156979
6260 -154 70112 84486 -294811 -133040 -97646 -18321 -71296 -157582 326863 -11990 -214762
6249 -214762 -289939 69945 -134385 -82163 119126 -168654 -78259 34537 -196882 -23542 14523
6237 -47033 -39684 15362 -157836 -272957 335105 61990 127720 155043 -17298 -137443 18387
6225 363458 -372073 94043 -186896 160439 -126742 55439 25393 -232762 -59467 -131628 254177
6213 -133958 -359852 -146000 -15722 11479 -22909 242432 -133581 -6151 358828 59121 -452658
6201 -85043 -3697 12364 -216326 -109361 131905 -33765 10039 -11768 73768 -219086 -315004
6190 -315004 212884 -456222 91329 -59091 -173445 133878 -155622 111961 -272107 117457
6179 71178 -101308 -122740 -51995 -48197 23487 -287859 14044 -30195 82207 54023 262999
6168 262999 107409 59344 125530 -20299 -187254 -33792 112666 -257589 48078 104378 -67493
6156 -90866 -129080 147159 85961 -194965 297246 6375 182071 35670 -81455 -282432 64670
6144 119184 -35195 -111066 -50252 -339071 138250 -160026 -278204 -54826 -45692 -70177 -192747
6133 -192747 -221133 -118424 186428 -104878 -162310 -317111 -25957 48240 9364 226643 -10061
6121 -111672 -37229 131789 -172468 169362 -231788 -191100 -280746 127108 7917 -70789 -255512
6110 -255512 -79167 160386 -78541 168651 -262 -294785 -75123 34094 -6437 27112 -29287 112886
6097 -222197 -37588 114371 202839 -47635 358860 298130 -57544 -54611 127788 92096 322131
6086 322131 -188140 -35448 -4151 -65532 -31694 -85428 92714 -277672 -101377 -296569 -129546
6074 96537 -136481 162573 -70690 335639 -42216 218111 19457 209513 -307274 247029
6063 117140 -213054 262172 -88630 -66467 -42689 -63367 145758 120219 -33092 -66476 248874
6051 63000 -127381 -12442 -343757 -102493 -72850 84740 -158240 166917 -36174 -40714 -265411
6040 -265411 -63966 -35440 -23146 -306873 -212127 -138193 -2738 -385653 294875 15759 181957
6029 181957 -155575 -110815 -198200 123825 64012 114830 70058 204871 88596 -4588 -8235
6018 -8235 -227996 8184 -106191 119893 258918 79453 -159951 -4080 162169 66982 -51117
6006 -83266 -33306 80208 157179 -366538 -97510 -63559 29170 -25762 -16036 49622 224604 636
5993 -77885 -234346 250802 -236971 -176733 134004 159029 -193767 -194182 -99494 315543 -249226
5981 174722 -497778 173790 -49550 284686 -192963 73952 142731 -59827 325030 -32588 -84756
5970 -84756 -320324 -333925 -1503 -33202 -167927 -95931 110004 163332 127653 -245267 -207012
5959 -207012 217567 78017 181709 -11398 100868 -376886 185571 -8016 -26630 59154 -315710
5947 93377 -269775 259846 71842 140126 88370 -83522 15362 -312031 -82903 115232 -22165
5935 -31772 234336 -442227 97947 104834 10369 -320872 -205234 6079 -64974 -18985 265252
5923 -31477 53485 247825 -22767 -139885 -115778 301829 245034 -195423 -265849 -120727 -48113
5911 -710 -7743 -172078 212088 197000 -69920 106502 324168 -104245 17700 275481 43920
5899 -190699 224529 -227846 50814 22422 -355541 120093 -455171 314076 -258477 88724
5888 14282 -236408 -236666 -45495 204499 210201 101032 -208656 217250 203911 46580 182141
5877 182141 161981 9954 -15233 -141699 -184170 -45839 -86070 147033 278100 -261239 16847
5865 116727 -92264 -92417 93022 -69540 170046 61664 157375 -44984 39486 -43355 295236 -160027
5852 175495 41241 124063 -214976 55922 188709 -173195 -39727 -365758 -167338 374345
5841 69744 -75073 36812 179823 67841 72728 143164 160314 159090 308186 283829 96529 180220
5829 180220 -25274 -7132 -143135 -222436 -22105 1786 -128818 -38027 -43533 -259493 91791 3697
5816 -233275 -196331 5213 -175248 -97404 232627 -175535 108042 257851 -88277 191824 100303
5805 100303 321679 -25055 262513 -167601 183896 17565 137429 125687 298999 -10323
5794 364848 43787 96561 -263188 203391 -50762 -177728 -62869 -83973 124780 -15517 -188896
5783 -188896 128109 -77767 -155879 -26525 -198718 365115 -241433 17602 231528 -134 -566
5772 -566 254696 -10642 -82114 -98442 -154680 -218869 -160786 1026 -58866 194000 82981 -307473
5759 163377 -7434 58486 -192182 86279 -133885 35639 149901 -23813 -79807 36308 238412
5748 238412 104896 118300 -11489 -125083 -30199 -25647 272690 -229767 57289 180288 60265
5736 17426 87327 -218345 -126437 112520 84981 -153138 28353 7514 138284 142640 240394
5725 240394 81069 -82784 156634 170638 12783 248835 47532 -85959 -110469 -196491 -99736
5714 -99736 -274715 178028 -292296 151315 -361624 -92242 -147618 28588 -8116 176139 2115
5702 73017 148137 -69967 70404 -311678 303382 -35756 -278206 -71437 22179 -71833 33370
5690 1580 252102 -82017 -264523 -47964 -257470 56221 351098 -37678 -218634 -150092 -158641
5679 -158641 110382 -242862 52375 401117 42125 -2727 83978 -226674 524355 -111746 53589
5667 44997 93855 17370 56816 -17606 347645 200533 -240196 216816 -392446 212203 -38966
5655 247873 -53239 -20812 70530 -89163 217478 -132183 108842 99564 98982 -95893 -73863 60897
5642 170336 113286 -180882 79621 -166743 62571 124072 -360 219220 33638 159970 -209772
5630 -70471 -182170 -110486 33171 61540 523672 168705 -83055 25061 -262219 -172720 228012
5618 -47276 -299338 176820 70340 248820 -6190 -203133 -135299 137330 20349 -162691 253986
5606 152166 306650 182250 -98955 -200750 9886 135202 -258945 -33011 -17577 7996 -4327
5594 -101162 -11353 86689 170896 187677 -230349 -93540 -92962 31914 -194944 308870 -158256
5582 66371 -221103 -108819 -399362 -152293 -70119 -87649 68300 -123920 232853 138649 46344
5570 -183693 75189 34369 -40853 -155804 102356 -314216 31069 -150518 206430 -396648
5559 289944 233035 32943 130688 -56678 -63583 -15502 -286899 168674 280721 103533 -48847
5547 -85659 -62848 -138276 36139 -89686 36766 14580 95181 15135 -101782 -62363 332179
5535 252077 -52818 207642 -210025 205083 -153522 226933 -74572 304629 -84882 -91464 -103855
5524 -103855 56556 294873 -71616 -3769 -138491 257940 65974 15889 502940 -200600 -37463
5512 -323857 -189074 287931 -247644 -31729 63370 -25807 14314 47724 136796 74753 -213050
5500 -124673 135819 357415 -139836 125886 -88361 144867 245679 24673 -4069 105076
5489 328225 -195825 389406 29130 70542 219282 -429792 48995 -256823 -168702 -198901 -157359
5478 -157359 118793 -47921 -146682 160294 166084 -215469 174998 -319806 -78843 -165572 -197879
5467 -197879 -25100 -39410 8411 129667 335471 88310 189992 -200130 -295788 -45704 -107972
5456 -107972 260064 -84767 92504 -102229 -73564 -61521 84829 -26280 -154842 -141446 -85938
5445 -85938 -44941 -15628 -249752 169206 -267060 3899 -121826 -32373 97254 120179 -196207
5433 117258 146247 124910 64555 43049 254500 -81534 229835 -316673 -17174 -164233 20213
5421 -59613 312180 141741 98002 23800 55534 115741 -10421 -20324 131249 273887 -6411
5409 45497 -357653 -270263 -182159 278517 -99931 -96364 -280005 69578 206529 316903 -273631
5397 42739 139242 55064 259115 -28683 98483 37414 -191989 -296049 -398929 41743 -282697
5385 -124683 -213520 26011 266517 -232817 -105019 -68379 177816 210911 105673 -200589
5374 -5658 -430870 111210 -67229 28243 381049 -419884 115956 193977 74701 -327861 -10506
5362 -15307 28565 -26716 264949 -125527 -178685 -278258 113276 -181762 -21921 -492598 -53359
5350 185017 -34903 267837 -133274 402751 174470 -131480 71137 67365 -141715 -126890 297638
5338 -52411 -79503 31737 -106164 221875 355024 -63768 -72932 11053 -223656 -2878 -376 -221953
5326 -221953 23648 -264222 -176980 217620 17961 269985 -362038 -154724 -128051 13962 16950
5315 16950 -129452 -68191 -21860 219337 424615 -235087 60618 -125088 -276461 178445
5304 88137 324731 -91751 -22173 162998 -107406 298229 204926 101385 -188563 198041
5293 292757 -169712 -62242 32141 -203111 -110955 68600 63807 -16587 -261203 34526 40283
5282 40283 27284 -102015 129549 99647 -72468 80214 -75449 -176804 -118705 302349 67914
5270 314804 -231984 311996 -334279 -58716 155397 30441 -9122 547838 182597 57539 156912
5259 156912 107075 36642 544304 191022 -81812 -74472 -4655 -211051 489236 -281634 -84404
5247 60419 -375422 -167725 -186708 -122910 86716 -4915 -16521 -252809 -186034 -232608 593 -195570
5234 -156840 20375 -207311 -6564 -13317 341486 -270053 47075 44498 -128037 -173462 7575 -67813
5221 -158890 -42441 6190 -169140 -252746 -11938 -64350 71295 -136975 -132778 139247 -1873 159165
5208 -13539 127340 323813 -28167 -31853 149542 41855 -335894 -117894 56976 -194402 83288
5196 197089 -424050 -188401 -88946 61761 -260408 -4026 48602 229717 -129052 -32306 -104567
5185 -104567 -62006 -105418 103706 -16064 104826 188250 58424 134542 335082 125571 86066
5174 86066 256964 -294089 -182070 160838 133473 -329751 -75504 -42019 26777 136495 -184233
5162 45070 -313793 -139568 -200226 95498 117365 59838 14745 232804 89445 -169625 -105602
5151 -105602 224122 -24873 83006 -138606 -252068 5894 72917 -129217 93551 -131756 -108383
5140 -108383 293989 -31685 1600 127399 -191772 -18800 155563 -11742 441376 46996 -99461
5128 143443 -55446 -160694 288643 -28121 -72118 -31742 -44470 415531 72986 -153075 503254
5116 -130033 106871 -95660 -71828 -36446 47970 -292815 233579 -242815 227639 -345909
5105 191530 -33710 113913 199433 195414 -332759 28551 -41791 -109084 149474 198091 -114919
5093 -380540 225926 -196448 306586 294850 -18264 -37433 -59613 70406 -289436 -87551 -254118
5082 -254118 -109995 45750 -12812 96024 -167298 -342442 125244 -141447 169405 -228970
5071 231162 1008 -255609 -310579 40184 -131262 143015 -126192 -72777 102178 7790 -131670
5059 -175002 41698 145028 -235177 -69650 -66085 -12221 -57414 -137483 132701 18178 -110494
5047 -108276 -137614 59993 -79965 167850 81824 -277182 129367 24459 -102875 -239539 63207
5035 91001 -327210 -147007 -17142 -218447 348130 37737 -11005 -86103 -113156 -128565 14199
5023 97732 182196 -84687 -157965 224346 -187187 125792 134130 -274011 -235356 464503 107948
5011 -188651 111057 -46745 25664 -12786 -169277 60011 84080 -95766 -190272 -142942 235936
4999 19151 104981 -224950 -346512 69257 -38067 -105810 -90568 31879 -255114 196484 -83362
4987 -160196 -63426 90710 26182 -106255 -46184 -29670 4432 87924 -166120 -4503 -313477
4976 -313477 -145831 79099 21104 -223947 94575 39164 351130 211201 30095 -59405 -241053
4965 -241053 125263 -201262 -60765 96531 -95312 205981 52027 83538 -117259 -166624 121304
4953 -52125 64214 -143568 -90864 353613 -35317 83869 25137 356960 159666 -73522 140104
4941 117868 -4965 -84421 -50106 121271 15069 -147603 -211808 218598 85346 126579 48742
4929 40999 56109 244715 102520 -108993 -146506 202284 141489 -55172 -9931 18859 -204635
4917 19505 310075 -113619 -94634 104783 -235033 93526 169537 -88732 -57535 -289221 121835
4905 -70359 140562 154297 -20188 275995 240125 -51856 29631 86687 94443 -156252 -15980
4893 -200734 30836 83939 67712 -2090 320947 -221124 -281689 -73794 -128515 -216645 -77997
4881 82130 -187350 123210 -116197 361135 -123796 237988 -92794 114963 149362 75728
4871 75728 -224993 -37054 -104637 -199314 -149108 5869 -162 71375 108640 -6196 -137926 -139732
4859 -139732 103105 -27193 9632 55986 -63964 96079 -2537 43445 -173016 136787 174815
4848 174815 153132 313162 133242 -99622 305632 57800 15596 321143 20634 -151554 47045
4836 145058 27444 -139577 158459 -29117 87240 187896 -96666 -451071 -123903 15895 106560
4825 106560 -132807 -479476 -378027 222891 73939 -7972 -142197 23611 -192681 282075
4814 -48176 -251645 -56063 -97265 96289 156435 -104919 -65986 122478 186111 -90539 99131
4802 -290295 -56119 113044 254506 -30766 -108209 234368 -82009 250436 95301 -91728 -106785
4791 -106785 -163686 -352836 -174033 96806 163267 19200 -175699 -275438 101483 233927 -337920
4779 -202292 39493 130230 -86286 -12564 70184 -241517 67807 24279 104140 433258 -40767
4767 82646 -88086 87996 16669 117768 -53546 -115507 31880 115115 -158392 -287164 127112
4755 47818 -11739 92126 -52673 -102544 63750 89183 -291263 -227504 148225 -269306 259406
4743 -358825 99637 40134 -217216 -179201 75636 53464 54383 70841 308062 125657 -208469
4731 -128789 -150755 -14741 -236939 -108712 -107549 -405 337372 -147028 161336 -49025 160786
4719 -16055 37976 1134 199069 432730 89273 -287289 209039 -64769 300555 22289 43715
4708 43715 -71664 318682 106381 209800 -136983 87536 276784 -26197 -246824 24575 -4876
4696 -143765 135326 62264 271457 104611 -118087 147948 -206613 159150 122935 -43618
4685 291742 -108876 186010 443999 -123308 333685 -205470 251423 -124134 -107697 127643
4674 17360 413722 72868 -161455 -127784 -145961 286547 -106960 -162093 -83596 19388 -113909
4662 30965 118889 149355 52085 112073 -69777 -90407 -289575 -191869 -122880 50047 2268 65970
4650 65970 -52818 -224031 214814 259081 169810 -177500 -196449 226469 -78335 -73093 17884
4638 193880 -163122 247041 -56025 -20768 123333 518105 -212192 -21843 -187297 -177948 -196569
4627 -196569 189040 -3084 -178473 94238 -132745 299206 105247 -125071 128614 -14495
4616 -60436 -31228 14742 -142400 79278 -320156 -64566 19284 -86814 286766 -28079 409270
4604 26846 205235 319168 113249 71620 64570 46018 240825 193926 -130556 -144329 -106201
4593 -106201 182308 -219763 454298 143349 -307455 47195 -287963 -59232 -176014 157098
4582 55254 4193 107571 -142978 -118653 -58632 -30276 -158456 -394195 -332016 174129 48791
4570 81652 -258668 75885 38298 -170662 200779 -244396 94464 35863 -114324 -57306 74623
4558 136791 -117231 223279 -227604 146752 -76612 -55381 174010 -164544 56755 11327
4547 272294 -172324 271409 232524 247518 -62287 227828 311151 14735 -129665 -174950 73049
4535 215485 159512 501802 331842 -55267 84256 197491 305218 -42769 -10121 -199165 216669
4523 77141 -275424 -10315 2967 110260 -166724 -146289 -11804 -53807 -195528 107741 126658
4512 126658 -244316 106054 98648 110536 204028 69140 -139688 272446 -77667 82726 -165225
$$ [...]
##END NTUPLES=NMR SPECTRUM
##END=
