
##TITLE=AC1327_PERAH12156_6535886_6jgkElnn9o
##JCAMPDX= 6.0         $$ Bruker NMR JCAMP-DX V2.0
##DATA TYPE= NMR SPECTRUM
##DATA CLASS= NTUPLES
##ORIGIN= BRUKER
##OWNER= Administrator
$$ 1.72 TOPSPIN		Version 2.1
$$ 2012-07-17 22:13:35.578 -0500  Administrator@TOPSPIN
$$ Compression mode = diff/dup
##.OBSERVE FREQUENCY= 400.02188249412
##.OBSERVE NUCLEUS= ^1H
##.ACQUISITION MODE= SIMULTANEOUS (DQD)
##.ACQUISITION SCHEME= undefined
##.AVERAGES= 64
##.DIGITISER RES= 22
##SPECTROMETER/DATA SYSTEM= spect
##.PULSE SEQUENCE= noesygpps1d.comp
##.SOLVENT NAME= COFFEE_meoh
##.SHIFT REFERENCE= INTERNAL, COFFEE_meoh, 1, 14.96076
##AUDIT TRAIL= $$ (NUMBER, WHEN, WHO, WHERE, PROCESS, VERSION, WHAT)
$$ ##TITLE= Audit trail, TOPSPIN		Version 2.1
$$ ##JCAMPDX= 5.01
$$ ##ORIGIN= Bruker BioSpin GmbH
$$ ##OWNER= Administrator
$$ $$ C:\Bruker\TOPSPIN/data/COFFEE/nmr/AC1327_PERAH12156_6535886_6jgkElnn9o/12/pdata/1/auditp.txt
$$ ##AUDIT TRAIL=  $$ (NUMBER, WHEN, WHO, WHERE, PROCESS, VERSION, WHAT)
(   1,<2012-07-17 22:13:30.875 -0500>,<Administrator>,<TOPSPIN>,<go>,<TOPSPIN 2.1>,
      <created by zg
	started at 2012-07-17 22:02:00.453 -0500,
	POWCHK enabled, PULCHK disabled,
       configuration hash MD5:
       6B 1B 68 BB D9 2E 58 E2 7F 35 AD 54 07 DF 0E 41
       data hash MD5: 64K
       AF 78 FE E4 2A B2 59 D3 71 CD 12 B6 AD 21 4A C3>)
(   2,<2012-07-17 22:13:33.703 -0500>,<Administrator>,<TOPSPIN>,<proc1d>,<TOPSPIN 2.1>,
      <Start of raw data processing
       efp LB = 0.3 FT_mod = 6 PKNL = 1 PHC0 = 0 PHC1 = 0 SI = 128K 
       data hash MD5: 128K
       D1 AA B1 E0 25 29 EA 78 A2 50 B4 C0 7D 63 8C EA>)
(   3,<2012-07-17 22:13:34.843 -0500>,<Administrator>,<TOPSPIN>,<proc1d>,<TOPSPIN 2.1>,
      <pk PHC0 = 0.6921387 PHC1 = 0 
       data hash MD5: 128K
       7A B0 CF 52 C8 02 59 C5 61 24 14 F1 00 7F 8C EA>)
(   4,<2012-07-17 22:13:35.078 -0500>,<Administrator>,<TOPSPIN>,<proc1d>,<TOPSPIN 2.1>,
      <abs ABSG = 1 
       data hash MD5: 128K
       C7 4F 8A 79 49 D1 21 D4 F2 5D D4 CA 95 F0 25 28>)
(   5,<2012-07-17 22:13:35.156 -0500>,<Administrator>,<TOPSPIN>,<proc1d>,<TOPSPIN 2.1>,
      <abs ABSG = 2 
       data hash MD5: 128K
       D8 18 CB 93 A5 86 7D 6F C0 4E 9E 8D 91 5C 64 15>)
(   6,<2012-07-17 22:13:35.296 -0500>,<Administrator>,<TOPSPIN>,<proc1d>,<TOPSPIN 2.1>,
      <abs ABSG = 3 
       data hash MD5: 128K
       03 5F 61 33 B6 FF 01 2F BD 7D 3A 52 BE 1B C2 2F>)
(   7,<2012-07-17 22:13:35.453 -0500>,<Administrator>,<TOPSPIN>,<proc1d>,<TOPSPIN 2.1>,
      <abs ABSG = 4 
       data hash MD5: 128K
       4F 77 E5 BF B8 CF E6 1C A2 61 72 D2 9A 53 26 9E>)
(   8,<2012-07-17 22:13:35.500 -0500>,<Administrator>,<TOPSPIN>,<proc1d>,<TOPSPIN 2.1>,
      <abs ABSG = 5 
       data hash MD5: 128K
       E8 FE F4 18 10 E7 24 6B 78 86 AE 81 48 60 17 42>)
$$ ##END=
$$ 
$$ $$ hash MD5
$$ $$ AE E0 1B 72 B9 81 60 E6 E2 6C D6 05 07 64 D0 1A
##$RELAX= 
##$RELAX= 
##$RELAX= 
##$RELAX= 
##$RELAX= 
##$RELAX= 
##$RELAX= 
##$RELAX= 
$$ Bruker specific parameters
$$ [...]
##$TP07= 0
##$TPNAME0= <>
##$TPNAME1= <>
##$TPNAME2= <>
##$TPNAME3= <>
##$TPNAME4= <>
##$TPNAME5= <>
##$TPNAME6= <>
##$TPNAME7= <>
##$TPOAL= (0..7)
0.5 0.5 0.5 0.5 0.5 0.5 0.5 0.5
##$TPOFFS= (0..7)
0 0 0 0 0 0 0 0
##$TUNHIN= 0
##$TUNHOUT= 0
##$TUNXOUT= 0
##$USERA1= <user>
##$USERA2= <user>
##$USERA3= <user>
##$USERA4= <user>
##$USERA5= <user>
##$V9= 5
##$VALIST= <valist>
##$VCLIST= <CCCCCCCCCCCCCCC>
##$VD= 0
##$VDLIST= <DDDDDDDDDDDDDDD>
##$VPLIST= <PPPPPPPPPPPPPPP>
##$VTLIST= <TTTTTTTTTTTTTTT>
##$WBST= 2048
##$WBSW= 25
##$XGAIN= (0..3)
0 0 0 0
##$XL= 0
##$YL= 0
##$YMAX_a= 11632679
##$YMIN_a= -8907293
##$ZGOPTNS= <>
##$ZL1= 120
##$ZL2= 120
##$ZL3= 120
##$ZL4= 120
##$ABSF1= 14.96076
##$ABSF2= -5.597422
##$ABSG= 5
##$ABSL= 3
##$ALPHA= 0
##$AQORDER= 0
##$ASSFAC= 0
##$ASSFACI= 0
##$ASSFACX= 0
##$ASSWID= 0
##$AUNMP= <proc_prof1d_extract.lims>
##$AXLEFT= 0
##$AXNAME= <>
##$AXNUC= <1H>
##$AXRIGHT= 0
##$AXTYPE= 0
##$AXUNIT= <>
##$AZFE= 0.1
##$AZFW= 0.1
##$BCFW= 0
##$BC_mod= 0
##$BYTORDP= 0
##$COROFFS= 0
##$CY= 15
##$DATMOD= 1
##$DC= 0
##$DFILT= <>
##$DTYPP= 0
##$F1P= 0
##$F2P= 0
##$FCOR= 0.5
##$FTSIZE= 131072
##$FT_mod= 6
##$GAMMA= 0
##$GB= 0
##$INTBC= 1
##$INTSCL= 1
##$ISEN= 128
##$LB= 0.3
##$LEV0= 0
##$LPBIN= 0
##$MAXI= 10000
##$MC2= 0
##$MEAN= 0
##$ME_mod= 0
##$MI= 0
##$NCOEF= 0
##$NC_proc= -2
##$NLEV= 6
##$NOISF1= 0
##$NOISF2= 0
##$NSP= 0
##$NTH_PI= 0
##$NZP= 0
##$OFFSET= 14.96076
##$PC= 1
##$PHC0= 0.6921387
##$PHC1= 0
##$PH_mod= 1
##$PKNL= yes
##$PPARMOD= 0
##$PPDIAG= 0
##$PPIPTYP= 0
##$PPMPNUM= 2147483647
##$PPRESOL= 1
##$PSCAL= 4
##$PSIGN= 0
##$PYNMP= <proc.py>
##$REVERSE= no
##$SF= 400.020009733297
##$SI= 131072
##$SIGF1= 0
##$SIGF2= 0
##$SINO= 400
##$SIOLD= 131072
##$SPECTYP= <>
##$SREGLST= <1H.CDCl3>
##$SSB= 0
##$STSI= 131072
##$STSR= 0
##$SW_p= 8223.68421052631
##$SYMM= 0
##$S_DEV= 0
##$TDeff= 65536
##$TDoff= 0
##$TI= <>
##$TILT= no
##$TM1= 0
##$TM2= 0
##$TOPLEV= 0
##$USERP1= <user>
##$USERP2= <user>
##$USERP3= <user>
##$USERP4= <user>
##$USERP5= <user>
##$WDW= 1
##$XDIM= 131072
##$YMAX_p= 431529810
##$YMIN_p= -12859
##$CURPLOT= <Network HP LaserJet P1505>
##$CURPRIN= <$Network HP LaserJet P1505>
##$DFORMAT= <normdp>
##$LAYOUT= <+/1D_H.xwp>
##$LFORMAT= <normlp>
##$PFORMAT= <normpl>
##$SURQMSG= 1
$$ End of Bruker specific parameters
$$ ---------------------------------
##NTUPLES= NMR SPECTRUM
##VAR_NAME=  FREQUENCY,     SPECTRUM/REAL,   SPECTRUM/IMAG
##SYMBOL=    X,             R,               I
##VAR_TYPE=  INDEPENDENT,   DEPENDENT,       DEPENDENT
##VAR_FORM=  AFFN,          ASDF,            ASDF
##VAR_DIM=   131072,        131072,          131072
##UNITS=     HZ,            ARBITRARY UNITS, ARBITRARY UNITS
##FACTOR=    0.0627417313425164, 1,          1
##FIRST=     8223.62146879497, 590,          -56423
##LAST=      0,             1747,            -56406
##MIN=       0,             -12859,          0
##MAX=       8223.62146879497, 431529810,    0
$$ Real data points
##PAGE= N=1
##DATA TABLE= (X++(R..R)), XYDATA
$$ [...]
63954H01678M3009M9216N6138O4535P5000Q7357J00816J14779J29367J45124J62235
63943A829254J80037J97203K12283K24382K33617K40736K45915K47921K44764
63934C856112K35112K18786J96198J68112J35932J01409O5597K8659r111m6766
63924D950040q3527j19256j53388j84018k08940k27233k39219k45317k45938k42106
63914C001098k35055k25225k12495j97381j81057j64193j46767j29215j12669
63905A397041r7776q4226p1894o1553n3767m7856m2627l7625l3000k8785k5014
63894H12918k2137k0534j9837j9348j8886j8637j8440j7935j7266j6960j7033
63883F05905j6823j5778j3965j1751r448p362n710m248k321M28L543O138P717
$$ y = [801678, 844687, 893903, 950041, 1014576, 1089576, 1176933, 1277749, 1392528, 1521895, 1667019, 1829254, 2009291, 2206494, 2418777, 2643159, 2876776, 3117512, 3363427, 3611348, 3856112, 4091224, 4310010, 4506208, 4674320, 4810252, 4911661, 4977258, 5005917, 4996806, 4950040, 4866513, 4747257, 4593869, 4409851, 4200911, 3973678, 3734459, 3489142, 3243204, 3001098, 2766043, 2540818, 2328323, 2130942, 1949885, 1785692, 1638925, 1509710, 1397041, 1299265, 1215039, 1143145, 1081592, 1027825, 979969, 937342, 899717, 866717, 837932, 812918, 790781, 770247, 750410, 731062, 712176, 693539, 675099, 657164, 639898, 622938, 605905, 589082, 573304, 559339, 547588, 538140, 530778, 525068, 520820, 518499, 518927, 522470, 528608, 536325]
63870E36325Q498R001R557J0179J0800J1380J1775J1756J1336J0885J0635J0272
63858F62399R344P946O542N195L546J554k92j708l024m632o469q260r820j1018
63844F51303j1855j2784j4332j6266j7724j8343j8553j8548j8013j7215j7205
63833D70465j8109j8355j6759j4499j3575j3932j3721j2153j0431r665r392q700
63821C11174p514o238n082m364m601n558o035n246l828k812k230j503o79l85p65
63806B54334j237j263q15j47L74K79n99j699k197j973j731k006k510k713k667
63791B33430k825l161l061k185j034l24j37j21k51q17j647k053j765j344j260
63776B11445j164n47K75N63K28j04O3O82J429J812J225m06k100k623j817o18J32
$$ y = [536325, 544823, 553824, 563381, 573560, 584360, 595740, 607515, 619271, 630607, 641492, 652127, 662399, 671743, 679689, 686231, 691426, 694972, 696526, 696234, 694526, 691502, 686870, 680401, 672141, 662321, 651303, 639448, 626664, 612332, 596066, 578342, 559999, 541446, 522898, 504885, 487670, 470465, 452356, 434001, 417242, 402743, 389168, 375236, 361515, 349362, 338931, 329266, 319874, 311174, 303660, 297422, 292340, 287976, 283375, 277817, 271782, 266536, 262708, 259896, 257666, 256163, 255484, 255099, 254334, 253097, 251834, 251019, 250872, 251246, 251525, 250926, 249227, 247030, 245057, 243326, 241320, 238810, 236097, 233430, 230605, 227444, 224383, 222198, 221164, 220840, 220703, 220582, 220331, 219514, 217867, 215814, 214049, 212705, 211445, 210281, 209734, 210009, 210572, 210800, 210696, 210759, 211441, 212870, 214682, 215907, 215501, 213401, 210778, 208961, 208343, 208475]
63759B08475K81r3q81j579j476n22N37J062J058P56L42J80O25J354J586J215J009
63742B13929J440K021K190K118K099J897J367J102J657K535K771K296J927K064
63728B41413K133J590Q70R85K386M412N940O421O208N877N509M868L999L167K324
63713B98102J221K3p84j157j559k165k670k955l281l545l209k269j542j446j293
63698B71471l70R65J917K321K369J968J181P63J347K439L141L417L728L852L124
63683C03633J772Q28O88P56O59P74J274J562J159M44J7q1m5K92J119K047K398
63666C19296K034J502J311J313R47oj086j796k396l585n277o283n771m499l912
63651B91792m282m517l756k313r84j45J45j23o57p88p6J184K262K650K358J866
$$ y = [208475, 208756, 208663, 207782, 206203, 204727, 204205, 204742, 205804, 206862, 207618, 207960, 208140, 208765, 210119, 211705, 212920, 213929, 215369, 217390, 219580, 221698, 223797, 225694, 227061, 228163, 229820, 232355, 235126, 237422, 239349, 241413, 243546, 245136, 246006, 246991, 249377, 253789, 259729, 266150, 272358, 278235, 283744, 288612, 292611, 295778, 298102, 299323, 299346, 298562, 297405, 295846, 293681, 291011, 288056, 284775, 281230, 278021, 275752, 274210, 272764, 271471, 271101, 272066, 273983, 276304, 278673, 280641, 281822, 282585, 283932, 286371, 289512, 292929, 296657, 300509, 303633, 305405, 306233, 306921, 307677, 308336, 309110, 310384, 311946, 313105, 313549, 313566, 313485, 313440, 313732, 314851, 316898, 319296, 321330, 322832, 324143, 325456, 326403, 326397, 325311, 323515, 321119, 317534, 312257, 305974, 300203, 295704, 291792, 287510, 282993, 279237, 276924, 275940, 275795, 275940, 275817, 275160, 274372, 274296, 275480, 277742, 280392, 282750, 284616]
63635B84616J867K664L780M439M515M538M797M961M808M741N208O034O816P656
63621C51440Q953J0620J2073J3021J3939J5501J7776K0142K2021K3489K5081K7077
63609E61133K9232L1307L3520L6158L8795M0259L9465L6144L0798K4159J6809
63598I17779R194J952l991p911r953j0984j1628j1770j1260j0702j1124j3120
63586H26482j6583k1006k5509k8968l0697l0894l0022k8164k5465k2740k0735
63575E45699j9029j6645j3565j0659q156n402k330O2J197J842K944M369N535O450
63561D92312P415Q291Q897R575J0626J1675J2317J3004J4475J6698J9116K1619
63549F46020K4552K7994L1862L6353M1380M5723M7686M6539M2488L5491K5367
$$ y = [284616, 286483, 289147, 292927, 297366, 301881, 306419, 311216, 316177, 320985, 325726, 330934, 336968, 343784, 351440, 360393, 371013, 383086, 396107, 410046, 425547, 443323, 463465, 485486, 508975, 534056, 561133, 590365, 621672, 655192, 691350, 730145, 770404, 809869, 846013, 876811, 900970, 917779, 926973, 928925, 924934, 917023, 907070, 896086, 884458, 872688, 861428, 850726, 839602, 826482, 809899, 788893, 763384, 734416, 703719, 672825, 642803, 614639, 589174, 566434, 545699, 526670, 510025, 496460, 485801, 477645, 472243, 469913, 469975, 471172, 473014, 475958, 480327, 485862, 492312, 499727, 508018, 516915, 526490, 537116, 548791, 561108, 574112, 588587, 605285, 624401, 646020, 670572, 698566, 730428, 766781, 808161, 853884, 901570, 948109, 990597, 1026088, 1051455]
63538A051455J3266J783p015j2882j6324j7288j5694j2549r478p446o699p605
63526I53524j0599j5340k0734k5998l1080l5838l9486m1198m0896l9115l6482
63515F16758l3562l0836k8405k5910k3072k0147j7505j5033j2487j0259r078q876
63503C81588q599p443n795m541l958l717l549l281k549j221j2J47n95j054o22
63488C34799o0k62r04r90l23L51O17R80J976L274M115M282M224M265M152L535
63472C64031K580J740J077J31j358k960m037m475m678m918n011m645l780k698
63458C30999j807j360j179p71J02J070J644J819J880J855J743K103L614N905P637
63443C55254Q066P969Q548R946J1434J2621J3876J5635J7904K0431K2948K5134
$$ y = [1051455, 1064721, 1066504, 1059489, 1046607, 1030283, 1012995, 997301, 984752, 975274, 967828, 961129, 953524, 942925, 927585, 906851, 880853, 849773, 813935, 774449, 733251, 692355, 653240, 616758, 583196, 552360, 523955, 498045, 474973, 454826, 437321, 422288, 409801, 399542, 390464, 381588, 372989, 365546, 359751, 355210, 351252, 347535, 343986, 340705, 338156, 336935, 336923, 337070, 336475, 335421, 334799, 334739, 334477, 333573, 332583, 332260, 332611, 333228, 334208, 336184, 339458, 343573, 347855, 352079, 356344, 360496, 364031, 366611, 368351, 369428, 369559, 368201, 365241, 361204, 356729, 352051, 347133, 342122, 337477, 333697, 330999, 329192, 327832, 326653, 325882, 325984, 327054, 328698, 330517, 332397, 334252, 335995, 338098, 341712, 347617, 355254, 363320, 371289, 379837, 389783, 401217, 413838, 427714, 443349, 461253, 481684, 504632, 529766]
63431E29766K6600K6939K5815K3180J9603J6113J3563J2245J2189J3452J5849
63420G35314J8868K2219K6198L1080L6481M1659M6075M9099M9573M6476L9966
63409A143008L1213K1238J0638L92p943j3283j5781j6234j5276j3568j2268j2607
63397A099529j4973j8786k3298k8199l3347l8145m1550m2812m2216m0818l9322
63386G36063l7365l4221l0002k5763k2358j9600j6770j3622j0563p938n580l123
63374E09158n49J783L648N288P146R294J1344J2938J4166J5379J6839J8685K0992
63361F46111K3629K6166K8324L0387L2924L6077L9435M2495M4920M6206M5484
63350A042158M1942L5414K6600J6791P335r28p753j3028j6366j7471j6766j5343
$$ y = [529766, 556366, 583305, 609120, 632300, 651903, 668016, 681579, 693824, 706013, 719465, 735314, 754182, 776401, 802599, 833679, 870160, 911819, 957894, 1006993, 1056566, 1103042, 1143008, 1174221, 1195459, 1206097, 1206489, 1198546, 1185263, 1169482, 1153248, 1137972, 1124404, 1112136, 1099529, 1084556, 1065770, 1042472, 1014273, 980926, 942781, 901231, 858419, 816203, 775385, 736063, 698698, 664477, 634475, 608712, 586354, 566754, 549984, 536362, 525799, 517861, 512281, 509158, 508609, 510392, 514040, 519328, 526474, 535768, 547112, 560050, 574216, 589595, 606434, 625119, 646111, 669740, 695906, 724230, 754617, 787541, 823618, 863053, 905548, 950468, 996674, 1042158, 1084100, 1119514, 1146114, 1162905, 1170240, 1169312, 1161559, 1148531, 1132165, 1114694, 1097928, 1082585]
63338A082585j4217j3984j5115j8077k2768k8217l3157l6873l9280m0427m0180
63327G80290l8460l5555l2099k8694k5454k1986j8010j3894j0408p936o318n526
63315E35950o082q434j2100j5731j8008j8438j7459j5977j4635j3359j1635r304
63303C74788o908n120m111l584l163k522j422q1P15L70p94j987k990m172n462
63288C33557o072n550m545m012m028l906l244k307j504r38n72l50j45J47L64K31
63272B97126k22o29p60o63l44L24J182J660J407P92N57J103K244L389L831L239
63256C14236K184J831K716M097M828M638M094L682L558L973N149O624P540P747
63242C76897Q004Q832R824J0450J0956J1922J3345J4787J6106J7504J8913J9913
$$ y = [1082585, 1068368, 1054384, 1039269, 1021192, 998424, 970207, 937050, 900177, 860897, 820470, 780290, 741830, 706275, 674176, 645482, 620028, 598042, 580032, 566138, 555730, 547794, 541476, 535950, 529868, 521434, 509334, 493603, 475595, 457157, 439698, 423721, 409086, 395727, 384092, 374788, 367880, 362760, 358649, 355065, 351902, 349380, 347958, 347877, 348592, 348962, 348168, 346181, 343191, 339019, 333557, 327485, 321935, 317390, 313378, 309350, 305444, 302200, 299893, 298389, 297451, 296879, 296529, 296384, 296531, 296895, 297126, 296904, 296275, 295515, 294852, 294508, 294832, 296014, 297674, 299081, 299873, 300430, 301533, 303777, 307166, 310997, 314236, 316420, 318251, 320967, 325064, 329892, 334530, 338624, 342306, 345864, 349837, 354986, 361610, 369150, 376897, 384901, 393733, 403557, 414007, 424963, 436885, 450230, 465017, 481123, 498627, 517540, 537453]
63230E37453K0222J9953J9384J8780J8365J8201J8122J7956J7750J7627J7572
63219G41385J7623J8010J8824J9665J9987J9567J8370J6143J2647Q228L679n72
63207I13556m729r016j3192j6819j9703k1855k3196k3497k2588k0574j7888j5069
63195G05430j2388r688o768l781j078J265L470N646P661R480J1383J3673J6251
63182G40556J8599K0158K0807K1031K1499K2375K3137K3193K2538K1621K0763
63171I76277J9947J9028J7843J6201J4032J1412Q226M061j186o846j2112j6990
63159A049893k2025k7131l1443l4438l6487l7930l8338l7197l4905l2373k9964
63148F87662k7399k4638k2103j9952j7762j5194j2644j0759r563q508p300o273
$$ y = [537453, 557675, 577628, 597012, 615792, 634157, 652358, 670480, 688436, 706186, 723813, 741385, 759008, 777018, 795842, 815507, 835494, 855061, 873431, 889574, 902221, 910449, 914128, 913556, 908827, 899811, 886619, 869800, 850097, 828242, 805046, 781549, 758961, 738387, 720499, 705430, 693042, 683354, 676586, 672805, 671727, 672992, 676462, 682108, 689769, 699249, 710632, 724305, 740556, 759155, 779313, 800120, 821151, 842650, 865025, 888162, 911355, 933893, 955514, 976277, 996224, 1015252, 1033095, 1049296, 1063328, 1074740, 1082966, 1087027, 1085841, 1078995, 1066883, 1049893, 1027868, 1000737, 969294, 934856, 898369, 860439, 822101, 784904, 749999, 717626, 687662, 660263, 635625, 613522, 593570, 575808, 560614, 547970, 537211, 527648, 519140, 511840, 505567]
63136E05567n764n533n094m385l692l031k060o48Q79K220L381M313M728M570M330
63121D99781M473M888N234N478N631N370M573L862L870M169L740K465J246O28
63107E55408K22k84n37l24r1j34k3M97P67J64p05p28R9O28R5j063j911j918j074
63088E49088J96J090R27j33j153j340o88L29J366K355L324M227M893N145N070
63073E74696N050N336N748O094O671P860R385J0523J1147J1970J3470J5141J6226
63060F99317J6882J8054K0283K3132K5812K8048L0151L2479L5045L7550L9684
63049A006437M1428M3109M5033M7024M8391M8547M7637M6377M5320M4436M3567
63038A507306M2943M2965M3510M3855M3409M2309M1044L9584L7105L2628K5844
$$ y = [505567, 499803, 494270, 489176, 484791, 481099, 478068, 476008, 475360, 476239, 478459, 481840, 486153, 490881, 495451, 499781, 504254, 509142, 514376, 519854, 525485, 530855, 535428, 539290, 543160, 547329, 551069, 553534, 554780, 555408, 555630, 555346, 554809, 554485, 554394, 554260, 554237, 554734, 555501, 555665, 554960, 554232, 554331, 554959, 555054, 553991, 552080, 550162, 549088, 549284, 550374, 551301, 551168, 550015, 548675, 547987, 548316, 549682, 552037, 555361, 559588, 564481, 569626, 574696, 579746, 585082, 590830, 596924, 603595, 611455, 620840, 631363, 642510, 654480, 667950, 683091, 699317, 716199, 734253, 754536, 777668, 803480, 831528, 861679, 894158, 929203, 966753, 1006437, 1047865, 1090974, 1136007, 1183031, 1231422, 1279969, 1327606, 1373983, 1419303, 1463739, 1507306, 1550249, 1593214, 1636724, 1680579, 1723988, 1766297, 1807341, 1846925, 1884030, 1916658, 1942502]
63027A942502J7281P736k353j2893k3560l3577m2188m9208n4747n8544n9993n8980
63015A571476n6204n2471m7891m2162l5373k8164k1102j4354p949j965L777R874
63003A277492J6692K3599K9270L2977L5293L7282L9199M0458M0791M0779M1014
62992A654846M1276M1031M0269L9284L7898L5675L2763K9662K6096K0969J3738
62981B013507N097m148j4063k4818l5550m4948n2734n9644o6006p1084p3954p4405
62969A497250p2820o9741o5796o1567n7202n2479m7474m2780l8888l5638l2606
62958I20259k9765k7403k5556k3892k2097k0134j8258j6952j6756j7702j8948
62947F82796j9313j8323j6541j4828j3516j2443j1463j0653j0105r781r539r137
$$ y = [1942502, 1959783, 1967519, 1965166, 1952273, 1928713, 1895136, 1852948, 1803740, 1748993, 1690449, 1630456, 1571476, 1515272, 1462801, 1414910, 1372748, 1337375, 1309211, 1288109, 1273755, 1265806, 1263841, 1267618, 1277492, 1294184, 1317783, 1347053, 1380030, 1415323, 1452605, 1491804, 1532262, 1573053, 1613832, 1654846, 1696122, 1737153, 1777422, 1816706, 1854604, 1890279, 1923042, 1952704, 1978800, 1999769, 2013507, 2018604, 2014456, 2000393, 1975575, 1940025, 1895077, 1842343, 1782699, 1716693, 1645609, 1571655, 1497250, 1424430, 1354689, 1288893, 1227326, 1170124, 1117645, 1070171, 1027391, 988503, 952865, 920259, 890494, 863091, 837535, 813643, 791546, 771412, 753154, 736202, 719446, 701744, 682796, 663483, 645160, 628619, 613791, 600275, 587832, 576369, 565716, 555611, 545830, 536291, 527154]
62935E27154q368p296o290n612n094m433l658k968k351j736j398j586j838j378
62921D73148l03L81K18r9l4k29j394k839l251k558j925k027k392k497k492k575
62905D49132k586k465k444k487k300k066k348l058l349k844k127j627r78j4N49
62890D18988J49o66j083j104j036o26L48J209J164N28K23M18N80N42N09L13l16
62873D20140q42m36N96R28r3j723k897l134k372q07P25J180M61m51p76o70l97
62856D09432K36J269K053K038J569J357J553J794J847J715J387Q47K46k43n98
62841D26502q41r62j041j212j423j488j456j567j878k227k510k596k085p89N99
62826D05026J100P48N90J118J648J559J378J866K769L191K875K404K340K767L470
$$ y = [527154, 518786, 511490, 505200, 499588, 494494, 490061, 486403, 483435, 481084, 479348, 477950, 476364, 474526, 473148, 472845, 473226, 473444, 473345, 473311, 473082, 471688, 468849, 465598, 463040, 461115, 459088, 456696, 454199, 451707, 449132, 446546, 444081, 441637, 439150, 436850, 434784, 432436, 429378, 426029, 423185, 421058, 419431, 418453, 418439, 418988, 419137, 418471, 417388, 416284, 415248, 414622, 414970, 416179, 417343, 417871, 418094, 418512, 419092, 419634, 420143, 420456, 420140, 419298, 418862, 419458, 420386, 420293, 418570, 415673, 412539, 410167, 409360, 410085, 411265, 411726, 411275, 410499, 409829, 409432, 409668, 410937, 412990, 415028, 416597, 417954, 419507, 421301, 423148, 424863, 426250, 427097, 427343, 427100, 426502, 425661, 424699, 423658, 422446, 421023, 419535, 418079, 416512, 414634, 412407, 409897, 407301, 405216, 404427, 405026, 406126, 406874, 407464, 408582, 410230, 411789, 413167, 415033, 417802, 420993, 423868, 426272, 428612, 431379, 434849]
62811D34849M072M188L849L608L862M343M602M691M937N329N695O170P028Q204
62797E05427R428J0628J1802J2701J3163J3563J4376J5537J6735J8244K0751K4370
62785F86725K8406L2252L6045M0274M5128N0385N5658O0607O5079O9094P2504
62774A242157P4795P5480P4565P2232O8177O1736N2736M1800K9687J6755L190
62763A813310j0487k3476l5100m5072n3486o0552o6198o9939p1391p0885o9336
62752A237388o7485o5436o2896n9590n5464n0800m6242m2311l8839l5190l1212
62741F81923k7567k4880k2820k0464j7471j4423j2024j0338q972p716o618n605
62729E03025m376k819j251q0O32J076J359J475J556J857K493L484M975P105R535
$$ y = [434849, 438921, 443109, 446958, 450566, 454428, 458771, 463373, 468064, 473001, 478330, 484025, 490195, 497223, 505427, 514855, 525483, 537285, 549986, 563149, 576712, 591088, 606625, 623360, 641604, 662355, 686725, 715131, 747383, 783428, 823702, 868830, 919215, 974873, 1035480, 1100559, 1169653, 1242157, 1316952, 1392432, 1466997, 1539229, 1607406, 1669142, 1721878, 1763678, 1793365, 1810120, 1813310, 1802823, 1779347, 1744247, 1699175, 1645689, 1585137, 1518939, 1449000, 1377609, 1306724, 1237388, 1169903, 1104467, 1041571, 981981, 926517, 875717, 829475, 787164, 748325, 713135, 681923, 654356, 629476, 606656, 586192, 568721, 554298, 542274, 531936, 522964, 515248, 508630, 503025, 498649, 495830, 494579, 494499, 495131, 496207, 497566, 499041, 500597, 502454, 504947, 508431, 513406, 520511, 530046]
62714E30046J1533J2772J3809J5433J7761K0241K2516K4938K8134L2180L6448
62703G65811M0273M3794M7868N3052N8874O4392O9305P3976P8462Q2120Q4361
62692A462288Q5163Q4550Q2054P7197P0097O1114N0192L6999K1596M561j3221
62681B022590l0513m5846n8325o8264p6502q3131q7418q8896q7970q5412q1708
62670A228605p7074p1724o6011o0455n5561n1381m7366m3066l8760l5007l1760
62659F50440k8445k4863k1441j8588j6286j4398j2886j1634j0556r886r847j0014
62647D61596r628q623p715p286o921o231n467m880m137k961j739r56l93M26J332
62632C96417J684J266M73l02r44j386j573j670j874k036j841j265o03j03J55J78
$$ y = [530046, 541579, 554351, 568160, 583593, 601354, 621595, 644111, 669049, 697183, 729363, 765811, 806084, 849878, 897746, 950798, 1009672, 1074064, 1143369, 1217345, 1295807, 1377927, 1462288, 1547451, 1632001, 1714055, 1791252, 1861349, 1922463, 1972655, 2009654, 2031250, 2035811, 2022590, 1992077, 1946231, 1887906, 1819642, 1743140, 1660009, 1572591, 1483695, 1395725, 1310313, 1228605, 1151531, 1079807, 1013796, 953341, 897780, 846399, 799033, 755967, 717207, 682200, 650440, 621995, 597132, 575691, 557103, 540817, 526419, 513533, 501899, 491343, 481457, 471610, 461596, 451968, 443345, 435630, 428344, 421423, 415192, 409725, 404845, 400708, 397747, 396008, 395052, 394659, 395085, 396417, 398101, 399367, 399840, 399538, 398594, 397208, 395635, 393965, 392091, 390055, 388214, 386949, 386346, 386243, 386398, 386576]
62616C86576J78O32J763L076L850M077M485N583P084Q320Q895Q902Q794R123J0121
62601D71459J1504J2907J4464J6596J9281K1985K4350K6524K8716L0841L2834
62590G11461L4791L6468L7036L5760L2757K8716K4005J8453J1922M731k523r352
62578I64225j5505k0920k5611k9482l2276l3785l4117l3595l2441l0701k8495
62567F47297k6170k4094k2356k0758j9073j7313j5647j4120j2525j0691q766p048
62555D48736n559m085k744k127k583l529l883l161j848o39K95J092J628J567J006
62540D24166O36J055J998K583K346J829J905K658L288L122K447K122K625L793
62526D56573N307P009Q752J0345J1835J3655J6279J9706K3395K6644K9167L1431
$$ y = [386576, 386754, 387386, 389149, 392225, 396075, 400152, 404637, 410220, 417304, 425624, 434519, 443421, 452215, 461338, 471459, 482963, 495870, 510334, 526930, 546211, 568196, 592546, 619070, 647786, 678627, 711461, 746252, 782720, 819756, 855516, 888273, 916989, 940994, 959447, 971369, 976100, 973577, 964225, 948720, 927800, 902189, 872707, 840431, 806646, 772529, 738934, 706493, 675792, 647297, 621127, 597033, 574677, 553919, 534846, 517533, 501886, 487766, 475241, 464550, 455784, 448736, 443177, 439092, 436348, 434221, 431638, 428109, 424226, 421065, 419217, 418578, 418873, 419965, 421593, 423160, 424166, 424802, 425857, 427855, 430438, 432784, 434613, 436518, 439176, 442464, 445586, 448033, 450155, 452780, 456573, 461880, 468889, 477641, 487986, 499821, 513476, 529755, 549461, 572856, 599500, 628667, 660098]
62514F60098L4307L8226M2637M6481M9169N0825N1648N1400M9655M6294M1528
62503A162268L5653K8836K1110J2582L794m287j0989j6540k1495k5638k8063k8352
62491A128879k6949k4202j9951j4487q920l839J690Q734J6649K3685K9055L3356
62479A143700L7195M0606M3737M6699M8492M7308M2452L4982K6137J6164N356
62468A532828n051j4013k2098l0773m0613n0746n9585o5486o7478o6236o3872
62457A046877o1919n9853n6339n1326m5952m0811l5571l0161k5122k0771j6945
62446F02107j3711j1390r699p803n427l078j008J125L258M519M445L814L705M195
62432E75052M499L920K219m84l602o201p770q673r456j0038j0004r424q861q657
$$ y = [660098, 694405, 732631, 775268, 821749, 870918, 921743, 973391, 1024791, 1074446, 1120740, 1162268, 1197921, 1226757, 1247867, 1260449, 1264243, 1259956, 1248967, 1232427, 1210932, 1185294, 1157231, 1128879, 1101930, 1077728, 1057777, 1043290, 1034370, 1030531, 1032221, 1040955, 1057604, 1081289, 1110344, 1143700, 1180895, 1221501, 1265238, 1311937, 1360429, 1407737, 1450189, 1485171, 1511308, 1527472, 1532828, 1527777, 1513764, 1491666, 1460893, 1420280, 1369534, 1309949, 1244463, 1176985, 1110749, 1046877, 984958, 925105, 868766, 817440, 771488, 730677, 695106, 664945, 639823, 619052, 602107, 588396, 577006, 567307, 559504, 554077, 550999, 549991, 551116, 554374, 558893, 563338, 567152, 570857, 575052, 579551, 583471, 585690, 585206, 581604, 575403, 567633, 558960, 549504, 539466, 529462, 520038, 511177, 502520]
62418E02520q613q354p757o998o345n835n207m293l428l144l422l665l530l298
62404D28631l245l138k660j950j367r51n07O4P31J439K046K341K322K167J916
62389D27839J547J400J901K683K759J936J415K322M236N846O603O960P310P649
62375D82406Q116R021J0181J0972J1179J1287J1783J2705J3927J5451J7211J9063
62363F33302K1160K3914K7468L1461L5550L9885M4812N0260N5617O0240O3919
62352A087588O6723O8277O7464O3288N6052M7096L7273K6410J4614L216o427j4528
62340A517046k2306l0148l7328m3317m8227n1871n3545n3132n1519m9434m6714
62329A029505m3122l9106l5157l1030k6435k2013j8922j7513j7030j6533j5822
$$ y = [502520, 493907, 485553, 477796, 470798, 464453, 458618, 453411, 449118, 445690, 442546, 439124, 435459, 431929, 428631, 425386, 422248, 419588, 417638, 416271, 415320, 414813, 414877, 415608, 417047, 419093, 421434, 423756, 425923, 427839, 429386, 430786, 432687, 435370, 438129, 440065, 441480, 443802, 448038, 453884, 460487, 467447, 474757, 482406, 490522, 499543, 509724, 520696, 531875, 543162, 554945, 567650, 581577, 597028, 614239, 633302, 654462, 678376, 705844, 737305, 772855, 812740, 857552, 907812, 963429, 1023669, 1087588, 1154311, 1222588, 1290052, 1353340, 1409392, 1456488, 1493761, 1520171, 1534785, 1538001, 1531574, 1517046, 1494740, 1464592, 1427264, 1383947, 1335720, 1283849, 1230304, 1177172, 1125653, 1076219, 1029505, 986383, 947277, 912120, 881090, 854655, 832642, 813720, 796207, 779177, 762644, 746822]
62318G46822j5485j6257j8150k0084k0697j9693j8034j6655j5492j4093j2563
62307E59619j1326j0327r149p698o200m658k924j196R6R36J799K978M257N318
62293E21525O092O602O819O779O607O295N700M883M209L910L713L170K325J799
62279E90428K000K421K127J023K14O56J902K772L118L993O010Q440J0364J1880
62265F47348J3543J5309J6898J8754K1655K5609K9926L4338L9217M4772N0677
62254I58046N6566O2159O6872O9935P0955O9712O5562N7858M7181L5235K3317
62243A583398J1692O30r099j7377k5351l3960m2590n0074n6328o1834o5963o7240
62231A165904o5335o1634n7514n3076m7942m2470l7522l3522l0258k7311k4275
$$ y = [746822, 731337, 715080, 696930, 676846, 656149, 636456, 618422, 601767, 586275, 572182, 559619, 548293, 537966, 528817, 521119, 514919, 510261, 507337, 506141, 506237, 507173, 508972, 511950, 516207, 521525, 527617, 534219, 541038, 547817, 554424, 560719, 566419, 571302, 575511, 579421, 583134, 586304, 588629, 590428, 592428, 594849, 596976, 597999, 598213, 598869, 600771, 603543, 606661, 610654, 616664, 625104, 635468, 647348, 660891, 676200, 693098, 711852, 733507, 759116, 789042, 823380, 862597, 907369, 958046, 1014612, 1076771, 1143643, 1213578, 1284533, 1354245, 1419807, 1477665, 1524846, 1560081, 1583398, 1595090, 1595720, 1586621, 1569244, 1543893, 1509933, 1467343, 1417269, 1360941, 1299107, 1233144, 1165904, 1100569, 1038935, 981421, 928345, 880403, 837933, 800411, 766889, 736631, 709320, 685045]
62220F85045k0927j7587j4959j3285j1931j0214q329o999o439o193n868n435m862
62207E52017m020l071k484k386k216j300L81K199L529M205M533M948N641O402
62193E68378O952P395Q114R154J0041J0387J0507J1085J2345J3806J4749J4784
62181F97697J4033J3025J2282J1814J1108R814Q244P004O359O371P339R543J2645
62168H27278J6056J9918K4967L1142L7118M1704M5131M8243N0908N1947N0397
62157A244809M6120L9262L0079J9481R124M39o249j1579j6418k1423k6913l2743
62145A273989l8320m2852m5702m6628m5815m3632m0338l6150l1619k7465k3754
62134H51714j9756j5119j0826q233p296o626n371m167l924m401m526l697k165
$$ y = [685045, 664118, 646531, 631572, 618287, 606356, 596142, 587813, 580814, 574375, 568182, 562314, 556879, 552017, 547997, 544926, 542442, 540056, 537840, 536540, 536921, 539120, 542649, 546854, 551387, 556335, 561976, 568378, 575330, 582725, 590839, 599993, 610034, 620421, 630928, 642013, 654358, 668164, 682913, 697697, 711730, 724755, 737037, 748851, 759959, 769773, 778017, 785021, 791380, 797751, 805090, 814633, 827278, 843334, 863252, 888219, 919361, 956479, 998183, 1043314, 1091557, 1142465, 1194412, 1244809, 1290929, 1330191, 1360270, 1379751, 1388875, 1389314, 1383065, 1371486, 1355068, 1333645, 1306732, 1273989, 1235669, 1192817, 1147115, 1100487, 1054672, 1011040, 970702, 934552, 902933, 875468, 851714, 831958, 816839, 806013, 797780, 790484, 783858, 778487, 774320, 770396, 765995, 761469, 757772, 755607]
62121G55607m42J198K806M513O079O619N225K090j410m018n563o306n982m261
62107G56155j876m97j269l822o792q980r990j0081r658q891p744o227m441k475
62093F73412n24J005J857K422L267M206M444L877L471L997N077O048P044Q536
62079G28139J0400J2214J4041J5991J7496J7995J8132J9189K1249K3024K3658
62068I21528K3793K4501K5915K7372K8396K9233L0653L3204L6266L7976L6744
62057A255581L2842K7808K2401J6064Q517P90n854j1243j6031k0746k5608l0729
62045A253792l5905m0536m4112m6492m7572m7249m5950m4506m3066m0842l7402
62034G80160l3608l0602k8395k6137k3372k0393j7641j5399j3818j2750j1711
$$ y = [755607, 755165, 756363, 759169, 763682, 769761, 776380, 781605, 783695, 782285, 778267, 772704, 766398, 760416, 756155, 754279, 753782, 752513, 748691, 741899, 732919, 722929, 712848, 703190, 694299, 686555, 680328, 675887, 673412, 672888, 673893, 675750, 678172, 681439, 685645, 690089, 693966, 697437, 701434, 706511, 712559, 719603, 728139, 738539, 750753, 764794, 780785, 798281, 816276, 834408, 853597, 874846, 897870, 921528, 945321, 969822, 995737, 1023109, 1051505, 1080738, 1111391, 1144595, 1180861, 1218837, 1255581, 1288423, 1316231, 1338632, 1354696, 1363213, 1364003, 1358149, 1346906, 1330875, 1310129, 1284521, 1253792, 1217887, 1177351, 1133239, 1086747, 1039175, 991926, 945976, 901470, 858404, 817562, 780160, 746552, 715950, 687555, 661418, 638046, 617653, 600012, 584613, 570795, 558045, 546334]
62023E46334j0431r184q296p708p401p614q140q054o851n368m754m919m903m423
62009D48288m002l767l175k040q70K9R30J960K754L144L531M194M764M851M678
61994D65269M698M824M446L194J446Rp32j340k752n072p289q456q737q802q730
61979D31976q191p367o815o534o056n453n287n448m975l441j698p86o86o51k60
61964C68328K97O27M58j44o00k67P38J591J838J888K163K357K085J713J949K828
61948C87849L688M028M029M234M994O169P232P814Q185Q899R980J0853J1208J1377
61934D90539J1677J1937J1990J2057J2163J1786J0612R179Q142P342O197M698
61922F08319L219J639n08l057n192o494p279p736p421n940l655j329O71K485M422
$$ y = [546334, 535903, 526719, 518423, 510715, 503314, 495700, 487560, 479506, 472655, 467287, 462533, 457614, 452711, 448288, 444286, 440519, 437344, 435304, 434434, 434463, 435393, 437353, 440107, 443251, 446782, 450976, 455740, 460591, 465269, 469967, 474791, 479237, 482431, 483877, 483886, 483154, 481814, 479062, 473990, 466701, 458245, 449508, 440706, 431976, 423785, 416418, 409603, 403069, 397013, 391560, 386273, 380825, 375850, 372409, 370711, 369925, 369239, 368588, 368328, 368625, 369252, 369710, 369566, 368966, 368699, 369437, 371028, 372866, 374754, 376917, 379274, 381359, 383072, 385021, 387849, 391537, 395565, 399594, 403828, 408822, 414991, 422223, 430037, 438222, 447121, 457101, 467954, 479162, 490539, 502216, 514153, 526143, 538200, 550363, 562149, 572761, 581940, 590082, 597424, 603621, 608319, 611538, 613177, 612669, 609612, 604420, 597926, 590647, 582911, 575490, 569550, 565895, 564566, 565237, 567722, 572144]
61907E72144O674R157J1428J2920J3488J3469J3032J1747R089N313J509j289k924
61894F75757m104n683p916j0190j1475j1232j0008q949q607q383p426n925n040
61881E70819n409o375o955p191p833r113j0442j1276j1531j1089r661p478n468
61868D60998m338l872l419k686j693m37R92K292L344M437N807P306Q824J0568
61854D88123J2518J4118J5114J6212J8168K0550K2191K2740K2925K3267K3460
61843F99386K3118K2342K1077J8653J4596R527M657N38l216o943j0187j2145j2611
61830G68792j2086j0939q820n305r18L049N859P990J0146J2118J3069J2589J0930
61817H06474Q354M911P29l918q826j3647j7579j9893k0748k0922k0712j9762j8066
$$ y = [572144, 578818, 587975, 599403, 612323, 625811, 639280, 652312, 664059, 673148, 678461, 679970, 678681, 675757, 671653, 665970, 658054, 647864, 636389, 625157, 615149, 606200, 597593, 589210, 581784, 575859, 570819, 565410, 559035, 552080, 544889, 537056, 527943, 517501, 506225, 494694, 483605, 473944, 466466, 460998, 456660, 452788, 449369, 446683, 444990, 444553, 445545, 447837, 451181, 455618, 461425, 468731, 477555, 488123, 500641, 514759, 529873, 546085, 564253, 584803, 606994, 629734, 652659, 675926, 699386, 722504, 744846, 765923, 784576, 799172, 808699, 813356, 813894, 810678, 803735, 793548, 781403, 768792, 756706, 745767, 736947, 731642, 730724, 733773, 739632, 747622, 757768, 769886, 782955, 795544, 806474, 814828, 819739, 820468, 816550, 807724, 794077, 776498, 756605, 735857, 714935, 694223, 674461, 656395]
61804F56395j6414j5480j5063j4656j4245j4026j3743j2925j1582j0131q756p337
61792E02037o011n211n065n091m788m184l624l218k829k503k505k890l252l186
61778D47680k741k250j859j501j256j275j334r00Q9R14Q56J02m48r8J085K465
61762D39529L294L241K792K869L746M649M778M356M083L933L325K299J561J233
61748D85688N37r13k330k866k811l094l958m876n395n441m989m133l394l301l573
61733D35151l325k228r60k61j8L48R22J192Q75M33N82J484K649L469L730L506
61717D47549K898K101J568J767K534L006K480J235K33oL9m55j688l124m116m427
61701D51594m244l923l765l834l903l770l599l709l987l888l185k450k360k860
$$ y = [656395, 639981, 624501, 609438, 594782, 580537, 566511, 552768, 539843, 528261, 518130, 509374, 502037, 496026, 490815, 485750, 480659, 475871, 471687, 468063, 464845, 462016, 459513, 457008, 454118, 450866, 447680, 444939, 442689, 440830, 439329, 438073, 436798, 435464, 434564, 434653, 435567, 436423, 436525, 436077, 435979, 437064, 439529, 442823, 446064, 448856, 451725, 455471, 460120, 464898, 469254, 473337, 477270, 480595, 482894, 484455, 485688, 486225, 485312, 482982, 480116, 477305, 474211, 470253, 465377, 459982, 454541, 449552, 445419, 442025, 438724, 435151, 431826, 429598, 428638, 428377, 428359, 428707, 429629, 430821, 431696, 432129, 432711, 434195, 436844, 440313, 444043, 447549, 450447, 452548, 454116, 455883, 458417, 461423, 463903, 465138, 465371, 465365, 465404, 464949, 463261, 460137, 456021, 451594, 447350, 443427, 439662, 435828, 431925, 428155, 424556, 420847, 416860, 412972, 409787, 407337, 404977, 402117]
61687D02117l382l682l908l976l559k784k317k476k777k677k279j954j682j246
61673C63418p31l84k46k65n41j009j242r44m11m1L04R64J748K127J969J571J160
61656C67447R18J245K293L345L468K769K299K590L031K887K268J745J601J796
61642C99702K225K653K738K395J901J466J042O07K52j30p61j466j773j657j687
61627D07507k132k456k124j434j123j416j891k092j933j652j554j745j975j926
61613C82054j692j626j749j745j646j986l017m230m977n131m890m368l748l434
61599C37815l620l992m162m145m120m015l693l239k842k610k650k943l020k285
61585B90479r44k7j28o33o81l08l2R7L34N43L84O8J33O27J062J118Q25K04o98
$$ y = [402117, 398735, 395053, 391145, 387169, 383610, 380826, 378509, 376033, 373256, 370579, 368300, 366346, 364664, 363418, 362687, 362303, 362057, 361792, 361251, 360242, 359000, 358056, 357645, 357604, 357908, 358872, 360620, 362747, 364716, 366287, 367447, 368365, 369610, 371903, 375248, 378716, 381485, 383784, 386374, 389405, 392292, 394560, 396305, 397906, 399702, 401927, 404580, 407318, 409713, 411614, 413080, 414122, 414729, 414981, 414851, 414090, 412624, 410851, 409194, 407507, 405375, 402919, 400795, 399361, 398238, 396822, 394931, 392839, 390906, 389254, 387700, 385955, 383980, 382054, 380362, 378736, 376987, 375242, 373596, 371610, 368593, 364363, 359386, 354255, 349365, 344997, 341249, 337815, 334195, 330203, 326041, 321896, 317776, 313761, 310068, 306829, 303987, 301377, 298727, 295784, 292764, 290479, 289535, 289508, 289380, 288747, 288066, 287758, 287726, 287823, 288157, 288700, 289084, 289152, 289285, 289912, 290974, 292092, 292917, 293121, 292423]
61566B92423j478j626j108k79N74J271J582J528J568J955K200J828J317J471K031
61551C05257J928Q63k54o26m23o2M44J032J238R02O38J032J782K153J962J607
61535C19473J326R74M11j66m03q7N75R93O87j95j015j292j000l60K64K96n96j887
61517C17998k561k324j872j767j678j154m89k23k37p7J38n0n24o54l15m4k9K82
61499C04420J216K172K418K113J876J762J316O36N30J332K195K091J164N37Q46
61484C26624J549J819J643J687K319L169L631L530L196L017K998K735J866M67
61470C60250r76k025k583k764k647k285j839j517j443j557j627j410r59p35j088
61455C34795j682j776j171m20L4M11R87J415J187M51j69l75k71R2P10J273J453
$$ y = [292423, 290945, 289319, 288211, 287932, 288506, 289777, 291359, 292887, 294455, 296410, 298610, 300438, 301755, 303226, 305257, 307185, 308048, 307794, 307168, 306745, 306683, 307127, 308159, 309397, 310299, 310937, 311969, 313751, 315904, 317866, 319473, 320799, 321773, 322184, 322018, 321615, 321528, 322103, 323096, 323783, 323588, 322573, 321281, 320281, 319921, 320185, 320481, 319885, 317998, 315437, 313113, 311241, 309474, 307796, 306642, 306153, 305930, 305693, 305616, 305754, 305704, 305180, 304526, 304211, 304167, 304138, 304420, 305636, 307808, 310226, 312339, 314215, 315977, 317293, 317929, 318459, 319791, 321986, 324077, 325241, 325778, 326624, 328173, 329992, 331635, 333322, 335641, 338810, 342441, 345971, 349167, 352184, 355182, 357917, 359783, 360250, 359274, 357249, 354666, 351902, 349255, 346970, 345131, 343614, 342171, 340614, 338987, 337577, 336618, 335883, 334795, 333113, 331337, 330166, 329746, 329780, 330191, 331178, 332593, 333780, 334231, 334062, 333687, 333416, 333508, 334218, 335491, 336944]
61438C36944J497J952K725L127K886K486K348K257J915J495J263J120R16Q31J031
61423C64793J213R93N34M13R29J816K592K942K840K488K074J551P85o6o46r10
61407C84341j193j598j811j734j745j938j664m74Q67J138K54p38j212j567k016
61392C68910j826m38J297J978J452Q98J091J482J285P20O16J238K206L308M598
61377C88815N641N448L696J487L86P83J687J969J353L01o04r82q39o04p53j229
61361D06555j543j524j544j832j942j345j71J051K137L215M076M264L887L735
61347D19019M257M895M853M160L496L113K567J640R60J293K433L286L120K398
61333D61490K097K429K592J881O49j73l15m25j014j609j439n74J85N18J031K195
$$ y = [336944, 338441, 340393, 343118, 346245, 349131, 351617, 353965, 356222, 358137, 359632, 360895, 362015, 362931, 363762, 364793, 366006, 366999, 367533, 367946, 368875, 370691, 373283, 376225, 379065, 381553, 383627, 385178, 385963, 385897, 385251, 384341, 383148, 381550, 379739, 378005, 376260, 374322, 372658, 372184, 373051, 374189, 374443, 373705, 372493, 370926, 368910, 367084, 366646, 367943, 369921, 371373, 372271, 373362, 374844, 376129, 376849, 377465, 378703, 380909, 384217, 388815, 394456, 399904, 403600, 405087, 405473, 406256, 407943, 409912, 411265, 411566, 410962, 409980, 409141, 408537, 407784, 406555, 405012, 403488, 401944, 400112, 398170, 396825, 396654, 397705, 399842, 403057, 407133, 411397, 415284, 419019, 423276, 428171, 433024, 437184, 440680, 443793, 446360, 448000, 448960, 450253, 452686, 455972, 459092, 461490, 463587, 466016, 468608, 470489, 471138, 470965, 470650, 470225, 469211, 467602, 466163, 465589, 465774, 466292, 467323, 469518]
61317D69518L420L709L034K470K966M435O109P425Q348R084R820J0600J1232J1398
61303E63568J0985J0333R896R621Q811O800L787Q16j241k510l755n199o241o408
61289E99263o173o374p170q062q745r286r563r195q213p150o281n294m082l202
61275E00473l089l178k494q97P54J691J975K144K473K713K466J721J074J258K326
61260E11410L569M332M652M897N081M972M643M388M198L716K820J854J215R51
61246E62698Q99R49J042J011N53m91j874k978l343l107k747k435j958j341j048
61231E45830j306j615j264j37J301K564L459M042M570N297O100O598O764O992
61217E89195P377P502P245P216P777Q262P921P127O735O554N577L635J788R26
$$ y = [469518, 472938, 476647, 479681, 482151, 485117, 489552, 495661, 503086, 511434, 520518, 530338, 540938, 552170, 563568, 574553, 584886, 594782, 604403, 613214, 620014, 623801, 624617, 623376, 620866, 617111, 611912, 605671, 599263, 593090, 586716, 579546, 571484, 562739, 553453, 543890, 534695, 526482, 519332, 513051, 507757, 503675, 500473, 497384, 494206, 491712, 490815, 491569, 493260, 495235, 497379, 499852, 502565, 505031, 506752, 507826, 509084, 511410, 514979, 519311, 523963, 528860, 533941, 538913, 543556, 547944, 552142, 555858, 558678, 560532, 561747, 562698, 563597, 564546, 565588, 566599, 567152, 566661, 564787, 561809, 558466, 555359, 552612, 550177, 548219, 546878, 545830, 544524, 542909, 541645, 541508, 542809, 545373, 548832, 552874, 557444, 562741, 568841, 575439, 582203, 589195, 596572, 604074, 611319, 618535, 626312, 634574, 642495, 649622, 656357, 662911, 668488, 672123, 673911, 674837]
61203F74837Q40R62J178J593K226L249M930O965Q490R128R501J0222J0913J0768
61189G55802R642Q052O281M168J673p76k652l736m096l910l437l040l068l610
61175G57293m417n203n976o846p558p602p048o714p099p562p212o328o056o781
61161F64891p615p674p168o855p050p442p541p007n844m523l634l215k711j717
61147E84895m30O47J136Q26k70j703k800l324l621m013m343m254l628k568j280
61132E55270q3P27J178J677K628M099N786P130P751Q024Q966J1077J3559J5220
61118F43009J5972J6771J8189J9873K1370K2665K3690K4099K3901K3671K3806
61107H77016K3975K3593K2465K0804J9053J7689J6685J5227J2585R231O381M372
$$ y = [674837, 675677, 676639, 677817, 679410, 681636, 684885, 689815, 696780, 705270, 714398, 723899, 734121, 745034, 755802, 765444, 773496, 779777, 783945, 785618, 784842, 782190, 778454, 774358, 770448, 767011, 763971, 760903, 757293, 752876, 747673, 741697, 734851, 727293, 719691, 712643, 705929, 698830, 691268, 684056, 677728, 671672, 664891, 657276, 649602, 642434, 635579, 628529, 621087, 613546, 606539, 600695, 596172, 592538, 589323, 586612, 584895, 584465, 585112, 586248, 587074, 586804, 585101, 582301, 578977, 575356, 571343, 567000, 562746, 559118, 556550, 555270, 555187, 555914, 557092, 558769, 561397, 565496, 571282, 578412, 586163, 594187, 603153, 614230, 627789, 643009, 658981, 675752, 693941, 713814, 735184, 757849, 781539, 805638, 829539, 853210, 877016, 900991, 924584, 947049, 967853, 986906, 1004595, 1021280, 1036507, 1049092, 1058323, 1064704, 1069076]
61095A069076K383j16k587m480o033p535q576q689q097p309o441n481m590l724
61081I97801k500r60J95O53J134K429M340O198P867R536J0977J1754J1845J1525
61067A072794J0956J0376J0306J0910J1533J1391J0489R366Q231O940N471L951
61055A182714K430J073L21L39N62K57o19j344j114L56K580M506N358N452N780
61040A208651O817Q300J0141J2677J5797J8729K1077K3326K5952K8810L1784L5057
61028A447118L8325M0621M1541M1776M2076M2674M4325M8666N6603O7098P8331
61017A989154Q9219R9446J09278J20201J34679J54428J80007K12480K53772L04624
61007C647288L64554M35355N22668O32553P68935R36117J139684J379307J639691
$$ y = [1069076, 1071459, 1071343, 1068756, 1064276, 1058243, 1050708, 1042132, 1033443, 1025346, 1018037, 1011596, 1006115, 1001525, 997801, 995301, 994341, 994536, 995189, 996323, 998752, 1003092, 1009290, 1017157, 1026693, 1037670, 1049424, 1061269, 1072794, 1083750, 1094126, 1104432, 1115342, 1126875, 1138266, 1148755, 1158121, 1166352, 1173292, 1178763, 1182714, 1185144, 1186217, 1186538, 1186877, 1187439, 1187696, 1187077, 1185733, 1184619, 1184975, 1187555, 1192061, 1197419, 1202871, 1208651, 1215468, 1223768, 1233909, 1246586, 1262383, 1281112, 1302189, 1325515, 1351467, 1380277, 1412061, 1447118, 1485443, 1526064, 1567605, 1609381, 1651457, 1694131, 1738456, 1787122, 1843725, 1910823, 1989154, 2078373, 2177819, 2287097, 2407298, 2541977, 2696405, 2876412, 3088892, 3342664, 3647288, 4011842, 4447197, 4969865, 5602418, 6371353, 7307470, 8447154, 9826461, 11466152]
60998A1466152J887795K071561K116621J939857J500161Q60472J93841k98336
60990B1738124m98221m19530j65646J37607L68315M06641J62845l58224j024435
60981B0347476j633145k023379k149467k065595j859492j603066j342908j107221
60973F563203r08420p45228o10859n00651m11939l40796k82702k35274j98020
60964B329314j70071j49485j33978j21201j09259r7815q7765p9187p0742o1717
60954A248094n3144m5994l9762l3928k9525k7759k8069k8764k8802k7894k5832
60943H78621k2877k0149j8443j7234j5705j4114j3215j3028j3096j3346j3784
60932G03630j3966j3581j2953j2274j1148r641q811r231r857r465q371p644p330
$$ y = [11466152, 13353947, 15425508, 17542129, 19481986, 20982147, 21842619, 22036460, 21738124, 21239903, 20820373, 20654727, 20792334, 21160649, 21567290, 21730135, 21371911, 20347476, 18714331, 16690952, 14541485, 12475890, 10616398, 9013332, 7670424, 6563203, 5654783, 4909555, 4298696, 3798045, 3386106, 3045310, 2762608, 2527334, 2329314, 2159243, 2009758, 1875780, 1754579, 1645320, 1547505, 1459740, 1380553, 1309811, 1248094, 1194950, 1148956, 1109194, 1075266, 1045741, 1017982, 989913, 961149, 932347, 904453, 878621, 855744, 835595, 817152, 799918, 784213, 770099, 756884, 743856, 730760, 717414, 703630, 689664, 676083, 663130, 650856, 639708, 630067, 621256, 612025, 602168, 592703, 584332, 576688, 569358]
60919E69358o748n919n428n240m854m329m079l990l716l434l370l025j951q54
60905E12421p46j365j565j085o68o46n86l62m34r21j351j517j793k427l169l710
60889D90076l939l874l799m293n454o484o675o431o529o780o379n312m340l720
60875D16067l047k290j953k086k095j728j322r29n6J388K689L223L202L273L853
60860D18189M972O239O892O368M953L470K400J751J580J927K357K300J879J654
60846D66931J564Q76o16k149k960l034k712k207j812k011l000m473o011p322p945
60831D23119p371n751m119l518m081n021n353m610l178k019j801k311k865l172
60817C67949l384l501l274k740k365k500k996l391l335k830k298k204k409k217
$$ y = [569358, 562610, 556691, 551263, 546023, 541169, 536840, 532761, 528771, 525055, 521621, 518251, 515226, 513275, 512421, 511675, 510310, 508745, 507660, 506992, 506346, 505760, 505398, 504964, 504043, 502692, 501175, 499382, 496955, 493786, 490076, 486137, 482263, 478464, 474171, 468717, 462233, 455558, 449127, 442598, 435818, 429439, 424127, 419787, 416067, 413020, 410730, 408777, 406691, 404596, 402868, 401546, 400617, 400561, 401949, 404638, 407861, 411063, 414336, 418189, 423161, 429400, 436292, 442660, 447613, 451083, 453483, 455234, 456814, 458741, 461098, 463398, 465277, 466931, 468495, 469371, 468755, 466606, 463646, 460612, 457900, 455693, 453881, 451870, 448870, 444397, 438386, 431064, 423119, 415748, 409997, 405878, 402360, 398279, 393258, 387905, 383295, 380117, 378098, 376297, 373986, 371121, 367949, 364565, 361064, 357790, 355050, 352685, 350185, 347189, 343798, 340463, 337633, 335335, 333131, 330722, 328505]
60803C28505j326m13k52o57q33n51k73k93l55j41L59R81J467J569J340J153J097
60786C31377P86J25k52J01O59Q41J024J702K191J434j75j044n03N21J032J039
60770C40858R18P77P16Q55Q18Q1j025j579j447j373j560j341o01k56p76j299j005
60753C32761m03m54j118j584j329l71R66J966J916J135R51J954K969K525P31j114
60737C41501k274k984l557m000m296m348l780k492j172o33p94r61r02r30j044
60722C07334p38K12J351K038K004J347L91l80n46k0J003K132K758K338J140K75
60706C22639N15J271J385P55L94Q50J357R41j61q05m53K52M15k4m71o26q28j437
60688C25969k256k777k685j955p19O51J570J750J500J260J034O89M62O02P54M78
$$ y = [328505, 327179, 326766, 326514, 325857, 325024, 324473, 324200, 323907, 323552, 323411, 323770, 324751, 326218, 327787, 329127, 330280, 331377, 332163, 332288, 332036, 332137, 332796, 333637, 334661, 336363, 338554, 339988, 339813, 338769, 338266, 338787, 339819, 340858, 341776, 342553, 343269, 344124, 344942, 345023, 343998, 342419, 340972, 339599, 338039, 336698, 336097, 335841, 335065, 333766, 332761, 332358, 331904, 330786, 329202, 327873, 327502, 328468, 330434, 332350, 333485, 334436, 336390, 339359, 341884, 342615, 341501, 339227, 336243, 332686, 328686, 324390, 320042, 316262, 313770, 312598, 311965, 311171, 310210, 309308, 308378, 307334, 306596, 306808, 308159, 310197, 312201, 313548, 313939, 313559, 313013, 312993, 313996, 316128, 318886, 321224, 322364, 322639, 323154, 324425, 325810, 326565, 326959, 327809, 329166, 330107, 329946, 329141, 328688, 328940, 329355, 329331, 328860, 328234, 327406, 325969, 323713, 320936, 318251, 316296, 315577, 316228, 317798, 319548, 321048, 322308, 323342, 324031, 324493, 325095, 325849, 326327]
60672C26327J84P26J990K835K579J700P54m47k061l463l906l375k260p69P09J364
60656C22887Q41o3l40K1M37R08J784K741L000K568K289K559K828K602K044J318
60640C48424O5j835l600m277l881l243k882k604k179j779j593j407r56m31k15
60625C17607k04J44R30J483J156K01n36n19J49J058J713J636Q36N6N7O24Q79N32
60607C27802J83K93N24L94M5J2N52J393J909J508L28n08NJ412K217J810J039P55
60589C41673P60O54O42Q18N36n12j405j128m2P30Q84Q51O73K12J30J344L479N073
60571C55372N508N641O327P374Q304R111R740R683Q759P632O966O448N223K968
60557D55056J19k655m733n708n685n270m917m440l426j890j96J401K805L901M673
$$ y = [326327, 326511, 327237, 329227, 332062, 334641, 336341, 337095, 336648, 334587, 331124, 327218, 323843, 321583, 320814, 321523, 322887, 323728, 323665, 323325, 323346, 323783, 324691, 326475, 329216, 332216, 334784, 337073, 339632, 342460, 345062, 347106, 348424, 348489, 346654, 343054, 338777, 334896, 331653, 328771, 326167, 323988, 322209, 320616, 319209, 318253, 317822, 317607, 317403, 317547, 318477, 319960, 321116, 321317, 320781, 320262, 320411, 321469, 323182, 324818, 325654, 325710, 325767, 326391, 327270, 327802, 327985, 328278, 328802, 329196, 329241, 329253, 329805, 331198, 333107, 334615, 334943, 334435, 334440, 335852, 338069, 339879, 340918, 341673, 342433, 343087, 343729, 344547, 345083, 344571, 343166, 342038, 341996, 342726, 343610, 344461, 345134, 345346, 345476, 346820, 350299, 355372, 360880, 366521, 372848, 380222, 388526, 397637, 407377, 417060, 425819, 433451, 440417, 446865, 452088, 455056, 455175, 452520, 447787, 442079, 436394, 431124, 426207, 421767, 418341, 416451, 416255, 417656, 420461, 424362, 429035]
60542D29035N442O568Q004R397J0588J1759J3035J4231J5045J5363J5130J4152
60530E67749J2165R182N626K008j447m702p516r412j0134r913r129p985o658n493
60516E24341m747m248l672k983k309j589o85K29Q78J485K691M775P284R567J1395
60501E42412J3038J5012J7821K1580K5681K9184L1712L3637L5288L6300L6010
60490H37675L4195L1145K7192K2581J7562J2275O499j49p702j5603k3005k9207
60478I13458l3982l7591m0357m2040m1861l9455l5648l1857k8726k5793k2555
60467E33593j9301j6622j4568j2765j1088r653q330o862n508m902n120n356m870
60454D08648l853l053k888l263l871m306m110l228k239j707j436q40J07Q18R06
$$ y = [429035, 434477, 441045, 449049, 458446, 469034, 480793, 493828, 508059, 523104, 538467, 553597, 567749, 579914, 589096, 594722, 596730, 595283, 590581, 583065, 573653, 563519, 553606, 544477, 536492, 529834, 524341, 519594, 515346, 511674, 508691, 506382, 504793, 504108, 504337, 505215, 506700, 509391, 514166, 521450, 531017, 542412, 555450, 570462, 588283, 609863, 635544, 664728, 696440, 730077, 765365, 801665, 837675, 871870, 903015, 930207, 952788, 970350, 982625, 989124, 988975, 981273, 965670, 942665, 913458, 879476, 841885, 801528, 759488, 717627, 678172, 642524, 610667, 581941, 556148, 533593, 514292, 497670, 483102, 470337, 459249, 449596, 441266, 434404, 428896, 423994, 418874, 413518, 408648, 404795, 401742, 398854, 395591, 391720, 387414, 383304, 380076, 377837, 376130, 374694, 373854, 373961, 374779, 375685]
60439C75685N90J64l49r21j282j227q81n64n08o98q05m67J07J09q26j834j746
60422C64547o47K96M47K92L10L54L51O94J323J452Q37M78J198K232K242J211L70
60405C77987N15J325K178K740K851K599K546L138L984M315M051L712L439K950
60391D18330K418K448L025L367L102K798K947L201L106K911L003L096K696K075
60377D58523J988K532K979K849K537K582K790K566J906J500J752K151J986J376
60363D90017J066J303J595J682K069L185M530N275N433N815O971Q696J0465J1787
60349E59889J2164J1262R286O807M127J222j716m172n873p105q217r073r237q504
60335E50860p197n936n090m438l508k468k224l295m915n840n813n559n454n086
$$ y = [375685, 376275, 376439, 376090, 375169, 373887, 372660, 371779, 371215, 370707, 370009, 369204, 368737, 368844, 368953, 368127, 366293, 364547, 363900, 364196, 364643, 364935, 365245, 365599, 365950, 366644, 367967, 369419, 370256, 370734, 371932, 374164, 376406, 377617, 377987, 378502, 379827, 382005, 384745, 387596, 390195, 392741, 395879, 399863, 404178, 408229, 411941, 415380, 418330, 420748, 423196, 426221, 429588, 432690, 435488, 438435, 441636, 444742, 447653, 450656, 453752, 456448, 458523, 460511, 463043, 466022, 468871, 471408, 473990, 476780, 479346, 481252, 482752, 484504, 486655, 488641, 490017, 491083, 492386, 493981, 495663, 497732, 500917, 505447, 510722, 516155, 521970, 528941, 537637, 548102, 559889, 572053, 583315, 592601, 599408, 603535, 604757, 603041, 598869, 592996, 585891, 577674, 568601, 559364, 550860, 543663, 537727, 532637, 528199, 524691, 522223, 519999, 516704, 511789, 505949, 500136, 494577, 489123, 484037]
60321D84037m176l117k237j273K0J354K511L876N797P830R304J0309J1446J2744
60307E38425J3479J3144J1938J0307Q507O861N844N457M796K761p94m925q599
60294F07201j1505j3798j5405j5983j5474j4259j2663j0666q292n994m301l194
60282D75667k218j180l78r8k16m27o99j208j938k557k745k576k487k810l382l728
60266D47020l635l361l267l431l747m075m123l473k107p39j61l32n14l52l24r17
60250D12462j696j658l76J463K725K859K219J582J433J709K081K272K146J644
60236D30865Q47L6m00k51L44J025J575K090K620K805K213J167P25J425K540L126
60220D52752L378M061M900M741L474K571L185M729O016O849P586P991P649O991
$$ y = [484037, 479861, 476744, 474507, 473234, 473254, 474608, 477119, 480995, 486792, 494622, 503926, 514235, 525681, 538425, 551904, 565048, 576986, 587293, 595800, 602661, 608505, 613962, 618758, 621519, 620725, 615800, 607201, 595696, 581898, 566493, 550510, 535036, 520777, 508114, 497448, 489156, 483162, 478861, 475667, 473449, 472269, 471891, 471793, 471577, 471150, 470451, 469243, 467305, 464748, 462003, 459427, 456940, 454130, 450748, 447020, 443385, 440024, 436757, 433326, 429579, 425504, 421381, 417908, 415801, 415062, 414901, 414569, 414055, 413703, 413379, 412462, 410766, 409108, 408732, 410195, 412920, 415779, 417998, 419580, 421013, 422722, 424803, 427075, 429221, 430865, 431712, 431748, 431348, 431097, 431441, 432466, 434041, 436131, 438751, 441556, 443769, 444936, 445661, 447086, 449626, 452752, 456130, 460191, 465091, 469832, 473306, 475877, 479062, 483791, 489807, 496656, 504242, 512233, 519882, 526873]
60206E26873O760O759O259N468N422O353P273P418P121O961O813O248N298M371
60192F15397L741L343K810J719J03j332k049k558l791n586o660o303n313m916
60178E88605n315n825n875n458m863m366l989l428k472j582j516k308l058l053
60164E35497k621k541k977l311k919j799o28k15p06j316j157k65N20O11J22n69
60148E15726j120j100l30O09Q70N21M26Q70J137Q32O60J322K418L173L607M209
60132E33830M928N355N466N446N038L915K513J698J653J852K068K636L591M251
60118E84240M098L494L194L423L763L722L195K433J796J510J536J683J775J634
60104F21496J034j04j423k290k350j908j636j947k707l502m025m238m218m026
$$ y = [526873, 533633, 540392, 546651, 552119, 557541, 563894, 571167, 578585, 585706, 592667, 599480, 605728, 611026, 615397, 619138, 622481, 625291, 627010, 627113, 625781, 623732, 621174, 617383, 611797, 605137, 598834, 593521, 588605, 583290, 577465, 571590, 566132, 561269, 556903, 552914, 549486, 547014, 545432, 543916, 541608, 538550, 535497, 532876, 530335, 527358, 524047, 521128, 519329, 518701, 518486, 517780, 516464, 515307, 515042, 515562, 516173, 516295, 515726, 514606, 513506, 513176, 513785, 514655, 515176, 515602, 516472, 517609, 518441, 519101, 520423, 522841, 526014, 529621, 533830, 538758, 544113, 549579, 555025, 560063, 563978, 566491, 568189, 569842, 571694, 573762, 576398, 579989, 584240, 588338, 591832, 595026, 598449, 602212, 605934, 609129, 611562, 613358, 614868, 616404, 618087, 619862, 621496, 622530, 622426, 621003, 618713, 616363, 614455, 612819, 610872, 608165, 604663, 600638, 596400, 592182, 588156]
60090E88156l685l172k483j798j547k049l067l965m250l794k621r97K73L15p83
60075E54533j998k745l520m709n637n553m902m636m728m471l875l596l669l593
60061D96901l526m077m831m554l160k131k359k888k512j545r86r12o53O4J023
60046D63854K093L084L567L468L393L797M374M831N506O520P060O445N334M824
60032E28150M832M348L016J439J36q44j430j550j623k275l526m941o384p899r038
60017E02411r183q542p997p875p628o796n665m784m413m549m953n038m290k909
60003D17789j580n98K98J201J690J409N21m97j152j056k04P94J208J031R38J398
59987D23190K232L063L751M256M515M532M334L728K478P56q64j973k594k941l156
$$ y = [588156, 584471, 581299, 578816, 577018, 575471, 573422, 570355, 566390, 562140, 558346, 555725, 554728, 555001, 555316, 554533, 552535, 549790, 546270, 541561, 535924, 530371, 525469, 520833, 516105, 511634, 507759, 504163, 500494, 496901, 493375, 489298, 484467, 479913, 476753, 474622, 472263, 469375, 466863, 465318, 464332, 463420, 462767, 462831, 463854, 465947, 469031, 472598, 476066, 479459, 483256, 487630, 492461, 497967, 504487, 511547, 517992, 523326, 528150, 532982, 537330, 540346, 541785, 541921, 541077, 539647, 538097, 536474, 534199, 530673, 525732, 519348, 511449, 502411, 493228, 484686, 476689, 468814, 461186, 454390, 448725, 443941, 439528, 434979, 430026, 424988, 420698, 417789, 416209, 415611, 415909, 417110, 418800, 420209, 420730, 420233, 419081, 418025, 417821, 418615, 419823, 420854, 421792, 423190, 425422, 428485, 432236, 436492, 441007, 445539, 449873, 453601, 456079, 456835, 455971, 453998, 451404, 448463, 445307]
59972D45307l317l396l196k623j970j620j560j480j262j005o93k65L5j45o70r90
59956D21150q99q04j005j141o44M61J513J927J757J532J611J886K073K162K245
59941D33824K067J269Q4p09p84o47p41p34k08M64O46N45J012K328L887N001N466
59924D52770N287M488L308K143J162L12l50o71p56r30j291j596j545j029j90N10
59908D61622O27L73N88J601K528K306J151K34O9no44j537j953j681j121p13m68
59891D62977L1J221L030M839O113O828P132P011O622O474O732O780O085N113M668
59876E41656M703M622M355M215L870K611O63q25j238j070q96p83q98j620k603
59861E56762k708j465J91J200J646K158K793L273L802M775O011P014P799Q784
$$ y = [445307, 441990, 438594, 435398, 432775, 430805, 429185, 427625, 426145, 424883, 423878, 423185, 422920, 422955, 422810, 422140, 421150, 420251, 419447, 418442, 417301, 416657, 417118, 418631, 420558, 422315, 423847, 425458, 427344, 429417, 431579, 433824, 435891, 437160, 437244, 436535, 435751, 435104, 434363, 433629, 433421, 433885, 434531, 435076, 436088, 438416, 442303, 447304, 452770, 458057, 462545, 465853, 467996, 469158, 469470, 469120, 468449, 467693, 466763, 465472, 463876, 462331, 461302, 461112, 461622, 462249, 462622, 463210, 464811, 467339, 469645, 470796, 471030, 471099, 471094, 470450, 468913, 466960, 465279, 464158, 463445, 462977, 463008, 464229, 467259, 472098, 478211, 485039, 492171, 499182, 505804, 512278, 519010, 525790, 531875, 536988, 541656, 546359, 550981, 555336, 559551, 563421, 566032, 566695, 565870, 564632, 563562, 562666, 561883, 560985, 559365, 556762, 554054, 552589, 552780, 553980, 555626, 557784, 560577, 563850, 567652, 572427, 578438, 585452, 593251, 602035]
59847F02035R903J0389R450O870L061j021m128n401m947l601k154j021n33j114
59833F17788k880n242p121p739p128n855m374k861j585r84j210j930k770l621
59819E62488m288m328l672k987k817k800k292j440q82o19l4J014J890K025J427
59804E42685M13n43p59J1Q89O53p55k194k912l228l628l985m048l896l597l106
59788E12000k712k881l417l559l089k512k016j277n66q40k125k981k389j189p27
59773D79720r44r21m74l4N45J734L191M006M030L875L710L104K173J850K637L888
59757E12090M678M956N405O511P953Q851Q567P438O474O168N982N367M795N031
59743F00266N666N346L572J462L76L80M67o3r26j366j036l28O0j66o02o92l58
$$ y = [602035, 611938, 622327, 631777, 638647, 641708, 640687, 636559, 631158, 626211, 622610, 620456, 619435, 618902, 617788, 614908, 609666, 602545, 594806, 587678, 581823, 577449, 574588, 573003, 572019, 570809, 568879, 566109, 562488, 558200, 553872, 550200, 547213, 544396, 541596, 539304, 537864, 536982, 536363, 536329, 537343, 539233, 541258, 542685, 543098, 542555, 541796, 541807, 542696, 543349, 542594, 540400, 537488, 534260, 530632, 526647, 522599, 518703, 515106, 512000, 509288, 506407, 502990, 499431, 496342, 493830, 491814, 490537, 489971, 489131, 487006, 484025, 481636, 480447, 479720, 478776, 477855, 477381, 477347, 477892, 479626, 482817, 486823, 490853, 494728, 498438, 501542, 503715, 505565, 508202, 512090, 516768, 521724, 527129, 533640, 541593, 550444, 559011, 566449, 572923, 579091, 585073, 590440, 595235, 600266, 605932, 611278, 614850, 616312, 616688, 617068, 617535, 617472, 616546, 615180, 614144, 613816, 613876, 613710, 613108, 612416, 612058]
59726F12058%P3p7j80l7L60P78Q88O25K97J27q6o06j193j300p86l5O60J405K291
59706F15262L035L354L402L566L861L899L513L099L143L618M068M262M380M600
59692F67062M817M878M677L875J983p41k962l520k848k437k979l806m254m638
59678F59107n434o246o318n689n181n401o171o858o928o289n388m829m666m320
59664E79389l406k398k072k435k615j839k41J290J967J810J639K235L439M280
59650E81043M077L181K480K345K411K182J522N57n96j859l126m282n246n947o276
59635E72466o181n848n585n398m853l709k594k436l176l702l333k692k622k984
59621E17353l238l520m144m524l883k771k618l675m677m680m088l478k641j429
$$ y = [612058, 612058, 612131, 612054, 611874, 611837, 612197, 612975, 613863, 614488, 614785, 614912, 614826, 614220, 613027, 611727, 610941, 610906, 611566, 612971, 615262, 618297, 621651, 625053, 628619, 632480, 636379, 639892, 642991, 646134, 649752, 653820, 658082, 662462, 667062, 671879, 676757, 681434, 685309, 687292, 686551, 683589, 680069, 677221, 674784, 671805, 667999, 663745, 659107, 653673, 647427, 641109, 635420, 630239, 624838, 618667, 611809, 604881, 598592, 593204, 588375, 583709, 579389, 575983, 573585, 571513, 569078, 566463, 564624, 564383, 565673, 567640, 569450, 571089, 573324, 576763, 581043, 585120, 588301, 590781, 593126, 595537, 597719, 599241, 599798, 599202, 597343, 594217, 589935, 584689, 578742, 572466, 566285, 560437, 554852, 549454, 544601, 540892, 538298, 535862, 532686, 528984, 525651, 522959, 520337, 517353, 514115, 510595, 506451, 501927, 498044, 495273, 492655, 488980, 484303, 479623, 475535, 472057, 469416, 467987]
59607D67987l85J60P52J765K564K489J987J795J649Q05m85j086n08N21J075J023
59591D82108Q80J102J602J861J491P41J92n1l51p94j008r63j199j884k398k293
59575D79036j977j956k049j931j849k070k186j746j080p80p31m71j22j71n63p82
59559D58572o91n82n81o00p40j050j061k18J278K571L079K911K496K284K604L382
59543D73654M119M615N437P214R749J2300J4524J6572J8360J9184J7986J3848
59531F17562O738j775r011j3001j3706j2183r188n191j138J795L181L370K793
59518E70246J752O72j43q42j632k329k762l285m219n239n907o398p021p432p193
59503E18268o619o260n951n287m596m366m065k853j251p22j515k237j847q83k21
$$ y = [467987, 467602, 467762, 468514, 470279, 472843, 475332, 477319, 479114, 480763, 481568, 481083, 479997, 479489, 480010, 481085, 482108, 482988, 484090, 485692, 487553, 489044, 489785, 489977, 489926, 489575, 488781, 487773, 486810, 485611, 483727, 481329, 479036, 477059, 475103, 473054, 471123, 469274, 467204, 465018, 463272, 462192, 461412, 460681, 460210, 460088, 459917, 459354, 458572, 457881, 457299, 456718, 456118, 455378, 454328, 453267, 453049, 454327, 456898, 459977, 462888, 465384, 467668, 470272, 473654, 477773, 482388, 487825, 495039, 504788, 517088, 531612, 548184, 566544, 585728, 603714, 617562, 624300, 622525, 613514, 600513, 586807, 574624, 565436, 560245, 559107, 560902, 564083, 567453, 570246, 571998, 572670, 572527, 571685, 570053, 567724, 564962, 561677, 557458, 552219, 546312, 539914, 532893, 525461, 518268, 511649, 505389, 499438, 494151, 489555, 485189, 481124, 478271, 477020, 476298, 474783, 472546, 470699, 469816, 469595]
59488D69595K18Q94J696K267K648K951K920K418J990K340L390M354M625M337M053
59473E10696M049M050L654K931K289J779J089L65L32J167J913J701R32M62K44
59458E37653k31n98M3J667L322M567N787P030P661P437O934O598O197N485M634
59443F04186L691K349N06j491l404n200o542o894o333n608n183m848m376l861
59429E56992l318k627k017j831j713p40J317L696N692P338Q866J0331J2012J4398
59415F08396J7384K0168K2288K4216K6594K9209L0765K9175K2596J1290j436j1321
59403H29324j6418j7575j5882j1295m147L625R884J3682J4323J0374J361j0113
59391H07143j9566k4182k4421k2343j9431j6107j2456q807n771l825k795k003
$$ y = [469595, 469813, 470707, 472403, 474670, 477318, 480269, 483189, 485607, 487597, 489937, 493327, 497681, 502306, 506643, 510696, 514745, 518795, 522449, 525380, 527669, 529448, 530537, 530902, 531234, 532401, 534314, 536015, 536947, 537409, 537653, 537422, 536824, 536867, 538534, 541856, 546423, 552210, 559240, 566901, 574338, 581272, 587870, 594067, 599552, 604186, 607877, 610226, 610732, 609241, 605837, 600637, 594095, 587201, 580868, 575260, 570077, 565229, 560853, 556992, 553674, 551047, 549030, 547199, 545486, 544746, 546063, 549759, 555451, 562789, 571655, 581986, 593998, 608396, 625780, 645948, 668236, 692452, 719046, 748255, 779020, 808195, 830791, 842081, 840645, 829324, 812906, 795331, 779449, 768154, 764007, 767632, 777516, 791198, 805521, 815895, 817256, 807143, 787577, 763395, 738974, 716631, 697200, 681093, 668637, 659830, 654059, 650234, 647439, 645436]
59379F45436j112m82m65o62l68N04J292J340N89m80j265j521j437j241q74l19
59363F38935Qk68p36n27N76J922K920L516L754L647L619M348N891P595R009J0239
59347F94448J1269J1790J1943J2426J3439J4217J4036J3004J1587J0035Q613P605
59335H34412O747N348L325J273o92l188o178q552r742j0685j2201j3478j3284
59322G73105j2002j1135j1287j1745j1836j1585j1188j0732j0407j0231r686q292
59310F42979o444n007m229l607k615j092Q72K892M515N997Q325J1627J3966J2729
59296F80908P205q56q932j5201j8696j9261j7756j5529j3289j0920q388o171m570
59283E48544l193j511M59K197L230L467L260L226L819N031O558Q166R656J0705
$$ y = [645436, 644324, 643842, 643377, 642715, 642347, 642851, 644143, 645483, 646072, 645592, 644327, 642806, 641369, 640128, 639254, 638935, 638943, 638675, 637939, 637412, 637988, 639910, 642830, 646346, 650100, 653747, 657366, 661714, 667605, 675200, 684209, 694448, 705717, 717507, 729450, 741876, 755315, 769532, 783568, 796572, 808159, 818194, 826807, 834412, 841159, 846507, 849832, 851105, 850413, 847225, 841047, 832495, 822753, 812068, 799867, 786389, 773105, 761103, 749968, 738681, 726936, 715100, 703515, 692327, 681595, 671188, 660957, 651271, 642979, 636535, 631528, 627299, 623692, 621077, 619985, 620857, 623749, 628264, 634261, 642586, 654213, 668179, 680908, 688113, 687257, 678325, 663124, 644428, 625167, 607411, 591882, 578593, 567673, 559285, 553114, 548544, 545351, 543840, 544299, 546496, 549726, 553193, 556453, 559679, 563498, 568529, 575087, 583253, 592909, 603614]
59269F03614J1101J1067J0976J0833J0335R463Q625Q088P539O414M549K385M72
59256G05461j104k684m366n649n986n524m900m397l741k747j647p33m2M64R15
59241F63320J701L112M691N465N097M181L343K526J498M78j14j48J74L89j64j774
59225F93775l699m767m852n089o318q040r268r648r330q442p263o347n927n617
59211E99168n080m509m128l822l521l267k700j307M45J190M19p37j039m82M59
59196E71089J790L352M224L870L060K706K611K338K414L396M603N087N167N601
59182F21308N929N224M018L656L979L414J472m57j179j080r95r97r05r25j156
59167F41306j243j001p13n43l63l63r68j846j923q04M72O27n25k276l994n391
$$ y = [603614, 614715, 625782, 636758, 647591, 657926, 667389, 676014, 684102, 691641, 698055, 702604, 704989, 705461, 704357, 701673, 697307, 691658, 685672, 680148, 675248, 670851, 667110, 664363, 662716, 661983, 661941, 662405, 663320, 665021, 668133, 672824, 678289, 683386, 687567, 690910, 693436, 694934, 695412, 695298, 695150, 695324, 695713, 695549, 693775, 690076, 685309, 680457, 675368, 669050, 661010, 651742, 642094, 632764, 624322, 617059, 610712, 604785, 599168, 594088, 589579, 585451, 581629, 578108, 574841, 572141, 570834, 571279, 572469, 572888, 572151, 571112, 570630, 571089, 572879, 576231, 580455, 584325, 587385, 590091, 592702, 595040, 597454, 600850, 605453, 610540, 615707, 621308, 627237, 632461, 636479, 640135, 644114, 647528, 649000, 648543, 647364, 646284, 645289, 644292, 643387, 642462, 641306, 640063, 639062, 638349, 637806, 637443, 637080, 636112, 634266, 632343, 631539, 632011, 632638, 632113, 629837, 625843, 620452]
59151F20452o352o964p468p911q073p869p492p023o302n349m532m217m424m926
59137E31550n361n304m596l601k876k544k327k058j821j686j624j578j290l02
59123D94582J471L390M758N630O508P447Q074Q327Q601R232J0278J1578J2610
59110E92486J2554J1160R255P886P154O502N802N379N207M915M457M024L419K334
59096F82534J060J34n52j404k085j869j036o97j076j131l05M37m2j537l085m364
59080F64982n615o671o979o558o198o531p262p550o990o062n564n733o041n887
59066E75341n180m246l429l041l282l942m444m492m385m440m394l802k731j687
59052E21846j081j072j595k242k418j950j190m09M12J025R60M20K34N01L40m19
$$ y = [620452, 614100, 607136, 599668, 591757, 583684, 575815, 568323, 561300, 554998, 549649, 545117, 540900, 536476, 531550, 526189, 520885, 516289, 512688, 509812, 507268, 504941, 502883, 501062, 499376, 497752, 496174, 494884, 494582, 496053, 499443, 504201, 509831, 516339, 523786, 531860, 540187, 548788, 558020, 568298, 579876, 592486, 605040, 616200, 625455, 633341, 640495, 646997, 652799, 658178, 663385, 668300, 672757, 676781, 680200, 682534, 683594, 683728, 683176, 681772, 679687, 677818, 676782, 676085, 675009, 673878, 673573, 674010, 673968, 672431, 669346, 664982, 659367, 652696, 645717, 639159, 632961, 626430, 619168, 611618, 604628, 598566, 593002, 587269, 581228, 575341, 570161, 565915, 562486, 559445, 556163, 552221, 547777, 543285, 538900, 534460, 530066, 526264, 523533, 521846, 520765, 519693, 518098, 515856, 513438, 511488, 510298, 509889, 510301, 511326, 512286, 512706, 512940, 513441, 513781, 513362]
59036E13362n52O01J718J380L08K09J182K019K492L435M807N600N739O347P840
59021E56487R305J0120J0771J1603J2068J1717J0849R772Q386O768N247L706J791
59008F68590j20j252j723k319k919k526j085K17Q40J640L167M574M956M550L961
58993F80551L223K306J516P70m63j935k514j905j346j809k658k945k846k817k391
58978F64737j030O64J828K758M252O064P235P662Q149R070R986J0620J1242J1984
58964G55221J2400J2054J1046R838Q713P556O160M623L258J906k28l479o817q890
58950H13361r771j0733j2272j3555j4005j4190j4589j4567j3368j1336r441q153
58938F67381p378o840o040m537k763j865k170k553j958p89p1M1P2P7l28j081j616
$$ y = [513362, 512810, 513411, 515129, 516509, 516817, 517026, 518208, 520227, 522719, 526154, 530961, 536561, 542300, 548647, 556487, 565792, 575912, 586683, 598286, 610354, 622071, 632920, 642692, 651078, 657846, 663093, 666799, 668590, 668470, 667218, 665495, 663176, 660257, 657731, 656646, 656863, 657703, 659343, 662510, 667084, 672040, 676590, 680551, 683774, 686080, 687596, 688366, 687903, 685968, 683454, 681549, 680203, 678394, 675736, 672791, 669945, 667128, 664737, 663707, 664371, 666199, 668957, 673209, 679273, 686508, 694170, 702319, 711389, 721375, 731995, 743237, 755221, 767621, 779675, 790721, 800559, 809272, 816828, 822988, 827611, 830869, 832775, 832547, 829068, 822251, 813361, 803590, 792857, 780585, 767030, 753025, 738835, 724246, 709679, 696311, 684975, 675534, 667381, 660003, 653163, 647123, 642586, 639823, 637958, 635788, 633235, 631277, 630488, 630417, 630458, 630530, 630607, 630279, 629198, 627582]
58921F27582j634j337r57n36q5K99M04L2o32q77j81R87J729J972K409L269M147
58904F36591N062O604Q669J0244J0885J1313J2009J2331J1759J0982J0843J1038
58892G58330J0756J0006R483R690J0792J2745J4960J6464J6960J7067J7090J6354
58880I20697J4361J1667Q936O100L163Q27o68k339m980p759r430j0128j0700j0917
58866I08830r927q082o796o648o896o932p002p359p710p840q005q441r059r734
58852G98399j0400j0854j0928j0818j0824j0812j0433r663q737p745o796o398
58840F83991o990q090q527p678o202n314n465n944n780m967m345m226l807k535
58826F04121j335j370j989j389P05K559K966K697K853L269L464L836M724N329
$$ y = [627582, 625948, 624611, 623654, 623118, 623033, 623332, 623736, 623768, 623136, 622259, 622078, 623065, 624794, 626766, 629175, 632444, 636591, 641653, 648257, 656926, 667170, 678055, 689368, 701377, 713708, 725467, 736449, 747292, 758330, 769086, 779092, 788575, 798265, 809057, 821802, 836762, 853226, 870186, 887253, 904343, 920697, 935058, 946725, 955661, 961761, 964924, 965751, 965083, 962744, 957764, 950005, 940575, 930447, 919747, 908830, 898903, 890821, 884025, 877377, 870481, 863549, 856547, 849188, 841478, 833638, 825633, 817192, 808133, 798399, 787999, 777145, 766217, 755399, 744575, 733763, 723330, 713667, 704930, 697185, 690389, 683991, 677001, 668911, 660384, 652706, 646504, 641190, 635725, 629781, 624001, 619034, 614689, 610463, 606656, 604121, 602786, 601416, 599427, 598038, 598743, 601302, 604268, 606965, 609818, 613087, 616551, 620387, 625111, 630440]
58812F30440M877M012L855M224L999K789J166l21j455k000j981k011k616l504
58798F41474m114m455m814n138n334n675o297o806o890o674o046m490k262o77
58784E71802l92l21P38K374L405L697L895M163M395M969N939O141M492J730m60
58769F16567j726l104n074o941q071q515q378p669o802o309o051n523m759m182
58755E33463l686k782j463j81R06J865K464K528K526L014L722L906L408K698K233
58740E54621K336L300M818N837N696N002M681M787M895M976N016M567L659L331
58726F17522M217N323N390M670M136L772L093K641L322M688N545N937O851Q180
58712F85287Q636P850O922O653O490N543L617J050j582l651n160p067r986j2966
$$ y = [630440, 635317, 639329, 643184, 647408, 651407, 654196, 655362, 655041, 653586, 651586, 649605, 647594, 644978, 641474, 637360, 632905, 628091, 622953, 617619, 611944, 605647, 598841, 591951, 585277, 579231, 574741, 572479, 571802, 571410, 571089, 571827, 574201, 577606, 581303, 585198, 589361, 593756, 598725, 604664, 610805, 615297, 617027, 616567, 614841, 611737, 606663, 599722, 591651, 583136, 574758, 567089, 560287, 553978, 547927, 542404, 537645, 533463, 529777, 526995, 525532, 525351, 526257, 528122, 530586, 533114, 535640, 538654, 542376, 546282, 549690, 552388, 554621, 556957, 560257, 565075, 570912, 576608, 581610, 586291, 591078, 595973, 600949, 605965, 610532, 614191, 617522, 621739, 627062, 632452, 637122, 641258, 645030, 648123, 650764, 654086, 658774, 664319, 670256, 677107, 685287, 693923, 701773, 708695, 715348, 721838, 727381, 730998, 732048, 730466, 726815, 721655, 714588, 704602, 691636]
58698F91636j4617j5035j5371j5874j5794j5021j4351j4057j3554j2554j1352
58687E34056r902p775n234l227k250k082k584l672m659m709l964l232k712k044
58673D76010j325r07l98Q47K445L427L827M568N888P144Q121R193J0219J0473
58659E39532R655P905N087J325k025l496l468l608m421m888m464l779l271k698
58645E27386k287k777l983m674m238l247k185r66R5K73j98j00J010K157K438K054
58629E10758J573J162Q27M44m87k116l397l136j701m89J29P92J395J100J68NJ041
58612E08068K231K992L954N342O230O040N367M786M101L215K512J959J131K93
58598E58221J58M07l5j088j513j032p17r12o26M49J230J279J706L146M589N211
$$ y = [691636, 677019, 661984, 646613, 630739, 614945, 599924, 585573, 571516, 557962, 545408, 534056, 524154, 516379, 511145, 507918, 505668, 503586, 501002, 497330, 492671, 487962, 483998, 480766, 478054, 476010, 474685, 473778, 473380, 474227, 476672, 480099, 483926, 488494, 494382, 501526, 509647, 518840, 529059, 539532, 549187, 557092, 562179, 563504, 561479, 557983, 554515, 550907, 546486, 541598, 537134, 533355, 530084, 527386, 525099, 522322, 518339, 513665, 509427, 506180, 503995, 503029, 503124, 503397, 503199, 503099, 504109, 506266, 508704, 510758, 512331, 513493, 514320, 514764, 514277, 512161, 508764, 505628, 503927, 503438, 503567, 504359, 505754, 506854, 507022, 507027, 508068, 510299, 513291, 517245, 522587, 528817, 534857, 540224, 545010, 549111, 552326, 554838, 556797, 557928, 558221, 558379, 558786, 558751, 557663, 556150, 555118, 554401, 553489, 552863, 553312, 554542, 555821, 557527, 560673, 565262, 570473]
58582E70473N835P346R092J0006J0143J0034R619Q850Q321Q337Q270P698P287
58569F81311P744Q811J0004J1466J3358J5318J7123J9088K1203K2789K3524K3928
58557H75667K4332K4247K3111K0793J7166J2240O910K431j080m445p563r205q981
58544I75623q021p312o781o491p188r003j1096j3142j5739j8748k0801k1173k0699
58531H09429k0082j8778j6484j4183j2706j1458r630p572o065n165m550m138l729
58518F74889l013k335k449l149l397k993k820l086k904k016j315j129o26M19R66
58503F45042N46J17K90L44j47k87N49J528J702J236N70k50p26M5J735K751K663
58486F57708L001M715O553P049O651O750P866R777J2239J4694J6370J7267J7925
$$ y = [570473, 576308, 583654, 592746, 602752, 612895, 622929, 632548, 641398, 649719, 658056, 666326, 674024, 681311, 689055, 697866, 707870, 719336, 732694, 748012, 765135, 784223, 805426, 828215, 851739, 875667, 899999, 924246, 947357, 968150, 985316, 997556, 1004466, 1006897, 1005817, 1001372, 993809, 984604, 975623, 967602, 960290, 953509, 947018, 939830, 930827, 919731, 906589, 890850, 872102, 851301, 830128, 809429, 789347, 770569, 754085, 739902, 727196, 715738, 706108, 698536, 692471, 687306, 682756, 678618, 674889, 671876, 669541, 667092, 663943, 660546, 657553, 654733, 651647, 648743, 646727, 645412, 644283, 643657, 644076, 645042, 645588, 645705, 645995, 646339, 646192, 645905, 646454, 647982, 649684, 650920, 651490, 651240, 650514, 650559, 652294, 655045, 657708, 660709, 665424, 671977, 679026, 685677, 692427, 700293, 710070, 722309, 737003, 753373, 770640, 788565]
58473G88565J7966J6386J3481J0649P967M083r49n065p191q539r941j0230q557
58460H08625o072l994j914O27K868M434O272Q713J0501J0974J1205J1768J1422
58447H75429R342O546L776J36m657q903j1322j2712j3680j3060j0436p873p050
58434H05536o648m763k018j81N98J201J723K187L488N902Q135R324J0278J1397
58420H46159J1453R910Q248P266N477J994j327k755l448n156p338q712r506r994
58406H42271r076o555m620m730n249m437l321l168k664m89J838K627L212N270
58392H10909P269O928N284M803N238M748L577L239L359K620J588J567J936J489
58378H64554J050J970L451M200N000O851Q347P930O985P547Q754Q713Q145Q811
$$ y = [788565, 806531, 822917, 836398, 847047, 855014, 859097, 858148, 853083, 845892, 837353, 827412, 817182, 808625, 802553, 798559, 796645, 797272, 800140, 804574, 810846, 819559, 830060, 841034, 852239, 864007, 875429, 884771, 891317, 895093, 895229, 890572, 881669, 870347, 857635, 843955, 830895, 820459, 812586, 805536, 798888, 794125, 792107, 791926, 792524, 793725, 795448, 797635, 801123, 807025, 815160, 824484, 834762, 846159, 857612, 867522, 875770, 883036, 888513, 890507, 889180, 886425, 882977, 877821, 870483, 861771, 852265, 842271, 833195, 826640, 822020, 817290, 812041, 807604, 804283, 801115, 798451, 797962, 799800, 802427, 805639, 810909, 818178, 825106, 830390, 835193, 840431, 845179, 848756, 851995, 855354, 857974, 859562, 861129, 863065, 864554, 865604, 867574, 871025, 875225, 880225, 887076, 895423, 903353, 910338, 917885, 926639, 935352, 943497, 952308]
58364I52308J0125J0600J0956J2433J3804J3532J3041J4291J5923J5446J3499
58353A095958J2215J1222R037O639N672M962K833R62J719L607L862L592N558Q600
58339A176438R468Q730R587J1848J2536J1737J2506J5222J7107J7320J7724J8651
58327A338874J8435J7209J6734J6651J5020J2301J0592R541P321M963N142P207
58315A479990Q042P411P853R735J1100J1904J3776J6021J6495J5985J7068J9276
58303A634656K0034J9636K0437K1943K1770K0650K1290K3114K3430K2831K3974
58292A873765K5954K5721K4180K4797K7028K7425K6478K7756L0770L1607L0404
58281B175885L1241L4489L6299L6017L7046L9912M1362M1038M2184M5068M6482
$$ y = [952308, 962433, 973033, 983989, 996422, 1010226, 1023758, 1036799, 1051090, 1067013, 1082459, 1095958, 1108173, 1119395, 1128432, 1135071, 1140743, 1145705, 1148538, 1149500, 1151219, 1154826, 1158688, 1162280, 1167838, 1176438, 1185906, 1194636, 1204223, 1216071, 1228607, 1240344, 1252850, 1268072, 1285179, 1302499, 1320223, 1338874, 1357309, 1374518, 1391252, 1407903, 1422923, 1435224, 1445816, 1455357, 1462678, 1467641, 1472783, 1479990, 1488032, 1495443, 1503296, 1513031, 1524131, 1536035, 1549811, 1565832, 1582327, 1598312, 1615380, 1634656, 1654690, 1674326, 1694763, 1716706, 1738476, 1759126, 1780416, 1803530, 1826960, 1849791, 1873765, 1899719, 1925440, 1949620, 1974417, 2001445, 2028870, 2055348, 2083104, 2113874, 2145481, 2175885, 2207126, 2241615, 2277914, 2313931, 2350977, 2390889, 2432251, 2473289, 2515473, 2560541, 2607023]
58270B607023M6431M8437N2596N5228N5978N8292O2403O4997O6222O9614P4696
58259C261917P7338P7867Q0766Q5851Q8143Q7181Q7911R1345R3142R2611R4215
58248D218287R8825J02416J04769J10378J19308J26436J31108J38001J47339J54241
58238E451108J59110J67996J81143J92178K00318K11957K28232K43021K55439
58229G290502K71929K93442L13313L30628L52565L80517M07606M32989M64391
58220A0537882N03237N42364N81804O30858O90844P52889Q16949Q94882R90069
58211A6941778J093493J205388J340007J502864J685704J891201K139016K439876
58203C0239327K790103L201408L707582M330595N071012N945071O997429Q263896
$$ y = [2607023, 2653454, 2701891, 2754487, 2809715, 2865693, 2923985, 2986388, 3051385, 3117607, 3187221, 3261917, 3339255, 3417122, 3497888, 3583739, 3671882, 3759063, 3846974, 3938319, 4031461, 4124072, 4218287, 4317112, 4419528, 4524297, 4634675, 4753983, 4880419, 5011527, 5149528, 5296867, 5451108, 5610218, 5778214, 5959357, 6151535, 6351853, 6563810, 6792042, 7035063, 7290502, 7562431, 7855873, 8169186, 8499814, 8852379, 9232896, 9640502, 10073491, 10537882, 11041119, 11583483, 12165287, 12796145, 13486989, 14239878, 15056827, 15951709, 16941778, 18035271, 19240659, 20580666, 22083530, 23769234, 25660435, 27799451, 30239327, 33029430, 36230838, 39938420, 44269015, 49340027, 55285098, 62282527, 70546423]
58195G0546423R764645J1558850J3764121J6491353J9794510K3691262K8135951
58188A93747115L2868585L7281779M0437926M1147713L8068239L0083565J7110632
58181D30745554P84256j5826710k9537046l8413793m2210336m1862879l8749888
58174B24929158l4202477k9259609k4561779k0394980j6843801j3907264j1522869
58167G4236379r585236q001088o714100n674304m820816m108167l519164l038151
58159B8775353k636453k293886k009439j779142j584482j412225j265444j145318
58151A4648964j040264r41899q54479p80043p10231o40876n79481n30141m85103
58142H086447m38916l97686l66715l41256l16807k96905k83630k70971k54523
$$ y = [70546423, 80311068, 91869918, 105634039, 122125392, 141919902, 165611164, 193747115, 226615700, 263897479, 304335405, 345483118, 383551357, 413634922, 430745554, 431529810, 415703100, 386166054, 347752261, 305541925, 263679046, 224929158, 190726681, 161467072, 136905293, 116510313, 99666512, 85759248, 74236379, 64651143, 56650055, 49935955, 44261651, 39440835, 35332668, 31813504, 28775353, 26138900, 23845014, 21835575, 20056433, 18471951, 17059726, 15794282, 14648964, 13608700, 12666801, 11812322, 11032279, 10322048, 9681172, 9101691, 8571550, 8086447, 7647531, 7249845, 6883130, 6541874, 6225067, 5928162, 5644532, 5373561, 5119038]
58133E119038k38073k24737k10970j94851j80910j71318j61201j47900j36163
58124C452915j29240j23296j15386j08623j04717r9700r1763q5407q3047q0238
58114B431498p3875o7685o4840o2463n8080n4481n3448n1583m7074m3934m4761
58103A809274m5715m3484m1080m1729m2891m1322l8782l7824l6872l4063l1376
58092A374136l0572k9468k6321k3514k3006k2488j9889j7445j7533j8577j8651
58081A126672j9022k0743k1716k0528j9263j9362j8803j6481j5100j6353j7478
58070I21823j6028j4006j3776j3868j2457j1138j1585j2022j0636r042q978q975
58058G79312p646o892q357j0029r809r211j0045j0721r393p754q070r158q821
$$ y = [5119038, 4880965, 4656228, 4445258, 4250407, 4069497, 3898179, 3736978, 3589078, 3452915, 3323675, 3200379, 3084993, 2976370, 2871653, 2771953, 2680190, 2594783, 2511736, 2431498, 2357623, 2289938, 2225098, 2162635, 2104555, 2050074, 1996626, 1945043, 1897969, 1854035, 1809274, 1763559, 1720075, 1678995, 1637266, 1594375, 1553053, 1514271, 1476447, 1439575, 1405512, 1374136, 1343564, 1314096, 1287775, 1264261, 1241255, 1218767, 1198878, 1181433, 1163900, 1145323, 1126672, 1107650, 1086907, 1065191, 1044663, 1025400, 1006038, 987235, 970754, 955654, 939301, 921823, 905795, 891789, 878013, 864145, 851688, 840550, 828965, 816943, 806307, 797265, 788287, 779312, 771666, 764774, 756417, 746388, 736579, 727368, 717323, 706602, 697209, 689455, 681385, 672227, 663406]
58045F63406p703p318o806m985l272l400m440m935n566o938p340n718m257n034
58031E85694o569o695o340p280q588q572q038q471r037q453p729q016p841n639
58017D78426l067k555l336l089j888j424j698j569j270j629j931j140r3o2m55
58002D53220j35L64K05K53J442K664K510J660J374J197L51l08Q6M79k47j206j421
57985D62488j919l628n043m505l020k419k470k229k448l932n229m693l268k689
57971D14996k519j625q49j354j936r73M46L58m65L3J433J735J032R97J496J001
57955D13806k12m29J60m33k570m328m470l678k784j944j452j479j151L13J931
57940C91280K286J904K425L976N365O265P188P923P958P876Q289Q085N875K537
$$ y = [663406, 655703, 648385, 641579, 636594, 633322, 629922, 625482, 620547, 614981, 608043, 600703, 594985, 590728, 585694, 579125, 572430, 566090, 558810, 550222, 541650, 533612, 525141, 516104, 507651, 499922, 491906, 484065, 478426, 475359, 472804, 469468, 466379, 464491, 463067, 461369, 459800, 458530, 456901, 454970, 453830, 453737, 453675, 453220, 453085, 453449, 453654, 453907, 455349, 458013, 460523, 462183, 463557, 464754, 465105, 464797, 464883, 465362, 465115, 463909, 462488, 460569, 456941, 451898, 447393, 444373, 441954, 439484, 437255, 434807, 430875, 425646, 420953, 417685, 414996, 412477, 410852, 410003, 408649, 406713, 405740, 406186, 406544, 406079, 406112, 407545, 409280, 410312, 411309, 412805, 413806, 413594, 413165, 413325, 412892, 410322, 405994, 401524, 397846, 395062, 393118, 391666, 390187, 389036, 389349, 391280, 393566, 395470, 397895, 401871, 407236, 413501, 420689, 428612, 436570, 444446, 452735, 460820, 466695, 469232]
57926D69232Q1j434l555o412q370q633q075p510o982o708o904o853n776m369l918
57911C83814m233m088l212k260j331k01N37L29O5Q21J791J354k82j403j340q96
57895C69465n98l19k67o21o07M55J669J828J507K077L254L578K854K127J724J158
57879C89284O90R65J456J107K29j6L92O12P21J401K274K482K398K829L068J885
57863D11777M7m32O34J472J225R02J356K260L167L834L603K161P34P38J532J367
57847D36377J91m35l8K88q8p60j653k921l659k810j186n59q92o56L31P23L02L39
57829D22894J163J712J742K156K844K637J783K011L596M813M897N164O263O812
57815D70487N799M201K907J115j914n201p480q758r379r042p942p316p698p888
$$ y = [469232, 469313, 467879, 464324, 457912, 449542, 440909, 432834, 425324, 418342, 411634, 404730, 397877, 392101, 387732, 383814, 379581, 375493, 372281, 370021, 368690, 368489, 369026, 369355, 369420, 370241, 372032, 373386, 373104, 371701, 370361, 369465, 368867, 368548, 368281, 367660, 367053, 367508, 369177, 371005, 372512, 374589, 377843, 381421, 384275, 386402, 388126, 389284, 389974, 390939, 392395, 393502, 393731, 393715, 394107, 394719, 395440, 396841, 399115, 401597, 403995, 406824, 409892, 411777, 411824, 411392, 412026, 413498, 414723, 415625, 416981, 419241, 422408, 426242, 429845, 432006, 432740, 433478, 435010, 436377, 436568, 436133, 436095, 436383, 436295, 435535, 433882, 430961, 427302, 424492, 423306, 422747, 421855, 421199, 421530, 422253, 422555, 422894, 424057, 425769, 427511, 429667, 432511, 435148, 436931, 438942, 442538, 447351, 452248, 457412, 463675, 470487, 476286, 480487, 483394, 484509, 482595, 477394, 469914, 461156, 451777, 442735, 434793, 427477, 419779, 411891]
57801D11891o794n067l863l196k543j996j752j385n89J72M73N47N67K53k22j10
57785C86386O82J237J122J115J814K657L011L234L905M822N461N708N651N321
57771D32126M873M390L478J846K70k51j98j050k959m383m287l354k617k263k148
57756D23473k196j867o00R27J341P71R32K607M554N514N693N573M831L371K114
57741D57038J819K089K308K460K500K054J294J009J252J195P14O87J258J333M86
57726D79496k16k6L48K51J84N15O15K85M85J598K441K217J934K545L117K433J147
57709D99369O97J008R56L61n6j26k33k90N4N94J035J762L072M256M460L990L660
57692E24569L417K645J388K25o72j408j673j136j74N58R93J405J745J936K352
$$ y = [411891, 405097, 400030, 396167, 392971, 390428, 388432, 386680, 385295, 384706, 384878, 385351, 385898, 386465, 386718, 386496, 386386, 387068, 388305, 389427, 390542, 392356, 395013, 398024, 401258, 405163, 409985, 415446, 421154, 426805, 432126, 436999, 441389, 444867, 446713, 446983, 446732, 446534, 445484, 442525, 438142, 433855, 430501, 427884, 425621, 423473, 421277, 419410, 418810, 419737, 421078, 421849, 422781, 425388, 429942, 435456, 441149, 446722, 451553, 454924, 457038, 458857, 460946, 463254, 465714, 468214, 470268, 471562, 472571, 473823, 475018, 475732, 476419, 477677, 479010, 479496, 479280, 479254, 479602, 479853, 480037, 480552, 481167, 481452, 481937, 483535, 485976, 488193, 490127, 492672, 495789, 498222, 499369, 500066, 501074, 502030, 502391, 502335, 502209, 501976, 501686, 501740, 502334, 503369, 505131, 508203, 512459, 516919, 520909, 524569, 527986, 530631, 532019, 532244, 531572, 530164, 528491, 527355, 527181, 527739, 528732, 530137, 531882, 533818, 536170]
57677E36170L316M658O333Q923J2694J6867K0673K4591K9694L6134M2946M8802
57665G91801N2154N1156M4333L1359J3122q204k8750m3869n0849n0665m6488m0869
57653G14231l4758k8434k2300j6964j3044j0701r124p190m839l111k451k006j023
57640E58286J44R90J650K046J422k46j485j045N03J896K878L648L665K439Q18
57625E77609R4L01N82P04R34J009M88j75j58M52R81J312J673J668Q27j60l1J338
57607E89448K805L474L380K861K187J732J668J613J281J120J576K135J988J272
57593F18540O93L64j5k28J12O43P95R43J861L246L938L579K900K421K015J687
57577F43494J728J935J730J176R82J338J684J727J803K015J946J486J215J553
$$ y = [536170, 539486, 544144, 550477, 559400, 572094, 588961, 609634, 634225, 663919, 700053, 742999, 791801, 843955, 895111, 939444, 970803, 983925, 975721, 946971, 903102, 852253, 801588, 755100, 714231, 679473, 651039, 628739, 611775, 598731, 588030, 578906, 571716, 566877, 563766, 561315, 559309, 558286, 558430, 559420, 561070, 563116, 564538, 564292, 562807, 561762, 562265, 564161, 567039, 570687, 574352, 576791, 577609, 577703, 578004, 578586, 579290, 580224, 581233, 581721, 581546, 581388, 581840, 582821, 584133, 585806, 587474, 588301, 588141, 588110, 589448, 592253, 595727, 599107, 601968, 604155, 605887, 607555, 609168, 610449, 611569, 613145, 615280, 617268, 618540, 619233, 619597, 619582, 619354, 619466, 620109, 620904, 621847, 623708, 626954, 630892, 634471, 637371, 639792, 641807, 643494, 645222, 647157, 648887, 650063, 651045, 652383, 654067, 655794, 657597, 659612, 661558, 663044, 664259, 665812]
57563F65812K195K656K851K918K961L145L627M216M492M370M287M720N740O956
57549G20946P709P492O404N047L846K863K309K602L480L823L019J974K076L519
57535G77109N235O091N624M114K550K007K491K885K569K338L012M091M724N167
57521H30007O026O776O521N716N669O499P003O600O031O001O344O786P446Q228
57507I21653Q524P960O850N760N124N196N815O275O072N545N295N286N209N227
57493A005791N522N560M845M021M085M860N421N715O434P412P670P131O889P431
57479A088787P903P576O928O709O912P153P274P154O654O076O007O477O853O798
57465A185261O593O465O291O061N948N888N859O346P642Q856Q770P705P238Q018
$$ y = [665812, 668007, 670663, 673514, 676432, 679393, 682538, 686165, 690381, 694873, 699243, 703530, 708250, 713990, 720946, 728655, 736147, 742551, 747598, 751444, 754307, 756616, 759218, 762698, 766521, 769540, 771514, 773590, 777109, 782344, 788435, 794059, 798173, 800723, 802730, 805221, 808106, 810675, 813013, 816025, 820116, 824840, 830007, 836033, 842809, 849330, 855046, 860715, 867214, 874217, 880817, 886848, 892849, 899193, 905979, 913425, 921653, 930177, 938137, 944987, 950747, 955871, 961067, 966882, 973157, 979229, 984774, 990069, 995355, 1000564, 1005791, 1011313, 1016873, 1021718, 1025739, 1029824, 1034684, 1040105, 1045820, 1052254, 1059666, 1067336, 1074467, 1081356, 1088787, 1096690, 1104266, 1111194, 1117903, 1124815, 1131968, 1139242, 1146396, 1153050, 1159126, 1165133, 1171610, 1178463, 1185261, 1191854, 1198319, 1204610, 1210671, 1216619, 1222507, 1228366, 1234712, 1242354, 1251210, 1259980, 1267685, 1274923, 1282941]
57451A282941R105R695J0101J0517J0302R240Q348Q550R428J0110J0542J1055
57439A399934J1437J1353J1035J0833J0574J0067R717R917J0319J0355J0126J0087
57427A525754J0259J0391J0549J0960J1507J1923J2203J2409J2323J1837J1404
57416A651519J1624J2458J3241J3480J3289J3099J3107J3051J2674J2397J3101
57405A793040J4862J6294J5952J4179J2653J2172J1962J1405J1178J2021J3323
57394A939041J3923J3750J3741J4439J5419J6062J6265J6314J6478J6832J7278
57383B109542J7774J8463J9336J9853J9337J7923J6608J6165J6375J6497J6135
57372B304008J5425J4783J4664J5255J6133J6615J6564J6445J6536J6588J6466
$$ y = [1282941, 1292046, 1301741, 1311842, 1322359, 1332661, 1341901, 1350249, 1358799, 1368227, 1378337, 1388879, 1399934, 1411371, 1422724, 1433759, 1444592, 1455166, 1465233, 1474950, 1484867, 1495186, 1505541, 1515667, 1525754, 1536013, 1546404, 1556953, 1567913, 1579420, 1591343, 1603546, 1615955, 1628278, 1640115, 1651519, 1663143, 1675601, 1688842, 1702322, 1715611, 1728710, 1741817, 1754868, 1767542, 1779939, 1793040, 1807902, 1824196, 1840148, 1854327, 1866980, 1879152, 1891114, 1902519, 1913697, 1925718, 1939041, 1952964, 1966714, 1980455, 1994894, 2010313, 2026375, 2042640, 2058954, 2075432, 2092264, 2109542, 2127316, 2145779, 2165115, 2184968, 2204305, 2222228, 2238836, 2255001, 2271376, 2287873, 2304008, 2319433, 2334216, 2348880, 2364135, 2380268, 2396883, 2413447, 2429892, 2446428, 2463016, 2479482]
57361B479482J6516J6989J7585J7995J8434J9134J9687J9509J8785J8456J9154
57350B681726K0496K1541K1742K1368K1031K0958K0878K0595K0363K0479K0804
57339B911981K0982K0899K0660K0336K0070K0115K0433K0565K0364K0434K1188
57328C138027K1951K1760K0859K0422K0940K1752K2160K2208K2223K2352K2690
57317C377344K3166K3255K2547K1645K1726K3026K4541K5377K5669K5961K6377
57306C640634K6716K6836K6725K6530K6512K6616K6329K5564K5214K6002K7149
57295C930827K7285K6459K6008K6541K7348K7895K8489K9213K9573K9539K9759
57284D238936L0253L0153K9219K8372K8249K8428K8592K9175L0121L0437K9789
$$ y = [2479482, 2495998, 2512987, 2530572, 2548567, 2567001, 2586135, 2605822, 2625331, 2644116, 2662572, 2681726, 2702222, 2723763, 2745505, 2766873, 2787904, 2808862, 2829740, 2850335, 2870698, 2891177, 2911981, 2932963, 2953862, 2974522, 2994858, 3014928, 3035043, 3055476, 3076041, 3096405, 3116839, 3138027, 3159978, 3181738, 3202597, 3223019, 3243959, 3265711, 3287871, 3310079, 3332302, 3354654, 3377344, 3400510, 3423765, 3446312, 3467957, 3489683, 3512709, 3537250, 3562627, 3588296, 3614257, 3640634, 3667350, 3694186, 3720911, 3747441, 3773953, 3800569, 3826898, 3852462, 3877676, 3903678, 3930827, 3958112, 3984571, 4010579, 4037120, 4064468, 4092363, 4120852, 4150065, 4179638, 4209177, 4238936, 4269189, 4299342, 4328561, 4356933, 4385182, 4413610, 4442202, 4471377, 4501498, 4531935, 4561724]
57273D561724K9345L0033L1112L1513L1508L1943L2729L3327L3873L4679L5244
57262D917030L4980L4358L4214L4421L4308L3920L3797L3877L3696L3359L3338
57251E291298L3565L3590L3420L3413L3557L3623L3747L4106L4311L3777L2496
57240E660903L0912K9384K8255K7883K7968K7440K5739K3681K2338K1696K1182
57229E947381K0850K1083K1596K1750K1524K1276K0939K0285J9619J9365J9366
57218F175034J9337J9491J9885J9786J8834J8161J9178K1617K3989K5666K7144
57207F408122K8617K9638L0138L0466L0392K9306K7505K6058K5333K4755K4146
57196F714476K4031K4396K4324K3365K2250K1766K1801K1825K1533K0661J9043
$$ y = [4561724, 4591069, 4621102, 4652214, 4683727, 4715235, 4747178, 4779907, 4813234, 4847107, 4881786, 4917030, 4952010, 4986368, 5020582, 5055003, 5089311, 5123231, 5157028, 5190905, 5224601, 5257960, 5291298, 5324863, 5358453, 5391873, 5425286, 5458843, 5492466, 5526213, 5560319, 5594630, 5628407, 5660903, 5691815, 5721199, 5749454, 5777337, 5805305, 5832745, 5858484, 5882165, 5904503, 5926199, 5947381, 5968231, 5989314, 6010910, 6032660, 6054184, 6075460, 6096399, 6116684, 6136303, 6155668, 6175034, 6194371, 6213862, 6233747, 6253533, 6272367, 6290528, 6309706, 6331323, 6355312, 6380978, 6408122, 6436739, 6466377, 6496515, 6526981, 6557373, 6586679, 6614184, 6640242, 6665575, 6690330, 6714476, 6738507, 6762903, 6787227, 6810592, 6832842, 6854608, 6876409, 6898234, 6919767, 6940428, 6959471]
57185F959471J7291J6628J7502J8974J9821J9668J8824J7653J6519J5722J5030
57174G153103J3798J1894R985Q577P217N073J987j409m321o399p954r731j2187
57161G169633j4868j6859j7896j8643j9810k1380k2786k3596k3920k4350k5428
57150F940097k6927k7831k7390k5821k3611k0614j6658j2670j0004q705p511n860
57138F726495m882n888q800j2703j7171k2319k7956l3526l8720m3506m7556n0090
57126F413378n0387m8271m4133l8577l2055k4774j7070r814m119n29J330K336
57114F147315L370N346R273J5952K5655L8323N3974P2636R4051J17798J44028
57103F727721J74015K09823K53592L07306L73069M53002N48607O60571P89315
$$ y = [6959471, 6976762, 6993390, 7010892, 7029866, 7049687, 7069355, 7088179, 7105832, 7122351, 7138073, 7153103, 7166901, 7178795, 7188780, 7197357, 7204574, 7209647, 7211634, 7210225, 7205904, 7199505, 7191551, 7181820, 7169633, 7154765, 7137906, 7120010, 7101367, 7081557, 7060177, 7037391, 7013795, 6989875, 6965525, 6940097, 6913170, 6885339, 6857949, 6832128, 6808517, 6787903, 6771245, 6758575, 6748571, 6739866, 6732355, 6726495, 6721613, 6715725, 6706925, 6694222, 6677051, 6654732, 6626776, 6593250, 6554530, 6511024, 6463468, 6413378, 6362991, 6314720, 6270587, 6232010, 6199955, 6175181, 6158111, 6148297, 6144178, 6143649, 6144979, 6147315, 6150685, 6156031, 6165304, 6181256, 6206911, 6245234, 6299208, 6371844, 6465895, 6583693, 6727721, 6901736, 7111559, 7365151, 7672457, 8045526, 8498528, 9047135, 9707706, 10497021]
57094A0497021R35236J098032J276173J467248J667919J872555K071882K253127
57086B3139193K401169K500906K542650K527693K464365K350977K160712J849894
57078D1937559J389067P90070J05459n94707j246567j804332k243364k558652
57070C5774533k758437k855619k863207k794998k666398k492847k288798k068387
57062A4985842j844906j628280j424238j236385j067743r19736p91423o80886
57054E392245n86535n06524m38288l79678l29735k87668k51918k21019j94472
57045B196408j72095j53237j37266j24042j13202j03646r4459q5734p7846p0390
57035A064491o2503n3811m4420l4330k3461j2022m82J0702K0857K8325K9905K1665
$$ y = [10497021, 11432257, 12530289, 13806462, 15273710, 16941629, 18814184, 20886066, 23139193, 25540362, 28041268, 30583918, 33111611, 35575976, 37926953, 40087665, 41937559, 43326626, 44116696, 44222155, 43627448, 42380881, 40576549, 38333185, 35774533, 33016096, 30160477, 27297270, 24502272, 21835874, 19343027, 17054229, 14985842, 13140936, 11512656, 10088418, 8852033, 7784290, 6864554, 6073131, 5392245, 4805710, 4299186, 3860898, 3481220, 3151485, 2863817, 2611899, 2390880, 2196408, 2024313, 1871076, 1733810, 1609768, 1496566, 1392920, 1298461, 1212727, 1134881, 1064491, 1001988, 948177, 903757, 869427, 845966, 833944, 833462, 844164, 865021, 893346, 923251, 944916]
57023I44916J726k6582n4968p5092q3805q3421p7805o9504o0127n1145m3293l6323
57011B84577l0117k5269k2092j9911j7856j5671j3417j1144r191q002p364o617
56999I7926n804n668o251o544n885m713l567k328r24K49J151K459M570P013R283
56984H0967J1405J3250J4169J3713J1887Q485L272k795p755j0592j1968j2630
56972A11408j2328j0898r081p378n202k149R57L166M619N892P095Q480J0840J4290
56958A19711J7612J9688K0645K0648J8671J3715O425j658r550j6446k0838k1626
56946A66997j9616j6733j4030j1462q917o356l440o9L108N724Q501J2127J6027
56933A31861J9391K2614K6341K9657L0570K7895K1499J1500j103j3463k2284k6558
$$ y = [944916, 946642, 920060, 865092, 790000, 706195, 622774, 544969, 475465, 415338, 364193, 320900, 284577, 254460, 229191, 207099, 187188, 169332, 153661, 140244, 129100, 119909, 111907, 104543, 97926, 92122, 86454, 80203, 73659, 67774, 63061, 59494, 57166, 56242, 56491, 57642, 60101, 64671, 71684, 80967, 92372, 105622, 119791, 133504, 145391, 153876, 157148, 154353, 146598, 136006, 124038, 111408, 99080, 88182, 79101, 71723, 66521, 64372, 65329, 68495, 73114, 79006, 86101, 94581, 105421, 119711, 137323, 157011, 177656, 198304, 216975, 230690, 237115, 235457, 225907, 209461, 188623, 166997, 147381, 130648, 116618, 105156, 96239, 89883, 86443, 86374, 89482, 95206, 103707, 115834, 131861, 151252, 173866, 200207, 229864, 260434, 288329, 309828, 321328, 320225, 306762, 284478, 257920]
56921B57920k7744k7480k6303k4409k2153j9550j6418j3132j0366q128o071m514
56909E1652m004m044l511k323j473j288r20J57J400K278L059M028M866N278N627
56894F0782O478P974R862J1741J3270J4569J6292J8792K1371K2907K2898K1241
56882B48177J7412J0938K625n589j1997j5778j6643j4981j2181r711p644m954
56870A79674j235K778O393R774J3388J7516K2446K8414L5100M1777M7903N2915
56858D56843N5476N3677M6123L2552J3966o926k5907l9165m5344m5320m0584l2920
56846D22471k4781j8110j2588o432R14Q306J5158K2502L1360M1511N2419O3978
56834E96708P5415Q4629Q9235Q7268P6465N4738K3064j2839m5209o8670q1802
$$ y = [257920, 230176, 202696, 176393, 151984, 129831, 110281, 93863, 80731, 70365, 62237, 56166, 51652, 47648, 43604, 40093, 37770, 36297, 35009, 34089, 34246, 35646, 37924, 40983, 45011, 49877, 55155, 60782, 67260, 75234, 85096, 96837, 110107, 124676, 140968, 159760, 181131, 204038, 226936, 248177, 265589, 276527, 279152, 273563, 261566, 245788, 229145, 214164, 201983, 192272, 184628, 179674, 178439, 181217, 187610, 197384, 210772, 228288, 250734, 279148, 314248, 356025, 403928, 456843, 512319, 565996, 612119, 644671, 658637, 651711, 625804, 586639, 541295, 495975, 455391, 422471, 397690, 379580, 366992, 360560, 361474, 369780, 384938, 407440, 438800, 480311, 532730, 596708, 672123, 756752, 845987, 933255, 1009720, 1064458, 1087522, 1074683, 1029474, 960804, 879002]
56823H79002q5603q1998p3514o2810n1776m1239l1407k2196j3290m450M174J2343
56811D27236K0262K8591L7851M7805N7108O3487O4446N8083M3515K1313n721l2536
56799H31440n3752o6431p0945o9383o3715n5420m5938l6690k8677k2125j6377
56788C01987j0411l892K366P493J1880J6763K2583K8380L2663L4083L1371K3703
56776D98969J1617k897j7418k9829l8408m2307m2195l9709l6058l1703k7224k3441
56764A79397k0456j7534j4278j1229q967p422o309n539m876m001l170l072l719
56751F8825m222m027l507l063k468j588r68j012j278j148p14m78o01r32j315j490
56735D0014j148m33Q0J46J69M07N44L78L30P56J280J337R80P12Q12J256J958K642
$$ y = [879002, 793399, 711401, 637887, 575077, 523301, 482062, 450655, 428459, 415169, 410719, 414893, 427236, 447498, 476089, 513940, 561745, 618853, 682340, 746786, 804869, 848384, 869697, 863976, 831440, 777688, 711257, 640312, 570929, 507214, 451794, 405856, 369166, 340489, 318364, 301987, 291576, 287684, 290050, 297543, 309423, 326186, 348769, 377149, 409812, 443895, 475266, 498969, 510586, 507689, 490271, 460442, 422034, 379727, 337532, 297823, 261765, 230062, 202838, 179397, 158941, 141407, 127129, 115900, 106933, 99511, 93202, 87663, 82787, 78786, 75616, 72544, 68825, 64603, 60576, 57069, 54006, 51538, 49950, 48982, 47970, 46692, 45544, 44830, 44352, 43751, 42819, 41504, 40014, 38866, 38433, 38513, 38659, 38828, 39235, 39779, 40157, 40487, 41243, 42523, 43860, 44840, 45552, 46364, 47620, 49578, 52220]
56717E2220K777K079R86L23M50Q89Q62J98l67k9R19J342Q24K92N98J270J417J173
56699F8223J158J213P93K69M32J023J095O46N41R25J152J170J556K109K037J583
56683H5925J781K421K133Q41K71J246K353K209J373Q90N22l17j202j505j510j539
56667I5892j069J35J068Q89L11M41J024J099N31j97r92j808k026j268k84L8o7
56650I3717Q0L84L62J21n5l88r58j069k74O45O78j1o02q77j022r26n96n86j064
56631H7559j211m85L01K36k63l49k19m56p20l81K38N12O61J063J102K36n85r8
56613H7141J229J833J314M78l36j311j914j341j17L72l2j42N50J240J357J250
56597I1571J154P19n8n42l91R3O83J350J721J350N46L5r0j59K9Q18J582J327L59
$$ y = [52220, 54997, 57076, 58062, 58385, 58835, 59724, 60586, 60784, 60417, 60388, 61307, 62649, 63473, 63765, 64363, 65633, 67050, 68223, 69381, 70594, 71387, 71656, 72088, 73111, 74206, 74852, 75393, 76318, 77470, 78640, 80196, 82305, 84342, 85925, 87706, 90127, 92260, 93101, 93372, 94618, 96971, 99180, 100553, 101443, 101965, 101648, 100446, 98941, 97431, 95892, 94823, 94958, 96026, 96915, 97226, 97667, 98691, 99790, 100321, 100124, 99132, 97324, 95298, 94030, 93746, 93784, 93717, 93797, 94181, 94543, 94664, 94609, 94221, 93263, 92194, 91920, 92565, 93243, 93232, 92630, 91753, 90731, 89805, 89209, 88623, 87559, 86348, 85863, 86164, 86400, 86137, 85788, 85569, 85113, 84393, 84012, 84250, 84762, 85423, 86486, 87588, 87824, 87239, 87141, 88370, 90203, 91517, 91995, 91659, 90348, 88434, 87093, 86976, 87348, 87316, 87174, 87724, 88964, 90321, 91571, 92725, 93444, 93386, 92844, 92453, 92546, 93229, 94579, 96300, 97650, 98196, 98231, 98141, 97982, 98011, 98829, 100411, 101738, 102097]
56578A02097PO23J224J234J265J742K084J765J238J199J687K375L074L618L871
56563A29103M110M898O376Q177J0004J1736J3003J3231J2128R665N832J078l308
56550B26033o042o987o854o161n205m540m493m401l423j903j038j306k100k676
56536A68904k696k108j364j369k297k942k307j205j079j739j760q19L4K79N27
56521A48059J076J373J090M97l62j610k610k482j621j316j747j769r25j38l4l5
56505A37446L27M93mn86m74L17J285J980J952R51n31j648k160k284j824n31Q70
56488A35579J206M94j57k18q4J47P98J468J309N64L66P88P37J4k42L97Q55M83
56470A44504Q2K50K79l27p21k03M47K53l95n71k92j25p1K15O87J141J548J647
$$ y = [102097, 102104, 102727, 103951, 105185, 106450, 108192, 110276, 112041, 113279, 114478, 116165, 118540, 121614, 125232, 129103, 133213, 138111, 144487, 152664, 162668, 174404, 187407, 200638, 212766, 222431, 228263, 229341, 226033, 219991, 213004, 206150, 199989, 194784, 190244, 185751, 181350, 177927, 176024, 174986, 173680, 171580, 168904, 166208, 164100, 162736, 161367, 159070, 156128, 153821, 152616, 151537, 149798, 148038, 147219, 147253, 147532, 148059, 149135, 150508, 151598, 152095, 151733, 150123, 147513, 145031, 143410, 142094, 140347, 138578, 137653, 137515, 137481, 137446, 137773, 138266, 138262, 137676, 137202, 137519, 138804, 140784, 142736, 143687, 143156, 141508, 139348, 137064, 135240, 134709, 135579, 136785, 137279, 137122, 136904, 136820, 136967, 137765, 139233, 140542, 141106, 141472, 142260, 142997, 143011, 142769, 143166, 144021, 144504, 144586, 144836, 145115, 144788, 144067, 143864, 144311, 144564, 144169, 143598, 143306, 143181, 143110, 143325, 144012, 145153, 146701, 148348]
56452A48348R13l88j005j52J464K557K596J833Q22L28Q83J937K208J203l73j835
56436A61339l086l809l336j830m79lJ1k9l52q97r91n16j80j60K48J083J248L34
56418A48595m06J69J545K670L405L940L893L067K225K051K159J880J269O24j47
56403A76939r43j175p39l88n15n62j99K2k02k87K8J01k64k45M16O12k59j092q55
56384A70393k57l18n33NP56N98j97m63MM98P81J089J185O77m2k38K7J40RL1L74
56363A74519R28J612K185K335K283K620L124K855J835J374J964K294J373K47L29
56348B01877J243J738J698J728J644R48J63K09R15J457J793K427L197L479L260
56333B27776K947K603K288K589L730M737M566L605L047L275L740L920L507K236
$$ y = [148348, 149261, 148873, 147868, 147716, 149180, 151737, 154333, 156166, 156988, 157316, 158199, 160136, 162344, 163547, 163174, 161339, 158253, 154444, 151108, 149278, 148799, 148796, 148807, 148778, 148426, 147529, 146538, 146022, 145842, 145682, 145930, 147013, 148261, 148595, 148189, 148358, 149903, 152573, 155978, 159918, 163811, 166878, 169103, 171154, 173313, 175193, 176462, 177086, 176939, 175996, 174821, 174082, 173694, 173179, 172617, 172418, 172440, 172238, 171951, 171979, 172080, 171816, 171571, 171987, 172599, 172340, 171248, 170393, 170136, 169818, 169285, 169290, 170046, 170644, 170447, 169984, 169988, 170486, 171267, 172356, 173541, 174218, 174176, 173938, 173965, 174105, 174114, 174145, 174519, 175447, 177059, 179244, 181579, 183862, 186482, 189606, 192461, 194296, 195670, 197634, 199928, 201301, 201548, 201877, 203120, 204858, 206556, 208284, 209928, 210876, 211039, 211248, 212163, 213620, 215413, 217840, 221037, 224516, 227776, 230723, 233326, 235614, 238203, 241933, 246670, 251236, 254841, 257888, 261163, 264903, 268823, 272330, 274566]
56319B74566M43q41j093r58j019q48j14M39K25JO05J472J648J405J619K245K757
56302B82552L318M267N147N478N772O522O979O213M729L695L219K706K350K879
56288C45826M258N803P133Q064Q202P611P242P719Q447Q770R022R472R460Q731
56274D55760Q450R502J0976J1763J2450J4026J5881J6901J7528J8930K0948K2742
56262F35857K4593K7244L0221L2747L5579M0016M5669N1193N6656O3257P1059
56251A114091P9053Q7097R5991J05737J15438J24749J33874J42336J49164J53946
56241B301476J56380J55358J50053J41317J30296J16295R7664P4393M8255K0951
56231C392438o362l2256n5598p6432r4888j09877j20468j27691j33171j36748
$$ y = [274566, 275009, 274168, 273075, 272117, 271098, 270250, 270136, 270575, 270800, 270801, 271406, 272878, 274526, 275931, 277550, 279795, 282552, 285870, 290137, 295284, 300762, 306534, 313056, 320035, 326248, 330977, 334672, 337891, 340597, 342947, 345826, 350084, 355887, 363020, 371084, 379286, 386897, 394139, 401858, 410305, 419075, 428097, 437569, 447029, 455760, 464210, 473712, 484688, 496451, 508901, 522927, 538808, 555709, 573237, 592167, 613115, 635857, 660450, 687694, 717915, 750662, 786241, 826257, 871926, 923119, 979775, 1043032, 1114091, 1193144, 1280241, 1376232, 1481969, 1597407, 1722156, 1856030, 1998366, 2147530, 2301476, 2457856, 2613214, 2763267, 2904584, 3034880, 3151175, 3248839, 3323232, 3371487, 3392438, 3386076, 3353820, 3298222, 3221790, 3126902, 3017025, 2896557, 2768866, 2635695, 2498947]
56221B498947j37271j35056j31484j26862j20736j13732j07029j00449r3057q5134
56211A348137p7756p0984o4419n8783n4816n1344m6714m1562l7788l5369l2559
56200G76043k8881k5443k2634j9855j7352j5937j5099j3612j1740j0639r960q446
56188E76445o536n821o135n742m319l255k997k591j873j720j989j561n26j01l45
56173E30934j28P14J384K010L269M434M210L251L383M591N298N283N699O483O532
56158E87347O280P212Q992R930J0183J1537J4050J5995J7170J9228K2532K5769
56146G56225K8877L3266L8869M4059M8814N4794O1856O7613P1013P3255P4636
56135A353277P3463O8798O1591N2751M2955L4524L0215K9555K9237K7339K4250
$$ y = [2498947, 2361676, 2226620, 2095136, 1968274, 1847538, 1733806, 1626777, 1526328, 1433271, 1348137, 1270381, 1199397, 1134978, 1076195, 1021379, 970035, 923321, 881759, 843971, 808602, 776043, 747162, 721719, 699085, 679230, 661878, 645941, 630842, 617230, 605490, 594851, 584891, 576445, 569909, 564088, 557953, 552211, 547892, 544637, 541640, 539049, 537176, 535456, 533467, 531906, 531380, 531279, 530934, 530806, 531520, 532904, 534914, 538183, 542617, 546827, 550078, 553461, 558052, 563350, 568633, 574332, 580815, 587347, 593627, 600839, 609831, 619761, 629944, 641481, 655531, 671526, 688696, 707924, 730456, 756225, 785102, 818368, 857237, 901296, 950110, 1004904, 1066760, 1134373, 1205386, 1278641, 1353277, 1426740, 1495538, 1557129, 1609880, 1652835, 1687359, 1717574, 1747129, 1776366, 1803705, 1827955]
56124A827955J9624J2197L051m642r754j3844j7504j9992k2853k9694m1065n3295
56112A650184o3341p1130p6329p6937p2650o6003n8781n0597m1925l4766k9233
56101A008492k3260j6863j2707j1286r675o476l845k952j742R43L070L359L614
56088I30672N029N992N639N854P615Q988Q895R170J0846J2027J1567J1224J2092
56075A045610J2531J1774J1852J3813J5605J5800J5843J6733J7161J6819J7601
56064A211142J9699K0590J9781K0124K2522K3900K2736K1826K3003K3854K2554
56053A451731K1323K2072K2972K2409K2034K3020K3542K2810K3225K5731K7490
56042A708359K6953K6649K8257K9686K9807L0993L4076L6087L5948L7009M0724
$$ y = [1827955, 1847579, 1859776, 1862827, 1858185, 1848431, 1834587, 1817083, 1797091, 1774238, 1744544, 1703479, 1650184, 1586843, 1515713, 1439384, 1362447, 1289797, 1223794, 1165013, 1114416, 1072491, 1037725, 1008492, 985232, 968369, 955662, 944376, 934701, 928225, 924380, 921428, 919686, 920629, 923699, 927058, 930672, 935701, 941693, 947332, 953186, 960801, 969789, 978684, 987854, 998700, 1010727, 1022294, 1033518, 1045610, 1058141, 1069915, 1081767, 1095580, 1111185, 1126985, 1142828, 1159561, 1176722, 1193541, 1211142, 1230841, 1251431, 1271212, 1291336, 1313858, 1337758, 1360494, 1382320, 1405323, 1429177, 1451731, 1473054, 1495126, 1518098, 1540507, 1562541, 1585561, 1609103, 1631913, 1655138, 1680869, 1708359, 1735312, 1761961, 1790218, 1819904, 1849711, 1880704, 1914780, 1950867, 1986815, 2023824, 2064548]
56031B064548M3598M3739M4569M8221N1321N1302N1015N2838N4237N3521N3890
56020B612799N7295O0325O0885O2666O8156P3624P6013P8378Q3376Q7961Q9906
56009C411384R2740R8693J03752J05370J07956J14656J21252J24429J28433J36844
55999D545509J45614J51301J58108J69398J80529J87861J96470K10779K26191
55990F171760K38382K51961K71057K90682L06744L24984L50200L76693L99780
55981H982243M26109M61535M99910N35779N76497O29004O86797P44021Q09796
55972A4351691Q93627R89621J091384J208900J353477J520655J707051J929154
55964B5045560K205385K536378K925383L399792L986871M687868N505470O476771
$$ y = [2064548, 2108146, 2151885, 2196454, 2244675, 2295996, 2347298, 2398313, 2451151, 2505388, 2558909, 2612799, 2670094, 2730419, 2791304, 2853970, 2922126, 2995750, 3071763, 3150141, 3233517, 3321478, 3411384, 3504124, 3602817, 3706569, 3811939, 3919895, 4034551, 4155803, 4280232, 4408665, 4545509, 4691123, 4842424, 5000532, 5169930, 5350459, 5538320, 5734790, 5945569, 6171760, 6410142, 6662103, 6933160, 7223842, 7530586, 7855570, 8205770, 8582463, 8982243, 9408352, 9869887, 10369797, 10905576, 11482073, 12111077, 12797874, 13541895, 14351691, 15245318, 16234939, 17326323, 18535223, 19888700, 21409355, 23116406, 25045560, 27250945, 29787323, 32712706, 36112498, 40099369, 44787237, 50292707, 56769478]
55956E6769478P648107R043997J0704417J2730277J5241492J8302853K1924545
55949A52365166K6074230L0565731L4887166L8152671L9185834L6651625K9394696
55942C87277119J7184192J476404j4694442k8007531l6420440l9769622l9179728
55935B47865952l6113047l1821673k7221637k2883837j9060172j5801286j3090125
55928H1874175j0880522r085926p611794o400320n416820m614262l944062l384381
55920C0536088k927003k549389k224914j946793j717359j525073j353760j203085
55912A5088712j079045r74246q76684p88434p17251o58308o01394n48100n05424
55903H339826m69759m32798l96533l67703l43698l17810k92310k73023k56782
$$ y = [56769478, 64417585, 73461582, 84165999, 96896276, 112137768, 130440621, 152365166, 178439396, 209005127, 243892293, 282044964, 321230798, 357882423, 387277119, 404461311, 405937715, 391243273, 363235742, 326815302, 287045680, 247865952, 211752905, 179931232, 152709595, 129825758, 110765586, 94964300, 81874175, 70993653, 61907727, 54295933, 47895613, 42478793, 37864531, 33920469, 30536088, 27609085, 25059696, 22834782, 20887989, 19170630, 17645557, 16291797, 15088712, 14009667, 13035421, 12158737, 11370303, 10653052, 9994744, 9393350, 8845250, 8339826, 7870067, 7437269, 7040736, 6673033, 6329335, 6011525, 5719215, 5446192, 5189410]
55894E189410k37155k16952k02707j92005j78309j63279j52570j44216j32620
55885C569597j19733j11209j05730r8789r2909r3322r7187r7446r4097r1756q9471
55874B477948q3093p4804p0432o9512o7203o3665o2586o2616n9206n3135m8922
55863A762774m6549m2742l8494l7367l8091l6724l4395l5234l8122l8132l4863
55852A342061l2075l0369k7426k4316k4354k6491k6686k5035k5053k6786k7035
55841A046435k5655k5290k5640k4032k1037j9596j9299j7310j4159j2902j3273
55830H28242j2382j0415j0057j0934j0253q290p776q523q114p229q752j2067j3707
55817F99743j3203j2978j3031j1180q227p344q428q306o512n649o069n408l448
$$ y = [5189410, 4952255, 4735303, 4532596, 4340591, 4162282, 3999003, 3846433, 3702217, 3569597, 3449864, 3338655, 3232925, 3134136, 3041227, 2947905, 2850718, 2753272, 2659175, 2567419, 2477948, 2394855, 2320051, 2249619, 2180107, 2112904, 2049239, 1986653, 1924037, 1864831, 1811696, 1762774, 1716225, 1673483, 1634989, 1597622, 1559531, 1522807, 1488412, 1453178, 1415056, 1376924, 1342061, 1309986, 1279617, 1252191, 1227875, 1203521, 1177030, 1150344, 1125309, 1100256, 1073470, 1046435, 1020780, 995490, 969850, 945818, 924781, 905185, 885886, 868576, 854417, 841515, 828242, 815860, 805445, 795388, 784454, 774201, 765911, 758135, 749612, 741498, 734269, 725517, 713450, 699743, 686540, 673562, 660531, 649351, 641124, 633780, 625352, 617046, 610534, 604885, 598816, 593408, 589960]
55804E89960k427k268n26K696M568M584N017O106N587L357J917J690N03j795k780
55789F16189k160k508m466n605m907m308m841n270n482p338j1014j3972j4588
55776E29730j3559j1288p162j983K284N688R946J4578J6677J4761R639J720q631
55763E62400j8098k2135k0514j7427j5418j3143r726p087o448o266n274m482m737
55750D11645n181n357o107p343p628o807o383o591n833l732j918j162n41O1n23
55735C46600k125l104l315m242n728n822m405l701m414m743m087m301o028p139
55721B83446o296m980m483l816k238j052j133j042O31L170N332P055Q338Q417
55707B91349P211N664L866R06k745n017n269n238o106o944o946o823p005o718
$$ y = [589960, 587533, 585265, 584739, 587435, 592003, 596587, 601604, 607710, 613297, 616654, 618571, 620261, 620764, 618969, 616189, 614029, 611521, 607055, 601450, 596543, 592235, 587394, 582124, 576642, 569304, 558290, 544318, 529730, 516171, 504883, 497721, 495738, 498022, 503710, 513656, 528234, 544911, 559672, 569311, 571031, 562400, 544302, 522167, 501653, 484226, 468808, 455665, 445939, 438852, 432404, 426138, 420864, 416382, 411645, 406464, 401107, 395000, 387657, 380029, 373222, 366839, 360248, 354415, 350683, 348765, 347603, 347062, 347123, 346600, 344475, 341371, 338056, 333814, 328086, 322264, 317859, 314158, 309744, 305001, 300914, 296613, 290585, 283446, 277150, 272170, 267687, 263871, 261633, 260581, 259448, 258406, 259037, 262207, 267539, 274594, 282932, 291349, 298560, 304224, 308090, 308996, 306251, 301234, 295965, 290727, 284621, 277677, 270731, 263908, 256903, 250185]
55693B50185n767n131m987m292l024k491k765k316q69j7j99J62J661K767K758
55678B25675K951L902M136L039K239K616K627J158n25j325k216l830m603l355
55664B32489j524q48p87j71N42N54N25J194J785J497J065J300J576J274J112J641
55648B43224K012J589J142J122N64r84k175k046j688k245l067l321l738n053o454
55633B18882p152p811q776q672o590m022k774k448j809j130j223j571j334j046
55619A62524j427j737j105l53o39j361j276o79p17j342j733j921k315k409j623
55604A41887o96p52j532j988j902j639j058l8O71L50n50j272j922k703k979k264
55588A21613j246o98k95L88P95M65J36N88J407J999K679L597L812K858K051K723
$$ y = [250185, 244418, 239287, 234300, 230008, 226984, 224493, 221728, 219412, 218543, 218526, 218327, 218489, 220150, 222917, 225675, 228626, 232528, 236664, 239703, 241942, 244558, 247185, 248343, 247818, 246493, 244277, 240447, 235844, 232489, 230965, 230117, 229330, 229159, 229701, 230255, 230780, 231974, 233759, 235256, 236321, 237621, 239197, 240471, 241583, 243224, 245236, 246825, 247967, 249089, 249653, 248669, 246494, 244448, 242760, 240515, 237448, 234127, 230389, 225336, 218882, 211730, 203919, 195143, 186471, 179881, 175859, 173085, 170637, 168828, 167698, 166475, 164904, 163570, 162524, 161097, 159360, 158255, 157902, 157263, 155902, 154626, 153947, 153230, 151888, 150155, 148234, 145919, 143510, 141887, 141191, 140439, 138907, 136919, 135017, 133378, 132320, 132282, 132953, 133303, 132753, 131481, 129559, 126856, 123877, 121613, 120367, 119669, 119374, 119762, 120557, 121022, 121158, 121746, 123153, 125152, 127831, 131428, 135240, 138098, 140149, 142872]
55572A42872M187M910M776M644M600M152L396K640J562K3j126j283j251j947k868
55557A69287l118k962l097l349l364l594m244m322l198k000j932k286j705m56
55543A29660K61L44M35M03j44o01k77K15J38L06J677L130K697N95j055j193o39
55526A35952k21L8p4r25j922k023j455j520k556l453l335k538j859j797k477l409
55510A06426l576k654j710j710j993j383k08K37j81m20j21j9n51j337j976k302
55494H6522j974r07J03K63k1J57O42N56j82q43j109j090m77J035K590K849J784
55477H9898P00N11J042J859K709L158K801J821O52o24j824k183j349k86j32o06
55461I8147p50n93p99j191j078o81p64j063o40L59Q51O45O44J078J064K38n00
$$ y = [142872, 147059, 151969, 156745, 161389, 165989, 170141, 173537, 176177, 177739, 177762, 176636, 175353, 174102, 172155, 169287, 166169, 163207, 160110, 156761, 153397, 149803, 145559, 141237, 138039, 136039, 134107, 131821, 130116, 129660, 129921, 130265, 130700, 131103, 130959, 130358, 130081, 130296, 130434, 130740, 132417, 135547, 138244, 138839, 137784, 136591, 135952, 135731, 135769, 135695, 134770, 132848, 130825, 129370, 127850, 125294, 121841, 118506, 115968, 114109, 112312, 109835, 106426, 102850, 100196, 98486, 96776, 94783, 93400, 93192, 93429, 93248, 92828, 92707, 92688, 92137, 90800, 88824, 86522, 84548, 83641, 83744, 84007, 83986, 84143, 84785, 85341, 85159, 84316, 83207, 82117, 81640, 82675, 85265, 88114, 89898, 90598, 91109, 92151, 94010, 96719, 99877, 102678, 104499, 105151, 104527, 102703, 100520, 99171, 98885, 98753, 98147, 97397, 96804, 96005, 94814, 93736, 93055, 92291, 91228, 90588, 90947, 91798, 92443, 93087, 94165, 95229, 95467, 94967]
55444I4967l69K90P32P40M30j17p58j316j768j987j615o71R0J21r6P0L04N1l30
55425H8768k62j45o68j328j120k32K82L00O36J380J720J429J144J092Q33L41J51
55408I4321K56N5n10q29p37p13q60p93n45n31n69q0P18R10L55r6J4J93ml88p62
55387H9405j186j401r31KM93R3p29j304j349q77k28n6n72j035p17L3M29N12P59
55368H1341R71P15M62R66J819J958J384R87Q65L09n79q26k45K66K64K33L47Q6
55350I1323n67r06p15n04l63J20N85K9j406k214j620n95j80q8L03P38P39N55O02
55331H5836O65M02J1j53j47j47j04n3j94m18l16J22M26M16M61P35R24P92M94J65
55311H9917k53o64p92o10l39r1Mk88q05q21q4M91N1q35j054n71r4K95P98P66m38
$$ y = [94967, 94598, 94888, 95620, 96360, 96790, 96673, 95915, 94599, 92831, 90844, 89229, 88558, 88648, 88769, 88673, 88743, 89047, 89098, 88768, 88506, 88361, 87693, 86365, 85245, 85013, 85295, 85595, 86231, 87611, 89331, 90760, 91904, 92996, 93829, 94170, 94321, 94577, 94632, 94122, 93293, 92556, 91843, 90983, 90190, 89645, 89114, 88545, 88465, 89183, 90093, 90448, 90352, 90366, 90559, 90555, 90167, 89405, 88219, 86818, 85887, 85889, 86382, 86475, 85746, 84442, 83093, 82216, 81988, 81932, 81360, 80325, 79608, 79641, 80070, 80582, 81341, 82312, 83027, 83489, 84455, 86274, 88232, 89616, 90603, 91468, 91777, 91198, 90372, 90127, 90393, 90657, 90890, 91237, 91323, 90756, 89850, 89135, 88631, 88268, 88388, 88973, 89002, 87596, 85382, 83762, 83167, 82987, 82899, 83202, 83940, 84679, 85234, 85836, 86501, 86903, 86914, 86761, 86614, 86467, 86363, 86310, 86116, 85698, 85382, 85504, 85930, 86346, 86807, 87542, 88466, 89258, 89752, 89917, 89664, 89000, 88208, 87598, 87259, 87168, 87172, 86884, 86079, 85258, 85174, 85665, 85716, 84881, 83827, 83256, 83162, 83457, 84255, 85021, 84583]
55290H4583j832j821o25M9k82l49M95J287J222P43L42j44n73l82J16j65j175j475
55272H0014m53P45J141J245J671J953J572R41N26J22k90k16K16Q7o94j004m10
55255H7166l4o27j257r13j08K41K69M25M31Q4K4N95J039Q19O44J066J220L09q07
55236I0586q85l09k79p58p45j07K96M4m61q78j147j146r09q74j136j027j99N59
55218H0625M60J1J27N65M91M7J03O72P92K3r57j280o96N42J880K521J982O42n06
55199H8044p11K1R48J035r6j526j870r64O7M47N06N90L95n9n8N23O99j7o33l12
55179H7029J79j56p73n42K90N64N2n22q38j066j019l65N14J032J399K061K600
55162I0439K279J400Q77Q05N64O1k58m39q59j271j139p41p54r64o49n9j66r20
$$ y = [84583, 82751, 80930, 80305, 80354, 80072, 79723, 80218, 81505, 82727, 83470, 83812, 83668, 83095, 82713, 82829, 82664, 81489, 80014, 79561, 80306, 81447, 82692, 84363, 86316, 87888, 88829, 89355, 89477, 89187, 88971, 89187, 89274, 88580, 87576, 87166, 87132, 86505, 85248, 84335, 84227, 84468, 84737, 85162, 85593, 85677, 85701, 86296, 87335, 88154, 88798, 89864, 91084, 91393, 90586, 89701, 89392, 89113, 88355, 87610, 87503, 87799, 87843, 87382, 86504, 85357, 84211, 83302, 82428, 81292, 80265, 80066, 80625, 81085, 81096, 81223, 81788, 82279, 82326, 82429, 83101, 83893, 83916, 82959, 81679, 80983, 81525, 83405, 85926, 87908, 88550, 88044, 87333, 87354, 88302, 89337, 89241, 87715, 85845, 84881, 84948, 85395, 85901, 86491, 86886, 86827, 86769, 87292, 87991, 87974, 87341, 87029, 87208, 87052, 86279, 85737, 86027, 86591, 86643, 86121, 85283, 84217, 83198, 82833, 83347, 84379, 85778, 87839, 90439, 92718, 94118, 94995, 95800, 96364, 96425, 96167, 95728, 94869, 93598, 92459, 91718, 90964, 90000, 89351, 89292, 89126, 88206]
55144H8206j187n80LL4J49P82J200P07j39l69%J96j23o17r04r08o91l81j60m9
55124H5169J90P38J350J473P78m41j433j626j192p73o73n80j34N60J206J715K072
55107H8399K152J910J503J018L81k51m61j44L15O51R73J274J257R54P88P15R7
55090A01531j049j585p75M63P22n3q11j006r58q63m78K30Q49J049Q41L95n9l15
55072I8128m75q13j172j022m00j8m9K72J237J906J573J018J145J317M70q57j216
55055A01044n55j92o13r24o03k54k73j54L57N16k82j504k173j984j248l45L92
55038I1205O81N55L35K49L32O47J118J328R41L07N8K20K87P9j19j56j32M9N23
55019I8507R57Q81M59K23P3n70j572j929j075L56J345J499J052L94j14k61j76
$$ y = [88206, 87019, 86439, 86442, 86476, 86625, 87407, 88607, 89314, 89175, 88806, 88806, 89002, 88879, 88262, 87358, 86450, 85759, 85378, 85218, 85169, 85359, 86097, 87447, 88920, 89698, 89257, 87824, 86198, 85006, 84233, 83560, 82980, 82846, 83406, 84612, 86327, 88399, 90551, 92461, 93964, 94982, 95363, 95112, 94651, 94507, 94822, 95473, 96446, 97720, 98977, 99931, 100719, 101434, 101531, 100482, 98897, 98122, 98585, 99307, 99254, 98443, 97437, 96479, 95616, 95138, 95368, 96217, 97266, 98107, 98502, 98443, 98128, 97653, 96840, 95668, 94646, 94246, 94228, 94179, 94451, 95688, 97594, 99167, 100185, 101330, 102647, 103117, 102260, 101044, 100489, 100297, 99684, 98760, 98157, 97903, 97630, 97476, 97833, 98349, 98067, 96563, 94390, 92406, 91158, 90813, 91205, 91886, 92441, 92776, 93025, 93357, 94004, 95122, 96450, 97391, 97698, 97756, 97976, 98263, 98342, 98223, 98067, 97935, 97984, 98507, 99464, 100345, 100804, 101027, 101100, 100530, 98958, 97029, 95954, 96310, 97655, 99154, 100206, 100600, 100486, 100225, 100049]
55002A00049j37j82k18l14m82l56L09J027J079N96M11Q08J120P10k39j097j419
54985A01665j035l0J141J814J662R53K54QK45N30M47K03L91R61J086M34k07j55
54967A10367K1n13j376j565j019m91k09J78M99J84n59q64n71l18k71Q4O80O51
54949A04908k19r73q60l46k43o03j040j350j346o99N18J611K019J841J404Q89
54933A05511O18R85J751K007J275J54m66l75J08P03J275J733K152K668L114L221
54917A26434L249L860N084O024N886M857L584K276P43j023k732m063m836n094
54903A44249n141n258n280m725l467k025j064q23j062j301j112m51K71N78L49
54888A13738k39q87j140n74O00J563J833J781J736J381O53N35J836L748M799M931
$$ y = [100049, 99912, 99730, 99512, 99198, 98716, 98360, 98669, 99696, 100775, 101371, 101782, 102590, 103710, 104420, 104181, 103084, 101665, 100630, 100600, 101741, 103555, 105217, 106170, 106424, 106432, 106677, 107207, 107654, 107857, 108248, 109209, 110295, 110729, 110522, 110367, 110388, 109875, 108499, 106934, 105915, 105424, 105215, 105393, 105892, 106076, 105517, 104653, 104082, 103764, 103493, 103577, 104257, 104908, 104689, 103716, 102856, 102510, 102267, 101664, 100624, 99274, 97928, 97229, 97747, 99358, 101377, 103218, 104622, 105511, 106129, 107114, 108865, 110872, 112147, 112301, 111835, 111460, 111568, 112271, 113546, 115279, 117431, 120099, 123213, 126434, 129683, 133543, 138627, 144651, 150537, 155394, 158978, 161254, 161997, 160974, 158242, 154179, 149343, 144249, 139108, 133850, 128570, 123845, 120378, 118353, 117289, 116466, 115404, 114103, 112991, 112540, 112811, 113389, 113738, 113499, 112612, 111472, 110898, 111498, 113061, 114894, 116675, 118411, 119792, 120445, 120980, 122816, 126564, 131363, 136294]
54872A36294N284O067O145M956L436K515J875P84p29k171l356m299m886n086n069
54857A41760m857m340l731l463l538l572l468l397l125k298j332j056j329j096
54843A01158j21M78q8j134j592j337q30j94N42R87R04O60O37O27L67J45L60Q96
54825A02465J338J445J063J15r89j498j239q77r05r56n56L6K28m4l30k69J93Q48
54807A00068J309J330J101Q91N23j70o31j73P06P63j21o55o8Q31J031O32J40m13
54789A07094q74m98Q75J983J542k2j173j170n04J54N39O45O53Q80J262J285Q54
54772A13525O97J345K241K518K235K170K778L874N027N728N658N224N304N948
54758A64272O003M693K824J601Q83m16k649n055o793p491p081n911m831m384m122
$$ y = [136294, 141578, 147645, 153790, 158746, 162182, 164697, 166572, 167356, 166627, 164456, 161100, 156801, 151915, 146829, 141760, 136903, 132563, 128832, 125369, 121831, 118259, 114791, 111394, 108269, 105971, 104639, 103583, 102254, 101158, 101037, 101515, 101427, 100293, 98701, 97364, 96534, 96340, 96882, 97869, 98773, 99433, 100070, 100697, 101064, 101209, 101569, 102465, 103803, 105248, 106311, 106426, 105437, 103939, 102700, 101823, 100918, 99962, 99406, 99442, 99670, 99626, 99296, 99027, 99220, 100068, 101377, 102707, 103808, 104699, 105222, 105052, 104421, 104248, 104954, 105717, 105596, 104941, 104873, 105704, 106735, 107367, 107507, 107094, 106220, 105722, 106597, 108580, 110122, 110100, 108927, 107757, 107253, 107407, 107946, 108591, 109244, 110124, 111386, 112671, 113525, 114222, 115567, 117808, 120326, 122561, 124731, 127509, 131383, 136410, 142138, 147796, 153020, 158324, 164272, 170275, 174968, 177792, 179393, 180276, 179860, 177211, 172156, 165363, 157872, 150791, 144880, 140049, 135665, 131543]
54743A31543l376k343j727j571j382j076r40q16k74M43N57o7o40n02J63P88J107
54726A19887J231J445J997K718L021K617K076K239L221M412N223N398M802L529
54712A63816K094R39j32j499k905l674l734l734m104m531m520l970l142k350j860
54697A26694j753j865j941j888j748j577j524j707j872j505o04P3p0o62r37p89
54681A06325o63o57m28P7L64R4m69p76n86r9L15M61M45M06K44j38m35k44K85O07
54661A05128O42P91J055R11L95L44J064J609J105M4n70o33o34n40o8L61N5p14
54643A10345j016p09n04o07l50N63J400J391P15O3j93n5L77Q53R20L74l79o85
54625A12503l48J65K66j23n66p46q53j032q00L89J970K519J441k30j156j128p74
$$ y = [131543, 128167, 125824, 124097, 122526, 121144, 120068, 119128, 118312, 118038, 118481, 119038, 118971, 118331, 117829, 117992, 118780, 119887, 121118, 122563, 124560, 127278, 130299, 132916, 134992, 137231, 140452, 144864, 150087, 155485, 160287, 163816, 165910, 166849, 166717, 165218, 162313, 158639, 154905, 151171, 147067, 142536, 138016, 134046, 130904, 128554, 126694, 124941, 123076, 121135, 119247, 117499, 115922, 114398, 112691, 110819, 109314, 108710, 108783, 108713, 108051, 107114, 106325, 105662, 105005, 104577, 104654, 105018, 105112, 104643, 103867, 103281, 103182, 103497, 103958, 104403, 104809, 105053, 104915, 104480, 104236, 104521, 105128, 105770, 106561, 107616, 108527, 108922, 109266, 110330, 111939, 113044, 113088, 112518, 111885, 111251, 110711, 110643, 111004, 111059, 110345, 109329, 108620, 108116, 107509, 107159, 107722, 109122, 110513, 111228, 111291, 111098, 111043, 111420, 112273, 113193, 113567, 113188, 112503, 112155, 112320, 112586, 112463, 111897, 111151, 110298, 109266, 108466, 108855, 110825, 113344, 114785, 114555, 113399, 112271, 111497]
54608A11497m56j62M1J16L10P25R84P84M01J17k80q82j081m46L39L17l37o53l71
54589A10963j83m77p79n80LN23O56K94l11n75j78M14M70p5o49q17n62j9O26J111
54569A09855J334J426J299N84n87j308r74j20M80R24J590K005J432K40m12j49
54553A17619L73O84R82J352J399Q98J36m86p02l04N41J122R21L34N3L1j65m04
54535A24384l04j61m97r13n23M90R66M52l06o93r23j190j210r17p41p35l88L84
54517A17175Q84O79K29O8M9j59m97p34q30p11k12N46J179J516J585J218L69k65
54499A22089J03J031J183K01p60p78l65l55m84N0J195J984J693M84q90j630j341
54482A23410k94Q45J588J837J611J023M54K66L38L05K05L37N60M36N1K5N86J286
$$ y = [111497, 111041, 110879, 110920, 111036, 111346, 112071, 113055, 113839, 114240, 114357, 114077, 113195, 112114, 111668, 112007, 112324, 111987, 111334, 110963, 110780, 110303, 109524, 108944, 108947, 109470, 110126, 110420, 110109, 109534, 109356, 109770, 110240, 110165, 109516, 108699, 108137, 108118, 108744, 109855, 111189, 112615, 113914, 114498, 113911, 112603, 111629, 111509, 111989, 112913, 114503, 116508, 117940, 118180, 117768, 117619, 117992, 118676, 119658, 121010, 122409, 123307, 123443, 122957, 122255, 121951, 122492, 123614, 124535, 124869, 124922, 124953, 124788, 124384, 124080, 123919, 123422, 122509, 121986, 122476, 123442, 123894, 123588, 122895, 121972, 120782, 119572, 118655, 117914, 117179, 116791, 117175, 118059, 118738, 118967, 119035, 119084, 118925, 118428, 117694, 116864, 116153, 115941, 116487, 117666, 119182, 120767, 121985, 122354, 122089, 122192, 123223, 124406, 124607, 123847, 123069, 122704, 122349, 121865, 121915, 123110, 125094, 126787, 127271, 126381, 124751, 123410, 123116, 123961, 125549, 127386, 128997, 130020, 130474, 130740, 131078, 131383, 131588, 131925, 132485, 132921, 132972, 132997, 133583, 134869]
54464A34869J699J828J706J291P69M01K5n93j050p30P9M00k8m59m18l66p93j519
54446A37111k184k621k562j759o71j76l70m74k08k28q62j381j099l76N9Q7L6J50
54428A22472N94J391K070K064J621J461J492Q93k85q80m23J33R3J53R17J547J048
54411A36361p5o04l59J2L07P19R57O45J34J7J06p7k41K11J007J312J037Q30R08
54392A43207Q77O51O05P43N82O3k09J51P17Q78N84K52J51P0l99j220j691j205
54374A44807j74L80K48L27J201K234K634K668L068L749M019L663L016K175R78
54359A74993l98j504k212k653k693k098j203p61j076j670j933j744j486j544j864
54344A50154j977j680j501j968k519k020n61L46j19q70n91K90N14J9k24l1k15
$$ y = [134869, 136568, 138396, 140102, 141393, 142162, 142563, 142588, 141995, 140945, 140215, 140294, 140694, 140666, 140207, 139789, 139423, 138630, 137111, 134927, 132306, 129744, 127985, 127314, 127138, 126768, 126294, 126086, 125858, 124996, 123615, 122516, 122140, 122199, 122286, 122322, 122472, 123066, 124457, 126527, 128591, 130212, 131673, 133165, 134058, 133773, 132893, 132470, 132603, 132696, 132849, 133766, 135313, 136361, 136286, 135682, 135323, 135335, 135642, 136361, 137318, 137963, 138097, 138114, 138220, 138143, 137902, 138113, 139120, 140432, 141469, 142299, 143207, 144084, 144735, 145340, 146083, 146665, 146728, 146519, 146670, 147387, 148265, 148849, 149101, 149252, 149322, 148923, 147703, 146012, 144807, 144633, 145013, 145261, 145588, 146789, 149023, 151657, 154325, 157393, 161142, 165161, 168824, 171840, 174015, 174993, 174595, 173091, 170879, 168226, 165533, 163435, 162232, 161471, 160395, 158725, 156792, 155048, 153562, 152018, 150154, 148177, 146497, 144996, 143028, 140509, 138489, 137928, 138274, 138155, 137285, 136694, 136984, 137498, 137517, 137293, 137262, 137047]
54327A37047r71j408r54j88J34R8J79M05L80k4l90j07R35J973J962Q16l63o53
54309A38871m55p25j458j747j148k30K93K87K4k27l41m58q98j611j890j147K21
54292A27361J278J645J680J659J516J262J048P40Q7o50q16k54M33O72N19L45L09
54275A38834L67M34M08J79k03n50p03n84j65M72J100J553J773J623R43j9o22n41
54257A44299j38J89N65J215J895K265K414K454K002P51o74j201o44P6J22l66o43
54240A54581k62M53O63j27j317j683q66N8n9r66j524j260o67k07R8J58k80j020
54222A45773j410j100m29J01L28L82M72P43J048R50K59n88j031j058j031j020
54206A42389q11m43k38l48n83o47l00M69J155J078L11j63K72R29Q11J15j40L10
$$ y = [137047, 136076, 134668, 133714, 133526, 133660, 133758, 133937, 134342, 134722, 134698, 134308, 134201, 135136, 137109, 139071, 139887, 139524, 138871, 138416, 137691, 136233, 134486, 133338, 133108, 133401, 133688, 133712, 133485, 133144, 132686, 131788, 130177, 128287, 127140, 127361, 128639, 130284, 131964, 133623, 135139, 136401, 137449, 138189, 138276, 137626, 136810, 136556, 136989, 137661, 138180, 138525, 138834, 139201, 139635, 140043, 140222, 140019, 139469, 138766, 138182, 138017, 138489, 139589, 141142, 142915, 144538, 145481, 145462, 144840, 144299, 144161, 144350, 144915, 146130, 148025, 150290, 152704, 155158, 157160, 157911, 157237, 156036, 155392, 155468, 155590, 155224, 154581, 154319, 154772, 155435, 155308, 153991, 152308, 151442, 151500, 151441, 150475, 148951, 147691, 147024, 146817, 146915, 147073, 146793, 145773, 144363, 143263, 142834, 142935, 143263, 143645, 144117, 144860, 145908, 146858, 147117, 146529, 145498, 144440, 143409, 142389, 141578, 141135, 140897, 140549, 139966, 139319, 139019, 139488, 140643, 141721, 142032, 141869, 142141, 143070, 143881, 143996, 143856, 144166]
54188A44166P00M58j30n52o55n22k66j18j60j06K67O23N71M13O88J108Q27k21
54170A47091j082j055n20j85j20R9O69J293J430P85l24j098j052n12j38j39k84
54153A44858l80l57j55O9p1n79q29m40J40M24P27J430J941J432K34n28n44m73
54135A46899o70p81o70o33o42k85L98Q69R99J144J258Q55oo32p51p46o84j04R51
54116A46769J632J539J305J545J950J979J747J677J786J859J891J993K146K331
54102A72149K506K358J561M17l31m34l14k58j16O3j78q90j408j199n94k80m94
54085A72558r46j216j151j065j487k281k412j206M69J167Q19O35J159J572J139
54070A67754K41l83m98j63M97R77P20j1l99l51m92q61p54j68l5n94q57k51M93
$$ y = [144166, 144866, 145324, 145194, 144642, 143987, 143465, 143199, 143081, 142921, 142815, 143082, 143705, 144276, 144689, 145377, 146485, 147312, 147091, 146009, 144954, 144434, 144249, 144129, 144228, 144897, 146190, 147620, 148405, 148081, 146983, 145931, 145419, 145281, 145142, 144858, 144478, 144121, 143966, 144035, 143964, 143385, 142556, 142116, 142256, 142680, 143407, 144837, 146778, 148210, 148444, 147916, 147372, 146899, 146229, 145448, 144778, 144145, 143503, 143218, 143616, 144485, 145484, 146628, 147886, 148741, 148735, 148103, 147352, 146606, 145922, 145818, 146769, 148401, 149940, 151245, 152790, 154740, 156719, 158466, 160143, 161929, 163788, 165679, 167672, 169818, 172149, 174655, 177013, 178574, 178991, 178660, 178226, 177912, 177654, 177538, 177601, 177423, 176533, 175125, 173926, 173332, 173052, 172558, 171612, 170396, 169245, 168180, 166693, 164412, 162000, 160794, 161263, 162430, 163249, 163884, 165043, 166615, 167754, 167995, 167612, 167114, 166951, 167448, 168425, 169145, 169134, 168735, 168384, 167892, 167031, 166277, 166109, 166074, 165480, 164623, 164372, 164865]
54051A64865Q53J475K740L658L438K939L267L835L381K243J968K997M137M428
54037B06224M231M364N093O158P091P332O608N286M011L077K438K035J739J312
54023B66999Q47Q45J419J892J651J016O61O30M38k16j327k781m123m632m183l583
54007B55553l549l858m030m242m774n149m684l570k620k165j888j526j093p20
53993B11685p11j378k320k544j857j407k014k770k286p55M53P66P91R85J254J685
53977A99577K483L230L296K992L249M233N311O283P416Q108O992L769j09l106
53963B53724n009o244o800o526n741m843l817k644j740j451j498j319o76L42J491
53948B07249K313K366J869J694K347L332L836L725L482L471L639L758L631L162
$$ y = [164865, 165718, 167193, 169933, 173591, 177029, 179968, 183235, 187070, 190451, 192694, 194662, 197659, 201796, 206224, 210455, 214819, 219912, 226070, 233161, 240493, 247101, 252387, 256398, 259475, 261913, 263948, 265687, 266999, 267846, 268691, 270110, 272002, 273653, 274669, 275330, 275960, 276398, 276182, 274855, 272074, 267951, 263319, 259136, 255553, 252004, 248146, 244116, 239874, 235100, 229951, 225267, 221697, 219077, 216912, 215024, 213498, 212405, 211685, 210974, 209596, 207276, 204732, 202875, 201468, 199454, 196684, 194398, 193643, 194096, 194862, 195653, 196638, 197892, 199577, 202060, 205290, 208586, 211578, 214827, 219060, 224371, 230654, 238070, 246178, 253170, 256939, 256830, 253724, 248715, 242471, 235671, 229145, 223404, 218561, 214744, 212100, 210360, 208909, 207411, 206092, 205416, 205758, 207249, 209562, 211928, 213797, 215491, 217838, 221170, 225006, 228731, 232213, 235684, 239323, 243081, 246712, 249874]
53934B49874K486J934J744J897K260K727L135L269L031K545K100K072K755M056
53920B85885N402O271O680O974P232P267P074O895O847O763O426N699M541L118
53906C73074J817Q63O0p43j272j253j019j116j514j775j895k374l390m534n432
53891C49497o121o685p029p173p286p337p114o691o418o289n827m760l497k688
53877B64582k612l077l604l657l111k537k643l319l727l480l091l028k942k321
53863B21433j488j191j428j402p37j35m36j407j974j598r32r25j649k362k459
53848B01310j975j208l87K13K82j44o60r56j014q11k86L36O77Q44J291J846J580
53831B00938J47j460k073j721j191p99l45J74O14J135J807K101J537N79P1P7N1
$$ y = [249874, 252360, 254294, 256038, 257935, 260195, 262922, 266057, 269326, 272357, 274902, 277002, 279074, 281829, 285885, 291287, 297558, 304238, 311212, 318444, 325711, 332785, 339680, 346527, 353290, 359716, 365415, 369956, 373074, 374891, 375754, 375814, 375071, 373799, 372546, 371527, 370411, 368897, 367122, 365227, 362853, 359463, 354929, 349497, 343376, 336691, 329662, 322489, 315203, 307866, 300752, 294061, 287643, 281354, 275527, 270767, 267270, 264582, 261970, 258893, 255289, 251632, 248521, 245984, 243341, 240022, 236295, 232815, 229724, 226696, 223754, 221433, 219945, 218754, 217326, 215924, 215187, 215052, 214616, 213209, 211235, 209637, 208705, 207780, 206131, 203769, 201310, 199335, 198127, 197740, 197953, 198235, 198091, 197431, 196475, 195461, 194650, 194364, 194700, 195377, 196221, 197512, 199358, 200938, 201085, 199625, 197552, 195831, 194640, 193841, 193496, 193670, 194284, 195419, 197226, 199327, 200864, 201443, 201514, 201591, 201642]
53814B01642j10n5K46O69J535L050M350M345L404L002L623M294M337M270M569
53799B43171M833M727M640M770M598L929L478L665L776L134K281K065K266K136
53785B93469J658J278Q53j00j347k193k551k985l711m380m817n185n407n141m479
53770B54962m039m214m670m743m067k849j790j591k237k840k614j854j479j780
53756B14195k123j916j322q87q35r61r31n71m8J96j41p92j158r78n58k91j69P1
53738B00781M66P33O67M53M19N53N53M16N86J222J669J243L46J23R36J925K290
53721B15381K264K329K231J523O15L90R16J381J369J408K044K958L436L309K998
53706B44552K824K678K360J934J654J655J877K166K388K401K153J883K132L236
$$ y = [201642, 201532, 201477, 201723, 202392, 203927, 206977, 211327, 215672, 219076, 222078, 225701, 229995, 234332, 238602, 243171, 248004, 252731, 257371, 262141, 266739, 270668, 274146, 277811, 281587, 284721, 287002, 289067, 291333, 293469, 295127, 296405, 297258, 297158, 295811, 293618, 291067, 288082, 284371, 279991, 275174, 269989, 264582, 259441, 254962, 250923, 246709, 242039, 237296, 233229, 230380, 228590, 226999, 224762, 221922, 219308, 217454, 215975, 214195, 212072, 210156, 208834, 207947, 207112, 206151, 205220, 204649, 204601, 204797, 204656, 203864, 202706, 201728, 201170, 200879, 200710, 200781, 201247, 201980, 202647, 203100, 203519, 204072, 204625, 205041, 205627, 206849, 208518, 209761, 210107, 210230, 211166, 213091, 215381, 217645, 219974, 222205, 223728, 224343, 224733, 225649, 227030, 228399, 229807, 231851, 234809, 238245, 241554, 244552, 247376, 250054, 252414, 254348, 256002, 257657, 259534, 261700, 264088, 266489, 268642, 270525, 272657, 275893]
53692B75893M818N966N945M662K577M15j159j965k410k844k898k015o08N7n22
53677B85912j304j083o7O45O57M79L32j27q43j096o37k72o93j394j426q13l58
53660B77912l07j16L57L88m62j420j457o66RJ81L65R09J414J500J442J653K025
53643B83727K279K523K950L283L177K869K844L008K785K049J305R58R37J088J346
53628C17128J484J269R43J012J422J651J702K208L268L988L782L353L665M487
53614C51362M850M571M328M390M227L582L051L180L592L526K867K143J654J200
53600C98523O90N66J229K213K445J493K25j96K92P42N78J62j73q41k189l577m016
53583C98166l481k843k592k431k127j963k078k061j669j409j837k587k710j908
$$ y = [275893, 280711, 286677, 292622, 297284, 299861, 300276, 299117, 297152, 294742, 291898, 289000, 286985, 286377, 286434, 285912, 284608, 283525, 283458, 284103, 284760, 285239, 285571, 285444, 284601, 283505, 282868, 282596, 281903, 280509, 279083, 278270, 277912, 277605, 277489, 277846, 278234, 277772, 276352, 274895, 274229, 274238, 274419, 274784, 275693, 277107, 278607, 280049, 281702, 283727, 286006, 288529, 291479, 294762, 297939, 300808, 303652, 306660, 309445, 311494, 312799, 313757, 314694, 315782, 317128, 318612, 319881, 320824, 321836, 323258, 324909, 326611, 328819, 332087, 336075, 339857, 343210, 346875, 351362, 356212, 360783, 365111, 369501, 373728, 377310, 380361, 383541, 387133, 390659, 393526, 395669, 397323, 398523, 399213, 399779, 401008, 403221, 405666, 407159, 407384, 407188, 407480, 408222, 408800, 408962, 408789, 407948, 405759, 402182, 398166, 394685, 391842, 389250, 386819, 384692, 382729, 380651, 378590, 376921, 375512, 373675, 371088, 368378, 366470]
53569C66470r29n77q12j024q74o05n42n88l51L39J103J366R85M77N09J168J831
53552C67946J856J332R90J328K009K265J842J310J317J851K419K833L419M352
53538C97069N225N617N745O129O728P039P094P653R118J0792J1804J2259J2815
53525E05087J3496J3797J3815J4282J5315J6103J6196J6314J7254J8743J9940
53514F80342K0617K1214K2133K3554K5458K7272K8006K7492K6970K7550K8556
53503I59164K8431K7056K5845K5590K5453K4496K3060K1955K1169K0153J8842
53492A221214J7725J7219J7439J8262J9218J9708J9619J9464J9572J9569J8984
53481A427993J7967J7018J6350J5934J5643J4914J2734Q692L938L19j496k561
$$ y = [366470, 365541, 364964, 364152, 363128, 362254, 361649, 361107, 360519, 360168, 360507, 361610, 362976, 363961, 364438, 364947, 366115, 367946, 369802, 371134, 372124, 373452, 375461, 377726, 379568, 380878, 382195, 384046, 386465, 389298, 392717, 397069, 402294, 407911, 413656, 419785, 426513, 433552, 440646, 448299, 457417, 468209, 480013, 492272, 505087, 518583, 532380, 546195, 560477, 575792, 591895, 608091, 624405, 641659, 660402, 680342, 700959, 722173, 744306, 767860, 793318, 820590, 848596, 876088, 903058, 930608, 959164, 987595, 1014651, 1040496, 1066086, 1091539, 1116035, 1139095, 1161050, 1182219, 1202372, 1221214, 1238939, 1256158, 1273597, 1291859, 1311077, 1330785, 1350404, 1369868, 1389440, 1409009, 1427993, 1445960, 1462978, 1479328, 1495262, 1510905, 1525819, 1538553, 1547245, 1551183, 1551502, 1550006, 1547445]
53469A547445m258o900r844j2469j4606j6268j7426j8132j8549j8721j8490j7893
53457A373889j7504j8018j9443k1075k2366k3425k4396k4901k4514k3476k2286
53446A132485k0919j9082j7081j5701j5116j4637j3511j1503q728n629l121j958
53434I85499j707j125K91J849K967M069N660P379Q603R467J0561J2042J3659J5315
53420A074529J7072J8815K0421K1993K3568K4953K6189K7789K9961L2078L3477
53409A350845L4515L6149L8613M1130M2979M4300M5786M7900N0486N2977N4938
53398A840618N6422N7698N8739N9352N9809O0739O2141O3110O2838O1452N9570
53387B502488N7581N5685N4033N2294M9719M6157M2519L9585L6863L3270K8517
$$ y = [1547445, 1543187, 1536287, 1526443, 1513974, 1499368, 1483100, 1465674, 1447542, 1428993, 1410272, 1391782, 1373889, 1356385, 1338367, 1318924, 1297849, 1275483, 1252058, 1227662, 1202761, 1178247, 1154771, 1132485, 1111566, 1092484, 1075403, 1059702, 1044586, 1029949, 1016438, 1004935, 996207, 990578, 987457, 985499, 983792, 982667, 982958, 984807, 987774, 991843, 997503, 1004882, 1013485, 1022952, 1033513, 1045555, 1059214, 1074529, 1091601, 1110416, 1130837, 1152830, 1176398, 1201351, 1227540, 1255329, 1285290, 1317368, 1350845, 1385360, 1421509, 1460122, 1501252, 1544231, 1588531, 1634317, 1682217, 1732703, 1785680, 1840618, 1897040, 1954738, 2013477, 2072829, 2132638, 2193377, 2255518, 2318628, 2381466, 2442918, 2502488, 2560069, 2615754, 2669787, 2722081, 2771800, 2817957, 2860476, 2900061, 2936924, 2970194, 2998711]
53376B998711K3099J7372J1524O024J145l814r873j7039k4387l1439l8469m5407
53364B887447n1426n5872n8860o0683o1387o1292o1201o1501o1535o0476n8466
53353B234748n6393n4685n2904n0573m7988m5974m5088m5237m5919m6552m6482
53342A696953m5110m2430l9341l6910l5231l3387l0636k7301k4266k2020k0407
53331A339914j9013j7523j5988j4866j4549j4742j4758j4445j4247j4234j3806
53320A171743j2669j1292j0005q430o466m979m573m384l122q40J404L262N233
53307A114882P261Q567R069R855J1752J4282J6549J8459K0525K2825K4771K5828
53295A304625K6179K6632K7835K9581L1052L1778L1993L1808L0711K8382K5489
$$ y = [2998711, 3021810, 3039182, 3050706, 3056730, 3057875, 3054061, 3044188, 3027149, 3002762, 2971323, 2932854, 2887447, 2836021, 2780149, 2721289, 2660606, 2599219, 2537927, 2476726, 2415225, 2353690, 2293214, 2234748, 2178355, 2123670, 2070766, 2020193, 1972205, 1926231, 1881143, 1835906, 1789987, 1743435, 1696953, 1651843, 1609413, 1570072, 1533162, 1497931, 1464544, 1433908, 1406607, 1382341, 1360321, 1339914, 1320901, 1303378, 1287390, 1272524, 1257975, 1243233, 1228475, 1214030, 1199783, 1185549, 1171743, 1159074, 1147782, 1137777, 1129347, 1122881, 1117902, 1113329, 1108945, 1105823, 1104983, 1106387, 1109649, 1114882, 1122143, 1130710, 1139779, 1149634, 1161386, 1175668, 1192217, 1210676, 1231201, 1254026, 1278797, 1304625, 1330804, 1357436, 1385271, 1414852, 1445904, 1477682, 1509675, 1541483, 1572194, 1600576, 1626065]
53284A626065K2965K0787J8296J5378J2482R627O268K272j766n314q347j0993
53272A707720j3336j5639j8197k0878k3241k5158k6802k8163k9154k9974l0829
53261A446349l1420l1397l1149l1405l2171l2866l3320l3716l3720l2713l0975
53250A091497k9549k8788k8091k7263k6992k7543k8048k7650k6534k5242k3856
53239G91941k2412k1333k0742j9987j8553j6872j5582j4517j3085j1245r434p939
53227F00240o937o850p864r393j0503j0901j1031j1306j1699j2016j2228j2465
53215D77047j2745j2820j2308j1197j0006r167q431p398o391o062o236o019n237
53202C63030m764n076n477n327n232o101p575q265p373n540m129m056n062n827
$$ y = [1626065, 1649030, 1669817, 1688113, 1703491, 1715973, 1725600, 1731868, 1734140, 1732374, 1727060, 1718713, 1707720, 1694384, 1678745, 1660548, 1639670, 1616429, 1591271, 1564469, 1536306, 1507152, 1477178, 1446349, 1414929, 1383532, 1352383, 1320978, 1288807, 1255941, 1222621, 1188905, 1155185, 1122472, 1091497, 1061948, 1033160, 1005069, 977806, 950814, 923271, 895223, 867573, 841039, 815797, 791941, 769529, 748196, 727454, 707467, 688914, 672042, 656460, 641943, 628858, 617613, 608179, 600240, 593303, 586453, 578589, 569196, 558693, 547792, 536761, 525455, 513756, 501740, 489512, 477047, 464302, 451482, 439174, 427977, 417971, 408804, 400373, 392975, 386584, 380522, 374286, 368267, 363030, 358266, 353190, 347713, 342386, 337154, 331053, 323478, 315213, 307840, 302300, 298171, 294115, 289053, 283226]
53188B83226n133l199j515j198j939k769l226l279k819j929j207j120j332j242
53174B51319r30r02j226j490j486j304r30l57Rk78r22j046l59L36P2j112k215
53157B37179k399j804j154p50j86P95J645J654R56K83q7m43p84p44m32m46p66
53140B32517n65M34J355J473J308J584J919J441K48p79j228j315j059k84O32Q99
53124B38580L22m06n05K38J563K902L547L193K369J849J699J378O59n0m12o29
53108B56297j064j708k191k138j536q68p28j141j461j280j047j422k236k674k306
53093B32497j502q30n27n39o95p93p72p53q12q20p29p85j148j468j254n09K59
53076B18820N86M17L5j92j29l2j73k65J38P02M60p19j636j361n76n04j079j262
$$ y = [283226, 278093, 274894, 273379, 272181, 270242, 267473, 264247, 260968, 258149, 256220, 255013, 253893, 252561, 251319, 250389, 249487, 248261, 246771, 245285, 243981, 243051, 242694, 242703, 242425, 241503, 240457, 240098, 240434, 240506, 239394, 237179, 234780, 232976, 231822, 231072, 230886, 231681, 233326, 234980, 235936, 236219, 236132, 235689, 234905, 234161, 233729, 233283, 232517, 231952, 232386, 233741, 235214, 236522, 238106, 240025, 241466, 241714, 240935, 239707, 238392, 237333, 237049, 237681, 238580, 238902, 238496, 237991, 238229, 239792, 242694, 246241, 249434, 251803, 253652, 255351, 256729, 257388, 257338, 256926, 256297, 255233, 253525, 251334, 249196, 247660, 246792, 246064, 244923, 243462, 242182, 241135, 239713, 237477, 234803, 232497, 230995, 230165, 229638, 229099, 228404, 227611, 226839, 226086, 225274, 224454, 223725, 222940, 221792, 220324, 219070, 218561, 218820, 219406, 219823, 219858, 219666, 219537, 219505, 219332, 219067, 219205, 219907, 220367, 219648, 218012, 216651, 216075, 215571, 214492, 213230]
53058B13230p71m28o82q80k94Q47J706J749J143N16M48Q92J196R28L83J3k62o19
53040B19115o96j67M42L72j69k87J26K92j21n28n03l09n3O63J738K142J198l15
53022B22940j115r88p08p32p96o49n04n46n18m2P98J449J394O75j35m83l09M9
53004B19780K84L34K85L41O98J228J408Q83Qn45n68l88k78k52l05l62o2Q62J880
52985B25231K045J199K83J75O54R19O94M49O85J398K144K458K251J877J736J772
52969B45970J571R17O3o12r49r67p53m58k18lK27K97Mm85p86q64j079j565j915
52950B38395j703j091p00r76j780k471k401j494l74K73L83L73M51M37K20Mk5O
52932B27527j06l78p10r94j111r80p09n26m83m61l85k84j08K68Q02J262J454J373
$$ y = [213230, 212459, 212031, 211349, 210469, 210175, 211022, 212728, 214477, 215620, 216136, 216584, 217476, 218672, 219600, 219983, 219996, 219734, 219115, 218419, 218252, 218694, 219066, 218897, 218610, 218736, 219028, 218907, 218379, 217876, 217567, 217514, 218177, 219915, 222057, 223255, 222940, 221825, 220837, 220129, 219397, 218601, 217952, 217448, 216902, 216384, 216342, 217140, 218589, 219983, 220658, 220523, 220040, 219731, 219780, 220064, 220398, 220683, 221024, 221722, 222950, 224358, 225241, 225249, 224704, 224136, 223748, 223470, 223218, 222913, 222551, 222489, 223351, 225231, 227276, 228475, 228758, 228933, 229587, 230506, 231200, 231649, 232334, 233732, 235876, 238334, 240585, 242462, 244198, 245970, 247541, 248458, 248521, 247909, 246960, 245993, 245240, 244782, 244564, 244561, 244788, 245085, 245089, 244604, 243818, 242954, 241875, 240310, 238395, 236692, 235601, 234901, 233925, 232145, 229674, 227273, 225779, 225405, 225678, 226061, 226434, 226885, 227322, 227542, 227546, 227521, 227527, 227421, 227043, 226333, 225339, 224228, 223248, 222539, 222013, 221530, 221069, 220684, 220400, 220292, 220560, 221362, 222624, 224078, 225451]
52914B25451J070N44j64q65j225j013m48k40q10j580j543p21k88q41j380p48O05
52897B15804J342J206J041J032L80j034k003j601n03R9O7M0J93K22K01N59J219
52880B18264J484R49Q1l03J27J011J783K161K192J998J576R83M32J24R5L66J004
52863B34327J811K250K071J727J686J644R77j93j114j526j943k800l898m756m966
52848B25297m229k783j714j987l050l248j899j40O32L03l60q29r04m23L97Q40
52832B05903N19r0l85m16l61P4J085J984J902R37qm19m80m06j75J02J34p0j71
52813B09659P0N33R57J072P28J36j52J75P59R87P04J92k86o80r82j214j385j358
52795B09915r99o36q62j604j898j130mL13k61q04p16k45K36O87J037J054P49M87
$$ y = [225451, 226521, 227065, 226901, 226036, 224811, 223798, 223350, 223110, 222300, 220720, 219177, 218456, 218168, 217327, 215947, 215199, 215804, 217146, 218352, 219393, 220425, 220805, 219771, 217768, 216167, 215664, 215763, 215830, 215870, 216063, 216285, 216486, 217045, 218264, 219748, 220697, 220778, 220475, 220602, 221613, 223396, 225557, 227749, 229747, 231323, 232306, 232738, 232862, 232957, 233323, 234327, 236138, 238388, 240459, 242186, 243872, 245516, 246493, 246300, 245186, 243660, 241717, 238917, 235019, 230263, 225297, 221068, 218285, 216571, 214584, 211534, 208286, 206387, 206247, 206879, 207182, 206822, 205993, 205089, 204666, 205063, 205903, 206422, 206332, 205947, 205531, 205170, 205244, 206329, 208313, 210215, 211152, 211144, 210725, 210245, 209839, 209664, 209766, 209900, 209830, 209659, 209729, 210262, 211219, 212291, 213019, 213155, 213003, 213178, 213937, 214924, 215628, 215820, 215534, 214854, 213872, 212658, 211273, 209915, 208916, 208280, 207418, 205814, 203916, 202786, 202782, 203095, 202834, 202030, 201314, 201069, 201305, 201992, 203029, 204083, 204832, 205319]
52777B05319M47M29K87J60J83L05M78P12Q10M45l17r43j048q29o59n25j71K90
52759B05373L56j76p59o60J35R03J173J276J602J775J205K59j8O88J639K341L143
52742B20255M112M304L060J279L63L83L47m5r9L87O83M03K02P11J493J748J398
52725B40984R15M55k20j133j960k398k386j989j386q75p05q45j020r73o88m24
52709B25352m64p17o72K3R75J372Q93O5l95k46J98M58K42k93o47n70m84q76j390
52690B22824j137j07M68l28j697k028r30M17R13P27N85N71K55l26n51j68K34j4
52672B19708p26j051n63K52O82O77P92J332J876J849J312R04R29R78O63M78J280
52655B31372K926M089L813K713K049K003J607L55j031j718j900k341l155l668
$$ y = [205319, 205766, 206195, 206482, 206642, 206825, 207130, 207608, 208320, 209130, 209575, 209258, 208315, 207267, 206438, 205779, 205254, 205083, 205373, 205729, 205553, 204794, 204134, 204269, 205172, 206345, 207621, 209223, 210998, 212203, 212462, 212444, 213132, 214771, 217112, 220255, 224367, 228671, 231731, 233010, 233373, 233756, 234103, 234058, 233959, 234346, 235029, 235432, 235634, 236345, 237838, 239586, 240984, 241899, 242354, 242134, 241001, 239041, 236643, 234257, 232268, 230882, 230007, 229302, 228457, 227437, 226464, 225776, 225352, 224888, 224171, 223499, 223522, 224497, 225869, 226762, 226827, 226432, 226186, 226384, 226842, 227084, 226791, 226144, 225574, 225090, 224214, 222824, 221687, 221580, 222048, 221720, 220023, 217995, 217065, 217482, 218395, 219122, 219707, 220278, 220533, 220207, 219656, 219488, 219722, 219708, 218982, 217931, 217368, 217620, 218302, 218979, 219771, 221103, 222979, 224828, 226140, 227044, 227973, 228951, 229614, 230092, 231372, 234298, 238387, 242200, 244913, 246962, 248965, 250572, 250927, 249896, 248178, 246278, 243937, 240782, 237114]
52641B37114l347k395j461j012j012j042p55l04j13k20q5P04J807K453K246J410
52625B33988M17l14n04k02J33l7p43j469j715j474j118q84o26j34M44O87M90K70
52607B27209L43M36K02o8J14M92L32k76l60M82J387J477J016O88M87J20j26J82
52589B34137P13Q21O28O71P97M28j03K77J654K611J985L10r94j257p95j08M65
52572B42240O14K28k87l88l9K28k3o46j070q73k43J65o3n97p72m55j22j31k64
52553B37502k02n1j71o87j327j642j307m25M04O05L19J38K10K2n82q26l7J175
52535B33118J478N88l81m86j53l10q53p65L29J544J887J449R82P63N18K70M93
52518B40471J269J954J986J556J194J004P85N93P71J497K586L638M141L725K539
$$ y = [237114, 233767, 231372, 229911, 228899, 227887, 226845, 226090, 225786, 225673, 225453, 225368, 226072, 227879, 230332, 232578, 233988, 234405, 234091, 233587, 233385, 233518, 233481, 232738, 231269, 229554, 228080, 226962, 226078, 225452, 225318, 225762, 226449, 226939, 227209, 227552, 227988, 228190, 228122, 228236, 228728, 229060, 228784, 228424, 228906, 230293, 231770, 232786, 233474, 233961, 234081, 233955, 234137, 234850, 235671, 236299, 236970, 237767, 238195, 238092, 238369, 240023, 242634, 244619, 244929, 243935, 242678, 241883, 241775, 242240, 242854, 243082, 242795, 242407, 242368, 242596, 242573, 241927, 240857, 239984, 239741, 239906, 239843, 239246, 238474, 238019, 237897, 237766, 237502, 237300, 237249, 237078, 236391, 235064, 233422, 232115, 231690, 232094, 232699, 233018, 233156, 233366, 233388, 232806, 231980, 231943, 233118, 234596, 235184, 234803, 234317, 234164, 233854, 233001, 232236, 232565, 234109, 235996, 237445, 238427, 239190, 239708, 239978, 240471, 241740, 243694, 245680, 247236, 248430, 249434, 250219, 250812, 251583, 253080, 255666, 259304, 263445, 267170, 269709]
52503B69709J233K80m77j381k397l299m065m590m366l093j407l16q2k69p06j551
52487B43223k411k357j195Q4N68N02N95Q36P66M84N80J124J461J150O18O00J254
52470B47882K097K604K634K312J806J363J344J928K767L165K801K064J485J087
52456B77339N33k38r74j589k232k868l190l113k953k885k586j709n45J35j37j042
52440B51946j831k027j739j332r26m00J83M81L54J43J53J58j72n92n58n5M36P86
52422B45008J376K251K717K218J137L96M94J208K053K594K613K294K180K726L934
52407B75199N524P274Q995J0303J0696R806P565M255N37k756n063o313o726o620
52393C12676o390o310o165n373l756j945p73l36n9M32Q48P51K76J19P96K067L131
$$ y = [269709, 270942, 271222, 270745, 269364, 266967, 263668, 259603, 255013, 250647, 247554, 246147, 245831, 245749, 245480, 244774, 243223, 240812, 238455, 237260, 237344, 237912, 238414, 239009, 239845, 240611, 241095, 241675, 242799, 244260, 245410, 246028, 246628, 247882, 249979, 252583, 255217, 257529, 259335, 260698, 262042, 263970, 266737, 269902, 272703, 274767, 276252, 277339, 277872, 277634, 276660, 275071, 272839, 269971, 266781, 263668, 260715, 257830, 255244, 253535, 252990, 253125, 252988, 251946, 250115, 248088, 246349, 245017, 244091, 243691, 243874, 244355, 244709, 244852, 245005, 245163, 244991, 244399, 243841, 243786, 244222, 245008, 246384, 248635, 251352, 253570, 254707, 255103, 255597, 256805, 258858, 261452, 264065, 266359, 268539, 271265, 275199, 280723, 287997, 296992, 307295, 317991, 327797, 335362, 339617, 340154, 337398, 332335, 326022, 319296, 312676, 306286, 299976, 293811, 288438, 284682, 282737, 281964, 281628, 281569, 282001, 282849, 283600, 283876, 283995, 284791, 286858, 289989]
52376B89989L458L292L265L605L939L885L583L522L942M556M807M336L271K041
52362C41491R15j75j268k067k298k199k219k249j685l73R68J620J718J847K104
52347C36130K092J761J572J837K345K853L461M203M674M565M354M877O158P287
52333C88169P681P915Q902J0553J1928J2493J2669J3085J3881J4903J6040J7122
52321E35341J7875J8266J8545J8741J8519J7779J6972J6500J6212J5820J5408
52310G25978J5098J4617J3711J2675J1997J1674J1351J0881J0282R486Q572P919
52298H64241P557O807N154L195J855R61n56l075n758p636q490q622q485q544q841
52283H29763q632p178m800k498o45J079K626L537M056N149P105R125J0620J1887
$$ y = [289989, 293447, 296739, 300004, 303609, 307548, 311433, 315016, 318538, 322480, 327036, 331843, 336179, 339450, 341491, 342406, 342231, 340963, 338896, 336598, 334399, 332180, 329931, 328246, 327873, 328841, 330461, 332179, 334026, 336130, 338222, 339983, 341555, 343392, 345737, 348590, 352051, 356254, 360928, 365493, 369847, 374724, 380882, 388169, 395850, 403765, 412667, 423220, 435148, 447641, 460310, 473395, 487276, 502179, 518219, 535341, 553216, 571482, 590027, 608768, 627287, 645066, 662038, 678538, 694750, 710570, 725978, 741076, 755693, 769404, 782079, 794076, 805750, 817101, 827982, 838264, 847750, 856322, 864241, 871798, 878605, 883759, 886954, 888809, 889770, 889214, 886139, 880381, 872745, 864255, 855633, 847148, 838604, 829763, 821131, 813953, 809153, 806655, 806010, 807089, 809715, 813252, 817308, 822457, 829562, 838687, 849307, 861194]
52269H61194J3121J3790J3576J2949J2289J1373J0338J0056J0731J1155J0411
52258I90983R428R637J0715J1027R969Q570P827P544P019N983M617L209J911M90
52244A088929j579m380p132r018j0109j0875j1196j0653r582q877q771q589p847
52231I80321o868o145n673n189m581l887l226k739k371j747o17P01J741K545L472
52216I45737M451N048N151N085N035M941M915N184N547N516N060M683M605M472
52202A015430M065L770L986M505M836M832M705M570M322L890L472L512M264N325
52188A075484N789N135L851K779K052J098l81k049l570n042o606q018q957r399
52174A052166r496r270q696p898p074o280n420m337k994j640o82k28J03P34J583
$$ y = [861194, 874315, 888105, 901681, 914630, 926919, 938292, 948630, 958686, 969417, 980572, 990983, 1000411, 1010048, 1020763, 1031790, 1041759, 1050329, 1058156, 1065700, 1072719, 1078702, 1083319, 1086528, 1088439, 1088929, 1087350, 1082970, 1075838, 1066820, 1056711, 1045836, 1034640, 1023987, 1014405, 1005528, 996757, 988168, 980321, 973453, 967308, 961635, 956446, 951865, 947978, 944752, 942013, 939642, 937895, 937278, 937979, 939720, 942265, 945737, 950188, 955236, 960387, 965472, 970507, 975448, 980363, 985547, 991094, 996610, 1001670, 1006353, 1010958, 1015430, 1019495, 1023265, 1027251, 1031756, 1036592, 1041424, 1046129, 1050699, 1055021, 1058911, 1062383, 1065895, 1070159, 1075484, 1081273, 1086408, 1090259, 1093038, 1095090, 1096188, 1095807, 1093758, 1090188, 1085146, 1078540, 1070522, 1061565, 1052166, 1042670, 1033400, 1024704, 1016806, 1009732, 1003452, 998032, 993695, 990701, 989061, 988379, 988151, 988254, 988988, 990571]
52159I90571K328K987L842M774N153M434K619K16j929k854k194p03L08K45l69
52144A009428q02q63o64j97M68R91J141J162J384J728J925K094K705L982N624
52129A030106P217Q737J0518J2818J5498J8130K0356K2107K3516K4751K5963K7197
52117A246914K8204K8488K7709K5998K3809K1601J9634J7838J5712J2673Q848
52106A477428N208K621R68l87j635k501l018l567m166m332l930l615m193n803
$$ y = [990571, 992899, 995886, 999728, 1004502, 1009655, 1014089, 1016708, 1016924, 1014995, 1012141, 1009947, 1009244, 1009552, 1009797, 1009428, 1008626, 1007763, 1007099, 1006902, 1007370, 1008361, 1009502, 1010664, 1012048, 1013776, 1015701, 1017795, 1020500, 1024482, 1030106, 1037323, 1046060, 1056578, 1069396, 1084894, 1103024, 1123380, 1145487, 1169003, 1193754, 1219717, 1246914, 1275118, 1303606, 1331315, 1357313, 1381122, 1402723, 1422357, 1440195, 1455907, 1468580, 1477428, 1482636, 1485257, 1486225, 1485838, 1484203, 1481702, 1478684, 1475117, 1470951, 1466619, 1462689, 1459074, 1454881, 1449078]
$$ [...]
##END NTUPLES=NMR SPECTRUM
##END=
