
##TITLE=AC1327_PERAH12156_7163865_ym0b1Gj23m
##JCAMPDX= 6.0         $$ Bruker NMR JCAMP-DX V2.0
##DATA TYPE= NMR SPECTRUM
##DATA CLASS= NTUPLES
##ORIGIN= BRUKER
##OWNER= Administrator
$$ 1.72 TOPSPIN		Version 2.1
$$ 2012-12-01 12:15:52.910 -0500  Administrator@X
$$ Compression mode = diff/dup
##.OBSERVE FREQUENCY= 400.02188249412
##.OBSERVE NUCLEUS= ^1H
##.ACQUISITION MODE= SIMULTANEOUS (DQD)
##.ACQUISITION SCHEME= undefined
##.AVERAGES= 8
##.DIGITISER RES= 22
##SPECTROMETER/DATA SYSTEM= spect
##.PULSE SEQUENCE= zg30
##.SOLVENT NAME= COFFEE_meoh
##.SHIFT REFERENCE= INTERNAL, COFFEE_meoh, 1, 14.98509
##AUDIT TRAIL= $$ (NUMBER, WHEN, WHO, WHERE, PROCESS, VERSION, WHAT)
$$ ##TITLE= Audit trail, TOPSPIN		Version 2.1
$$ ##JCAMPDX= 5.01
$$ ##ORIGIN= Bruker BioSpin GmbH
$$ ##OWNER= Administrator
$$ $$ E:\/data/COFFEE/nmr/AC1327_PERAH12156_7163865_ym0b1Gj23m/10/pdata/1/auditp.txt
$$ ##AUDIT TRAIL=  $$ (NUMBER, WHEN, WHO, WHERE, PROCESS, VERSION, WHAT)
(   1,<2012-12-01 12:15:45.916 -0500>,<Administrator>,<X>,<go>,<TOPSPIN 2.1>,
      <created by zg
	started at 2012-12-01 12:14:40.957 -0500,
	POWCHK enabled, PULCHK disabled,
       configuration hash MD5:
       86 BA 57 50 F2 9D 5C 9B 26 00 A9 28 5F 66 2E 89
       data hash MD5: 64K
       23 8E 39 D8 A9 FD 22 51 0B 4D 05 FA B2 01 EA 87>)
(   2,<2012-12-01 12:15:48.577 -0500>,<Administrator>,<X>,<proc1d>,<TOPSPIN 2.1>,
      <Start of raw data processing
       efp LB = 0 FT_mod = 6 PKNL = 1 PHC0 = 0 PHC1 = 0 SI = 32K 
       data hash MD5: 32K
       44 30 BF 7C 49 00 2D C4 6F A9 D7 9B 9B 41 23 C1>)
(   3,<2012-12-01 12:15:48.992 -0500>,<Administrator>,<X>,<proc1d>,<TOPSPIN 2.1>,
      <pk PHC0 = 98.92639 PHC1 = 0 
       data hash MD5: 32K
       80 32 5C 86 EB 41 D6 0F 5B 04 E5 F0 EF 12 76 50>)
(   4,<2012-12-01 12:15:49.179 -0500>,<Administrator>,<X>,<proc1d>,<TOPSPIN 2.1>,
      <abs ABSG = 1 
       data hash MD5: 32K
       D4 29 6A 01 8A 21 56 FB 70 04 31 9D 49 AD F2 C2>)
(   5,<2012-12-01 12:15:49.313 -0500>,<Administrator>,<X>,<proc1d>,<TOPSPIN 2.1>,
      <abs ABSG = 2 
       data hash MD5: 32K
       9D 7D B7 0F 3E DE AD F0 C7 D3 F3 40 54 80 48 1D>)
(   6,<2012-12-01 12:15:49.433 -0500>,<Administrator>,<X>,<proc1d>,<TOPSPIN 2.1>,
      <abs ABSG = 3 
       data hash MD5: 32K
       DC 93 C0 88 2A 29 63 9D 9E A7 D4 70 4B 3E B9 92>)
(   7,<2012-12-01 12:15:49.553 -0500>,<Administrator>,<X>,<proc1d>,<TOPSPIN 2.1>,
      <abs ABSG = 4 
       data hash MD5: 32K
       A1 76 E2 08 F7 7C E6 9E C5 95 D9 87 F6 53 39 9E>)
(   8,<2012-12-01 12:15:49.674 -0500>,<Administrator>,<X>,<proc1d>,<TOPSPIN 2.1>,
      <abs ABSG = 5 
       data hash MD5: 32K
       A9 34 5F D5 4F 45 D1 1C C7 4F CC 2A BA C3 01 79>)
$$ ##END=
$$ 
$$ $$ hash MD5
$$ $$ FF 37 B3 17 20 AB F8 9D F2 F5 6A 69 B4 03 15 A9
##$RELAX= 
##$RELAX= 
##$RELAX= 
##$RELAX= 
##$RELAX= 
##$RELAX= 
##$RELAX= 
$$ Bruker specific parameters
$$ --------------------------
##$DU= <E:\>
##$EXPNO= 10
##$NAME= <AC1327_PERAH12156_7163865_ym0b1Gj23m>
$$ [...]
##$TP= (0..7)
150 150 150 150 150 150 150 150
##$TP07= 0
##$TPNAME0= <>
##$TPNAME1= <>
##$TPNAME2= <>
##$TPNAME3= <>
##$TPNAME4= <>
##$TPNAME5= <>
##$TPNAME6= <>
##$TPNAME7= <>
##$TPOAL= (0..7)
0.5 0.5 0.5 0.5 0.5 0.5 0.5 0.5
##$TPOFFS= (0..7)
0 0 0 0 0 0 0 0
##$TUNHIN= 0
##$TUNHOUT= 0
##$TUNXOUT= 0
##$USERA1= <user>
##$USERA2= <user>
##$USERA3= <user>
##$USERA4= <user>
##$USERA5= <user>
##$V9= 5
##$VALIST= <valist>
##$VCLIST= <CCCCCCCCCCCCCCC>
##$VD= 0
##$VDLIST= <DDDDDDDDDDDDDDD>
##$VPLIST= <PPPPPPPPPPPPPPP>
##$VTLIST= <TTTTTTTTTTTTTTT>
##$WBST= 1024
##$WBSW= 4
##$XGAIN= (0..3)
0 0 0 0
##$XL= 0
##$YL= 0
##$YMAX_a= 664215
##$YMIN_a= -560759
##$ZGOPTNS= <>
##$ZL1= 120
##$ZL2= 120
##$ZL3= 120
##$ZL4= 120
##$ABSF1= 14.98509
##$ABSF2= -5.573092
##$ABSG= 5
##$ABSL= 3
##$ALPHA= 0
##$AQORDER= 0
##$ASSFAC= 0
##$ASSFACI= 0
##$ASSFACX= 0
##$ASSWID= 0
##$AUNMP= <proc_prof1d_extract_pilot.lims>
##$AXLEFT= 0
##$AXNAME= <>
##$AXNUC= <1H>
##$AXRIGHT= 0
##$AXTYPE= 0
##$AXUNIT= <>
##$AZFE= 0.1
##$AZFW= 0.1
##$BCFW= 0
##$BC_mod= 0
##$BYTORDP= 0
##$COROFFS= 0
##$CY= 15
##$DATMOD= 1
##$DC= 0
##$DFILT= <>
##$DTYPP= 0
##$F1P= 0
##$F2P= 0
##$FCOR= 0.5
##$FTSIZE= 32768
##$FT_mod= 6
##$GAMMA= 0
##$GB= 0
##$INTBC= 1
##$INTSCL= 1
##$ISEN= 128
##$LB= 0
##$LEV0= 0
##$LPBIN= 0
##$MAXI= 10000
##$MC2= 0
##$MEAN= 0
##$ME_mod= 0
##$MI= 0
##$NCOEF= 0
##$NC_proc= -8
##$NLEV= 6
##$NOISF1= 0
##$NOISF2= 0
##$NSP= 0
##$NTH_PI= 0
##$NZP= 0
##$OFFSET= 14.98509
##$PC= 1
##$PHC0= 98.92639
##$PHC1= 0
##$PH_mod= 1
##$PKNL= yes
##$PPARMOD= 0
##$PPDIAG= 0
##$PPIPTYP= 0
##$PPMPNUM= 2147483647
##$PPRESOL= 1
##$PSCAL= 4
##$PSIGN= 0
##$PYNMP= <proc.py>
##$REVERSE= no
##$SF= 400.02
##$SI= 32768
##$SIGF1= 0
##$SIGF2= 0
##$SINO= 400
##$SIOLD= 32768
##$SPECTYP= <>
##$SREGLST= <1H.CDCl3>
##$SSB= 0
##$STSI= 32768
##$STSR= 0
##$SW_p= 8223.68421052631
##$SYMM= 0
##$S_DEV= 0
##$TDeff= 65536
##$TDoff= 0
##$TI= <>
##$TILT= no
##$TM1= 0
##$TM2= 0
##$TOPLEV= 0
##$USERP1= <user>
##$USERP2= <user>
##$USERP3= <user>
##$USERP4= <user>
##$USERP5= <user>
##$WDW= 1
##$XDIM= 32768
##$YMAX_p= 471723224
##$YMIN_p= -730120
##$CURPLOT= <Network HP LaserJet P1505>
##$CURPRIN= <$Network HP LaserJet P1505>
##$DFORMAT= <normdp>
##$LAYOUT= <+/1D_H.xwp>
##$LFORMAT= <normlp>
##$PFORMAT= <normpl>
##$SURQMSG= 1
$$ End of Bruker specific parameters
$$ ---------------------------------
##NTUPLES= NMR SPECTRUM
##VAR_NAME=  FREQUENCY,     SPECTRUM/REAL,   SPECTRUM/IMAG
##SYMBOL=    X,             R,               I
##VAR_TYPE=  INDEPENDENT,   DEPENDENT,       DEPENDENT
##VAR_FORM=  AFFN,          ASDF,            ASDF
##VAR_DIM=   32768,         32768,           32768
##UNITS=     HZ,            ARBITRARY UNITS, ARBITRARY UNITS
##FACTOR=    0.250966925370066, 1,           1
##FIRST=     8223.43324360094, -54818,       58373
##LAST=      0,             -235898,         -153433
##MIN=       0,             -730120,         0
##MAX=       8223.43324360094, 471723224,    0
$$ Real data points
##PAGE= N=1
##DATA TABLE= (X++(R..R)), XYDATA
$$ [...]
19470B33256g0412B31750b72322I8920c08289a10906A20198f5031r5142l4193
$$ 233256 -70412 231750 -272322 98920 -308289 -110906 120198 -65031 -160173 -194366
19460a94366B31541E4139R5086a1700j57191A49471b84819A35693d7814j31804
$$ -194366 231541 54139 149225 -11700 -168891 149471 -284819 135693 -47814 -179618
19450a79618q7859A9417J33462a50718c8447j36227l872F5188N1579a20951k8745
$$ -179618 -267477 19417 152879 -150718 -38447 -174674 -178546 65188 116767 -120951 -149696
19439a49696A2188a08345j37550p7698A68449e09345a73122k14169i3780l19947
$$ -149696 12188 -108345 -245895 -323593 168449 -509345 -173122 -387291 -93780 -413727
19429d13727a62120C7495J39477a34207j62468f3067m99438A61286a32638O4403
$$ -413727 -162120 37495 176972 -134207 -296675 -63067 -562505 161286 -132638 -68235
19419f8235b1518C9547a90132C9241j4596K4444J4754j5394B0452a88415h5776
$$ -68235 -21518 39547 -190132 39241 24645 49089 63843 48449 20452 -188415 -85776
19407e6319A73390b80053R360a13885B1074a7585A58355b17469Q3743j46643H1620
$$ -56319 173390 -280053 -270693 -113885 21074 -17585 158355 -217469 -133726 -280369 81620
19395a17178k33720A50019c6324l70409a66747C35577A24827B0438l430J81136
$$ -117178 -350898 150019 -36324 -406733 -166747 335577 124827 20438 17008 198144
19385A98144c18262B251R9712a4406A72306M5113a47323A08577a85638I7754J05463
$$ 198144 -318262 2251 101963 -14406 172306 217419 -147323 108577 -185638 97754 203217
19374B03217c9055k79589G6886a19634j75425A39532c5968j32868k37327I7430
$$ 203217 -39055 -318644 76886 -119634 -295059 139532 -35968 -168836 -406163 97430
19363b41404f9694D1413c05566h053G2763b58854H7411b05522l6355a2364l05424
$$ -241404 -69694 41413 -305566 -8053 72763 -258854 87411 -205522 -241877 -12364 -317788
19352c17788J1419i6888A37042a54443j42964k4059a29657k9576B04860c1584
$$ -317788 -306369 -96888 137042 -154443 -297407 -321466 -129657 -159233 204860 -31584
19341a20047C25426j54615b06251C7814b81476A61550b13381C6342b25651a018
$$ -120047 325426 170811 -206251 37814 -281476 161550 -213381 36342 -225651 -1018
19330b56419J08764A50624b96384N6382k8649A11577e80955b68319b7307G5802
$$ -256419 -147655 150624 -296384 -240002 -268651 111577 -580955 -268319 -27307 75802
19319b34352E2517K7305P3482k5406l9607e17998a59610M8592a5743k26198Q9826
$$ -234352 52517 79822 153304 127898 88291 -517998 -159610 -111018 -15743 -241941 -152115
19308a52115j68898R6920i3506j96128D7114J40353f0609k13885J15072j03131
$$ -152115 -321013 -224093 -93506 -289634 47114 187467 -60609 -274494 -159422 -262553
19298b62553Q5921A55083c2425E8496d3022l7649B81827b50596Q4379k8804B43644
$$ -262553 -176632 155083 -32425 58496 -43022 -80671 281827 -250596 -166217 -195021 243644
19286C2513d9832A320J23631a06071L1824k898A96746D8307c74391D6237a07395
$$ 32513 -49832 1320 124951 -106071 -74247 -77145 196746 48307 -374391 46237 -107395
19274B94338c10002C793b4184j82414H9254J13998d48116a03236B5522a85101
$$ 294338 -310002 3793 -24184 -206598 89254 203252 -448116 -103236 25522 -185101
19263B2031a83407A87462a24749A08178d5511r8741j17774A91865F1231b05289
$$ 22031 -183407 187462 -124749 108178 -45511 -144252 -262026 191865 61231 -205289
19252E1893c61622C515b53843f3594G1099L21983h0645j76972o0380a11500N5233
$$ 51893 -361622 3515 -253843 -63594 71099 393082 -80645 -257617 -317997 -111500 -56267
19241e6267A27753c38559a61627G6664b82557A41594j8626M03647A62253b8055
$$ -56267 127753 -338559 -161627 76664 -282557 141594 122968 526615 162253 -28055
19230e9907l41508B70111c33387A15248l4735a47369d0831F3373a01843q16A50999
$$ -59907 -401415 270111 -333387 115248 80513 -147369 -40831 63373 -101843 -102659 150999
19218a69318B13922j0221F6832b26731c0411A64961D873L2152a505A09242a76358
$$ -169318 213922 203701 66832 -226731 -30411 164961 4873 37025 -1505 109242 -176358
19206c99568J99163K9460c6397A37174J41446b13392P5469c9903A25430J68553
$$ -399568 -200405 -170945 -36397 137174 278620 -213392 -137923 -39903 125430 293983
19196B93983H3767a47610j89096A94546a84604B2515b11078m2373P7436C9405
$$ 293983 83767 -147610 -336706 194546 -184604 22515 -211078 -253451 -176015 39405
19185G5871g8972j65903a05105j1170A01486e1226B3062c52245E6544K80058b21211
$$ 75871 -78972 -244875 -105105 -116275 101486 -51226 23062 -352245 56544 336602 -221211
19173g0135j68995k44954A82145a00544j29378j2043G5822J24359C5908c3078
$$ -70135 -239130 -484084 182145 -100544 -229922 -241965 75822 200181 35908 -33078
19162a59300H9495a06599j89471O1214l374E8708Q8142c42040A29401a66770L3474
$$ -159300 89495 -106599 -296070 -234856 -238230 58708 146850 -342040 129401 -166770 -133296
19151a33296k4420B09551C4996a59396j33325A04501a14196d1017l42181a76084
$$ -133296 -157716 209551 34996 -159396 -292721 104501 -114196 -41017 -383198 -176084
19140I1792a14365j36128g2151k213A05833e9484H724a87882o9124O9317p05A74673
$$ 91792 -114365 -250493 -72151 -74364 105833 -59484 8724 -187882 -257006 -187689 -188394 174673
19127g8174n89a1452A20689c66192a47750g2419j84446J22229A22386a12877d5747
$$ -78174 -78763 -11452 120689 -366192 -147750 -72419 -256865 -134636 122386 -112877 -45747
19115c7248C36077R3589g2430j62713l700B19979m8331a52993M0429G8740e7442
$$ -37248 336077 429666 -72430 -235143 -238843 219979 171648 -152993 -112564 78740 -57442
19103B21469a16494B98027A6942O3576b30704B8888a52058K8085d0634A5773a18780
$$ 221469 -116494 298027 16942 80518 -230704 28888 -152058 -123973 -40634 15773 -118780
19091b07652H929b5653j08003A38813g9063l0406c0717j50424O5924M93m3116
$$ -207652 8929 -25653 -133656 138813 -79063 -109469 -30717 -181141 -115217 -114724 -157840
19080a57840f8019A97256i6128M4151k51379i8512j34567q0380A8838a33588O4753
$$ -157840 -68019 197256 -96128 -51977 -303356 -98512 -233079 -313459 18838 -133588 -68835
19069f8835l7051n8792k140R985d8235l18502E8857b64778e9903J0427F3049a84516
$$ -68835 -105886 -164678 -166818 -156833 -48235 -366737 58857 -264778 -59903 -49476 63049 -184516
19056f866k65173c3791A22072l5126a46351B76999a53050B34620b11853j52395
$$ -6866 -272039 -33791 122072 86946 -146351 276999 -153050 234620 -211853 -364248
19046c64248a26553j3320m3913k4705c497k30567B21417D1193a77401O7958H9570
$$ -364248 -126553 -139873 -183786 -208491 -3497 -234064 221417 41193 -177401 -109443 89570
19034a04685E7699c23981M6190J13077g6835J9379K8403p8976F1961d8044a2144
$$ -104685 57699 -323981 -277791 -164714 -76835 -57456 -29053 -108029 61961 -48044 -12144
19022C262J04602f6634D30088b07533A93373j9186a51481A11416c2791j91597
$$ 3262 107864 -66634 430088 -207533 193373 174187 -151481 111416 -32791 -224388
19012b24388i6725I0543A6752C180M0692R1289k9102R9366b09844n556C55796
$$ -224388 -96725 90543 16752 3180 43872 135161 106059 205425 -209844 -215400 355796
19000a28655b7190j57951b5388F5277a51974N6614b4234F2178a09110A0485K76137
$$ -128655 -27190 -185141 -25388 65277 -151974 -95360 -24234 62178 -109110 10485 286622
18989B86622C3688f1826D8275b75895g2069j94096o5958Q6568h9968j21644A29436
$$ 286622 33688 -61826 48275 -275895 -72069 -266165 -332123 -245555 -89968 -211612 129436
18977b28321A57056a26437k28643C9236L57189J60072J96493A20680J29922f0421
$$ -228321 157056 -126437 -355080 39236 396425 556497 752990 120680 250602 -60421
18966A63059J3031c3210I7397a76891A22421m4187K6720a48294L9095K2577M1556
$$ 163059 176090 -33210 97397 -176891 122421 78234 104954 -148294 -109199 -86622 -45066
18955d5066a3744D40351a53011g3644A34848L84k7329a41380f8234A68445e0023
$$ -45066 -13744 440351 -153011 -73644 134848 135232 107903 -141380 -68234 168445 -50023
18943g8710j14797A86959b52294M1317M7907c8548A16285R3900d2031p9136j17591
$$ -78710 -193507 186959 -252294 -210977 -163070 -38548 116285 210185 -42031 -121167 -238758
18932b38758C92676j00814g4211A28095a92419a8317B82275a22324k74292A23671
$$ -238758 392676 291862 -74211 128095 -192419 -18317 282275 -122324 -396616 123671
18921e41684A92265a45778n1700F4671b18131A85797a85293c490A37122J5871
$$ -541684 192265 -145778 -197478 64671 -218131 185797 -185293 -3490 137122 152993
18911A52993F3902P8505K27245k1427Q1950H288f254p783B56916h6276K8302E9669
$$ 152993 63902 142407 369652 348225 430175 8288 -6254 -14037 256916 -86276 -57974 59669
18898h4496k16948H5403g30120b7619o520I0660h5112j9180G4676c9424m54853
$$ -84496 -301444 85403 -730120 -27619 -34139 90660 -85112 -104292 74676 -39424 -494277
18887d94277a56933P1010q216L426j04182A32431J62386a29699A2434a29882L1748
$$ -494277 -156933 -85923 -94139 -90713 -194895 132431 294817 -129699 12434 -129882 -98134
18876i8134j5599k9448q8473A59985b99657a20287C1967L0361a80565g1454F2358
$$ -98134 -113733 -143181 -231654 159985 -299657 -120287 31967 62328 -180565 -71454 62358
18864A81671m0523b8143k1139k0200o8413A9987b19789L9872A71792e079j95892
$$ 181671 141148 -28143 -49282 -69482 -137895 19987 -219789 -179917 171792 -5079 -200971
18853b00971L5701A9680c7844l187q1822r8999B9435a05177C03779e39A9461c2658
$$ -200971 -165270 19680 -37844 -41031 -122853 -221852 29435 -105177 303779 -539 19461 -32658
18840c03659a70j97205A2361c28090B48792c5703r8736j6860O7564g107j16488
$$ -303659 -170 -197375 12361 -328090 248792 -35703 -134439 -151299 -83735 -7107 -123595
18829a23595e9883l29134A01942c24359a524k82973n9694a6447k0347a3145j89570
$$ -123595 -59883 -389017 101942 -324359 -1524 -284497 -344191 -16447 -36794 -13145 -202715
18818b02715b4748B01041Q1285G4563L11942b80064B58392c06411H0307B4685
$$ -202715 -24748 201041 282326 74563 386505 -280064 258392 -306411 80307 24685
18807B00158J45716C3652a96197d1133G1449j1868a78803Q2032j214C1593K15762
$$ 200158 345874 33652 -196197 -41133 71449 59581 -178803 -96771 -97985 31593 247355
18796B47355B9208C730a42598A7894i7525l06695A05815a36847j29477e5810p101
$$ 247355 29208 3730 -142598 17894 -97525 -404220 105815 -136847 -266324 -55810 -62911
18785f2911A13876m3110a3509j92182M0416A4435c70769r9834B5392A0956D712
$$ -62911 113876 70766 -13509 -205691 -165275 14435 -370769 -470603 25392 10956 4712
18773a19093E1686a16391G4146B62d1020D0978K00807q7630F0629a9398C99968
$$ -119093 51686 -116391 74146 262 -41020 40978 241785 154155 60629 -19398 399968
18761f4766o2959B43370q7361P3083a59015F5009K10698a44981k9633f1258a7196
$$ -64766 -127725 243370 156009 229092 -159015 65009 275707 -144981 -174614 -61258 -17196
18749b23078A27911b1561B60136C9629a95623a2826p9266A15524K71089B0723
$$ -223078 127911 -21561 260136 39629 -195623 -12826 -92092 115524 386613 20723
18738b95024e7038p3865e942C1967a54822B32640I7757a79205D985b29215a14019
$$ -295024 -57038 -130903 -5942 31967 -154822 232640 97757 -179205 4985 -229215 -114019
18726A08110j9590J0028a31141l7996A31112J17820a58309A1778K87051c7652
$$ 108110 88520 98548 -131141 -169137 131112 248932 -158309 11778 298829 -37652
18715d0165m28772B72479b24961c1078A19710L6378N8376b17845c7724H4463a55928
$$ -40165 -468937 272479 -224961 -31078 119710 156088 214464 -217845 -37724 84463 -155928
18703a64089g1662I7348L3824c79835G0580a2212B87727a44488O9501A8708e4948
$$ -164089 -71662 97348 131172 -379835 70580 -12212 287727 -144488 -74987 18708 -54948
18691a20453J1386j3603A80645f4630j88695J9879B0178M7900D161J48933f0298
$$ -120453 -109067 -122670 180645 -64630 -253325 -233446 20178 68078 4161 153094 -60298
18679C36009a11372K328C8269c33381A85326B2945J07603c29190A51256b64891
$$ 336009 -111372 -109044 38269 -333381 185326 22945 130548 -329190 151256 -264891
18668f4292m9432j18946e9974a122j39023E1849d3257o2573j64973B63211m6188
$$ -64292 -113724 -232670 -59974 -1122 -140145 51849 -43257 -105830 -270803 263211 217023
18657B17023f4833r669A50003N7177b54430A53087C9426a43069A19200K70828
$$ 217023 -64833 -74502 150003 207180 -254430 153087 39426 -143069 119200 390028
18647C90028h5635G1016J11758A3634J30072d77949K09997f4487q2685J3527J8635
$$ 390028 -85635 71016 182774 13634 143706 -477949 -267952 -64487 -147172 -133645 -115010
18636a15010k3586o1540G4656g4068a8538k01790k40109e6201l6603o742d5310
$$ -115010 -138596 -200136 74656 -74068 -18538 -220328 -460437 -56201 -92804 -99546 -45310
18624f1635j46532m1095A7270g5733A5181a14744j47068D4528J77107a8183A49424
$$ -61635 -208167 -249262 17270 -75733 15181 -114744 -261812 44528 221635 -18183 149424
18612b2999k2592l146k33599i9192p0907l7623g2143k1597j10773F0147b6353
$$ -22999 -45591 -48737 -282336 -99192 -170099 -207722 -72143 -93740 -204513 60147 -26353
18600c8466B1678b63716O2110N839G6114i7617n779q9491k19309J37185d6640
$$ -38466 21678 -263716 -201606 -195767 76114 -97617 -103396 -192887 -412196 -275011 -46640
18588a68662M1741a3117j30936K1434l2033A54233p6158c1618R944o9974j01843
$$ -168662 -126921 -13117 -144053 -122619 -154652 154233 78075 -31618 -21674 -91648 -193491
18577a93491D79232c10564j7778J47759A27147a09674q5739m7745a0810C6626
$$ -193491 479232 -310564 -328342 -180583 127147 -109674 -195413 -243158 -10810 36626
18566a96133K5210P8983I2723i3038G0891a49397I0138c0852k04102g8046e518
$$ -196133 -170923 -91940 92723 -93038 70891 -149397 90138 -30852 -234954 -78046 -5518
18554D6935a95619e3675k5264L6809j0503A50319J95317b04022M7668G3979K8009
$$ 46935 -195619 -53675 -78939 -42130 -52633 150319 345636 -204022 -156354 73979 101988
18543A01988N3530K6053b25216C4606h8532p7879o500G5323j131b53872a04912
$$ 101988 155518 181571 -225216 34606 -88532 -166411 -172911 75323 74192 -253872 -104912
18531i5748k51886a26190L5814j17366C09397B7984E627a25462O0752j79000Q4015
$$ -95748 -347634 -126190 -90376 -207742 309397 27984 5627 -125462 -64710 -243710 -159695
18520a59695c1836k98032a28915N4433A2802J52062G9849a7182k84736A89578
$$ -159695 -31836 -329868 -128915 -74482 12802 164864 79849 -17182 -301918 189578
18509a29138A55018b71553a26548C7839J72767a58379c5392A11791b2655k2188
$$ -129138 155018 -271553 -126548 37839 210606 -158379 -35392 111791 -22655 -44843
18499d4843k42923E1595J19513j0469n7925k7252f2973j86174j92905a02840b0588
$$ -44843 -287766 51595 171108 160639 102714 75462 -62973 -249147 -442052 -102840 -20588
18487c9596C5204J3484A8025a36847K0180J9358I026i3994A85580b73294e476
$$ -39596 35204 48688 18025 -136847 -116667 -97309 9026 -93994 185580 -273294 -5476
18475c19657F4319J17625a81635D4243N3393b41655O5503c9261q1153k73435A14625
$$ -319657 64319 181944 -181635 44243 97636 -241655 -176152 -39261 -120414 -393849 114625
18463A64307Q850i1932j8730K335m7028d6596B26098i8723A67565c83318h1059
$$ 164307 173157 -91932 -110662 -108327 -155355 -46596 226098 -98723 167565 -383318 -81059
18451c08591G237i8287A37269b9796E9085d57597G2073e9022A03057b23422b8609
$$ -308591 7237 -98287 137269 -29796 59085 -457597 72073 -59022 103057 -223422 -28609
18439a69659B7772a98314L0254p8558D070e7055D1869J34176J5227j9687m498
$$ -169659 27772 -198314 -168060 -246618 4070 -57055 41869 176045 191272 171585 167087
18428A67087f8027K7068k64630i0814A19309J52235f7917A36009c354j88552d3203
$$ 167087 -68027 -40959 -305589 -90814 119309 271544 -67917 136009 -3354 -191906 -43203
18416h1043J4377p5481I697b89132J03551F2782j2516q955a24383B54042a22293
$$ -81043 -66666 -142147 9697 -289132 -185581 62782 50266 41311 -124383 254042 -122293
18404G8829C1677a07087l40348c2271J0526A52768a80602P1651G7422m898k7153
$$ 78829 31677 -107087 -447435 -32271 -21745 152768 -180602 -108951 77422 72524 45371
18393D5371d4923j39568I576d05716a60280A12927K33905I9534a17284A91652
$$ 45371 -44923 -184491 9576 -405716 -160280 112927 346832 99534 -117284 191652
18382f2973C89505A78407b59103O5530B24753h4419F5980K89123D3043c06392
$$ -62973 389505 178407 -259103 -193573 224753 -84419 65980 355103 43043 -306392
18371B6243N6062h414j64067c2438A62827c36842I4215g2840k45650J9629B08721
$$ 26243 82305 -8414 -172481 -32438 162827 -336842 94215 -72840 -318490 -298861 208721
18359a60951g4578D17034a03154G2215J09020i2247k43547G1898a39968I46Q4152
$$ -160951 -74578 417034 -103154 72215 181235 -92247 -335794 71898 -139968 946 85098
18348H5098b03123n3675C7978O49394C01853H0415J19632a1348A07278a79196
$$ 85098 -203123 -256798 37978 687372 301853 80415 200047 -11348 107278 -179196
18337g1478n4138N1987n2887N9826b1681Q377j87168A56867j3231K2265d91949
$$ -71478 -125616 -73629 -126516 -66690 -21681 -13304 -200472 156867 143636 165901 -491949
18325b17721r3931i9887i801E6453k5380J24188b78478C9628b5448k53163B5991
$$ -217721 -311652 -99887 -9801 56453 31073 155261 -278478 39628 -25448 -278611 25991
18313A10718a3693j66202h8106k28702B60282h1743A80534c01904B4626f2546
$$ 110718 -13693 -179895 -88106 -316808 260282 -81743 180534 -301904 24626 -62546
18302a30749h236J477A2668J69856G7135a61662e5058P644p2359E4512i4669B4206
$$ -130749 -8236 -6759 12668 182524 77135 -161662 -55058 -47414 -119773 54512 -94669 24206
18289a93671f8783m1013B01988b81188D0376f4195j03778M9940B6401i8262o3239
$$ -193671 -68783 -109796 201988 -281188 40376 -64195 -167973 -118033 26401 -98262 -161501
18278a61501L9065d3791j50353N2249k85627e359m41960C56806a5444q2116d1051
$$ -161501 -122436 -43791 -194144 -141895 -427522 -5359 -447319 356806 -15444 -97560 -41051
18266a90735b6573k10638f9618q1355r237B05846a12587A4577p086J13749J15020
$$ -190735 -26573 -237211 -69618 -150973 -160210 205846 -112587 14577 7491 121240 236260
18255B36260i6804A15343a50475K687P3555j2454C0006J29981E5764d23856b9440
$$ 236260 -96804 115343 -150475 -147788 -74233 -86687 30006 159987 55764 -423856 -29440
18243b11228A54736a94975n2886F9662a58091j46330g4377B2832J48693e27371
$$ -211228 154736 -194975 -247861 69662 -158091 -304421 -74377 22832 171525 -527371
18232d162k73906a30573o2192D4249Q0009b3452B08969I1974l4902c72155J59505
$$ -4162 -278068 -130573 -192765 44249 124258 -23452 208969 91974 57072 -372155 -212650
18221b12650a9161C7099J17852d69943d380k81948P8497R4844k78610e9527A02420
$$ -212650 -19161 37099 154951 -469943 -4380 -286328 -207831 -112987 -391597 -59527 102420
18209B22962r7413a5295G1363L0699L2669L3252a25250K1011G2200k3761d6314
$$ 222962 125549 -15295 71363 102062 134731 167983 -125250 -104239 72200 48439 -46314
18197a14712e5109A2273L55854b00719E1223a90660A11049A3802a7405A02050
$$ -114712 -55109 12273 368127 -200719 51223 -190660 111049 13802 -17405 102050
18186a03947A34620c34184B70195A20143b70708P9409r6640A99000g7864m8427
$$ -103947 134620 -334184 270195 120143 -270708 -191299 -287939 199000 -77864 -126291
18176a26291A1383a38469H4652b2502j9379D5162a24909B67342b5401J2496j70456
$$ -126291 11383 -138469 84652 -22502 -41881 45162 -124909 267342 -25401 -12905 -183361
18165a83361O4899A52423n8058J23192L18233g9567B0330a47059d5969j13707
$$ -183361 -118462 152423 94365 217557 535790 -79567 20330 -147059 -45969 -159676
18155a59676B90506a16087q9686o9480A92737L4125b60963J1726N2533O8420M1287
$$ -159676 290506 -116087 -205773 -275253 192737 226862 -260963 -249237 -196704 -128284 -86997
18144h6997A4502b46159Q9743j24410O8623L3499H5833l9332L92010f1630E197
$$ -86997 14502 -246159 -156416 -280826 -212203 -178704 85833 46501 438511 -61630 5197
18132D3591l458R8211b44096d2511n1271B44660I9058J19532A03276i4039d3920
$$ 43591 40133 138344 -244096 -42511 -93782 244660 99058 218590 103276 -94039 -43920
18120b45833N9459B66374b52771b164A50578a08924E1643J83928B6824a60032
$$ -245833 -186374 266374 -252771 -2164 150578 -108924 51643 235571 26824 -160032
18109a84973A06914B6820Q9089n704j1031a5940j66378A1604K01921r2044c72183
$$ -184973 106914 26820 115909 110205 99174 -15940 -182318 11604 213525 121481 -372183
18097a01227B14103f7127A03336a99490j11603B4542r614a38865I4369b12878
$$ -101227 214103 -67127 103336 -199490 -311093 24542 14928 -138865 94369 -212878
18086A15493B0293M9187J4130K98756A26288a32893B77788k7618j12576k7343
$$ 115493 20293 69480 83610 382366 126288 -132893 277788 250170 137594 110251
18076A10251c787k26054P2863A3919c0901k66931N9431E9307Q6705I181C700f6829
$$ 110251 -3787 -229841 -156978 13919 -30901 -297832 -238401 59307 146012 9181 3700 -66829
18063c13376a11741p2262A60544a5567C3641E867a58577Q304M7078h416l68925
$$ -313376 -111741 -184003 160544 -15567 33641 5867 -158577 -150273 -103195 -8416 -377341
18052c77341B59965G3194c05116a18110G8630R8072C4270b66260M9598N0947B10916
$$ -377341 259965 73194 -305116 -118110 78630 176702 34270 -266260 -216662 -165715 210916
18040C26729c01638a00540r5846P387F309a42456B28623c3964C15713r8233A5959
$$ 326729 -301638 -100540 -196386 -188999 6309 -142456 228623 -33964 315713 217480 15959
18028A8530h2097D44L03403i1413o2359E9246g4439j64129I1117C5826J15279
$$ 18530 -82097 444 303847 -91413 -153772 59246 -74439 -238568 91117 35826 151105
18017A51105M8624k5448a07148l5543g0946p8487e6470A13291K08741F202K29846
$$ 151105 199729 174281 -107148 -142691 -70946 -149433 -56470 113291 322032 6202 236048
18006B36048a65527A56056Q426F7603a55267O5949F7227a00308C55090i3651F1544
$$ 236048 -165527 156056 164482 67603 -155267 -89318 67227 -100308 355090 -93651 61544
17994d9811E1857I382b41644G1013e84106A90449F8735c31080a12133k18687d156
$$ -49811 51857 9382 -241644 71013 -584106 190449 68735 -331080 -112133 -330820 -4156
17982A12403a14806E6315b89924b3377D9670d9268A08600a99028a0001B63390
$$ 112403 -114806 56315 -289924 -23377 49670 -49268 108600 -199028 -10001 263390
17971e5244m6167c1473k0208k25944A86917k1124a37677A63416j8196j1899h1838
$$ -55244 -101411 -31473 -51681 -277625 186917 165793 -137677 163416 145220 133321 -81838
17959B540K30554F7648N6184a90121g3714r3870D8458J70716j5533A5909O2415
$$ 2540 233094 67648 123832 -190121 -73714 -167584 48458 219174 203641 15909 78324
17948G8324i4393b9779B7253c48405g8424A27701K2714b09295D7638e1069I4758
$$ 78324 -94393 -29779 27253 -348405 -78424 127701 150415 -209295 47638 -51069 94758
17936b12062H3164a41621f2992k15577B8153a21861j30306A17751B921Q2557B3274
$$ -212062 83164 -141621 -62992 -278569 28153 -121861 -252167 117751 2921 85478 23274
17924d02856D416a26749A83435c8942A60619D4979G113r41J38151a02841A9057
$$ -402856 4416 -126749 183435 -38942 160619 44979 7113 6172 144323 -102841 19057
17912A68750P9454b44236i3457B45965j11295a39215A31079b58350B4469d2551
$$ 168750 248204 -244236 -93457 245965 134670 -139215 131079 -258350 24469 -42551
17901A44062b24256B2548g7424R939H4295A2191b7520A23249b37191c6731j5020
$$ 144062 -224256 22548 -77424 -67485 84295 12191 -27520 123249 -237191 -36731 -51751
17890e1751j40806J6420o2319C87636h6393p373F0179a50350I2263C3289J43831
$$ -51751 -192557 -176137 -238456 387636 -86393 -93766 60179 -150350 92263 33289 177120
17879A77120b31436A71000e713p1418A61619o1403N7815b3770k09573C54171P8024
$$ 177120 -231436 171000 -5713 -77131 161619 100216 158031 -23770 -233343 354171 432195
17868D32195E7767J45220J06591c20512E4916a89324b8483p1711j13627A53380
$$ 432195 57767 202987 309578 -320512 54916 -189324 -28483 -100194 -213821 153380
17857A85852m3513H927a05599n2369j9923C48032c98874B4510g5861A33583e3647
$$ 185852 142339 8927 -105599 -157968 -177891 348032 -398874 24510 -75861 133583 -53647
17845b35019a616k78759f1920B10187q6409c96203A22376a34332a2658G0971A8912
$$ -235019 -1616 -280375 -61920 210187 123778 -396203 122376 -134332 -12658 70971 18912
17833C5446a29642H0532N9127Q4921a38298B56043b98279J25072A91972G9593
$$ 35446 -129642 80532 139659 224580 -138298 256043 -298279 -173207 191972 79593
17822a01153C8084R3455Q2856F7741Q4594l6004a68208I4226a5888o8259n1895
$$ -101153 38084 131539 214395 67741 152335 116331 -168208 94226 -15888 -84147 -136042
17811a36042c4333A39802J15926O5897B5786K08552K258b61120B82938G6216m444
$$ -136042 -34333 139802 255728 321625 25786 234338 236596 -261120 282938 76216 71772
17800G1772K6502K29035h6026l5616F506J46059f5479j0505j16736A1830a6052
$$ 71772 98274 327309 -86026 -121642 6506 152565 -65479 -75984 -192720 11830 -16052
17788A41352a22665D6917J65518a06881l19756B27376K6709d5844C6470L3418
$$ 141352 -122665 46917 212435 -106881 -426637 227376 254085 -45844 36470 69888
17778F9888b21328E6150a07268H5060Q9811k4313A7562a26200k19584C34790b17402
$$ 69888 -221328 56150 -107268 85060 174871 150558 17562 -126200 -345784 334790 -217402
17766C17511a34618A09070m6907O2186m4216k3042c4907C1342K37069G3340B2615
$$ 317511 -134618 109070 62163 124349 80133 57091 -34907 31342 268411 73340 22615
17754A55774E5376c96679a13979K8600E1576i6251B01415F7522K18196j33671
$$ 155774 55376 -396679 -113979 -85379 51576 -96251 201415 67522 285718 152047
17744A52047K28988A61554B7595L80780c20374A03314C9683M9233D2910b70193
$$ 152047 381035 161554 27595 408375 -320374 103314 39683 88916 42910 -270193
17733a0328j29119d2670A6156L16628j40793k6643C9643b00125I4328b16909A64298
$$ -10328 -139447 -42670 16156 332784 191991 165348 39643 -200125 94328 -216909 164298
17721H7629K65601e134B3255J95757d275n8224A53617o5308b30074D63112A06791
$$ 87629 353230 -5134 23255 219012 -4275 -62499 153617 88309 -230074 463112 106791
17709H2110K61268j43691i8084d2245A53729O4279D5743J34261d8376A53545J91909
$$ 82110 343378 199687 -98084 -42245 153729 218008 45743 180004 -48376 153545 345454
17698C45454a30183E6464J57390b5421g418F79110E0184J080c4376F4684f3736
$$ 345454 -130183 56464 213854 -25421 -7418 679110 50184 51264 -34376 64684 -63736
17686B17116F4554a98713G669Q2263a40052B59911G405e4759A47403a10876r8640
$$ 217116 64554 -198713 7669 89932 -140052 259911 7405 -54759 147403 -110876 -209516
17675b09516A92403O5413g2245B91071G2843K515a2743A31979K06188F2202J83782
$$ -209516 192403 257816 -72245 291071 72843 75358 -12743 131979 338167 62202 245984
17664B45984b73535C74645G5973J04828J2071J18368d33653B08335B5598i3590
$$ 245984 -273535 374645 75973 180801 192872 311240 -433653 208335 25598 -93590
17653E13076A26279M9329J34843b1958B30667B0839p650L9861e4668h6F8420k5317
$$ 513076 126279 175608 310451 -21958 230667 20839 13189 53050 -54668 -86 68420 43103
17641D3103a07995A0236J02610a8051B25286a3741A92481m7800n7945J87827d2155
$$ 43103 -107995 10236 112846 -18051 225286 -13741 192481 144681 86736 274563 -42155
17629b36415f9857a3851n288H3714K95374a60781K5115I4444j9593f5052n8262
$$ -236415 -69857 -13851 -19139 83714 379088 -160781 -135666 94444 74851 -65052 -123314
17618a23314C37079A41214h153B81810b27692C20779N3838e7843j63D07354A26392
$$ -123314 337079 141214 -8153 281810 -227692 320779 374617 -57843 -58006 407354 126392
17606a65206C27961a8886j69156E3781f2041C56621e0185j05978j00516A81623
$$ -165206 327961 -18886 -188042 53781 -62041 356621 -50185 -156163 -256679 181623
17595B49850D2726A5100J22791H793a38533A99284f443B08554n4875b5439B80602
$$ 249850 42726 15100 137891 8793 -138533 199284 -6443 208554 153679 -25439 280602
17583A21361K10102d2470B29538k4782L744H5302f1533B42112a50265B21720Q5790
$$ 121361 331463 -42470 229538 204756 208500 85302 -61533 242112 -150265 221720 307510
17572C07510E4187b0268C36478j10171I9310K2643d2060E3707K31959K82949I4587
$$ 307510 54187 -20268 336478 226307 99310 121953 -42060 53707 285666 568615 94587
17560E0467K04330j09925J91956a72549A56050N176J93740j57618K0343M1032
$$ 50467 254797 144872 336828 -172549 156050 161226 354966 197348 217691 258723
17550B58723A3127J14691j00b31519H8479K66660l4678J47181M5299a93929A79213
$$ 258723 13127 127818 127718 -231519 88479 355139 320461 467642 512941 -193929 179213
17538E5253K77948e2847G5508K64296A29658m1489K28556B4943M65464o5299j04826
$$ 55253 333201 -52847 75508 339804 129658 88169 316725 24943 490407 425108 320282
17527C20282J17128N06119R8620R4502q0448j70707j23876l71667J86315N6006
$$ 320282 437410 943529 1042149 1136651 1056203 885496 761620 389953 576268 632274
17517F32274k36334A47836K50405M3437B16907M03883Q4745K91509k13491M02832
$$ 632274 395940 147836 398241 441678 216907 620790 705535 997044 783553 1186385
17507A186385j80898K66447F24234A68287L33737B20035Q1396K267P1939A31397
$$ 1186385 1005487 1271934 624234 168287 502024 220035 301431 303698 375637 131397
17496B93053m3538F5121L65153j42507L18175E0717L65188L3928q198j8466A12075
$$ 293053 249515 65121 430274 287767 605942 50717 415905 449833 441635 423169 112075
17484D03941J01570k0034r6590o1306J20096K29780B57214K26772k24552O8976
$$ 403941 505511 485477 388887 327581 447677 677457 257214 483986 259434 328410
17474C28410k6083A350N1173J13405J98575K8440o0030a15527d2876J9211C30326
$$ 328410 302327 1350 52523 165928 364503 392943 332913 -115527 -42876 -23665 330326
17462A79950a39347C85327j63140J11509j13885J01675q2397Q9136J34929j67887
$$ 179950 -139347 385327 222187 333696 219811 321486 239089 328225 463154 295267
17452B95267j47507n0686L00937O7684o9689J45833J83271k00133j91543J92805
$$ 295267 147760 97074 398011 465695 396006 541839 725110 524977 333434 526239
17442E26239j91133P8744J53352B60243K72812j78143N2249j17973J4696L04669
$$ 526239 335106 413850 567202 260243 533055 354912 407161 289188 303884 608553
17432F08553I3217O77071j83230k02718j15519J74566n2949j28257A04669L51140
$$ 608553 93217 770288 587058 384340 268821 443387 390438 262181 104669 455809
17422D55809j02758K01134k43198F0511O32361k94823k4242L32845c2559C56125
$$ 455809 353051 554185 310987 60511 692872 398049 373807 706652 -32559 356125
17411F84407B54759J6576O1771R991K65225A63014O0332P4564Q7471E6563O2454
$$ 684407 254759 271335 333106 343097 608322 163014 223346 297910 385381 56563 119017
17400A19017K68120A75911J0210J02064r3438D5564J1228K60722G7815J20306
$$ 119017 387137 175911 186121 288185 194747 45564 56792 317514 77815 198121
17390A98121R5724Q0267j00169L25276B0242J37518M40387j40790J71526A70095
$$ 198121 293845 374112 273943 599219 20242 157760 598147 457357 628883 170095
17379A11745o109J41856j14366n9081K15044J28798p2496r0949o634Q873J76602
$$ 111745 105636 247492 133126 74045 289089 417887 345391 254442 247808 256681 433283
17368D33283n2516A70360L64499e5956G406K96642p9008R6205j28054N0223l2741
$$ 433283 380767 170360 534859 -55956 7406 304048 225040 321245 193191 243414 210673
17357B10673j1263K6903K09566N7932j83755A31707J06896g0621A96073O9987
$$ 210673 199410 226313 435879 493811 310056 131707 238603 -70621 196073 266060
17347B66060q739j07392K02123j24601A361J32001J07873A07950R3305c9573A979
$$ 266060 257321 149929 352052 227451 1361 133362 241235 107950 201255 -39573 1979
17335D38696n2210A41690P1627R3220K53439a22563E65311a36350A06996a19735
$$ 438696 386486 141690 213317 306537 559976 -122563 565311 -136350 106996 -119735
17324A28433K54546j41616L23012B02211m7593J80156A5268M9102O6741n176b2054
$$ 128433 382979 241363 564375 202211 154618 334774 15268 64370 131111 125935 -22054
17312A69109J42591K4502I6461L86713j35891A25859M54426G2795J20196K13297
$$ 169109 311700 336202 96461 483174 347283 125859 580285 72795 192991 406288
17302D06288M6039E8530J4831K11810j14540k4975K96819B2255J13282L72340
$$ 406288 452327 58530 73361 285171 170631 145656 442475 22255 135537 507877
17292E07877m7665N1313A77446Q3814o2795K26017A64064K83239B21751D2049
$$ 507877 460212 511525 177446 261260 198465 424482 164064 447303 221751 42049
17281C70948o8270o671a6227B58562L00492j23588j1628P8557j28265j19110J09912
$$ 370948 302678 296007 -16227 258562 559054 435466 423838 502395 374130 255020 364932
17270C64932N8066Q2529o5939k16579b8111C56127J60336m1102a20517D32927
$$ 364932 422998 505527 439588 223009 -28111 356127 516463 475361 -120517 432927
17259F32715k86724r0437J918J07755i8765B58854R5413A25133J23809K90468
$$ 632715 345991 255554 257472 365227 -98765 258854 354267 125133 248942 539410
17249E39410k03581M7148A09729N5656L37686j46458J36490A67041b9340D55708
$$ 539410 335829 382977 109729 165385 503071 356613 493103 167041 -29340 455708
17238D85405O37d7284D98014o2134A95931j3085K51024l9961j75633p5803p0697
$$ 485405 486042 -47284 498014 435880 195931 182846 433870 393909 218276 142473 71776
17227G1776M91997k78947K8351b0319B46525R6074a0758C66937N1375A84005L85841
$$ 71776 563773 284826 313177 -20319 246525 342599 -10758 366937 418312 184005 569846
17216E69846M7452B39761K49414A85734Q485J71496N856M9769N86j62880J66400
$$ 569846 617298 239761 489175 185734 194219 365715 371571 421340 421926 259046 425446
17205D25446K10412A77373J00672P1138j69117L10231j28354j45181J02943r4962
$$ 425446 635858 177373 278045 349183 180066 490297 361943 216762 319705 224743
17195B24743J03456L43727k81466J24663B44084J93574j0578J12540K21794o4485
$$ 224743 328199 671926 390460 515123 244084 437658 427080 539620 761414 696929
17185F96929k11523j38156O5197A24027K11117M63933k01735j37823j86896K13670
$$ 696929 485406 347250 412447 124027 335144 799077 597342 459519 272623 486293
17175D86293j57286J19221j69974K06367J71184j31359O5281j53932N04986k40274
$$ 486293 329007 448228 278254 484621 655805 524446 589727 435795 940781 700507
17165G00507j25306m138B74521L03274J03978C07448J28202K12250j62512A18877
$$ 700507 575201 571063 274521 577795 681773 307448 435650 647900 485388 118877
17154F22129A51343N58418B94645N38741C91493K82733r3309B50844L01998j93842
$$ 622129 151343 709761 294645 833386 391493 674226 580917 250844 552842 359000
17144C59000J23043K7750J42573k08579B12483L56537k5001j01819R4906K60411
$$ 359000 482043 509793 652366 443787 212483 569020 544019 442200 537106 797517
17134G97517C23371A50358M50918Q4428J64864K1871r4988l68275K40354C02300
$$ 797517 323371 150358 601276 685704 850568 872439 777451 409176 649530 302300
17123H63980D05162K15865L4150j00664j81571J32007J09881J16570C22192K4344
$$ 863980 405162 621027 655177 554513 372942 504949 614830 731400 322192 346536
17113C46536O70051l38229k30724j25664L47303k07527O3410j37061L05243j80937
$$ 346536 1016587 678358 447634 321970 669273 461746 525156 388095 693338 512401
17103E12401J87861l39724L18028J9200j06008M74971l25094J0122l33099L57550
$$ 512401 700262 360538 678566 697766 591758 1066729 741635 751757 418658 776208
17093G76208Q9910k70581k93280N02754j69161k4708o8942O122L06290k12820
$$ 776208 866118 595537 302257 805011 635850 611142 542200 548322 854612 641792
17083F41792n3184J63253j50537r3005J15688p939R2651p6649m5791M06907k81002
$$ 641792 588608 751861 601324 508319 624007 616068 708719 632070 586279 993186 712184
17072G12184j74473J1372M70162j17081J45435D51140N42407l60890K51782p7789
$$ 712184 537711 549083 1019245 902164 1047599 451140 993547 632657 884439 806650
17062H06650j28504J58309k11635K65918J25787r3767l05770M35658l7231l29737
$$ 806650 678146 836455 624820 890738 1016525 922758 616988 1052646 1015415 685678
17052F85678k05135N93227n606l73597J77845r8175J98964k14279k03911K40283
$$ 685678 480543 1073770 1068164 694567 872412 774237 973201 758922 555011 795294
17042G95294J46320P6690N7945K3264l11074J38884O5653r2371k12789K3983K37757
$$ 795294 941614 1018304 1076249 1099513 788439 927323 992976 900605 687816 711799 949556
17031I49556J54323P8034k83182L970J17179l843j31873J6418K06582j32050K87788
$$ 949556 1103879 1181913 898731 902701 1019880 1016037 884164 900582 1107164 975114 1262902
17020A262902l00911m7820p7492L21939O2498k41785j8408J53510O5333j3392
$$ 1262902 961991 914171 836679 1158618 1221116 979331 960923 1114433 1179766 1166374
17010A166374N1023j37633j71373J33593L71951j43630J99636l94857K68845J30206
$$ 1166374 1217397 1079764 908391 1041984 1413935 1270305 1469941 1075084 1343929 1474135
17000A474135l54827l6670K27226j97683J99399k58817J68588l1508N9026R3851
$$ 1474135 1119308 1082638 1309864 1112181 1311580 1052763 1221351 1189843 1248869 1342720
16990A342720K64676l98507M6930j79608L04549j2523K1746k36844J79034J17982
$$ 1342720 1607396 1208889 1255819 1076211 1380760 1368237 1389983 1153139 1332173 1450155
16980A450155K6055k06400J77454J45190o2180k48624K43511L0150k04097P7326
$$ 1450155 1476210 1269810 1447264 1592454 1530274 1281650 1525161 1555311 1351214 1428540
16970A428540L9791M0298K43535m65818K21073k92239K60403J97527J04264l00027
$$ 1428540 1468331 1508629 1752164 1286346 1507419 1215180 1475583 1673110 1777374 1477347
16960A477347K3989Q2116j13533j05157J10452M3133m2679J20186j61418M30058
$$ 1477347 1501336 1583452 1469919 1364762 1475214 1518347 1475668 1595854 1434436 1864494
16950A864494j0379j81542k54164L65895R3512K79859o49469J15961L90953j72739
$$ 1864494 1854115 1672573 1418409 1784304 1877816 2157675 1508206 1624167 2015120 1842381
16940A842381N3175j83161L24846j28327j12241N1464k46654L01309J62974K3675
$$ 1842381 1895556 1712395 2037241 1908914 1796673 1848137 1601483 1902792 2065766 2089441
16930B089441J30101k51706J60377M2890q544K96615n19632N28597m45237P5590
$$ 2089441 2219542 1967836 2128213 2171103 2162559 2459174 1939542 2468139 2022902 2098492
16920B098492K2399K3156K19829o6562J4369J22174j34844M12047j62192j72969
$$ 2098492 2120891 2144047 2363876 2297314 2311683 2433857 2299013 2711060 2548868 2375899
16910B375899Q1652j14545M3313M47098N0859J39286j59246J34714l98213L2618
$$ 2375899 2457551 2343006 2386319 2833417 2884276 3023562 2864316 2999030 2600817 2633435
16900B633435K20059j56786K22792j15190J49575J62036R598k04835j03O28955
$$ 2633435 2853494 2696708 2919500 2804310 2953885 3115921 3125519 2920684 2920581 3549536
16890C549536n3701m72395J85067K39999k38193m202N61326l53349L1554J04353
$$ 3549536 3495835 3023440 3208507 3448506 3210313 3206111 3767437 3414088 3445642 3549995
16880C549995J09038l9180L5717k30048M3368K88424m9683K15184J4845J3483
$$ 3549995 3659033 3619853 3655570 3425522 3468890 3757314 3707631 3922815 3937660 3951143
16870C951143r5177K11329K55919m09320J50705K72755m9002o1516J52410O6644
$$ 3951143 3855966 4067295 4323214 3913894 4064599 4337354 4288352 4226836 4379246 4445890
16860D445890K36773r3439Q2181K17791m4268k47264J67586R4415l7027N59906
$$ 4445890 4682663 4589224 4671405 4889196 4844928 4597664 4765250 4859665 4822638 5382544
16850E382544j6007k10002K46878j61447M03206O3047M2650r0685K05212J09653
$$ 5382544 5366537 5156535 5403413 5241966 5645172 5708219 5750869 5660184 5865396 5975049
16840E975049l76297L59114J12463K62251P4887l7596K85361p7724J89251k91118
$$ 5975049 5598752 5957866 6070329 6332580 6407467 6369871 6655232 6577508 6766759 6475641
16830F475641O77484n04830N04570L39880M7725J97182J76085J98237j94690L62059
$$ 6475641 7153125 6648295 7152865 7492745 7540470 7737652 7913737 8111974 7917284 8279343
16820H279343K59941k5975K66929Q8330J32429M09427j60923o5028P81629j23820
$$ 8279343 8539284 8513309 8780238 8868568 9000997 9410424 9249501 9184473 9966102 9842282
16810I842282L09703K30643k52944O58501J08457K64605M92340k48927N03064
$$ 9842282 10151985 10382628 10129684 10788185 10896642 11161247 11653587 11404660 11907724
16801A1907724M07301o206N47310O15896j30433L41200L49871K80812K34139O35984
$$ 11907724 12315025 12308819 12856129 13472025 13341592 13682792 14032663 14313475 14547614 15183598
16791A5183598K33594J75880Q48841O4957N93154J29815O46736L71910L90395
$$ 15183598 15417192 15593072 16441913 16506870 17100024 17229839 17876575 18248485 18638880
16782A8638880M82087O60569M72682R44520J34208Q99246K77489J024935L89393
$$ 18638880 19120967 19781536 20254218 21198738 21332946 22232192 22509681 23534616 23924009
16773B3924009R54869Q18790N83871Q21668Q25548J193357Q65738P99403P32161
$$ 23924009 24878878 25697668 26281539 27103207 27928755 29122112 29987850 30787253 31519414
16764C1519414J520951R07538J399331R42906J328059J055636J601061J206809
$$ 31519414 33040365 33947903 35347234 36290140 37618199 38673835 40274896 41481705
16756D1481705J603111J649516J708820J319822K211031J915354J994127K040198
$$ 41481705 43084816 44734332 46443152 47762974 49974005 51889359 53883486 55923684
16748E5923684J960499K151155K515050K236489K199358K763784K661527K433757
$$ 55923684 57884183 60035338 62550388 64786877 66986235 69750019 72411546 74845303
16740G4845303L035104K707111L001944L338447K736764L225652L323461K930520
$$ 74845303 77880407 80587518 83589462 86927909 89664673 92890325 96213786 99144306
16732I9144306K972518L102194L246284K413813L183950K761395K374743K060160
$$ 99144306 102116824 105219018 108465302 110879115 114063065 116824460 119199203 121259363
16724A21259363J939051J463281J521277R73710P15180L30340J21966m56935n71644
$$ 121259363 123198414 124661695 126182972 127156682 127871862 128202202 128324168 127867233 127295589
16715A27295589j556800j641954j569313j917572k429728k549297k386260k836023
$$ 127295589 125738789 124096835 122527522 120609950 118180222 115630925 113244665 110408642
16707A10408642l275710l181546k881828l232193l348867k742480l447769k742630
$$ 110408642 107132932 103951386 101069558 97837365 94488498 91746018 88298249 85555619
16699H5555619l615573k755081l099198k972415k850884k410806k330893k738589
$$ 85555619 81940046 79184965 76085767 73113352 70262468 67851662 65520769 62782180
16691F2782180k432952k303869k262138k115265j719232k036845k135149j605224
$$ 62782180 60349228 58045359 55783221 53667956 51948724 49911879 47776730 46171506
16683D6171506j657242j657776j531447j278841j986617j055886r12267j440563
$$ 46171506 44514264 42856488 41325041 40046200 38059583 37003697 36091430 34650867
16675C4650867j324425j195007p84824j206684r85971q45878j002265j024308
$$ 34650867 33326442 32131435 31346611 30139927 29153956 28308078 27305813 26281505
16667B6281505p23461m45540j422685l66542k87015j165879l70369o12684q43909
$$ 26281505 25558044 25112504 23689819 23323277 23036262 21870383 21500014 20887330 20043421
16658B0043421l47230m70310q94490j74712l71572k27338n30060q01485l75934
$$ 20043421 19696191 19225881 18331391 18156679 17785107 17557769 17027709 16226224 15850290
16649A5850290o94792l00752m64583J30370l09901o71771k44869p87359p8548
$$ 15850290 15155498 14854746 14390163 14520533 14210632 13538861 13293992 12506633 12428085
16640A2428085o0061l59045l36933j61980m536n16932k28471o06390J0775j99272
$$ 12428085 12368024 12008979 11672046 11510066 11505530 10988598 10760127 10153737 10164512 9965240
16630I965240l59264j0405k53361k72403j48146m13750L63994l76549m7207j55513
$$ 9965240 9605976 9595571 9342210 9069807 8921661 8507911 8871905 8495356 8448149 8292636
16620H292636n20010J9835m45200J77506j56360J70884k26469n59984j04645M3409
$$ 8292636 7772626 7792461 7347261 7524767 7368407 7539291 7312822 6752838 6648193 6691602
16610F691602p6797l72206o345N7969j6357l35139L49951n15355j26015l8961
$$ 6691602 6614805 6242599 6236254 6294223 6277866 5942727 6292678 5777323 5651308 5612347
16600E612347j73512J42797k84875J79213k21206J30640l43685q4059Q1767P7739
$$ 5612347 5438835 5581632 5296757 5475970 5254764 5385404 5041719 4957660 5039427 5117166
16590E117166l36713j09372j51378j42948K62821k98770J64182l03091j81760
$$ 5117166 4780453 4671081 4519703 4376755 4639576 4340806 4504988 4201897 4020137
16581D020137N21029n53441k1859r6315L8176m8612M2046j5451k59592j9085J25639
$$ 4020137 4541166 3987725 3965866 3869551 3907727 3859115 3901161 3885710 3626118 3607033 3732672
16570C732672j62688j90327K61930k70634N1982P4476n26581K73958O3776j40024
$$ 3732672 3569984 3379657 3641587 3370953 3422935 3497411 2970830 3244788 3308564 3168540
16560C168540J21862k04243k69650J93017P327j60955o5832L0725J35171j62363
$$ 3168540 3290402 3086159 2816509 3009526 3016853 2855898 2790066 2820791 2955962 2793599
16550B793599L4607j29401P575j69626K14903o6130k28921L8931L793r1905N0402
$$ 2793599 2828206 2698805 2706380 2536754 2751657 2685527 2456606 2495537 2499330 2407425 2457827
16539B457827N3924P5533M2143N7780m89147R0811J15834k89121L18945l73585
$$ 2457827 2511751 2587284 2629427 2687207 2198060 2288871 2404705 2115584 2434529 2060944
16529B060944K21453k80816J86630j1316l74520L94874j93372m3904N3344j00483
$$ 2060944 2282397 2001581 2188211 2176895 1802375 2197249 2003877 1959973 2013317 1912834
16519A912834j98141K33614l7774j00765J5410J71052l5516M2137o02289J48757
$$ 1912834 1714693 1948307 1910533 1809768 1825178 1996230 1960714 2002851 1400562 1549319
16509A549319J74764R624R889J49224k38170l0971r9282J69573k3424l24275K45436
$$ 1549319 1724083 1733707 1743596 1892820 1654650 1623679 1524397 1693970 1670546 1346271 1591707
16498A591707k82519L03637k15685J8489m8304O1150M8581j22931L28317l84438
$$ 1591707 1309188 1612825 1397140 1415629 1367325 1428475 1477056 1354125 1682442 1298004
16488A298004K3607K50275k3018o1123l24270K99466m63438J08513Q2654J29998
$$ 1298004 1321611 1571886 1548868 1487745 1163475 1462941 999503 1108016 1190670 1320668
16478A320668o7578M04740l64259j24498j76983M62170r5167j45811j23124L0428
$$ 1320668 1253090 1657830 1293571 1169073 992090 1454260 1359093 1213282 1090158 1120586
16468A120586O9011k75684M30943K83887l50517o5043J1836K4821l30033K21441
$$ 1120586 1189597 913913 1344856 1628743 1278226 1213183 1225019 1249840 919807 1141248
16458A141248r3165J30907m09034L38826N8598j24641p0833M5639J61114k66940
$$ 1141248 1048083 1178990 769956 1108782 1167380 1042739 971906 1017545 1178659 911719
16448I11719L97083n18791K37042l496k54398M75866l94919L11415j72169l3589
$$ 911719 1308802 790011 1027053 1023557 769159 1245025 850106 1161521 989352 955763
16438I55763l84805M87717l03615J56758k25844J08819R9173n1661k70828Q8237
$$ 955763 570958 1058675 755060 911818 685974 794793 893966 842305 571477 659714
16428F59714J11153K22213k40182R7426Q9496m2676l91792J41584o8113K41211
$$ 659714 770867 993080 752898 850324 939820 897144 505352 646936 578823 820034
16418H20034j80687K64212j30206j29177K85265l05782K33144j79757K5571K42347
$$ 820034 639347 903559 773353 644176 929441 623659 856803 677046 702617 944964
16408I44964q7036l21642J87552j82816K73601O2788j29376J06130j97507J59711
$$ 944964 857928 536286 723838 541022 814623 877411 748035 854165 656658 816369
16398H16369j67815O6981k47217K08892J54886r1512C00899J89740J08150k2307
$$ 816369 648554 715535 468318 677210 832096 740584 300899 490639 598789 576482
16388E76482J33265r7481o4978r5564K0728L46212C69632K53668j8929P1350k0957
$$ 576482 709747 612266 547288 451724 472452 818664 369632 623300 604371 675721 654764
16377F54764k23927K18253k8218r6303J09575k12232j89468M87888l06687L63789
$$ 654764 430837 649090 620872 524569 634144 421912 232444 720332 413645 777434
16367G77434j63242j235B94249J76764L00491j73011j00937A98521K33833J06894
$$ 777434 614192 612957 294249 471013 771504 598493 497556 198521 432354 539248
16357E39248J06280A97796N5805J90850J18843k0304A77918K42614J30329j00777
$$ 539248 645528 197796 253601 444451 563294 542990 177918 420532 550861 450084
16347D50084J46432k93219K06852M2308J80692l19148k0105J09353k21222P9325
$$ 450084 596516 303297 510149 552457 733149 414001 393896 503249 282027 361352
16337C61352j01814J91072P6276k60853Q8717q3455j29715L43540m5974k8416
$$ 361352 259538 450610 526886 266033 354750 271295 141580 485120 439146 410730
16327D10730A52845N6598K97524j84895m4927B2489M49694A72374N09193C25423
$$ 410730 152845 209443 506967 322072 277145 22489 472183 172374 681567 325423
16316C94021J23790j89978J17946j66575K712L0537H3652L71654j8387A59766
$$ 394021 517811 327833 445779 279204 281916 312453 83652 455306 436919 159766
16305E77753A21836L621Q2701M1284Q7175J53731j12159K25143j11877K76880
$$ 577753 121836 125457 208158 249442 336617 490348 378189 603332 491455 768335
16295G68335k22027l6529O7362o3299J55200B40780K24677r0172n9848M2015O4113
$$ 768335 546308 509779 577141 513842 669042 240780 465457 375285 315437 357452 421565
16284D21565j27334J57644j19755J75311p188H2305J81350G0170K9090P1345R1668
$$ 421565 294231 451875 332120 507431 500243 82305 263655 70170 99260 170605 262273
16273B62273K7282M7048L87565B25895n5328o2361K39810K5649j67869J57893
$$ 262273 289555 336603 724168 225895 170567 108206 348016 373665 205796 363689
16263C63689L8956I6730C9217N4093M17061g7964C58354j63292M42376k87634
$$ 363689 402645 96730 39217 93310 510371 -77964 358354 195062 637438 349804
16253C49804j50361C5414K63929N6873K2515j82228M51014B28212L3653O1085
$$ 349804 199443 35414 299343 356216 378731 196503 647517 228212 261865 322950
16243C22950J38383F5865N31020j23911I5845L09881A89691J53725F0759L2838
$$ 322950 461333 65865 596885 472974 95845 405726 189691 343416 60759 93597
16233I3597L24339n5257J64298H0849J9014j0219J83473m7945J81310r5594J56028
$$ 93597 417936 362679 526977 80849 99863 89644 273117 225172 406482 310888 466916
16222D66916j95381m5455r4080Q7958l3469j5623o6076J91162a43161E01546A88753
$$ 466916 271535 226080 132000 219958 186489 170866 104790 295952 -143161 501546 188753
16210A31437J34069b17698C53830j62627J5619L2182d4826A77504R3402j31814
$$ 131437 265506 -217698 353830 191203 206822 239004 -44826 177504 270906 139092
16200A39092J93174p4993G3091b21984B53132D7842J75626b705q7759A58603N2699
$$ 139092 332266 257273 73091 -221984 253132 47842 223468 -2705 -90464 158603 211302
16189B11302b17218C38454A52584J34678a31343d7503A17025c8861B24132J27819
$$ 211302 -217218 338454 152584 287262 -131343 -47503 117025 -38861 224132 351951
16179C51951B5114e345E7519K30804l6480A18203J96666E5939M01558j9454i5009
$$ 351951 25114 -5345 57519 288323 251843 118203 314869 55939 457497 438043 -95009
16167H5899L04659a16899A49697O8827E9469f7684A12861J65681j09479R0469
$$ 85899 390558 -116899 149697 218524 59469 -67684 112861 278542 169063 259532
16157B59532D0028J27004E4322J92188B3980J54031b52720E1623f2725D78709
$$ 259532 40028 167032 54322 246510 23980 178011 -252720 51623 -62725 478709
16146A40836J04193i76l1537D02748j68566a14663q2165e7704B20755B1224f0312
$$ 140836 245029 -976 -32513 402748 234182 -114663 -196828 -57704 220755 21224 -60312
16134B77389j16985a05879A44449J2706a76575D24603g8685G4022b5670A71547
$$ 277389 160404 -105879 144449 157155 -176575 424603 -78685 74022 -25670 171547
16123d3802b30A72768q2253a74045k8262A4439O8514j7988a35535A94344A2757
$$ -43802 -230 172768 90515 -174045 -202307 14439 82953 64965 -135535 194344 12757
16111C73937a32888O1367k2643A82502L9386q3960A9569M3662b06344B59714H5112
$$ 373937 -132888 -71521 -94164 182502 221888 137928 19569 63231 -206344 259714 85112
16099f4880C08614J13260g8991C26623H3423K92849P4121B12562r1759J53062
$$ -64880 308614 421874 -78991 326623 83423 376272 450393 212562 120803 273865
16089B73865A14836c2122j42818B06526J15100j24572a69900B81312j01338c0413
$$ 273865 114836 -32122 -174940 206526 321626 197054 -169900 281312 179974 -30413
16078c30509c749B91305b42422C22494e715j04986L5540Q914G8482b53773A687
$$ -330509 -3749 291305 -242422 322494 -5715 -110701 -75161 -66247 78482 -253773 1687
16066A12984p101D2157d0184G7636J44404F0774A2616K1653N3429B1544J38052
$$ 112984 105883 42157 -40184 77636 222040 60774 12616 34269 87698 21544 159596
16055A59596P8684J85735E6645L1035D0454c84574J16824B18108p4025i3877b1957
$$ 159596 238280 424015 56645 87680 40454 -384574 -267750 218108 144083 -93877 -21957
16043g2572o201k23736l2382E1594J85445a52927a8912A63119K3708H5415K89701
$$ -72572 -78773 -302509 -334891 51594 237039 -152927 -18912 163119 186827 85415 375116
16032C75116A55797b54629G9201j773c14076A0930c28237B4878i7972A9327b4150
$$ 375116 155797 -254629 79201 77428 -314076 10930 -328237 24878 -97972 19327 -24150
16020A94164R906A4331a24330q9080B46687a82223f9242A29282c03451h9169b9101
$$ 194164 204070 14331 -124330 -213410 246687 -182223 -69242 129282 -303451 -89169 -29101
16008B62970a91629B19358L0944C5801j078i450l6510a6844o6870L1308A88571
$$ 262970 -191629 219358 250302 35801 34723 -9450 -45960 -16844 -83714 -52406 188571
15996B55906D43M0040K51570G7714L60937A08847J8685L2958J50444J76775K85035
$$ 255906 443 40483 292053 77714 438651 108847 127532 160490 310934 487709 772744
15985G72744J87696K87796m31097k1951n3801j08601k61437D9897c5375A11243
$$ 772744 960440 1248236 817139 795188 741387 632786 371349 49897 -35375 111243
15974b30423A48527f9280j9405B37348n8865m1294a94157b5378j36495A02869
$$ -230423 148527 -69280 -88685 237348 178483 137189 -194157 -25378 -161873 102869
15963A72664n3157a57535c9879q6989B88424c1028j02582b0127B31247j05520
$$ 172664 119507 -157535 -39879 -126868 288424 -31028 -133610 -20127 231247 125727
15953A25727J35542e6717J2019K1449B09250D8223a90996N1536k05889D3448a69157
$$ 125727 261269 -56717 -44698 -23249 209250 48223 -190996 -139460 -345349 43448 -169157
15941A54885c28381f467B26747d654I9781K143O3173b06063A22544a39169A13774
$$ 154885 -328381 -6467 226747 -4654 99781 101924 165097 -206063 122544 -139169 113774
15929c21433b9241k17692E4020I254J85822E1661K24452H8380b28741R0369F039
$$ -321433 -29241 -246933 54020 9254 195076 51661 276113 88380 -228741 -138372 6039
15917I2967d7666J5435o0398A3531J09337g6994A90145a15501l8162O1239a9087
$$ 92967 -47666 -32231 -92629 13531 122868 -76994 190145 -115501 -153663 -92424 -19087
15905a69171n2800a0254A25135M4871l4859l8404L61367b05903B03116O5290b53661
$$ -169171 -221971 -10254 125135 170006 135147 96743 458110 -205903 203116 268406 -253661
15893A5370J95924f2642I7852b00733M8263K9720H0728a63007A44064a30431j54863
$$ 15370 211294 -62642 97852 -200733 -152470 -122750 80728 -163007 144064 -130431 -285294
15882b85294k1360e4093b1084A18311c8783j81250I4847a54715I0673i7630j76087
$$ -285294 -306654 -54093 -21084 118311 -38783 -220033 94847 -154715 90673 -97630 -273717
15871b73717B9791c73058h3670A03023A1189J91232b50118I5477B9613J39276
$$ -273717 29791 -373058 -83670 103023 11189 202421 -250118 95477 29613 168889
15861A68889b9855A03012b83079Q3214Q3363b628D9600R5292l5205B1592e4217
$$ 168889 -29855 103012 -283079 -199865 -116502 -2628 49600 144892 109687 21592 -54217
15849b16711A19161K06146c00389f3392p5911O5609l66731B776J45786a56981
$$ -216711 119161 325307 -300389 -63392 -139303 -73694 -440425 2776 148562 -156981
15838b2146B72772a20225j0623A16088b03117f511k08979D0417O7411b00081c8962
$$ -22146 272772 -120225 -130848 116088 -203117 -6511 -215490 40417 107828 -200081 -38962
15826A13154a82246l04985a25399R945B66924a03261B15263I2356b29114A24595
$$ 113154 -182246 -487231 -125399 -115454 266924 -103261 215263 92356 -229114 124595
15815C85056e3403j14995K2030L0982n7088N5360M9591A58872J15697c5491B62614
$$ 385056 -53403 -168398 -146368 -115386 -172474 -117114 -67523 158872 274569 -35491 262614
15803b17723A06921c71650a6554j32212A99841b7274D01349A80246a97315j47035
$$ -217723 106921 -371650 -16554 -148766 199841 -27274 401349 180246 -197315 -344350
15793c44350C35929a42285A45679k6343a50735B68902a85119k548C7714R6395
$$ -344350 335929 -142285 145679 119336 -150735 268902 -185119 -187667 37714 134109
15783A34109b51829A15761e3012C06319i4713g251r4589K8082A35952d0361A74092
$$ 134109 -251829 115761 -53012 306319 -94713 -7251 -101840 -73758 135952 -40361 174092
15771a21567C9597b53943k09873f0915p9401j471O4693A88720B9831Q7334D2891
$$ -121567 39597 -253943 -463816 -60915 -140316 -141787 -77094 188720 29831 117165 42891
15759G9912J41224B3953L5667b13055E7031b70087a02435B80163C6702J58868
$$ 79912 221136 23953 59620 -213055 57031 -270087 -102435 280163 36702 195570
15749A95570e0707F46345B52933b57761A34384J105A4525K15091b54612J18999
$$ 195570 -50707 646345 252933 -257761 134384 135489 14525 229616 -254612 -135613
15739a35613c3578B49791g7371B36083F8216Q4809g799j1417C908a94233A54514
$$ -135613 -33578 249791 -77371 236083 68216 153025 -7799 -19216 3908 -194233 154514
15727A49515C1232c37859I9734g7099B38170q5693b61970B2636c36716E229M4369
$$ 149515 31232 -337859 99734 -77099 238170 152477 -261970 22636 -336716 5229 49598
15716D9598a11187p1652J6508A44934G568a59982a5195A58423A6072b82656c6105
$$ 49598 -111187 -182839 -166331 144934 7568 -159982 -15195 158423 16072 -282656 -36105
15704a09917j65387K3012M7472h3448j87991d9565m5681f797G348a9239j68569
$$ -109917 -275304 -252292 -204820 -83448 -271439 -49565 -95246 -6797 7348 -19239 -187808
15693a87808B4403K47030a15660B25366D0045K77284a47452N0631r7235p3433
$$ -187808 24403 271433 -115660 225366 40045 317329 -147452 -96821 -194056 -267489
15683b67489G8326e0259j27639C20619n7759p9356e25450a19256k19675O9517
$$ -267489 78326 -50259 -177898 320619 262860 183504 -525450 -119256 -338931 -269414
15673b69414J04129j3854A18352b54490J16961A22950i780B57822q2650A0937
$$ -269414 -165285 -179139 118352 -254490 -137529 122950 -9780 257822 175172 10937
15662F906a63812B6560i5046A19020J6202a21235e7064D8720i1835q634B2017
$$ 6906 -163812 26560 -95046 119020 135222 -121235 -57064 48720 -91835 -100469 22017
15650h3770E2634j5715d0698e744j33542B29940a15203e2955l4061b7872k29954
$$ -83770 52634 36919 -40698 -5744 -139286 229940 -115203 -52955 -87016 -27872 -257826
15639b57826i5065o8979j18649A77340b04174O0312r8372C3783e693A74770b86355
$$ -257826 -95065 -164044 -282693 177340 -204174 -143862 -242234 33783 -5693 174770 -286355
15627a12254j17785B07500J49612a22000L9651B3653K27628b46688i4179o3535
$$ -112254 -230039 207500 357112 -122000 -82349 23653 251281 -246688 -94179 -157714
15617a57714c6190A42373J60367b17048J03091j8613C64546j02682J27675b90712
$$ -157714 -36190 142373 302740 -217048 -113957 -132570 364546 261864 389539 -290712
15606B02044b9387n9957D4135J06716f28B9657a66467C09436c13985J52986i093
$$ 202044 -29387 -89344 44135 150851 -628 29657 -166467 309436 -313985 -160999 -9093
15594H0965C5263a73687j59592a50450r4841G2326C1931d18389A37868J6076L80428
$$ 80965 35263 -173687 -333279 -150450 -245291 72326 31931 -418389 137868 153944 534372
15583E34372a71202A11542h764A25031K80313c10913A3983h9843B6742b05659
$$ 534372 -171202 111542 -8764 125031 405344 -310913 13983 -89843 26742 -205659
15572B74750f9857P502j95935Q9918C331i1164p9034d5244j06693B39473f6881
$$ 274750 -69857 -62355 -258290 -168372 3331 -91164 -170198 -45244 -151937 239473 -66881
15560B05413C6170e1244k50192a05779H0419J70280d7307n450A27804b19056f2788
$$ 205413 36170 -51244 -301436 -105779 80419 250699 -47307 -52757 127804 -219056 -62788
15548b74736a24006G118b5195m8922a7605k90524A48431g6481I3687J16254c1848
$$ -274736 -124006 7118 -25195 -74117 -17605 -308129 148431 -76481 93687 209941 -31848
15536B80459g5146E5290M6221a31294j16683Q5328I8685m5756E395b78120c7570
$$ 280459 -75146 55290 101511 -131294 -247977 -162649 98685 52929 5395 -278120 -37570
15524h5637H8223a85434D1020L25732A10577f6729j38634h2014j5450b9103A09328
$$ -85637 88223 -185434 41020 366752 110577 -66729 -205363 -82014 -97464 -29103 109328
15512C1392p595L35805j53564J0350j3225c566A96337f1618I4706L5922E5544
$$ 31392 23797 359602 206038 216388 203163 -3566 196337 -61618 94706 130628 55544
15500A47324K38153A58209b0300B34313q3228E6821K50261j28278N3907e5428
$$ 147324 385477 158209 -20300 234313 151085 56821 307082 178804 232711 -55428
15489C05515M8653J07j29975f9519A88015K73895j97209q4504d3699A75918K7659
$$ 305515 354168 354275 224300 -69519 188015 461910 264701 180197 -43699 175918 203577
15478B03577M5312j15343N2063K11506j32542M84049o2984J28990C56386l0780
$$ 203577 248889 133546 185609 397115 264573 748622 685638 814628 356386 325606
15468C25606n5603A17972f4010F9850L13616J8923A50030D3040K8806a13681L0943
$$ 325606 270003 117972 -64010 69850 383466 402389 150030 43040 71846 -113681 -82738
15457h2738B50494h1909B31435D8511b44485G4362J96336A3496a75836B44038
$$ -82738 250494 -81909 231435 48511 -244485 74362 270698 13496 -175836 244038
15446a6151j30458b9670R652C06505J72712M127N98405L41670k54375C11588O042
$$ -16151 -146609 -29670 -20018 306505 479217 483344 1081749 1423419 1169044 311588 317630
15435C17630c8050C11017b9375A70500C7302L9062N5656j4591m8787J29121p0530
$$ 317630 -38050 311017 -29375 170500 37302 76364 132020 117429 68642 197763 127233
15424A27233K52433a10867D47207j73999q9045D5498J00823O9013J50922c989
$$ 127233 379666 -110867 447207 273208 184163 45498 146321 215334 366256 -3989
15413A47809b63998c8630B72962G979a51921b1819C20773a11531n4250P1058h622
$$ 147809 -263998 -38630 272962 7979 -151921 -21819 320773 -111531 -165781 -94723 -8622
15401A69832b14277B21639f1916D0530b31155G0463g0963k3113A8649b06200A52593
$$ 169832 -214277 221639 -61916 40530 -231155 70463 -70963 -94076 18649 -206200 152593
15389B4563h3039C44590g6365F3348b11540C78672B66J4979a21086d7761A17620
$$ 24563 -83039 344590 -76365 63348 -211540 378672 266 15245 -121086 -47761 117620
15377A56970K61791j83556E4953J79634j10700J60208f3408F6270J21204j3547
$$ 156970 418761 235205 54953 234587 123887 284095 -63408 66270 187474 173927
15367A73927q5374c02491B35040G906J21565c0993A26763B2323K93345a94331
$$ 173927 88553 -302491 235040 7906 129471 -30993 126763 22323 315668 -194331
15356h5298H6165d3562A97538C5427P9969K86897A03680D1876c47051D15942G5980
$$ -85298 86165 -43562 197538 35427 115396 402293 103680 41876 -347051 415942 75980
15344A2933a42987C5541K39890d4532D14774j3798j20861j25664a0647B15369
$$ 12933 -142987 35541 275431 -44532 414774 400976 280115 154451 -10647 215369
15333B0405K40674a36897D31650r4986a2176C07418j16716K28456j04154q5315
$$ 20405 261079 -136897 431650 336664 -12176 307418 190702 419158 315004 229689
15323B29689b7317F8849c0809I7130g612C81643g9510A70399k2080D4936N8729
$$ 229689 -27317 68849 -30809 97130 -7612 381643 -79510 170399 148319 44936 103665
15312A03665P267N2133L85508A9267K96971K20048d1536B84484F1415l990K83651
$$ 103665 110932 163065 548573 19267 316238 536286 -41536 284484 61415 57425 341076
15301C41076h1900A36553K3209D5951e2677H4131a03981h799A3995K01389H8242
$$ 341076 -81900 136553 159762 45951 -52677 84131 -103981 -8799 13995 215384 88242
15289H3120J95563a55167e9727k7097f189k1948A08669Q0158a09172C952M3628
$$ 83120 278683 -155167 -59727 -86824 -6189 -28137 108669 188827 -109172 3952 47580
15278D7580L8328K00493A38759A7784J53330a56456B40390c7723j42899B9515
$$ 47580 85908 286401 138759 17784 171114 -156456 240390 -37723 -180622 29515
15267b40385b6753F2112O8423E4210J18312L07399A6177J03328D4897j4684K2351
$$ -240385 -26753 62112 130535 54210 172522 479921 16177 119505 44897 30213 52564
15256E2564b64660B45779e3216A18068b73976E5260i1934J1466E2464b6423C6428
$$ 52564 -264660 245779 -53216 118068 -273976 55260 -91934 -80468 52464 -26423 36428
15244C07068Q2764L01346J004260l38301O5753M58552F58079J8755B09848m4509
$$ 307068 389832 691178 1695438 1357137 1422890 1881442 658079 676834 209848 165339
15234A65339E8758d8013A48244i4013k4822A56370c372q2878B7695J19312n3217
$$ 165339 58758 -48013 148244 -94013 -118835 156370 -3372 -86250 27695 147007 93790
15223I3790c8317A66293A5118R3233J13450G5259K56702b85043D56435i4338E5240
$$ 93790 -38317 166293 15118 108351 221801 75259 331961 -285043 456435 -94338 55240
15211A76793P2023a36791A04563f7974B4101P9473K09609l8046a66542A96452
$$ 176793 248816 -136791 104563 -67974 24101 103574 313183 275137 -166542 196452
15200e21602I9963g7640j13440j01311B07599A1373J48266b70727c8986I9292
$$ -521602 99963 -77640 -191080 -292391 207599 11373 159639 -270727 -38986 99292
15189B14264m9084a41228N5760D7549J49679q7063l7099J81423m3263C0786d7366
$$ 214264 165180 -141228 -85468 47549 197228 110165 73066 254489 211226 30786 -47366
15177a54971A77791O6968c50371A35016N9148n2130J30747A6712J32330a4112
$$ -154971 177791 244759 -350371 135016 194164 142034 272781 16712 149042 -14112
15166g3328j42807A27325J51233r3638F0160e5628B71698c5511B00389m6224D0494
$$ -73328 -216135 127325 278558 184920 60160 -55628 271698 -35511 200389 154165 40494
15154a80477B02798D6100h943A30163a68255D02998d50441B22578p3120J18780
$$ -180477 202798 46100 -8943 130163 -168255 402998 -450441 222578 149458 268238
15144B68238D3398J67472a52469b5672A21831a35596G2332K30379A14919a52613
$$ 268238 43398 210870 -152469 -25672 121831 -135596 72332 302711 114919 -152613
15133C34738r7860A14489M2987N4473n796n9818c58756A29433k9680i982B4561
$$ 334738 236878 114489 157476 211949 206153 146335 -358756 129433 99753 -9982 24561
15121B49576J94081O944j80340L85710B35561C2013b9250A43838a45579A60968
$$ 249576 443657 450601 270261 655971 235561 32013 -29250 143838 -145579 160968
15110A50726B3029L29248b16608C7485J72348a60245k985A08047B5332L69375
$$ 150726 23029 352277 -216608 37485 209833 -160245 -163230 108047 25332 394707
15100C94707q2674j31226L82517A72849E8435K93810j20885b79068g7800B53487
$$ 394707 312033 180807 563324 172849 58435 352245 231360 -279068 -77800 253487
15089B59666F1956a6664G0334J22061J9734J60623A49202J4868O9518a06178j5477
$$ 259666 61956 -16664 70334 192395 212129 372752 149202 164070 233588 -106178 -121655
15078a21655B91263C877K54008J03353E4321K59084J90249A96070m4569a35733
$$ -121655 291263 3877 257885 361238 54321 313405 503654 196070 151501 -135733
15067B03283C9806J19393J77338a37470A82554N5297C4324M37085j73666J13694
$$ 203283 39806 159199 336537 -137470 182554 237851 34324 471409 297743 411437
15057D11437A75200L81412k32535m3249l4416L04284j40278j38622n4591J00506
$$ 411437 175200 556612 324077 280828 246412 550696 410418 271796 217205 317711
15047C17711N619J76798j53025A68431E7168L26129j66286J80155J16644B29234
$$ 317711 323330 500128 347103 168431 57168 383297 217011 397166 513810 229234
15036C71699m1708L8555k9108J46219j47987l1232N75P28948k28921k04791K19531
$$ 371699 329991 368546 339438 485657 337670 306438 307013 1035961 807040 602249 821780
15025H21780k2726l4392C07145Q4100J13516m8242N5909J38054j84434k1269k14870
$$ 821780 799054 764662 307145 391245 504761 456519 512428 650482 466048 444779 229909
15014B29909M54075k66600j44431m0120K83496J06011A07366K76600J73257k12127
$$ 229909 683984 417384 272953 232833 516329 622340 107366 383966 557223 345096
15004C45096F54L33315j3419K16694K42323k50909j11621n0638L77379B33108
$$ 345096 654 333969 320550 537244 779567 528658 417037 366399 743778 233108
14993C30929m0174r4916J90375L1248m3152j35828N10532l66847J24848j56427
$$ 330929 290755 195839 386214 417462 374310 238482 749014 382167 507015 350588
14983C50588L37636J18968k38742R0080Q1466J11899l58498Q6552n4425m7840
$$ 350588 688224 807192 568450 658530 739996 851895 493397 579949 525524 477684
14973D77684j89618K12736r3284M95386K6133j48025k62284C0002L89196j83200
$$ 477684 288066 500802 407518 902904 929037 781012 518728 30002 419198 235998
14963B35998J06276A44221j2099A1482M59066M00741A38066L22230A47952L18495
$$ 235998 342274 144221 132122 11482 470548 871289 138066 460296 147952 466447
14953D66447J42730B71599E0668J81545K60895B35359r187A12513P1854N00798
$$ 466447 609177 271599 50668 232213 493108 235359 226172 112513 184367 685165
14943F85165k60953M20482p7812l62142J8622H5660M72985n6204J74489j62717
$$ 685165 424212 844694 766882 404740 423362 85660 558645 502441 676930 514213
14933E14213j62202M5208n2643K6070L43313K92953L20841J62918J89013L04361
$$ 514213 352011 397219 344576 370646 713959 1006912 1327753 1490671 1679684 1984045
14923A984045l13136p3570k18288k32123J25317L78624L30608J17675K52410j95064
$$ 1984045 1670909 1597339 1379051 1146928 1272245 1650869 1981477 2099152 2351562 2156498
14913B156498l12780k16542n04405p2129L1500D39658n0950K8779J05933O1266
$$ 2156498 1843718 1627176 1122771 1050642 1082142 439658 388708 417487 523420 584686
14903E84686m5783o5160j62310m9963M48377F7742O72858k5972j81355r3419N5179
$$ 584686 538903 473743 311433 261470 709847 67742 740600 714628 533273 439854 495033
14892D95033J73492q4248N694Q234m3502m0681Q1451J21176k8607L53622j15374
$$ 495033 668525 584277 589971 598205 554703 514022 595473 716649 688042 1041664 926290
14881I26290N7823j61965j85947J77640K90928m55958o6498j54107p0404J37162
$$ 926290 984113 822148 636201 813841 1104769 648811 582313 428206 357802 494964
14871D94964j40464K4093o5614L75647j02565J33439j47247L38300J28107m07519
$$ 494964 354500 378593 312979 688626 586061 719500 572253 910553 1038660 631141
14861F31141k78992j65214M20812j41309k717A25206L40665N8830J94287k02214
$$ 631141 352149 186935 607747 466438 463721 125206 465871 524701 718988 516774
14851E16774q4721N9002L14040l33091j57202L27313J09595r8844L52852R7632
$$ 516774 432053 491055 805095 472004 314802 642115 751710 652866 1005718 1103350
14841A103350j14726J12197L37141l71805l19689N20279k31400k84652j28543
$$ 1103350 988624 1100821 1437962 1066157 746468 1266747 1035347 750695 622152
14832F22152j09496P6881j75602N6538J44979Q2284o3599B13943R9972M27131
$$ 622152 512656 589537 413935 470473 615452 697736 634137 213943 313915 741046
14822G41046j01492j57120O95817m15177P6168k8924r6208j46401m9362L28541
$$ 741046 639554 482434 1178251 763074 839242 810318 714110 567709 518347 846888
14812H46888j48813M8353j19012J98339J28195o7490j96539O4954R2749M98551
$$ 846888 698075 746428 627416 825755 953950 886460 689921 754875 847624 1346175
14802A346175l09572P0139l89055j69312A68517O04945l55992L10516m9021j05455
$$ 1346175 1036603 1106742 717687 548375 168517 773462 417470 727986 678965 573510
14792E73510B57936K11269K7488J77336j91722P7904J55164j50304O2942k38668
$$ 573510 257936 469205 496693 674029 482307 560211 715375 565071 628013 389345
14782C89345J56060r004L16723M626J01752j83467J07903m1964K39571k40314
$$ 389345 545405 536401 853124 857750 959502 776035 883938 841974 1081545 841231
14772H41231M5434k61687L37383L80045B19004J97618M2787J01750P4548q2104
$$ 841231 886665 624978 962361 1342406 219004 416622 459409 561159 635707 553603
14762E53603K70678l18858j04956K85843J07569j36094B92558O08219j00134J01090
$$ 553603 824281 505423 400467 686310 793879 657785 292558 900777 800643 901733
14752I01733j52927j25833j2191J46154O7803o2962J09827j98806L62914m23161
$$ 901733 748806 622973 610782 756936 824739 761777 871604 672798 1035712 612551
14742F12551J0717p5162K47431k16671Q7576K23489l6641K796j34002M80910E21196
$$ 612551 623268 548106 795537 578866 666442 889931 853290 856086 722084 1202994 521196
14730I72144j51939K37069N61932M7174j15292J56049J51848n16659n6214m58381
$$ 972144 820205 1057274 1619206 1666380 1551088 1707137 1858985 1342326 1286112 827731
14720H27731J93831M7982j36681O8581l47283M12235l52666Q891M8179K28121
$$ 827731 1021562 1069544 932863 1001444 654161 1066396 713730 722621 770800 998921
14710I98921k03323K00309p4464m0967j22095L25782J21487J80519o5645M91190
$$ 998921 795598 995907 921443 880476 758381 1084163 1205650 1386169 1320524 1811714
14700A811714J99933K37151m87011k35477k85986j62733l273Q4757M5003j39541
$$ 1811714 2011647 2248798 1761787 1526310 1240324 1077591 1074318 1159075 1204078 1064537
14690A064537P3371K6430k09921m45365M62310k56218M33817o2639J72180k84973
$$ 1064537 1137908 1164338 954417 509052 971362 715144 1148961 1086322 1258502 973529
14680I73529J31012l32521K55062k80896K59472L2895o4604j16587M9630J19675
$$ 973529 1104541 772020 1027082 746186 1005658 1038553 973949 857362 906992 1026667
14670A026667l06542p0160K58331L22518k4210l57850L09855k62057J22244j19968
$$ 1026667 720125 649965 908296 1230814 1206604 848754 1158609 896552 1018796 898828
14660H98828K43751l52456L62617Q0381j71120m6381K69405k96764L32796j95812
$$ 898828 1142579 790123 1152740 1233121 1062001 1015620 1285025 988261 1321057 1125245
14650A125245K65269J2101R1735n30866M9092L22479P5967j95092l76566M06564
$$ 1125245 1390514 1402615 1494350 963484 1012576 1335055 1411022 1215930 839364 1245928
14640A245928p8549q7822P52458n08777k94684K70301L9168j47211J51092k01314
$$ 1245928 1167379 1079557 1832015 1323238 1028554 1298855 1338023 1190812 1341904 1140590
14630A140590J14163J27710j18401P906K45708j65398j00969J06236j3112j66231
$$ 1140590 1254753 1382463 1264062 1271968 1517676 1352278 1251309 1357545 1344433 1178202
14620A178202L32355k11090K90528m5136K3049K0631k94375P5683m137K65628
$$ 1178202 1510557 1299467 1589995 1544859 1567908 1588539 1294164 1369847 1365710 1631338
14610A631338k2974k50712J74820R3288j27633j38482N2560K92996k60483Q7138
$$ 1631338 1608364 1357652 1532472 1625760 1498127 1359645 1412205 1705201 1444718 1531856
14600A531856k13580M04983j94296N04930m51129M7634r9993J23099J38097k1815
$$ 1531856 1318276 1723259 1528963 2033893 1582764 1630398 1530405 1653504 1791601 1769786
14590A769786j7345k10932M7822J7101q1800L57010j22624K53484j10148k13125
$$ 1769786 1752441 1541509 1589331 1606432 1524632 1881642 1759018 2012502 1902354 1689229
14580A689229K02878J05744j407k83084M30468j06410l18482J02195K42324j53058
$$ 1689229 1892107 1997851 1996444 1713360 2143828 2037418 1718936 1821131 2063455 1910397
14570A910397l8514M6381M38989J18049k37255l2759L25239l0565R4269l2733
$$ 1910397 1871883 1918264 2357253 2475302 2238047 2205288 2530527 2499962 2594231 2561498
14560B561498K80484k67872R3007N66378l69888L71469K33348K09662M89876K01951
$$ 2561498 2841982 2574110 2667117 3233495 2863607 3235076 3468424 3678086 4167962 4369913
14550D369913P06145J413523L214841Q348840J7130092J7672116B3041979I238050
$$ 4369913 5076058 6489581 9704422 18053262 35183354 52855470 23041979 9238050
14541D498685j556581j69873O81699J877754j429166j604602j64156k04293Q9319
$$ 4498685 2942104 2772231 3453930 5331684 3902518 2297916 2133760 1929467 2018786
14532B018786j83931J89019K38516m23185N15225k477K72463j14293q3520j68132
$$ 2018786 1834855 2023874 2262390 1839205 2354430 2351953 2624416 2510123 2426603 2258471
14522B258471L7305N80372l57915j18819J19771p0161k45738O68714l25822J02952
$$ 2258471 2295776 2876148 2518233 2399414 2519185 2449024 2203286 2872000 2546178 2649130
14512B649130R7868J3537j54233P4967J99321l0367k76600M20401l14911K86796
$$ 2649130 2746998 2760535 2606302 2681269 2880590 2850223 2573623 2994024 2679113 2965909
14502B965909j49988L01510K80933n67894L09715J59872M6256n651k34215J63999
$$ 2965909 2815921 3117431 3398364 2830470 3140185 3300057 3346313 3340662 3106447 3270446
14492C270446K89887O9341o7494k57904J05974K3685J35873k35142Q2940L02639
$$ 3270446 3560333 3629674 3562180 3304276 3410250 3433935 3569808 3334666 3417606 3720245
14482C720245P0467l93617L79173K2376M34521l06505K20987M5053k13698Q5039
$$ 3720245 3790712 3397095 3776268 3798644 4233165 3926660 4147647 4192700 3979002 4064041
14472D064041k94212P49608k97290K28101r3201L29762k19025K31631l09493K76344
$$ 4064041 3769829 4519437 4222147 4450248 4357047 4686809 4467784 4699415 4389922 4666266
14462D666266n2689j62203L8841N82391L7226j29017R8170m572l82507N19554
$$ 4666266 4613577 4451374 4490215 5072606 5109832 4980815 5078985 5074413 4691906 5211460
14452E211460j72677j35953N15862p4246q3422O76757k09573k51834p6855M77053
$$ 5211460 5038783 4902830 5418692 5344446 5261024 5937781 5728208 5476374 5399519 5876572
14442E876572k50347M50466j04768N17123n85504O40668k60339P7045L5502J67059
$$ 5876572 5626225 6076691 5971923 6489046 5903542 6544210 6283871 6360916 6396418 6563477
14432F563477j4531K92129J55072K26261j55514J45349J34612j46157J01896J35675
$$ 6563477 6548946 6841075 6996147 7222408 7066894 7212243 7346855 7200698 7302594 7438269
14422G438269j29776N01039L08046L75696q7531Q4862q5659K68755j89980L50314
$$ 7438269 7308493 7809532 8117578 8493274 8405743 8490605 8404946 8673701 8483721 8834035
14412H834035P4902l05509N53652k03563L18026k5923N21698K36715L68895J58403
$$ 8834035 8908937 8603428 9157080 8953517 9271543 9245620 9767318 10004033 10372928 10531331
14402A0531331j34768K16644k63906K27704N17182j99080N31749J32654j43231
$$ 10531331 10396563 10613207 10349301 10577005 11094187 10895107 11426856 11559510 11416279
14393A1416279N92061j87172J50613N8316N31604J66911M08206j12231O37809
$$ 11416279 12008340 11821168 11971781 12030097 12561701 12728612 13136818 13024587 13662396
14384A3662396M2920O6352L18698N51167l3262J018809j31780J14138L10176K14396
$$ 13662396 13705316 13771668 14090366 14641533 14608271 15627080 15495300 15609438 15919614 16134010
14374A6134010j81486P13442L52345L59735J02808Q17382P6589M81722O20103
$$ 16134010 15952524 16665966 17018311 17378046 17480854 18298236 18374825 18856547 19476650
14365A9476650L61022P19096m18413Q67282K69306L61151O81337O18795K39723
$$ 19476650 19837672 20556768 20138355 21005637 21274943 21636094 22317431 22936226 23175949
14356B3175949M30348O26257M43068P98817M52692N36363P31921J166497M95686
$$ 23175949 23606297 24232554 24675622 25474439 25927131 26463494 27195415 28361912 28857598
14347B8857598O23970N93900Q56089N22124J063866P84577R12695J165669R09322
$$ 28857598 29481568 30075468 30931557 31453681 32517547 33302124 34214819 35380488 36289810
14338C6289810Q93110O94358J414915J433095Q81803J061557J719856J011553
$$ 36289810 37182920 37877278 39292193 40725288 41607091 42668648 44388504 45400057
14330D5400057J557124J861289J002406J721180J868593J731692J887808K055912
$$ 45400057 46957181 48818470 49820876 51542056 53410649 55142341 57030149 59086061
14322E9086061J906688J953792K354105K523841K901967K166581K829410K846825
$$ 59086061 60992749 62946541 65300646 67824487 70726454 72893035 75722445 78569270
14314G8569270K971066K978339L411566L490513L913315M036629M421782M305528
$$ 78569270 81540336 84518675 87930241 91420754 95334069 99370698 103792480 108098008
14306A08098008M668208M940753N275301N838186O045184O206158O741528P071432
$$ 108098008 112766216 117706969 122982270 128820456 134865640 141071798 147813326 154884758
14298A54884758P497574Q219194Q405279Q793185R884304J0206938J0445404J1403704
$$ 154884758 162382332 170601526 179006805 187799990 197684294 207891232 218336636 229740340
14290B29740340J1904852J2271341J3022324J3734656J3707272J4542802J4682511
$$ 229740340 241645192 253916533 266938857 280673513 294380785 308923587 323606098
14283C23606098J5507666J5052410J5472986J4861749J4808359J4128885J3342377
$$ 323606098 339113764 354166174 369639160 384500909 399309268 413438153 426780530
14276D26780530J2318721J0960703R644191P671074M348005r80502k183647J258029
$$ 426780530 439099251 450059954 459704145 467375219 471723224 470742722 468559075 469817104
14268D69817104k746093m534559o366637q544996j0897752j2224176j3930318
$$ 469817104 467071011 462536452 456169815 447624819 436727067 424502891 410572573
14261D10572573j4434152j5493871j5842251j5849989j5933504j5308202j5537348
$$ 410572573 396138421 380644550 364802299 348952310 333018806 317710604 302173256
14254C02173256j4755401j3991170j3957190j3196479j2166423j1450523r929044
$$ 302173256 287417855 273426685 259469495 246273016 234106593 222656070 212727026
14247B12727026j0816674j0355408r326614q393995q210300q066080p630345o632786
$$ 212727026 201910352 191554944 182228330 173834335 165624035 157557955 149927610 143294824
14239A43294824o297364o087941n595070n684453n386451m796193m724229m393544
$$ 143294824 136997460 130909519 125314449 119629996 114243545 109447352 104723123 100329579
14231A00329579l258342m063867l633745l767008l285813l215409k819781k833112
$$ 100329579 97071237 93007370 89373625 85606617 82320804 79105395 76285614 73452502
14223G3452502k282061k883391k148675k351913j849249k413015j867714k166659
$$ 73452502 71170441 68287050 66138375 63786462 61937213 59524198 57656484 55489825
14215E5489825j847016j287988j174882j828788j512256j626911j388414j222632
$$ 55489825 53642809 52354821 51179939 49351151 47838895 46211984 44823570 43600938
14207D3600938n61620q38742j876085j149435j143723r93503p17273m17516j240199
$$ 43600938 43039318 42200576 40324491 39175056 38031333 37037830 36320557 35903041 34662842
14198C4662842r81009j383306p94664p99252n10840o00652j029112o30313p09743
$$ 34662842 33681833 32298527 31503863 30704611 30193771 29593119 28564007 27933694 27223951
14189B7223951m95630p58839l27435j230820l75562k65015n69619k84065n57988
$$ 27223951 26728321 25969482 25642047 24411227 24035665 23770650 23201031 22916966 22358978
14180B2358978k03995o01424k85859p48502l74429m72700r68387K24170p8063
$$ 22358978 22154983 21553559 21267700 20519198 20144769 19672069 18703682 18927852 18849789
14171A8849789q15527m15698j05821m05538l22948l93887j8161n85452o242k71182
$$ 18849789 18034262 17618564 17512743 17107205 16784257 16390370 16372209 15786757 15780515 15509333
14161A5509333m95540j01249o70243n8577k73039p6028m07979l29983J269k46715
$$ 15509333 15013793 14912544 14242301 14183724 13910685 13834657 13426678 13096695 13097964 12851249
14151A2851249k9547k68057l49530j66304J79162p18073J04140j80245m40224
$$ 12851249 12821702 12553645 12204115 12037811 12216973 11498900 11603040 11422795 10982571
14142A0982571k10376L76810o83533K88654k79292k25682l33050J71716l2455
$$ 10982571 10772195 11149005 10465472 10754126 10474834 10249152 9916102 10087818 10055363
14133A0055363k49196j57833l42057M4279l14040j3726l62718r9052J06595p9402
$$ 10055363 9806167 9648334 9306277 9350556 9036516 9022790 8660072 8561020 8667615 8588213
14123H588213k40718o5670k97349n0589L99310m91629k92932P0810n9938m13505
$$ 8588213 8347495 8281825 7984476 7933887 8333197 7841568 7548636 7619446 7559508 7146003
14113G146003K28780l40835R8506m8366j90599Q7095j88262l03181J39164m7810
$$ 7146003 7374783 7033948 7132454 7084088 6893489 6980584 6792322 6489141 6628305 6580495
14103F580495L3274j93566j27264J3189k99542J42046q2188N9984p7031k08436
$$ 6580495 6613769 6420203 6292939 6306128 6006586 6148632 6066444 6126428 6049397 5840961
14093E840961Q8334m90638P4030j19316Q240k33204K72974L5210r0135l37757
$$ 5840961 5929295 5438657 5512687 5393371 5401611 5168407 5441381 5476591 5386456 5048699
14083E048699J42496J68885o13084L09034J04008j60705j40945K17222j89202
$$ 5048699 5191195 5360080 4746996 5056030 5160038 4999333 4858388 5075610 4886408
14074D886408k34050k71823J70906J52614j45437k28451K3348k27117K01834k73354
$$ 4886408 4652358 4380535 4551441 4704055 4558618 4330167 4353515 4126398 4328232 4054878
14064D054878L29287j0219J91620m42365p8167K29420k15306J28390k17111K26250
$$ 4054878 4384165 4373946 4565566 4123201 4045034 4274454 4059148 4187538 3970427 4196677
14054D196677j43079k17847k25390O1518J90624j38008J53184j85835J60255m81854
$$ 4196677 4053598 3835751 3610361 3671879 3862503 3724495 3877679 3691844 3852099 3370245
14044C370245K6100N5428k9474K76200l07102q6558K2840k3509l7747J80964l61934
$$ 3370245 3396345 3451773 3422299 3698499 3391397 3304839 3327679 3304170 3266423 3447387 3085453
14033C085453J12102K18968m31421K89521P8468l56586K46500m84670L54509q9059
$$ 3085453 3197555 3416523 2985102 3274623 3353091 2996505 3243005 2758335 3112844 3023785
14023C023785J15006n0266k32289K8280k98659J44795J6085j33198k31556M45717
$$ 3023785 3138791 3088525 2856236 2884516 2585857 2730652 2746737 2613539 2381983 2827700
14013B827700m22315O19687n06115k89489K54104R1704L2464m75532K95670l46613
$$ 2827700 2405385 3025072 2518957 2229468 2483572 2575276 2607740 2132208 2427878 2081265
14003B081265K75599K5135j14506o3156j56772J25655j50664o8399Q9115J76721
$$ 2081265 2356864 2381999 2267493 2204337 2047565 2173220 2022556 1954157 2043272 2219993
13993B219993p4806J75450m7876M12983L88582J626502O082171J5840423K5966779
$$ 2219993 2145187 2320637 2272761 2685744 3074326 4700828 10782999 26623422 52590201
13984E2590201k0648592A5218688o305731k971779o32261j308794k03083m38871
$$ 52590201 31941609 15218688 8912957 5941178 5308917 4000123 3797040 3358169
13976C358169k86751N2225l40404R4817k83863j10085j13310J98660k91001J84632
$$ 3358169 3071418 3123643 2783239 2878056 2594193 2484108 2370798 2569458 2278457 2463089
13966B463089K2244p9796r7801K01978q3685k16606r2360K33968j32380k9494
$$ 2463089 2485333 2405537 2307736 2509714 2426029 2209423 2117063 2351031 2218651 2189157
13956B189157k54812j6308R8708l8900K18669j36361J07896k37101J59710k27668
$$ 2189157 1934345 1918037 2016745 1977845 2196514 2060153 2168049 1930948 2090658 1862990
13946A862990P0324j70022M06200K9243l37634J21171P9171k31626k57733L99806
$$ 1862990 1933314 1763292 2169492 2198735 1861101 1982272 2061443 1829817 1572084 1971890
13936A971890j86713j63868R2215k67659M09842j17129k44106M2893J01034J27486
$$ 1971890 1785177 1621309 1713524 1445865 1855707 1738578 1494472 1537365 1638399 1765885
13926A765885j60002Q4715l29410K98310m4906j02475j62965J81530j14436J04343
$$ 1765885 1605883 1690598 1361188 1659498 1614592 1512117 1349152 1530682 1416246 1520589
13916A520589L6407o1334K19101l49490K97400j0815k3414k23456O2024m13352
$$ 1520589 1556996 1495662 1714763 1365273 1662673 1651858 1628444 1404988 1467012 1053660
13906A053660L21135J77438j64742P6560k74314J21229j24394r5810L09060j76024
$$ 1053660 1374795 1552233 1387491 1464051 1189737 1310966 1186572 1090762 1399822 1223798
13896A223798P47J40894L8869l31609J88740K25349m50522j6848K15422k62109
$$ 1223798 1224545 1365439 1404308 1072699 1261439 1486788 1036266 1019418 1234840 972731
13886I72731L63221j73524L53058k96301j04714L55392j2875p1127j27954M1012
$$ 972731 1335952 1162428 1515486 1219185 1114471 1469863 1456988 1385861 1257907 1298919
13876A298919p5001o6853K58635j34175j01724K80719k64112j1810j57643J40284
$$ 1298919 1223918 1157065 1415700 1281525 1179801 1460520 1196408 1184598 1026955 1167239
13866A167239k12750L7587J23716J55318m58452K77059M14072j94470m56559J51177
$$ 1167239 954489 992076 1115792 1271110 812658 1089717 1503789 1309319 852760 1003937
13856A003937M69219l40005k69552K95301m7487L7231P871j14329L10727l15837
$$ 1003937 1473156 1133151 863599 1158900 1111413 1148644 1156515 1042186 1352913 1037076
13846A037076L194J62520k8674E62944M37780K05855M49465q14558L28872j08826
$$ 1037076 1040270 1202790 1174116 562944 1000724 1206579 1656044 841486 1170358 1061532
13836A061532l39763K81967K19610j02210l01021R5323k30935K75752k84655N00227
$$ 1061532 721769 1003736 1223346 1121136 820115 915438 684503 960255 675600 1175827
13826A175827m00662N31459j52208j88849j58423J58160n8830J00170J39291k45921
$$ 1175827 775165 1306624 1154416 965567 807144 965304 906474 1006644 1145935 900014
13816I00014k66J07321j83243J97117k23957J3547K82402m70543J83936m353L5826
$$ 900014 899748 1007069 823826 1020943 796986 810533 1092935 622392 806328 801975 837801
13805H37801M08298j36692j00215O547m28336M98986l55632L73893j97254k08926
$$ 837801 1246099 1109407 1009192 1015739 587403 1086389 730757 1104650 907396 698470
13795F98470l8116N12700l36860R8989j86153q9314o8304K121R4040l37402P11673
$$ 698470 660354 1173054 836194 935183 749030 659716 591412 593533 687573 350171 1061844
13784A061844k14021J38426r2263j00426M4532j94383k5837L02246l30456M67486
$$ 1061844 847823 986249 893986 793560 838092 643709 617872 920118 589662 1057148
13774A057148m05739R3899m3367l9138R9921j31552K58586j40994L15728m13476
$$ 1057148 651409 745308 701941 662803 762724 631172 889758 748764 1064492 651016
13764F51016J29801Q1158k91880M48817m44895R0367P7837k53417J40948L04564
$$ 651016 780817 861975 570095 1018912 574017 664384 742221 488804 629752 934316
13754I34316j71639k56640L12644k48100K65449j28475j34421P411m9976H9144
$$ 934316 762677 506037 818681 570581 836030 707555 573134 580545 530569 89144
13743F88525O5002j37319l2932l6016N78773n08281O8848M0985C45522M73796
$$ 688525 753527 616208 583276 547260 1126033 617752 686600 727585 345522 819318
13733H19318k63994L46782j77360p1918N12468k82171m09117j71899K99252A61101
$$ 819318 555324 902106 724746 652828 1165296 883125 474008 302109 601361 161101
13722D40478K92840k1880l50218J81287R0571j90365j2945L26033m0289l47709
$$ 440478 733318 711438 361220 542507 633078 442713 429768 755801 715512 367803
13712C67803J10807A20817N67161k31055L12261o8454k14523m1945K1615K89012
$$ 367803 478610 120817 687978 456923 769184 700730 486207 444262 465877 754889
13702G54889B49332L1559M28559M71415D72420B24782K87572K26993M68C26994
$$ 754889 249332 280891 709450 1180865 472420 224782 512354 739347 739815 326994
13691G20521j84169J6955q4761A60047L79278n5833j03401K44511k32609M04101
$$ 720521 536352 553307 468546 160047 539325 483492 380091 624602 391993 796094
13681G96094B22002L0527K05205K8494q0745j29763J68330J072K44869j92353
$$ 796094 222002 252529 457734 486228 405483 275720 444050 445122 689991 497638
13671D97638K11287p5796l15223J24029R8032H3667R8125J63284k3500J84035
$$ 497638 708925 633129 317906 441935 539967 83667 181792 345076 321576 505611
13661E05611j41517P1157o0361K17735K22251l06391j2618O9021j50614r7803
$$ 505611 364094 435251 374890 592625 814876 508485 495867 564888 414274 316471
13651C16471J3034L40967k09161A61254Q5471P4520k2621J5621M746r2910A10387
$$ 316471 329505 670472 461311 161254 246725 321245 298624 314245 318991 226081 110387
13639B63810o9813N02205l13361M59645l64719K25558k76221K38553j55688j73768
$$ 263810 193997 696202 382841 842486 477767 703325 427104 665657 509969 336201
13629C36201n5480J17309A92731J92404J85546j73804J76549k63551K51008j56993
$$ 336201 280721 398030 192731 385135 570681 396877 573426 309875 560883 403890
13619D03890j49890M9280M71543B87087J65899j87569a85450A77203M15714L8388
$$ 403890 254000 303280 774823 287087 452986 265417 -185450 177203 592917 631305
13609F31305B13198m7938O43152l20413j19985P1427g4816B60527J29678J15151
$$ 631305 213198 165260 808412 487999 368014 439441 -74816 260527 390205 505356
13599E05356K7820j52419J18469j47470q1289j30586M18498A69332K293L52841
$$ 505356 533176 380757 499226 351756 270467 139881 558379 169332 171625 524466
13589E24466a08210A86468m6794K97577m2102K9327A25186K12960J36208A07184
$$ 524466 -108210 186468 139674 437251 395149 424476 125186 338146 474354 107184
13578C01939I2729O2605K44455j59308K08195B17691l1183h2166A61126J68786
$$ 301939 92729 155334 399789 240481 448676 217691 186508 -82166 161126 329912
13568C29912M1409L3784L26816C26982J21220k15014O12140B65965J57933A03537
$$ 329912 371321 405105 731921 326982 448202 233188 845328 265965 423898 103537
13557C88398R1559A40862K24947n7004I8734K35225J20260k18964E2082R4099
$$ 388398 479957 140862 365809 308805 98734 333959 454219 235255 52082 146181
13547A46181K09587J63662A39799K9490C6393O4667L86305A80466p0802K05430
$$ 146181 355768 519430 139799 169289 36393 101060 487365 180466 109664 315094
13537C15094J90845q5182p7483L1931j05930p4336J35055O7240j32256A26492
$$ 315094 505939 420757 343274 375205 269275 194939 329994 397234 264978 126492
13526A84050M17814k12645q7935J86605A82620K55176j62873n1096h2872G4918
$$ 184050 601864 389219 301284 487889 182620 437796 274923 223827 -82872 74918
13515C28780J53718j70493D4324J6408L12442A02039M64905A93730O9262G2162
$$ 328780 482498 312005 44324 60732 373174 102039 566944 193730 262992 72162
13504A67065N5692l2326K35318C8292L94900j43894L19225A44230n8380J70205
$$ 167065 222757 190431 425749 38292 433192 289298 608523 144230 85850 256055
13494B56055J05459D9168L14443A32866b2741B12618N8814J42327A51585o3690
$$ 256055 361514 49168 363611 132866 -22741 212618 271432 413759 151585 87895
13484H7895K68808L54973k72735M0996j94572A34039K59280F1320a07005C45438
$$ 87895 356703 711676 438941 479937 285365 134039 393319 61320 -107005 345438
13473A59401K06231K93266j48305B12554I6375D4223Q3233K2259L7702H5709K71150
$$ 159401 365632 658898 510593 212554 96375 44223 127456 149715 187417 85709 356859
13462C56859j15647h3276A76792J36540P5049k112j27600d4659C2169R2643N7237
$$ 356859 241212 -83276 176792 313332 388381 386269 258669 -44659 32169 124812 182049
13451A82049J115J00523a75071F39265B93116c3283C80974G4286J36912r5882
$$ 182049 183164 283687 -175071 639265 293116 -33283 380974 74286 211198 115316
13441A15316K02542D0601L42281j51167o9321L4834l1151Q7140j16554J66831
$$ 115316 317858 40601 382882 231715 162394 197228 166077 253217 136663 303494
13431C03494M1644J23875a2542B04486O8837e7315j99073D50895B25422c30077
$$ 303494 345138 469013 -12542 204486 273323 -57315 -256388 450895 225422 -330077
13420C72267A51234o6217K21079M4233A62055K12915A14297J48687n2746J60768
$$ 372267 151234 85017 306096 350329 162055 374970 114297 262984 210238 371006
13410C71006I5284j3710K98581L1474J38761A39497J0184J23048D913Q3689K92304
$$ 371006 95284 81574 380155 411629 550390 139497 149681 272729 4913 88602 380906
13399C80906j32779h2973A02751L31062A29642J1223P2564q5273L22482j98408
$$ 380906 248127 -82973 102751 433813 129642 140865 213429 128156 450638 252230
13389B52230j20639Q1846C4930J7465J14710P973b44811m975A75253J10958J05032
$$ 252230 131591 213437 34930 52395 167105 175078 -244811 -249786 175253 286211 391243
13378C91243j38696l7543J17843A07179L6890K44208O555A48747K74566j72964
$$ 391243 252547 215004 332847 107179 144069 388277 394832 148747 423313 250349
13368B50349j21784O5140G8367M52554B05353o6799j0838j1824J55486J18424
$$ 250349 128565 193705 78367 530921 205353 138554 127716 115892 271378 389802
13358C89802J95006k02226E008a18014A57131a98477D51289A68694L75157k26729
$$ 389802 584808 382582 5008 -118014 157131 -198477 451289 168694 543851 317122
13348C17122r0988m439I18R8795M3965J74435k4890K51879j93765L16943k48905
$$ 317122 226134 221695 918 99713 143678 318113 293223 545102 351337 668280 419375
13337D19375j08191K77560B06386L7603L0937J16341q8864j38652R7780M7370
$$ 419375 311184 588744 206386 243989 274926 391267 302403 163751 261531 308901
13327C08901G3191L35268A72749J90626j80967A7202p573K78797J19703j45453
$$ 308901 73191 408459 172749 363375 182408 17202 9629 288426 408129 262676
13317B62676J5588q7812K38013j22895m3379K5945j08804J20874A03635J91217
$$ 262676 278264 190452 428465 305570 262191 288136 179332 300206 103635 294852
13307B94852E4200O0397O2899D0261h0475m503B7180b02101B97349n7646a29712
$$ 294852 54200 114597 177496 40261 -80475 -84978 27180 -202101 297349 239703 -129712
13295C19158r5584i063C25724e7748m6118A72897K18573B1429a57479B58514D3493
$$ 319158 223574 -9063 325724 -57748 -103866 172897 391470 21429 -157479 258514 43493
13283B41881I9024R6618C749K33883n0243M5104e8916C35910A23499K32768F3921
$$ 241881 99024 195642 3749 237632 187389 232493 -58916 335910 123499 356267 63921
13271F7349c5413R025A4604a32836H7195R0084o7393J38268e3443B04995N1271
$$ 67349 -35413 -26388 14604 -132836 87195 177279 109886 248154 -53443 204995 256266
13260B56266K13888k33568o2644M16834a70183B51430c6218A74835a5997o0375
$$ 256266 470154 236586 173942 590776 -170183 251430 -36218 174835 -15997 -76372
13250g6372p8923A16187l5373f4771A68292A6841N7453K03195A34611k8770n2873
$$ -76372 -155295 116187 80814 -64771 168292 16841 74294 277489 134611 105841 52968
13239E2968R0314k4099J15849j4007c9891j7875a0443D4499K70408n9385H7833
$$ 52968 143282 119183 235032 221025 -39891 -57766 -10443 44499 314907 255522 87833
13227C47632j39951j02793O5998I880P1337b12978d5122A95180n254F827N09254
$$ 347632 207681 104888 170886 9880 81217 -212978 -45122 195180 189926 6827 516081
13216E16081A78824e3533a1811B23933p4624e1304C57178b29232q0887A01341
$$ 516081 178824 -53533 -11811 223933 149309 -51304 357178 -229232 -310119 101341
13205B95085l9638a20019H3550a2128j53968C13817J46877b56125A58505G4450
$$ 295085 255447 -120019 83550 -12128 -166096 313817 460694 -256125 158505 74450
13194B08776L3301A7801O4791L3049N6026P7751M0000d7556A11288N0752M9763
$$ 208776 242077 17801 82592 115641 171667 249418 289418 -47556 111288 162040 211803
13183B11803M3472a22273j22433E1766J94770A05384R8312a19313E6366J41882
$$ 211803 255275 -122273 -244706 51766 246536 105384 203696 -119313 56366 198248
13173A98248K3261A02741p326h5981j41748C34131a39945B63080a24985A36442
$$ 198248 221509 102741 95415 -85981 -227729 334131 -139945 263080 -124985 136442
13162I4502O1995N5092d5235A76552a45018c8725C86996j51017G2642e2419A32430
$$ 94502 156497 211589 -45235 176552 -145018 -38725 386996 235979 72642 -52419 132430
13150I7840R2352K15834j18169A19095R4458b1909C9004b7451A30919d8010I2141
$$ 97840 190192 406026 287857 119095 213553 -21909 39004 -27451 130919 -48010 92141
13138B47619E5485M6757K22872a75958J9033o9237A03542d8575l89998E6650J80192
$$ 247619 55485 102242 325114 -175958 -156925 -226162 103542 -48575 -438573 56650 236842
13127B36842o5971q2978l3424P2744C8290O6575J48982a8760j76976c3849C28732
$$ 236842 170871 87893 54469 127213 38290 104865 253847 -18760 -195736 -33849 328732
13115B83748q4378m6683c6139B79549E2250c3117j44756D59884a11214K0470J7782
$$ 283748 199370 152687 -36139 279549 52250 -33117 -177873 459884 -111214 -90744 -72962
13104g2962C40320f575B3831J10836J53857A6429J80400P3489P6569I3774b68538
$$ -72962 340320 -6575 23831 134667 288524 16429 196829 270318 346887 93774 -268538
13092a59990f3915D36346a5968l859B74110a0128d959G9287l8218J07201b80467
$$ -159990 -63915 436346 -15968 -19827 274110 -10128 -4959 79287 41069 148270 -280467
13080H4915J2394m0302K83179A16802H409J93397c60696I2357C6965L11205b67899
$$ 84915 97309 57007 340186 116802 8409 201806 -360696 92357 36965 348170 -267899
13068B13633Q5202m9576L1701e7839p5918B28373c23561Q0956A75957m1125A6051
$$ 213633 298835 249259 280960 -57839 -133757 228373 -323561 -242605 175957 134832 16051
13056B09955a07860F126K20816g6145A00359K00791a0126I0186A2930J44615J39614
$$ 209955 -107860 6126 226942 -76145 100359 301150 -10126 90186 12930 157545 297159
13045B97159j7352j15614J6901H0005P6312J10677A8604K53210d2066l1894j01095
$$ 297159 279807 164193 181094 80005 156317 266994 18604 271814 -42066 -73960 -175055
13034a75055e9406k9437E7817Q573M7428b6278B72405F9893kP8277e6008C07893
$$ -175055 -59406 -88843 57817 66390 113818 -26278 272405 69893 69891 148168 -56008 307893
13021B00435m9271c8638H8145l1581a38223j70190D17406c8089j4637H2904c780
$$ 200435 151164 -38638 88145 56564 -138223 -308413 417406 -38089 -52726 82904 -3780
13009D3969J32016o1394K64100J05445C045K08137a1775C6298J50659M1961D5846
$$ 43969 175985 114591 378691 484136 3045 211182 -11775 36298 186957 228918 45846
12997B41880j08783j3669a10531C94229A9602r283h1145D25986b13234A50640
$$ 241880 133097 119428 -110531 394229 19602 10319 -81145 425986 -213234 150640
12986c4544d52A02417h0434j02611b784j44580F8169b56807A61943J22994C69
$$ -34544 -452 102417 -80434 -183045 -2784 -147364 68169 -256807 161943 284937 369
12974D3815J19288k0008a62838L761E1342d7598A1900J74999L4834a18749j77774
$$ 43815 163103 143095 -162838 -159077 51342 -47598 11900 186899 221733 -118749 -296523
12963b96523g2330b9047B27601l6301h2893A98649g3657A97761B608d6186o897
$$ -296523 -72330 -29047 227601 191300 -82893 198649 -73657 197761 2608 -46186 -53083
12952e3083C87216c42850A30611L4366k1285J8198G305N5763R3869F7932M6987
$$ -53083 387216 -342850 130611 164977 143692 161890 7305 63068 156937 67932 114919
12941A14919a30170R185B47396F7344b25147h0669J9340D0580r775f1773D7277
$$ 114919 -130170 -120985 247396 67344 -225147 -80669 -61329 40580 30805 -61773 47277
12929b88020A95720D0949d6138A69229N34229F1684a38881a0497A14433l992a49767
$$ -288020 195720 40949 -46138 169229 703458 61684 -138881 -10497 114433 110441 -149767
12917I169K35836a21179M736A55082i4278K6805B38762c9972j62208C0872J21567
$$ 9169 245005 -121179 -116443 155082 -94278 -67473 238762 -39972 -202180 30872 152439
12906A52439g254l0559k0323A12820j8204f662H1693d375B4402J49038a33387
$$ 152439 -7254 -37813 -58136 112820 94616 -6662 81693 -4375 24402 173440 -133387
12894A82099g8270I9109C5924K9134N7041D9328J71729j04164J47734b30941E47307
$$ 182099 -78270 99109 35924 65058 122099 49328 221057 116893 264627 -230941 547307
12882e689k4903n3342A25313e9852H960J02709b96301A22302L3890C1968g1499
$$ -5689 -30592 -83934 125313 -59852 8960 111669 -296301 122302 156192 31968 -71499
12870B4369d4508i343B48657a89729L6829P4666C63635c3689j56587k7159a01381
$$ 24369 -44508 -9343 248657 -189729 -152900 -78234 363635 -33689 -190276 -217435 -101381
12858C6157P3437J97319D1950b78245F1013b01364A73567D6370a77624O4968r7961
$$ 36157 109594 306913 41950 -278245 61013 -201364 173567 46370 -177624 -112656 -210617
12847b10617B80861C3738o107K14176G0382a02992n4k6402k6260c5389A33552
$$ -210617 280861 33738 27631 241807 70382 -102992 -103046 -129448 -155708 -35389 133552
12835c71257J40262a5246j1190A53305g886A18217j6609B3698f1287D51150e112
$$ -371257 -230995 -15246 -26436 153305 -7886 118217 101608 23698 -61287 451150 -5112
12823h6366I2961K25078b11400D2113R2776O1494J8091f2046j09620C4058b6601
$$ -86366 92961 318039 -211400 42113 134889 196383 214474 -62046 -171666 34058 -26601
12811C86216b75790I8922D039e4585j1434P236b89D2467Q0826O3522g2702B30571
$$ 386216 -275790 98922 4039 -54585 -66019 -58783 -289 42467 123293 186815 -72702 230571
12798E9116b64146h7241L2207B83209a89931D0106J06207b13973B28101k0195
$$ 59116 -264146 -87241 -55034 283209 -189931 40106 146313 -213973 228101 207906
12788B07906a95225A6804f0638A13452b25714N6048A92317B744L19535a19081
$$ 207906 -195225 16804 -60638 113452 -225714 -169666 192317 2744 322279 -119081
12777B73270C234O5785q895c56707a51656B56281m0203a21225l5204a2661B20907
$$ 273270 3234 69019 60124 -356707 -151656 256281 216078 -121225 -156429 -12661 220907
12765B16294j03058A7984a27404A7413f6636A65929H0233Q2052K8083a50308E7910
$$ 216294 113236 17984 -127404 17413 -66636 165929 80233 162285 190368 -150308 57910
12753i4959J3724a2463B00751J30823d2845g75F5252L2566B4632a28172A6693
$$ -94959 -81235 -12463 200751 331574 -42845 -775 65252 97818 24632 -128172 16693
12741A09614l7606J6230a2223j23709A43346b31918B02210k3722a71481A45732
$$ 109614 72008 88238 -12223 -135932 143346 -231918 202210 178488 -171481 145732
12730A63086N1087G5387A5469L20303q2359q8265g9202C626b75040R7178D6347
$$ 163086 214173 75387 15469 335772 253413 165148 -79202 3626 -275040 -177862 46347
12718d13801c3827j52781B61038A15837h0663A49114J4220c50053A01765L76300
$$ -413801 -33827 -186608 261038 115837 -80663 149114 163334 -350053 101765 478065
12708D78065j67761I4919g5575A38360J87799G9034A3508J33772C3353J37886
$$ 478065 310304 94919 -75575 138360 326159 79034 13508 147280 33353 171239
12698A71239b69948a3351A12970B4814a68756b3145B0761a95306B44329b13891
$$ 171239 -269948 -13351 112970 24814 -168756 -23145 20761 -195306 244329 -213891
12687c8477j4927o6524A44418M73472B39568a37785J2646B97872F9644J1314R1488
$$ -38477 -53404 -119928 144418 617890 239568 -137785 -125139 297872 69644 80958 172446
12676A72446J07386F9109L90654A90690J29964H41K80640a7625B96556C0315J37743
$$ 172446 279832 69109 459763 190690 320654 841 281481 -17625 296556 30315 168058
12665A68058b9553B28407a88856C20638A13498a16077A2263g55r6174C73162A24719
$$ 168058 -29553 228407 -188856 320638 113498 -116077 12263 -755 -96929 373162 124719
12653b5132k15497A25394l0021f2976C55167A46783d1567A90861H1362a82353
$$ -25132 -240629 125394 95373 -62976 355167 146783 -41567 190861 81362 -182353
12642B40453A02410b16624I3192Q3189b1086B16950j5393I8668K07576E5607a10728
$$ 240453 102410 -216624 93192 176381 -21086 216950 201557 98668 306244 55607 -110728
12630A43620b65818C35178H3064J31621Q6958E9530J80163R600a46995d8525C19029
$$ 143620 -265818 335178 83064 214685 301643 59530 239693 249293 -146995 -48525 319029
12618I7205Q2450J85875c10805f2495D7780K3778b31048J05024B66809a51181
$$ 97205 179655 365530 -310805 -62495 47780 71558 -231048 -126024 266809 -151181
12607c40346h9321F053f3989B65608a7608B7026a14091I8893K27536D7196J1473
$$ -340346 -89321 6053 -63989 265608 -17608 27026 -114091 98893 326429 47196 58669
12596E8669e796k56992C5404i2734d136j2695A13406i1130K8452H9155a25718
$$ 58669 -5796 -262788 35404 -92734 -4136 -16831 113406 -91130 -62678 89155 -125718
12584a92662N5445N6318q3362A36934a19901j27474L8095B99957A3612L3400A3611
$$ -192662 -137217 -80899 -164261 136934 -119901 -247375 -209280 299957 13612 47012 13611
12572C26879D3475a42958O8378B77870a72447A39222Q7087E9879a22456G9439
$$ 326879 43475 -142958 -74580 277870 -172447 139222 226309 59879 -122456 79439
12561A754b7310B36323I153J37770L04046k15475a14152A44959h810G0653K07476
$$ 1754 -27310 236323 9153 146923 450969 235494 -114152 144959 -8810 70653 278129
12550B78129b2494A48027b94245e8449G811J94585e7338B66484L5277j15300b48054
$$ 278129 -22494 148027 -294245 -58449 7811 202396 -57338 266484 301761 186461 -248054
12538A54745J04014g7746I276b35765B2901J96462F8914a767k21823J02337I5284
$$ 154745 258759 -77746 9276 -235765 22901 219363 68914 -1767 -223590 -121253 95284
12526B17346m2678b68567h6734B14297d34751a3086j23022H9875R9145b10637
$$ 217346 174668 -268567 -86734 214297 -434751 -13086 -136108 89875 189020 -210637
12515A84968b67625g9097A3717f1189A39253g4299I1101f3530B1445e5777A41534
$$ 184968 -267625 -79097 13717 -61189 139253 -74299 91101 -63530 21445 -55777 141534
12503G3206a42143A18587C9020a64755B67982b29691g377G8863b36516E9716K41355
$$ 73206 -142143 118587 39020 -164755 267982 -229691 -7377 78863 -236516 59716 301071
12492C01071I6547B1025L57774c5730l79343a07267D4782b88240P1329j14801
$$ 301071 96547 21025 378799 -35730 -415073 -107267 44782 -288240 -216911 -331712
12482c31712G9600H68J53598h8896k83418A25142J69797q7428a94368A06270L91412
$$ -331712 79600 868 154466 -88896 -372314 125142 294939 207511 -194368 106270 497682
12471D97682r9916A71935O1988i2026B10528I8732b14199A27016a77377r0292
$$ 497682 397766 171935 233923 -92026 210528 98732 -214199 127016 -177377 -267669
12461b67669f357C83056A05314a42035b8959B59309J1146E6715A8944c98099c9342
$$ -267669 -6357 383056 105314 -142035 -28959 259309 270455 56715 18944 -398099 -39342
12449f2380k14214C8452K46647C8515J24910o820a96572a5693E6231M19203A39086
$$ -62380 -276594 38452 285099 38515 163425 156605 -196572 -15693 56231 475434 139086
12437a50791J0065A57482o5811a40541r1593H5416J74036m5428H6125O6344q48
$$ -150791 -140726 157482 91671 -140541 -232134 85416 259452 214024 86125 152469 151621
12426A51621b08215A94131F4668c6019k32056A59700d7962o626H7915a59027m0672
$$ 151621 -208215 194131 64668 -36019 -268075 159700 -47962 -54588 87915 -159027 -199699
12415a99699a6138I792L15612I0091b47443A52589E3234L1333b27398B66768e5301
$$ -199699 -16138 9792 325404 90091 -247443 152589 53234 84567 -227398 266768 -55301
12403f5002D8023B2613a3010B05078Q600h0650B26021g2461k17182a39957P341
$$ -65002 48023 22613 -13010 205078 213678 -80650 226021 -72461 -289643 -139957 -132616
12392a32616C3957J82904a73842B7177K03235e9003B45547M138a10438l7574H6173
$$ -132616 33957 216861 -173842 27177 230412 -59003 245547 249685 -110438 -148012 86173
12380I1267R438A2872K36223j17419N4202f7871B16147a8357I6912a59632A16580
$$ 91267 100705 12872 249095 131676 185878 -67871 216147 -18357 96912 -159632 116580
12368F0978g3097H8160C3962d4842G5110K1651b21733G5185j0924a14650A59948
$$ 60978 -73097 88160 33962 -44842 75110 96761 -221733 75185 64261 -114650 159948
12356a52569A93511a60440A9199L58321h3854A3686N4483h059l4122p09D9110
$$ -152569 193511 -160440 19199 377520 -83854 13686 68169 -8059 -42181 -42890 49110
12344a8825E79605h7255L5245B25300d03334A11050a29081j05922g335k0302j2702
$$ -18825 579605 -87255 -52010 225300 -403334 111050 -129081 -235003 -7335 -27637 -40339
12333d0339C98830j92303J0574a5672H8967R8718K40260a75786c6220A23274L94043
$$ -40339 398830 206527 217101 -15672 88967 187685 427945 -175786 -36220 123274 517317
12322E17317A9958K8341K62933R4341r5652R6719A85778J57894b22105B71148
$$ 517317 19958 48299 311232 405573 309921 406640 185778 343672 -222105 271148
12311d4765B91757A30199h9192F6137K16980l2622J22214b15430J2967i7883a5969
$$ -44765 291757 130199 -89192 66137 283117 250495 372709 -215430 -202463 -97883 -15969
12299B93933A24076N5989G9683a37528C5821L05568f376C04345c44475b4188l72640
$$ 293933 124076 180065 79683 -137528 35821 341389 -6376 304345 -344475 -24188 -396828
12288c96828A00512g2731F27358a34091k232D4853Q6600K31180j48966P660Q5493
$$ -396828 100512 -72731 627358 -134091 -136323 44853 131453 362633 213667 221327 306820
12277C06820E109a1794m1086D37049D6250c1806A01792d8359B56216p3720o4704
$$ 306820 5109 -11794 -52880 437049 46250 -31806 101792 -48359 256216 182496 117792
12266A17792C7739K64670j48874m8900b46B38874J38343J5841A50404K08898j14422
$$ 117792 37739 302409 153535 104635 -246 238874 377217 393058 150404 359302 244880
12255B44880I8512J25603A8419J11097f6296C91869j29664j30040K36703r4362
$$ 244880 98512 224115 18419 129516 -66296 391869 262205 132165 368868 274506
12245B74506l6354D766J3240K35336e820C8938J48292o6444J40442H1995c30196
$$ 274506 238152 4766 18006 253342 -5820 38938 187230 120786 261228 81995 -330196
12233A80401B951J65827f134B15931Q8067a87874A73592P2104j08194A2083b6741
$$ 180401 2951 168778 -6134 215931 303998 -187874 173592 245696 137502 12083 -26741
12221A47839L29508p6675j53002D4401C875L17390J84782A93076O0647J74252
$$ 147839 477347 400672 247670 44401 3875 321265 506047 193076 253723 427975
12211D27975j43740j37442L8679c2541G6769J43040r1802C6607b26362J2536B91705
$$ 427975 284235 146793 185472 -32541 76769 219809 128007 36607 -226362 -213826 291705
12199C58447P40r484b2158B82187j01280b58650B30522Q608B2969J47028J22582
$$ 358447 359187 349703 -22158 282187 180907 -258650 230522 239130 22969 169997 292579
12188B92579o9962q1492J6539J8795M9250A6450M841J02450Q349J00538A11693
$$ 292579 222617 141125 157664 176459 225709 16450 21291 123741 132090 232628 111693
12176A16157n0372P5994m4688K76740a75280B9845K40559j25344q472N7110L3444
$$ 116157 65785 141779 97091 373831 -175280 29845 270404 145060 136588 193698 227142
12165B27142Q1258O7968A7393L92215A83248F2682L4723k4258J73282H7695b77
$$ 227142 308400 376368 17393 409608 183248 62682 97405 73147 246429 87695 -277
12153C56162F7425J1162J79857B1495P1763f5525k33309B84328A2779K42649m0771
$$ 356162 67425 78587 258444 21495 93258 -65525 -298834 284328 12779 255428 214657
12142B14657b2187j13920A92979f0269C4682K55948P3214A54523a37130I584c9239
$$ 214657 -22187 -136107 192979 -60269 34682 290630 363844 154523 -137130 9584 -39239
12130A86245h8182D7117M13271A21095K1905F7627J79432E6626j3193i8101G627
$$ 186245 -88182 47117 460388 121095 143000 67627 247059 56626 43433 -98101 7627
12118a88556A60603J09516f7126B22030H0170C215K13976r39L6170A10219K67600
$$ -188556 160603 270119 -67126 222030 80170 3215 217191 216252 252422 110219 377819
12107C77819F8761c6853C296L4116h184D7036L52426A84699Q278d3504A47370
$$ 377819 68761 -36853 3296 37412 -8184 47036 399462 184699 192977 -43504 147370
12095b86666A9852M8931f8391l17198B11744J34540l1793i1703A06048i2739I6327
$$ -286666 19852 68783 -68391 -385589 211744 346284 314491 -91703 106048 -92739 96327
12083C28656k6853O724A36273i0781n7786f9538D05967F652b30444A25706e3949
$$ 328656 301803 308527 136273 -90781 -148567 -69538 405967 6652 -230444 125706 -53949
12071B35380q6055K29901A8033J49272j0131J31340a78466f8727C20401B5756
$$ 235380 149325 379226 18033 167305 157174 288514 -178466 -68727 320401 25756
12060B91070D5632h7279A39172f7973b9571F3570b3588j0419j47974J4674C18502
$$ 291070 45632 -87279 139172 -67973 -29571 63570 -23588 -34007 -181981 -167307 318502
12048b78983h169l23679g8458B43364A06568c36739i3815n9699p6388J2008e9806
$$ -278983 -8169 -331848 -78458 243364 106568 -336739 -93815 -153514 -229902 -217894 -59806
12036f5115B63353E0723i2012K0450r6425L8946A56399o7110J39247I8329L42481
$$ -65115 263353 50723 -92012 -71562 -167987 -129041 156399 89289 228536 98329 440810
12025D40810b62980B40154a42917j6557E5319N21400B12331a0824A15328i585
$$ 440810 -262980 240154 -142917 -159474 55319 576719 212331 -10824 115328 -9585
12014A12045m2471a18003D46158m0635j80795a59861c7264B59791P0673A40569
$$ 112045 69574 -118003 446158 405523 224728 -159861 -37264 259791 330464 140569
12003D2596b4145A09154c1096j60150K9364A24227N9415m5062e9162A86604D9767
$$ 42596 -24145 109154 -31096 -191246 -161882 124227 183642 138580 -59162 186604 49767
11991B4825b95149D07384A23485J60716g0971A59060F6821J15766m2873a02838
$$ 24825 -295149 407384 123485 284201 -70971 159060 66821 182587 139714 -102838
11980i9291c7124k37585P4080A25448K15637c27980B27820c98559B8623a61917
$$ -99291 -37124 -274709 -200629 125448 341085 -327980 227820 -398559 28623 -161917
11969c68135a4921j66133A58217d35179c7575k05180K0333B1725f3760q370j79540
$$ -368135 -14921 -181054 158217 -435179 -37575 -242755 -222422 21725 -63760 -72130 -251670
11958b51670G8943C0389b90732R7839A59705F2177J58033D0997J79416a38558
$$ -251670 78943 30389 -290732 -192893 159705 62177 220210 40997 220413 -138558
11947a19542A06143r742m4839b48488A64279a70087j68536J49086B08161a54516
$$ -119542 106143 96401 51562 -248488 164279 -170087 -338623 -189537 208161 -154516
11936A8406i9890A86140b31481j05196i5678j73894B35233a88115n2801c1787
$$ 18406 -99890 186140 -231481 -336677 -95678 -269572 235233 -188115 -240916 -31787
11925C07248a42098b4774B18562f3843l02008B74557a2511r7241j94958B70208
$$ 307248 -142098 -24774 218562 -63843 -365851 274557 -12511 -109752 -304710 270208
11914A36081A2790h6018B54503C8788a11372K0808k4247j36475a04971C78266
$$ 136081 12790 -86018 254503 38788 -111372 -90564 -114811 -251286 -104971 378266
11903a38626H6281a3820G4142J72924I6332b78650F7333a37418B23666H1237K6028
$$ -138626 86281 -13820 74142 247066 96332 -278650 67333 -137418 223666 81237 107265
11892A07265a4586C2497J33849E9134O5481a95698r7874p116O5660E4316e9908
$$ 107265 -14586 32497 166346 59134 124615 -195698 -293572 -300688 -235028 54316 -59908
11880A24551J52247C8126f1571H2744J6793K1473b56284C4560l980d9590B42533
$$ 124551 276798 38126 -61571 82744 99537 121010 -256284 34560 30580 -49590 242533
11868A31831c3540J3870o4642c4076K32j59259j13602g1411l01190A69418m3131
$$ 131831 -33540 -19670 -84312 -34076 -33844 -193103 -306705 -71411 -372601 169418 126287
11857A26287e5517j36745g3406l9491A12574b95732J02844f8789D5690L4438J77837
$$ 126287 -55517 -192262 -73406 -112897 112574 -295732 -192888 -68789 45690 80128 257965
11846B57965A6382a15328B57162m8368a91075f0510F7930b11768k9620b8498A94469
$$ 257965 16382 -115328 257162 208794 -191075 -60510 67930 -211768 -241388 -28498 194469
11834a14484K4158A06094b40859C18600a18289j29459A78955b13728B65568d8141
$$ -114484 -90326 106094 -240859 318600 -118289 -247748 178955 -213728 265568 -48141
11823B33412d3257d376G1235c4383A03196a06205o1430j52668G3766J18868d38582
$$ 233412 -43257 -4376 71235 -34383 103196 -106205 -167635 -320303 73766 192634 -438582
11811a40360k23108A09867f6919m2325j28650g188r0835p4990h2521k15094B74138
$$ -140360 -363468 109867 -66919 -109244 -237894 -7188 -98023 -173013 -82521 -297615 274138
11799g2392A26857a27236j88683a7256j39415I7565d5257B3438a44310M9314b4284
$$ -72392 126857 -127236 -315919 -17256 -156671 97565 -45257 23438 -144310 -94996 -24284
11787a7997D8656J18784a39218D0533a03356A33606a72391F7822l2460R7150D0669
$$ -17997 48656 167440 -139218 40533 -103356 133606 -172391 67822 35362 132512 40669
11775b5214k28829j22929a23229k7612n5346g6166C36689c02446B05354a46224
$$ -25214 -254043 -376972 -123229 -150841 -206187 -76166 336689 -302446 205354 -146224
11764c04997j4476g5299A29410c2612k6355B97967J30917A36212b78369B8507
$$ -304997 -319473 -75299 129410 -32612 -58967 297967 428884 136212 -278369 28507
11753g1923j47022Q0649E85932f0057j19789A34017e4266P657A50934j0537J24699
$$ -71923 -218945 -138296 585932 -60057 -179846 134017 -54266 -46609 150934 140397 265096
11742B65096A30980F0933k7019P858L7917K1686R9653a04624j43001G2364K5364
$$ 265096 130980 60933 33914 41772 79689 101375 201028 -104624 -247625 72364 97728
11731I7728B4333J32906J5092a32128B19282B3271g0435B22027c04650h751D67144
$$ 97728 24333 157239 172331 -132128 219282 23271 -70435 222027 -304650 -8751 467144
11719A1985K43950a13649A04582p992i4035I7537b28105B4424O986K83476I503
$$ 11985 255935 -113649 104582 96590 -94035 97537 -228105 24424 31410 314886 9503
11707C40167a35255A30105a78301j45400h0811B09661Q6342p1510K8386N8267
$$ 340167 -135255 130105 -178301 -323701 -80811 209661 296003 224493 252879 311146
11697C11146a53431j12864B44126E3368a74773C27637C7332r77J72083C9537a26444
$$ 311146 -153431 -266295 244126 53368 -174773 327637 37332 36355 208438 39537 -126444
11685A93919i0444B6614Q4089j8011a82271g7902B75071A05388j4314J17806h2371
$$ 193919 -90444 26614 110703 92692 -182271 -77902 275071 105388 91074 208880 -82371
11673h0589c3673D5213J86526C5227O4017a33902A39043E1432R5667a31693b1757
$$ -80589 -33673 45213 231739 35227 99244 -133902 139043 51432 147099 -131693 -21757
11661C68014a85774B51926e7768B30427j04618e8127H4554Q8871A7244K13743
$$ 368014 -185774 251926 -57768 230427 125809 -58127 84554 173425 17244 230987
11651B30987r2468b7067B06485j2214c31986f8107E5755h1398a6987C98202a2834
$$ 230987 138519 -27067 206485 194271 -331986 -68107 55755 -81398 -16987 398202 -12834
11639c73779e6486l0960k66732a56643O0476B2063K08754G9380b07461P1420A8400
$$ -373779 -56486 -87446 -354178 -156643 -96167 22063 230817 79380 -207461 -136041 18400
11627a99582O2174H8415c4591A35167A8755J69165G9668e617m558r6042C57527
$$ -199582 -137408 88415 -34591 135167 18755 187920 79668 -5617 -10175 -106217 357527
11615C47538b8493l0313I2366J90070a23770j5614F5424J51575j06114D206e9857
$$ 347538 -28493 -58806 92366 282436 -123770 -139384 65424 216999 110885 4206 -59857
11603I8901a86888A50129R506L2556b42216j1445J26339G8901A4455K7180K1297
$$ 98901 -186888 150129 159635 192191 -242216 -253661 -127322 78901 14455 41635 62932
11592F2932A8418f5228G4394a4819b764o1421H520B852a3116A16913N3295a80226
$$ 62932 18418 -65228 74394 -14819 -2764 -64185 8520 2852 -13116 116913 170208 -180226
11579A16724b11475D38997j83792d8427E6K9992a53704A9546b42511I7849a01129
$$ 116724 -211475 438997 255205 -48427 56 30048 -153704 19546 -242511 97849 -101129
11567e3518A24227c2936A79441J24033A26400L8485p6441L73407a21299j79401
$$ -53518 124227 -32936 179441 303474 126400 164885 88444 461851 -121299 -300700
11557c00700F0454b62326d6643p8444o307A61848h2893D6177B0662J1197b84715
$$ -300700 60454 -262326 -46643 -125087 -131394 161848 -82893 46177 20662 31859 -284715
11545A6659J38741K4494k8725g8421C00665j7135b565j8505B93800A9677M06773
$$ 16659 155400 179894 151169 -78421 300665 283530 -2565 -21070 293800 19677 426450
11534D26450b1622A6538j006J10690c5582A80035d53552E3942K5236L3314b20524
$$ 426450 -21622 16538 15532 126222 -35582 180035 -453552 53942 79178 112492 -220524
11522F9543a46861G509a7508B88375b0745D7160J48466d4917D69849C3325J11453
$$ 69543 -146861 7509 -17508 288375 -20745 47160 195626 -44917 469849 33325 144778
11511A44778a12690B69377a10301A92692o2167c37800B99117j08625o2147J25088
$$ 144778 -112690 269377 -110301 192692 130525 -337800 299117 190492 128345 253433
11501B53433I0995h2356j06115E2352J1424M3440K32561b0014C16806D9890K40390
$$ 253433 90995 -82356 -188471 52352 63776 107216 339777 -20014 316806 49890 290280
11490B90280j22454J00439p7964D532d8155B04189K36792A52244g1099B57439
$$ 290280 167826 268265 190301 4532 -48155 204189 440981 152244 -71099 257439
11479A80125I531L4588a66950A49772a5301l1161J1632B62720F1374K68958a01046
$$ 180125 9531 44119 -166950 149772 -15301 -46462 -34830 262720 61374 330332 -101046
11467B06247k5748g9737C32179J50808E9589g9183A35696j9773c1397C52297A47212
$$ 206247 180499 -79737 332179 482987 59589 -79183 135696 115923 -31397 352297 147212
11455D47873d03878A14395J01406G2319N60826e1691J7243j80068G8048Q065a14660
$$ 447873 -403878 114395 215801 72319 633145 -51691 -34448 -214516 78048 86113 -114660
11443A42161b67847C73711A54084E0649M32648h5092o981A02597b1347A87673
$$ 142161 -267847 373711 154084 50649 483297 -85092 -92073 102597 -21347 187673
11432A03517j0095B7339K93044A53506J02107c1139j50549L2816D3310J34665
$$ 103517 93422 27339 320383 153506 255613 -31139 -181688 -148872 43310 177975
11422A77975D0649j0352j3144c5498C5660b9391C41837H6947L8131J23492b36388
$$ 177975 40649 30297 17153 -35498 35660 -29391 341837 86947 125078 248570 -236388
11410h3701A49992n8373L6121b68083H2866b36114A92207I1637L9399e5853K3651
$$ -83701 149992 91619 127740 -268083 82866 -236114 192207 91637 131036 -55853 -32202
11399c2202E2987a73579A54167b79975A78501b52893j7750G2276a69003m2240
$$ -32202 52987 -173579 154167 -279975 178501 -252893 -270643 72276 -169003 -211243
11389b11243A33654J6193a83385K7083I742a6364L079j18641j14402B42114r7708
$$ -211243 133654 149847 -183385 -156302 9742 -16364 -13285 -131926 -246328 242114 144406
11378A44406b47448B87359a688k930B6698K05548B5026a61328A63462J18534O769
$$ 144406 -247448 287359 -1688 -4618 26698 232246 25026 -161328 163462 281996 288765
11367B88765a1765B8541d6322D3241a01172A08145c0856l27941J68498r3780Q6805
$$ 288765 -11765 28541 -46322 43241 -101172 108145 -30856 -358797 -190299 -284079 -197274
11356a97274p6022a10261J2549B01409E894a74044A06699a36511F537N1730L50985
$$ -197274 -273296 -110261 -97712 201409 5894 -174044 106699 -136511 6537 58267 409252
11345D09252b2970p8507C86701j45019I2844a9392G1236b92716B22594g1087m3462
$$ 409252 -22970 -101477 386701 241682 92844 -19392 71236 -292716 222594 -71087 -114549
11334a14549b3699l0861A98138a14430j31921L4489A14055a82435N1545c7506
$$ -114549 -23699 -54560 198138 -114430 -246351 -211862 114055 -182435 -130890 -37506
11323B33314c04787j17176D6821J04989g9455A39412b56040Q0969j0034M9611
$$ 233314 -304787 -421963 46821 151810 -79455 139412 -256040 -175071 -185105 -135494
11313a35494C4285J43649m4272C1153b86199A16166J043i7988j7397r070k24919
$$ -135494 34285 177934 133662 31153 -286199 116166 117209 -97988 -115385 -124455 -349374
11302c49374e6712B22595g3278j0829j30982j50944c2180A97632r8190N531K11399
$$ -349374 -56712 222595 -73278 -84107 -215089 -366033 -32180 197632 99442 104973 316372
11291C16372D0159c4892O760k27684a1069m0698j36120h4609D8876m028h4902
$$ 316372 40159 -34892 -28132 -255816 -11069 -51767 -187887 -84609 48876 44848 -84902
11279A82179a51k63332i8969j17100A37924a50518B3492b45814f5755A22297e17665
$$ 182179 -151 -263483 -98969 -216069 137924 -150518 23492 -245814 -65755 122297 -517665
11267b03915j4434F0420J18307G450c5058l9267l52647a23432B13126b22798J04474
$$ -203915 -218349 60420 178727 7450 -35058 -74325 -426972 -123432 213126 -222798 -118324
11256a18324d6462o9874k16478J42063A4935a24925j23444j8697d9446k70674
$$ -118324 -46462 -116336 -332814 -190751 14935 -124925 -248369 -267066 -49446 -320120
11246c20120a57063A7503i3606m6833J3306M2658P391j86999B02476q1481K9664
$$ -320120 -157063 17503 -93606 -140439 -127133 -84475 -77084 -264083 202476 120995 150659
11235A50659c91888J66168C4981a54486O6994C18441e5251A08911c75794f2584
$$ 150659 -391888 -225720 34981 -154486 -87492 318441 -55251 108911 -375794 -62584
11224c45432F6807K2126k2568O3677B24a81056o7124E4137j4514a25304I9844
$$ -345432 66807 88933 66365 130042 224 -181056 -248180 54137 39623 -125304 99844
11212b91782R8674Q5322K3514o1557J7189A41025F2637K72698b78967f6490j0030
$$ -291782 -193108 -107786 -84272 -145829 -128640 141025 62637 335335 -278967 -66490 -76520
11201g6520j04850G8333a75438m1965Q8858b5573j46645n5750Q1316p1546F0640
$$ -76520 -181370 78333 -175438 -217403 -128545 -25573 -172218 -227968 -146652 -218198 60640
11189i4400j05761b6087B40510c1651j54161k09657R8312J12731Q8714m53696
$$ -94400 -200161 -26087 240510 -31651 -185812 -395469 -297157 -184426 -95712 -549408
11179e49408f2990l05699a2418B38099p1702d6158A1901L38631H0050f1938l6070
$$ -549408 -62990 -368689 -12418 238099 166397 -46158 11901 350532 80050 -61938 -98008
11168i8008a9336p8785A1663M7052K4929A5686h0049I4714J44649j03478M0582
$$ -98008 -19336 -98121 11663 58715 83644 15686 -80049 94714 239363 135885 176467
11157A76467b3873G5548r211h0618B53555a20410C6616O8480a85948g2624k2859
$$ 176467 -23873 75548 66337 -80618 253555 -120410 36616 105096 -185948 -72624 -95483
11146i5483a9040A36155a36390C54890B7290b86015C04463p1091a04763A51870
$$ -95483 -19040 136155 -136390 354890 27290 -286015 304463 233372 -104763 151870
11135C04194m647r4281m8219j0997l9645Q5203o4699J06914J20256A67763c9146
$$ 304194 299547 205266 157047 146050 106405 191608 126909 233823 354079 167763 -39146
11123e2032k9629D62904c067G4257f3217B83948c33001B86971c71417c2242k42321
$$ -52032 -81661 462904 -3067 74257 -63217 283948 -333001 286971 -371417 -32242 -274563
11112b74563A39228l5099a24989j81684a8238E0244K18567K15831d4419A7313
$$ -274563 139228 104129 -124989 -306673 -18238 50244 268811 484642 -44419 17313
11101A03841Q5218J51198A0744a85111G2942J18731G1901J59444r040H9659N6888
$$ 103841 189059 340257 10744 -185111 72942 191673 71901 231345 222305 89659 146547
11090A46547R203J04739J13372P4036j65356G3628K43139A34719Q2148K66340
$$ 146547 155750 260489 373861 447897 282541 73628 316767 134719 216867 483207
11080D83207j00201J1554A62376M2901N389Q4914F8811j4187L43099H6000K55079
$$ 483207 383006 394560 162376 205277 210666 295580 68811 54624 397723 86000 341079
11069C41079r2077A9487L84873H7340K59585K15217j55511j41822M7450J18737
$$ 341079 249002 19487 404360 87340 346925 562142 406631 264809 312259 430996
11059D30996J56646K2667k22451J48811J320o0450K38049k98590J75279L50863
$$ 430996 587642 610309 387858 536669 537989 477539 715588 416998 592277 943140
11049I43140p4008q6742k02822J01595K79608j99789L3650l453K9768q8801K1093
$$ 943140 869132 782390 579568 681163 960771 760982 794632 791179 820947 732146 753239
11038G53239l5714K37930k94105K02895K33290l47564k10715j35661O10001J16897
$$ 753239 717525 955455 661350 864245 1097535 749971 539256 403595 1013596 1130493
11028A130493k75556C25344L90431j93427K92189j63444O53052m80882p8210O8196
$$ 1130493 854937 325344 715775 522348 814537 651093 1304145 823263 745053 813249
11018H13249j20512K458k42163J91079B76653M73867J87217l23581L5002B32786
$$ 813249 692737 695195 453032 644111 276653 750520 937737 614156 649158 232786
11007F45666J96353n1147k68764J94407j78720J50692j8491P3014j18839K01513
$$ 645666 842019 790872 522108 716515 537795 688487 669996 743010 624171 825684
10997H25684k53097J77308q6741P4174J4547L28047m83124J22857C48408L87363
$$ 825684 572587 749895 663154 737328 751875 1079922 596798 719655 348408 735771
10987G35771K1537M6478J21858j7017M5568J33376j93748N69085k66423k68926
$$ 735771 757308 803786 925644 908627 954195 1087571 893823 1462908 1196485 927559
10977I27559J94567N07735j24722R3955K58885K72181M83667K88320k41881L98259
$$ 927559 1122126 1629861 1505139 1599094 1857979 2130160 2613827 2902147 2660266 3058525
10967C058525J5414m4905P6628l48542J40081o23913j09061r4825m22357r1306
$$ 3058525 3073939 3029034 3105662 2757120 2897201 2273288 2164227 2069402 1647045 1555739
10957A555739l3855j20223L9170M9432j98895J44028k5767k29099k05576m0202
$$ 1555739 1521884 1401661 1440831 1490263 1291368 1435396 1409629 1180530 974954 934752
10947I34752K3980k54521R5567l36562j08675R2050o1053J8793p2441A23915J89195
$$ 934752 958732 704211 799778 463216 354541 446591 385538 404331 331890 123915 313110
10936C13110A43814K68970f3063A69195p5115C4057K4388Q5892i9991c2492k32258
$$ 313110 143814 412784 -63063 169195 94080 34057 58445 144337 -99991 -32492 -264750
10925b64750B49738A967J41431F0838K54982D5476M0488a87457d178B25654b67411
$$ -264750 249738 1967 143398 60838 315820 45476 85964 -187457 -4178 225654 -267411
10913c12501a31481j24939O7765b6028B4276O6345l6337M6704N753c50690e354
$$ -312501 -131481 -256420 -188655 -26028 24276 90621 54284 100988 106741 -350690 -5354
10901a2056j49304k33871a27543C4306j6189Q4571c59591a40234N6097D83093
$$ -12056 -161360 -395231 -127543 34306 18117 102688 -359591 -140234 -84137 483093
10890a22584k6572A52403F6524a42430E1742R186J04174g0227F699a9039k22580
$$ -122584 -149156 152403 66524 -142430 51742 60928 165102 -70227 6699 -19039 -241619
10879b41619j8754a3407A5462O8632i0749I6345e7844j65221f2318A64660e5968
$$ -241619 -260373 -13407 15462 84094 -90749 96345 -57844 -223065 -62318 164660 -55968
10867i4798j4994l69994g7369j15316a6607k5072A77408b9080a1217l0180a2193
$$ -94798 -109792 -479786 -77369 -192685 -16607 -41679 177408 -29080 -11217 -41397 -12193
10855A98827c23014C08510i4694E5648Q7956n8857b9265m11241J25185A40436
$$ 198827 -323014 308510 -94694 55648 143604 84747 -29265 -440506 -315321 140436
10844a7517j6279B29747a24726A23306g2308k1522n3289A20238M8409b3876m9182
$$ -17517 -33796 229747 -124726 123306 -72308 -93830 -147119 120238 168647 -23876 -73058
10833g3058A54096d85101C10812a07885A55189b3202l28684J28453A7743O0070
$$ -73058 154096 -485101 310812 -107885 155189 -23202 -351886 -223433 17743 77813
10823G7813C7857a32344A9378e2688m6521A93019g7045C53516i0690q370H0861
$$ 77813 37857 -132344 19378 -52688 -99209 193019 -77045 353516 -90690 -99060 80861
10811C253Q6227c00374A71249C6448c43991j07251d0459O02A07669b23748f1545
$$ 3253 89480 -300374 171249 36448 -343991 -451242 -40459 -39857 107669 -223748 -61545
10799c2100a3017B83085a23n2247k70522i8465K4056A21240K15391g8420q8539
$$ -32100 -13017 283085 -123 -52370 -322892 -98465 -74409 121240 336631 -78420 -166959
10788a66959j18334a21237j13626B41396e4150A15837J02867a47188H3139k1354
$$ -166959 -285293 -121237 -234863 241396 -54150 115837 218704 -147188 83139 61785
10778F1785d09253D22514b82706J18170B2270J36418B5445e7635C14856b10644
$$ 61785 -409253 422514 -282706 -164536 22270 158688 25445 -57635 314856 -210644
10767f6944m2762n2723K6397d7721o2767j87518B49349I5695K3773k624g4631
$$ -66944 -109706 -162429 -136032 -47721 -110488 -298006 249349 95695 119468 116844 -74631
10755c32646h5997k10k6480k44242a44406B6482b81233C11548Q240b76192P2110
$$ -332646 -85997 -86207 -112687 -356929 -144406 26482 -281233 311548 319788 -276192 -204082
10744b04082A46269o594o1690a56185c639A57503B7996a88939B47768b26393j31701
$$ -204082 146269 139675 77985 -156185 -3639 157503 27996 -188939 247768 -226393 -358094
10733c58094B42385I6266m6468a25006r1407G7672m594h2145A22127b00427h8278
$$ -358094 242385 96266 49798 -125006 -216413 77672 73078 -82145 122127 -200427 -88278
10721b08659j38737e4058o8616n4572o9309c4724j03595H0310b25102m19M3497
$$ -208659 -347396 -54058 -122674 -177246 -246555 -34724 -138319 80310 -225102 -225521 -182024
10710a82024k3176O1936l4741A00006a5751q8512j34735B05771b29995j64793
$$ -182024 -205200 -143264 -178005 100006 -15751 -104263 -238998 205771 -229995 -394788
10700c94788a26035o8113e2393j45723J6933g6818c7393F1178M5015J16384B4230
$$ -394788 -126035 -194148 -52393 -198116 -181183 -76818 -37393 61178 106193 222577 24230
10688i3400d1773A82843b6351p8922A31565a90080B56140a36887B35385F9107
$$ -93400 -41773 182843 -26351 -105273 131565 -190080 256140 -136887 235385 69107
10677g6264I3026F811i619F800b04730O4919o8550R5543l76216C6693K53859a28689
$$ -76264 93026 6811 -9619 6800 -204730 -139811 -208361 -112818 -489034 36693 290552 -128689
10664i6461K6111k5847G8275K93101H8362c34756A62709e5667j87446f5670j05512
$$ -96461 -70350 -96197 78275 371376 88362 -334756 162709 -55667 -243113 -65670 -171182
10653a71182L9418j7443B81882a33056m0014A26601a68435B24929b52720B43126
$$ -171182 -131764 -149207 281882 -133056 -173070 126601 -168435 224929 -252720 243126
10642i3123B5507J7369G574b6325p6213p5098j40786a47450D48222f8784C3462
$$ -93123 25507 42876 7574 -26325 -102538 -177636 -318422 -147450 448222 -68784 33462
10630H392J26221c08065B63456c69792A64608k0737l7092o758l6565a45431K7932
$$ 8392 134613 -308065 263456 -369792 164608 143871 106779 100021 63456 -145431 -117499
10619a17499o5031M8801g246j18378l5114q7076N4628D468b71351j2159A78821
$$ -117499 -182530 -133729 -7246 -125624 -160738 -247814 -193186 4468 -271351 -283510 178821
10607i3649M2951A03507b93985R8664o1886A07045l7647b23119a7478r9180o6235
$$ -93649 -50698 103507 -293985 -195321 -257207 107045 69398 -223119 -17478 -116658 -182893
10596a82893N9772D1047b49155A44432e7315A37635b07829r8274n2115d3731k51174
$$ -182893 -123121 41047 -249155 144432 -57315 137635 -207829 -306103 -358218 -43731 -294905
10585b94905A11326N4874a1009B07409G69N0078c06028J13008l25437a62567H0714
$$ -294905 111326 166200 -11009 207409 769 50847 -306028 -193020 -518457 -162567 80714
10573A15432d5054A22145l8037J12095c09174J09128q1046G0222f8492A11267
$$ 115432 -45054 122145 84108 196203 -309174 -200046 -281092 70222 -68492 111267
10562b78452M2972a15108K9670B01323b49680O3456A89079a07537D01315b40194
$$ -278452 -235480 -115108 -85438 201323 -249680 -186224 189079 -107537 401315 -240194
10551A27966c7148M566A30643B8707p762a0m55863a77503o5392A12124O1977B8421
$$ 127966 -37148 -32582 130643 28707 20945 -10 -455873 -177503 -242895 112124 174101 28421
10538f4245a4696E4261M6314c93266a65325I3551g1913A9800L6756J87994I9112
$$ -64245 -14696 54261 100575 -393266 -165325 93551 -71913 19800 56556 244550 99112
10526b12101i1832J583K1029k1488I2354d5544j17161k1898i080I6378a72867
$$ -212101 -91832 -90249 -69220 -90708 92354 -45544 -162705 -184603 -9080 96378 -172867
10514c51796q1917D1505b2117j53590j42050r0730e7419r18j16360B4137J03396
$$ -351796 -433713 41505 -22117 -175707 -317757 -408487 -57419 -58337 -174697 24137 127533
10503A27533b23336E4872b77227P5215A27726a02634b766A99743b1424J50l48662
$$ 127533 -223336 54872 -277227 -202012 127726 -102634 -2766 199743 -21424 -21274 -369936
10492c69936a7803l6951C3045J69327b68095N6421I4621a4140l00231g0413R079
$$ -369936 -17803 -54754 33045 202372 -268095 -211674 94621 -14140 -314371 -70413 -61334
10481f1334A68447b2191j71741I6860L12777j60764J02239L8974D9424N6776b41225
$$ -61334 168447 -22191 -193932 96860 409637 248873 351112 390086 49424 106200 -241225
10469a91199C38641j61166f8437B1492b26248C79089I5384a56912B18835p818
$$ -191199 338641 177475 -68437 21492 -226248 379089 95384 -156912 218835 211017
10459B11017R7029a75456G2378e3862G9122b20600C081M7491a74015j22377D1989
$$ 211017 308046 -175456 72378 -53862 79122 -220600 3081 50572 -174015 -296392 41989
10447F0394P6781B9837R8159h7757c1983r5640q1470p0994J1162J11570r8737
$$ 60394 137175 29837 127996 -87757 -31983 -127623 -209093 -280087 -268925 -157355 -256092
10436b56092r6867e8443k3168B87743a49130L0685a3131B43237i1786C0560a93363
$$ -256092 -352959 -58443 -81611 287743 -149130 -118445 -13131 243237 -91786 30560 -193363
10424h7769C9849a84325l3654c6187q9638B09825R6526j41421c38026J67657j9854
$$ -87769 39849 -184325 -217979 -36187 -125825 209825 306351 164930 -338026 -170369 -190223
10413a90223O5022H4947a77134k7359E789e10056a38641r8626I9604a43575d0160
$$ -190223 -125201 84947 -177134 -204493 5789 -510056 -138641 -237267 99604 -143575 -40160
10401a89838e7004B5509L6250b1225o6203m9314o6778O7008E3189a9812G8204
$$ -189838 -57004 25509 61759 -21225 -87428 -136742 -203520 -136512 53189 -19812 78204
10389B74406b12254B19125m7202R5427D6883J0132f8903C372J09940A1507K6872
$$ 274406 -212254 219125 171923 267350 46883 57015 -68903 3372 113312 11507 38379
10378C8379A2050K00193R2394n9713P9274A58585L03897A9366J8175K13762J10159
$$ 38379 12050 212243 304637 244924 324198 158585 462482 19366 37541 251303 361462
10367C61462O3281o522j8129J01491J6696j16137K71212C11443j9765k2543K1943
$$ 361462 424743 418221 400092 501583 518279 402142 673354 311443 291678 269135 291078
10356B91078j45333n363j6555L20110j95126j04617Q6493M58995j64589R7037
$$ 291078 145745 140382 123827 443937 248811 144194 230687 689682 525093 622130
10346F22130B81916O184E3039L06984K439N0045j86034J79125E7393K4410J13585
$$ 622130 281916 288100 53039 360023 362462 412507 226473 405598 57393 81803 195388
10335A95388M31042k99797A38880P5568i3740C66905a1948C77471j20548E7542
$$ 195388 626430 326633 138880 214448 -93740 366905 -11948 377471 256923 57542
10324H2684K14705c3527D13971h9459I9853J87845q19J03089j63455e1695A57373
$$ 82684 297389 -33527 413971 -89459 99853 287698 286879 389968 226513 -51695 157373
10312D72082B34179g5960L6219D0572K98377A6911b13940g0273G1491b77933b9774
$$ 472082 234179 -75960 -39741 40572 338949 16911 -213940 -70273 71491 -277933 -29774
10300D37347B00910F1295f6821A61695n8905A8264K3679c6389B3273a48027A25827
$$ 437347 200910 61295 -66821 161695 102790 18264 41943 -36389 23273 -148027 125827
10288B8174J77634d8437D0451N4683C3151b35300B93810I388b89406l7990j9664
$$ 28174 205808 -48437 40451 95134 33151 -235300 293810 9388 -289406 -327396 -347060
10277c47060h3694K7606C89835G0516J38509a93475F4750a41756C29426f0118
$$ -347060 -83694 -56088 389835 70516 209025 -193475 64750 -141756 329426 -60118
10266b71996E3561c63710C51493E4201c28119i3753B16310g8720j3005C97129
$$ -271996 53561 -363710 351493 54201 -328119 -93753 216310 -78720 -91725 397129
10255C38595A61718K5852q0030L52574L005B30726j9774o7299E1612b55944A2210
$$ 338595 161718 187570 107540 460114 463119 230726 210952 143653 51612 -255944 12210
10243c136A36202a60863F865i7629C98185a27159D9029a63596A38953a1818j31957
$$ -3136 136202 -160863 6865 -97629 398185 -127159 49029 -163596 138953 -11818 -143775
10232a43775N1772k9492a5030A97713a71089l7444M6676A50170N8658a74097A39508
$$ -143775 -92003 -121495 -15030 197713 -171089 -208533 -161857 150170 208828 -174097 139508
10220g3742I4699a74012O6849o9422q6096H2984e8634E8398i9929K3037l29731
$$ -73742 94699 -174012 -107163 -176585 -262681 82984 -58634 58398 -99929 -76892 -406623
10209d06623c1742I752e539l83891J32414l1570b1299C49278c04738a11509q7228
$$ -406623 -31742 9752 -5539 -389430 -257016 -288586 -21299 349278 -304738 -111509 -198737
10198a98737M3486H8017d5674D859P6142a25923I095b9785B25556b77403B91300
$$ -198737 -155251 88017 -45674 4859 81001 -125923 9095 -29785 225556 -277403 291300
10186A02153e1052l10563F7034J134O3785B4063K8573L7088a9879A44905b55690
$$ 102153 -51052 -361615 67034 68168 131953 24063 52636 89724 -19879 144905 -255690
10174a07792G5429b51027d8047j54851P8444A16927k0560D0350J79469a3602k74631
$$ -107792 75429 -251027 -48047 -202898 -124454 116927 96367 40350 219819 -13602 -288233
10163b88233B33076b30638A91140a66581b9088j98413A33765a32866j72444A05330
$$ -288233 233076 -230638 191140 -166581 -29088 -227501 133765 -132866 -305310 105330
10152c15542m9854a09413j9200D6865b22252H3206a61478J3497K7269K0142k1464
$$ -315542 -365396 -109413 -128613 46865 -222252 83206 -161478 -147981 -120712 -100570 -122034
10141a22034k8828l9759c133j42511k94069H7155N8614B4748L46847h2719A4953
$$ -122034 -150862 -190621 -3133 -145644 -439713 87155 145769 24748 371595 -82719 14953
10129G1262A7814b33576A05317B8473i0645a1693j98036B6335h3835a2569j14194
$$ 71262 17814 -233576 105317 28473 -90645 -11693 -209729 26335 -83835 -12569 -126763
10118a26763m45081b82569d8090k84941o1024A60497g7800m4057A38353K6767
$$ -126763 -571844 -282569 -48090 -333031 -394055 160497 -77800 -121857 138353 165120
10108A65120d6138l40939A17090g9167k1050A62857N9765c33225a23890r8048
$$ 165120 -46138 -387077 117090 -79167 -100217 162857 222622 -333225 -123890 -221938
10098b21938D8780e7564j55091j08949J14770j78219M194B517d1645k42241J06772
$$ -221938 48780 -57564 -212655 -321604 -206834 -385053 -380859 2517 -41645 -283886 -177114
10087a77114h6775B66459j4971I1352b06616B9032a96980O2992k899B3944b64928
$$ -177114 -86775 266459 251488 91352 -206616 29032 -196980 -133988 -136887 23944 -264928
10075A43103a31850C6560i3527b7643k66088c1849q7550d8875D3015K85332D999
$$ 143103 -131850 36560 -93527 -27643 -293731 -31849 -119399 -48875 43015 328347 4999
10063b24659b5447j59973I9710B0327b81583N0275Q9660D4005O7749B8285M0837
$$ -224659 -25447 -185420 99710 20327 -281583 -231308 -141648 44005 111754 28285 69122
10052F9122a4990j65040L666B0318J81429b07073A22677d4726r9034b0218o1571
$$ 69122 -14990 -180030 -176364 20318 201747 -207073 122677 -44726 -143760 -20218 -81789
10041h1789j24363B5889g7683k06569a6655k81566a02013d7287m5110j11242B16360
$$ -81789 -206152 25889 -77683 -284252 -16655 -298221 -102013 -47287 -92397 -203639 216360
10029f7336n39640A87175D7946b37869A5364M25079a16130j9680B50968j03572
$$ -67336 -606976 187175 47946 -237869 15364 440443 -116130 -135810 250968 147396
10019A47396a71440A91896J31891c44006a29445A19021n8921a6762k33041A72069
$$ 147396 -171440 191896 323787 -344006 -129445 119021 60100 -16762 -249803 172069
10008b20608H1251d5687j37245B11840A2038a53068j28306O0321D2482a92195
$$ -220608 81251 -45687 -182932 211840 12038 -153068 -281374 -221053 42482 -192195
9997A06603N7741a06984a7668j82737A28841a47783P2479A81011a16986H4433
$$ 106603 164344 -106984 -17668 -200405 128841 -147783 -75304 181011 -116986 84433
9986E6528f0198C55067b2109A066a03118P818B5889J39328D7580M712a26027k63834
$$ 56528 -60198 355067 -22109 1066 -103118 -95300 25889 165217 47580 52292 -126027 -389861
9974c89861h387k8215j49508B17689b03543l3472A62587m2442d2671C127K7344
$$ -389861 -8387 -36602 -186110 217689 -203543 -237015 162587 120145 -42671 3127 30471
9963C0471a61115j01185e032j99502a02073B2283b06197B19371b14936a9509j3049
$$ 30471 -161115 -262300 -5032 -204534 -102073 22283 -206197 219371 -214936 -19509 -32558
9952c2558j40205d9038j6882j15276J7295e5960F1326a34568q1847J70N2854D9011
$$ -32558 -172763 -49038 -65920 -181196 -163901 -55960 61326 -134568 -216415 -216245 -163391 49011
9939a6063C80633b78319K4502K9659A70748a23142M5692A00517i2878j02237q5626
$$ -16063 380633 -278319 -253817 -224158 170748 -123142 -77450 100517 -92878 -195115 -280741
9928b80741a04413A01655a47118C6015O9990J10637a81037k659c4333j08018c1682
$$ -280741 -104413 101655 -147118 36015 106005 216642 -181037 -183696 -34333 -142351 -31682
9916b03966d0554q5825A2700a50272A54448a90750p4323b0387k06993A4693a9162
$$ -203966 -40554 -126379 12700 -150272 154448 -190750 -265073 -20387 -227380 14693 -19162
9904d8274j39606P4868k9956K514o3112r1917g0762j25936N7045r517P4518D9087
$$ -48274 -187880 -113012 -142968 -140454 -203566 -295483 -70762 -196698 -139653 -149170 -74652 49087
9891b85086r7235D5346b10093o7090A49336i428A62840b05504b6946k21872I7218
$$ -285086 -382321 45346 -210093 -277183 149336 -9428 162840 -205504 -26946 -248818 97218
9879a85057A75741p0564f1577B22013c33821a53271A22409c15653O3552A3364
$$ -185057 175741 105177 -61577 222013 -333821 -153271 122409 -315653 -252101 13364
9868h1891k4872L2863b9861j97423K9669b3677m70232d3458j73099a04267m2163
$$ -81891 -106763 -73900 -29861 -227284 -197615 -23677 -493909 -43458 -216557 -104267 -146430
9857a46430A37512a75717I8544D7563b21547d4300j2388j77060j19185A78341
$$ -146430 137512 -175717 98544 47563 -221547 -44300 -56688 -233748 -352933 178341
9846a42041p2638A783c13525a46314D504c40491n771a1959q678k63299Q1571d125
$$ -142041 -214679 1783 -313525 -146314 4504 -340491 -346262 -11959 -20637 -283936 -202365 -4125
9833F3425b79255O6888I6756b60812G4686c518B2220b27244j1869Q1067j07046
$$ 63425 -279255 -212367 96756 -260812 74686 -3518 22220 -227244 -239113 -158046 -265092
9822b65092A14733K1918L6442b53017F8963e7374l4522L3768j8839B67873g252
$$ -265092 114733 136651 173093 -253017 68963 -57374 -91896 -58128 -76967 267873 -7252
9810B0222f2637G2529k3909b38327r5957N7102a19410j38926J23882M8036C04367
$$ 20222 -62637 72529 48620 -238327 -334284 -277182 -119410 -258336 -134454 -86418 304367
9798A7274d5913B83182B1100a82013C43789A07847N2598a72875E9896a51509c5905
$$ 17274 -45913 283182 21100 -182013 343789 107847 160445 -172875 59896 -151509 -35905
9786A07179a34734F9168M9984G214c4272o6789C318L1726c26608a20222M797D7138
$$ 107179 -134734 69168 119152 7214 -34272 -101061 3318 35044 -326608 -120222 -115425 47138
9773d63092I2460h01B5778P1217b1879B06649I6439a26493j37872M4671f1272
$$ -463092 92460 -801 25778 96995 -21879 206649 96439 -126493 -264365 -219694 -61272
9761b61899a936D84322D6965b19266B9855C234c37340J28022F1623b3341q8991
$$ -261899 -1936 484322 46965 -219266 29855 3234 -337340 -209318 61623 -23341 -112332
9750a12332D20327a43855L4117B43386a60071A79861D3149c95214a19055m013
$$ -112332 420327 -143855 -109738 243386 -160071 179861 43149 -395214 -119055 -123068
9740a23068b1050B69685A01337b57323A56834N7639D6197a4352o454j60734N6253
$$ -123068 -21050 269685 101337 -257323 156834 214473 46197 -14352 -20806 -181540 -125287
9729a25287A39236K4759E353b71577b7433l24905N5102Q8831B45422a01727K4990
$$ -125287 139236 163995 5353 -271577 -27433 -352338 -297236 -208405 245422 -101727 -76737
9718g6737m2316m559l38019E8442M3968M0082n1646a02258L0099m8971N3668j58987
$$ -76737 -119053 -123612 -461631 58442 102410 142492 90846 -102258 -72159 -121130 -67462 -226449
9706b26449R9830I9541a50771N2908F493i4872I823a17593E7407P9192J4602c8174
$$ -226449 -126619 99541 -150771 -97863 6493 -94872 9823 -117593 57407 136599 151201 -38174
9693i6249A05762f3761D325c18092b0644o6321B75536a43450B136b19732k05278
$$ -96249 105762 -63761 4325 -318092 -20644 -86965 275536 -143450 2136 -219732 -425010
9682d25010I4461b8927j18558O3131K8794b3475C4216a5212F768O1683b57241
$$ -425010 94461 -28927 -147485 -84354 -55560 -23475 34216 -15212 6768 68451 -257241
9670h5059D3525a0516k3408E4924b35255O1776m6272B4441g020A888M7933J64858
$$ -85059 43525 -10516 -33924 54924 -235255 -173479 -219751 24441 -7020 1888 49821 214679
9658B14679p5121J7197F9058b50513E4933b99219C95754a3422l11823O7015j05084
$$ 214679 139558 156755 69058 -250513 54933 -299219 395754 -13422 -325245 -258230 -363314
9647c63314e5446j01340G9952b96741h9131D3371a47546J3012N3984j26285k94661
$$ -363314 -55446 -156786 79952 -296741 -89131 43371 -147546 -134534 -80550 -206835 -501496
9636e01496A58812b2626l00428p2625A35420J56976L9371A37481l6483a25555
$$ -501496 158812 -22626 -323054 -395679 135420 292396 331767 137481 100998 -125555
9625a46073g0768b6914A90374n0654K33906A76471C6143L525J23857a22786A62375
$$ -146073 -70768 -26914 190374 139720 373626 176471 36143 39668 163525 -122786 162375
9613E95650C4012h4815m6634A55248b38029g7595k6800Q255d0275p6714D6883
$$ 595650 34012 -84815 -131449 155248 -238029 -77595 -104395 -96140 -40275 -116989 46883
9601a64600b2013j24578o7219e5499r9850B94408h4802D1112c36579J24088d7850
$$ -164600 -22013 -146591 -213810 -55499 -155349 294408 -84802 41112 -336579 -212491 -47850
9589a29335B22384J32555c8471q2346A25916M690b84112j57231J69736C1848K49207
$$ -129335 222384 354939 -38471 -120817 125916 130606 -284112 -441343 -271607 31848 281055
9578B81055a03867o1651o9604G5232h9332A48486a4225m7356q5088B2408a09080
$$ 281055 -103867 -165518 -235122 75232 -89332 148486 -14225 -61581 -146669 22408 -109080
9566A03314B6637O9103a44389B59495g5124B57727g5530E6870M1536J49191k8598
$$ 103314 26637 95740 -144389 259495 -75124 257727 -75530 56870 98406 247597 218999
9555B18999c10600B8965N4741l3351b2842B02172k1095k3292b1658A70293b2208
$$ 218999 -310600 28965 83706 50355 -22842 202172 181077 157785 -21658 170293 -22208
9543i2309o0593l0289m856C45859b90662Q0284h2301A9144a31358A82290A6944
$$ -92309 -152902 -183191 -188047 345859 -290662 -210378 -82301 19144 -131358 182290 16944
9531a36505a195j77348Q8105G4136J72472b25775f0125C9886h0336m12735e4811
$$ -136505 -1195 -178543 -90438 74136 246608 -225775 -60125 39886 -80336 -493071 -54811
9519h5699j72694A46582b33172c7462m1229k7199L53q2115q9261A1194b65332
$$ -85699 -258393 146582 -233172 -37462 -78691 -105890 -105537 -187652 -276913 11194 -265332
9507C85291b98589R464O9720g1125B06368a01004A07104a05563k15100H6173a77248
$$ 385291 -298589 -289125 -219405 -71125 206368 -101004 107104 -105563 -320663 86173 -177248
9495I5477N6265B6097j917L58259b7917A20504J72873b01535A70624F1989g2069
$$ 95477 151742 26097 24180 382439 -27917 120504 293377 -201535 170624 61989 -72069
9483d8262l8771P173b4720j27570D2499b32543f3554b1916l38401h1645d0084
$$ -48262 -87033 -79860 -24720 -152290 42499 -232543 -63554 -21916 -360317 -81645 -40084
9471c00899e7361l10687B22001b62836D14g6783n963A12349a08121j395o8706
$$ -300899 -57361 -368048 222001 -262836 414 -76783 -82746 112349 -108121 -109516 -178222
9460a78222B03157a70774D335a05697j78198A69306a28874C6852e4507C9076b88878
$$ -178222 203157 -170774 4335 -105697 -283895 169306 -128874 36852 -54507 39076 -288878
9448C3329b18590K0602D8028a90283A67422E7632J7430d6606B18659d0097A95661
$$ 33329 -218590 -197988 48028 -190283 167422 57632 75062 -46606 218659 -40097 195661
9436e5096j11141f8981n1866M598j2862A36781a21891K9166B42572a53408j38708
$$ -55096 -166237 -68981 -120847 -116249 -129111 136781 -121891 -92725 242572 -153408 -292116
9425b92116j23622J50077h9382A64626e058j8935L762A63735E3132J31534D1314
$$ -292116 -415738 -265661 -89382 164626 -5058 -23993 -20231 163735 53132 184666 41314
9413C6971a24414A6148O3259a36856B9922b9251k16105k08635c3899A66661b78405
$$ 36971 -124414 16148 79407 -136856 29922 -29251 -245356 -453991 -33899 166661 -278405
9401a73670k70817g9104q0559j34155J39855G7051j4673J38717p150D0171c93269
$$ -173670 -444487 -79104 -159663 -293818 -153963 77051 62378 201095 193945 40171 -393269
9389b43772G1411d13311B45861B3745b0084A75125a70758J2580n4943A96567f849
$$ -243772 71411 -413311 245861 23745 -20084 175125 -170758 -158178 -213121 196567 -6849
9377a1736B7140P9906e0449n0565D5774b71299a33878j80207a34923C7975J75737
$$ -11736 27140 107046 -50449 -101014 45774 -271299 -133878 -314085 -134923 37975 213712
9366B13712G4126k4697e3057C9663d61099g0002A27061n329b13136M9858k18016
$$ 213712 74126 49429 -53057 39663 -461099 -70002 127061 121732 -213136 -163278 -381294
9355c81294a63752B19073f5236j90810L9862k21394B09515h8086A68321D2009
$$ -381294 -163752 219073 -65236 -256046 -216184 -437578 209515 -88086 168321 42009
9344a63709A66568a76375j15300q6336n9867a32604e5950B4774i6542k3019j50721
$$ -163709 166568 -176375 -291675 -378011 -437878 -132604 -55950 24774 -96542 -119561 -270282
9333b70282A23634a6494C58716b42976j1616O0581B58553g0319A45282B7895a25221
$$ -270282 123634 -16494 358716 -242976 -254592 -194011 258553 -70319 145282 27895 -125221
9321h498B01874E5030F512P451F848b3345j5100j23475e5941j18502G4709a64774
$$ -8498 201874 55030 6512 13963 6848 -23345 -38445 -161920 -55941 -174443 74709 -164774
9308G0182c67094i0762k5005G7313j9460b02007h0047l21076a53956K0628j35508
$$ 70182 -367094 -90762 -115767 77313 57853 -202007 -80047 -401123 -153956 -133328 -268836
9297b68836O2162O6425j5778O2263p5203K1200r2069A1147c38709a63854Q1395
$$ -268836 -206674 -140249 -156027 -93764 -168967 -147767 -239836 11147 -338709 -163854 -82459
9286h2459B9689b38371B2296h049A03789c20068e8509B9881b0712H801K14845
$$ -82459 29689 -238371 22296 -8049 103789 -320068 -58509 29881 -20712 8801 223646
9275B23646H4491a24550l08548A30259a20683J9293a3182j27413L1367l1893f0965
$$ 223646 84491 -124550 -433098 130259 -120683 -101390 -13182 -140595 -109228 -141121 -60965
9263d07311J77900l742P4046p5442E7636a66595j21955d6513E7326j4687l48K9320
$$ -407311 -229411 -233153 -159107 -234549 57636 -166595 -288550 -46513 57326 42639 42291 71611
9251G1611a77530k4150F546J86305a61130B5981R3101a92799d4429j2670A26299
$$ 71611 -177530 -201680 6546 192851 -161130 25981 119082 -192799 -44429 -57099 126299
9239A72152e9559r5936H2203b51192j87819N2971B8761J88325a04697j03073d4413
$$ 172152 -59559 -155495 82203 -251192 -439011 -386040 28761 217086 -104697 -207770 -44413
9227a94494d8403B5556d9510m8899k68769J65024A39972M6168p7041c02657A38459
$$ -194494 -48403 25556 -49510 -98409 -367178 -202154 139972 186140 109099 -302657 138459
9215f6890j03657L1523j21838B1731c59813a74970o1743n9047Q6093B18375b84149
$$ -66890 -170547 -139024 -260862 21731 -359813 -174970 -236713 -295760 -209667 218375 -284149
9203a45597m6801C5751a22169M5193P331a9784j90353b8631g208G041c82575b5284
$$ -145597 -192398 35751 -122169 -76976 -69645 -19784 -210137 -28631 -7208 7041 -382575 -25284
9190A944J02841K7619a36214j14793k31397D9946a57710P7645c0705A39682D1795
$$ 1944 104785 132404 -136214 -251007 -482404 49946 -157710 -80065 -30705 139682 41795
9178C50573A34298f7793p9085d8024o1804K4290A72437c4249j94872f8374D0855
$$ 350573 134298 -67793 -146878 -48024 -109828 -85538 172437 -34249 -229121 -68374 40855
9166c71715f7774j02019J8800f7994K1958F7920c01064k7328B6856B571K29255
$$ -371715 -67774 -169793 -150993 -67994 -46036 67920 -301064 -328392 26856 2571 231826
9155B31826F8954e1690J3613j06915a912l25019B1500B369a2993C1417K5931J83715
$$ 231826 68954 -51690 -38077 -144992 -1912 -326931 21500 2369 -12993 31417 57348 241063
9143B41063b84074C4028q462M74058A55004L0607G5172a71688A92671q473b97458
$$ 241063 -284074 34028 25566 499624 155004 185611 75172 -171688 192671 184198 -297458
9131E2279M6048j5352b63524d6063F527h5078j32767h6074o7260j55144r9963
$$ 52279 98327 82975 -263524 -46063 6527 -85078 -217845 -86074 -153334 -308478 -408441
9120d08441a98135B82481b51997B53541A16107A0218a8418m81358H6004J00107
$$ -408441 -198135 282481 -251997 253541 116107 10218 -18418 -499776 86004 186111
9110A86111a19509j08894A94666C3667m8K4217g5149j40635R224O352B02467a60252
$$ 186111 -119509 -228403 194666 33667 33619 57836 -75149 -215784 -206560 -200208 202467 -160252
9097A05096a2204k61467C5436c4444B14839c6475j46771m7361g9333h569B8469
$$ 105096 -12204 -273671 35436 -34444 214839 -36475 -183246 -230607 -79333 -8569 28469
9085A12561b85915p0810D8633a36585j63003J16315j8381o3591B03006l0380b64691
$$ 112561 -285915 -356725 48633 -136585 -299588 -183273 -201654 -265245 203006 172626 -264691
9073a59562b7336F21J93613F1513M8395c5928B52157c3376l09396j1706C00782
$$ -159562 -27336 621 194234 61513 109908 -35928 252157 -33376 -342772 -354478 300782
9061c19240e4724k88860B07212a98990F880A203g0568j03451A74750b10094A4146
$$ -319240 -54724 -343584 207212 -198990 6880 1203 -70568 -174019 174750 -210094 14146
9049d91346d0764p5768K3059k3914a0439A75482n4282b82181N9862i4309B25703
$$ -491346 -40764 -116532 -93473 -117387 -10439 175482 121200 -282181 -222319 -94309 225703
9037d19050H0539a59419B5263O161k526a92904N2224C80564I6090a39757E085
$$ -419050 80539 -159419 25263 31424 28898 -192904 -140680 380564 96090 -139757 5085
9025h9585j32162H4701D1212M9950a86883B4192h5591C32064b5641k42948A31686
$$ -89585 -221747 84701 41212 91162 -186883 24192 -85591 332064 -25641 -268589 131686
9013a11970f461p2260A22526g0103B16162g6525a813k83799c3270l8452b8350
$$ -111970 -6461 -78721 122526 -70103 216162 -76525 -1813 -285612 -33270 -71722 -28350
9001c75674A55900p4134c9143B41411H4361e3921G2646a74931a4685j46644k94234
$$ -375674 155900 81766 -39143 241411 84361 -53921 72646 -174931 -14685 -161329 -455563
8990d55563a18065r758B04802i5433k9381l7178n4290P6689c5377j54625f8913
$$ -455563 -118065 -127823 204802 -95433 -124814 -161992 -216282 -139593 -35377 -190002 -68913
8978B23084a23105B21563o772c4850n7758k18935A50687a579o8087A30488J07657
$$ 223084 -123105 221563 214791 -34850 -92608 -311543 150687 -1579 -69666 130488 238145
8967B38145b71699G7169K4261a72513e1401j20090h5554D46060D4120a84671f2924
$$ 238145 -271699 77169 101430 -172513 -51401 -171491 -85554 446060 44120 -184671 -62924
8955I4620a62733J2590q0770A37235a26129k80082I5013l1575c79042C94591a21464
$$ 94620 -162733 -150143 -230913 137235 -126129 -406211 95013 63438 -379042 394591 -121464
8943a36945c1073M541Q794j13324b1148m6551B25558b46740e4326A60787b1533
$$ -136945 -31073 -26532 -17738 -131062 -21148 -67699 225558 -246740 -54326 160787 -21533
8931D03310b32351G8769a20932F1003b81290c016D2853J86960J79292L08041J107270
$$ 403310 -232351 78769 -120932 61003 -281290 -3016 42853 229813 409105 717146 1824416
8920A824416L191567R279215D088182A383140F64223k99365a26894A81112A7900
$$ 1824416 5015983 14295198 4088182 1383140 664223 364858 -126894 181112 17900
8910b06525C20133a05969b7098F7230A4894L3580c14959A22520c43956f1376p5069
$$ -206525 320133 -105969 -27098 67230 14894 48474 -314959 122520 -343956 -61376 -136445
8899a36445H9968a24556B64286g5277A39236a52905k8004G7852f5830l12601J88380
$$ -136445 89968 -124556 264286 -75277 139236 -152905 -180909 77852 -65830 -378431 -190051
8888a90051h1766a43p0421K9751A29684b35964p2967A85176i3229j99995F6727
$$ -190051 -81766 -143 -70564 -40813 129684 -235964 -308931 185176 -93229 -293224 66727
8876a53670N2525j22975I7479J99491A9127e40326a46934e1620A59968g4114k08490
$$ -153670 -101145 -224120 97479 296970 19127 -540326 -146934 -51620 159968 -74114 -282604
$$ [...]
##END NTUPLES=NMR SPECTRUM
##END=
