
##TITLE=AC1327_PERAH12156_7163865_ym0b1Gj23m
##JCAMPDX= 6.0         $$ Bruker NMR JCAMP-DX V2.0
##DATA TYPE= NMR SPECTRUM
##DATA CLASS= NTUPLES
##ORIGIN= BRUKER
##OWNER= Administrator
$$ 1.72 TOPSPIN		Version 2.1
$$ 2013-01-29 20:55:19.496 -0500  Administrator@X
$$ Compression mode = diff/dup
##.OBSERVE FREQUENCY= 400.02188249412
##.OBSERVE NUCLEUS= ^1H
##.ACQUISITION MODE= SIMULTANEOUS (DQD)
##.ACQUISITION SCHEME= undefined
##.AVERAGES= 8
##.DIGITISER RES= 22
##SPECTROMETER/DATA SYSTEM= spect
##.PULSE SEQUENCE= zg30
##.SOLVENT NAME= COFFEE_meoh
##.SHIFT REFERENCE= INTERNAL, COFFEE_meoh, 1, 14.98509
##AUDIT TRAIL= $$ (NUMBER, WHEN, WHO, WHERE, PROCESS, VERSION, WHAT)
$$ ##TITLE= Audit trail, TOPSPIN		Version 2.1
$$ ##JCAMPDX= 5.01
$$ ##ORIGIN= Bruker BioSpin GmbH
$$ ##OWNER= Administrator
$$ $$ E:\/data/COFFEE/nmr/AC1327_PERAH12156_7163865_ym0b1Gj23m/20/pdata/1/auditp.txt
$$ ##AUDIT TRAIL=  $$ (NUMBER, WHEN, WHO, WHERE, PROCESS, VERSION, WHAT)
(   1,<2013-01-29 20:55:11.230 -0500>,<Administrator>,<X>,<go>,<TOPSPIN 2.1>,
      <created by zg
	started at 2013-01-29 20:54:04.839 -0500,
	POWCHK enabled, PULCHK disabled,
       configuration hash MD5:
       86 BA 57 50 F2 9D 5C 9B 26 00 A9 28 5F 66 2E 89
       data hash MD5: 64K
       5C 91 A3 E5 CB AD 78 9D 10 65 C5 50 46 2B DA A7>)
(   2,<2013-01-29 20:55:14.308 -0500>,<Administrator>,<X>,<proc1d>,<TOPSPIN 2.1>,
      <Start of raw data processing
       efp LB = 0 FT_mod = 6 PKNL = 1 PHC0 = 0 PHC1 = 0 SI = 32K 
       data hash MD5: 32K
       59 12 E1 F9 B5 FB 1A 47 3A 4B 83 4A 9A 74 77 B0>)
(   3,<2013-01-29 20:55:14.808 -0500>,<Administrator>,<X>,<proc1d>,<TOPSPIN 2.1>,
      <pk PHC0 = 100.415 PHC1 = 0 
       data hash MD5: 32K
       AF 53 CD 5C 8B A1 88 C8 0C 52 B2 A6 9F 77 0E 4B>)
(   4,<2013-01-29 20:55:15.027 -0500>,<Administrator>,<X>,<proc1d>,<TOPSPIN 2.1>,
      <abs ABSG = 1 
       data hash MD5: 32K
       14 81 94 68 28 D7 57 A0 20 E0 68 1E A8 6F E8 12>)
(   5,<2013-01-29 20:55:15.199 -0500>,<Administrator>,<X>,<proc1d>,<TOPSPIN 2.1>,
      <abs ABSG = 2 
       data hash MD5: 32K
       FE FF 1C A8 A8 E8 5D 53 9B B5 79 F3 71 A8 71 64>)
(   6,<2013-01-29 20:55:15.339 -0500>,<Administrator>,<X>,<proc1d>,<TOPSPIN 2.1>,
      <abs ABSG = 3 
       data hash MD5: 32K
       59 7D A0 89 62 F3 17 7E 9E 29 0A 41 3A D1 23 01>)
(   7,<2013-01-29 20:55:15.480 -0500>,<Administrator>,<X>,<proc1d>,<TOPSPIN 2.1>,
      <abs ABSG = 4 
       data hash MD5: 32K
       F1 92 26 DD 75 56 62 5F 83 4C 89 0A 29 CB 82 FE>)
(   8,<2013-01-29 20:55:15.621 -0500>,<Administrator>,<X>,<proc1d>,<TOPSPIN 2.1>,
      <abs ABSG = 5 
       data hash MD5: 32K
       C4 CF 8E 19 C0 0A 9B 90 21 85 42 95 7C A6 49 4B>)
$$ ##END=
$$ 
$$ $$ hash MD5
$$ $$ 18 76 D4 A0 BF 30 DC 57 6A 14 5B DC 05 8B 22 87
##$RELAX= 
##$RELAX= 
##$RELAX= 
##$RELAX= 
##$RELAX= 
##$RELAX= 
##$RELAX= 
$$ Bruker specific parameters
$$ --------------------------
##$DU= <E:\>
##$EXPNO= 20
##$NAME= <AC1327_PERAH12156_7163865_ym0b1Gj23m>
$$ [...]
##$TP= (0..7)
150 150 150 150 150 150 150 150
##$TP07= 0
##$TPNAME0= <>
##$TPNAME1= <>
##$TPNAME2= <>
##$TPNAME3= <>
##$TPNAME4= <>
##$TPNAME5= <>
##$TPNAME6= <>
##$TPNAME7= <>
##$TPOAL= (0..7)
0.5 0.5 0.5 0.5 0.5 0.5 0.5 0.5
##$TPOFFS= (0..7)
0 0 0 0 0 0 0 0
##$TUNHIN= 0
##$TUNHOUT= 0
##$TUNXOUT= 0
##$USERA1= <user>
##$USERA2= <user>
##$USERA3= <user>
##$USERA4= <user>
##$USERA5= <user>
##$V9= 5
##$VALIST= <valist>
##$VCLIST= <CCCCCCCCCCCCCCC>
##$VD= 0
##$VDLIST= <DDDDDDDDDDDDDDD>
##$VPLIST= <PPPPPPPPPPPPPPP>
##$VTLIST= <TTTTTTTTTTTTTTT>
##$WBST= 1024
##$WBSW= 4
##$XGAIN= (0..3)
0 0 0 0
##$XL= 0
##$YL= 0
##$YMAX_a= 609023
##$YMIN_a= -515234
##$ZGOPTNS= <>
##$ZL1= 120
##$ZL2= 120
##$ZL3= 120
##$ZL4= 120
##$ABSF1= 14.98509
##$ABSF2= -5.573092
##$ABSG= 5
##$ABSL= 3
##$ALPHA= 0
##$AQORDER= 0
##$ASSFAC= 0
##$ASSFACI= 0
##$ASSFACX= 0
##$ASSWID= 0
##$AUNMP= <proc_prof1d_extract_pilot.lims>
##$AXLEFT= 0
##$AXNAME= <>
##$AXNUC= <1H>
##$AXRIGHT= 0
##$AXTYPE= 0
##$AXUNIT= <>
##$AZFE= 0.1
##$AZFW= 0.1
##$BCFW= 0
##$BC_mod= 0
##$BYTORDP= 0
##$COROFFS= 0
##$CY= 15
##$DATMOD= 1
##$DC= 0
##$DFILT= <>
##$DTYPP= 0
##$F1P= 0
##$F2P= 0
##$FCOR= 0.5
##$FTSIZE= 32768
##$FT_mod= 6
##$GAMMA= 0
##$GB= 0
##$INTBC= 1
##$INTSCL= 1
##$ISEN= 128
##$LB= 0
##$LEV0= 0
##$LPBIN= 0
##$MAXI= 10000
##$MC2= 0
##$MEAN= 0
##$ME_mod= 0
##$MI= 0
##$NCOEF= 0
##$NC_proc= -8
##$NLEV= 6
##$NOISF1= 0
##$NOISF2= 0
##$NSP= 0
##$NTH_PI= 0
##$NZP= 0
##$OFFSET= 14.98509
##$PC= 1
##$PHC0= 100.415
##$PHC1= 0
##$PH_mod= 1
##$PKNL= yes
##$PPARMOD= 0
##$PPDIAG= 0
##$PPIPTYP= 0
##$PPMPNUM= 2147483647
##$PPRESOL= 1
##$PSCAL= 4
##$PSIGN= 0
##$PYNMP= <proc.py>
##$REVERSE= no
##$SF= 400.02
##$SI= 32768
##$SIGF1= 0
##$SIGF2= 0
##$SINO= 400
##$SIOLD= 32768
##$SPECTYP= <>
##$SREGLST= <1H.CDCl3>
##$SSB= 0
##$STSI= 32768
##$STSR= 0
##$SW_p= 8223.68421052631
##$SYMM= 0
##$S_DEV= 0
##$TDeff= 65536
##$TDoff= 0
##$TI= <>
##$TILT= no
##$TM1= 0
##$TM2= 0
##$TOPLEV= 0
##$USERP1= <user>
##$USERP2= <user>
##$USERP3= <user>
##$USERP4= <user>
##$USERP5= <user>
##$WDW= 1
##$XDIM= 32768
##$YMAX_p= 454598076
##$YMIN_p= -711667
##$CURPLOT= <Network HP LaserJet P1505>
##$CURPRIN= <$Network HP LaserJet P1505>
##$DFORMAT= <normdp>
##$LAYOUT= <+/1D_H.xwp>
##$LFORMAT= <normlp>
##$PFORMAT= <normpl>
##$SURQMSG= 1
$$ End of Bruker specific parameters
$$ ---------------------------------
##NTUPLES= NMR SPECTRUM
##VAR_NAME=  FREQUENCY,     SPECTRUM/REAL,   SPECTRUM/IMAG
##SYMBOL=    X,             R,               I
##VAR_TYPE=  INDEPENDENT,   DEPENDENT,       DEPENDENT
##VAR_FORM=  AFFN,          ASDF,            ASDF
##VAR_DIM=   32768,         32768,           32768
##UNITS=     HZ,            ARBITRARY UNITS, ARBITRARY UNITS
##FACTOR=    0.250966925370066, 1,           1
##FIRST=     8223.43324360094, 21354,        25096
##LAST=      0,             -45917,          -118392
##MIN=       0,             -711667,         0
##MAX=       8223.43324360094, 454598076,    0
$$ Real data points
##PAGE= N=1
##DATA TABLE= (X++(R..R)), XYDATA
$$ [...]
19530a59381r4710L2321A09813b65632c1593R429A57615a22785k18937D2962N9432
19519A02394A0141O5001c4611n3449K3968k88396a57129B32077b45442g1822m19439
19508d91261d5789j58078R6509A23891A262M6739K24130c10451C2610g0339G3334
19496C39125C7824M376a08735j6522C4479a98229g5668m975q3970O1288L3042
19485g0283A06833a96954B47793a69338A238a38075j51395D7735a31302M3336
19475h7966p6961A35764j4239l1167i8582j29963A81683Q6636b04356j71037A72526
19463A4524a38802k52136f3536j48301E3291K36319g4069G3688a04896M2656l15024
19452c77264A7727K2169f6075l95257K12870k2471D5756c57503A9841L2242K2955
$$ y = [-159381, -254091, -221770, 109813, -265632, -31593, -22164, 157615, -122785, -341722, 42962, 102394, 10141, 75142, -34611, -88060, -64092, -352488, -157129, 232077, -245442, -71822, -491261, -45789, -203867, -107358, 123891, 1262, 48001, 272131, -310451, 32610, -70339, 73334, 339125, 37824, 42200, -108735, -125257, 34479, -198229, -75668, -80643, -164613, -103325, -70283, 106833, -196954, 247793, -169338, 1238, -138075, -289470, 47735, -131302, -87966, -164927, 135764, 121525, 90358, -98582, -228545, 181683, 268319, -204356, -375393, 172526, 14524, -138802, -390938, -63536, -211837, 53291, 289610, -74069, 73688, -104896, -62240, -377264, 17727, 39896, -66075, -461332, -248462, -270933, 45756, -357503, 19841, 52083, 75038]
19441G5038b91287a23703e3858n2193q341I1555a0066l21141a04397I8290c28066
19429a65899A34425F2091a87157j9273E3685R8J5986b73528B02986i9298C3119
19417c05817h2918A97647d66188a02880A43763J2146d63711B7982a14634a7600
19406c74129O4283D4771a89494P7317k64853J85288f039m0591k18529R8379d6812
19394c26274A09306g8836m8685A6413e484q3573o9790n9836K7625p0026Q820h8660
19381b53234J01473m1830k87843B104a55665C74964c55560J73542p6872A46605
19370A53958A5701b34143A19454b52208i7228A53554f3905C07816b00103l5111
19360b35214h8370c6307B38476a08848C6457c78458J71519C5076a12818A50101
$$ y = [75038, -291287, -123703, -53858, -106051, -114392, 91555, -10066, -331207, -104397, 98290, -328066, -165899, 134425, 62091, -187157, -206430, 53685, 53783, 69769, -273528, 202986, -99298, 33119, -305817, -82918, 197647, -466188, -102880, 143763, 155909, -463711, 27982, -114634, -17600, -374129, -309846, 44771, -189494, -112177, -377030, -191742, -6039, -46630, -265159, -166780, -46812, -326274, 109306, -78836, -127521, 16413, -5484, -89057, -158847, -218683, -191058, -261084, -252264, -88660, -253234, -151761, -193591, -481434, 2104, -155665, 374964, -355560, -182018, -258890, 146605, 153958, 15701, -234143, 119454, -252208, -97228, 153554, -63905, 307816, -200103, -235214, -88370, -36307, 238476, -108848, 36457, -378458, -206939, 35076, -112818, 150101]
19349a2214E3206e24299D78a13016j68807c0166A37914F6457b86534a29200A07603
19337B65440a51189q3769h5466A55299C9015c4597m0094r6319C049P0073a30125
19325b1081j08548A20603f2266A0796Q6531D0803a0669C45312a20947K6407D0978
19313e1327j92948d4213j34234n0962e8865B6267d31688D1475K75A5237a31693
19301D7283b12152j76245B83152F4420J23742f73165b14601A32967i5034F6693
19290A96122c47734A40253A702c96678h6862j52440N670g8269A73512A8403a65382
19278A16239b85965L6604H8801a2134k124F0507K32362a79552Q3654O860p3404
19267a62442e1994j41654L1053b4462I9458h2825N303m7232q1505E7619J95120
$$ y = [-12214, 53206, -524299, 478, -113016, -281823, -30166, 137914, 66457, -286534, -129200, 107603, 265440, -151189, -234958, -85466, 155299, 39015, -34597, -74691, -171010, 3049, 73122, -130125, -21081, -129629, 120603, -62266, 10796, 97327, 40803, -10669, 345312, -120947, -94540, 40978, -51327, -244275, -44213, -178447, -229409, -58865, 26267, -431688, 41475, 41750, 15237, -131693, 47283, -212152, -388397, 283152, 64420, 188162, -673165, -214601, 132967, -95034, 66693, 196122, -347734, 140253, 1702, -396678, -86862, -239302, -233632, -78269, 173512, 18403, -165382, 116239, -285965, -249361, 88801, -12134, -14258, 60507, 292869, -179552, -95898, -89038, -162442, -51994, -193648, -162595, -24462, 99458, -82825, -77522, -124754, -206259, 57619, 252739]
19256B52739C2456b16231h8767H6126b58292e526E5792c0890G7862i738C290P6546
19244G9836a77142K0287K4358f2730m6426J9992A85794c98238A00573m1893c48811
19232b9063j83816a0331r413k42354h9350c6152k15726b563j37122A26630f3853
19220C8748b67783A6739a44610K5883q9369m468R5706J1914L5494H789c13750
19208A25392a0265C6573a18579j68196a08431A12235g2185k26362B04047J22426
19198C26473e22317b17999g3308B5749c88526o1210a61092j05283A85131g4704
19187a26765k32987B480N3586J42768i5827I1838c2904A69277d6449C1149a95936
19175e5410k41530J48156K2224j03982f4041A13552a11649F3196b73642H9104
$$ y = [252739, 32456, -216231, -88767, 86126, -258292, -5526, 55792, -30890, 77862, -9738, 3290, 79836, -177142, -156855, -132497, -62730, -109156, -89164, 185794, -398238, 100573, 58680, -348811, -29063, -212879, -10331, -19744, -262098, -89350, -36152, -251878, -2563, -139685, 126630, -63853, 38748, -267783, 16739, -144610, -118727, -208096, -212564, -116858, -104944, -69450, 8789, -313750, 125392, -10265, 36573, -118579, -286775, -108431, 112235, -72185, -298547, 204047, 326473, -522317, -217999, -73308, 25749, -388526, -449736, -161092, -266375, 185131, -74704, -126765, -359752, 2480, 56066, 198834, -95827, 91838, -32904, 169277, -46449, 31149, -195936, -55410, -296940, -148784, -126560, -230542, -64041, 113552, -111649, 63196, -273642, 89104]
19164B37060a39705d2075B1918e4950o112j31330I5984B9534e3350j2175B42051
19152B72790b63821k1994A93352n8435E7324B5573d22544a09312A3620h0295B14181
19140c56399g7439l5247C20219d3495l5153k6125r5890O9614B21943A0566a1533
19128a59974k33750f172m34B94646A5128J77316E3996c73397d3683l3408H5598
19116h1924A35371A8151a50624c3331H0521h4307j7680j6835B7349K4670d60516
19104f3232j76689F1458a86522B91868a42103a2042o9923L9130P733A25764g5964
19092a27514M9248b2606j72811M2009C10699d30038A62721a82185M1663C1752
19081f083A99915I1596a30769d8489A04804f5960F2461e4962E5653a04421A49916
$$ y = [237060, -139705, -42075, 21918, -54950, -61062, -192392, 95984, 29534, -53350, -65525, 242051, 272790, -263821, -285815, 193352, 134917, 57324, 25573, -422544, -109312, 13620, -80295, 214181, -356399, -77439, -112686, 320219, -43495, -78648, -104773, -200663, -131049, 221943, 10566, -11533, -159974, -393724, -6172, -6606, 294646, 15128, 192444, 53996, -373397, -43683, -77091, 85598, -81924, 135371, 18151, -150624, -33331, 80521, -84307, -101987, -118822, 27349, 52019, -460516, -63232, -239921, 61458, -186522, 291868, -142103, -12042, -81965, -42835, -35102, 125764, -75964, -127514, -78266, -22606, -195417, -153408, 310699, -430038, 162721, -182185, -140522, 31752, -6083, 199915, 91596, -130769, -48489, 104804, -65960, 62461, -54962, 55653, -104421, 149916]
19069F3209a42089j20984f9551K772n2797j70905A6255c6724C4947a17080a4504
19057A0798J47312b0801j28670j06388h3037d753j57487B23230G0976i2093A60007
19045c0885j3836k01456a4311j59675Q1677b596j59333C975f7915a2638B12684
19033a18996e142j92366k44793J62440J5297B5533J4936e1126F4946b2683m5833
19022f8516C2390a22296A98849b81759B70139e9553j88885e738j05436b9679j85011
19011b14690B27462J60558C5695A5937J57892N429a47487K2857A28662a79830
19000a83583a8891E5188K07487g8661l0225k11691r6074g8721j53913B08318b10096
18988h3744o4817q3507A22052a72999j44524C09142D7557c37702B11693r9670
$$ y = [63209, -142089, -263073, -69551, -66779, -119576, -290481, 16255, -36724, 34947, -117080, -14504, 10798, 158110, -20801, -149471, -255859, -83037, -4753, -162240, 223230, 70976, -92093, 160007, -30885, -44721, -246177, -14311, -173986, -92309, -2596, -161929, 3975, -67915, -12638, 212684, -118996, -5142, -197508, -442301, -279861, -264564, 25533, 40469, -51126, 64946, -22683, -68516, 32390, -122296, 198849, -281759, 270139, -59553, -248438, -5738, -111174, -29679, -214690, 227462, 388020, 35695, 15937, 173829, 179258, -147487, -124630, 128662, -179830, -183583, -18891, 55188, 262675, -78661, -108886, -320577, -416651, -78721, -232634, 208318, -210096, -83744, -148561, -232068, 122052, -172999, -317523, 309142, 47557, -337702, 211693, 112023]
18978A12023A2510b79929H7944i1063c9239D4396a8064C95978L29593A36595l6997
18967I9598g2917B3334K4315b50702q93F4500e0974E3690J20720a67072B02906
18955c8388k1747j67141E3740f5586E2863j1442N7141a71025j0272A21799a93790
18943A69674A6598a58555j19739A31221b4788C27141I9536b73654k0942a25892
18932E6981d2278A6291a56872L8960l02922J63485f4117A56971e30350b28037
18921A4038b06776O2318b3611H5058M2302F3527a47553M4504B73169b1676M820
18910a6856B04901a15668E00841o5041K63112A74946C4057a12930J557B39740
18899C75948a29950l1758P3283B5512a2682A49313c2550A43491h9733j16562a02507
$$ y = [112023, 12510, -279929, 87944, -91063, -39239, 44396, -18064, 395978, 725571, 136595, 99598, -72917, 23334, 47649, -250702, -251595, 64500, -50974, 53690, 174410, -167072, 202906, -38388, -60135, -227276, 53740, -65586, 52863, 41421, 98562, -171025, -181297, 121799, -193790, 169674, 16598, -158555, -278294, 131221, -24788, 327141, 99536, -273654, -294596, -125892, 56981, -42278, 16291, -156872, -117912, -420834, -257349, -64117, 156971, -530350, -228037, 14038, -206776, -144458, -23611, 85058, 127360, 63527, -147553, -103049, 273169, -21676, -16856, 204901, -115668, 500841, 435800, 698912, 174946, 34057, -112930, -111373, 239740, 375948, -129950, -161708, -88425, 25512, -12682, 149313, -32550, 143491, -89733, -206295, -102507]
18887A36081b68471J28405a4676I0190m3163a61627A4861J5936a65929R588k2945
18876a79286H8095M4692b29589A76732e1677B56369d4910j82494R0512D2825b35141
18864a35245A50720Q1346A11364Q0654A1429l307DJ4231a3094G7521b4571A08073
18851d59420g4843b9214j84349I6081a67454A02715a92661B17940F8552h1297
18840c3174A94238b6254j46337A41793n7298a13370J8639o4193E4425b74200P2433
18829b01767j62563h0200B67954b1593A60552a90871j0370G536K9340L4465b35232
18817b17158E6414A9332N9829K01923D2888Q1859a86605H8745J17541a57880j01129
18806b59009F9518J1894J33543a74999I6226a36733E3028d9530j50427h9639c996
$$ y = [136081, -268471, -140066, -14676, 90190, 47027, -161627, 14861, 30797, -165929, -156341, -179286, 88095, 132787, -229589, 176732, -51677, 256369, -44910, -227404, -136892, 42825, -235141, -135245, 150720, 232066, 111364, 192018, 11429, 8122, 4, 14235, -13094, 77521, -24571, 108073, -459420, -74843, -29214, -213563, 96081, -167454, 102715, -192661, 217940, 68552, -81297, -33174, 194238, -26254, -172591, 141793, 84495, -113370, -94731, -158924, 54425, -274200, -201767, -364330, -80200, 267954, -21593, 160552, -190871, -201241, 7536, 36876, 71341, -235232, -217158, 56414, 19332, 79161, 281084, 42888, 124747, -186605, 88745, 206286, -157880, -259009, 69518, 81412, 214955, -174999, 96226, -136733, 53028, -49530, -199957, -89639, -3996]
18794I4174D0512L07360a22023L5136J9898j63566B18632H6438c8200C1611j3729
18783A7882a35885A69888b01125C6026N9048l3865d39107C40402a05220q710K9428
18772h4502K0716I9266b45522D7619c35444N622Q6004b6178E0898R1491c13837
18760B64814e7669O583C783L35983A30750N2183a35190M868q0864P1230n4602
18749a94558B27168a5948C5670b48416e3232H3935R8191a24235I4634a40634A63871
18737c13301j224J25078c1064j36309k1877E3396e6531j81000r1665A2535d61262
18725B20084b39186g4620m1326E547J9161K44343l9946d27883h138k174B21722
18713d4496J5854m8242N019B39814d6179k43623A75506p5619c4251C925c29175
$$ y = [94174, 40512, 347872, -122023, -86887, -66989, -230555, 218632, 86438, -38200, 31611, 17882, -135885, 169888, -201125, 36026, 95074, 61209, -439107, 340402, -105220, -113930, -84502, -63786, 99266, -245522, 47619, -335444, -329822, -243818, -26178, 50898, 142389, -313837, 264814, -57669, -51086, 3783, 339766, 130750, 182933, -135190, -130322, -211186, -139956, -194558, 227168, -15948, 35670, -248416, -53232, 83935, 182126, -124235, 94634, -140634, 163871, -313301, -314525, -189447, -31064, -167373, -189250, 53396, -56531, -237531, -329196, 12535, -461262, 220084, -239186, -74620, -115946, 5547, 24708, 269051, 229105, -427883, -8138, -10312, 221722, -44496, -28642, -76884, -71865, 239814, -46179, -289802, 175506, 99887, -34251, 3925, -329175]
18701g7082q0341b7620r1403B4390Q0332D2131D532c04369B76693J5662a75299
18689d1521p691j24012b2266j28375N3063m3525d2123G2354B3247L1322K24476
18678B79045A01869g8704j05059a9701F7223E50b21593E348J44852d84597J14741
18667c69856I19h8994C5261M1991e6206A0847N9518e6960j27036j48237A12224
18655a07504e1458q3205o3610m1165a01624j10339A09139E3016O776i2593O762
18644h5831E5360b25946J10400j19574a8829k53605a23622K9039A34422d9967
18633a65981A7736Q5302a9574B58063J9330a70425j14534R8890L454g0556k38132
18622c08688f9583p1671q538A52379a63594M0159B2484F127Q9909K24568H4054
$$ y = [-77082, -157423, -27620, -119023, 24390, 104722, 42131, 4532, -304369, 276693, 292355, -175299, -41521, -49212, -173224, -22266, -150641, -97578, -141103, -42123, 72354, 23247, 54569, 279045, 101869, -78704, -183763, -19701, 67223, 550, -221593, 5348, 150200, -484597, -369856, 919, -88994, 35261, 77252, -56206, 10847, 70365, -56960, -183996, -332233, 112224, -107504, -51458, -134663, -198273, -239438, -101624, -211963, 109139, 53016, 59792, -92593, -85831, 55360, -225946, -115546, -235120, -18829, -272434, -123622, -94583, 134422, -49967, -165981, 17736, 103038, -19574, 258063, 277393, -170425, -284959, -186069, -182615, -70556, -308688, -69583, -141254, -149792, 152379, -163594, -123435, 22484, 6127, 96036, 320604, 84054]
18610c29485f6986j44875I7010a03807d8809p7538a2767j64353f8938A54184a3870
18598g1763j43248i9772B22425a40232G0834a47634a7834j53625B05709a90755
18587c12919J0798J46937m1719C7211P4532B3127a06744E6966K3046a67102A40635
18575F2672i2093D8741b6545k39409b4682q7338B3034b62546A24070n462E2306
18563B10490c24767G1149c327k49085N3454B553J10460K5950P2421q4043L0717
18552A58058c0606R811j98988O7622c303j86995Q1724k75808R7274a27601C52005
18540i5410G532J68490G8518k9807c5712C46944a92078L0230J5614L2403J7079
18529i6752j74821A80892o5830g4624A53672a31690b1697C17878A06836M9703
$$ y = [-329485, -66986, -211861, 97010, -103807, -48809, -126347, -12767, -177120, -68938, 154184, -13870, -71763, -215011, -99772, 222425, -140232, 70834, -147634, -17834, -171459, 205709, -190755, -312919, -302121, -155184, -196903, 37211, 111743, 23127, -106744, 56966, 80012, -167102, 140635, 62672, -92093, 48741, -26545, -265954, -24682, -112020, 23034, -262546, 124070, 118608, 52306, 210490, -324767, 71149, -3327, -252412, -198958, 2553, 113013, 138963, 211384, 127341, 158058, -30606, -20795, -219783, -152161, -3303, -190298, -108574, -384382, -287108, -127601, 352005, -95410, 7532, 176022, 78518, 48711, -35712, 346944, -192078, -161848, -146234, -113831, -96752, -271573, 180892, 115062, -74624, 153672, -131690, -21697, 317878, 106836, 156539]
18519A56539d91183C5413c1734k4108k83744E8108b51214h3532j01036C31803
18508a45276B019h4063A08571B1548b13946B20038a36384m8666A68540h6514l46414
18497d32928b8941C32838B6188a91679r8136i7488d070H8678a04423E388Q4492
18486H9880b85940j4105A35440K1485d7833l2369C91257D3006b96975B35848b31135
18474B60454b2505l18787B6108M20091g8259j89024A82140b49670j06891a31430
18463A19237d46599i0550j04593n1930K9511D6470J13900r294G1567b74920C94039
18451b728j08722c9669j7188m14350K25159p7381J52204E6322J30056a70136g8997
18439B8073b2704j48538K7640j32910a24598A49537a11018C1453j2459b62092
$$ y = [156539, -491183, 35413, -31734, -55842, -339586, 58108, -251214, -83532, -184568, 331803, -145276, 2019, -84063, 108571, 21548, -213946, 220038, -136384, -185050, 168540, -86514, -432928, -28941, 332838, 26188, -191679, -289815, -97488, -4070, 88678, -104423, 5388, 89880, -285940, -300045, 135440, 156925, -47833, -80202, 391257, 43006, -296975, 235848, -231135, 260454, -22505, -341292, 26108, 446199, -78259, -267283, 182140, -249670, -356561, -131430, 119237, -446599, -90550, -195143, -247073, -217562, 46470, 160370, 151076, 71567, -274920, 394039, -2728, -111450, -39669, -56857, -471207, -246048, -323429, -171225, 56322, 186378, -170136, -78997, 28073, -22704, -171242, -143602, -276512, -124598, 149537, -111018, 31453, 18994, -262092]
18428d8921K4212E2669a79435P5135n5359B98237g742j79476f4537A08876a33071
18416f1339A3523i5661J0197A49924E1461b64445a15525I9822M7080F7266J55482
18405B22748A5746J16340a26073d8242A1898J56295q1411b32423A80166A9979
18394b32392A92503K38743b4630j43345N3334B33880A00601L4646k7894c9790
18383B159f6487E7713K73208a48479j08878F4183b91243i5137d5457l0983q8729
18372a65169P7818A27683a55080A44615H495a16657D4087a41705d8569n7534H794
18360b30761A29713e5387j14167o4068a1733C8033b25139M7409B04140a23887
18349b20919C5491M618J37096E4680J09614b67184J2990a07502j65210J24752
$$ y = [-48921, -24709, 52669, -179435, -104300, -159659, 298237, -7742, -187218, -64537, 108876, -133071, -61339, 13523, -95661, -85464, 149924, 51461, -264445, -115525, 99822, 146902, 67266, 222748, 15746, 132086, -126073, -48242, 11898, 168193, 86782, -232423, 180166, 19979, -232392, 192503, 431246, -24630, -167975, -114641, 233880, 100601, 135247, 107353, -39790, 2159, -66487, 57713, 330921, -148479, -257357, 64183, -291243, -95137, -45457, -76440, -165169, -87351, 127683, -155080, 144615, 8495, -116657, 44087, -141705, -48569, -106103, 8794, -230761, 129713, -55387, -169554, -233622, -11733, 38033, -225139, -177730, 204140, -123887, -220919, 35491, 40109, 177205, 54680, 164294, -267184, -254194, -107502, -272712, -147960]
18339a47960e0588m7968E2074b93246a00743G642J45250E8283d5835g331k65634
18328b72965f9870c1064B17556a98950A82930a51742j14674i1224j68608D6844
18317E649J09327L0913A9474L97742a3422j70535g0240j55849C5042a33968N5415
18306g8553G7813a29667c6123j76379H4137a1711j97257J01857n9396J766L5622
18295a29119A3323a22948A21848B6787b40432f5695l6727C35641e9938K1210H6454
18283B31997C5647b00769L5426F195d5689b1641A04300A5617a37380F6895P3318
18272A40213n6466b99909J44783d3091B9268H803i7846O88A59144K20290j76778
18261B02656a85055H3780i841n3097D71093E0821j823b30396f617G7542J10508
$$ y = [-147960, -50588, -98556, 52074, -293246, -100743, 7642, 152892, 58283, -45835, -7331, -272965, -69870, -31064, 217556, -198950, 182930, -151742, -266416, -91224, -259832, 46844, 5649, 114976, 145889, 19474, 417216, -13422, -183957, -70240, -226089, 35042, -133968, -78553, 77813, -129667, -36123, -212502, 84137, -11711, -208968, -107111, -166507, -164741, -129119, 13323, -122948, 121848, 26787, -240432, -65695, -102422, 335641, -59938, -38728, 86454, 231997, 35647, -200769, -165343, 6195, -45689, -21641, 104300, 15617, -137380, 66895, 140213, 83747, -299909, -155126, -43091, 29268, 8803, -97846, -97158, 159144, 379434, 202656, -185055, 83780, -9841, -62938, 471093, 50821, 48998, -230396, -6617, 77542, 188050]
18250A88050f0461q4914C0535O2863a4641k38512E842i1506A20836C3488a58030
18238d8847E8915i3934B6562a75256A00636O5218a6031k05732F3927b60472A2967
18226c06279i0961d0744C5484e0678A32068A85c99427B25628o1543a43630B23603
18214B25872r2216l9951J42647j14324b7839p1863a1569j22723O6635A89112b09947
18202C93806j69374B7688a12923E1990e6147H1844B6576P2988O9592d8645j45493
18191a94138D5124k338b09949M1775Q671p0300d7975A65228c02996Q6701P2752
18180a43543a5168m3983j78562A41916K3184b35232c4003m00916a68240b38k13473
18169b13711A51487F8398a55597j59043C0080e5156A70964o8216o583a22694D4431
$$ y = [188050, -60461, -145375, 30535, 93398, -14641, -253153, 5842, -91506, 120836, 33488, -158030, -48847, 58915, -93934, 26562, -175256, 100636, 165854, -16031, -221763, 63927, -260472, 12967, -306279, -90961, -40744, 35484, -50678, 132068, 185, -399427, 225628, 164085, -143630, 223603, 225872, 133656, 93705, 236352, 122028, -27839, -99702, -11569, -134292, -67657, 189112, -209947, 393806, 224432, 27688, -112923, 51990, -56147, 81844, 26576, 99564, 169156, -48645, -194138, 45124, 42786, -209949, -168174, -159503, -229803, -47975, 165228, -302996, -216295, -143543, -15168, -59151, -237713, 141916, 165100, -235232, -34003, -434919, -168240, -238, -213711, 151487, 68398, -155597, -314640, 30080, -55156, 170964, 102748, 96165, -122694, 44431]
18157b31299d6009G3602J8K17216d3024l34897J62532b8657J0249q0058n2222
18146a50688j0020A21410K5572a65171A5246J79427D2008a45519A49777G1850
18135f2513C28273a88741R0392A57228i4770b1834H6747D2259Q9190c4144k88727
18124c22871O2105C16775B0605b3838j02822E5680J28746d6089H5211a02705C0473
18112a27609J5649A58583l6460b50345C6288e4901D3684J02163a04534I6898P1295
18101A68193M543K7624d15868A27662a82777N5800o9612P8701E4842e5525A41094
18089e691q1083k91006h971A2319g4713j96409i5475j50173H0628R693d6269G0802
18076B8073a29647E6054c9766j73133a3434A5758e71536H0406B7859b16317r283
$$ y = [-231299, -46009, 73602, 73620, 290836, -43024, -377921, -215389, -28657, -18408, -98466, -150688, -160708, 121410, 146982, -165171, 15246, 194673, 42008, -145519, 149777, 71850, -62513, 328273, -188741, -98349, 157228, -94770, -21834, 86747, 42259, 131449, -34144, -322871, -260766, 316775, 20605, -23838, -126660, 55680, 184426, -46089, 85211, -102705, 30473, -127609, -111960, 158583, 122123, -250345, 36288, -54901, 43684, 145847, -104534, 96898, 168193, 172736, 200360, -415868, 127662, -182777, -126977, -196589, -117888, 54842, -55525, 141094, -5691, -86774, -377780, -8971, 12319, -74713, -271122, -95475, -245648, 80628, 90321, -46269, 70802, 28073, -129647, 56054, -39766, -212899, -13434, 15758, -571536, 80406, 27859, -216317, -225600]
18065b25600I8243A7711L65174h9852A27708b0997k41o4087D85636a83928I5756
18053a49433C11903e9838A25288J92260A13230a04456B2383c05968B26222B0854
18042b9309g645r615D1476b60781J23903C4762g960j48455p5277F2184i6455E4367
18029A28337A1143d3868E1229c7081A14748L4660K20016j38220b78258E830h1334
18017B2841L6935f3636m9980j67468J27916H5099a98781l833r3515B0893j0190
18006A0703f1065C0629h5501j68416I9423a01938B33295a79018i316C3732L3032
17995F6764a09514B0965a83974I4527A9593h1776A96658f2583D30938k05507M8876
17984B74307A18874D3416a16947M4457j6902o3218J053B53386a25461Q618a2109
$$ y = [-225600, 98243, 17711, 382885, -89852, 127708, -20997, -21238, -85325, 485636, -183928, 95756, -149433, 311903, -59838, 125288, 317548, 113230, -104456, 22383, -305968, 226222, 20854, -29309, -7645, -17260, 41476, -260781, -136878, 34762, -7960, -156415, -231692, 62184, -96455, 54367, 128337, 11143, -43868, 51229, -37081, 114748, 149408, 369424, 231204, -278258, 5830, -81334, 22841, 59776, -63636, -113616, -281084, -153168, 85099, -198781, -202614, -296129, 20893, 10703, -61065, 30629, -85501, -253917, 99423, -101938, 233295, -179018, -9316, 33732, 66764, -109514, 20965, -183974, 94527, 19593, -81776, 196658, -62583, 430938, 225431, 274307, 118874, 43416, -116947, -72490, -89392, -152610, -151557, 253386, -125461, -116843, -12109]
17972e3834j65022A00411F69M6095N4912K3498E9812b117p578j87349A67643L39962
17960E07605E1074O5394K49468F9902L54700l6683A57038c86138d4123C55761
17949C29606c017C2040b56669A10334A2599g7922A51038a71383g9820E16543c307
17937b03469E1285J7699a3100o428B06466d8427A13872B7210K614I544e89869
17925a69585M688I1574l7236J4142j1368b52835B0409J87181b44429I2594K37306
17914C29900a88994L2311E0412a85157c3631k34951C57598F5558j9341j5647h5643
17902g1561I0786O7091A7466b91870A90674C3962O232M6146e5300j28765o5192
17891b49257A51814b06369c8318j0013j05641k8162d4569H8764M5719a00473k01670
$$ y = [-53834, -218856, 100411, 669, 46764, 101676, 125174, 59812, -2117, -9695, -197044, 167643, 507605, 51074, 116468, 365936, 69902, 424602, 387919, 157038, -386138, -44123, 355761, 329606, -3017, 32040, -256669, 110334, 12599, -77922, 151038, -171383, -79820, 516543, -3307, -203469, 51285, 68984, -13100, -19528, 206466, -48427, 113872, 27210, 29824, 9544, -589869, -169585, -164897, 91574, 54338, 68480, 57112, -252835, 20409, 207590, -244429, 92594, 329900, -188994, -156683, 50412, -185157, -33631, -268582, 357598, 65558, 46217, 30570, -85643, -71561, 90786, 157877, 17466, -291870, 190674, 33962, 40194, 86340, -55300, -184065, -249257, 151814, -206369, -38318, -48331, -153972, -182134, -44569, 88764, 134483, -100473, -302143]
17880c02143a29517C59530l4715k0478b77729g4228b8287A08650D4855b16325
17869H5355a51401A39855K3484p146a1914A83562N69a92144P2124E76162H8525
17857a23904d934j34823B169J2194k824K63151R9666c30908D6359a3819I726h7860
17844D4348c98382H5613q879P1410D0656d6495m1398n0499A66342P3828B9470
17832F3281K87770G1987g5455K7715p1554A28686K14237c42420B45467i9867B999
17820A22796K08222a68521B22331i8376D72684e4810l02225A55170p5344m209
17810G5617b09759n5490A92936m5451l4539a64551o0389e4454B20754p9618j0230
17799A30906D0415N0409A827L37058K4128j08523F5221a07979G1314J93373J28774
$$ y = [-302143, -129517, 359530, 324815, 304337, -277729, -74228, -28287, 108650, 44855, -216325, 85355, -151401, 139855, 163339, 156193, -11914, 183562, 184131, -192144, -120020, 576162, 88525, -123904, -4934, -139757, 2169, 14363, 11539, 274690, 374356, -330908, 46359, -13819, 9726, -87860, 44348, -398382, 85613, 76734, 148144, 40656, -46495, -87893, -138392, 166342, 240170, 29470, 63281, 351051, 71987, -75455, -47740, -119294, 128686, 342923, -342420, 245467, -99867, 2999, 122796, 331018, -168521, 222331, -98376, 472684, -54810, -357035, 155170, 79826, 75617, -209759, -265249, 192936, 147485, 112946, -164551, -224940, -54454, 220754, 141136, 130906, 40415, 90824, 1827, 338885, 363013, 254490, 65221, -107979, 71314, 264687, 393461]
17788C93461j36873L4959b50056B22143C2176K03114n3576B319a0869m26298i3490
17776B4158J48014F9700e1425A29339J90343A42350R0955c3724q2921A04838b07581
17764B9139K14457D4512J27252f1475B55982i4771C0157L9397e4461p1481r5616
17753b21558c1471o5736a8812B28021h067l49522A68378e1400L878A04120L19787
17742D23907c69332C22416c9348a8086A85484F5162a55663B06431d1842B02137
17731B5022O3471m518J16957N0213a26600A41772k703E6096J06886i4250B99013
17719A08012a59039C23620H6001K0984b38445P6274A63453a54729C72102b23780
17708a39070c371H9565J82505g3376B8413K35199a8478A21630E1389Q5517b17596
$$ y = [393461, 256588, 291547, -250056, 222143, 32176, 235290, 181714, 2319, -10869, -437167, -93490, 24158, 172172, 69700, -51425, 129339, 319682, 142350, 233305, -33724, -116645, 104838, -207581, 29139, 243596, 44512, 171764, -61475, 255982, -94771, 30157, 69554, -54461, -125942, -221558, -31471, -97207, -18812, 228021, -8067, -357589, 168378, -51400, -47522, 104120, 423907, -369332, 322416, -39348, -18086, 185484, 65162, -155663, 206431, -41842, 202137, 25022, 88493, 83975, 200932, 251145, -126600, 141772, 139069, 56096, 162982, -94250, 299013, 108012, -159039, 323620, 86001, 106985, -238445, -162171, 163453, -154729, 372102, -223780, -139070, -3371, 89565, 272070, -73376, 28413, 263612, -18478, 121630, 51389, 136906, -217596]
17696g3085j42508A9354Q5866K76186b25758A42358h7138A71410e3848B79205
17685C11694I3792b05054i8624A45689a10982F7617g9022E2067J06207K9895b8478
17673A09981O5532o3085b47584a18228b2417A45296A8175J9653K46360k3830j15322
17662A45036j3630H942K8036O3455c7215B59767J85575A84084p4924Q487b0719
17650A43018n2146J3129C7019K128K56677f1223a2150j80801C4534L34568L2673
17639D01775g354m5374A0213b33462A90465i4608G1465J57518k8289c9365l4695
17628g4060B27429H9127N71458g073j39749g2258L2190C01012g3989A42101K8
17617A42129J18269F6801A1840K85667i698C3201b31610F7139a83184d6595l9278
$$ y = [-73085, -215593, 19354, 105220, 381406, -225758, 142358, -87138, 171410, -53848, 279205, 311694, 93792, -205054, -98624, 145689, -110982, 67617, -79022, 52067, 158274, 188169, -28478, 109981, 175513, 112428, -247584, -118228, -22417, 145296, 18175, 37828, 284188, 260358, 145036, 131406, 8942, 36978, 100433, -37215, 259767, 445342, 184084, 109160, 117647, -20719, 143018, 90872, 104001, 37019, 39147, 295824, -61223, -12150, -192951, 34534, 369102, 401775, -7354, -52728, 10213, -233462, 190465, -94608, 71465, 228983, 200694, -39365, -74060, 227429, 89127, 660585, -7073, -146822, -72258, -40068, 301012, -73989, 142101, 142129, 260398, 66801, 11840, 297507, -9698, 33201, -231610, 67139, -183184, -46595, -85873]
17606h5873A29769Q7718B9005Q9751D9538Q9693L89908A59841J26692q3606J73356
17595C76283C1564K17020A00572M8434p1322N5485b3133p2790E5396N7969h4123
17583A56584e8095A05195C1168b4439G9599L8767b28369E42096k67037a93811
17572b66691B65408m5646J80804E2958K03538j0648c3344B3250Q0952a46415B47698
17560f7076C2695a69644C6256a43373A67043K8981a8729k50865c9345B63463f5392
17548D7086b2273f549m0971o0561B24073L5368M9161J56675J01103a53653D03491
17536C39103q3843J68031A81407K81599l5503A64514J38365G0235M69666K1369
17526E61270j2031J05947N31316l89496R6086k82286j01611G3804N54105B24601
$$ y = [-85873, 129769, 217487, 29005, 118756, 49538, 139231, 529139, 159841, 286533, 202927, 376283, 31564, 248584, 100572, 149006, 77684, 133169, -23133, -95923, 55396, 113365, -84123, 156584, -58095, 105195, 31168, -24439, 79599, 118366, -228369, 542096, 275059, -193811, -266691, 265408, 219762, 400566, 52958, 256496, 245848, -33344, 23250, 104202, -146415, 247698, -67076, 32695, -169644, 36256, -143373, 167043, 196024, -18729, -269594, -39345, 263463, -65392, 47086, -22273, -6549, -47520, -108081, 224073, 259441, 308602, 465277, 566380, -153653, 403491, 339103, 255260, 423291, 181407, 463006, 427503, 164514, 302879, 70235, 539901, 561270, 549239, 655186, 1186502, 797006, 893092, 610806, 509195, 73804, 627909, 224601]
17515A71220n0063J67708m6846L75232L17728P6943Q2627O2917n7255k88548C29154
17503C03022J01400R404A97358Q7164K0R7291k1713j42701K71578B42996J49422
17492C92418A72276J59740p6842P8324J44790B13517I206O5102L95732I6886J55375
17481B52261p690H7911L53262k07106J67583K49503e4023I9786K18608j12499
17471B05895J12642L08352k58789j33879L02374P4328A64992q1125M15480j95339
17461C04008G2534B0523L96407j53817K09108j97358p12m2671J02225q6191N2457
17450B99971K85514A04259L8274M04556k2683j1633k4082j89485L92056A70296
17439B35912L56314B34509O70966j63485q5616B99525G7816J72111k234J5923
$$ y = [171220, 121157, 288865, 242019, 617251, 934979, 1011922, 1094549, 1157466, 1100211, 811663, 329154, 303022, 404422, 413826, 197358, 284522, 284542, 381833, 360120, 217419, 488997, 242996, 392418, 172276, 332016, 255174, 333498, 478288, 213517, 9206, 74308, 470040, 96886, 252261, 244571, 87911, 441173, 234067, 401650, 651153, -54023, 99786, 318394, 205895, 318537, 626889, 368100, 234221, 536595, 610923, 164992, 83867, 499347, 304008, 72534, 20523, 416930, 263113, 472221, 274863, 274151, 231480, 333705, 247514, 299971, 585485, 104259, 142533, 547089, 524406, 512773, 488691, 299206, 691262, 170296, 235912, 592226, 234509, 905475, 741990, 656374, 299525, 77816, 249927, 247693, 263616]
17429B63616N27029l60926l8688A26455J33581K41037p7625O4373j62221H3002
17418G77513A86708J97940A33229M66540o2027o2580j80570J95820j04649J92383
17408E78146q0390p5315N091k05426F2661N94203A87606M9957m0477O4038h863
17396B63906e3007D83117B07860A02734O4389j2590N5463J57927j30027f5731
17385A29996J16198q1809J52203J27834j1869A71838J81258k6879p0374j24739
17375A31104m7784J21587o8588b2267B63489J87709A24340K49886l9611A64590
17364A50232K3905J05024n6360Q0239m1602g023c188C79994L6924A62651k9221
17353A33430E8098K71275A58727O7465R3333J59252A76103K70100J03233B63436
$$ y = [263616, 790645, 429719, 391031, 126455, 260036, 501073, 423448, 487821, 325600, 83002, 777513, 186708, 384648, 133229, 599769, 537742, 475162, 294592, 490412, 385763, 578146, 497756, 422441, 427532, 222106, 62661, 656864, 187606, 237563, 197086, 261124, -8863, 263906, -53007, 483117, 207860, 102734, 167123, 154533, 209996, 367923, 237896, -65731, 129996, 246194, 164385, 316588, 444422, 432553, 171838, 353096, 326217, 255843, 131104, 83320, 204907, 136319, -22267, 263489, 451198, 124340, 374226, 334615, 164590, 150232, 174137, 279161, 222801, 303040, 261438, -7023, -3188, 379994, 416918, 162651, 133430, 58098, 329373, 158727, 226192, 319525, 478777, 176103, 446203, 549436, 263436]
17342C30470A55327Q7951q8866J25062p426O3373j29959m1872K31772j53198o4986
17331A77178M9017J90174A34655K4897K27263j80067J61705p1609q4743c001B72422
17319A97152J05014K4944J1233j55927J18904K24103k58585O3366A03246J31226
17309B34472q3533Q4475Q9368J43564A74907c7628A47639n6690P8202F2028R509
17298G1537K80123J61412O7553A67018c1620r2528D3812N89201j98756B16082
17287B42327O0717B0351K46029j9390n9938Q4187J33550J02169n7709J72354A97143
17275A79926p8818J65091b5921C13516j24302J36985j53988P3809R9516I0526
17264g7583B45108D9312K16582I2349M31445N0379K1578j11423j20866l9488J03653
$$ y = [330470, 155327, 243278, 154412, 279474, 272048, 335421, 205462, 163590, 395362, 242164, 177178, 226195, 416369, 134655, 159552, 386815, 206748, 368453, 296844, 212101, -3001, 272422, 197152, 302166, 327110, 338343, 182416, 301320, 525423, 266838, 330204, 103246, 234472, 150939, 235414, 324782, 468346, 174907, -37628, 147639, 90949, 169151, 62028, 71537, 351660, 513072, 580625, 167018, -31620, -124148, 43812, 633013, 434257, 216082, 242327, 303044, 20351, 266380, 246990, 187052, 271239, 404789, 506958, 449249, 621603, 197143, 179926, 101108, 266199, -25921, 313516, 189214, 326199, 172211, 246020, 345536, 90526, -77583, 245108, 49312, 265894, 92349, 523794, 574173, 595751, 484328, 363462, 323974, 427627]
17253D27627A05605D0439J28216R5749M1244M2593R5485o285j83309n1705K97356
17242D99783j86079J08823j80638P1569Q0542j78621K81506j77512j8046R9695
17232D01022N91l4799A19043J61636J23620H1456L75853A80291O3812J79014g8715
17220E26682j80639j40069R2584p7939a94335D50891l1158N6676p9071A63736
17209A56591M92730A57541K46954j42991K73755k01656j00843J79918R6317o1719
17199D47276G869M28717A72941k4184Q6144j11558L07844N0207m9787K83j26334
17188C05556J710K86509k04905L44238C27284L5103e1408E86208A33183J83126
17178C16309L53337j06275j62041O3447K7865o4933K7844K50462j34026k26755
$$ y = [427627, 105605, 40439, 168655, 264404, 305648, 348241, 443726, 437441, 254132, 202427, 499783, 313704, 422527, 241889, 313458, 394000, 215379, 496885, 319373, 301327, 401022, 401613, 366814, 119043, 280679, 404299, 81456, 457309, 180291, 244103, 423117, -78715, 526682, 346043, 205974, 298558, 220619, -194335, 450891, 419733, 476409, 397338, 163736, 156591, 649321, 157541, 404495, 261504, 535259, 333603, 232760, 412678, 508995, 447276, 7869, 436586, 172941, 148757, 234901, 123343, 431187, 481394, 431607, 431890, 305556, 307266, 593775, 388870, 733108, 327284, 362387, -51408, 586208, 133183, 316309, 669646, 563371, 401330, 464777, 492642, 427709, 455553, 706015, 571989, 345234]
17168C45234K89330j62795k905b7370C53032K332J19339j12911M23326j83458
17158F01660j45919j907o3166j33747M04341k08606o353G9625K28237L97126j31427
17147E73561k15092L50447j46239J439k71182M01846J26668k88996L4059B76152
17136G47558n6601B77569K56955L5280J04364J06007j81001j76998L65085p613
17126G79648j04848j52194p222J52989k30537J81480k19708L60584j11196K56236
17116I05232m25641K05900k50858n3121K12644J45888j48722J18583j82515K92400
17106H19790j49927k06966J97485j53275L0161j9419K04646o8792B82891M28979
17096G11870j62247j13724J93997J54290l23316K3402J01848L66600l94400J65176
$$ y = [345234, 634564, 471769, 468864, -27370, 353032, 355364, 474703, 361792, 785118, 601660, 455741, 453834, 390668, 256921, 661262, 452656, 446303, 79625, 307862, 704988, 573561, 358469, 708916, 562677, 564116, 292934, 694780, 821448, 532452, 566511, 276152, 747558, 690957, 277569, 534524, 569804, 674168, 780175, 599174, 422176, 787261, 779648, 674800, 522606, 515384, 668373, 437836, 619316, 399608, 760192, 648996, 905232, 479591, 685491, 434633, 381512, 594156, 740044, 591322, 709905, 527390, 819790, 669863, 462897, 660382, 507107, 537268, 517849, 722495, 653703, 282891, 711870, 549623, 435899, 629896, 784186, 460870, 484272, 586120, 952720, 558320, 723496]
17086G23496K71628l78697K18670B81369N49014k24755j00387J29965K24055j27725
17076G31536k89186L14659R4853k3077j15788J23313j06409n0912J8779j91295
17066E06473L53749B18156O26155k47171J88519j42378J18970K15608D31383M81790
17056I13173m7623j55851J10905j00487Q5590l36494K21502J12274K08370k5844
17046I85515j92548o0957L01144j79222J93553l01987p9750M45621j95877L17746
17036A233238n38180K85817R2158l19075L72373n7779l38273j8503k7615L43137
17026A027298j34013j1306J60868k2771m6389J24825m62555L66314J06047P1511
17016A179829l9392m66838L48108K35796k60632q203m2880J29619k8694J98212
$$ y = [723496, 995124, 616427, 835097, 281369, 830383, 605628, 505241, 635206, 859261, 731536, 442350, 757009, 851862, 828785, 712997, 836310, 729901, 678989, 697768, 506473, 860222, 218156, 844311, 597140, 785659, 643281, 762251, 977859, 431383, 913173, 865550, 709699, 820604, 720117, 805707, 469213, 690715, 802989, 1011359, 985515, 792967, 732010, 1033154, 853932, 1047485, 745498, 665748, 1111369, 915492, 1233238, 695058, 980875, 1073033, 753958, 1126331, 1068552, 730279, 711776, 684161, 1027298, 893285, 881979, 1042847, 1020076, 973687, 1098512, 635957, 1002271, 1108318, 1179829, 1140437, 673599, 1021707, 1257503, 996871, 988668, 945788, 1075407, 1046713, 1244925]
17006A244925J46697o0666j70184K72665k77943q4632L5922L31360j68196O9867
16996A339815l16848L81671k45655L51165k83422J82877m0231k50905J51314k64729
16986A005052J67628Q3666J84707Q7524j72731N6000j49960K19459l41677K10265
16976A349933M2039M2427K11627K10427o77270Q9831M08740j53339L00439n0244
16966A774610l82443P7313J65813K3681j42597k69592N21964J7622j11688K80045
16956A954728m42607n517J02250k2448j55980M78224p8003p2909j47780j10704
16946A499254N33277r9340m06655J54065L34836n46498K27895L94520j80713l1591
16936A879050j5522L29053l87773J61708j04402L85364j91454m428l12208L01866
$$ y = [1244925, 1391622, 1330956, 1160772, 1433437, 1155494, 1070862, 1106784, 1438144, 1269948, 1339815, 1022967, 1404638, 1158983, 1510148, 1226726, 1409603, 1369372, 1118467, 1269781, 1005052, 1172680, 1256346, 1441053, 1528577, 1355846, 1411846, 1261886, 1481345, 1139668, 1349933, 1391972, 1434399, 1646026, 1856453, 1179183, 1269014, 1677754, 1524415, 1824854, 1774610, 1392167, 1469480, 1635293, 1658974, 1516377, 1246785, 1768749, 1786371, 1674683, 1954728, 1512121, 1506604, 1608854, 1586406, 1430426, 1908650, 1830647, 1757738, 1609958, 1499254, 2032531, 1933191, 1526536, 1680601, 2015437, 1468939, 1696834, 2091354, 1910641, 1879050, 1863528, 2192581, 1804808, 1966516, 1862114, 2247478, 2056024, 2051596, 1739388, 2041254]
16926B041254j94784L24822Q6682j60219N0696j75484J7126R5583J4796K22035
16916B322507J69353o5017n1714l4785L21422l64798L97282o5154j23038j75142
16906B330916O27403n00678J63285k42086K12553J45138K87251k32238J77798
16897B969342O6276m0011j60161J6621J05242j35993K00909N0005K11545j70852
16887C112923O7699k3615J31457j24574M07040m12974L55597K19366l16987J65347
16877C581279J04659K48275l79389J6139J75954Q2867m6226K77300j31293k2346
16867C907219J50418P885r8102j15877M94906K06059m15954L3962L31320K56081
16857D757917o6947p6473O0703K96649m1816L39958J4042q5621J8041K65624l57687
$$ y = [2041254, 1846470, 2171292, 2257974, 2097755, 2148451, 1972967, 1990093, 2085676, 2100472, 2322507, 2491860, 2426843, 2375129, 2340344, 2661766, 2296968, 2694250, 2629096, 2506058, 2330916, 2958319, 2457641, 2620926, 2378840, 2591393, 2736531, 3023782, 2791544, 2969342, 3035618, 2995607, 2835446, 2852067, 2957309, 2821316, 3022225, 3072230, 3283775, 3112923, 3180622, 3157007, 3288464, 3163890, 3570930, 3157956, 3513553, 3732919, 3415932, 3581279, 3685938, 3934213, 3554824, 3570963, 3746917, 3829784, 3783558, 4060858, 3929565, 3907219, 4057637, 4065522, 3967420, 3851543, 4346449, 4552508, 4136554, 4170516, 4501836, 4757917, 4690970, 4614497, 4675200, 4971849, 4930033, 5269991, 5284033, 5198412, 5216453, 5482077, 5124390]
16846E124390K93066K12502L01729n15215L32500L2285J22916R7270L19106O2373
16836F382922k83491L14008l7073j6916J55037j04604N99337K25134k43586J34126
16826G124894K08293L85210l22345N98724K81082k74819L67935Q8750K31898j59773
16816H529849N76094k74309K93486L60708R7465K50311n6021M76128J10260J42451
16806A0506422J13798M67879L68439K06699j13N93078M0491K15465J86063M94883
16796A3193104M67949J57881M63482J07810K9871O16952J46264O23260K88709
16787A6095282O18644K32274P50188J48659N31505M32042O90289M24326L27931
16778B0251140L66753P30686J012442N77245P04298K22150R99435L91502Q19563
$$ y = [5124390, 5417456, 5629958, 5931687, 5416472, 5748972, 5781257, 5904173, 6001443, 6320549, 6382922, 6099431, 6413439, 6376366, 6359450, 6514487, 6409883, 7009220, 7234354, 6990768, 7124894, 7333187, 7718397, 7396052, 7994776, 8275858, 8001039, 8368974, 8457724, 8689622, 8529849, 9105943, 8831634, 9125120, 9485828, 9583293, 9833604, 9777583, 10253711, 10363971, 10506422, 10620220, 11088099, 11456538, 11663237, 11663124, 12256202, 12296693, 12512158, 12698221, 13193104, 13661053, 13818934, 14282416, 14390226, 14420097, 15037049, 15183313, 15806573, 16095282, 16713926, 16946200, 17696388, 17845047, 18376552, 18808594, 19498883, 19923209, 20251140, 20617893, 21348579, 22361021, 22938266, 23642564, 23864714, 24864149, 25255651, 26075214]
16769B6075214Q80504P45561J308041O64391R82178Q14892J295111R29961J032361
16760C4728214J233494J033265J619126J284421J234206J377191J670503J624321
16752D5804741J396231J809957J643867J616798J840440J838898K141758K079537
16744F0172227K180832K243174K357718K328587K471832K287418K623722K685903
16736G9351413K533945K487050K548230K262752K441536K377278K188123K119928
16728I8310255K057981J674810K248395J143799J822400J056949O28285N55931
16720A09498805P86875K60021q25635J58587r69741r22508j019812j345694k015511
16711A03605387j672927k263741k273965k102540k075653k626668k357002k607903
$$ y = [26075214, 26955718, 27701279, 29009320, 29673711, 30655889, 31470781, 32765892, 33695853, 34728214, 35961708, 36994973, 38614099, 39898520, 41132726, 42509917, 44180420, 45804741, 47200972, 49010929, 50654796, 52271594, 54112034, 55950932, 58092690, 60172227, 62353059, 64596233, 66953951, 69282538, 71754370, 74041788, 76665510, 79351413, 81885358, 84372408, 86920638, 89183390, 91624926, 94002204, 96190327, 98310255, 100368236, 102043046, 104291441, 105435240, 107257640, 108314589, 108942874, 109498805, 110285680, 110545701, 109720066, 109878653, 108908912, 107986404, 106966592, 105620898, 103605387, 101932460, 99668719, 97394754, 95292214, 93216561, 90589893, 88232891, 85624988]
16703H5624988k104359k833720k455361k950689k271264k318132k741353k125733
16695F5824377k226622k545830k213195j930283j910633j916934j911435j799362
16687D9370083j943735j524120j644170j568220j361995j596822j331722j026468
16679C7372831j434769j165936q86395j389627j295060q85157j135359k86542
16671B8893986j268529p41137j289925p61769m73119p51176n12914p82002p49161
16662B1564254o64811m64274n59126p94673o47684j33906o37781m93723k71645
16653A6896631r09455L057m79177k80980l66249p11155Q223p02558k43097l36889
16643A2878351j02212k87661l82076n03565J1812l89694l0146k76578p2358n73343
$$ y = [85624988, 83520629, 80686909, 78231548, 75280859, 73009595, 70691463, 67950110, 65824377, 63597755, 61051925, 58838730, 56908447, 54997814, 53080880, 51169445, 49370083, 47426348, 45902228, 44258058, 42689838, 41327843, 39731021, 38399299, 37372831, 35938062, 34772126, 33885731, 32496104, 31201044, 30315887, 29180528, 28893986, 27625457, 26884320, 25594395, 24832626, 24359507, 23608331, 23095417, 22313415, 21564254, 20899443, 20435169, 19876043, 19081370, 18433686, 18299780, 17661999, 17168276, 16896631, 15987176, 15990233, 15511056, 15230076, 14863827, 14152672, 14160895, 13458337, 13215240, 12878351, 12776139, 12488478, 12106402, 11602837, 11614649, 11224955, 11194809, 10918231, 10845873, 10272530]
16633A0272530l68231k5413l40246O9751l49065j52100o22983L08909j91975k24813
16623H376364l44800k02514q88m98812K76481l08944j02680P6248j23113l17820
16613F829522j78651K14461m18155k9790n21453L64787k7458j82139l71296J91620
16603E871448j57975k94942j53985J63513l7986j63771Q0986l16872j13968R0422
16593D966870k96875k9716J23462j00801j15157j00035k21387O6545k8958J13950
16583D377898k76087j48329L7263l9464k04465J83991k95699J89628l83798r3262
16573C347676K16434J85807l34568j99020J28718N9205K08103r7809k67421J35508
16563C382633l15231j59620J09249M8320j19907R8355k65475J85061j95623L0442
$$ y = [10272530, 9904299, 9878886, 9538640, 9608391, 9259326, 9107226, 8484243, 8793152, 8601177, 8376364, 8031564, 7829050, 7828162, 7329350, 7605831, 7296887, 7194207, 7270455, 7147342, 6829522, 6650871, 6865332, 6447177, 6417387, 5895934, 6260721, 6233263, 6051124, 5679828, 5871448, 5713473, 5418531, 5264546, 5428059, 5390073, 5226302, 5307288, 4990416, 4876448, 4966870, 4669995, 4640279, 4763741, 4662940, 4547783, 4447748, 4226361, 4292906, 4263948, 4377898, 4101811, 3953482, 3990745, 3951281, 3746816, 3930807, 3635108, 3824736, 3440938, 3347676, 3564110, 3749917, 3415349, 3216329, 3345047, 3404252, 3612355, 3514546, 3247125, 3382633, 3067402, 2907782, 3017031, 3065351, 2945444, 3043799, 2778324, 2963385, 2767762, 2798204]
16553B798204J60467l90758L4714j4012K12133j60114N4657n28567J78833J91314
16543B536871k24292k58274L38146l640K4885l5696l05019K43762M4465k16579
16533B144629L00498p2051l27782l963K26239l12640J7254L6956K26529r0625
16523B145044Q5300l36264N0098m31113j60584O31334J02810m67510L03259k88256
16513A634118J1472K2568r7902j65264J99571K78636j14184l02616L46413p6872
16503A735940L9246R851k22086J5964j21113m4070J74908j2856k0273N5210m5588
16492A565133k05085K13023k24054N5577k72608K99180k77067j52477J65626J33908
16482A301156j72570K779J32256j86340K05907j80821J15586J05317n7037O244
$$ y = [2798204, 2958671, 2567913, 2602627, 2588615, 2800748, 2640634, 2695291, 2166724, 2345557, 2536871, 2312579, 2054305, 2392451, 2388811, 2413696, 2378000, 2072981, 2316743, 2361208, 2144629, 2445127, 2373076, 2045294, 2041331, 2267570, 1954930, 1972184, 2009140, 2235669, 2145044, 2230344, 1894080, 1944178, 1513065, 1352481, 1983815, 2086625, 1619115, 1922374, 1634118, 1645590, 1668158, 1570256, 1404992, 1604563, 1883199, 1769015, 1466399, 1812812, 1735940, 1775186, 1785037, 1562951, 1578915, 1457802, 1413732, 1588640, 1575784, 1555511, 1610721, 1565133, 1360048, 1573071, 1349017, 1404594, 1131986, 1431166, 1154099, 1001622, 1167248, 1301156, 1128586, 1131365, 1263621, 1077281, 1283188, 1102367, 1217953, 1323270, 1266233, 1272477]
16472A272477r2673j70842J92434k01339L7176j17755J47575J59719o4745q2131
16462A079896J42271j14304j81018J59152k42602Q1881j22320L87880K5122j20861
16452A095097k14891N368R3726k74060j7637J68285l6960p8629q1971K14220o8211
16441H04337J0663J09970k91033K99765L3762j40576K41951n9513r2131N3520
16431I70715j33774M8317J258J5712j74041K41775k56865j0584J81383n5638R6783
16420I25041J9092l57467K28088j21452l4711B62017K55437O41592k90508K896
16410H71434k85241j01441J51688R5256j98238J9128J96825M082o7848j4819k19330
16399D51496Q3853N187K91848J33249k98112q488j12528o3237K67820B31724K85171
$$ y = [1272477, 1179804, 1008962, 1201396, 1000057, 1037233, 919478, 1067053, 1226772, 1162027, 1079896, 1222167, 1107863, 926845, 1085997, 843395, 925276, 802956, 1190836, 1215958, 1095097, 880206, 885574, 979300, 705240, 687603, 855888, 818928, 740299, 658328, 872548, 804337, 815000, 924970, 633937, 933702, 967464, 826888, 1068839, 1009326, 917195, 970715, 836941, 885258, 886516, 902228, 728187, 969962, 713097, 702513, 883896, 828258, 925041, 944133, 586666, 814754, 693302, 658591, 262017, 517454, 1159046, 868538, 871434, 586193, 484752, 636440, 731696, 533458, 552586, 749411, 753493, 685645, 670826, 451496, 535349, 540536, 832384, 965633, 667521, 659033, 546505, 483268, 751088, 231724, 516895]
16388E16895Q492N8854J77571J87944D39812K13911j61678Q2039J14421k46201
16378D42304N6606R8944A37437N70053j57918j76443L73463j44382k40619M81798
16368H43389C74831N7290K37927k61943J76797Q2322k06667k25477L28418j10791
16358D52707J59192J42482k2278A09703M58776M5846l8608k00511L13907A31637
16347F15702k77582A67150K35196n5275j53355P51989D02631j4841q9388R0542
16337C88944o1734O8989J86663k48392n8564K07888J04632k47852F8260J87536
16327B55796j25208L9312K63425A0349M12326J44104k69232J46890P3355H6794
16316E06217m8497j32023A7944L79655A61736J2460J78556j02123L01577k35153
$$ y = [516895, 525387, 584241, 761812, 949756, 439812, 653723, 492045, 574084, 688505, 442304, 498910, 597854, 137437, 707490, 549572, 373129, 746592, 602210, 361591, 843389, 374831, 432121, 670048, 408105, 584902, 667224, 460557, 235080, 563498, 452707, 611899, 754381, 732103, 109703, 568479, 614325, 575717, 375206, 689113, 131637, 615702, 338120, 167150, 402346, 347071, 193716, 945705, 402631, 387790, 298402, 388944, 327210, 396199, 582862, 334470, 275906, 483794, 588426, 340574, 68260, 255796, 130588, 169900, 433325, 10349, 422675, 566779, 297547, 444437, 517792, 86794, 506217, 457720, 325697, 17944, 397599, 161736, 174196, 352752, 250629, 552206, 317053]
16306C17053J95079j10924k7377J34762R6890B66259k0817L35866q1478K03194
16296G03024k81599E5221L90761F4797L57192J34952G0545L07003A38450K85427
16286D23877l7429p5864J04175a82529E1040O3180m7910M56754A41305E0818L72235
16275D23053A16574K00227H9671J6155J74613C5099J30373k8065J44706E1138
16264A86951J89077h8517B41434q7654R5291A01657j518N23618k42081A52157
16253D58932j67985r5519f280E18570A22576D1845N2587K27467Q4984a1592j14051
16242a25643D23197j34107A03839C4660L22357o5842R8799j38909P4595L04432
16232F30092A16436G213L4079J30638D3081Q2779F1106K28364k7668J16796J18228
$$ y = [317053, 512132, 401208, 373831, 508593, 605483, 266259, 245442, 581308, 499830, 703024, 421425, 55221, 445982, 64797, 421989, 556941, 70545, 377548, 138450, 423877, 386448, 310584, 414759, -182529, 51040, 114220, 66310, 523064, 141305, 50818, 423053, 116574, 316801, 89671, 105826, 280439, 35099, 165472, 137407, 282113, 51138, 186951, 376028, -88517, 241434, 153780, 249071, 101657, 100139, 623757, 381676, 152157, 458932, 290947, 195428, -6280, 518570, 122576, 41845, 94432, 321899, 406883, -11592, -125643, 423197, 289090, 103839, 34660, 357017, 291175, 389974, 251065, 325660, 630092, 116436, 7213, 41292, 171930, 43081, 125860, 61106, 289470, 261802, 378598, 496826]
16221D96826C9710L46456b433F085b2629A36169d5484j01619f3368B65764N2478
16210C18242A44233R6632C469J67193a06000H3267a37329d9333D1865K545L24033
16199C68443h1106D89347C7999c0110A22404B0226K67277j24587c9020l8055D711
16187b8497B36694J39564r8224j35568K7162j479J07019J41998I0633a02317D16507
16175A62646k3611a82780B12405a46314A39694g5377A44924g2426C919b1595G5328
16163i6478A95360k8872e232A54572K13234m6928j37787O0760o6262p4344g8038
16151F0646J1553b10137C27667k4857A29041b30580N839C81064A15954a30882
16140D629L30378P327D7003K13599B3979J56127i213H6828A5876J47525l31j988
$$ y = [496826, 39710, 386166, -2433, 6085, -22629, 136169, -45484, -147103, -63368, 265764, 318242, 144233, 240865, 3469, 170662, -106000, 83267, -137329, -49333, 41865, 44410, 368443, -81106, 489347, 37999, -30110, 122404, 20226, 287503, 162916, -39020, -77075, 4711, -28497, 236694, 376258, 278034, 142466, 169628, 168149, 275168, 417166, 90633, -102317, 416507, 162646, 139035, -182780, 212405, -146314, 139694, -75377, 144924, -72426, 3919, -21595, 75328, -96478, 195360, 166488, -5232, 154572, 367806, 320878, 183091, 243851, 177589, 103245, -78038, 60646, 72199, -210137, 327667, 302810, 129041, -230580, -224741, 381064, 115954, -130882, 4629, 335007, 342334, 47003, 260602, 23979, 180106, -9213, 86828, 15876, 163401, 163070, 161082]
16128A61082a97772D2831R8312J03462j04150o9675B7264M2176O4334A5509a2219
16116I4385d6238B68542K70644A46420J7153p6873M2188C5238M3424B8873e9900
16104a3746j1193G0851d999A62975B5546K70920b22951B5326L91287a76217A30218
16092B09409F3785R5728c91087A78922c46066B65783j28972E7023N18994b50332
16081E0238a34140g374E9741A5286a05208E5389L4303K8997b80695a5206A4942
16069A10113R1477G2425O3127A9436g1400A76392d0342m1016a4646j46978a8853
16057d7461k870A06662K63599J2816j09909Q5067a13701G933e3691A04401a1604
16045A7448P4249K09633l6924G8894J02698o2307a08719q8416A46174o535h7187
$$ y = [161082, -197772, 42831, 141143, 244605, 140455, 70780, 27264, 69440, 133774, 15509, -12219, 94385, -46238, 268542, 539186, 146420, 163573, 86700, 128888, 35238, 78662, 28873, -59900, -13746, -24939, 70851, -4999, 162975, 25546, 296466, -222951, 25326, 416613, -176217, 130218, 209409, 63785, 159513, -391087, 178922, -346066, 265783, 136811, 57023, 576017, -250332, 50238, -134140, -7374, 59741, 15286, -105208, 55389, 89692, 118689, -280695, -15206, 14942, 110113, 201590, 72425, 135552, 19436, -71400, 176392, -40342, -81358, -14646, -161624, -18853, -47461, -50331, 106662, 370261, 383077, 273168, 358235, -113701, 7933, -53691, 104401, -11604, 17448, 91697, 301330, 264406, 78894, 181592, 119285, -108719, -197135, 146174, 139639, -87187]
16033g42n3768M982k67905P3459c4197C26508b1304B14127n0970f8498B07312
16021b18899A07751L93701B00334j9338i0049A04239B9351K13227b44823C0410
16010f8467A17745J09630k905a24699e9441C05581I5494a21022H9266b03212A12800
15998a80729j2380d7764C10796b83851A25954b9508j18092R108H2739K44214j49121
15987A77832M05713m8090K06412M84612p2222m74281j74141n1376B22757b0566
15976A97459D8307P2551J30640H5860b16549B43949K10637h0697B21976F540L72968
15965C79508p1022b30301N0672A45155a28518G7078b38953L9602A10513b36996
15954B93146b93851N5051h0367B930c2144k88480J19979f1997A02697a8288B42878
$$ y = [-742, -54510, -49528, -317433, -243974, -34197, 326508, -21304, 214127, 163157, -68498, 207312, -218899, 107751, 501452, 200334, 180996, -90049, 104239, 29351, 242578, -244823, 30410, -68467, 117745, 227375, 224470, -124699, -59441, 305581, 95494, -121022, 89266, -203212, 112800, -180729, -193109, -47764, 310796, -283851, 125954, -29508, -147600, -138492, 82739, 326953, 177832, 583545, 535455, 741867, 1226479, 1154257, 679976, 505835, 454459, 222757, -20566, 197459, 48307, 120858, 251498, 85860, -216549, 243949, 454586, -80697, 221976, 6540, 379508, 308486, -230301, -179629, 145155, -128518, 77078, -238953, -199351, 110513, -236996, 293146, -293851, -238800, -80367, 2930, -32144, -320624, -200645, -61997, 102697, -18288, 242878]
15942A18394Q7789P5850h134m006j8907r1350H2483f343B867a38750A13092h0939
15929H4771a54655E3839c23297A23924e9597C8203K20572D2212a6524j86246d8861
15917C80431K03A2887a94696h7043B27725a34271B14012n6933C6439a57065D4146
15905E6580L5824c62213A5246J87486A170a12218B31377c3714l9352j82625a00208
15893F1241a28837A68334h3477r2643E3188M4331c7439c482A11891h0545a0451
15881b32344B29725a24741p1547A8780c42891a08499G0585a44982H855a71002
15870A49472E616b6560j14275J1076A08748a39178D7683K97896b61878H3986J53215
15859B37201J34912j73964h3762j92F388d7333j57165H1462c15196J8984K0356
$$ y = [118394, 206183, 282033, -8134, -12140, -31047, -122397, 82483, -6343, 2867, -138750, 113092, -80939, 84771, -154655, 53839, -323297, 123924, -59597, 38203, 258775, 42212, -16524, -202770, -48861, 380431, 380634, 12887, -194696, -87043, 227725, -134271, 214012, 157079, 36439, -157065, 44146, 56580, 92404, -362213, 15246, 202732, 1170, -112218, 231377, -33714, -73066, -255691, -100208, 61241, -128837, 168334, -83477, -176120, 53188, 97519, -37439, -3482, 111891, -80545, -10451, -232344, 229725, -124741, -196288, 18780, -342891, -108499, 70585, -144982, 8855, -171002, 149472, 5616, -26560, -140835, -129759, 108748, -139178, 47683, 345579, -261878, 83986, 237201, 372113, 198149, -83762, -83954, 6388, -47333, -204498, 81462, -315196, -296212, -275856]
15848b75856c9256j59691D6832b6438j51629d1345G2519j3177R5770b31197E6978
15836a36068A66542P6679E218J10854c2813k32761g2402D0199Q0865a58347R621
15825a48726B40540I5683J19653e3636A36075c696j47721j23948A18270D1139
15814B48460E4915c85619A45214a61326j4092p0406j8978O9846q8316B34352b69740
15802a75019j52546a17929A25405a43455D5495b05135A39735h0215D4513A7964
15791e1802j14687d4776B74755E3017P9902O4033a10537L9756B14522k9387b17695
15779C16350f712m2519r6097f6619A45430C0144d0247A98443a9165j79186r8497
15768b96848J42689A17564e9463B96619j44312J6273n9290d4417J3343G7460j7315
$$ y = [-275856, -39256, -198947, 46832, -26438, -178067, -41345, 72519, 59342, 155112, -231197, 56978, -136068, 166542, 243221, 5218, 116072, -32813, -265574, -72402, 40199, 121064, -158347, -148726, 240540, 95683, 215336, -53636, 136075, -3696, -151417, -275365, 118270, 41139, 248460, 54915, -385619, 145214, -161326, -175418, -245824, -264802, -194956, -283272, 234352, -269740, -175019, -327565, -117929, 125405, -143455, 45495, -205135, 139735, -80215, 44513, 17964, -51802, -166489, -44776, 274755, 53017, 132919, 196952, -110537, -70781, 214522, 185135, -217695, 316350, -6712, -49231, -145328, -66619, 145430, 30144, -40247, 198443, -19165, -198351, -296848, -154159, 117564, -59463, 296619, 152307, 168580, 109290, -44417, -31074, 77460, 60145]
15757F0145e8459C81930J74910b4346C28701h9138I2207f1140P132J6186A25317
15745I8148m096A9989R4080i1118B39765Q7548A08259K5238c73193P9706h4632
15733b54590I6425f5688j28771j44419A39751A3654i8013m7244A5142L4771J74602
15722B24515I923J86971c7413j95794A734c94879B4383a82582A78248A1583P2287
15711H3870a3273j61069g9814A45625b57950c7492B86169b11784n7429Q1219K3491
15700a64503L141n5872B25050a12645B11434d27392a65729A75960n6228f7444
15689E7280D960L12491g140j11790C9160b2756B64541j24085b88993b2414B82839
15677D7574f5136A14883b01146k0806A00246f9342J9666b0248B50420a18002C9800
$$ y = [60145, -58459, 381930, 556840, -24346, 328701, -89138, 92207, -61140, -54008, -37822, 125317, 98148, 94052, 19989, 114069, -91118, 239765, 327313, 108259, 133497, -373193, -293487, -84632, -254590, 96425, -65688, -194459, -338878, 139751, 13654, -98013, -145257, 15142, 49913, 224515, 9923, 196894, -37413, -233207, 1734, -394879, 24383, -182582, 178248, 11583, 83870, -13273, -174342, -79814, 145625, -257950, -37492, 286169, -211784, -269213, -187994, -164503, -161362, -217234, 225050, -112645, 211434, -427392, -165729, 175960, 119732, -67444, 57280, 4960, 317451, -7140, -118930, 39160, -22756, 264541, 140456, -288993, -22414, 282839, 47574, -65136, 114883, -201146, -221952, 100246, -69342, -49676, -20248, 250420, -118002, 39800]
15665F0117a01096M5020j15402B53539B7920J42808b04718a036o8317K3188A9926
15653F6859h3762r7037e6983j56250a7946l6822j00792j2956G3013K25935j24534
15642A74414b60828R4336j42382C22092c2101n7251A39261o9007K4008b13303
15631D5251c03340h183j23803a6322j56858F1795e1247k92390C01345a66384P7011
15620h9373B61554A8055c11564a08017E5753a54856a7972l46066A68837O3581
15610B32418G7938L94586G801e46306H7332a40454A18754J45390E7027j198b13585
15598b95574n622I9585C6866J97779Q5016a51735E6373a52226p4464D9805e0491
15586f6142A07660C2364d7364n307B3612c60688c1480B7926L32968a42945e559
$$ y = [60117, -101096, -56076, -171478, 253539, 27920, 170728, -204718, -1036, -69353, -46165, 19926, 66859, -83762, -180799, -56983, -213233, -17946, -54768, -155560, -168516, 73013, 298948, 174414, -260828, -166492, -308874, 322092, -32101, -89352, 139261, 70254, 94262, -213303, 45251, -303340, -8183, -131986, -16322, -173180, 61795, -51247, -343637, 301345, -166384, -89373, 261554, 18055, -311564, -108017, 55753, -154856, -17972, -364038, 168837, 232418, 77938, 472524, 7801, -546306, 87332, -140454, 118754, 264144, 57027, 55829, -213585, -295574, -301196, 99585, 36866, 234645, 319661, -151735, 56373, -152226, -226690, 49805, -50491, -66142, 107660, 32364, -47364, -52671, 23612, -360688, -31480, 27926, 360894, -142945, -5559]
15574b49181I6032c05662I0436b42338H8349L340l463c34125A0898K70803c08242
15562A40193e9367B97094a70127c8232j69186E5155a27808I838c4566B3786a61302
15550b7905B47885G216K42209I8625R6128B052a24198A53249L4653a4650r0011
15539a04661A5785a37115A5080h5238D12709c19161d4386B90210A33621b82438
15528C20651n5436b09995H1320J28909J2645g7699A4226L26041c7680C12660b1584
15516a6672A00825g701B92816d3693C06454a88678A31967O2433Q796J4123M6833
15505B64152a8997A4284L9495L00803L3928A61232E7003J97994F6667M82847B58771
15493a24600H8438g9179G2249a84481A15930e33502K48162B59269f9635m1179
$$ y = [-249181, 96032, -305662, 90436, -242338, 88349, 91689, 88226, -334125, 10898, 281701, -308242, 140193, -59367, 297094, -170127, -38232, -207418, 55155, -127808, 9838, -34566, 23786, -161302, -27905, 247885, 7216, 249425, 98625, 194753, 2052, -124198, 153249, 187902, -14650, -104661, 15785, -137115, 15080, -85238, 412709, -319161, -44386, 290210, 133621, -282438, 320651, 265215, -209995, 81320, 210229, 222874, -77699, 14226, 340267, -37680, 312660, -21584, -16672, 100825, -7701, 292816, -43693, 306454, -188678, 131967, 194400, 203196, 217319, 264152, -18997, 14284, 53779, 354582, 388510, 161232, 57003, 254997, 66667, 549514, 258771, -124600, 88438, -79179, 72249, -184481, 115930, -533502, -285340, 259269, -69635, -110814]
15483a10814I1041Q2216O65b5593H7096M0227K4886K44466j79277M65589J76255
15472H59242J00582k63867C39546B6335L820a21605F8109h0779B16803a5260A00845
15460A13638m4267a7771l9550p146a271C52944j67641N1965J44964C9057b5827
15448c65550I0253b0784j05858F0000K54269J81293P2176M58948L09691j77908
15438A158469k45262j66905A13392K1350L3604j7898B5390j0234a13646b4280
15427B19009a362l9539j89273B72870A08851l268a0234o4652A35116i0301A32347
15415A2836P4268k1699b64669A56062p5876K01894j05799L7147A06530N8675C1514
15403b27953e6781A21223C7474M9348j5421b65921A57416a3397G0213C0757a01826
$$ y = [-110814, 91041, 173257, 173922, -25593, 87096, 127323, 152209, 396675, 217398, 682987, 859242, 959824, 695957, 339546, 26335, 30155, -121605, 68109, -80779, 216803, -15260, 100845, 113638, 69371, -17771, -57321, -64467, -1271, 352944, 185303, 237268, 382232, 39057, -25827, -365550, 90253, -20784, -126642, 60000, 314269, 495562, 567738, 1026686, 1336377, 1158469, 913207, 746302, 113392, 134742, 168346, 150448, 25390, 15156, -113646, -24280, 219009, -1362, -40901, -230174, 272870, 108851, 105583, -10234, -74886, 135116, -90301, 132347, 12836, 87104, 65405, -264669, 156062, 80186, 282080, 176281, 213428, 106530, 165205, 31514, -227953, -56781, 121223, 37474, 86822, 71401, -265921, 157416, -13397, 70213, 30757, -101826]
15391a79986A23986J17096P0029b76441p403D8106B0127b2193m8503C01968l4814
15380B67154j26666K82686j81168M0980G0863J86441A06786M0949m117N2746J22835
15369C19199A55266b9147A09552a65541j17340A96921C2824o41J27569m4136L36723
15358D52339m5011F0020c55369h0922B69361H1869M5384R5489A03497j5256J81054
15347B69295j27647J09142M4246d0610B76489L27422B85396o6783J10967d152
15336B23494J10589i1993D0211b8846j03050B99577A18636a40567A72145R1739
15326B63884D2212a16957D13597J68960k77632h3995C95742c7840I0925g8696
15315C47371o6213j8002A00569e4834k41202A87578p6693P3533b29922A39847
$$ y = [-179986, 123986, 241082, 311111, -276441, -283844, 48106, 20127, -22193, -70696, 301968, 267154, 140488, 423174, 242006, 282986, 70863, 257304, 106786, 147735, 143618, 196364, 319199, 155266, -29147, 109552, -165541, -282881, 196921, 32824, 32183, 159752, 115616, 452339, 407328, 60020, -355369, -80922, 269361, 81869, 127253, 222742, 103497, 88241, 269295, 141648, 250790, 295036, -40610, 276489, 603911, 285396, 218613, 329580, -4152, 223494, 334083, -91993, 40211, -28846, -131896, 299577, 118636, -140567, 172145, 263884, 42212, -116957, 413597, 582557, 304925, -83995, 395742, -37840, 90925, -78696, 347371, 281158, 263156, 100569, -54834, -296036, 187578, 110885, 184418, -229922, 139847]
15304B17347b30220I3095L3346N8167b45063D18693E4667n754c8185A95470M4028
15293B39498D1022c07966e3231B02956k1926G0957k5350J53722B1976a76092L7029
15282a39063q0316E2964j7543d0190D07297A4481a03340F4316a51935b8098A58259
15270i8821B88803B2684M3522g1621j41393P0499r1323a6432k8860q5351M2749
15259h7894a9192A19164Q4330n3113K06701b06423e753C487J84712c19953i2934
15247A77149k1425K5580J81889J04240k14376M39508O00148M06954j80381n5146
15237A464140m35686A03638D1438h9165A30274O025a25507E66912a53710h888
15226G1948J67671A06661L56265A04003b46835F7271c2306G4063L9910K1956J9359
$$ y = [217347, -230220, 93095, 126441, 184608, -245063, 418693, 54667, 48913, -38185, 195470, 239498, 41022, -307966, -53231, 202956, 181030, 70957, 45607, 199329, 21976, -176092, -139063, -219379, 52964, 35421, -40190, 407297, 14481, -103340, 64316, -151935, -28098, 158259, -98821, 288803, 22684, 66206, -71621, -213014, -142515, -233838, -16432, -45292, -130643, -87894, -19192, 119164, 203494, 150381, 357082, -206423, -5753, 3487, 188199, -319953, -92934, 177149, 155724, 181304, 363193, 467433, 253057, 692565, 1292713, 1699667, 1519286, 1464140, 1028454, 103638, 41438, -89165, 130274, 136299, -125507, 566912, -153710, -8888, 71948, 239619, 106661, 462926, 104003, -246835, 67271, -32306, 74063, 113973, 135929, 155288]
15215A55288k8361b69265E3126b28020A49641l9961b47600A06472b18541A53657
15204A46963j5890l5698P7029H1111b01062e6945G4506b81172J24794b3128j46886
15193a70014A32940a45690p7414A16049J0384J37702m8062c8922A44011C5092
15182h4087C5241L7402C824L00944j5945a15943d1971k70514H7927l9790g2794
15170i3724A32848n3754J15283E7756a54337C08390q8277G6381Q2862D5592a8230
15158d8047j39998d4254I2937d4285p9314A7370e0708B75954K4930e2966F517
15146A9288J75817q0398C3310g469j73155C3756J60332o8785C8314A4259B688
15134i2310l9448f0897A80820N3669b60405E7402j2027d7891o6678F981K66315
$$ y = [155288, 126927, -269265, 53126, -228020, 149641, 109680, -247600, 106472, -218541, 153657, 146963, 131073, 95375, 172404, 81111, -201062, -56945, 74506, -281172, -156378, -23128, -170014, 132940, -145690, -223104, 116049, 126433, 264135, 216073, -38922, 144011, 35092, -84087, 35241, 72643, 3824, 304768, 288823, -115943, -41971, -312485, 87927, 48137, -72794, -93724, 132848, 79094, 194377, 57756, -154337, 308390, 220113, 76381, 159243, 45592, -18230, -48047, -188045, -44254, 92937, -44285, -123599, 17370, -50708, 275954, 300884, -52966, 6517, 19288, 195105, 114707, 33310, -7469, -180624, 33756, 194088, 125303, 38314, 14259, 2688, -92310, -131758, -60897, 180820, 234489, -260405, 57402, 45375, -47891, -114569, 6981, 273296]
15123B73296K03489A10601J10139J14191j55526L88815B4914J35959e590A70077
15112d7151B11315o7090R4310D2293J26932j9285o3063L38592A41371a80004B88316
15100B55317F7474J05087h1236A05124R5553b41881C04971j10638L9452P3324
15090C07109A3097Q9351J03681l1253J17752o8799i2774C017K08049a19797C11139
15078B65412I9351j6218J57936A11134K01358j7857K0350F7662a19500K3582A25902
15066C23337B6708Q7997b64910A46367I94K9806L84177I4217L98554j23382A13289
15054C43526j55067J2262D4303L12340J51257j30064M9721r1607A40524J35784
15044B76308R1157R5172j97030o9123J31392o2061j7665o1436L2848d9777B34409
$$ y = [273296, 476785, 110601, 220740, 334931, 179405, 568220, 24914, 160873, -5590, 170077, -47151, 211315, 144225, 238535, 42293, 169225, 149940, 86877, 425469, 141371, -180004, 288316, 255317, 67474, 172561, -81236, 105124, 200677, -241881, 304971, 194333, 233785, 307109, 13097, 102448, 206129, 174876, 292628, 223829, -92774, 3017, 211066, -119797, 311139, 265412, 99351, 83133, 241069, 111134, 312492, 294635, 314985, 67662, -119500, -95918, 125902, 323337, 26708, 114705, -264910, 146367, 994, 30800, 414977, 94217, 492771, 369389, 113289, 343526, 188459, 200721, 44303, 356643, 507900, 377836, 427557, 335950, 140524, 276308, 367465, 462637, 265607, 196484, 327876, 265815, 248150, 186714, 219562, -49777, 234409]
15032C22865m4341K07505L66256k73007n8769K52930k28933B00307M43307l03405
15022C40209K49328r5192j25069K28864j87165J55792J41042A87945K17207A59004
15011D89368q8021j62192K49836j14888j2266N7836J76G7607K42822j3916K2857
15000C29370A03862N70721B06965K65591p1982J1303J1105A43095L15833J92931
14990F51859j56119k39292K70688j72002J35847q0884J26065B12016O00008K09202
14980A021226l93137p1136k19311l9068L05050j22278M57269l49738j34447J94416
14970F48846B71761j07802K30808j22180J96331k04670C8451K02061M29044B81187
14959D53710o2736A65075k9770L83413j29061Q1732A28296L54717k12174A17260
$$ y = [322865, 278524, 486029, 852285, 579278, 520509, 773439, 544506, 200307, 643614, 340209, 589537, 494345, 369276, 598140, 410975, 566767, 707809, 187945, 405152, 159004, 489368, 401347, 239155, 488991, 374103, 361837, 419673, 419849, 77607, 320429, 306513, 329370, 103862, 674583, 206965, 472556, 400574, 411877, 422982, 143095, 458928, 651859, 495740, 256448, 527136, 355134, 490981, 410097, 536162, 212016, 812024, 1021226, 628089, 556953, 337642, 298574, 603624, 481346, 938615, 588877, 454430, 648846, 271761, 163959, 394767, 272587, 468918, 264248, 38451, 240512, 669556, 281187, 453710, 390974, 165075, 135305, 518718, 389657, 471389, 128296, 483013, 270839, 117260]
14948C21071j5430q7648L19994A29598K94149N41520l38488L09156k52719k49952
14938D33264J3975p7739O2411k14039M89531k30289R3121J41448L26673K6641
14928A064997J06N0803o6629O14140J0225j11521l41207K44676l72006J00999
14918A194583J197790j40482l6287k94477k06368m85513l0961j37760k49919l66090
14908D44516l5553j335Q8868a44245B87075A05533J02025L52979r6063A65296
14897B37213A4380L87429D5223f539C21886J15856j40475J23240J07123B42660
14886E82603J67283B95375L87425K17172k1700j90326M3487j39559j1589L08715
14876H89000j42786A61568K44960k5512J9541j23021J70299j53357J80292K04063
$$ y = [321071, 305641, 217993, 537987, 129598, 423747, 965267, 626779, 935935, 683216, 433264, 447239, 369500, 431911, 217872, 707403, 477114, 570235, 711683, 1038356, 1064997, 1065103, 1115906, 1049277, 1663417, 1673642, 1562121, 1220914, 1465590, 1093584, 1194583, 2392373, 2251891, 2215604, 1921127, 1714759, 1229246, 1198285, 1060525, 810606, 444516, 408963, 407628, 496496, -144245, 287075, 105533, 207558, 560537, 464474, 165296, 237213, 14380, 401809, 45223, -6539, 321886, 437742, 297267, 420507, 527630, 242660, 582603, 749886, 295375, 682800, 899972, 878272, 687946, 731433, 591874, 580285, 889000, 746214, 161568, 406528, 381016, 400557, 277536, 447835, 294478, 474770, 678833]
14866F78833K65113j88885K11860k66247j41229n0912M9059A63774R9282R2909
14856C55965K8741K04142k62338A02908K98243M990j25270Q117J2286K03011K11439
14845G15724j67082L64315p5088K94370k74278k0837L33533j73892j67133j53945
14835F75687K01887C78368k4032j17631J97334K74208j62655B69422J84107J31378
14825E84907q1527J16212J33144l64091N4395O9303J95438C20832L08183L42123
14815I71138l52082n1675L24824k50280J56759m8106O0071J01740k21664K9587
14805G20312J78825j16115j00484R0241R1415B37545P1294n9682J09404j2476
14795C46085K24677n2043r2512l5774J90337n846K06315k82155K5623P8181j94434
$$ y = [678833, 943946, 755061, 966921, 700674, 559445, 508533, 557592, 163774, 263056, 355965, 384706, 588848, 326510, 102908, 401151, 406141, 280871, 288988, 301274, 504285, 715724, 548642, 912957, 837869, 1132239, 857961, 837124, 1170657, 996765, 829632, 675687, 877574, 378368, 354336, 236705, 434039, 708247, 545592, 269422, 453529, 584907, 503380, 619592, 752736, 388645, 443040, 512343, 707781, 320832, 629015, 971138, 619056, 567381, 892205, 641925, 798684, 750578, 810649, 912389, 690725, 720312, 899137, 783022, 682538, 772779, 864194, 237545, 308839, 249157, 358561, 346085, 570762, 518719, 426207, 390433, 580770, 574924, 781239, 499084, 524707, 602888, 408454]
14784D08454M94515j28393M2318j05661k18451J51058K8947K70154l05186J57279
14774G95034J28907k43259J98327j3633l19059O8940L9652K61798C90836L9556
14764D30392J75132j01415p193K27129k80841K1924k4927j2258K09406j8529n2143
14753E66677K14596C61339J98426O4557o463K3154J558M78330A43134M41378B21356
14741E64263K04195m2337M1823M2989j91318B23189N55632K83484l06265j1516
14731G44524K72297K76198j04507J35352M73426k12528r3629m89312j88522L9493
14721H52792K17372P5333D65259J20874J56130L7430r8466J48127J41227o2053
14711I08528l22603k02404L53732j49419l2366J77523M59469m0942N08737k601
$$ y = [408454, 902969, 774576, 816894, 711233, 492782, 643840, 672787, 942941, 637755, 795034, 923941, 680682, 879009, 865376, 546317, 615257, 654909, 916707, 390836, 430392, 605524, 504109, 496916, 724045, 443204, 465128, 440201, 427943, 637349, 618820, 566677, 781273, 361339, 559765, 624322, 617859, 641013, 642571, 1120901, 143134, 584512, 221356, 564263, 768458, 726121, 767944, 810933, 619615, 223189, 778821, 1062305, 756040, 744524, 1016821, 1293019, 1188512, 1323864, 1797290, 1584762, 1491133, 1001821, 813299, 852792, 1070164, 1145497, 465259, 586133, 742263, 779693, 681227, 829354, 970581, 908528, 585925, 383521, 737253, 587834, 555468, 732991, 1192460, 1151518, 1660255, 1657654]
14701A657654l9706j97992L58714H38762n9905j3986M03717k6615k52238j96701
14691F93034L06603K37036n71794J23495o9050L1401K95105k42858Q0008r8387
14681G84593r9890K83125J00446n08399L98469k17883n0975K1556J64636l74476
14671E01202M28865J91601k06913o4697k35787J21255J43512q0083J7388j289
14661H15054N4947K7332L2160j75910j15941M62267q6685Q7874J15577J05922
14651A322597j45703K4742K4558k25828D94237M99648j43190J39451q4400O2878
14641I68624J31104r9602R0293j41560k9948J3411J1498m1010M6889L3422j72924
14630H10197L98404J02025R6671N4291o05871O7696J60653l08668K75586J25179
$$ y = [1657654, 1617948, 1419956, 1778670, 838762, 778857, 764871, 1168588, 1141973, 889735, 693034, 999637, 1236673, 664879, 788374, 719324, 750725, 1045830, 802972, 882980, 784593, 684703, 967828, 1068274, 559875, 958344, 740461, 689486, 711042, 875678, 501202, 930067, 1121668, 914755, 850058, 614271, 735526, 879038, 798955, 816343, 815054, 870001, 897333, 929493, 753583, 637642, 1099909, 1013224, 1101098, 1216675, 1322597, 1176894, 1201636, 1226194, 1000366, 494237, 993885, 850695, 990146, 905746, 968624, 1099728, 1000126, 1090419, 948859, 918911, 932322, 943820, 902810, 949699, 983121, 810197, 1208601, 1310626, 1407297, 1461588, 855717, 923413, 1084066, 775398, 1050984, 1176163]
14620A176163J79284j69382j88266K86030K3708k19541P5103L41601k10048j87476
14610A107176O1448j548k84669M63133N5307n9353K65505m10479J02084k81274
14600A017330L68766o5205L31443k61612j45506j5497K45758M7799M6611m53013
14590A116874L37035J76743J65760j29324l4537N5238k40372K50108J0406j68567
14580A539364K5478j9615L53477l57615R0128J17990q3047L32222m74506J57884
14570A681760K17890J09003j55539R1859j14904L08975K05140k68758l59815K72269
14560A987880K47351K51146m33239M62834j41783J21431L33062J22962K32279
14551C183923M50741M84903J939887L874929P800422J7820560Q469825B0417024
$$ y = [1176163, 1355447, 1186065, 997799, 1283829, 1307537, 1087996, 1163099, 1504700, 1294652, 1107176, 1168624, 1167076, 882407, 1345540, 1400847, 1341494, 1606999, 1196520, 1298604, 1017330, 1386096, 1320891, 1652334, 1390722, 1245216, 1229719, 1475477, 1523276, 1569887, 1116874, 1453909, 1630652, 1796412, 1667088, 1632551, 1687789, 1447417, 1697525, 1707931, 1539364, 1564842, 1545227, 1898704, 1541089, 1631217, 1749207, 1666160, 1998382, 1523876, 1681760, 1899650, 2008653, 1853114, 1944973, 1830069, 2139044, 2344184, 2075426, 1715611, 1987880, 2235231, 2486377, 2053138, 2515972, 2374189, 2495620, 2828682, 2951644, 3183923, 3634664, 4119567, 6059454, 9934383, 17734805, 35555365, 44025190, 20417024]
14542H908176D334801j705148m47085j51049M67805J357399Q41737j575944r72455
14533B150061k40899l16332J97290q5230K7282J41311K35500m86922J7732L03685
14523A943478O5071J14792k62426k9577K25826J03899j79298J99244K59945l87890
14513B053064P1144L31711j16494L0758J55179j67291L30997O8078m30351J99252
14503B526047J76184k66307j14785N00003P2489k76162o9198M47359k17799n3781
14493B724050L12795l08883J29687Q7788K14557l23626K35998L00352l14150J73542
14483C232110L9968r4324K76002j45597q0283O7359j48090M68550n5335J65878
14473C726238m3350n04339N98754k60194M0326L10848k02763J08568m160K62209
$$ y = [8908176, 4334801, 2629653, 2182568, 2031519, 2499324, 3856723, 4698460, 3122516, 2150061, 1909162, 1592830, 1790120, 1704890, 1732172, 1873483, 2108983, 1622061, 1639793, 1943478, 2008549, 2123341, 1860915, 1831338, 2057164, 2161063, 1981765, 2181009, 2440954, 2053064, 2124208, 2455919, 2339425, 2370183, 2525362, 2358071, 2689068, 2757146, 2326795, 2526047, 2702231, 2435924, 2321139, 2821142, 2893631, 2617469, 2548271, 2995630, 2777831, 2724050, 3036845, 2727962, 2857649, 2945437, 3159994, 2836368, 3072366, 3372718, 3058568, 3232110, 3272078, 3177754, 3453756, 3308159, 3227876, 3295235, 3147145, 3615695, 3560360, 3726238, 3682888, 3178549, 3777303, 3517109, 3557435, 3868283, 3665520, 3774088, 3769928, 4032137]
14463D032137k51434L41675K8054j04256K08119j37065l4715J78665l78014N96475
14453D479641l17894K31426j9206K77493j35565k25739M83427J33281j7638R334
14443D898560L4553L7405J73670M5019J3668n3011M59509o8116j5022J1495K85788
14432E823518j3205k83149M55330j8058K49497m6809n3718J08896M10983o6173
14422F567112n9439M33961J63750M5030m45806M31872J49481l5004K90631q784
14412G532804J60077k2976M1791K0360K02085L88071J13318J68229J56654k08477
14402H551936Q5190J64843J27625J65455K12948j37508N32118k08282K00095K02558
14392I896978L14554q5079N20244j55851L91635M19302J23032M7433N96780K61403
$$ y = [4032137, 3780703, 4122378, 4150432, 4046176, 4254295, 4117230, 4082515, 4261180, 3883166, 4479641, 4161747, 4393173, 4373967, 4651460, 4515895, 4290156, 4773583, 4906864, 4889226, 4898560, 4933113, 4970518, 5144188, 5189207, 5202875, 5149864, 5609373, 5541257, 5526235, 5537730, 5823518, 5810313, 5527164, 5982494, 5964436, 6213933, 6167124, 6113406, 6222302, 6633285, 6567112, 6507673, 6941634, 7105384, 7150414, 6704608, 7136480, 7285961, 7250957, 7541588, 7532804, 7692881, 7669905, 7711696, 7732056, 7934141, 8322212, 8435530, 8603759, 8760413, 8551936, 8637126, 8801969, 8929594, 9095049, 9307997, 9170489, 9702607, 9494325, 9694420, 9896978, 10211532, 10126453, 10646697, 10490846, 10882481, 11301783, 11424815, 11472248, 12069028, 12330431]
14382A2330431r2993L81510J01655L9698J99545J17060M67067L46164p4062J86709
14372A4002784K42249M23898N14046J81882N23405L41650N42460K69125q693N29702
14362A7562508O0952N15234O3735N33396M06240L66147N53187P99684Q8133P51785
14352B1701001L43070N69534L41294R46193M63078M10984Q72770M88704N56333
14343B6692961Q99035Q72332N83873Q78171N83849J209792P68277J219331O73617
14334C4381238O70775J276347J014670J426369P28716J331414J048765J764642
14326D3642936J401549J493402J644402J456224J851184K166366J600514K084405
14318E7340982J769658K477299K232198K306230K513891K793406L055750K864752
$$ y = [12330431, 12237438, 12618948, 12720603, 12760301, 12959846, 13076906, 13543973, 13890137, 13816075, 14002784, 14245033, 14668931, 15182977, 15364859, 15888264, 16229914, 16772374, 17041499, 17032806, 17562508, 17623460, 18138694, 18202429, 18735825, 19142065, 19508212, 20061399, 20861083, 20949216, 21701001, 22044071, 22613605, 22954899, 23901092, 24364170, 24775154, 25647924, 26136628, 26692961, 27591996, 28464328, 29048201, 29926372, 30510221, 31720013, 32488290, 33707621, 34381238, 35052013, 36328360, 37343030, 38769399, 39498115, 40829529, 41878294, 43642936, 45044485, 46537887, 48182289, 49638513, 51489697, 53656063, 55256577, 57340982, 59110640, 61587939, 63820137, 66126367, 68640258, 71433664, 74489414, 77354166]
14310G7354166L365608L400006L560249L784375M222175M442676M676479M933195
14302A09738929N296086N852299N764497O442456O486958P576970P477267Q454255
14294A63089717Q667690R658049R581521J0937444J0934031J1957041J2536536
14287B37362029J2910998J4131986J4602032J5219906J5449911J6011597J6122439
14280C41810898J6685823J6291713J6344505J5071440J4761473J3018116J0945982
14273D44929950O283302J634175R57611P93038j528280j656608m064980k918241
14265D44429967o094909j0401727j2974663j4291467j5520108j6388972j6796215
14258C51961906j6635506j6573229j6212377j5587782j4822916j4407250j3831744
$$ y = [77354166, 80719774, 84119780, 87680029, 91464404, 95686579, 100129255, 104805734, 109738929, 115035015, 120887314, 126651811, 133094267, 139581225, 147158195, 154635462, 163089717, 171757407, 181415456, 190996977, 201934421, 212868452, 224825493, 237362029, 250273027, 264405013, 279007045, 294226951, 309676862, 325688459, 341810898, 358496721, 374788434, 391132939, 406204379, 420965852, 433983968, 444929950, 451213252, 452847427, 453805038, 454598076, 453069796, 451413188, 447348208, 444429967, 438335058, 427933331, 414958668, 400667201, 385147093, 368758121, 351961906, 335326400, 318753171, 302540794, 286953012, 272130096, 257722846, 243891102]
14251B43891102j3196533j2216069j1792024j0437013r610145q967649r567804
14244A68103865q090951p987186p694265p149448o502485o500155n623781n001882
14236A13553712n035657n107839m494442m767719l791159l246307l452785m057786
14228G9600018l067651k770747k746731k861738k794930k424671j967032k372528
14220E8593990j893796j848237k078295j899728j455674j820408j283469j228812
14212D5085571j533553j487876j162543j415404q69290q67711j125408j146211
14204C5477575j453373j120049o93808l50195q84193q61159j063544p36663r20219
14195B7394372o38167k09383q58147j177551l60575k89344q67234n04095k76717
$$ y = [243891102, 230694569, 218478500, 206686476, 196249463, 186639318, 177671669, 168103865, 160012914, 152025728, 144331463, 137182015, 130679530, 124179375, 118555594, 113553712, 108518055, 103410216, 98915774, 94148055, 90356896, 87110589, 83657804, 79600018, 76532367, 73761620, 71014889, 68153151, 65358221, 62933550, 60966518, 58593990, 56700194, 54851957, 52773662, 50873934, 49418260, 47597852, 46314383, 45085571, 43552018, 42064142, 40901599, 39486195, 38616905, 37749194, 36623786, 35477575, 34024202, 32904153, 32210345, 31860150, 30975957, 30114798, 29051254, 28314591, 27394372, 26756205, 26546822, 25688675, 24511124, 24150549, 23861205, 22993971, 22489876, 22213159]
14186B2213159p57883p43838N143r20541p9896m59240n6527l54575r72291l94914
14176A7478597m55756o8944l41912o65217K72988n07458m63535k50658O0448r28285
14166A4130268o4969j29895Q100n26280l02690j81591L1414p71751r2132J9640
14156A2120114N0421o08659j10613n04204K08628n43949K80327n28478J92640
14147A0556227o55935j35923n4402o1972k59698J72701p07621K17764l46029j56611
14137H568501r5472l4819J15252j84349q8813o05041J69111P9357l86193K85369
14127G822903m44315j08226J41338m31356l671j18303p9655M7468j44644q2812
14117F598727m54544M06287l46937K19326J11807k82804q5822n55903L29680j74789
$$ y = [22213159, 21455276, 20711438, 20716581, 19796040, 19716144, 19256904, 19200377, 18845802, 17873511, 17478597, 17022841, 16953897, 16611985, 15946768, 16219756, 15712298, 15248763, 14998105, 15058553, 14130268, 14065299, 13935404, 13943504, 13417224, 13114534, 12932943, 12964357, 12192606, 12100474, 12120114, 12170535, 11561876, 11451263, 10947059, 11155687, 10611738, 10892065, 10363587, 10556227, 9900292, 9764369, 9709967, 9647995, 9388297, 9560998, 8853377, 9071141, 8725112, 8568501, 8473029, 8438210, 8553462, 8369113, 8280300, 7675259, 7844370, 7923727, 7537534, 7822903, 7378588, 7270362, 7411700, 6980344, 6976673, 6858370, 6778715, 6826183, 6681539, 6598727, 6144183, 6550470, 6203533, 6422859, 6534666, 6251862, 6166040, 5610137, 5939817, 5765028]
14107E765028K97237m13553m06957L02096k74862J10937K07857n4768k85456p3216
14097E174343l20229Q7469J72400j10279j2070l23766k53356M37029m4834M1687
14087D848394k42378J6694k01874K9670M095o1911M5053j28548j56518k57371
14077C895306O1543L0703K54944k8909j73203k16271P2167k41383K94846o7563
14067C882180n13473M18132l0996j28332L8513K6084K85691n36307J91996K62169
14057C895657n82055L8268J36511j3014m41357P8207M67649m30674K02796m59792
14047B892196K66280j66142K674o2166j2203n715L27031m04128j68488N58511
14037C227850n36493j72533J69390p9469K27340k95970J48984j3181O030k36257
$$ y = [5765028, 6062265, 5648712, 5241755, 5543851, 5268989, 5379926, 5587783, 5533015, 5247559, 5174343, 4854114, 4941583, 5113983, 5003704, 4991634, 4667868, 4414512, 4851541, 4806707, 4848394, 4606016, 4622710, 4420836, 4450506, 4454601, 4392690, 4437743, 4309195, 4152677, 3895306, 3956849, 3987552, 4242496, 4213587, 4040384, 3824113, 3896280, 3654897, 3949743, 3882180, 3368707, 3786839, 3755843, 3627511, 3666024, 3692108, 3977799, 3441492, 3633488, 3895657, 3313602, 3351870, 3488381, 3475367, 3034010, 3112217, 3579866, 3149192, 3351988, 2892196, 3158476, 2992334, 2995008, 2932842, 2920639, 2914924, 3241955, 2837827, 2669339, 3227850, 2691357, 2518824, 2688214, 2608745, 2836085, 2540115, 2689099, 2675918, 2681948, 2445691]
14027B445691J53667j64320J10661L4703n7861r5527o0749j62485j24519J17947
14017B197208j42959M8039J80346j03693j76198J23985K92544m70865m3999K20208
14007B124616o09055J86757K19441l235k0185K05269k49879k91654L41073m36263
13997A466885L64481n430K32811l63609j00667j00397k34952P24479Q62537K239656
13987E085794O651257J5823003J7656619j7457398j3432695n871135l033323j290099
13979D132023m79685l67020m33805m26529L46293j22200n36216N12818j53468
13970B472211j7118j87993o3452k86043q6565J26233p0796L6220j31667m692j88545
13959A597793K14442M5528J9504R0736O6843m68373Q9244J35212O8064k29920
$$ y = [2445691, 2599358, 2435038, 2545699, 2580402, 2522541, 2427014, 2366265, 2203780, 2079261, 2197208, 2054249, 2102288, 2282634, 2178941, 2002743, 2126728, 2419272, 1948407, 1904408, 2124616, 1515561, 1702318, 1921759, 1918524, 1898339, 2103608, 1853729, 1562075, 1903148, 1466885, 1831366, 1825936, 2058747, 1695138, 1594471, 1494074, 1259122, 1983601, 2846138, 5085794, 11737051, 27560054, 45216673, 27759275, 14326580, 8455445, 5422122, 4132023, 3652338, 3285318, 2851513, 2424984, 2771277, 2649077, 2112861, 2625679, 2472211, 2455093, 2267100, 2203648, 1917605, 1831040, 1957273, 1886477, 1922697, 1791030, 1786338, 1597793, 1812235, 1857763, 1877267, 1968003, 2034846, 1566473, 1655717, 1790929, 1858993, 1629073]
13949A629073K47728j92083J93005m81249Q7572K08875J03694o85061K66405K5604
13939A403563l3779M91490j27495l07928K8380o5423J69578J11421k84889L2390
13929A417308R2142l61674L86003j61881R4558J57892q082m3801n55910K50004
13919A266559j12378L85427j03847q6314p5463J42252l41333L70165l13617Q49
13909A132300K64982m4868J1551K05558o33877J85153j96966J27762N6097M26572
13899A534264l10266k4709j41226L91610m25834n1475L20082p5395K55895k79449
13889A193497l55844J8500O11460q8352k01912M1357M3202l00917L38378j11084
13879A188285J88445o76447N10376r5005l09270J96399k27065M5645l988K7231
$$ y = [1629073, 1876801, 1684718, 1877723, 1396474, 1484046, 1692921, 1796615, 1111554, 1377959, 1403563, 1369784, 1861274, 1733779, 1425851, 1454231, 1388808, 1558386, 1669807, 1384918, 1417308, 1509450, 1147776, 1533779, 1371898, 1466456, 1624348, 1616266, 1572465, 1016555, 1266559, 1154181, 1539608, 1435761, 1349447, 1273984, 1416236, 1074903, 1445068, 1131451, 1132300, 1397282, 1352414, 1363965, 1569523, 935646, 1120799, 923833, 1051595, 1107692, 1534264, 1223998, 1199289, 1058063, 1449673, 1023839, 972364, 1292446, 1217051, 1472946, 1193497, 837653, 856153, 1467613, 1379261, 1177349, 1218706, 1261908, 960991, 1299369, 1188285, 1376730, 700283, 1210659, 1115654, 806384, 1002783, 775718, 821363, 817375, 844606]
13869H44606L364J07588K72831R0R3798n78806K12959j5360j89149J21811j58636
13858G15096P1469L90920m29471J66645j54599L12165P7619r0489j24291l4321
13848I00743k53023Q1718K2937M0385k9477M3821n1044K5943j21312L44122m3744
13837I61069J64267k96701J37346j13608k31017J13736K65748l97917K06193K04801
13827A013917n1631k48595N564O5219J73983k70008L2218J45987j87203R7297
13817G76748M19838m00114O3919k96187L44213C69724L53985o1563l7891L24423
13807I48678C00897N25084K4409j59552l3244N1521Q8685r1197j3549j30586M3381
13796F05849m1570L22261k67066J48003l27384j19923K81863P7058o3904R0151
$$ y = [844606, 847970, 955558, 1228389, 1228479, 1322277, 743471, 956430, 941070, 751921, 873732, 715096, 786565, 1177485, 748014, 914659, 760060, 1072225, 1149844, 1059355, 935064, 900743, 647720, 729438, 752375, 792760, 763283, 807104, 756060, 782003, 660691, 1004813, 961069, 1125336, 828635, 965981, 852373, 621356, 735092, 1000840, 602923, 809116, 1013917, 962286, 713691, 719255, 784474, 958457, 688449, 720667, 866654, 679451, 776748, 1196586, 796472, 860391, 564204, 908417, 369724, 723709, 662146, 624255, 948678, 300897, 825981, 850390, 690838, 657594, 709115, 797800, 706603, 693054, 562468, 605849, 564279, 886540, 619474, 767477, 440093, 320170, 602033, 679091, 615187, 705338]
13786G05338l8363k69609J14375Q0283L26266q8790R953k06534J97493l88611
13776D41801K28379n1137B64444J56938L15302o8889j5089B81212L61946K7754
13766F70912l8430J26934L1639k24499K06171j35127q2158j11752m8933K32821
13756F27578K37723l05477K9677J96126k57650j59342J05307M5571R1424k01420
13746D09517Q98n1600M35287l57600J37170A95325L22427B36941J96025j03880
13736C29086L16184L1049o9714N0014k7417k78666L01494j86363J8519J6515o0254
13725D40447K43850j93090K21993B67744M05719j25508L7883j56189j8345Q325
13715D19629j37310L15496j22550J76219k73687k4922A54366M64534q8148L5296
$$ y = [705338, 666975, 397366, 511741, 592024, 918290, 829500, 839453, 632919, 830412, 441801, 670180, 619043, 264444, 421382, 736684, 667795, 652706, 281212, 643158, 670912, 632482, 759416, 791055, 566556, 772727, 637600, 555442, 443690, 394757, 627578, 865301, 559824, 589501, 785627, 527977, 368635, 473942, 519513, 610937, 409517, 410415, 358815, 794102, 436502, 573672, 195325, 517752, 236941, 432966, 329086, 645270, 676319, 606605, 656619, 629202, 350536, 652030, 465667, 484186, 500701, 440447, 684297, 491207, 713200, 267744, 673463, 547955, 585838, 429649, 411304, 419629, 282319, 597815, 475265, 651484, 377797, 352875, 154366, 618900, 530752, 566048]
13705E66048B69618J49634j06276k6096M5542K27558N1716L2005N1844j71447
13695E24098F7562N29151k11559q2604P7056n2422L32177J04260j85832r1035
13685D86754j75417M8889m7407N6443Q4391Q5851A88478L3364J83403Q6133O0833
13674E52211k24380j25470K61781n5036M863J41398k63614n900k6607J40586j09505
13663B90327p1327L22394j02618A20583M72912j23702p9192A3180K71422J31852
13653D16454K0571q6840L32092B28383O1582J02385I7800L02560J46784k12514
13643C34630r9061J33120J69861j20196q8675j44588J90675j41963N4820N93481
13633H82104H8813L44777A41967K42272k0512M0123J73350J736o5814B29231J61961
$$ y = [566048, 269618, 419252, 312976, 286880, 332422, 559980, 611696, 643701, 695545, 524098, 67562, 596713, 385154, 302550, 379606, 327184, 659361, 763621, 577789, 486754, 311337, 360226, 312819, 369262, 453653, 539504, 188478, 221842, 405245, 491378, 552211, 327831, 202361, 464142, 409106, 413969, 555367, 291753, 285853, 259246, 399832, 290327, 219000, 541394, 438776, 120583, 593495, 469793, 390601, 13180, 284602, 416454, 437025, 350185, 682277, 228383, 289965, 392350, 97800, 400360, 547144, 334630, 235569, 368689, 538550, 418354, 329679, 185091, 375766, 233803, 288623, 882104, 88813, 433590, 141967, 384239, 363727, 403850, 577200, 578936, 513122, 229231, 391192]
13622C91192R6931j87673K16756j43972A82900K94668j62644P4111j43718K24154
13612D69471A70155M6212M36547C4853J15982L72880k06296m3844l9658J70845
13602D04762j57413J10630m1846L0154F1059L00084m1518J82663j30235A51820
13591E0782L43281Q5779k07752j14878M41503b8287B22242L2881J68979j01369
13581C22733l445n6550K36774A04384M96558n234r4266j82395r2918L87502D9973
13569G3153M48682B30464j07905J91992J17711B5872K4378R6625a04811a9594
13558B84310m5520L82910j43616A89572K06503N9564e4870A52481A4644J91605
13548B06249m2962p014M6038a69420A96681a11297E08363a42360C54642l3898
$$ y = [391192, 488123, 300450, 517206, 373234, 182900, 477568, 314924, 389035, 245317, 469471, 170155, 216367, 652914, 34853, 150835, 523715, 317419, 273575, 233917, 404762, 247349, 357979, 316133, 346287, 61059, 361143, 319625, 502288, 372053, 151820, 50782, 394063, 479842, 272090, 157212, 598715, -28287, 222242, 255123, 424102, 322733, 319288, 262738, 499512, 104384, 600942, 595708, 501442, 319047, 226129, 613631, 49973, 73153, 521835, 230464, 122559, 314551, 432262, 25872, 50250, 146875, -104811, -19594, 284310, 238790, 621700, 478084, 189572, 396075, 455639, -54870, 152481, 14644, 206249, 163287, 156273, 202311, -169420, 196681, -111297, 508363, -142360, 354642, 320744]
13538C20744J17706A31572K33026M2994n632q9359j6855j34100o0992O5809L4322
13527B00785J42750J9224n3437r0092i2359F260J37642L27323j60480L55469k76595
13516C89619A0863K01169J30554j64420j857J6607q1312n121K01437H7474Q3950
13505A71424L7229o5546F4945K92831C4267K68940d9352B50033K89811B56868
13494i1136C6851M10L47850A73275n228n4337M9543p2740F273M6182J84808g7933
13481B92090Q3355r8573J2685a06328F8373K32414j9392k2093J32552n3995N1385
13470C89244A29973f7821C29027N2339I1403J12120K62656A90347n6919j8914
13460A14514K9520J12708n5642H1206g3250D61903G9535J86981B2278L14377A15426
$$ y = [320744, 438450, 131572, 364598, 407592, 401960, 312601, 295746, 161646, 100654, 166463, 200785, 343535, 362759, 309322, 219230, -92359, 6260, 143902, 471225, 310745, 666214, 389619, 10863, 212032, 342586, 178166, 176309, 192916, 111604, 106483, 307920, 87474, 171424, 208653, 143107, 64945, 357776, 34267, 303207, -49352, 250033, 539844, 256868, -91136, 36851, 37261, 385111, 173275, 168047, 113710, 163253, 90513, 6273, 52455, 237263, -77933, 292090, 375445, 276872, 289557, -106328, 68373, 300787, 281395, 259302, 391854, 337859, 389244, 129973, -67821, 329027, 381366, 91403, 203523, 466179, 190347, 133428, 114514, 144034, 256742, 201100, 81206, -73250, 461903, 79535, 266516, 22278, 336655, 115426]
13448f5052B00335h1806M99l2029C37972F5557Q3528F6650g4532I1234l6739J939
13436E6434J48060K65001D5698a72679C31220g6417K0439C84698E2530L88628
13426D41158k00853c7314p9689C39240K53259A76971j2419J01526C4061J76929
13416B10990e4989B37343i1033A94505e2465A65887R4631p1063a4602A01895K71788
13405C73683r1418A21288L52783B27414E4742O1154K58939L2000j15049B340M92337
13394D94677p5428e0701A50816f8707B18891a35751D63904I1670N376J71670o6200
13383B02516r7828K40789D3360K47606A20172J90871G1161J84962O8303L4157
13373C58583b62902D18203A08755J24206g9053E5450K6700K40965P4188b9319
$$ y = [-65052, 200335, -81806, -81307, -113336, 337972, 65557, 149085, 66650, -74532, 91234, 54495, 56434, 204494, 469495, 45698, -172679, 331220, -76417, -55978, 384698, 52530, 441158, 240305, -37314, -117003, 339240, 592499, 176971, 164552, 266078, 34061, 210990, -54989, 237343, -91033, 194505, -52465, 165887, 260518, 189455, -14602, 101895, 373683, 282265, 121288, 474071, 227414, 54742, 115896, 374835, 406835, 291786, 2340, 494677, 419249, -50701, 150816, -68707, 218891, -135751, 463904, 91670, 97046, 268716, 202516, 104688, 345477, 43360, 290966, 120172, 311043, 71161, 256123, 324426, 358583, -262902, 418203, 108755, 232961, -79053, 55450, 82150, 323115, 397303, -29319]
13362F85662B72750P9282j1786J83422Q4594F6714C648K39421A1740J13605J26058
13351B51403o0038N6577J39322I3974J03535Q7988j33782J7783R4784L00991A83082
13339D28163K9262j94537Q1257r2387I1847J55757A03579M7952a07211B63193
13328C50904A15252j3837L77724e9414G3778j6329a20001B08614D3319Q1134a91398
13316C75487q3064b275F6141h5066D62546A25807M4383L64135k51041D4089K11758
13305B55847E5345N0439L590K38930K07217B05417N3559p8700d7665C04277i0466
13293B9324b88257A63674J18053c6222p6713E8293a5964B97937K5653G8013J1108
13282H9121a59790D84638c30186A16414B9238i1179L6073A38943d4446C0218e5891
$$ y = [685662, 272750, 352032, 340246, 523668, 608262, 66714, 3648, 243069, 11740, 125345, 251403, 191365, 247942, 387264, 93974, 197509, 285497, 151715, 169498, 264282, 565273, 183082, 428163, 457425, 262888, 344145, 251758, 91847, 247604, 103579, 151531, -107211, 263193, 350904, 115252, 101415, 479139, -59414, 73778, 57449, -120001, 208614, 43319, 124453, -191398, 375487, 292423, -2275, 66141, -85066, 462546, 125807, 170190, 534325, 283284, 44089, 255847, 55345, 105784, 109374, 348304, 555521, 205417, 258976, 180276, -47665, 304277, -90466, 29324, -288257, 163674, 281727, -36222, -112935, 58293, -15964, 297937, 323590, 78013, 89121, -159790, 484638, -330186, 116414, 29238, -91179, -55106, 138943, -44446, 30218, -55891]
13270A30921D8160K82192A14874k2183N7575B1227J01695J07271J13125A19221
13259B7863J07440J18597A18029E2099K05378J2791a24336F4119J91850c45514
13248E2097K49543b51476J03072A16175j3327D8714J11787E5013K47300a76250
13237a06867j03681Q8991I9455J6481c6564A14463a57901A28082a9167p821p7012
13226a04000C23991a24992B96458B8160J01301b88727e9992B23245a80280B41617
13215A55767J38283N4161B3621J43984j7879J06413B9710K11069A8767J58311
13205A77078J28638j27863F6972a54814C8802L19441A42592l7250a28242p0204
13195a98446A11788R3963a36130A35847N15710a65087B50344q1274J85603H4382
$$ y = [130921, 48160, 330352, 114874, 92691, 150266, 21227, 122922, 230193, 343318, 119221, 27863, 135303, 253900, 118029, 52099, 257477, 270268, -124336, 64119, 255969, -345514, 52097, 301640, -251476, -148404, 116175, 102848, 48714, 160501, 55013, 302313, -176250, -106867, -210548, -121557, 99455, 115936, -36564, 114463, -157901, 128082, -19167, -26988, -104000, 323991, -124992, 296458, 28160, 129461, -288727, -59992, 223245, -180280, 241617, 155767, 294050, 348211, 23621, 167605, 149726, 256139, 29710, 240779, 18767, 177078, 305716, 177853, 66972, -154814, 38802, 358243, 142592, 105342, -128242, -198446, 111788, 205751, -136130, 135847, 651557, -165087, 250344, 169070, 354673, 84382]
13184A11068G183K19982m3695Q7952A25550J56404a29443O754e1827B48437a80804
13172A05919N6693p4655O9146h7538D7591B3762M3910P5975a59168B17120g8738
13160B27150E0647P8937N3118b04592D8798J93191o7686C178J56878a46277A17463
13148B59619I0923b33327H2310M9290A1351b25130B03943l7535K82407B09844
13137b52411C7469M65814f9271j40162C07345a36024j25877B12219L6630e1809
13126E4070h5999j03705P9218A46972k2575g4078J65C5756i0513D656R9770B865
13113A93902c543A42162J3107a01724B52284q7541N827C7495a3938j23564j38506
13102b76008C70956A59676I305a72021C5149a0905j16580N034p8511M09F2540
$$ y = [111068, 7183, 227165, 183470, 271422, 125550, 281954, -129443, -122689, -51827, 248437, -180804, 105919, 162612, 87957, 157103, -87538, 47591, 23762, 67672, 143647, -159168, 217120, -78738, 227150, 50647, 129584, 182702, -204592, 48798, 241989, 174303, 3178, 160056, -146277, 117463, 259619, 90923, -233327, 82310, 131600, 11351, -225130, 203943, 166408, 448815, 209844, -252411, 37469, 503283, -69271, -209433, 307345, -136024, -261901, 212219, 248849, -51809, 54070, -85999, -189704, -110486, 146972, 124397, -74078, -73913, 35756, -90513, 4656, 104426, 2865, 193902, -3543, 142162, 155269, -101724, 252284, 164743, 170570, 37495, -13938, -137502, -276008, 370956, 159676, 9305, -172021, 35149, -10905, -127485, -122451, -200962, -200553, 62540]
13090c4948n8642j7476A07218Q9888J51794a07841k53685c4348B60687p5054p2405
13079A13228a79450A54654F7846P4417J46323j00500a1773j35271B05538g6568
13068I2280c8291B77911k149E7959L6051M8734O9402q9961h2365E1216i9291o2650
13056a61941C9594a8304D5216c3254J2984A88216m3308C1648L74767A27714C2730
13044a04252B14571a37636C56726e28908b48421O1623N3942F6030Q7290c79282
13033F3754Q8833J50168k1001A16131K99770c3528A73710J47620f322A35311N595
13022A40906o9073c4752m1246F1024O639O6725i5261I7172N28h1930A73650i7011
13009A21871a12609a2492A90691J17367E2540k0463K00326b76403B71128K28701
$$ y = [-34948, -93590, -111066, 107218, 197106, 348900, -107841, -361526, -34348, 260687, 185633, 113228, -179450, 154654, 67846, 142263, 288586, 188086, -11773, -147044, 205538, -76568, 92280, -38291, 277911, 275762, 57959, 94010, 142744, 212146, 122185, -82365, 51216, -99291, -161941, 39594, -18304, 45216, -33254, -20270, 188216, 144908, 31648, 406415, 127714, 32730, -104252, 214571, -137636, 356726, -528908, -248421, -186798, -132856, 66030, 153320, -379282, 63754, 152587, 302755, 281754, 116131, 415901, -33528, 173710, 321330, -6322, 135311, 140906, 71833, -34752, -75998, 61024, 67663, 134388, -95261, 97172, 97700, -81930, 173650, -97011, 121871, -112609, -12492, 190691, 308058, 52540, 32077, 232403, -276403, 271128, 499829]
12999D99829B16373P9271B4571a16348N4954i546C06256h7232C0126a55211B77714
12987C72690A52151n1613J61221r8915g4823c6338B05227C5634e1213B95402a92583
12975c51626b2129j0215B9687K05045O7214G9919b00393I0177a04554j13795K4927
12964a93422c0254B452M0834J49634c6710A43340b3748G8523Q0966k2851K8400
12953A65038g7250k06729a6323B69146C976J44196C1291a26424j62218A80845
12942F1829J02760c5748r45G8869A1959e6424A66147e3117F0625K5567f1267o1753
12930a23020j82676F3021i6003a2013B41239e9998j80740F2078n813J04597o0741
12919A00121C0016c97170B12244b64559i5241r8865h1394B4913c1086A57135a34837
$$ y = [499829, 216373, 295644, 24571, -116348, -61394, -9546, 306256, -87232, 30126, -155211, 277714, 372690, 152151, 100538, 261759, 162844, -74823, -36338, 205227, 35634, -51213, 295402, -192583, -351626, -22129, -32344, 29687, 234732, 301946, 79919, -200393, 90177, -104554, -218349, -193422, -30254, 2452, 43286, 192920, -36710, 143340, -23748, 78523, 159489, 136638, 165038, -77250, -283979, -16323, 269146, 3976, 148172, 31291, -126424, -288642, 180845, 61829, 164589, -35748, -36693, 78869, 11959, -56424, 166147, -53117, 60625, 86192, -61267, -123020, -305696, 63021, -96003, -12013, 241239, -59998, -240738, 62078, 56265, 160862, 100121, 30016, -397170, 212244, -264559, -95241, -194106, -81394, 24913, -31086, 157135, -134837]
12907A26466d76411K23986f6604b3678l52058A71100h6809A27143J61365a09093
12896A03844b47338a03080j0067i230l75782I4276a1739r8094o2708P6959C3595
12884h9038n3992A22464C0200L227J34985c55652C5343e8881n2689k0426A05536
12872c5456B85313e3263G386L41522b18637b8970p3511H404b56219J8642A17758
12860B91688A32395d8375H4127b89178a17698E3217R3878m5231J06431q4198B6268
12848a74712A44978m8472A4221a06040C56445b52774A14388N3366f9458F2526
12837d85229A34826g8890c4658B15331b93851J17423A90154k9865b8107B4135
12826B78935b5295A2199b30378R0816n4816Q1492q6213B3154L97429H0793g0831
$$ y = [126466, -476411, -252425, -66604, -23678, -375736, 171100, -86809, 127143, 288508, -109093, 103844, -247338, -103080, -113147, -9230, -385012, 94276, -11739, -109833, -172541, -95582, 33595, -89038, -143030, 122464, 30200, 33427, 168412, -355652, 35343, -58881, -111570, -131996, 105536, -35456, 285313, -53263, 7386, 348908, -218637, -28970, -102481, 8404, -256219, -237577, 117758, 291688, 132395, -48375, 84127, -289178, -117698, 53217, 147095, 101864, 208295, 124097, 26268, -174712, 144978, 96506, 14221, -106040, 356445, -252774, 114388, 167754, -69458, 62526, -485229, 134826, -78890, -34658, 215331, -293851, -176428, 190154, 160289, -28107, 24135, 278935, -25295, 12199, -230378, -139562, -194378, -112886, -199099, 23154, 420583, 80793, -70831]
12814a84768A95023a35359A92264a77604D7858L8907L4496d05051B1697b16777
12803A13632P35B1878E566a8515A92586G6421g4980C13552b4514o1499I7649O261
12791A03910i4366j29282B12617H9138J86335a60448A09286e0761o5446N1109
12781f5098j78034c7794I3030c7044I4191a45697o0572b2924k81811G8121b57247
12769F7740N9702J93794a14377E0949b25020N0076j6945h3428A87308e9220A10861
12757e2243E7858g6949h697A5660K94767D5923a05809A90067b10807C0463b24619
12745G3831d0137A30668C6722R9117E9405A7273J21601J13496n2840c5514C31833
12733A49131J43507n2247J16208a88074A94702o2704a18412A52946d81680A16235
$$ y = [-184768, 195023, -135359, 192264, -177604, 47858, 86765, 121261, -405051, 21697, -216777, 113632, 114367, 21878, 5566, -18515, 192586, 76421, -74980, 313552, -24514, -86013, 97649, 103910, -94366, -223648, 212617, 89138, 275473, -160448, 109286, -50761, -116207, -65098, -243132, -37794, 93030, -37044, 94191, -145697, -206269, -22924, -304735, 78121, -257247, 67740, 127442, 321236, -114377, 50949, -225020, -174944, -191889, -83428, 187308, -59220, 110861, -52243, 57858, -76949, -8697, 15660, 310427, 45923, -105809, 190067, -210807, 30463, -224619, 73831, -40137, 130668, 36722, 135839, 59405, 17273, 138874, 252370, 199530, -35514, 331833, 149131, 292638, 240391, 356599, -188074, 194702, 131998, -118412, 152946, -481680, 116235]
12722G5042i3220B36294E9058a38407b4314j48573c5351F2509c68759A0838D770
12710i4987K6375B38282r2279d8481A13470D2123R6013J40659J4318a27274O0710
12699f6564B13707F9836a69223P1806A575a7460A39874L3016L862F9054J2265
12688H1319K27450q2583b21944a1305m0991B8699D486c5790l1409C282K75982
12677B79264b58480D10967a3192A41731l0612n4997h5380o5352F2186L7534a41414
12665B41564j1033R5842K08712b7100C01416A31972n7295j0048G669J70614f1260
12653C33416A50949P2553B5640d7473C3115K3556i1536b7811B18483D7183A8235
12641E625c72189a12210A76264a72810A8043c30233J62895K917A1187Q7559i3922
$$ y = [75042, -93220, 236294, 59058, -138407, -24314, -172887, -35351, 62509, -368759, 10838, 4770, -94987, -68612, 238282, 146003, -48481, 113470, 42123, 138136, 278795, 293113, -127274, -66564, 213707, 69836, -169223, -97417, 1575, -17460, 139874, 172890, 176752, 69054, 81319, 308769, 226186, -221944, -11305, -52296, 28699, 4486, -35790, -67199, 3282, 279264, -258480, 410967, -13192, 141731, 111119, 56122, -85380, -150732, 62186, 99720, -141414, 241564, 230531, 326373, 535085, -27100, 301416, 131972, 74677, 64629, 7669, 178283, -61260, 333416, 150949, 223502, 25640, -47473, 33115, 56671, -91536, -27811, 218483, 47183, 18235, 5625, -372189, -112210, 176264, -172810, 18043, -330233, -167338, -164421, 11187, 98746, -93922]
12629G8582K15324c689B12413C0556M7444b65153A77286g0841k34741J00330D17526
12617F5446A9279P532M7887K70689b6846P366A53601A5391J45774h5515K3601
12606f1914q5944C83684b37398B4513K37686h0194E3073c2969B42894A08876J73373
12595B82249k5398j00394Q4343J70758H9647K2696O4121b5198A84523m3621c1350
12583i8646A1773J7804l304h7635A06650f9775L315j5085m840b7135j07813C97803
12570D1154A8779g959D8604b92675B95055b23475e3560a0799k48858A93827b01165
12558A93429c2063j39077A75185q5603B9947c43843a33383A63491d1883D74527
12547g1822j42380B05627b40859Q0294m1839J8104h9084L7209J2477A66477b91197
$$ y = [78582, 293906, -3689, 212413, 30556, 78000, -265153, 177286, -70841, -305582, -205252, 417526, 65446, 19279, 26811, 74698, 345387, -26846, -19480, 153601, 15391, 161165, -85515, -61914, -147858, 383684, -237398, 24513, 262199, -80194, 53073, -32969, 242894, 108876, 282249, 256851, 156457, 240800, 411558, 89647, 112343, 176464, -25198, 184523, 140902, -31350, -98646, 11773, 29577, 26273, -87635, 106650, -69775, -66460, -81545, -86385, -27135, -134948, 397803, 41154, 18779, -7959, 48604, -292675, 295055, -223475, -53560, -10799, -259657, 193827, -201165, 193429, -32063, -171140, 175185, 89582, 29947, -343843, -133383, 163491, -41883, 474527, -71822, -214202, 205627, -240859, -160565, -202404, -184300, -89084, -51875, -39398, 166477, -291197]
12535c21979J43019A70878a34693p7972A16532N4440c92977a61311K2282k9899
12525a68928e3396I7244f0732A11562K69253A26219g0869n6588J7749m8640B86771
12513A24402J16669M33662A57549J30475A08108Q8386O6408a01804B57027r5054
12503A61973A1709b42044f9412B67284c04964c0347C3427d9730B6052M2776B8889
12491A11957P1605L6205b90150g2988m35097E986L72971j45129a9836B50394j8156
12480B32238d4093A76959Q8637a40378C3747J11032n0704C1420J08879c624H4206
12468a4108A09316m4367K41935L9865a98834A13487K13742H5543b41854f2709
12457c4228B5187b332F0952J29713n4358n5456a86504F289J0315a32179O4582
$$ y = [-321979, -178960, 170878, -134693, -212665, 116532, 170972, -392977, -161311, -139029, -168928, -53396, 97244, -60732, 111562, 380815, 126219, -70869, -127457, -109708, -158348, 286771, 124402, 241071, 674733, 157549, 288024, 108108, 196494, 262902, -101804, 257027, 161973, 11709, -242044, -69412, 267284, -304964, -30347, 33427, -49730, 26052, 68828, 28889, 111957, 183562, 219767, -290150, -72988, -508085, 5986, 378957, 233828, -19836, 250394, 232238, -44093, 176959, 265596, -140378, 33747, 144779, 94075, 31420, 140299, -3624, 84206, -14108, 109316, 64949, 306884, 346749, -198834, 113487, 327229, 85543, -241854, -62709, -34228, 25187, -2332, 60952, 190665, 136307, 80851, -186504, 6289, 16604, -132179, -67597]
12446f7597B30279a65519B86564b8407G8014a97114f6120D5142b02990B62834
12435a95869F2207b29626A32520K3667j7969i5483m9076r9375C4689J03800M3393
12424A81882a95692K2298j39061C7787a31440K6586M8736A33358m3566a89318
12413a07461e3002k43448m8168F5823J4009b31059J10330G7349a2992A32023a95260
12401d1344C17291b62336J30080N3621H4589c9458k1409r7277A82006O8792j01988
12390A48810P0763k5732b25435B82276E4656J48948J55180j41145r5716N8094
12380A80017p4405C9381a40876A9887b82863d8848r8933e7594k02191L8084h1770
12368b64401I8909D3942i873F1051a44269A14326K00779a20530B28708e3140A17823
$$ y = [-67597, 230279, -165519, 286564, -28407, 78014, -197114, -66120, 45142, -202990, 262834, -195869, 62207, -229626, 132520, 156187, 138218, -95483, -144559, -243934, 34689, 138489, 181882, -195692, -173394, -312455, 37787, -131440, -104854, -56118, 133358, 89792, -189318, -107461, -53002, -296450, -344618, 65823, 79832, -231059, -120729, 77349, -12992, 132023, -195260, -41344, 317291, -262336, -132256, -78635, 84589, -39458, -60867, -158144, 182006, 250798, 148810, 219573, 193841, -225435, 282276, 54656, 203604, 358784, 217639, 121923, 180017, 105612, 39381, -140876, 19887, -282863, -48848, -147781, -57594, -259785, -221701, -81770, -264401, 98909, 43942, -9873, 61051, -144269, 114326, 315105, -120530, 228708, -53140, 117823]
12356D7030J07362F0032d04599h4345B52967D8062A9011h2586k9704c1237j08178
12345a39415o4515G68N9084A8528e0108l1405D32319k02122o4653F4736J35223
12334A99959d3216J6928B56903l2796P9921p2216a52969B00614J52637n0253a47631
12322a8694j50612B31102J23565Q445A22757h9678L159B46544q3743l5926b15283
12310A32880P2852G6330A7077J28535J49353A794N2411a09364B63112a72877e9110
12298g818j57571B04321Q4238c9318C44653c1897D225K39115e5616D3387L73803
12287D17190a15479l7105C14388A39457a79833C71150P1584A37822f1255E14713
12276A15464a36537C75604b1287A13914b85475D56486h8464A71765p4227O5957
$$ y = [47030, 154392, 60032, -404599, -84345, 252967, 48062, 19011, -82586, -112290, -31237, -139415, -203930, 768, 59852, 18528, -50108, -81513, 432319, 230197, 165544, 64736, 199959, -43216, -26288, 256903, 224107, 304028, 231812, -152969, 200614, 353251, 302998, -147631, -18694, -169306, 231102, 354667, 363112, 122757, -89678, -86519, 246544, 162801, 126875, -215283, 132880, 205732, 76330, 17077, 145612, 294965, 1794, 54205, -109364, 263112, -172877, -59110, -7818, -165389, 204321, 288559, -39318, 344653, -31897, 4225, 243340, -55616, 43387, 417190, -115479, -152584, 314388, 139457, -179833, 371150, 442734, 137822, -61255, 514713, 115464, -136537, 375604, -21287, 113914, -285475, 456486, -88464, 171765, 97538, 163495]
12266A63495l3313a85203G2080k9709K0260K16173J27027c2161q3412a474B60718
12254B32597h3578B64615l6056a4322B93537A21900k2863K60508j71451j4966
12244A73128J23330a600A19012a0424C62942J29903b27814L1898B12317a22589
12233c4299C09954K396a7714B53492A25286J97680r8091l0236R6758Q3946j61793
12222B13550E8677K11400j10217K29830q4669M9497j70159J33588Q0610J02798
12212E01355K7862K9808r1578E1978K32759G3442R0878R0694A08955l4462P5779
12201A50272a18578N6240B96130O7811G2006J06840k2628J01359J18255r3330
12191B82502K68163A58471k9752N02008k81645O2985O7362A23527K38017e8220
$$ y = [163495, 130182, -185203, 72080, 42371, 62631, 278804, 405831, -32161, -115573, -1474, 260718, 232597, -83578, 264615, 228559, -14322, 293537, 121900, 99037, 359545, 188094, 173128, 296458, -1600, 119012, -10424, 362942, 492845, -227814, -195916, 212317, -122589, -34299, 309954, 312350, -17714, 253492, 125286, 322966, 224875, 194639, 291397, 375343, 213550, 58677, 270077, 159860, 389690, 305021, 354518, 184359, 317947, 398557, 501355, 529217, 559025, 467447, 51978, 284737, 73442, 164320, 255014, 108955, 74493, 150272, -118578, -62338, 296130, 363941, 72006, 178846, 156218, 257577, 375832, 282502, 550665, 158471, 128719, 630727, 349082, 412067, 479429, 123527, 361544, -58220]
12180B16285H5352c1284B75769l0528d653B73220k2077I9232j4906B4628K22597
12169B47225n8124c2430q0135B08694e6951C05883o4344o4897E8695K41603J25672
12158D25970a07766B51342m719j14843h0736A92099b31710C97130A86981D6311
12147A07216b3525A30222c4874j4838F2266O594L4905K12141B4932b0900A51877
12135B89597B5583L80441j52106B1702J08979B1287J96278o5581a50707D7081
12124a34176B62897G6124K26361n6134R2804A63483K73388k12243G2045h6149
12113H9703m3768M2388k8521J81155D0858Q0271M3142Q8699c83989A16747d1923
12101a63801H5790a36980A22972J89912j49471K77909m93A95466a67314B60627
$$ y = [216285, 85352, -31284, 275769, 245241, -4653, 273220, 251143, 99232, 84326, 24628, 247225, 189101, -32430, -112565, 208694, -56951, 305883, 241539, 176642, 58695, 300298, 425970, -107766, 251342, 246623, 131780, -80736, 192099, -231710, 397130, 186981, 46311, 107216, -23525, 130222, -34874, -49712, 62266, 68860, 103765, 315906, 24932, -20900, 151877, 289597, 25583, 406024, 253918, 21702, 130681, 21287, 217565, 151984, -150707, 47081, -134176, 262897, 76124, 302485, 246351, 339155, 163483, 436871, 224628, 72045, -86149, 89703, 45935, 88323, 59802, 240957, 40858, 121129, 164271, 252970, -383989, 116747, -41923, -163801, 85790, -136980, 122972, 312884, 163413, 441322, 440829, 195466, -167314, 260627]
12090b25787a924A44728E2209R8809J62585A7908c6825B13413j03785E1995K2459
12079G4454D027K28815K43052A15776I864L9447A3085M4653J63010p4333L30862
12068D77277A47242m3843f5200D71054A05312l1882O5291a23307d1791D0853K32590
12057B73443a08467C4652J9069N8420a53367F8164A4756L2889e6033A2454f5779
12045A47609N2995D409O9889a33854A49635a72962I415c15073C0169J999J08666
12034A40834m5250a49603n6300b8160B15184f7216m7495A59337O5780a71225h4594
12022B1543b0519j63119E6542J4672e1670j46417A18107J68727B1036i294B09468
12010A3473a01531B4754i5060D3437L5102b1904B4985J24772F6159M39702e4393
$$ y = [-225787, -1924, 144728, 52209, 151018, 313603, 17908, -36825, 213413, 109628, 51995, 74454, 4027, 232842, 475894, 115776, 9864, 49311, 13085, 57738, 220748, 146415, 477277, 147242, 103399, -65200, 471054, 105312, 73430, 138721, -123307, -41791, 40853, 273443, -108467, 34652, 53721, 112141, -153367, 68164, 14756, 47645, -56033, 12454, -65779, 147609, 200604, 4409, 74298, -133854, 149635, -172962, 9415, -315073, 30169, 32168, 140834, 95584, -149603, -205903, -28160, 215184, -67216, -114711, 159337, 225117, -171225, -84594, 21543, -20519, -183638, 56542, 71214, -51670, -198087, 118107, 286834, 21036, -9294, 209468, 13473, -101531, 24754, -95060, 43437, 78539, -21904, 24985, 149757, 66159, 505861, -54393]
11998h4646k28574f2832q6763A76461J303a27887c2130o4015C50054A19031D9791
11986A73920H0499a12955C53021F7124J76625b02639c6306A13637E0870d24952
11975G6895j90a22505d9561j6402A28869d6377A60259r265c78638i6201q8854
11964a85055k3239L770A04193j5141i660G5265f3811l38403c826p027B21213E5116
11951A76593E8955g8480L9099r7329K7378j95062A1273i2240m7106m33825c7679
11939D5966b25132G0100A9312b05069r900j35983A42121b11433p3991P2003M274
11928b09147A5642b85152J4569G2555c4172l3930j02576A21776D9004I946b01671
11916b3393k22306i0676E7351i5461B95532K1370j48936b74291C9464f676k10300
$$ y = [-84646, -313220, -62832, -149595, 176461, 177764, -127887, -32130, -96145, 350054, 119031, 49791, 173920, 80499, -112955, 353021, 67124, 243749, -202639, -36306, 113637, 50870, -424952, 76895, 76705, -122505, -49561, -65963, 128869, -46377, 160259, 150994, -378638, -96201, -185055, -208294, -204524, 104193, 89052, -9660, 75265, -63811, -402214, -3826, -10853, 221213, 55116, 176593, 58955, -78480, -39381, -136710, -109332, -304394, 11273, -92240, -139346, -573171, -37679, 45966, -225132, 70100, 19312, -205069, -214969, -350952, 142121, -211433, -285424, -213421, -209147, 15642, -285152, -270583, 72555, -34172, -68102, -170678, 121776, 49004, 9946, -201671, -23393, -245699, -90676, 57351, -95461, 295532, 316902, 167966, -274291, 39464, -6676, -216976]
11905b16976n0827A90342b3184H3504O6677j9246J5542a10245A39992a01807B08871
11893c56235A80728a88512q4777B43011F386J6446a32712E6950c2869p2119h181
11881g2572p4212j3033B15021F1671b87804a9393j66965b0897D95609a89711d9276
11869H7838C3347b03460n7963j86076a04928E5093h7164K1941m1791B7252b14627
11857b53340B75356b70746A46870b35125A07589a02741C2226M4161g856A36308
11846a85286J079d2386j68977D9646a18552o0636H9142A8037h2714B64734b47976
11834b82681D6306c12989c1030A58917c409j03210A62260b09064G546b93158A63681
11822h1938r0924d6927B04009J21433p7483c10532A10059c87406J66888A85502
$$ y = [-216976, -267803, 190342, -23184, 83504, 150181, 130935, 146477, -110245, 139992, -101807, 208871, -356235, 180728, -188512, -273289, 243011, 6386, 22832, -132712, 56950, -32869, -104988, -8181, -72572, -146784, -159817, 215021, 61671, -287804, -19393, -186358, -20897, 495609, -189711, -49276, 87838, 33347, -203460, -261423, -447499, -104928, 55093, -87164, -65223, -107014, 27252, -214627, -253340, 275356, -270746, 146870, -235125, 107589, -102741, 32226, 76387, -7856, 136308, -185286, -184207, -42386, -211363, 49646, -118552, -179188, 89142, 18037, -82714, 264734, -247976, -282681, 46306, -312989, -31030, 158917, -3409, -106619, 162260, -209064, 7546, -293158, 163681, -81938, -172862, -46927, 204009, 325442, 247959, -310532, 110059, -387406, -220518, 185502]
11811d97938A12096b1790l93671J19051a41661A74904h3543j97689A44527c33064
11800B12557a52458A87857a93745b2528a0508C75120G741b26846f9493F8808a28068
11788B61007G5060C4700c8573r1789e7103k96427a65466C949e07460B150J74031
11777A76181K57621a74265d6186j51097f670j49368n06B60090D1826a84547m0583
11766b25130b1896N283A47949B1982K79713a09483B27272b94431J21248C3474
11755I2287a20950e3j86790j66412H3250j5251r90c9086o4277m623B12538c1576
11742B14136e6757k5267C58533a67002b1629k6496A58608B7747Q6465h7856A47870
11730a61979l85973J00565a29389a518A02583a74496b2372I9465B2528K1450N0108
$$ y = [-497938, 112096, -21790, -415461, -296410, -141661, 174904, -83543, -281232, 144527, -333064, 212557, -152458, 187857, -193745, -22528, -10508, 375120, 7741, -226846, -69493, 68808, -128068, 261007, 75060, 34700, -38573, -130362, -57103, -353530, -165466, 3949, -507460, 2150, 176181, 433802, -174265, -46186, -197283, -6670, -156038, -156544, 260090, 41826, -184547, -225130, -21896, -16613, 147949, 21982, 301695, -109483, 227272, -294431, -173183, 33474, 92287, -120950, -53, -186843, -353255, 83250, 67999, 67009, -39086, -103363, -107986, 212538, -31576, 214136, -56757, -82024, 358533, -167002, -21629, -48125, 158608, 27747, 114212, -87856, 147870, -161979, -547952, -447387, -129389, -1518, 102583, -174496, -22372, 99465, 22528, 43978, 94086]
11719I4086j6039c42927g3701j471A51282o1197k8596d3856A8792b16075e8823
11707e3414H9275K71239j52314a68935B36699n1096J25858A08449I614C732e3360
11695b06139M2781E1561b73155i3534B8725a29555j17246G8413i4577H5192J8196
11684A03388O8966p0347a63105B07878i9584A09139E1046J87006a16243A06673
11673d089j69045P6111B32844L9060b10961c0170A57544R2632b53210J15405b7940
11661I9703D6606a9065j33794N380c8685r3186b9147o9516A03574L9461b55832
11649C44714C3796b29376b3730k29373R5816j41444J06669G7162l5161N3078b19451
11637B9023a55820j36151m7106A9752B595c021B21607l3245r046J6487b29662
$$ y = [94086, 78047, -342927, -73701, -75172, 151282, 90085, 61489, -43856, 18792, -216075, -58823, -53414, 89275, 360514, 208200, -168935, 236699, 185603, 311461, 108449, 9614, 3732, -53360, -206139, -163358, 51561, -273155, -93534, 28725, -129555, -246801, 78413, -94577, 85192, 103388, 172354, 102007, -163105, 207878, -99584, 109139, 51046, 238052, -116243, 106673, -4089, -173134, -97023, 232844, 271904, -210961, -30170, 157544, 250176, -253210, -137805, -27940, 99703, 46606, -19065, -152859, -147479, -38685, -131871, -29147, -98663, 103574, 143035, -255832, 344714, 33796, -229376, -23730, -253103, -157287, -298731, -192062, 77162, 42001, 95079, -219451, 29023, -155820, -291971, -339077, 19752, 2595, -3021, 221607, 188362, 179316, 195803, -229662]
11625A80093q4782Q5970a50892c082j76069F0088Q5201a22258I9087C34J15802
11614A16136b5154o3718F3875d1743l33469C27642H8699A8303K47245h3317A80921
11602d9397j81282a5790l18923A48119r158j8214K96142a74000G8046b82711I3674
11590b1647A80124q9196K466N3975R7829G6057h184H7113J5580J18424j8272I1033
11577B62362d5958D4579a6255H5787Q195b56488G925d9641k09373I7231b46459
11565G3734f6782r979C38504a5753A97633a53956c5926A28980Q0724a37282E2161
11553d7919A50208A867L36646a33326r4483J03453j4321C58408a05445k52873
11543c58318A27051A1481R6437J02294c8301j2333b0445B77248n562F1637K24701
$$ y = [180093, 95311, 181281, -150892, -3082, -179151, 60088, 145289, -122258, 99087, 334, 116136, -25154, -88872, 63875, -41743, -375212, 327642, 88699, 18303, 265548, -83317, 180921, -49397, -230679, -15790, -334713, 148119, 138961, 120747, 416889, -174000, 78046, -282711, 93674, -21647, 180124, 90928, 93394, 147369, 245198, 76057, -8184, 87113, 102693, 221117, 202845, 91033, 262362, -45958, 44579, -16255, 85787, 93982, -256488, 7925, -49641, -259014, 97231, -246459, 73734, -66782, -76761, 338504, -15753, 197633, -153956, -35926, 128980, 209704, -137282, 52161, -47919, 150208, 1867, 338513, -133326, -227809, -124356, -138677, 358408, -105445, -358318, 127051, 11481, 107918, 210212, -38301, -50634, -20445, 277248, 271686, 61637, 286338]
11532B86338A111a26904B0873b33385d3219q0051B50073A7320M8358a26103B43689
11520F3114R9304c1149r0947H8867J39463F0463B6105i5829j876B52199J66944
11509D19143g1817q7051A77552i5473n500d3038j29617D9155J56324K78742e5998
11497A08436Q0596l2737N9467I7137a79776C97156A00242P4789O7861m6190l1194
11486A65508k5475M5896K21657n8946l0546q2986J30986H8461a34917A47013J35625
11475B82638O5461q7818a23262G9587J2240j2402J81046J03378n257A57170o3381
11464I3789R0801J41430b86124B33400J27777F0347K75030B4444P1505J49110
11454B45059a62915a0083D70629I5034f5336j63657E6481J83925B7939J34064
$$ y = [286338, 1111, -126904, 20873, -233385, -43219, -123270, 250073, 17320, 65678, -126103, 243689, 63114, 162418, -31149, -122096, 88867, 228330, 60463, 26105, -95829, -97705, 252199, 419143, -71817, -158868, 177552, -95473, -100973, -43038, -172655, 49155, 205479, 484221, -55998, 108436, 189032, 156295, 215762, 97137, -179776, 397156, 100242, 175031, 242892, 196702, 165508, 140033, 185929, 407586, 348640, 318094, 235108, 366094, 88461, -134917, 147013, 282638, 348099, 260281, -123262, 79587, 91827, 79425, 260471, 363849, 358592, 157170, 93789, 184590, 326020, -286124, 233400, 361177, 60347, 335377, 24444, 95949, 245059, -162915, -10083, 470629, 95034, -65336, -228993, 56481, 240406, 27939, 162003]
11444A62003C1466K67354A00176j2228a43909H1666f7427J9211C14578j24644
11434A89934b9878I0466K35767D7267b7051j10813A62740a92040C6567b4717D094
11422D1236g8799D1881a73328c1283p7089D11837a08826r3913F294J29386c15301
11410f6507l1915k25989c1958J0129A37192f9819j40760O6984B56590a67448J1291
11399a56157e0871K090b060C6887J15372K63816A94240A6371j360a23065B30109
11387b18274f4621J3828b0728B28060r4592g3243l70703A53123e7962H7504i7016
11375b8671f171j31609B21791G1301a54203f859j60540A44797i831j96486D24222
11363b26218C718b89151N4480m3174J04868B42186H3002d3858p1357G1154i4554
$$ y = [162003, 31466, 298820, 100176, 87948, -143909, 81666, -67427, -48216, 314578, 189934, -29878, 90466, 326233, 47267, -27051, -137864, 162740, -192040, 36567, -24717, 4094, 41236, -78799, 41881, -173328, -31283, -108372, 411837, -108826, -202739, 6294, 135680, -315301, -66507, -98422, -324411, -31958, -21829, 137192, -69819, -210579, -143595, 256590, -167448, -156157, -50871, -48781, -2060, 36887, 152259, 416075, 194240, 16371, 15011, -123065, 230109, -218274, -64621, -50793, -20728, 228060, 133468, -73243, -443946, 153123, -57962, 87504, -97016, -28671, -6171, -137780, 221791, 71301, -154203, -6859, -167399, 144797, -9831, -206317, 424222, -226218, 3718, -289151, -234671, -277845, -172977, 242186, 83002, -43858, -115215, 71154, -94554]
11351A37986a77812j59256B89403q1911D8000K22790f377A8426K41973i8326A22054
11339H1635a90102N0207C19284b48299C8596M6628L11543D3024A82a31476a6109
11327a06457A75528i4340j19683j21055g6139A73085e4044q8803H340O9076a13512
11315A82205a31035B32393J26620j09863a32166d7048C2364J02584b25215A06837
11304g9740c9035l1169j00250k17900C6609e3893o5499C184b78307c660k04827
11293b08487m1050A69873a27514N8902j26196n8997n5196f5764A2373L02891a13035
11281B2005C580a18380A1155c85139i9765n3042A55417J03493c887j49896B04986
11269a38554E6289d7236C09267b70842B80164a10479j00626D3265K64209a43771
$$ y = [137986, -177812, -337068, 289403, 207492, 48000, 270790, -6377, 18426, 260399, -98326, 122054, 81635, -190102, -139895, 319284, -248299, 38596, 85224, 396767, 43024, 182, -131476, -16109, -106457, 175528, -94340, -214023, -335078, -76139, 173085, -54044, -142847, 8340, 77416, -113512, 182205, -131035, 232393, 359013, 249150, -132166, -47048, 32364, 134948, -225215, 106837, -79740, -39035, -70204, -170454, -388354, 36609, -53893, -119392, 3184, -278307, -3660, -208487, -249537, 169873, -127514, -68612, -194808, -253805, -309001, -65764, 12373, 315264, -113035, 22005, 3580, -118380, 11155, -385139, -99765, -152807, 155417, 258910, -3887, -153783, 204986, -138554, 56289, -47236, 309267, -270842, 280164, -110479, -211105, 43265, 307474, -143771]
11258g4741C98928c2920C1905b3151k7489E8408b42511C5453b91040f6837j86903
11247b53740D8259h7876I9550b47474D4815f5034L1829l1300A3316L3112L34377
11236C80805d1964q2055n0937b5294j59038A72261h3041a6457k4253j9783A33530
11224b74520n7328J51836a9225E0979d8376k01655b1681k04751N9971A65076p2145
11213I2931a47217p52B4952d2393j51889e0511k15910c3995k76607a0046n7677
11202f7723C2027a31941p1431i8719N318H3077A9300J21616a13015E7522d8948
11190d18748A93978o6769A7424L9107b51071g1767j72485B4001O6583b67937D34717
11178A60572O291i0764n0662B7441A2199c80841B84515a91685k8449B1871a64077
$$ y = [-74741, 398928, -32920, 31905, -23151, -50640, 58408, -242511, 35453, -291040, -66837, -253740, 48259, -87876, 99550, -247474, 44815, -65034, -33205, -64505, 13316, 46428, 380805, -41964, -124019, -174956, -25294, -184332, 172261, -83041, -16457, -40710, -60493, 133530, -274520, -331848, -180012, -19225, 50979, -48376, -250031, -21681, -226432, -166461, 165076, 92931, -147217, -147969, 24952, -42393, -194282, -50511, -266421, -33995, -310602, -10046, -67723, 32027, -131941, -203372, -98719, -93401, 83077, 19300, 140916, -113015, 57522, -48948, -418748, 193978, 127209, 17424, 56531, -251071, -71767, -244252, 24001, 90584, -267937, 434717, 160572, 166863, -90764, -141426, 27441, 12199, -380841, 284515, -191685, -220134, 21871, -164077]
11166a61353b3176l4967m154D5405i3113a1856B7472K58975j09005J6262a23936
11154a22627A30696a22406B2139a00885j47855a17952a363k9816j9278l10549
11144c61006J50952a6898j14531a3204B56452A18469b727l80179F1839L31954
11134C93793d5299H7036a80211F7844g5034C73188b08474B72445j03630D5782
11123C54713I7882J00716N4872J30756o4479D6585J00037A5681a44899B65232
11112a53539H187a300A56556j1672b40895i2953A91606r0326L51253A98657d2642
11100A2710M67674j46151J07096B903K13509c0247C58238p6503D8602J07935J62371
11089C18908e1994C04643p3614H0886M7518Q9709N9189L192q1369B7872R681J81305
$$ y = [-161353, -23176, -58143, -62297, 45405, -93113, -11856, 27472, 286447, 177442, 193704, -123936, -122627, 130696, -122406, 22139, -100885, -248740, -117952, -1363, -31179, -50457, -361006, -210054, -16898, -131429, -13204, 256452, 118469, -2727, -382906, 61839, 393793, -45299, 87036, -180211, 67844, -75034, 373188, -208474, 272445, 168815, 45782, 354713, 97882, 198598, 253470, 384226, 319747, 46585, 146622, 15681, -144899, 265232, -153539, 8187, -1300, 156556, 144884, -240895, -92953, 191606, 101280, 452533, 198657, -42642, 12710, 480384, 334233, 441329, 2903, 216412, -30247, 358238, 281735, 48602, 156537, 318908, -51994, 304643, 231029, 80886, 128404, 218113, 277302, 280494, 199125, 27872, 37553, 218858]
11077B18858J26802l6871K85870j45320A38073J60862P7444n3316R5076r4965
11067C23174p8100j1918a93698D59998j67599o2613L08471M5848K79611D25658
11056E58441l2371L330J8364K18961j56147J1897Q4591J74597L4723D14188O72289
11045A086477l69908N25370m96610K20774J28517k06065J57156L0476L01900k57363
11035A120724j8097j23160K50142l09517J88981l39671K49357k18893O5012K30812
11025A095690p5890J03778j89762K27642j87605r4381K03615N1598k23457j67124
11015G44104K77709l85169P9518o3383K23285Q5328k56578m6398J66776n6312
11005G68880k416L77732l18288q6666K19055J3189j68850M415j44812K40221K38542
$$ y = [218858, 345660, 308789, 594659, 449339, 138073, 298935, 376379, 323063, 418139, 323174, 245074, 233156, -193698, 459998, 292399, 229786, 538257, 584105, 863716, 425658, 558441, 526070, 529400, 547764, 766725, 610578, 622475, 707066, 881663, 916386, 414188, 1086477, 716569, 1241939, 745329, 966103, 1094620, 888555, 1045711, 1076187, 1378087, 1120724, 1102627, 979467, 1229609, 920092, 1109073, 769402, 1018759, 799866, 864878, 1095690, 1019800, 1123578, 933816, 1161458, 973853, 879472, 1083087, 1134685, 911228, 744104, 1021813, 636644, 716162, 652779, 876064, 961392, 704814, 658416, 825192, 768880, 766464, 1144196, 825908, 739242, 958297, 971486, 802636, 807051, 662239, 902460, 1141002]
10994A141002j62590j59907J74659J13412l71858o2997K88290O0097n3892J66196
10984A132412m12812K13125j62619N66067J38130j40168j97862K46334N9617P0483
10974A512707j716M78900P4824J08258P13260J02096M20391K20302J42242k46142
10964C525122K39353L3302l97879j74682n70188n96557l61406m7954q7264J34495
10954A696342l94859K40772R7794q7074o04688L27814k66538n4341k08831J58326
10944I04717k55292l1178k90143G6664M32903B23824R0984F5184O7821J75307
10934C08312b742F5318j5210B2309J45101d7157B58303b599H8029i9820e627G971
10921b8636A57638b02479E5722a51731M4051A12015P5430O9186f95A87786a51802
$$ y = [1141002, 978412, 818505, 993164, 1106576, 734718, 671721, 960011, 1020108, 966216, 1132412, 719600, 932725, 770106, 1336173, 1474303, 1334135, 1136273, 1382607, 1442224, 1512707, 1510991, 1989891, 2064715, 2172973, 2886233, 2988329, 3408720, 3629022, 3771264, 3525122, 3764475, 3797777, 3399898, 3225216, 2655028, 2058471, 1697065, 1649111, 1561847, 1696342, 1301483, 1542255, 1640049, 1552975, 948287, 1276101, 1009563, 955222, 746391, 904717, 649425, 618247, 328104, 76664, 509567, 223824, 314808, 65184, 133005, 308312, -2742, 65318, 50108, 22309, 167410, -47157, 258303, -2599, 88029, -99820, -5627, 7971, -28636, 157638, -202479, 55722, -151731, -107680, 112015, 187445, 256631, -695, 187786, -151802]
10909A32041a21741A39751K25338a72860L8982e2099E2244a66942C04991d31490
10898d2205A23716l3455f0397m5303C8773J49359C6655a33762A01241K30036c17928
10886H6765d0137l7482c378j24985B51615c2681A56041c2136a5365A7658d3525
10874D9332N8916h6763B0239e0940n9776j25882i5620L2413J8082A51736o6543
10863H5193a356j64010n9517A5961c5646k59725G6055b6837j82615f6952j16404
10852a83356A98549H9530J17793g8239F0871b24230E1493a35697B21732C015K83777
10841B86792A27439P9175a94355B80320a45459I0104d20528F6647g2621j40621
10831b13242H3241M1493a24622a9859C7858b43449c7726B54258b5960m8488j08994
$$ y = [132041, -121741, 139751, 365089, -172860, -133878, -52099, 52244, -166942, 304991, -431490, -42205, 123716, 90261, -60397, -105700, 38773, 188132, 36655, -133762, 101241, 331277, -317928, 86765, -40137, -77619, -3378, -128363, 251615, -32681, 156041, -32136, -15365, 17658, -43525, 49332, 108248, -86763, 20239, -50940, -110716, -236598, -95620, -63207, -45125, 151736, 85193, -1356, -165366, -224883, 15961, -35646, -295371, 76055, -26837, -209452, -66952, -183356, 198549, 89530, 207323, -78239, 60871, -224230, 51493, -135697, 221732, 3015, 286792, 127439, 206614, -194355, 280320, -145459, 90104, -420528, 66647, -72621, -213242, 83241, 124734, -124622, -19859, 37858, -243449, -37726, 254258, -25960, -74448, -183442]
10820a83442O9739A41937a86913b6650l3026B44709m7578a65682D5360Q3161J04074
10809B32595b43164a01399I9456l3630k7607c48312h3753j36328q014B8615e1916
10797c22800B5274L25741a28856j89640h8228m9898c9821j85281j0735O2849P6291
10786i6697A13877a63353E3843J06595a28010G1375a95772Q2308d1557j44421
10776a85978M4133M2969B34496a8027A65639j2433c20137a21756j84486c8744
10765a25024M0780F4982c93179c100r9809C7655a38156B79429b70871A22492k424
10754A20068b71899A51718a15980J393B7884a8640B09257i1334A7182J61522d4307
10742h8721j75999e5479l6968B7359b51846b1437p3245A61356l7501N4437a92728
$$ y = [-183442, -113703, 141937, -186913, -26650, -59676, 244709, 197131, -165682, 45360, 128521, 232595, -243164, -101399, 99456, 65826, 38219, -348312, -83753, -220081, -228095, 28615, -51916, -322800, 25274, 351015, -128856, -318496, -88228, -138126, -39821, -225102, -235837, -172988, -96697, 113877, -163353, 53843, 160438, -128010, 71375, -195772, -113464, -41557, -185978, -141845, -98876, 234496, -18027, 165639, 153206, -320137, -121756, -306242, -38744, -125024, -84244, 64982, -393179, -3100, -102909, 37655, -138156, 279429, -270871, 122492, 120068, -271899, 151718, -115980, -114587, 27884, -18640, 209257, -91334, 17182, 178704, -44307, -88721, -264720, -55479, -92447, 27359, -251846, -21437, -94682, 161356, 123855, 178292, -192728]
10730c22409i50D1499R5010a01746b9151A34693K00446a7666j40660a674n0184
10719e1858F7330a60384A97624a24251M5781n0870I7826D5942M3871J02703p6252
10708A16264m0416l2969b8244n4577C7110K7311b33047h9457D1252a33109L3403
10697i9706A15989l4181J2991A7369b1640I729a23008l8155F7785b16005o7401
10686b83406a9471j98589N3088D7027b36702a8007k15267C00272c0392G9697b27367
10674c4615i490l2958j01488A7083a48457e6279j17751j60333l693a05347b7323
10662a79009j32102A60258L6188N0358E9750f4401Q593m17644a65892p0764a04113
10650A06265A9475Q247a60188r5180P7390e4850l06007n3898A54092F3557h9225
$$ y = [-322409, -950, 41499, 136509, -101746, -29151, 134693, 335139, -17666, -158326, -1674, -51858, 67330, -160384, 197624, -124251, -78470, -129340, 97826, 45942, 89813, 192516, 116264, 75848, 42879, -28244, -82821, 37110, 64421, -233047, -89457, 41252, -133109, -99706, 115989, 81808, 94799, 17369, -21640, 9729, -123008, -161163, 67785, -216005, -283406, -19471, -218060, -164972, 47027, -236702, -18007, -233274, 300272, -30392, 79697, -227367, -34615, -9490, -42448, -143936, 17083, -148457, -56279, -174030, -334363, -338056, -105347, -27323, -179009, -311111, 160258, 196446, 246804, 59750, -64401, -55808, -473452, -165892, -236656, -104113, 106265, 19475, 27722, -160188, -255368, -177978, -54850, -360857, -414755, 154092, 63557, -89225]
10638a6126l17719b7036L501l7144A16236C5582a48230n6429E2460a29449j40142
10627b69591B4961c73811A75105b56422p9831e5262p9414e9314E2088Q1610g9947
10615c14381A18964i7170B694a02831j4729j51806e6156j80883J6054K9882A7309
10603a64561f6489l1652m1143d1233B8593J6816a24737l037e0482A1995c45194
10591E8179d61304d6831C47005j45711b99712A36808b39954C40127a60919f9614
10580c07188A699P4892h4948j42097g3336A61199F1052n422a2667n7042C2931
10568i4509c657B09220a61431D4171r345h3971L3103B0729J12466E7683b44134
10556G7343C2047a02074J0110H7846b52359i1730L1832B45807C7958e2296J9842
$$ y = [-16126, -333845, -27036, -23535, -60679, 116236, 35582, -148230, -204659, 52460, -129449, -269591, 24961, -373811, 175105, -256422, -336253, -55262, -134676, -59314, 52088, 133698, -79947, -314381, 118964, -97170, 2694, -102831, -117560, -269366, -56156, -237039, -220985, -191103, 17309, -164561, -66489, -98141, -139284, -41233, 28593, 45409, -124737, -127774, -50482, 11995, -345194, 58179, -461304, -46831, 347005, 201294, -299712, 136808, -239954, 340127, -160919, -69614, -307188, 1699, 76591, -84948, -227045, -73336, 161199, 61052, 55630, -12667, -69709, 32931, -94509, -3657, 209220, -161431, 44171, 34826, -83971, -50868, 20729, 133195, 57683, -244134, 77343, 32047, -102074, -91964, 87846, -252359, -91730, -59898, 245807, 37958, -52296, -32454]
10545c2454j53210A4715j508a99694j174f4111K7912l06k12449B8595g0278l42705
10533d12983a2170B09516a94005g4886J9787m7094I0317h8707j1981j36821A91659
10521B53254d02538c2987j05812G4167i4595d5379j44097A2279d09255h7769k66007
10510c53776i6311A27357e1419B91512q9328e7099H0497c93733A59350a86427
10499b22873C4093a3744q0196l0884d7432j85267f8235j47334a7582C5618J54558
10488A90176b24430d752j82528N5082L4691k7117b9010b047l978G192K41968J28570
10476C77730j65633C0897J95196A2178L61127j24558k169o0534M1061D8168B1487
10464a26231d1212k96685f5129n7095B9912a89868A67478a97364B15696a3812
$$ y = [-32454, -185664, 14715, 13207, -199694, -200868, -64111, -36199, -36505, -248954, 28595, -70278, -412983, -12170, 209516, -194005, -74886, -55099, -102193, 90317, -88707, -100688, -237509, 191659, 253254, -402538, -32987, -138799, 74167, -94595, -45379, -189476, 12279, -409255, -87769, -353776, -96311, 127357, -51419, 291512, 202184, -57099, 80497, -393733, 159350, -186427, -222873, 34093, -13744, -93940, -124824, -47432, -232699, -68235, -215569, -17582, 35618, 190176, -224430, -4752, -187280, -132198, -97507, -124624, -29010, -2047, -6025, 7192, 249160, 377730, 212097, 30897, 226093, 12178, 373305, 248747, 246578, 186044, 227105, 48168, 21487, -126231, -41212, -337897, -65129, -122224, 29912, -189868, 167478, -197364, 215696, -13812]
10453A64948b26689Q6433N0225k87905B35883f2446B8157J56939a0489D8953a2927
10441A51574b22952J08552a6157A92694D1447b63722A03190f2727l6808I4168
10430b48267C0842C252K33412c91280A38198a78989C4324a15358A85680B3330
10419g589l18549A4030c15605J00644G3330M9579c25796c5230A57884o6204K90096
10408C81776a0280k21545R2224D27688a1626B0496a79537r0144A98540a49457
10397c9565A59413K9838B4660e2766E912L4057O77i3986e499A09396D8275J70819
10385B19094l0769F9797e6431C07909j16148a16370E3448P6949D1281K3655K17271
10374B82207J8223A08692J65379J19715j61733l177o2929M08152B32961J06545
$$ y = [164948, -226689, -140256, -90031, -377936, 235883, -62446, 28157, 185096, -10489, 48953, -12927, 151574, -222952, -114400, -16157, 192694, 41447, -263722, 103190, -62727, -99535, 94168, -248267, 30842, 3252, 236664, -391280, 138198, -178989, 34324, -115358, 185680, 23330, -7589, -326138, 14030, -315605, -214961, 73330, 122909, -325796, -35230, 157884, 91680, 381776, -10280, -231825, -139601, 427688, -11626, 20496, -179537, -269681, 198540, -149457, -39565, 159413, 189251, 24660, -52766, 5912, 39969, 40646, -93986, -5499, 109396, 48275, 219094, 188325, 69797, -56431, 307909, 191761, -116370, 53448, 130397, 41281, 64936, 282207, 300430, 108692, 274071, 393786, 232053, 228876, 165947, 574099, 232961, 339506]
10364C39506K64200K03198l05144J76365J26547C53758J43308k32398n3257N5353
10354B66764G1398j1517e3771B37196D3266N46746j06566J87787K4242j95661
10344D99814A33871a14588C62628J51306B38245K44721j36042M2995o8378j4557
10334C06984A11147J54703J13446j2367A17647J79697F8243J27801J83174a13480
10323H5752J50799K30119I7923R3204L34M0307J03403c6606H8670O8758r668J38896
10311B86656a63514A84706G1463O0400a2710A92665e6612p0015l4523r7193C44
10299G6889a95613J7956f0868b6605F3782Q1575h79m3755j04365A5199J46113
10288A61312c53293B20389a43062k85554A06634a12006k3756a4568k34260h0751
$$ y = [339506, 603706, 806904, 501760, 678125, 804672, 353758, 497066, 264668, 211411, 266764, 71398, 59881, -53771, 237196, 43266, 590012, 483446, 671233, 695475, 499814, 133871, -114588, 362628, 513934, 238245, 482966, 346924, 389919, 321541, 306984, 111147, 265850, 379296, 366929, 117647, 297344, 68243, 196044, 379218, -113480, 85752, 236551, 466670, 97923, 191127, 191461, 231768, 335171, -36606, 88670, 157428, 147760, 286656, -163514, 184706, 71463, 131863, -12710, 192665, -56612, -126627, -161150, -258343, 344, 76889, -195613, -177657, -60868, -26605, 63782, 145357, -879, -44634, -148999, 15199, 161312, -353293, 220389, -143062, -428616, 106634, -112006, -135762, -14568, -248828, -80751]
10277d6387j25767e5272A22052e144j26224I599J57427b56460K1664H8659b76063
10265D8297g1522C6959K46975a2646F9518b9938j40020m168O6538B46610l9777
10254B06833p0397K68318C1512L83711J57556j97636j64365f5015E3001a4367
10243F2708P3932a4973A10269a73154A73821g5758j03678d759j37182l390K5901
10232a19430j16615c9839A4209L9701b07566A64709k149i6447p3408B79996A27727
10220a48226f5119D6004f4917n4549j35531A3657K78916D1013J25435A9825e3319
10208B21740i5852H827J11091K2698b40113R6552F1541J06660d32204D5200c4824
10196b61928j1917A75336b02569j90165C1988c3222l0505H9392b80345d3409B9475
$$ y = [-46387, -172154, -55272, 122052, -5144, -131368, 9599, 167026, -256460, -234796, 88659, -276063, 48297, -71522, 36959, 283934, -12646, 69518, -29938, -169958, -174126, -107588, 246610, 206833, 136436, 404754, 31512, 415223, 572779, 375143, 210778, -65015, 53001, -14367, 62708, 136640, -14973, 110269, -173154, 173821, -75758, -179436, -4759, -141941, -145331, -119430, -236045, -39839, 14209, 53910, -207566, 164709, 162560, -96447, -169855, 279996, 127727, -148226, -65119, 46004, -64917, -119466, -254997, 13657, 292573, 41013, 166448, 19825, -53319, 221740, -95852, 8827, 119918, 142616, -240113, -143561, 61541, 168201, -432204, 45200, -34824, -261928, -273845, 175336, -202569, -392734, 31988, -33222, -63727, 89392, -280345, -43409, 29475]
10184G232J17286C5445I642L372m760B115b14244f4880F482P9214a6406K66j04032
10171a20172b2620D2344K03772a9385j9170j63238g9165j71768R2050A12168A1483
10159B36108a29474n0519G573a56936I5531b16164g0658o8868J3504H5744a01204
10147a83133j54473A0974g9907B6035b72760A711K9078i3354L9184m5498b9021
10135B1234a53803p7476j94625D08a67603E6969b00124P5331G5128b00794L6235
10124a64559E3980a92451B50804a57142D763L5943K4105O930b1017l51340L1122
10113c41235A00333c0476A41236a97477A15780a36430d3477j64304A89155a11480
10102a32200B86064b68102P0086A93617j4764b57196n113i7231j11561r5062b1641
$$ y = [7232, 124518, 35445, 9642, 13014, 8254, 2115, -214244, -64880, 6482, 85696, -16406, -16140, -120172, -22620, 42344, 246116, -19385, -38555, -201793, -79165, -250933, -158883, 112168, 11483, 236108, -129474, -179993, 7573, -156936, 95531, -216164, -70658, -139526, -126022, 85744, -101204, -183133, -337606, 10974, -79907, 26035, -272760, 1711, 30789, -93354, -54170, -99668, -29021, 21234, -153803, -231279, -425904, 408, -167603, 56969, -200124, -124793, 75128, -200794, -164559, 53980, -192451, 250804, -157142, 4763, 40706, 64811, 71741, -21017, -372357, -341235, 100333, -30476, 141236, -197477, 115780, -136430, -43477, -207781, 189155, -111480, -132200, 286064, -268102, -198016, 193617, 178853, -257196, -262309, -97231, -208792, -303854, -21641]
10090b06820A5382a08277k21278A19035a12969a8203A90232c38422B0561b0493
10079b56733O2421i5758K7623m7197o8410r9481J15260j44425J12009f1539o0398
10068a21937d0659E426b66156b9651j88546e589F1950n648e154A00141O2920a53567
10055A15706c01718g3763k68939J39461P6520B5757a06310l7442o1956j56347
10045c62055E3544b66230G3628g1363k9206m3605n7549J1474B82889e07199A8282
10033a62608C08162A6834a71095A18834b53371d7339k22046J03550M2003B30750
10022c30128r708a36869j5259e8003k85291a5982l35435J12730B56031I2395K446
10011I4841C2906K12998h0682A7887a17209A23317M6903c5749p4528j06738j18792
$$ y = [-206820, 15382, -108277, -329555, 119035, -112969, -18203, 190232, -338422, 20561, -20493, -256733, -194312, -95758, -68135, -115332, -183742, -283223, -167963, -312388, -200379, -61539, -121937, -40659, 5426, -266156, -29651, -218197, -5589, 61950, 56302, -5154, 100141, 163061, -153567, 115706, -301718, -73763, -342702, -203241, -126721, 25757, -106310, -143752, -205708, -362055, 53544, -266230, 73628, -71363, -100569, -144174, -201723, -190249, 282889, -507199, 18282, -162608, 308162, 16834, -171095, 118834, -253371, -47339, -269385, -165835, -123832, 230750, -330128, -339836, -136869, -152128, -58003, -343294, -15982, -351417, -238687, 256031, 92395, 94841, 32906, 245904, -80682, 17887, -117209, 123317, 170220, -35749, -110277, -217015, -335807]
10000c35807i4725k1996A49866d7890k75399A3064L5532a10815a8500j68600N0866
9989a36234e9833p5470j55497e9874j1453L5092j87790A6459L8940a07349A75298
9977E5977a7410o7833A24503A3840c24945c932A83518H334P8333K35023g6760
9965A91962a05332B3931j1749b01462E7741L30569C9229d01818J62629A81496
9954a03948d3866D2406a01930b5038j93642j01710B65484G1589N6710K6496i372
9942E9013A4718e15488G7190a0982k48073i1562A22641P1973a01167g411l71961
9931c79372a82968A5501b52895A4940e0147n9569A62098D857K2929a27391A61041
9919f1895k16433P6798d2275j82012h1126l87449B07140E6096J16926b20106A08189
$$ y = [-335807, -94725, -116721, 149866, -47890, -323289, 13064, 48596, -110815, -18500, -187100, -136234, -59833, -135303, -290800, -59874, -71327, -36235, -224025, 16459, 55399, -107349, 175298, 55977, -17410, -85243, 124503, 13840, -324945, -3932, 183518, 8334, 86667, 321690, -76760, 191962, -105332, 23931, 12182, -201462, 57741, 388310, 39229, -401818, -239189, 181496, -103948, -43866, 42406, -101930, -25038, -218680, -320390, 265484, 71589, 128299, 154795, -9372, 59013, 14718, -515488, 77190, -10982, -259055, -91562, 122641, 194614, -101167, -7411, -379372, -182968, 15501, -252895, 14940, -50147, -109716, 162098, 4857, 27786, -127391, 161041, -61895, -278328, -201530, -42275, -224287, -81126, -468575, 207140, 56096, 173022, -220106, 108189]
9907a16014J5041B1356a30619q7314P8532l5195h3665B04749f4245k68449B16037
9895A26340a78380D0219b18135e3829n5860a3825C50311d12863a89224K1792B0794
9883G105c59581F4047b65956A55265B2627J77402e1464l59602A70745a40304e033
9871E6013B0436b22470N2345E2537b01709A29999d6172j39270M5079G6772j3411
9860F3361J1945a06003E1777J11247a22310c8219k07720r3689p8623A34645C5225
9848B35266A1682J62813b3517j58910h6452K9235b1409k83665J28155F5405b2073
9836b36399C1258Q3822b79203a18451A17949c30923r160a47103r3683k2529A2020
9824b81841Q9898D6125N0014e2555r2413e0662p6381k18938A36993a35590r821
$$ y = [-116014, -100973, 21356, -130619, -217933, -139401, -174596, -83665, 204749, -64245, -332694, 216037, 126340, -178380, 40219, -218135, -53829, -109689, -13825, 350311, -412863, -189224, -167432, 20794, 7105, -359581, 64047, -265956, 155265, 22627, 200029, -51464, -411066, 170745, -140304, -5033, 56013, 20436, -222470, -170125, 52537, -201709, 129999, -46172, -185442, -140363, 76772, 63361, 75306, -106003, 51777, 163024, -122310, -38219, -245939, -339628, -418251, 134645, 35225, 235266, 11682, 174495, -23517, -182427, -86452, -57217, -21409, -305074, -176919, 65405, -22073, -236399, 31258, 115080, -279203, -118451, 117949, -330923, -340083, -147103, -240786, -263315, 12020, -281841, -191943, 46125, 96139, -52555, -144968, -50662, -127043, -345981, 136993, -135590, -145411]
9813a45411e8332j96618H2192L3293a0987H5434b23670g6913A62028a96559A11672
9801d2027n04226a34155A86105b9379j47004h4576A04209c38106E2285J2355k275
9790F2365J13783n9652c25975a57271d1570A19542b18413O2924O4361H4300b40141
9778e6088j49277H7296J38551h4144j73052A28755a09487j08369h8621j07759
9768a96380d0076k39456M9289i6801p7272A61602b70414A77582a92413A01439
9757a28212I8955J32539c15070A27351f2570k43158j0869a49093d4269j19456
9747a63725d185G8922a75775o109l9843F4654b20545F3917g6872B06075g1087
9735e8746q6954n7114O9379e2478C6758a51991f6785G3926a86751b1652p437k76840
$$ y = [-145411, -58332, -254950, 82192, 115485, -10987, 85434, -223670, -76913, 162028, -196559, 111672, -42027, -546253, -134155, 186105, -29379, -176383, -84576, 104209, -338106, 52285, 64640, 62365, 176148, 116496, -325975, -157271, -41570, 119542, -218413, -155489, -91128, 84300, -240141, -56088, -205365, 87296, 225847, -84144, -257196, 128755, -109487, -217856, -88621, -196380, -40076, -279532, -230243, -96801, -174073, 161602, -270414, 177582, -192413, 101439, -128212, 98955, 231494, -315070, 127351, -62570, -305728, -316597, -149093, -44269, -163725, -4185, 78922, -175775, -181884, -221727, 64654, -220545, 63917, -76872, 206075, -71087, -58746, -145700, -202814, -133435, -52478, 36758, -151991, -66785, 73926, -186751, -21652, -29089, -305929]
9723c05929J28902A5873a09974C58677a71361C265b43127d0505D27988e574j30419
9712a35993B80539b27099j01606A98584h8553k25039a31829j38705C3786b74247
9701b08668m4135A7831b00033d125k49977g1453r186C772a71582A45354d0215
9689A43138a04681j16922g3358A05937c32219J36617B80222I9047B5911d3520
9678f5821j44259B7811i2985c1424k33446o0310g3220D0923b86073a00663B28877
9666F1164c0622C4994b11385B35080f2174q8057O3012A07645a74961K1755B54091
9654b25730c7044I7100a1508j44055O2153J1206c1122k90080a57468B26484b65863
9642b13483A0828a19433j16945A930a29080l1026d8486b904b74B22126B2408P0833
$$ y = [-305929, -177027, 15873, -109974, 358677, -171361, 3265, -243127, -40505, 427988, -5574, -135993, 280539, -227099, -328705, 198584, -88553, -313592, -131829, -270534, 33786, -274247, -208668, -252803, 17831, -200033, -4125, -254102, -71453, -80639, 3772, -171582, 145354, -40215, 143138, -104681, -221603, -73358, 105937, -332219, -195602, 280222, 99047, 25911, -43520, -65821, -210080, 27811, -92985, -31424, -264870, -325180, -73220, 40923, -286073, -100663, 228877, 61164, -30622, 34994, -211385, 235080, -62174, -150231, -87219, 107645, -174961, -153206, 254091, -225730, -37044, 97100, -11508, -155563, -93410, -82204, -31122, -321202, -157468, 226484, -265863, -213483, 10828, -119433, -236378, 1930, -129080, -160106, -48486, -2904, -274, 222126, 22408, 93241]
9630I3241o349c8184A06482c30868c5317I0773b72511A47420O794a75423e393
9618a3008j3971q5098J2302C2380n040a3338l01250a36730b1642G6634a15837
9606c48839J15140i1294A12577K80292A62650b04483B68089a08794k12350E1456
9595b20980B4077J29474c34977P7908f723A67019a33424I9237a69415C5104h176
9583E1672P9795M847a88791c0017j36270C1815h4706H0772C2295K04895B528J53512
9571A56040E1916a35944e5921M012k85796J55363j15965D12715b49611K0527G840
9559a64698N7484D2166a78846C1140i78k22392J08369a806o6751k03687K1676
9548b50568Q2416L0608e781j8411r7983l3731d2283h258H265R4068J20324d8446
$$ y = [93241, 86892, -38184, 106482, -330868, -35317, 90773, -272511, 147420, 154214, -175423, -5393, -13008, -26979, -112077, -99775, 32380, 27340, -13338, -314588, -136730, -21642, 76634, -115837, -348839, -233699, -91294, 112577, 392869, 162650, -204483, 268089, -108794, -321144, 51456, -220980, 24077, 153551, -334977, -257069, -6723, 167019, -133424, 99237, -169415, 35104, -8176, 51672, 131467, 136314, -188791, -30017, -166287, 31815, -84706, 80772, 32295, 237190, 2528, 156040, 51916, -135944, -55921, -51909, -337705, -182342, -298307, 412715, -249611, -229084, 7840, -164698, -107214, 42166, -178846, 31140, -978, -223370, -115001, -1806, -68557, -272244, -250568, -168152, -137544, -5781, -24192, -122175, -155906, -42283, -8258, 8265, 102333, 222657, -48446]
9535a78824k13893B7150a44076j67728J53377g3902c617G0062p122c34589m056
9524c38645J43279C2952L53006e1882o6140C187h1546n2137j46528d7382H8887
9512a20290J7832b3597j35558A97652F5713J98186a82337e741k09165A92131c36138
9500a86209j73822a71620A5781P5266a07754p3759c4529A58285a4345I7847A4862
9488g7883B37565C4480J7066J8641J05399C3677K39202B7917c5844k5627j13529
9477a75000q3960J29342M6787e942B6540J4706b601q9485B20048F206P5124C4992
9464d7449l0575r6295D7214A6305e8947l84480A2826a35580j64487A32441b16697
9452c91920l3654C0758b41356A22363B092c25066M0246I5211k4225J33873F4689
$$ y = [-178824, -392717, 27150, -144076, -311804, -158427, -73902, -3617, 70062, 62940, -334589, -338645, -195366, 32952, 385958, -51882, -118022, 3187, -81546, -133683, -280211, -47382, 88887, -120290, -102458, -23597, -159155, 197652, 65713, 263899, -182337, -5741, -214906, 192131, -336138, -186209, -360031, -171620, 15781, 91047, -107754, -181513, -34529, 158285, -14345, 97847, 14862, -77883, 237565, 34480, 51546, 70187, 175586, 33677, 272879, 27917, -35844, -61471, -175000, -258960, -129618, -82831, -5942, 26540, 41246, -2601, -92086, 220048, 6206, 81330, 34992, -47449, -78024, -174319, 47214, 16305, -58947, -443427, 12826, -135580, -300067, 132441, -216697, -391920, -425574, 30758, -241356, 122363, 2092, -325066, -284820, 95211, 70986, 204859, 64689]
9440A68967l1834h4567j91757B04259o4393b42705A26720b79081B07231H4739
9429b29519D6784R216a8361G3194g7114K4219j1037j11117j569C7033c55895A07740
9416b03974K8917A04863a02947D6570b0805A02924B0102c74902H1220a09204j6038
9405a25242c819j38387K1113j30985A6735a95548l5264G3073m094K10965d9420
9393a35243a3019j47035g3795k9946l27524A09766c64276a5510k91687L7852j4710
9382b84055L2970A07783C8206b98521e1603E2106h4290b3043j38126B00104a8391
9370a37966r5303i8638k05622d4833l38263D7254g5663j38145A39256a66311l9959
9359b06270d5455j18717C8550e6464A91066F458i8191F6799k1244b64795B44821
$$ y = [168967, 137133, -84567, -276324, 204259, 139866, -242705, 126720, -279081, 207231, 84739, -229519, 46784, 56000, -18361, 73194, -77114, -52895, -63932, -175049, -176618, 37033, -355895, 107740, -203974, -175057, 104863, -102947, 46570, -20805, 102924, 20102, -374902, 81220, -109204, -125242, -3819, -142206, -121093, -252078, 16735, -195548, -230812, 73073, 68979, 279944, -49420, -135243, -13019, -160054, -73795, -103741, -431265, 109766, -364276, -15510, -307197, -269345, -284055, -251085, 107783, 38206, -298521, -51603, 52106, -84290, -23043, -161169, 200104, -18391, -137966, -233269, -98638, -304260, -44833, -383096, 47254, -75663, -213808, 139256, -166311, -206270, -45455, -164172, 38550, -56464, 191066, 6458, -98191, 66799, 45555, -264795, 244821]
9347b1985k88671M4992h8492J8l714j77755H384a18039l93421J49525J2369J09997
9335b39569j18847E5936Q7510M0818A6507a37952A22895a30685e5813A2039N9137
9324G1176a99081A31324b27806F4174K8779b01537i331j49824A40999d9487A55724
9312H7231b15399c6949a4269n1180a9688q41j82606c9250A37180J57477A09486
9300a1961j67204c1473A10566b26476e6156j3323k8926B68283a98854K8403N7225
9289a13226D3785J8957L8705b24954f1086K4278l68974a24841B67289f2889j4615
9278g7504H8006a65722Q1804B42634h4361A05625d09999d1688k98203g5050B4623
9266A12930R8832a41707j03473A98892c38008M5542A34169L8128e0534A22030
$$ y = [-21985, -310656, -265664, -88492, -88474, -92188, -269943, 8384, -118039, -511460, -361935, -349566, -239569, -358416, 55936, 143446, 184264, 16507, -137952, 122895, -130685, -55813, 12039, 71176, -199081, 131324, -227806, 64174, 92953, -201537, -9331, -159155, 140999, -49487, 155724, 87231, -215399, -36949, -14269, -65449, -19688, -20529, -203135, -39250, 137180, 294657, 109486, -11961, -179165, -31473, 110566, -226476, -56156, -69479, -98405, 268283, -198854, -170451, -113226, 43785, 62742, 101447, -224954, -61086, -36808, -405782, -124841, 267289, -62889, -77504, 88006, -165722, -83918, 242634, -84361, 105625, -409999, -41688, -339891, -75050, 24623, 112930, 211762, -141707, -245180, 198892, -338008, -292466, 134169, 172297, -50534, 122030]
9255b18883B34283A5981K87829b26229e6044k25889g5611l5852l29473D2264a84735
9243B67656a1117l72761J44867A5772P7527a36363c688k75564c6687G6483h1978
9231G0617a49459j53292c1751m3150q0J6858A91338a04246A50480F5323b18607
9219a48747H9172e1106A2970h6329C39304B9818K328J97479C097g4441A0428h0726
9206C7041c92094a57113A67454o5673H002i7901A8506e2264l45780i5452A84109
9194A34749a90150A06727R0684a97852o4661j71431f7796H9936b26792a13059
9183b20371L6010k5115h0143L1220j9469j04366C52101a11026B13573i6029F4734
9171B01088a77396q8823E8861d37891G269e0235n9590B65914b0178H6794e33006
$$ y = [-218883, 234283, 15981, 303810, -226229, -56044, -281933, -75611, -111463, -440936, 42264, -184735, 267656, -11117, -383878, -239011, 15772, 93299, -136363, -3688, -279252, -36687, 76483, -81978, 70617, -149459, -302751, -31751, -74901, -74981, -58123, 191338, -104246, 150480, 65323, -218607, -148747, 89172, -51106, 12970, -86329, 339304, 29818, 32146, 229625, 3097, -74441, 10428, -80726, 37041, -392094, -157113, 167454, 101781, 8002, -97901, 18506, -52264, -398044, -95452, 184109, 134749, -190150, 106727, 197411, -197852, -262513, -433944, -67796, 89936, -226792, -113059, -220371, -184361, -209476, -80143, -48923, -68392, -172758, 352101, -111026, 213573, -96029, 64734, 201088, -177396, -266219, 58861, -437891, 7269, -50235, -109825, 265914, -20178, 86794, -533006]
9159b60383P6616A3885K04629K75915b74092J2183h5860j37410f8064l68808B17005
9147D1597a16029j83639B49535H4491a3048A85071a58575e390B866J00400b516
9135I4617b39049A01299b05723j37228A75815K2634C1867b68522I7017C9573h1505
9123c40686J44581A06536a71491J0493j29650l1454j09244a61074j62291e0390
9112b57320B98160j35492D8458c720G1879b24443A20113M3689c10172a26144n4585
9101a80729N5457p3868P7778j90792e6269A67239C2340J46927c17623a4995o2916
9090g7911r3975M2390n8969h7906K3364r038G013b61305E1928b3694A04737A5568
9077f4371B5639b94686e2793l2905j9821j13575j2093P0354f301q6190k9021G7765
$$ y = [-260383, -183767, 13885, 218514, 494429, -274092, -261909, -85860, -223270, -68064, -436872, 217005, 41597, -116029, -299668, 249535, 84491, -13048, 185071, -158575, -5390, 2866, 103266, -2516, 94617, -239049, 101299, -205723, -342951, 175815, 198449, 31867, -268522, 97017, 39573, -81505, -340686, -196105, 106536, -171491, -160998, -290648, -322102, -431346, -161074, -323365, -50390, -257320, 298160, 162668, 48458, -3720, 71879, -224443, 120113, 163802, -310172, -126144, -180729, -125272, -199140, -121362, -312154, -56269, 167239, 32340, 179267, -317623, -14995, -77911, -171886, -129496, -188465, -87906, -64542, -73580, 7013, -261305, 51928, -23694, 104737, 15568, -64371, 25639, -294686, -52793, -85698, -105519, -219094, -231187, -160833, -6301, -92491, -121512, 77765]
9064b18455B95367a67295B10034G0495b77895J27627O0918r4864C02993a83894
9053a88934D2191a7736A76080I135c7393k06210A6826b16045J0287B50927E2057
9041d71025a65732F1163a11711b4025l36587J59756J7104E3762c63424J46809
9031b16615A64094p0189A2476P3268a3883l55032A4293P3222b12494A5951i6864
9019d21274B9059a60956r1472B18464b00866c3948B3754a5546H8778e5656b1613
9007a38657q6705d6145k2437A4339i1843l32994B50871J2018b5471A06828f9794
8995c5478A70089a74819A25892a48847A03613a07486A09284a69699Q604r6203
8985b57298i8928o0003C5216h3665c7342F8996b98382l5949A34532c15376O1406
$$ y = [-218455, 295367, -167295, 210034, 70495, -277895, -150268, -89350, -184214, 302993, -183894, -188934, 42191, -17736, 176080, 9135, -37393, -243603, 16826, -216045, -205758, 250927, 52057, -471025, -165732, 61163, -111711, -24025, -360612, -200856, -183752, 53762, -363424, -216615, 164094, 93905, 12476, 85744, -13883, -368915, 14293, 87515, -212494, 15951, -96864, -421274, 29059, -160956, -252428, 218464, -200866, -33948, 23754, -15546, 88778, -55656, -21613, -138657, -225362, -46145, -68582, 14339, -91843, -424837, 250871, 262889, -25471, 106828, -69794, -35478, 170089, -174819, 125892, -148847, 103613, -107486, 109284, -169699, -161095, -257298, -98928, -158931, 35216, -83665, -37342, 68996, -298382, -334331, 134532, -315376, -253970]
8974b53970h0978A34613f6371G4823a13343b5901j24874B62432b9871B00641H613
8962C81569A46548a01899A04190d839j51047C58525A77789h8332G2300g6659D433
8950e3320j54396I620a43515j31180R9228A20590a88204C55154i1737j19257R5723
8939a15271F0563a06053I1772e8186A92484a10426G6255J27232A5956L3339r102
8928D0193b904B7223d1817k7657A6536M72067G9922J209421K061201O548067J181258
8917A1079869C678072A119873m60718m7082k79353A25090k3652H236a27117A08092
8906i7684E5209l638b5297i225k11454g6628B09711C6778L44129a52012h325j50574
8894a58899E0190R4582a01509B02180C8809J92806a24768B30556A00875b58963
$$ y = [-253970, -80978, 134613, -66371, 74823, -113343, -25901, -150775, 262432, -29871, 200641, 8613, 381569, 146548, -101899, 104190, -4839, -155886, 358525, 177789, -88332, 72300, -76659, 4433, -53320, -207716, 9620, -143515, -274695, -175467, 120590, -188204, 355154, -91737, -210994, -115271, 60563, -106053, 91772, -58186, 192484, -110426, 76255, 203487, 15956, 49295, 40193, -2904, 27223, -41817, -69474, 16536, 488603, 79922, 1289343, 3350544, 9898611, 11079869, 3678072, 1119873, 659155, 612073, 332720, 125090, 101438, 8236, -127117, 108092, -97684, 55209, 51571, -25297, -9225, -220679, -76628, 209711, 36778, 380907, -152012, -8325, -158899, 50190, 144772, -101509, 202180, 38809, 231615, -124768, 230556, 100875, -258963]
8883A98832c39618B20683g9144E405d8462j50898P120A61343p9319e29551G2010
8871B48419A5320a89520p3343A0111a48694m2244D256i101m1687j97080c8852
8859C48418i1928j25316o3294q277J27372B09571a39611A90432c0862j10872A376
8847c0644A07675b46328D4678c5207l9698m9696F1192j6523O0173g693n8281j82311
$$ y = [198832, -339618, 220683, -79144, 5405, -48462, -199360, -192240, 161343, 82024, -529551, 72010, 248419, 15320, -189520, -262863, 10111, -148694, -190938, 4256, -9101, -50788, -247868, -38852, 348418, -91928, -217244, -280538, -288815, -161443, 209571, -139611, 190432, -30862, -141734, 1376, -30644, 107675, -246328, 44678, -35207, -74905, -124601, 61192, 44669, 104842, -7693, -65974, -248285]
$$ [...]
##END NTUPLES=NMR SPECTRUM
##END=
