
##TITLE=AC1328_GUAAH12157_6535940_7y3JOrinaq
##JCAMPDX= 6.0         $$ Bruker NMR JCAMP-DX V2.0
##DATA TYPE= NMR SPECTRUM
##DATA CLASS= NTUPLES
##ORIGIN= BRUKER
##OWNER= Administrator
$$ 1.72 TOPSPIN		Version 2.1
$$ 2012-07-17 21:37:48.265 -0500  Administrator@TOPSPIN
$$ Compression mode = diff/dup
##.OBSERVE FREQUENCY= 400.02188249412
##.OBSERVE NUCLEUS= ^1H
##.ACQUISITION MODE= SIMULTANEOUS (DQD)
##.ACQUISITION SCHEME= undefined
##.AVERAGES= 64
##.DIGITISER RES= 22
##SPECTROMETER/DATA SYSTEM= spect
##.PULSE SEQUENCE= noesygpps1d.comp
##.SOLVENT NAME= COFFEE_meoh
##.SHIFT REFERENCE= INTERNAL, COFFEE_meoh, 1, 14.96075
##AUDIT TRAIL= $$ (NUMBER, WHEN, WHO, WHERE, PROCESS, VERSION, WHAT)
$$ ##TITLE= Audit trail, TOPSPIN		Version 2.1
$$ ##JCAMPDX= 5.01
$$ ##ORIGIN= Bruker BioSpin GmbH
$$ ##OWNER= Administrator
$$ $$ C:\Bruker\TOPSPIN/data/COFFEE/nmr/AC1328_GUAAH12157_6535940_7y3JOrinaq/12/pdata/1/auditp.txt
$$ ##AUDIT TRAIL=  $$ (NUMBER, WHEN, WHO, WHERE, PROCESS, VERSION, WHAT)
(   1,<2012-07-17 21:37:42.859 -0500>,<Administrator>,<TOPSPIN>,<go>,<TOPSPIN 2.1>,
      <created by zg
	started at 2012-07-17 21:26:12.734 -0500,
	POWCHK enabled, PULCHK disabled,
       configuration hash MD5:
       6B 1B 68 BB D9 2E 58 E2 7F 35 AD 54 07 DF 0E 41
       data hash MD5: 64K
       CE 79 1C E5 86 AA 01 A4 52 49 CE 8D 1F 40 A0 F2>)
(   2,<2012-07-17 21:37:45.765 -0500>,<Administrator>,<TOPSPIN>,<proc1d>,<TOPSPIN 2.1>,
      <Start of raw data processing
       efp LB = 0.3 FT_mod = 6 PKNL = 1 PHC0 = 0 PHC1 = 0 SI = 128K 
       data hash MD5: 128K
       3D 82 A6 91 36 CE AE B3 79 C4 C8 05 AE D4 D7 00>)
(   3,<2012-07-17 21:37:46.906 -0500>,<Administrator>,<TOPSPIN>,<proc1d>,<TOPSPIN 2.1>,
      <pk PHC0 = -0.9832764 PHC1 = 0 
       data hash MD5: 128K
       4A 00 D3 82 AF 7F 4A 6B 63 9E 93 7E F0 BD 85 12>)
(   4,<2012-07-17 21:37:47.609 -0500>,<Administrator>,<TOPSPIN>,<proc1d>,<TOPSPIN 2.1>,
      <abs ABSG = 1 
       data hash MD5: 128K
       DA 2B 26 4B 23 68 61 48 20 95 BD 11 D8 85 29 CF>)
(   5,<2012-07-17 21:37:47.890 -0500>,<Administrator>,<TOPSPIN>,<proc1d>,<TOPSPIN 2.1>,
      <abs ABSG = 2 
       data hash MD5: 128K
       B2 D6 AB 05 8A 88 25 AF 37 2F 76 A8 67 09 C5 9D>)
(   6,<2012-07-17 21:37:48.062 -0500>,<Administrator>,<TOPSPIN>,<proc1d>,<TOPSPIN 2.1>,
      <abs ABSG = 3 
       data hash MD5: 128K
       44 26 D4 0B 99 45 30 D1 62 20 A0 79 52 A6 E1 20>)
(   7,<2012-07-17 21:37:48.125 -0500>,<Administrator>,<TOPSPIN>,<proc1d>,<TOPSPIN 2.1>,
      <abs ABSG = 4 
       data hash MD5: 128K
       D7 0A FF 5A 57 9D 7B B2 61 A9 0C 38 A1 A3 EB F2>)
(   8,<2012-07-17 21:37:48.171 -0500>,<Administrator>,<TOPSPIN>,<proc1d>,<TOPSPIN 2.1>,
      <abs ABSG = 5 
       data hash MD5: 128K
       C9 7A 35 93 9E 30 D7 30 0D AC D3 30 6A 50 CC 18>)
$$ ##END=
$$ 
$$ $$ hash MD5
$$ $$ F0 C5 88 1D 51 2B 26 3F 25 3F 01 7A 72 3F 45 6B
##$RELAX= 
##$RELAX= 
##$RELAX= 
##$RELAX= 
##$RELAX= 
##$RELAX= 
##$RELAX= 
##$RELAX= 
$$ Bruker specific parameters
$$ [...]
##$TP07= 0
##$TPNAME0= <>
##$TPNAME1= <>
##$TPNAME2= <>
##$TPNAME3= <>
##$TPNAME4= <>
##$TPNAME5= <>
##$TPNAME6= <>
##$TPNAME7= <>
##$TPOAL= (0..7)
0.5 0.5 0.5 0.5 0.5 0.5 0.5 0.5
##$TPOFFS= (0..7)
0 0 0 0 0 0 0 0
##$TUNHIN= 0
##$TUNHOUT= 0
##$TUNXOUT= 0
##$USERA1= <user>
##$USERA2= <user>
##$USERA3= <user>
##$USERA4= <user>
##$USERA5= <user>
##$V9= 5
##$VALIST= <valist>
##$VCLIST= <CCCCCCCCCCCCCCC>
##$VD= 0
##$VDLIST= <DDDDDDDDDDDDDDD>
##$VPLIST= <PPPPPPPPPPPPPPP>
##$VTLIST= <TTTTTTTTTTTTTTT>
##$WBST= 2048
##$WBSW= 25
##$XGAIN= (0..3)
0 0 0 0
##$XL= 0
##$YL= 0
##$YMAX_a= 11565821
##$YMIN_a= -9083349
##$ZGOPTNS= <>
##$ZL1= 120
##$ZL2= 120
##$ZL3= 120
##$ZL4= 120
##$ABSF1= 14.96075
##$ABSF2= -5.597432
##$ABSG= 5
##$ABSL= 3
##$ALPHA= 0
##$AQORDER= 0
##$ASSFAC= 0
##$ASSFACI= 0
##$ASSFACX= 0
##$ASSWID= 0
##$AUNMP= <proc_prof1d_extract.lims>
##$AXLEFT= 0
##$AXNAME= <>
##$AXNUC= <1H>
##$AXRIGHT= 0
##$AXTYPE= 0
##$AXUNIT= <>
##$AZFE= 0.1
##$AZFW= 0.1
##$BCFW= 0
##$BC_mod= 0
##$BYTORDP= 0
##$COROFFS= 0
##$CY= 15
##$DATMOD= 1
##$DC= 0
##$DFILT= <>
##$DTYPP= 0
##$F1P= 0
##$F2P= 0
##$FCOR= 0.5
##$FTSIZE= 131072
##$FT_mod= 6
##$GAMMA= 0
##$GB= 0
##$INTBC= 1
##$INTSCL= 1
##$ISEN= 128
##$LB= 0.3
##$LEV0= 0
##$LPBIN= 0
##$MAXI= 10000
##$MC2= 0
##$MEAN= 0
##$ME_mod= 0
##$MI= 0
##$NCOEF= 0
##$NC_proc= -2
##$NLEV= 6
##$NOISF1= 0
##$NOISF2= 0
##$NSP= 0
##$NTH_PI= 0
##$NZP= 0
##$OFFSET= 14.96075
##$PC= 1
##$PHC0= -0.9832764
##$PHC1= 0
##$PH_mod= 1
##$PKNL= yes
##$PPARMOD= 0
##$PPDIAG= 0
##$PPIPTYP= 0
##$PPMPNUM= 2147483647
##$PPRESOL= 1
##$PSCAL= 4
##$PSIGN= 0
##$PYNMP= <proc.py>
##$REVERSE= no
##$SF= 400.020009737219
##$SI= 131072
##$SIGF1= 0
##$SIGF2= 0
##$SINO= 400
##$SIOLD= 131072
##$SPECTYP= <>
##$SREGLST= <1H.CDCl3>
##$SSB= 0
##$STSI= 131072
##$STSR= 0
##$SW_p= 8223.68421052631
##$SYMM= 0
##$S_DEV= 0
##$TDeff= 65536
##$TDoff= 0
##$TI= <>
##$TILT= no
##$TM1= 0
##$TM2= 0
##$TOPLEV= 0
##$USERP1= <user>
##$USERP2= <user>
##$USERP3= <user>
##$USERP4= <user>
##$USERP5= <user>
##$WDW= 1
##$XDIM= 131072
##$YMAX_p= 407830582
##$YMIN_p= -11116
##$CURPLOT= <Network HP LaserJet P1505>
##$CURPRIN= <$Network HP LaserJet P1505>
##$DFORMAT= <normdp>
##$LAYOUT= <+/1D_H.xwp>
##$LFORMAT= <normlp>
##$PFORMAT= <normpl>
##$SURQMSG= 1
$$ End of Bruker specific parameters
$$ ---------------------------------
##NTUPLES= NMR SPECTRUM
##VAR_NAME=  FREQUENCY,     SPECTRUM/REAL,   SPECTRUM/IMAG
##SYMBOL=    X,             R,               I
##VAR_TYPE=  INDEPENDENT,   DEPENDENT,       DEPENDENT
##VAR_FORM=  AFFN,          ASDF,            ASDF
##VAR_DIM=   131072,        131072,          131072
##UNITS=     HZ,            ARBITRARY UNITS, ARBITRARY UNITS
##FACTOR=    0.0627417313425164, 1,          1
##FIRST=     8223.62146879497, 2280,         -57489
##LAST=      0,             3905,            -57052
##MIN=       0,             -11116,          0
##MAX=       8223.62146879497, 407830582,    0
$$ Real data points
##PAGE= N=1
##DATA TABLE= (X++(R..R)), XYDATA
$$ [...]
67866 93163 93301 94121 95985 98194 99671 99930 99228 98088 96863 95685 94578 93533 92550 91648 90849 90104
67850 90104 89233 87968 86193 84181 82528 81731 81763 82093 82156 81818 81384 81153 81089 81034 81177 81984 83549 85273
67832 85273 86545 87563 89056 91248 93568 95514 97261 99087 100687 101563 101881 102397 103592 105322 107215
67817 107215 108867 109708 109285 107966 106873 106794 107480 108216 108595 108368 106992 104025 99849 95449 91501 88083
67801 88083 85257 83328 82372 81956 81610 81294 81188 81295 81478 81673 81821 81782 81503 81099 80595 79816 78810 78171
67783 78171 78486 79477 80068 79486 78059 76768 76210 76207 76328 76503 76956 77696 78358 78645 78756 79145 79924 80749 81342
67764 81342 81938 83092 85163 87986 90940 93294 94701 95404 95800 95885 95404 94571 94141 94534 95251 95479 95030
67747 95030 94336 93854 93841 94423 95364 95972 95737 94991 94430 94095 93411 92186 90869 89713 88399 86762 85249
67730 85249 84204 83201 81632 79626 77909 76941 76567 76319 75705 74401 72585 70960 70121 70005 70234 70712
67714 70712 71527 72493 73299 73982 74718 75258 75146 74515 74126 74453 75260 76158 77023 77621 77421 76267 74868 74102
67696 74102 74090 74392 74909 75976 77629 79322 80487 80939 80633 79471 77627 75689 74195 73268 72961 73634 75506
67679 75506 77963 79903 80890 81618 82981 84995 86851 87811 87802 87292 86889 87072 88056 89803 92136 94748 97093
67662 97093 98533 98846 98490 98143 98020 97852 97442 96934 96543 96281 96013 95627 95108 94619 94472 94773 95140 95030 94340
67643 94340 93404 92424 91300 90042 88865 87738 86355 84844 83999 84376 85502 86546 87469 88883 90875 92676
67627 92676 93720 94445 95726 97807 100139 102097 103530 104619 105468 105975 106093 106098 106470 107389 108446 108987 108817
67610 108817 108424 108489 109231 110243 110874 110692 109646 108005 106259 105003 104634 104997 105441 105409 104903 104229 103450 102389
67592 102389 101035 99630 98367 97352 96742 96476 95902 94311 92014 90241 89741 90073 90569 91227 92016 92112 90786
67575 90786 88724 87436 87489 88123 88534 88688 88803 88922 89209 89920 90824 91259 90985 90368 89557 88226 86391 84804
67557 84804 84104 84214 84911 86281 88028 89054 88516 86983 85764 85349 85157 84640 83910 83307 82950 82845 83040
67540 83040 83569 84458 85661 86779 87145 86587 85825 85590 85585 84993 83879 83290 83814 84742 85018 84501 83848 83490 83153
67521 83153 82307 80837 79308 78631 79224 80418 80932 80137 78699 77755 77687 77914 77802 77435 77427 78161 79421 80743
67503 80743 81865 82693 82966 82427 81460 81108 82030 83606 84579 84530 84242 84598 85634 86831 87812 88409 88470 88084
67485 88084 87748 87864 88174 88143 87775 87549 87553 87245 86343 85450 85297 85677 85727 85257 85142 86087 87469 87951 87085 85769
67465 85769 85089 85209 85631 86102 86872 88177 89877 91560 92788 93333 93435 93740 94659 95778 96269 95965 95652
67448 95652 96100 97104 97798 97772 97467 97457 97695 97688 97254 96825 96954 97689 98631 99504 100438 101642 103024 104345 105582
67429 105582 106868 108083 108814 108823 108333 107653 106715 105279 103567 102355 102228 102881 103365 103004 101931 100715 99728
67412 99728 98982 98304 97452 96231 94839 93987 94250 95288 96124 96301 96319 96753 97415 97784 97844 98019 98544 99374 100480
67393 100480 101652 102238 101764 100833 100682 101675 102845 103171 102712 102114 101571 100802 99766 98863 98512 98851 99736 100776
67375 100776 101525 101822 101824 101635 101294 101249 102246 104304 106305 107234 107434 107901 108640 108688 107699 106539 106072 106190 106402
67356 106402 106563 106564 106062 105197 104945 105952 107418 108019 107662 107455 108003 108703 108854 108580 108310 108114 108075 108678 110204
67337 110204 112087 113424 113882 113692 113157 112752 113332 115396 118213 120502 122061 123938 126764 129721 131688
67322 131688 132696 133559 134501 135021 134924 134608 134215 133263 131536 129804 129128 129625 130275 129935 128330 126183 124626
67305 124626 124395 125339 126644 127667 128567 130017 132329 135041 137390 139000 139989 140566 140799 140809 140968 141721 143224
67288 143224 145180 146959 147848 147443 146023 144418 143184 141935 139852 136842 133797 131569 130158 129226 128917
67273 128917 129631 131202 132900 134267 135491 136960 138891 141391 144320 147027 148782 149738 150883 152683 154249
67258 154249 154356 152985 151291 150240 149882 149913 150305 151134 152224 153257 154010 154245 153597 151918 149716 147987
67242 147987 147476 148110 149159 149901 150113 150038 150051 150385 151050 151817 152269 152015 150958 149394 147885 147008 147038 147699
67224 147699 148323 148513 148584 149075 149906 150373 150139 149759 149968 150749 151471 151709 151542 151184 150767 150532 150883 152054 153864
67205 153864 155880 157739 159292 160492 161175 161015 159892 158342 157383 157661 158908 160354 161433 161919 161758 161203
67189 161203 160894 161336 162403 163689 165113 166695 167964 168335 168100 168298 169367 170590 171182 171300 171594 172291
67173 172291 173274 174554 176024 177107 177389 177426 178192 179724 181020 181395 181317 181657 182633 183800 184654 184926 184566
67156 184566 183893 183536 183886 184685 185435 186081 186979 188247 189535 190427 190783 190659 190250 190026 190518 191690 192775
67139 192775 193081 192842 192917 193733 194882 195758 196197 196412 196693 197375 198677 200256 201283 201374 201176 201490 202042 201803
67121 201803 200585 199565 199906 201469 203336 205120 207108 209321 211178 212214 212639 212971 213457 214089 214940 216207
67105 216207 217893 219650 221016 221815 222329 223031 224138 225511 226956 228425 229801 230712 230844 230370 229886 229940
67089 229940 230767 232291 234102 235566 236329 236746 237449 238473 239237 239507 239901 241154 243206 245407 247351 249064
67073 249064 250547 251632 252402 253316 254710 256380 257838 258879 259737 260800 262232 263844 265279 266399 267502
67058 267502 269014 270944 272808 274163 275187 276553 278754 281564 284172 285891 286749 287429 288558 290135 291718
67043 291718 293056 294324 295747 297292 298819 300309 301751 303054 304287 305834 307999 310554 312938 314921
67029 314921 316781 318848 321198 323827 326816 330113 333400 336334 338811 340857 342472 343780 345165 347076
67015 347076 349721 353060 356915 360965 364773 368007 370530 372226 373029 373372 374287 376656 380454 385055 390098
67000 390098 395582 401285 406698 411667 416532 421414 425844 429426 432446 435456 438530 441340 443790 446163
66986 446163 448771 451798 455439 459820 464755 469783 474529 478925 483188 487729 492971 498985 505330 511445
66972 511445 517222 523063 529421 536379 543615 550592 556936 562796 568774 575317 582282 589282 596266 603474
66958 603474 610931 618388 625772 633408 641682 650671 660132 669726 679324 689235 699975 711555 723179
66945 723179 734078 744535 755616 767900 780956 794093 807089 819987 832779 845644 859059
66934 859059 873270 888004 903098 919036 936333 954617 972895 990644 1008202 1026175 1044957
66923 1044957 1064837 1086024 1108294 1130925 1153233 1175095 1196931 1219396 1243060 1268118 1294290
66912 1294290 1321202 1348862 1377480 1406824 1436258 1465659 1495882 1527866 1561487 1595763 1630139
66901 1630139 1665062 1701229 1738733 1777159 1816128 1855406 1894809 1934493 1975186 2017627 2061667
66890 2061667 2106326 2150861 2195314 2239878 2284263 2328098 2371527 2414847 2457800 2499874 2541150
66879 2541150 2582174 2622913 2662549 2700480 2736839 2771706 2804430 2834311 2861467 2886440 2909266
66868 2909266 2929507 2946977 2961762 2973641 2982093 2986944 2988491 2987001 2982571 2975502 2966174 2954369 2939220
66855 2939220 2920143 2897449 2871809 2843572 2812933 2780410 2746574 2711409 2674328 2634893 2593356
66844 2593356 2550528 2507283 2464061 2420625 2376344 2330913 2284775 2238652 2192791 2146947 2101124
66833 2101124 2055958 2012039 1968997 1925666 1881383 1836935 1793873 1752880 1713135 1673441 1633656
66822 1633656 1594669 1557200 1521151 1486122 1452040 1419000 1386879 1355434 1324593 1294326 1264356
66811 1264356 1234323 1204287 1174852 1146754 1120323 1095312 1071150 1047357 1023815 1000650 977963
66800 977963 955771 934153 913207 892851 872927 853597 835344 818412 802439 786863 771482
66789 771482 756393 741583 726938 712589 698916 686076 673718 661259 648407 635384 622669
66778 622669 610509 598665 586778 574998 564014 554366 545890 537986 530239 522542 514823 506940 498794
66765 498794 490359 481742 473394 465991 459744 453879 447212 439272 430658 422345 414961 408629 403085 397858
66751 397858 392662 387638 382955 378257 372965 367124 361409 356149 350945 345576 340690 337050 334476 332072
66737 332072 329272 326059 322378 318015 313162 308519 304593 301245 298036 294652 290870 286568 282029 277907
66723 277907 274572 271762 269110 266672 264568 262369 259407 255632 251673 247985 244410 240774 237434 234880
66709 234880 233038 231392 229645 227915 226291 224568 222547 220351 218321 216716 215571 214655 213524 211793
66695 211793 209556 207386 205780 204652 203481 201862 199778 197431 195032 192742 190659 188802 187221 186083
66681 186083 185529 185368 185016 183846 181611 178594 175423 172677 170519 168648 166697 164712 163159 162405 162244
66666 162244 161988 161057 159507 158004 157230 157255 157470 157170 156157 154793 153577 152761 152295 151974 151616 151185 150699
66649 150699 150036 148974 147552 146201 145273 144573 143733 142964 142983 143975 145052 145085 143853 142044 140308 138725 137149
66632 137149 135638 134332 133167 131930 130549 129151 127908 126899 126122 125576 125353 125648 126566 127795 128600 128393
66616 128393 127404 126602 126766 127725 128700 129246 129498 129487 128712 126790 124218 122004 120611 119681 118774 117916 117293 116869
66598 116869 116564 116463 116589 116714 116683 116677 116878 117050 116816 116121 115108 113738 111940 110024 108484 107388 106440 105601
66580 105601 105215 105364 105565 105347 104752 104031 103219 102355 101817 101922 102305 102143 101146 100004 99691 100489 101838 103047
66562 103047 103900 104519 104800 104324 102929 101108 99578 98578 97911 97572 97820 98547 99108 99131 99044 99344 99645 99029
66544 99029 97210 94826 92640 91063 90477 91316 93398 95616 96762 96460 95050 92947 90579 88693 88013
66529 88013 88471 89200 89475 89321 89099 88856 88375 87617 86756 85827 84630 83054 81346 80013 79463 79695 80262 80643
66511 80643 80713 80759 80967 81077 80789 80349 80390 81190 82428 83735 85085 86385 87029 86358 84523 82547 81472 81644
66493 81644 82694 83853 84302 83722 82715 82347 82932 83561 83132 81615 79937 78817 78207 77837 77735 78009 78557
66476 78557 79224 79997 80804 81338 81356 80923 80205 79253 78244 77632 77661 77905 77717 77074 76574 76622 77084 77799 78907
66457 78907 80438 81976 83071 83711 84067 84041 83446 82516 81781 81382 80825 79589 77842 76463 76335 77526 79100
66440 79100 79895 79614 79000 78803 78825 78361 77347 76501 76286 76335 76172 76105 76913 78855 81351 83551 84882 85090
66422 85090 84183 82492 80629 79174 78411 78310 78620 78933 78791 77887 76248 74231 72354 71057 70513 70624 71202
66405 71202 72055 72917 73427 73366 72920 72560 72525 72501 71872 70439 68878 68359 69452 71464 73066 73627 73661 73873 74235
66386 74235 74342 74345 74894 76180 77582 78411 78562 78243 77592 76910 76899 78105 80192 82131 83118 83085 82447 81706 81253
66367 81253 81170 81119 80640 79679 78615 77799 77311 77159 77398 77924 78448 78808 79055 79116 78682 77697 76671 76199 76319
66348 76319 76681 77111 77611 77914 77592 76692 75771 75100 74300 73115 72110 72125 73166 74367 75041 75261 75352 75269 74819
66329 74819 74126 73484 72895 72201 71627 71773 72924 74695 76515 78136 79397 79827 78968 77072 75061 73694
66313 73694 73082 73063 73573 74394 74919 74650 73799 73024 72609 72322 72030 72037 72643 73660 74592 75126 75238 75002 74491 73847
66293 73847 73302 73125 73458 74103 74522 74315 73700 73268 73252 73337 73316 73451 73975 74577 74824 74815 74941 75153 75049 74700 74881
66272 74881 76227 78438 80491 81455 81029 79586 77845 76394 75418 74929 75060 75838 76773 77221 77256 77736 79192
66255 79192 81057 82332 82704 82589 82336 81917 81346 80881 80584 80058 78885 77257 76007 75972 77245 78929 79753
66238 79753 79162 77825 76921 76924 77264 77147 76426 75563 75025 74963 75347 76127 77221 78460 79592 80333 80484 80115 79596
66219 79596 79316 79311 79269 78885 78187 77469 77013 76897 77006 77142 77151 77028 76878 76740 76470 75909 75134 74472 74237 74494 75043
66198 75043 75499 75478 74935 74333 74279 74882 75753 76695 78026 79944 81903 83088 83378 83370 83519 83787 84145 84861 85981
66179 85981 86932 87047 86323 85388 84836 84769 84858 84660 84009 83247 82952 83360 84181 85005 85609 85780 85261 84135 82993
66160 82993 82355 82109 81817 81336 80818 80266 79539 78738 78236 78305 78944 79975 81043 81639 81486 80832 80100 79386 78733
66141 78733 78680 79918 82245 84445 85521 85701 85871 86354 86686 86488 86057 85926 86109 86115 85682 85228 85329 85894 86267
66122 86267 86133 85864 85755 85413 84350 82818 81501 80642 80100 80113 81233 83373 85584 87019 87643 87823 87819 87883
66104 87883 88297 88899 89040 88425 87644 87485 88088 89107 90299 91472 92252 92489 92702 93536 94875 96019 96640
66087 96640 97069 97621 98121 98179 97562 96265 94558 93066 92451 92837 93741 94558 94943 94797 94259 93788 93890 94619
66069 94619 95540 96248 96730 97214 97906 98930 100217 101363 101840 101509 100755 100008 99345 98701 98243 98292 98929 99848
66051 99848 100584 100827 100600 100160 99666 98964 97870 96691 96175 96777 98107 99352 100138 100723 101390 101964 102182 102295
66033 102295 102972 104504 106370 107783 108576 109273 110367 111820 113326 114743 116085 117359 118661 120204 121926
66018 121926 123251 123658 123505 123860 125379 127638 129688 131012 131725 132091 132190 132019 131685 131408 131433 131990 133167
66001 133167 134718 136155 137270 138661 141386 145825 151044 155736 159768 164238 169772 175355 179381 181523
65987 181523 182862 184317 185684 186411 186566 186587 186483 185848 184478 182539 180170 177307 174014 170681 167700 164969
65971 164969 161880 157914 153294 148964 145758 143619 141724 139323 136300 133045 130124 128127 127393 127600 127862
65956 127862 127541 126903 126804 127838 129909 132463 134882 136756 138018 138831 139335 139689 140422 142333 145646 149504
65940 149504 152799 155394 157998 160877 163338 164753 165491 166333 167414 168326 169084 170246 171991 173693 174749
65925 174749 175383 176278 177726 179564 181823 184877 188852 193272 197457 201109 204377 207606 211157 215299 220032
65910 220032 225082 230121 234915 239193 242651 245256 247374 249324 250954 251952 252426 252802 253169 253151 252612 252109
65894 252109 252292 252979 253141 251838 249007 245277 241231 237020 232671 228429 224538 220738 216386 211218 205707
65879 205707 200380 195049 189104 182447 175716 169596 164358 160136 157129 155269 154068 153143 152631 152741 153130
65864 153130 153152 152607 151842 151056 149950 148249 146290 144775 144058 143941 144176 144874 146184 147734 148755 148868 148493
65847 148493 148325 148634 149381 150674 152594 154615 155805 155826 155268 154813 154493 154105 153813 153894 154216 154604 155520 157706
65829 157706 161123 164837 168149 171309 174886 178898 183001 187266 192266 198381 205348 212578 219682 226534
65815 226534 232876 238069 241371 242533 242004 240478 238286 235406 232038 228882 226599 225037 223240 220327
65801 220327 216251 211624 206969 202406 198077 194425 191731 189581 187316 185045 183750 184124 185626 187023
65787 187023 187695 188116 189234 191665 195388 199903 204633 209404 214499 220247 226724 234067 242704 252802
65773 252802 263632 274007 283351 291817 299293 304815 307238 306122 301778 294826 286040 276189 265644
65760 265644 254298 242275 230540 220428 212585 206721 202348 199511 198695 200237 203848 208666 213873
65747 213873 219473 226416 235743 247601 261185 275512 290048 304635 319111 333107 346034 357194
65735 357194 365951 371891 374738 374243 370329 363362 354102 343275 331246 318121 304049 289446 274993
65722 274993 261370 248870 237249 226073 215208 204925 195623 187541 180621 174463 168544 162731 157543
65709 157543 153640 151012 148956 146826 144512 142116 139575 136819 134043 131582 129751 128961 129612 131471 133416
65694 133416 134347 134279 134162 134644 135530 136484 137686 139459 141630 143647 145196 146411 147582 148976 150826 153209
65678 153209 155969 158975 162428 166693 171855 177742 184436 192414 202045 213155 225297 238264 252119
65665 252119 266833 282243 298373 315442 333380 351430 368459 383585 396438 406973 415311 421761
65653 421761 426665 430099 431924 432346 432213 432413 433014 433347 433076 432887 433860 436236 438997 440650 440300 437935
65637 437935 433795 427619 418685 406612 391940 375648 358214 339534 319792 299972 281160 263681
65625 263681 247280 231943 218055 205868 195289 186217 178624 172161 166124 160082 154282 149210 144978
65612 144978 141390 138417 136286 135096 134520 133898 132668 130839 129111 128277 128372 128624 128399 127944 127945 128585 129383
65595 129383 129835 129851 129608 129343 129381 130019 131265 132866 134695 136868 139349 141753 143800 145843 148565 152116
65579 152116 155847 159091 162078 165859 171374 178813 187932 198670 211179 225365 240761 256916 273644
65566 273644 290735 307639 323639 338203 350995 361594 369388 373781 374507 371814 366333 358640 348819
65553 348819 336624 322146 306158 289750 273776 258702 244642 231277 218079 205044 193104
65542 193104 183426 176349 171286 167505 164579 162189 160097 158546 158168 159194 161023 162880 164558 166186
65528 166186 167483 167785 166868 165325 163952 162928 161728 159722 156658 152678 148164 143671 139793 136839 134675
65513 134675 133077 132127 131986 132304 132331 131817 131353 131473 131810 131641 130942 130310 129934 129313 128038 126263 124340 122568
65495 122568 121436 121494 122676 124330 126217 128901 132737 137073 141085 144943 149370 154331 158952 162707 165950
65480 165950 169108 171999 174188 175543 176121 175889 174876 173430 172059 171060 170333 169428 167731 164863 160996
65465 160996 156649 152245 148086 144716 142768 142185 141925 140826 138722 136459 134902 134157 133762 133357 132963 132660
65449 132660 132187 131093 129330 127531 126518 126622 127596 129063 130780 132511 133959 134967 135650 136346 137591
65434 137591 140006 143800 148315 152416 155480 157788 159886 161957 163921 165622 166564 165913 163355 159733 156288
65419 156288 153397 150616 147823 145596 144281 143402 142391 141438 141078 141263 141455 141528 141984 143147 144621 145799
65403 145799 146598 147391 148366 149347 150268 151569 153866 157250 161059 164487 167416 170504 174333 178590 182251
65388 182251 184539 185490 185584 185148 184293 183132 181718 179925 177742 175619 174136 173295 172515 171484 170604 170361
65372 170361 170626 170956 171276 171800 172416 172778 173054 174035 176197 179022 181601 183740 186142 189608 194343 200029
65356 200029 206303 213025 220201 227782 235637 243704 252013 260392 268256 274982 280458 284985 288595 290858
65342 290858 291496 290703 288599 284840 279362 273154 267550 262764 257766 251679 244634 237066 228905 220043 211155
65327 211155 203384 197264 192405 188147 184187 180614 177698 175661 174358 173219 171756 170112 168890 168454
65313 168454 168645 169074 169357 169077 167912 165978 163740 161501 159212 156876 154825 153390 152483 151725 150946 150506
65297 150506 151188 153637 157595 161772 164931 167173 169654 172916 176105 178202 179361 180399 181402 181730 181199
65282 181199 180380 179620 178657 177435 176564 176456 176579 176127 175048 173850 172683 171215 169324 167338 165529 163809
65266 163809 162137 160845 160336 160564 160996 161024 160366 159182 157870 156747 155915 155413 155354 155821 156683 157618 158249 158284
65248 158284 157697 156860 156220 155646 154406 152103 149398 147315 145958 144492 142390 140098 138287 137073 136326
65233 136326 136222 136912 138015 139032 140058 141466 142956 143632 143133 142064 141124 140397 139870 140039 141344 143242
65217 143242 144536 144657 144114 143632 143327 142934 142453 142245 142627 143569 144716 145630 146145 146525 147101 147696 147716 146989
65199 146989 146218 146259 147119 147976 148106 147500 146564 145584 144598 143610 142788 142536 143312 145196 147654 149939 151766 153429
65181 153429 155241 157127 158798 160057 160816 161059 161004 161131 161862 163299 165316 167716 170137 172060 173159 173569
65165 173569 173636 173575 173551 173897 174913 176536 178528 180878 183705 186842 189944 193069 196727 201187 206127 211264
65149 211264 217007 224117 232862 242871 253700 265207 277442 290591 305139 321625 339893 358789
65137 358789 376951 393892 410088 426071 441770 456817 471115 484756 497459 508440 516942 522708
65125 522708 525797 526102 523325 517469 509240 499774 489871 479456 467798 454272 438928 422361 405171
65112 405171 387665 370003 352429 335289 318946 303803 290237 278309 267533 257161 246878
65101 246878 237140 228698 221683 215364 208921 202398 196571 191888 187892 183938 180081 176813 174154 171698
65087 171698 169590 168685 169311 170416 170595 169729 169008 169374 170485 171298 171188 170252 168892 167441 166124 165159 164789
65070 164789 165145 166017 166868 167289 167391 167534 167724 167582 166941 166142 165635 165527 165651 165845 166004 166038 165971 165992 166336 167181
65050 167181 168627 170498 172111 172669 172128 171426 171483 172168 172569 172192 171413 170749 170127 169110 167595 165987 164724
65033 164724 163785 162713 161064 158808 156311 153947 151806 149837 148140 146981 146501 146549 146824 147111 147355 147597
65017 147597 147846 147980 147782 147153 146274 145473 144922 144551 144292 144328 145103 147017 149998 153312 155991 157709 159162
65000 159162 161355 164566 168282 172088 176062 180073 183250 184784 185058 185318 186191 187096 187311 187017 186896 187186
64984 187186 187682 188404 189585 191055 192293 193239 194477 196399 198606 200390 201391 201420 200187 197788 195192
64969 195192 193514 192765 191886 190046 187398 184425 181224 177845 174851 172916 171989 171310 170249 168774 167120
64954 167120 165411 163764 162437 161645 161288 161011 160477 159525 158163 156576 155138 154269 154134 154435 154573 154189 153580
64937 153580 153483 154261 155367 155740 154788 152911 151077 150058 150105 151106 152738 154450 155615 155968 155874 155985 156578
64920 156578 157304 157626 157424 157065 156956 157146 157412 157659 158137 159208 160892 162736 164198 165104 165648 166014 166302
64903 166302 166846 168264 170869 174201 177469 180514 184040 188824 194951 201982 209587 217728 226226 234460
64889 234460 241662 247543 252487 257072 261448 265297 268415 271126 273942 276921 279565 281274 281654 280452
64875 280452 277559 273293 268410 263554 258717 253451 247631 241838 236953 233443 231046 229148 227383 225858
64861 225858 224823 224288 224029 223826 223432 222402 220244 216872 212746 208444 204196 199866 195279 190481 185778
64846 185778 181596 178161 175279 172533 169758 167196 165126 163538 162300 161523 161568 162593 164100 165010 164422
64831 164422 162551 160745 160258 160990 161770 161900 161947 162894 164974 167671 170468 173073 175148 176449 177324 178671
64815 178671 181211 184919 189220 193550 197743 202064 206994 212892 219829 227673 236144 244726 252772 259968
64801 259968 266503 272528 277552 280683 281414 279900 276546 271713 265856 259598 253429 247479 241674 236024
64787 236024 230663 225762 221427 217668 214459 211899 210221 209481 209363 209437 209576 209910 210482 211217 212192 213633
64771 213633 215543 217607 219613 221856 225040 229806 236285 243914 251729 259041 265858 272568 279330 285970
64757 285970 292347 298473 304275 309582 314433 319115 323774 328196 332075 335313 338023 340429 342749 344887
64743 344887 346193 345866 343674 340000 335068 328564 320208 310393 299981 289708 280071 271495 264220 258131
64729 258131 253032 248988 246065 243801 241345 238313 235295 233301 232717 232916 232960 232644 232715 234017 236620 239992
64713 239992 243814 248153 252854 257321 261121 264400 267393 269891 271557 272411 272486 271222 267880 262656 256872
64698 256872 251774 247382 242733 237176 231262 226290 223015 220902 218789 216177 213501 211160 208940 206766
64684 206766 205407 205615 206852 207792 208168 209272 212235 216529 220705 224201 227777 232365 238060 244322 250715
64669 250715 257227 264002 270929 277631 283851 289649 294943 298997 300835 300301 298194 295162 290923 285043
64655 285043 278012 270889 264078 257240 250450 244711 240947 238938 237666 236404 235162 234288 234099 234822 236553
64640 236553 239153 242395 246273 251066 257092 264458 273049 282684 293314 305078 318017 331677 345119
64627 345119 357455 368201 376978 383148 386133 386001 383335 378525 371618 362970 353587 344429 335603 326560
64613 326560 316946 306989 297172 287902 279511 272276 266328 261703 258505 256797 256335 256670 257568 259072 261048
64598 261048 262961 264304 265101 265779 266662 267790 269064 270233 270788 270266 268860 267559 267391 268461 269837 270468
64582 270468 270163 269643 269744 270757 272586 275248 278885 283361 288199 292998 297658 302066 305903 308978 311460
64567 311460 313369 314081 312792 309446 304748 299220 292758 285279 277284 269391 261655 253837 246133 239126
64553 239126 233071 227727 222975 219118 216366 214339 212438 210494 208795 207630 207044 206962 207326 208131 209547
64538 209547 211889 215220 218982 222248 224445 225620 225997 225529 223993 221350 217864 213955 210080 206649 203951
64523 203951 202177 201497 201973 203289 204771 205809 206229 206240 206193 206474 207392 208951 210846 212858 215113 217720
64507 217720 220430 222919 225307 227965 230911 233842 236828 240504 245347 251141 257407 264070 271371 279255
64493 279255 287215 294647 301095 306197 309675 311542 312178 312064 311348 309717 306820 302980 299296 296728 295062
64478 295062 293193 290577 287925 286086 284636 282213 278147 273146 268297 263986 260108 256773 254279 252528
64464 252528 251085 249929 249732 251109 253756 256629 258989 260992 263131 265313 266872 267477 267689 268320 269498
64449 269498 270686 271535 272277 273239 274391 275653 277308 279745 282941 286568 290615 295468 301313 307817 314655
64434 314655 322056 330491 340053 350624 362652 377245 395242 416544 440703 467913 498966 534416
64422 534416 574379 619341 670677 730042 798543 876703 964712 1061806 1165330 1271055 1374999
64411 1374999 1474849 1569498 1657546 1736756 1804889 1860473 1902483 1929614 1940442 1934457 1912766
64400 1912766 1877602 1831147 1774605 1708054 1630995 1543380 1446659 1344069 1239714 1137118 1038531
64389 1038531 945412 859187 781197 712042 651330 598281 552410 513460 480816 453348 430029
64378 430029 410485 394653 381916 370946 360558 350528 341409 333749 327676 322995 319253 315721 311680
64365 311680 306854 301333 295111 288010 280254 272715 266300 261182 256841 252712 248636 244827 241696 239701
64351 239701 239167 240174 242637 246389 251165 256622 262517 268742 275059 280929 285754 289163 290986 291143 289749
64336 289749 287168 283694 279326 274134 268732 264054 260662 258557 257583 257638 258430 259493 260657 262171 264095
64321 264095 265828 266611 266392 265833 265548 265617 265819 265949 265754 264972 263752 262781 262599 262846 262574 261275 259149 256311
64303 256311 252394 247349 242119 237783 234217 230329 225659 221045 217520 215238 213786 212904 212391 211779 210786
64288 210786 209853 209665 210332 211534 213205 215493 218167 220816 223643 227404 232342 237731 242746 247343 252094
64273 252094 257550 264004 271403 279163 286351 292389 297383 301518 304517 306021 306264 305920 305382 304591 303555
64258 303555 302690 302551 303388 304949 306538 307343 306959 305645 303890 301642 298108 292464 284748 275985 267404
64243 267404 259563 252307 245503 239577 235203 232586 231296 230684 230180 229288 227778 226070 225038 225117 225768 226108
64227 226108 225959 225948 226605 227595 227974 227177 225665 224571 224616 225383 225720 224845 222941 220788 219090 218153 217843 217607
64209 217607 216816 215316 213585 212201 211293 210636 210118 209903 210247 211232 212585 213732 214281 214574 215489 217484 220143
64192 220143 222902 225955 230060 235685 242739 250963 260108 269815 279853 290506 302202 314572 326309
64179 326309 336241 344198 350483 354705 355619 352190 344606 334217 322630 310937 299641 289029 279399
64166 279399 270894 263321 256364 249979 244431 239933 236340 233248 230307 227477 225039 223336 222380 221769 221082
64151 221082 220335 219933 220215 221193 222664 224389 226181 228121 230730 234632 239837 245540 250784 255143 258577
64136 258577 260896 261790 261340 260064 258321 256065 253385 250921 249251 248051 246374 243875 241366 239998 240240
64121 240240 241873 244600 248240 252574 257486 263194 269844 276915 283525 289489 295682 303152 312219 322486
64107 322486 333274 343728 352993 360769 367476 373511 378569 382139 384470 386552 389232 392825 397511 403499
64093 403499 410679 418593 426917 435553 443973 450964 455403 457094 456477 453685 448280 439952 429183 417106
64079 417106 404837 392973 381568 370495 359827 349938 341238 333851 327573 322096 317219 312803 308670
64066 308670 304689 301009 298065 296185 295236 294816 294792 295385 296683 298346 299998 301712 303824 306396 309169
64051 309169 311978 314948 318328 322320 327076 332618 338782 345398 352555 360557 369724 380318 392430 405608
64037 405608 418833 431258 442842 453821 463711 471541 477061 480961 483604 484265 482175 477776 472257
64024 472257 466198 459414 452043 444999 439222 434976 432059 430203 428915 427245 424168 419254 412895 405841
64010 405841 398581 391138 383406 375632 368410 362154 356785 352021 347753 343917 340304 336929 334414 333475
63996 333475 333989 335029 335878 336564 337356 338399 340121 343307 348059 353078 356791 359187 361904 366450 372859
63981 372859 380169 387597 394947 402386 410315 419239 429355 440283 451367 462123 472333 482072 491907
63968 491907 502740 515053 528485 542568 557656 574671 593997 615153 637592 661359 686872
63957 686872 714603 745178 779444 818175 862013 911939 969516 1036455 1114154 1203823 1306767
63946 1306767 1424297 1557559 1707513 1874693 2058656 2257925 2470708 2695374 2930003
63937 2930003 3171870 3417660 3663713 3905495 4137167 4352313 4545101 4710549 4844341
63928 4844341 4943354 5006237 5032602 5021567 4971927 4883846 4759628 4602738 4417172 4208284
63918 4208284 3983141 3748788 3510190 3270402 3032420 2800114 2577437 2367385 2171868
63909 2171868 1992065 1828708 1682198 1552518 1438894 1339733 1253210 1177908 1112722 1056365
63899 1056365 1007428 964881 928128 896513 869083 844916 823346 803746 785345 767414 749535
63888 749535 731615 713792 696346 679547 663501 648269 634138 621585 610939 602241 595465 590674
63876 590674 587917 587263 589135 594390 603617 616301 630918 646056 661369 677410 694721 713281 732702
63863 732702 752587 772589 792366 811698 830489 848430 864838 879083 891056 900843 908073 912098
63851 912098 912922 911449 908436 903532 895729 884567 870482 854059 835409 814406 791279 766731 741528
63838 741528 716018 690070 663509 636598 609979 584110 558880 533949 509382 485826 464053
63827 464053 444396 426568 409983 394280 379611 366403 354895 345012 336553 329255 322649 316234
63815 316234 309932 304182 299364 295351 291759 288461 285555 282988 280453 277731 274990 272705 271203 270220
63801 270220 269045 267281 265287 263535 261774 259411 256589 254028 251662 248448 244078 240014 237952 237738
63787 237738 237650 236366 233861 230749 227772 225795 225284 225629 225732 225266 224678 224035 222869 221304 220307 220392 220886
63770 220886 220949 220692 220790 221531 222710 224008 225064 225573 225578 225322 224677 223345 221758 220965 221232 221550 221091 220391
63752 220391 220445 221327 222457 223595 224674 225190 224851 224529 225499 227826 230404 232523 234463 236491 238270 239516
63736 239516 240511 241661 243073 244739 246611 248428 249961 251535 253718 256500 259383 262290 265642 269444
63722 269444 273090 276348 279790 283873 288280 292534 296541 300130 302780 304402 305698 307087 307762 306580
63708 306580 303545 299715 295965 292523 289466 286913 284764 282869 281387 280513 280055 279797 280083 281358 283317
63693 283317 285252 287180 289802 293295 296928 300120 303099 306149 308952 311160 313031 314926 316598 317627
63679 317627 318215 318932 319755 320002 319252 317946 316980 316976 317926 319290 320438 321222 322112 323569 325436 327165 328500
63662 328500 329534 330136 329821 328350 326095 323574 320819 317419 313096 308087 303054 298695 295295 292512 289687
63647 289687 286507 283303 280696 279034 278279 278201 278538 279096 279946 281481 284051 287485 291152 294561 297776 301205
63631 301205 305140 309648 314830 320977 328337 336724 345445 353734 361318 368544 375993 384129 393368 404194
63617 404194 416835 430870 445616 461113 478439 498731 522102 547836 575538 605641 638682
63606 638682 674418 711813 749598 786564 821498 853117 880115 901191 915263 921944 921911 916630
63594 916630 907776 896914 885414 874102 862850 850880 837649 823184 807363 789287 767893 743124
63582 743124 716090 688099 660005 632609 607072 584329 564211 545700 528240 512532 499920
63571 499920 491181 486006 483412 482386 482226 482627 483655 485669 489133 494357 501261 509327 517889 526620 535726
63556 535726 545703 556945 569609 583735 599449 617121 637380 660814 687599 717584 750915 788316
63544 788316 830373 876486 924553 971398 1013175 1045885 1066710 1075477 1074497 1066611 1053688 1037121
63532 1037121 1018937 1001455 985942 972270 959762 947683 934850 919561 900399 876873 849197
63521 849197 817863 783647 747527 710364 672997 636763 603275 573257 546038 520697 497328
63510 497328 476697 459085 444142 431559 421050 411783 402730 393733 385502 378344 371653 364986 358921
63497 358921 354257 350916 348250 346014 344350 343050 341614 339982 338566 337481 336413 335443 335370 336774 339176
63482 339176 341600 343774 346260 349516 353350 357429 361877 366950 372269 376780 379631 380938 381522 381950 381963
63467 381963 380840 378228 374560 370716 367249 363942 360158 355698 351234 347745 345584 344284 343261 342456
63453 342456 342233 342999 345090 348691 353451 358385 362622 366327 370522 375927 382347 389331 397074 406336 417643
63438 417643 430895 445715 461933 479728 499568 522083 547720 576206 606260 635896 663173
63427 663173 686809 706272 721569 733162 742113 750096 758992 770414 785616 805652 831258 862450
63415 862450 898454 938150 980394 1023811 1066477 1106123 1140627 1168147 1187028 1196169 1195798 1187726
63403 1187726 1174579 1158695 1141620 1124268 1107103 1090063 1072493 1053316 1031339 1005592 975619
63392 975619 941647 904508 865384 825602 786513 749327 714831 683193 654130 627347 602940
63381 602940 581369 562985 547588 534595 523682 515110 509224 505823 504412 505040 508415 514825 523275
63368 523275 532209 541119 551044 563418 578826 597028 617742 640917 666386 693788 723069 754820
63356 754820 789908 828769 871059 915774 961543 1006809 1049851 1088742 1121453 1146266 1162250
63345 1162250 1169367 1168180 1159677 1145455 1127840 1109307 1091470 1074582 1057939 1040551 1021410 999486
63333 999486 974010 944904 912743 878242 842023 805043 768876 735101 704380 676480 651224
63322 651224 629117 610874 596745 586581 580215 577111 575571 572833 566425 555512 540918 524136
63310 524136 506449 488717 471444 454810 438823 423633 409770 397988 388805 382115 377142 372829
63298 372829 368427 363882 359699 356406 354052 352171 350176 347826 345343 343085 341117 339154 336941 334554
63284 334554 332191 329739 326822 323400 320095 317677 316287 315428 314754 314545 315193 316410 317290 317244 316657 316446
63268 316446 317074 318222 319431 320819 322904 325799 328909 331580 333829 336176 338870 341642 344252 346967
63254 346967 350342 354750 360244 366634 373501 380411 387351 394800 403092 411954 420980 430360 440671 452100
63240 452100 464442 477899 493236 510918 530539 551479 573763 597883 624032 651850 680749
63229 680749 710177 739666 768910 797737 825868 852971 879112 904845 930534 955919 980741
63218 980741 1005452 1030738 1056498 1081887 1106266 1129425 1150796 1169081 1182896 1191286 1193465 1188741
63206 1188741 1177122 1159512 1136773 1108938 1075882 1038556 999021 959311 920702 883971 849778
63195 849778 818568 790425 765340 743532 725401 711221 700904 694011 689966 688322 688836 691327 695647
63182 695647 701905 710462 721432 734257 748012 762107 776422 790830 804930 818416 831445 844419
63170 844419 857449 870118 881655 891286 898531 903294 905658 905570 902744 896848 887642 874911 858447
63157 858447 838245 814721 788665 761041 732822 704889 677949 652535 629080 607877 588928
63146 588928 571943 556655 543091 531419 521569 513147 505759 499299 493796 489082 484767 480647 477006
63133 477006 474359 472848 472039 471430 471056 471399 472740 474832 477285 480021 483202 486884 490989 495509 500457
63118 500457 505634 510751 515823 521139 526732 532145 536934 541227 545532 550082 554607 558674 562040 564712
63104 564712 566881 568844 570799 572716 574500 576207 577927 579488 580510 580844 580774 580787 581265 582363 583921 585481
63088 585481 586618 587335 587890 588283 588258 587881 587699 588148 589195 590882 593796 598556 605022 612479 620490 629133
63072 629133 638441 648060 657638 667289 677566 689041 701931 716035 731152 747647 766313 787524
63060 787524 810875 836078 863824 895200 930493 969295 1011669 1058294 1109251 1163572 1220445
63049 1220445 1280207 1343436 1409543 1476990 1544722 1612694 1681044 1749338 1816790 1882787 1947035
63038 1947035 2009491 2070410 2130314 2189739 2248968 2307928 2366157 2422710 2476055 2524062 2564239
63027 2564239 2594259 2612403 2617481 2608443 2584386 2545064 2491201 2424269 2346267 2259859 2168302 2074759
63015 2074759 1981656 1890854 1804180 1723440 1649958 1584329 1526632 1476756 1434671 1400584 1374727
63004 1374727 1356768 1345585 1339905 1339080 1342999 1351407 1363722 1379434 1398161 1419131 1441014 1462666
62992 1462666 1483926 1505364 1527291 1549200 1570258 1590100 1608887 1626591 1642458 1655297 1664090
62981 1664090 1668059 1666336 1658019 1642712 1620756 1592819 1559480 1521237 1478576 1431955 1382148 1330790
62969 1330790 1280134 1231757 1185724 1141367 1098684 1058590 1021994 989008 959032 931305 905483
62958 905483 881921 861212 843179 826570 810151 793799 778093 763045 747907 732172 716124
62947 716124 700287 684909 670174 656424 643864 632299 621270 610270 598896 587224 576087
62936 576087 566524 558759 552074 545840 540223 535697 532284 529585 527304 525437 524053 523089 522287 521352 520336
62921 520336 519707 519728 519825 519090 517473 515923 515184 514931 514298 512734 510109 506606 502959 500281 498991 498123 496237
62904 496237 492898 488903 485246 482284 479764 477283 474778 472796 472034 472375 472657 471835 470123 468590 467927
62889 467927 468071 468709 469492 469913 469725 469486 470004 471154 471938 471909 471845 472693 474429 476304 477666 478072 477142 475051
62871 475051 472918 471921 471964 471796 470598 468919 467771 467282 466720 465629 464336 463258 462222 460894 459610 459300
62855 459300 460507 462766 465100 466860 467998 468817 469734 471044 472587 473703 473753 472659 470806 468614 466515
62840 466515 465065 464584 464658 464514 463976 463601 463724 463854 463362 462421 461844 462210 463493 465344 467303 468794 469421
62823 469421 469454 469816 471424 474581 478865 483403 487339 490459 493424 497151 501839 506878 511735 516570 521758
62808 521758 527229 532720 538503 545360 553737 563287 573319 583419 593555 603947 615050 627415 641287
62795 641287 656412 672454 689468 707782 727568 748888 772157 798252 828071 862179 900952
62784 900952 944848 994325 1049626 1110896 1178564 1253484 1336518 1427842 1526601 1631254 1740241
62773 1740241 1852168 1965325 2077269 2185137 2286337 2378714 2460039 2527539 2578098 2609052
62763 2609052 2619071 2608529 2578960 2531982 2468882 2391359 2302292 2205119 2102466 1995909 1887209
62752 1887209 1779026 1673912 1573055 1476597 1384956 1299149 1219810 1146609 1078937 1016819 960742
62741 960742 910792 866263 826169 789874 757143 727765 701330 677448 656033 637240 621132
62730 621132 607489 595897 585922 577226 569705 563451 558437 554256 550444 547078 544698 543513 543031 542740
62716 542740 542899 544350 547715 553045 560055 568403 577839 588502 601082 616378 634632 655509 678707
62703 678707 704339 732752 764319 799489 838685 881919 928676 978297 1030334 1084469 1140333
62692 1140333 1197582 1255926 1314743 1372615 1427468 1477151 1519827 1553900 1577942 1590988 1592845
62681 1592845 1583900 1564552 1534969 1495514 1447319 1392328 1332875 1271271 1209565 1149217 1090804
62670 1090804 1034277 979673 927492 878340 832505 790102 751407 716708 685852 658166 632879
62659 632879 609570 588341 569651 553809 540400 528394 517040 506558 497623 490251 483522 476413
62647 476413 468610 460514 452824 446244 441178 437418 434236 431053 427996 425667 424428 424021 423919 423950 424472
62632 424472 425839 427695 429035 429133 428273 427299 426614 425995 425282 424694 424323 423855 423201 422992 423906 425785 428024
62615 428024 430772 434988 441071 448089 454840 461317 468574 477391 487690 499109 511441 524350 537423
62602 537423 550941 566116 584030 604721 627836 653843 683822 718219 756589 798646 844705
62591 844705 894725 947535 1001543 1055745 1109507 1161630 1210204 1253293 1289443 1317572 1336747
62580 1336747 1346094 1344890 1332969 1311202 1281332 1245048 1203406 1157267 1107951 1057114 1006266 956648
62568 956648 909177 864032 820646 778723 739099 703068 671052 642500 616939 594390 574687
62557 574687 557073 540810 525784 512348 500894 491683 484679 479352 474827 470347 465533 460409 455529
62544 455529 451876 450109 449892 450315 450843 451397 451735 451544 451089 450953 450955 450135 448191 446209 445469 446139 447645 449779
62526 449779 452789 456729 461406 466839 473346 481350 491423 504196 519716 537144 555625 575382 597520
62513 597520 622808 651125 682049 715399 750970 788002 825241 861484 895980 928308 957943
62502 957943 984067 1005865 1022841 1034632 1040707 1040680 1035004 1024951 1011825 996527 979993 963588
62490 963588 948853 937150 929652 927152 929640 936491 947423 962897 983355 1008581 1038204 1072268
62478 1072268 1110693 1152479 1196034 1239934 1282715 1322164 1355682 1381530 1399335 1409338 1411602
62467 1411602 1405874 1391695 1368525 1336158 1295244 1247280 1194137 1137725 1079862 1022034 965211
62456 965211 910094 857483 808289 763393 723685 689885 661899 638609 618796 602089 588611
62445 588611 578049 569687 563221 558870 556670 556203 557086 559251 562730 567544 573674 580626 587183 592250
62431 592250 595907 598931 601257 601672 599182 593884 586254 576431 564761 552334 540282 528829 517565
62418 517565 506403 495775 486112 477543 469971 463079 456468 450138 444660 440523 437399 434352 430703 426489
62404 426489 422196 418315 415115 412666 411049 410434 410697 411018 410438 409099 408455 409766 412652 415606 417720
62389 417720 419351 421168 423254 425356 427537 430115 433215 436783 441019 446369 452867 459757 466168 472174
62375 472174 478838 487038 496567 506598 516748 527277 538490 550484 563455 577741 593468 610635
62363 610635 629605 651092 675581 703323 735012 771766 814055 861232 912594 968315 1028647
62352 1028647 1092498 1157538 1221522 1282859 1339906 1390426 1432081 1463247 1483373 1492901 1492868 1484275
62340 1484275 1467720 1443785 1413519 1378169 1338471 1294712 1247571 1198551 1149497 1102021 1057450
62329 1057450 1016884 980942 949587 922382 898857 878591 861092 845713 831658 818083 804273
62318 804273 789708 773854 756142 736397 715163 693297 671315 649466 628304 608605 590595
62307 590595 573753 557752 543228 531287 522400 516048 511233 507055 502973 498914 495176 491997 489257
62294 489257 486753 484692 483618 483826 484982 486397 487531 488319 489202 490865 493738 497606 501819 505980 510312
62279 510312 515226 520617 525808 530272 534283 538704 544202 550783 558082 565908 574348 583516 593493 604518
62265 604518 617016 631296 647436 665705 687023 712769 744012 781018 823505 871215 924132
62254 924132 982274 1045459 1113249 1184903 1259089 1333561 1405245 1470932 1528160 1575626 1612860
62243 1612860 1639666 1655897 1661567 1656826 1641777 1616589 1582007 1539474 1490396 1435385 1374667 1309339
62231 1309339 1241781 1174594 1109450 1047223 988811 935179 886698 843048 803971 769613 739864
62220 739864 713827 690405 669211 650474 634185 619798 606780 595050 584701 575572 567293 559539
62208 559539 552086 544841 538037 532256 527993 525219 523517 522575 522345 522851 524132 526349 529540 533219 536724
62193 536724 540242 544984 551861 560241 568753 577174 586702 598175 610757 622972 634473 646124 658593
62180 658593 671536 684141 695853 706481 716014 724568 732285 739283 745915 752987 761429 771915 785178
62167 785178 802500 825196 853513 886614 923797 965078 1010265 1058084 1106611 1154089 1198827
62156 1198827 1238772 1271935 1297140 1313980 1322295 1322322 1315162 1302369 1284906 1262892 1236306 1205453
62144 1205453 1170722 1132608 1092337 1052017 1013704 978446 946436 917865 893225 872814 856315
62133 856315 843033 832492 824663 819600 816920 815794 815499 815806 816757 818263 820239 822965 826936 832296
62119 832296 838764 846205 854882 864817 875125 884296 891118 895134 896322 894750 890793 885416 879805 874513
62105 874513 869034 862357 853852 843613 832220 820482 809303 799307 790419 782174 774694 769045 766278
62092 766278 766325 768167 770879 774072 777480 780695 783505 786087 788719 791557 794781 798599 802972 807677 812839
62077 812839 819138 827260 837403 849516 863699 880000 898020 917137 937084 957968 979815 1002493
62065 1002493 1026169 1051480 1079096 1109294 1142034 1177023 1213334 1249100 1282022 1310348 1333246
62054 1333246 1350305 1361023 1364946 1362114 1353092 1338644 1319496 1296264 1269330 1238723 1204312 1166189
62042 1166189 1124841 1081092 1036105 991319 948021 906899 868226 832429 799997 770762 743833
62031 743833 718647 695709 675861 659075 644428 631054 618664 607220 596653 586882 577672 568451
62019 568451 558703 548617 538934 530076 521861 514120 507084 500923 495347 489978 484811 480002 475478 471105
62005 471105 467078 463905 462119 462138 464087 467499 471388 474982 478301 481812 485615 489227 492064 493919 495034
61990 495034 495850 496606 497014 496462 494655 491885 488533 484552 479744 474332 468822 463323 457447 451011 444508
61975 444508 438707 433876 429641 425547 421646 418451 416319 415002 413855 412402 410501 408062 404984 401464
61961 401464 398038 395105 392625 390449 388618 387121 385677 384172 383105 383139 384309 386059 387979 390075 392435
61946 392435 395181 398832 404095 411021 418753 426491 434410 443335 453727 465272 477377 489693 502222
61933 502222 515129 528508 542122 555345 567490 578298 588076 597296 606002 613575 619097 622076 622810
61920 622810 621988 619955 616485 611319 604770 597756 591370 586430 583303 581944 582151 583846 587183 592414 599712
61905 599712 609093 620298 632645 645098 656669 666780 675288 682223 687586 691311 693251 693183 690817
61892 690817 685946 678684 669636 659750 649839 640222 630831 621602 612683 604309 596600 589466 582599 575657
61878 575657 568541 561332 553774 545047 534508 522734 511392 501851 494145 487468 481350 476035 471907
61865 471907 468993 467118 466275 466708 468667 472128 476751 482155 488204 494999 502666 511394 521638 533929
61851 533929 548329 564379 581836 601133 622736 646211 670301 693822 716084 736502 754391
61840 754391 769363 781526 790996 797417 800227 799296 795067 788228 779509 769787 760089 751300 743924 738206
61826 738206 734499 733415 735538 740969 749150 759087 769709 780048 789322 796923 802231 804376 802406 795893
61812 795893 785313 771605 755481 737390 717947 697985 678077 658393 639147 620858 604009
61801 604009 588727 575067 563282 553494 545182 537371 529410 521390 513792 506966 501014 496001 492003
61788 492003 488835 485910 482623 478972 475565 472800 470304 467534 464709 462552 461116 459565 457443 455439
61774 455439 454379 453939 453138 451758 450486 449692 448889 447599 446045 444683 443614 442846 442699 443477 445022 446997
61758 446997 449384 452240 455130 457265 458248 458380 458167 457848 457509 457370 457698 458428 459009 458759 457434 455401 453200
61741 453200 451017 448761 446524 444660 443374 442523 441940 441660 441656 441642 441459 441436 442079 443466 445231 447059 449001
61724 449001 451307 454097 457110 459689 461276 462089 463066 464866 467198 469485 471802 474550 477387 479307 479933
61709 479933 480042 480428 480753 480018 477851 474886 472002 469540 467210 464472 461059 457297 453817 450857 448054
61694 448054 445094 442245 439927 437993 435886 433346 430551 427600 424377 420981 417849 415253 412962 410557
61680 410557 407737 404216 399816 395068 391361 389894 390453 391575 391933 391240 389888 388192 386185 383827 381106
61665 381106 378105 375195 373018 372026 372096 372780 373838 375337 377299 379500 381626 383472 384959 386179 387409
61650 387409 388918 390698 392499 394163 395755 397427 399316 401537 404046 406453 408272 409407 410141 410595 410579
61635 410579 410115 409670 409538 409314 408432 407003 405659 404674 403741 402562 401138 399398 397040 393962 390517 387187
61619 387187 384330 382344 381655 382130 382784 382497 380953 378665 376212 373743 371127 368262 365165 361933 358596
61604 358596 354959 350714 345885 341097 337089 334008 331408 328941 326757 325088 323675 321869 319250 316009
61590 316009 312728 309885 307612 305794 304310 303119 302123 301059 299667 298025 296645 296069 296289 296685 296635 296113
61574 296113 295523 294969 293976 292132 289815 288020 287452 287937 288720 289102 288840 288200 287843 288443 290143 292286 293836
61557 293836 294234 293880 293713 294289 295340 296345 297371 299003 301404 303857 305488 306131 306164 305831 305279 305065 305891
61540 305891 307709 309645 311008 311949 312945 314127 315385 316655 317716 318106 317687 317012 316747 317005 317564 318346
61524 318346 319133 319188 317916 315801 314041 313173 312663 311877 310811 309666 308338 306768 305411 304890 305335 306330
61508 306330 307330 307925 307917 307408 306731 306124 305590 305125 304805 304462 303632 302146 300569 299678 299612 299886 300098 300245 300380
61489 300380 300435 300535 301124 302493 304405 306364 308079 309484 310570 311464 312527 314036 315871 317832 320079
61474 320079 322762 325194 326090 325038 323271 322435 322907 323829 324525 325120 325790 326221 326110 325592 324828 323664 322101
61457 322101 320625 319615 318844 318056 317614 317972 318900 319971 321521 324186 327503 329987 330833 330806 331063 331883 333010
61440 333010 334521 336577 338752 340409 341621 343042 344919 346789 348255 349595 351473 354303 357930 361607
61426 361607 364305 365434 365390 365181 365422 365995 366622 367335 368103 368430 367748 366170 364546 363722 363913 364729 365592 366079
61408 366079 366018 365398 364218 362440 360159 357740 355617 353920 352477 351188 350205 349577 348924 347778 346228 344909
61392 344909 344269 344106 344016 343987 344258 344723 344905 344629 344390 344846 346086 347600 348908 350066 351449 353176 354934
61375 354934 356484 358195 360724 364088 367396 369790 371394 372934 374604 375890 376572 377253 378544 380158 381310
61360 381310 381811 382332 383621 385815 388549 391437 394332 397288 400390 403657 407169 411276 416407 422524 428977
61345 428977 435185 441250 447558 453897 459458 463800 467424 471257 475831 481040 486319 490847 494001 495976
61331 495976 497743 499992 502242 503333 502703 500746 498023 494703 491020 487729 485568 484370 483182 481355
61317 481355 479267 477854 477619 478312 479558 481642 485428 491399 498952 506941 514950 523684 533990 545873
61303 545873 558768 572427 586913 601845 616172 628776 638872 645870 649504 650308 649339 647054 642904
61290 642904 636429 628275 619573 610690 601254 591174 580923 570855 560934 551312 542592 535263 529203
61277 529203 523966 519339 515563 513181 512652 513803 515763 517769 519929 522703 525828 528439 530322 532298
61263 532298 535131 538704 542617 546916 551754 556832 561749 566503 571187 575590 579592 583557 587734 591630
61249 591630 594592 596681 598313 599371 599543 599343 599759 600742 600943 599325 596333 593138 590416 588320 587039
61234 587039 586685 586958 587487 588317 589601 591025 592114 592992 594347 596669 599969 604265 609738 616205 622985
61219 622985 629675 636709 644677 653296 661637 669342 676969 684897 692510 698962 704349 709444 714475 718882
61205 718882 722324 725137 727618 729618 731280 733520 737147 742009 747645 754264 762261 771160 780121 789404
61191 789404 800170 812564 824965 835634 844295 851536 857410 861482 863750 864661 864382 862792 860203 857396
61177 857396 854874 852477 849784 846425 841952 835910 828357 820048 811923 804418 797267 789755 781187 771439
61163 771439 761147 751150 741613 731895 721400 710327 699382 688837 678211 666999 655598 645286
61151 645286 637159 631196 626525 622517 619309 617214 615985 614904 613313 610766 606876 601558 595432 589571
61137 589571 584670 580601 576819 572995 569274 566179 564331 564031 565101 567282 570672 575426 581191 587448
61123 587448 594505 603493 614996 628317 642613 658224 676101 696201 717414 739122 761904 786319
61111 786319 811782 837206 862267 887289 912164 936101 958533 979691 1000052 1019520 1037340
61100 1037340 1052580 1064561 1073008 1078001 1079776 1078476 1074066 1066397 1055351 1041045 1024023 1005079
61088 1005079 984689 962805 939494 915611 892346 870111 848414 826988 806496 787761 770695
61077 770695 754516 738854 724166 711131 700004 690642 682799 676307 671160 667489 665278 664102 663317
61064 663317 662593 662185 662719 664735 668302 672868 677650 682404 687762 694621 703311 713582 725195 738034
61050 738034 751776 765969 780613 796221 813130 831114 849922 869895 891742 915937 942527
61039 942527 971328 1002035 1034289 1067867 1102753 1138954 1176508 1215814 1257641 1302468 1349941
61028 1349941 1399201 1449637 1501063 1553342 1606221 1659616 1713902 1770011 1829333 1893416 1963552
61017 1963552 2040794 2126392 2221804 2327897 2444520 2571739 2711922 2870533 3055165 3274603
61007 3274603 3539308 3862438 4260081 4750788 5355370 6096396 6996349 8075727 9354242
60998 9354242 10853138 12587151 14535338 16601173 18598291 20294811 21504910 22169496
60990 22169496 22370978 22282113 22096739 21981133 22041090 22285342 22598568 22764749 22553895 21825814
60980 21825814 20582498 18943207 17076552 15141980 13263867 11528014 9984174 8650380
60972 8650380 7521166 6577825 5796032 5149883 4614691 4169354 3797000 3483806 3217929
60963 3217929 2989462 2790549 2614955 2457774 2315555 2186190 2068311 1960981 1863813 1776727
60953 1776727 1699211 1630165 1568603 1513899 1464894 1419329 1374841 1330417 1286446 1243637 1202447
60942 1202447 1163344 1126847 1093071 1061668 1032254 1004552 978081 952169 926499 901266 876665
60931 876665 852531 828727 805557 783573 763156 744459 727454 711823 697017 682694 668994
60920 668994 656215 644466 633836 624704 617443 611856 607194 602760 598303 593898 589706 585947 582829
60907 582829 580385 578540 577418 577353 578424 580123 581723 582910 583880 584896 585994 587143 588341 589367 589745
60892 589745 589297 588547 588074 587542 585910 582810 579178 576094 573376 569839 564694 558110 550573 542429 534199
60877 534199 526649 520142 514311 508653 503098 497694 492155 486211 480113 474325 468888 463605 458824 455491
60863 455491 454204 454475 455102 455154 454601 454142 454454 455504 456572 456970 456607 455791 454779 453832 453460 454157 455814
60846 455814 457768 459477 460929 462299 463464 464009 463638 462516 461220 460168 459059 457163 454345 451448 449258
60831 449258 447467 445297 442878 441205 440674 440557 440157 439730 439811 440308 440851 441494 442450 443496 444242 444685 444911
60814 444911 444568 443285 441439 439764 438297 436390 433755 430778 427699 424232 420306 416448 412975 409334
60800 409334 404825 399715 395064 391565 389026 386898 384836 382658 380167 377268 374100 370913 367904 365254
60786 365254 363182 361800 360956 360313 359651 359041 358667 358503 358217 357452 356210 354896 353966 353587 353716 354422 355931
60769 355931 358255 360943 363469 365908 368963 373166 378167 383005 386919 389730 391627 392957 394141 395378
60755 395378 396365 396658 396380 396181 396432 396898 397346 397902 398503 398569 397772 396663 395945 395449 394540 393229 391987 390522
60737 390522 387718 383095 377550 372188 367092 361777 356403 351799 348424 345830 343214 340190 337017 334293
60723 334293 332444 331365 330577 329752 328968 328398 327958 327418 326685 325834 324990 324302 323913 323854 324054 324440 324900 325229
60705 325229 325436 326044 327609 329857 331825 333093 334339 336223 338225 339250 339204 339241 340495 343088 346479 350166
60689 350166 353817 357176 360220 363263 366614 370211 373764 377145 380429 383610 386466 388855 391061 393684
60675 393684 397032 400712 403941 406275 407837 408920 409642 410060 410213 409825 408274 405219 401134 396906 393014
60660 393014 389343 385623 381750 377791 374104 371383 370188 370331 371010 371570 371917 372188 372449 372861 373841 375810
60644 375810 378801 382319 385471 387350 387574 386499 384688 382210 378797 374695 370914 368389 367153 366524 365885
60629 365885 365058 364206 363692 363896 364819 365823 366052 365256 364091 363516 363900 364788 365460 365612 365417 365091 364711 364449
60611 364449 364616 365192 365637 365550 365365 365915 367362 369016 370189 370752 370799 370369 369784 369741 370655 372221 374018 376118
60593 376118 378650 381067 382498 382790 382626 382600 382593 382212 381434 380615 380070 379767 379299 378223 376727 375851 376652 379006
60575 379006 381625 383438 384658 386349 389324 393806 399784 407166 415670 425000 435197 446405 458173
60562 458173 469313 478668 485855 491046 494245 495124 493609 490265 485881 480744 474621 467541 460427 454751
60548 454751 451524 450724 451702 453914 457166 461387 466504 472611 480008 488894 499127 510426 522787 536460
60534 536460 551408 566856 581509 594300 604851 613121 618758 621124 620116 616710 612307 607551 602130
60521 602130 595731 588762 581894 575329 568983 563160 558480 555182 552942 551436 550607 550312 550258 550569 551938
60506 551938 554816 558848 563608 569620 578030 589431 603594 620330 639971 662874 689030 718442
60494 718442 751341 787570 826071 865385 904367 942047 976996 1007384 1031571 1048368 1056880 1056672
60482 1056672 1048091 1031954 1008801 978883 943068 903328 861954 820508 779775 740451 703445
60471 703445 669501 638873 611424 586876 564940 545410 528224 513351 500627 489731 480261 471703
60459 471703 463489 455345 447601 440958 435846 432154 429474 427359 425259 422534 418841 414483 410257 406972
60445 406972 405047 404312 404069 403562 402632 401795 401508 401520 401155 400098 398635 397239 396250 395882 396103 396418 396137 395084
60427 395084 393831 393022 392640 392130 391071 389556 388022 387014 387011 388226 390373 392745 394623 395705 396212 396634
60411 396634 397388 398633 400349 402459 404795 407036 408839 410075 410895 411590 412475 413801 415587 417541 419360
60396 419360 421139 423320 426226 429778 433596 437094 439564 440636 440882 441610 443692 446742 449639 451688 453104
60381 453104 454597 456804 459932 463594 466982 469475 471150 472619 474509 477187 480716 484752 488621 491823
60367 491823 494453 496936 499484 502045 504582 507041 509189 510904 512571 514761 517514 520359 523159 526494
60353 526494 531056 537058 544451 553322 563701 575112 586606 597164 605939 612266 615764 616462 614762
60340 614762 611276 606646 601274 595108 587874 579686 571331 563758 557332 551732 546505 541602 537341 534012
60326 534012 531570 529656 527805 525570 522534 518415 513323 507824 502619 498207 494947 493269 493534 495657
60312 495657 499169 503755 509629 517372 527551 540473 556051 573783 593002 613191 633874 654125
60300 654125 672412 687148 697387 702939 703859 699923 690644 675869 656465 634348 611664 589882
60288 589882 569658 551405 535714 523228 514241 508428 504850 502344 500180 498356 497163 496605 496362 496098
60274 496098 495437 493886 491254 488077 485101 482329 479135 475421 472011 469591 467791 465745 463178 460475
60260 460475 457996 455804 453957 452572 451604 450888 450445 450477 450972 451523 451695 451557 451735 452776 454475 456044 457107
60243 457107 458242 460150 462592 464748 466452 468263 470228 471467 471452 470926 470886 471210 471087 470431 470049 470518 471630
60226 471630 472970 474397 475844 477146 478310 479600 481214 483032 484745 486144 487426 489359 492870 498131
60212 498131 504286 510429 516553 523068 529710 535685 540831 545947 551823 558567 565983 573971 582272 590339
60198 590339 597864 605039 611975 618181 622990 626276 628510 630311 632132 634049 635534 635709 634223 631699
60184 631699 628949 625899 621726 616064 609662 603618 598241 592886 586810 579966 572974 566596 561366 557429
60170 557429 554345 551092 546820 541907 537873 535837 535216 534420 532694 530734 529486 528994 528752 528718 529429 531217
60154 531217 533710 536125 537863 538805 539231 539501 539788 540093 540476 541117 542107 543339 544723 546415 548686 551559
60138 551559 554742 558043 561833 566883 573570 581296 588954 595999 602816 609926 617166 623833 629350 633465
60124 633465 636111 637541 638465 639590 640988 642328 643604 645211 647264 649343 651050 652429 653717 654993
60110 654993 656167 657031 657322 657110 657097 657986 659428 660175 659443 657596 655199 652065 647767 642583 637289 632307
60094 632307 627611 623241 619306 615616 611952 608676 606501 605559 605174 604655 603957 603414 603271 603664 604712 606346
60078 606346 608172 609734 610856 611646 612272 612741 612811 612011 609900 606360 601571 595724 588869 581084 572680 564197
60062 564197 556219 549110 542744 536606 530378 524428 519493 515817 512806 509681 506329 503331 501276 500243
60048 500243 499979 500374 501616 503903 507135 511008 515336 520122 525290 530597 535936 541497 547320 552821 557176
60033 557176 560276 562941 565919 568914 570944 571484 570885 569632 567611 564357 559705 553939 547455 540620 533828
60018 533828 527269 520619 513343 505480 497725 490533 483477 475944 468139 460941 454912 449988 446090 443398
60004 443398 441807 440670 439410 438006 436553 434791 432550 430434 429469 430057 431629 433320 434704 435928 437478
59989 437478 439850 443105 446682 449962 453085 456806 461397 466073 469765 472217 473939 475361 476521 477435
59975 477435 478209 478547 477692 475247 471829 468464 465486 462510 459509 457306 456666 457317 458313 459215 460367 462026
59959 462026 463785 465170 466509 468731 472246 476272 479501 481401 482659 484178 485765 486204 484748 482199
59945 482199 480193 479584 479893 480163 479823 478735 476981 474884 472866 470978 468843 466232 463430 460813 458405
59930 458405 456201 454611 454138 454773 456140 458166 461180 465333 470293 475614 481096 486672 492225 497700 503182
59915 503182 508671 513814 518070 521183 523413 525344 527427 529751 532197 534778 537660 540837 543989 546834
59901 546834 549503 552358 555516 558779 561984 565135 568093 570429 571785 572319 572578 572974 573576 574448 575958
59886 575958 578529 582131 586202 590138 593718 597056 600410 604234 609083 615067 621476 627320 632237 636486
59872 636486 639999 641969 641740 639735 637128 634702 632309 629287 625149 620033 614798 610583 607942 606393
59858 606393 605072 603779 603122 603683 605387 607734 610347 613185 616440 620439 625483 631662 638835 646762 655065
59843 655065 662919 669007 672064 671717 668830 664994 661545 658938 656883 654872 652438 649061 644264 637966
59829 637966 630610 622779 614843 607049 599730 593191 587484 582495 578106 574172 570541 567259 564554 562377
59815 562377 560201 557596 554778 552207 549859 547331 544508 541596 538585 535337 532252 530177 529354 528986 528215
59800 528215 527054 526002 525213 524559 524201 524412 524944 525114 524533 523317 521638 519585 517534 516039 515067 513830
59784 513830 511782 509419 507656 506613 505565 504001 502200 500681 499582 498810 498387 498276 498142 497672 497026 496689
59768 496689 496969 497953 499837 502820 506602 510353 513439 515975 518481 521248 524270 527734 532216 538224 545582
59753 545582 553370 560654 567347 574303 582452 591897 601945 611841 621233 630017 638107 645477 652213 658431
59739 658431 664219 669578 674169 677294 678549 678473 678109 677846 677179 675727 673891 672204 670542 668423 665763
59724 665763 662877 660026 657298 654724 652182 649461 646746 644642 643257 641600 638525 634161 629824 626550
59710 626550 624194 621929 619167 615927 612716 610134 608381 607158 606191 605636 605629 605782 605667 605630 606497 608433 610599
59693 610599 612040 612625 613067 614272 616516 618969 620219 619670 618132 616631 615078 612836 610156 608047 606834
59678 606834 605887 604765 603545 601846 598790 594377 589829 585892 581725 576260 569890 563929 559032 555039
59664 555039 551849 549445 547351 545014 542700 541267 541061 541638 542469 543299 543925 544295 544865 546314 548813 551971
59648 551971 555417 558973 562317 565021 566896 567927 567936 566774 564750 562310 559344 555441 550853 546569 543234
59633 543234 540583 538155 536007 534398 533256 532345 531628 531067 530323 529022 527166 525020 522755 520462 518296
59618 518296 516285 514109 511438 508498 505960 504215 502984 501786 500616 499930 499992 500474 500849 501093 501802 503510
59602 503510 506056 508678 510610 511526 511584 511297 511297 511970 513190 514451 515214 515187 514508 513885 514315 516241 518943 521040
59584 521040 521688 521120 520002 518607 516782 514488 512127 510341 509589 509825 510485 510818 510359 509133 507504 505927
59568 505927 504805 504336 504329 504243 503591 502361 501065 500329 500410 501055 501837 502570 503314 503982 504162 503508 502246 501079
59550 501079 500564 500741 501313 501984 502603 503226 504262 506449 510464 516464 524078 532882 542852 554366 567872
59535 567872 583568 601067 618922 634384 644221 646534 642054 633455 623408 613431 604355 597027 592027
59522 592027 589138 587745 587678 589159 591867 594577 596068 596179 595732 595432 594992 593384 589891 584848 579264 573829
59506 573829 568494 562970 557245 551374 545160 538525 532000 526343 521646 517343 513180 509686 507382 505970
59492 505970 504778 503786 503697 504924 506879 508456 509012 508704 508045 507436 507198 507810 509793 513296 517909 523034
59476 523034 528404 534191 540605 547510 554462 561058 567168 572750 577537 581068 583127 584038 584406 584612 584783
59461 584783 585135 586033 587563 589314 590786 592002 593558 596132 600006 604994 610763 617215 624514 632662 641196
59446 641196 649539 657560 665369 672436 677384 678991 677210 672960 667189 660422 652943 645001 636856 628944
59432 628944 621911 616205 611623 607528 603461 599406 595606 592408 590271 589653 590879 594217 599941 608127
59418 608127 618624 631464 647103 665855 687237 710282 734565 760582 788954 819152 848591
59407 848591 872801 887171 889564 881612 867278 850370 833653 819588 810521 807696 810696 817943 826970
59394 826970 834090 835109 827587 812278 791957 769243 745946 723709 703994 687320 673281 661557
59382 661557 652388 645970 641941 639706 638894 639224 640255 641602 643210 645209 647580 650144 652763 655347 657707
59367 657707 659634 661222 662943 665276 668228 671350 674253 677015 679994 683335 686847 690346 693995 698236
59353 698236 703470 709828 717135 725049 733312 741933 751145 761258 772555 785116 798568 812207 825630
59340 825630 839058 852638 865587 876579 885055 891567 896582 899479 899195 895468 888998 880647 870978
59327 870978 860436 849396 837893 825671 812621 799057 785595 772934 761657 751919 743314 735297
59315 735297 727750 720942 714987 709621 704503 699529 694800 690527 686985 684411 682950 682826 684441 688034
59301 688034 693397 700286 708984 719832 731999 743119 750443 752148 747532 736703 720719 701708 682122
59288 682122 663629 646922 632360 620281 610713 603319 597807 594050 591727 590319 589690 590301 592523 596028
59274 596028 600269 605288 611658 619744 629490 640818 653692 667667 681860 695640 709011 722042
59262 722042 734178 744468 752310 757645 760499 760685 758084 752944 745795 737185 727627 717691 707982 698996
59248 698996 691019 684181 678573 674286 671327 669539 668665 668524 669142 670752 673595 677577 682073 686279 689976
59233 689976 693736 698103 702757 706905 710442 714124 718396 722602 725692 727322 727773 727083 724797 720519 714325
59218 714325 706642 698078 689357 681044 673310 666185 659922 654734 650248 645630 640419 634948 629861 625449
59204 625449 621576 617993 614612 611579 609096 607002 604614 601291 597236 593510 591139 590347 590607 591215 591777
59189 591777 592378 593361 594832 596495 598187 600366 603610 607737 611940 615882 620050 624858 629955 634831 639640
59174 639640 644903 650623 656234 661357 666231 671376 677082 683189 689172 694510 699240 704086 709774 716183
59160 716183 722337 727221 730405 731891 731678 729699 726086 721204 715251 707966 698986 688581 677772 667502
59146 667502 657865 648457 639338 631156 624229 617893 611088 603389 595251 587379 580138 573509 567432 562067
59132 562067 557658 554138 551011 547888 545084 543474 543703 545694 548819 552313 555643 558926 563066 569042
59118 569042 576834 585348 593554 601412 609500 618121 627058 635957 644620 653043 661361 669642 677617 684851
59104 684851 691270 697216 702812 707604 711084 713293 714638 715376 715555 715167 714038 711793 708353 704308 700499
59089 700499 697352 694859 692983 691704 690836 690130 689494 688790 687573 685378 682146 678050 673033 666933 659946
59074 659946 652550 645056 637664 630866 625164 620268 615146 609203 603014 597568 593078 589019 585114 581744
59060 581744 579273 577505 576074 575092 574832 574933 574505 573284 572101 571740 571735 571025 569555 568384 568170 568409 568497
59043 568497 568676 569326 570003 569972 569364 569032 569379 569988 570325 570223 569667 568714 567792 567639 568796 571312 574950 579429
59025 579429 584559 590508 597847 607028 617862 629809 642623 656305 670515 684488 697574 709468
59013 709468 719866 728244 734083 737077 737161 734624 730142 724390 717721 710556 703911 699025 696470 695963 696981
58998 696981 699063 701620 704213 707156 711253 716616 722189 726693 729658 731372 732354 733248 734713 736793 738559
58983 738559 738875 737577 735594 733962 732952 732221 731604 731617 733156 736756 742267 749324 757895 768072 779474
58968 779474 791315 803166 815308 828210 841929 856116 870300 883993 896738 908238 918292
58957 918292 926527 932408 935596 936091 933966 929163 921546 910945 897216 880697 862570 844278 826431
58944 826431 808758 791263 774842 760286 747246 734829 722995 712745 704916 699287 694957 691233
58932 691233 688052 685804 684801 684764 684864 684572 684401 685455 688083 691278 693645 694744 695215 695689 695952 695317
58916 695317 693579 691322 689328 687887 686746 685570 684317 683276 682881 683512 685410 688798 693990 701217 710271
58901 710271 720546 731607 743543 756605 770646 785153 799687 814007 827853 840956 853359
58890 853359 865552 878187 891800 906755 923302 941611 961737 983418 1005803 1027504 1047094
58879 1047094 1063462 1075755 1083356 1086238 1085064 1080629 1073381 1063663 1051977 1038582 1023271 1006102
58867 1006102 988056 970321 953290 937022 922362 910479 901250 893244 885549 878520 872230 865361
58855 865361 856624 846560 836834 828057 819306 809711 799604 789972 781463 774203 768053 762661 757461 751909
58841 751909 745759 739094 732133 724967 717392 709119 700188 691104 682467 674603 667562 661240 655424 649969
58827 649969 645074 641165 638371 636351 634822 634020 634438 636296 639425 643476 648077 652967 658137 663644 669204
58812 669204 674279 678719 682976 687412 691689 695114 697314 698267 697964 696452 694091 691345 688342 684848 680589
58797 680589 675363 668992 661534 653546 645830 638832 632404 626150 619924 614019 608900 604810 601644 599276
58783 599276 597814 597346 597630 598446 600105 603114 607268 611631 615541 619050 622159 624254 624742 623743 621660
58768 621660 618490 614083 608738 602962 596881 590398 583775 577540 571962 567054 562984 560023 558185 557382
58754 557382 557860 560057 563962 568880 573799 577921 581120 584140 587981 592657 596899 599564 601047 602761
58740 602761 605480 608909 612651 616809 621515 626638 632111 638039 644209 650048 655258 660105 664877 669436
58726 669436 673581 677492 681550 685893 690288 694277 697415 699631 701402 703349 705677 708291 711368 715367
58712 715367 720416 726176 732397 739056 745721 751289 754848 756493 756878 756163 753795 749195 742204 732823 720949
58697 720949 706663 690633 673974 657600 641796 626456 611643 597763 585247 574286 565021 557674
58685 557674 552186 547859 543687 539172 534648 530798 527912 525516 522605 518389 513098 507997 504382 502568
58671 502568 502053 502459 503892 506408 509677 513496 518330 524973 533676 543844 554589 565374 575952 585681
58657 585681 593198 597135 597256 594687 590839 586304 580937 574752 568300 562217 556735 551783 547349 543596
58643 543596 540634 538228 535797 532881 529688 527021 525556 525329 526019 527415 529405 531796 534472 537597 541298
58628 541298 545266 548905 551745 553496 553873 552830 550880 548904 547567 547135 547684 549208 551570 554598 558156
58613 558156 562038 566006 570207 575208 581200 587363 592434 595787 597625 598386 598461 598295 598138 597780 597033 596327
58597 596327 596130 595943 594705 592280 589685 587614 585669 583531 582044 582386 584680 588242 592860 598977 606697
58582 606697 615381 624418 633780 643605 653643 663465 672903 681996 690629 698535 705659 712275 718750 725336
58568 725336 732316 740180 749474 760586 773795 789438 807692 828194 850217 873344 897596 922653
58556 922653 947253 969795 989371 1005874 1019235 1028978 1034571 1035859 1033186 1027444 1020098 1012724 1006220
58543 1006220 1000524 995172 989863 984301 977714 968930 957076 942078 924442 904703 883351 861231
58531 861231 839614 819558 801378 784982 770547 758490 748912 741577 736336 733011 730897 729028 727114
58518 727114 725577 724536 723439 721905 720121 717998 714836 710499 706192 703216 701506 700190 698991 698155
58504 698155 697440 696289 694838 693742 693066 692262 691217 690433 690125 689974 689881 690176 690904 691613 692058 692593 693780
58487 693780 696055 699726 704692 710283 715960 722090 729418 737977 747281 757407 768981 782148 796479
58474 796479 811859 828380 845191 860439 872673 881486 886601 887376 883697 876563 867330 856991 846435
58461 846435 836611 828057 820948 815907 814006 815603 819920 826168 834369 844668 856567 869283 882181
58448 882181 894436 904927 912935 918353 920913 919972 915527 908641 900340 890786 880116 869335 859684
58435 859684 851652 845245 840706 838292 837763 838699 840930 844199 847919 851828 856529 862839 870950 880549 891233
58420 891233 902308 912656 921356 928069 932531 934197 932860 929056 923455 916385 908407 900592 893583 886872
58406 886872 879644 871846 863916 856129 848969 843566 840827 840356 840947 841952 843473 845473 847487 849332 851541
58391 851541 854865 859418 864323 868341 871120 873697 877247 881519 885218 887777 889736 891378 892324 892877 894451
58376 894451 897841 902209 906567 911226 916858 923188 929814 937424 946895 957725 968563 978887 989098
58363 989098 999444 1009984 1021260 1033842 1047384 1061104 1074995 1089626 1104967 1120283 1134953
58352 1134953 1148541 1160284 1169453 1176140 1180976 1184324 1186495 1188444 1191392 1195879 1201777 1208906 1216989
58339 1216989 1225467 1234317 1244648 1257576 1272711 1288623 1304581 1320975 1338301 1356626 1375908 1395951
58327 1395951 1416067 1435475 1453950 1471515 1487767 1502150 1514617 1525380 1534374 1541619 1547815 1553877
58315 1553877 1560220 1566999 1574559 1582971 1591686 1600387 1609652 1620097 1631552 1643876 1657869 1674304 1692664
58302 1692664 1711793 1731256 1751195 1771547 1792445 1814695 1838678 1863373 1887552 1911341 1935572
58291 1935572 1960363 1985550 2011691 2039282 2067684 2096225 2125609 2156754 2189080 2221591 2254879
58280 2254879 2290140 2326796 2363118 2398889 2435562 2474067 2514435 2557306 2603651 2652873 2703131
58269 2703131 2753827 2806114 2860878 2917893 2977069 3038815 3103012 3169231 3238083 3310787 3387380
58258 3387380 3466914 3549260 3634901 3722970 3811439 3899523 3988214 4078364 4169987 4263637 4360644
58247 4360644 4461778 4567272 4678221 4796165 4921202 5052272 5189335 5333489 5485097
58238 5485097 5643772 5810248 5986287 6172736 6369697 6578474 6801124 7038122 7288804
58229 7288804 7554209 7837134 8139354 8461244 8804263 9171287 9564409 9985144 10437098
58220 10437098 10925735 11455172 12027801 12647280 13319247 14049224 14843062 15709794 16661082
58211 16661082 17707860 18861066 20135949 21552271 23130756 24894210 26873271 29107443
58203 29107443 31641234 34526424 37832426 41653694 46111407 51360905 57608202 65122276
58195 65122276 74235010 85334978 98852761 115220801 134812788 157908075 184708328
58188 184708328 215332657 249632372 286742064 324549814 359534276 387364323 404171584
58181 404171584 407830582 398487047 378129119 349676997 316217630 280605477 245256690
58174 245256690 211976837 181873241 155434979 132717177 113504281 97418433 84011242
58167 84011242 72843993 63526948 55722261 49145131 43570201 38823982 34765173 31275154
58159 31275154 28260391 25648492 23376340 21386464 19632837 18081010 16700521 15462624
58151 15462624 14345342 13334208 12416811 11581328 10820180 10129283 9502575 8931525 8410136
58142 8410136 7935661 7503875 7108119 6743546 6407973 6097722 5806751 5530975 5269861
58133 5269861 5022960 4788404 4565784 4356932 4162486 3980432 3809086 3648792 3499708
58124 3499708 3360488 3230149 3108925 2996363 2890728 2791070 2697810 2610575 2527440 2447049
58114 2447049 2369703 2295839 2225150 2157564 2093323 2031865 1972379 1915622 1863175 1814709 1767966
58103 1767966 1721748 1676934 1634246 1593094 1553108 1514834 1478262 1442430 1406997 1372574 1339162
58092 1339162 1306013 1273414 1242816 1214763 1188438 1163613 1141104 1120729 1100702 1079878 1058955
58081 1058955 1038764 1018976 999229 979967 961356 942804 924231 906473 889792 873407 857047
58070 857047 841493 826984 812621 798040 784123 771242 758376 744964 732203 721370 712027 702961
58058 702961 693862 685031 676392 667792 659467 651282 642259 631722 620358 609533 600111 592268 585643
58045 585643 579317 572540 565834 560387 556172 551916 547238 543262 540392 537119 532142 526341 521326 517079
58031 517079 512395 506833 500829 494386 487002 478743 470415 462671 455565 448761 441762 434285 426772 420042
58017 420042 414178 408503 402936 398389 395267 392585 389320 385685 382232 378647 374578 370870 368682 367747
58003 367747 366717 365023 363340 362280 361651 361128 360865 361178 362101 363437 364955 366472 367827 368740 368692 367288
57987 367288 364752 361641 358056 353734 349018 344961 342114 339870 337411 334703 332165 329993 328298 327302
57973 327302 326960 326841 326710 326669 326511 325718 324445 323599 323488 323305 322596 322308 323492 325724 327741 329072 330129
57956 330129 331167 332050 332605 332428 330773 327490 323742 320989 319545 318754 318085 317272 315913 313975 312418 312373
57940 312373 313836 315987 318498 321645 325421 329546 334316 340400 347731 355409 362766 369692 375858 380516
57926 380516 383373 384824 385011 383324 379341 373701 367524 361299 354839 348167 341866 336431 331647 326974
57912 326974 322438 318730 316283 314721 313594 313186 313927 315328 316477 317469 319259 321881 323989 324662 324609 324941
57896 324941 325787 326902 328659 331329 334126 336130 337580 339158 340478 340552 339424 338108 336979 335423 333081
57881 333081 330457 328154 326398 325289 324660 323684 321533 318484 315562 313126 310689 308141 306048 304564 302986
57866 302986 300751 298057 295244 292374 289763 288165 287984 288912 290599 293132 296615 300904 305986 311941 318292
57851 318292 324154 329374 334791 340906 346942 351733 354966 356976 357760 356920 354373 350673 346700 343194 340320
57836 340320 337489 333883 329402 324741 320478 316573 313020 310342 308908 308148 307075 305419 303764 302726
57822 302726 302404 302583 303063 303695 304357 305058 305986 307338 308949 310062 309674 307405 303939 300275 296651 292538
57806 292538 287622 282290 277097 272224 267614 263239 259090 255243 252035 249780 248251 246870 245555 244826
57792 244826 244952 245482 245964 246563 247633 249087 250663 252452 254707 257425 260524 264156 268427 273043 277733
57777 277733 282848 288991 296141 303638 311035 318432 325763 332231 336900 339716 341544 343107 344178 344041
57763 344041 342541 340278 337750 334796 331156 327113 323037 318642 313435 307878 303354 300702 299349 298222
57749 298222 297025 296189 295980 296215 296701 297516 298799 300520 302505 304548 306526 308437 310308 312057 313582
57734 313582 314910 316104 317152 318203 319785 322297 325325 327965 329917 331724 333787 335765 337286 338681
57720 338681 340567 342982 345378 347142 347785 346987 344964 342576 340598 339008 337309 335320 333179 330836 328075
57705 328075 324966 321788 318500 314791 310766 307135 304548 303001 301970 300909 299549 297961 296446 295232
57691 295232 294246 293285 292312 291388 290396 289137 287751 286770 286664 287506 289161 291576 294802 298970 304450 311969
57675 311969 322369 336229 353830 375539 402084 434308 472697 517312 568139 624934 685970
57664 685970 746675 799844 837801 855047 849779 823992 782573 731732 677239 623319 572662 527000
57652 527000 487428 454372 427597 406373 389708 376656 366541 358831 352832 347758 343230 339427
57640 339427 336569 334439 332569 330696 328858 327243 326143 325805 326052 326279 326153 326107 326832 328385 330199 331807
57624 331807 333099 333839 333550 332186 330550 329624 329541 329555 329011 328030 327106 326355 325513 324635 324323 325015 326325 327466
57606 327466 328195 329009 330437 332493 334832 337045 338739 339727 340330 341175 342484 343811 344607 344777 344473 343684
57590 343684 342250 340124 337458 334638 332314 331023 330611 330400 330140 330409 331802 334091 336530 338651 340400
57575 340400 341829 343056 344251 345297 345751 345483 345004 344763 344559 344111 343775 344050 344754 345441 346300 347826 349784
57558 349784 351434 352726 354416 356985 360286 364326 369379 375131 380680 385764 391086 396871 401981 405135
57544 405135 406410 406826 407021 407107 407385 408308 409905 411984 414791 418769 423638 428316 431817 433887 434826 435220
57528 435220 435829 437148 438921 440441 441490 442671 444753 447920 451734 455547 458919 461872 464795 467981
57514 467981 471340 474745 478450 482707 487119 491004 494394 498071 502423 506854 510721 514286 518148 522099
57500 522099 525271 527398 529319 532032 535605 539180 541788 543053 543403 543759 544868 546736 548763 550450 551823
57485 551823 553213 554960 557462 561162 566133 571855 577701 583486 589279 594830 599728 604063 608383 612749
57471 612749 616390 618728 620411 622822 626636 631290 635847 639952 643860 647903 652144 656352 660224 663769
57457 663769 667553 672289 678047 684069 689539 694359 699069 704252 710161 716678 723272 729223 734273 739032
57443 739032 744365 750393 756442 761979 767154 772357 777790 783762 790847 799188 807924 815939 823079 830081
57429 830081 837344 844465 851106 857655 864616 871896 879197 886739 895033 904132 913592 923036 932276 940986
57415 940986 948818 955923 962911 970194 977686 985198 992751 1000464 1008506 1017215 1026831 1036982 1046804 1055729
57401 1055729 1063828 1071370 1078543 1085728 1093542 1102240 1111494 1121012 1131015 1141828 1153417 1165615 1178341
57388 1178341 1191224 1203523 1214978 1226394 1238822 1252418 1266605 1281015 1295614 1310106 1323953
57377 1323953 1337003 1349521 1361611 1373182 1384477 1396001 1407809 1419367 1430297 1440850 1451487
57366 1451487 1462398 1473587 1485100 1497039 1509529 1522627 1535982 1548825 1560812 1572775 1586023
57355 1586023 1600879 1616421 1631658 1646338 1660628 1674798 1689475 1705376 1722336 1739218 1755260
57344 1755260 1770971 1787211 1803926 1820382 1836211 1851630 1866917 1882368 1898526 1915740 1933533
57333 1933533 1950984 1967846 1984809 2002536 2020884 2039238 2057372 2075680 2094552 2113660 2132036
57322 2132036 2149055 2165261 2181905 2199616 2217939 2236295 2254890 2274255 2294321 2314520 2334644
57311 2334644 2355056 2376016 2397236 2418154 2438479 2458456 2478729 2499847 2521696 2543518 2564664
57300 2564664 2585218 2605754 2626728 2648320 2670558 2693261 2716015 2738544 2760907 2783129 2804946
57289 2804946 2826303 2847749 2869834 2892324 2914563 2936394 2958099 2979577 3000382 3020628 3041073
57278 3041073 3062052 3082930 3102984 3122318 3141534 3160935 3180412 3199842 3219223 3238708 3258827
57267 3258827 3280395 3303843 3328792 3354622 3381261 3409075 3438135 3467991 3498113 3528183 3557943
57256 3557943 3587190 3616007 3644745 3673637 3702673 3731987 3762111 3793523 3826010 3858736 3890908
57245 3890908 3922169 3952367 3981377 4009464 4037569 4066732 4097118 4127911 4158268 4188167 4218255
57234 4218255 4249180 4281275 4314574 4348793 4383476 4418491 4454224 4490909 4527870 4563853 4598168
57223 4598168 4631036 4662765 4693025 4721316 4747804 4773206 4797876 4821460 4843643 4864850 4885810
57212 4885810 4906452 4925670 4942453 4957059 4970811 4984855 4999409 5014128 5028714 5043025 5056968
57201 5056968 5070629 5084336 5098420 5113013 5128092 5143433 5158480 5172754 5186652 5201361 5217578
57190 5217578 5234668 5251518 5267888 5284293 5300797 5316639 5331119 5344280 5356625 5368574 5380278
57179 5380278 5391567 5401902 5410696 5417789 5423455 5428048 5431871 5435174 5437848 5439222 5438648 5436230 5432542 5427743
57165 5427743 5421563 5414160 5406389 5399096 5392587 5386839 5381762 5377219 5373352 5370929 5370735 5372544 5375299 5378403
57151 5378403 5382060 5386175 5389784 5392017 5392836 5392214 5389268 5382892 5372773 5359084 5341564 5319611 5293030
57138 5293030 5262052 5226844 5187656 5145385 5101478 5057265 5013641 4971219 4930357 4891195 4854013
57127 4854013 4819505 4788406 4760989 4736988 4715657 4695726 4675838 4655434 4634956 4614998 4595854
57116 4595854 4578280 4564013 4554932 4552054 4555780 4566501 4584377 4609137 4640909 4680956 4731225 4794024
57104 4794024 4872957 4973491 5101836 5264088 5467526 5722057 6039459 6432480 6916566 7511984
57094 7511984 8242451 9131637 10201447 11470945 12952502 14647357 16545665 18629326
57086 18629326 20871715 23235829 25677152 28148272 30595654 32952379 35143995 37108600
57078 37108600 38804890 40189848 41189528 41703693 41647790 40992537 39768616 38046062 35916255
57069 35916255 33484878 30865025 28165624 25482016 22892532 20456924 18214416 16184576
57061 16184576 14372046 12771276 11369186 10147851 9088018 8171030 7378513 6692511
57053 6692511 6097150 5579401 5127804 4731480 4381025 4069456 3791509 3542624 3319096
57044 3319096 3118384 2938363 2776497 2630169 2497303 2376187 2265218 2163435 2070969 1988364
57034 1988364 1915670 1852609 1799256 1755957 1722790 1699727 1687300 1686454 1697307 1717653 1742057 1762017
57022 1762017 1767872 1752180 1712548 1651808 1575825 1491096 1403536 1318061 1238226 1165925 1101486
57011 1101486 1044203 993172 948003 908765 875189 846137 820121 796238 774307 754274 735889
57000 735889 718953 703490 689559 677157 666328 657057 648951 641360 633979 627194 621749 618235 616944
56987 616944 617978 621332 626951 634647 643786 653113 661139 666757 669274 667965 662169 652074 639046 624872
56973 624872 610812 597475 585212 574235 564592 556413 550115 546060 544091 543732 544882 548014 553690
56960 553690 562068 572890 585737 600178 615682 631319 645423 655739 660212 657778 648512 633405
56948 633405 614289 593656 573772 555661 539152 523997 510658 499899 492072 487132 485134 486339
56936 486339 490884 498654 509495 523355 540171 559735 581560 604487 626184 643148 651736 649769
56924 649769 637596 617760 593580 567731 541762 516455 492319 469814 449359 431297 415840
56913 415840 403005 392638 384424 377853 372279 367210 362495 358099 353800 349331 344797 340610 336945 333512
56899 333512 330025 326705 324187 323097 323802 326290 330125 334765 340200 347194 356674 369027 384080 401445
56885 401445 420519 440325 459670 477274 491400 499831 501087 495919 487029 477061 467212 457834 449630
56872 449630 443650 440487 440086 442329 447471 456061 468723 485941 507821 534230 565361 601846 643851
56859 643851 690089 737852 783606 823097 851469 864610 861147 842975 813855 777879 739067 701201
56847 701201 667085 638160 615240 599307 591153 590750 597741 612436 635662 667742 708280 757056
56835 757056 814405 880391 953858 1032014 1109867 1179530 1231182 1256502 1252289 1221207 1169518 1104387
56823 1104387 1032472 959451 889647 825940 770179 723558 686591 659167 641051 632321 633097 643043
56811 643043 661403 687539 721220 762367 810514 864087 919480 970539 1009543 1029707 1027694 1004440
56799 1004440 964083 912078 853691 793291 734372 679814 631876 591801 559629 534672 516272
56788 516272 504114 497990 497537 502284 511756 525505 543222 564797 589904 617103 643260 664045
56776 664045 675376 674897 662576 640139 609909 574134 535236 496117 459503 426817 398067 372941
56764 372941 351563 333964 319401 306819 295773 286368 278413 271201 264163 257259 250629 244314 238503
56751 238503 233617 229856 226979 224766 223381 222956 223012 222721 221759 220589 219867 219739 219779 219474 218743 217993 217652
56734 217652 217682 217664 217416 217303 217726 218445 218726 218208 217394 217127 217724 218790 219786 220588 221428 222469 223583 224529
56716 224529 225178 225529 225633 225556 225341 224916 224175 223262 222628 222600 223002 223444 223920 224821 226293 227927 229221 230073
56698 230073 230598 230734 230356 229684 229180 228986 228752 228123 227176 226256 225554 225090 224958 225266 225778 225933 225428 224646 224246
56679 224246 224393 224694 224870 225089 225495 225759 225451 224697 224101 224039 224283 224319 223822 222877 221963 221707 222356 223453 224250
56660 224250 224475 224501 224770 225364 226130 226903 227498 227799 228057 228831 230367 232184 233551 234287 234912 236008 237526
56643 237526 238727 238817 237687 236011 234533 233419 232448 231627 231179 230982 230548 229750 229117 229085 229302 229041 228101 226927
56625 226927 225995 225396 224989 224687 224528 224616 225005 225616 226331 227107 227842 228141 227565 226180 224603 223359 222461 221732
56607 221732 221164 220774 220406 219933 219376 218637 217546 216465 216314 217503 219149 219934 219546 218714 218036 217468 216952
56590 216952 216789 217099 217397 217082 216136 215079 214402 214242 214557 215360 216690 218302 219607 220187 220385 221026 222416
56573 222416 223953 224961 225549 226374 227918 230336 233598 237305 240716 243644 247112 252458 259877 268454 277524
56558 277524 287282 298004 309281 320055 328822 333878 334314 331090 326420 321720 316748 310972 304905 299459
56544 299459 294728 290281 286217 283014 280467 277666 274157 270461 267208 264308 261347 258382 255947 254379
56530 254379 253479 252841 252297 251962 251923 252003 251858 251283 250471 249978 250366 251733 253553 255051 255765 255695 254965 253606
56512 253606 251750 249773 248044 246654 245542 244665 243868 242884 241745 240996 241124 241962 242990 244041 245270 246584
56496 246584 247626 248294 248856 249474 250051 250523 250912 251086 250949 250884 251473 252648 253556 253511 252657 251539 250378 249053
56478 249053 247593 246422 246219 247410 249579 251547 252442 252624 253077 254014 254676 254525 253952 253630 253784 254310 255027
56461 255027 255555 255517 255140 255139 255751 256466 256878 257179 257477 257388 256841 256602 257411 259094 261096 263313 265758 267914
56443 267914 269184 269641 269640 269061 267706 266110 265124 264823 264636 264403 264461 264733 264611 263892 263031 262270 261284 260033
56425 260033 259257 259635 260871 262079 262727 262802 262416 261717 261087 260948 261339 261972 262701 263681 264982 266287 267182 267642
56407 267642 268016 268574 269242 269864 270443 270940 271075 270651 269995 269757 270305 271580 273434 275727 278173 280566 283124
56390 283124 286060 288808 290336 290454 290176 290482 291337 292336 293612 295450 297465 298901 299592 300043 300627 301184
56374 301184 301332 300814 299645 298182 296858 295650 294185 292620 291908 292694 294444 296232 297936 299878 301707
56359 301707 302634 302735 303108 304555 306803 309189 311442 313446 314831 315299 315211 315478 316817 319117 321477 322974
56343 322974 323521 323864 324688 326003 327558 329480 332093 335373 339026 342907 346976 351005 354716 358095 361259
56328 361259 364239 367194 370560 374541 378730 382654 386445 390505 394721 398458 401104 402234 401596 399520
56314 399520 397067 395262 394395 394432 395507 397366 398949 399555 400087 402080 405611 409222 411933 414311 417429
56299 417429 421672 426794 432301 437530 442021 446037 450115 454158 457726 461130 465223 469997 474491 478453
56285 478453 483042 489282 496699 504187 511500 519159 527443 536292 545880 556579 568467 581304 594891
56272 594891 609148 624014 639599 656274 674403 694137 715549 738693 763415 789423 816778
56261 816778 846187 878700 915215 956108 1001101 1049778 1102712 1161970 1229883 1307418 1394281
56250 1394281 1490502 1597154 1715454 1845908 1988414 2142368 2306230 2477527 2653665 2832369
56240 2832369 3011143 3186697 3355020 3511593 3651478 3769833 3862690 3927207 3961533 3965083
56230 3965083 3938872 3884918 3805441 3703242 3582505 3447958 3303128 3150320 2992376 2833229
56220 2833229 2676350 2523714 2376671 2236731 2104874 1981049 1865104 1757495 1658454 1567198
56210 1567198 1482615 1404126 1331388 1263908 1201572 1144893 1094071 1048391 1007064 970004 937135
56199 937135 907675 880793 856368 834377 814161 795182 778004 763563 751645 740847 729996
56188 729996 719092 709016 700737 694619 690101 686186 682414 679063 676348 674013 671881 670131 668728 667272
56174 667272 665796 665004 665265 666050 666847 667977 669969 672708 675725 678817 682001 685433 689686 695372 702183
56159 702183 709127 716031 723798 732757 741966 750875 760508 772042 785273 799565 815388 833691 854580
56146 854580 877865 904366 935478 972026 1014649 1064634 1122912 1188584 1259738 1335470 1415696
56135 1415696 1498940 1581532 1659312 1729419 1790652 1843234 1888659 1929094 1966438 2001771 2035063
56124 2035063 2064832 2088485 2103795 2110124 2108210 2099382 2085155 2066592 2043236 2013270 1975253 1928944
56112 1928944 1874111 1810056 1737620 1660631 1583947 1510646 1442161 1380082 1326029 1280183 1241547
56101 1241547 1209481 1183777 1163598 1147762 1135903 1128044 1123287 1120227 1118503 1118671 1120683 1123730 1127465
56088 1127465 1132132 1137528 1143034 1148684 1155178 1162851 1171547 1181299 1192137 1203505 1214931 1226981 1240420
56075 1240420 1254731 1268653 1281907 1295207 1308827 1322489 1336498 1351671 1368146 1385350 1403044
56064 1403044 1421356 1440012 1458721 1478073 1498938 1521138 1543783 1566603 1589879 1613526 1637398
56053 1637398 1661966 1687372 1712431 1736010 1758818 1782267 1806170 1829332 1851902 1875253 1899903
56042 1899903 1925514 1952628 1982270 2013875 2045735 2077641 2111151 2147140 2185051 2224751 2267087
56031 2267087 2312212 2359111 2407205 2456799 2507797 2559705 2613045 2668924 2727025 2785844 2845134
56020 2845134 2906252 2969886 3035338 3102327 3171574 3243258 3316782 3392462 3471696 3555198 3642813
56009 3642813 3735144 3833384 3937362 4045763 4158510 4276989 4401805 4532352 4668661 4811540
55999 4811540 4960827 5115805 5277413 5447754 5627461 5816010 6014585 6225821 6450630
55990 6450630 6688098 6938681 7204649 7487338 7787119 8106362 8449145 8817739 9212755
55981 9212755 9636970 10095359 10591036 11125136 11701333 12326451 13006079 13744056 14547363
55972 14547363 15427088 16393674 17456200 18627967 19928288 21377701 22997041 24813661
55964 24813661 26864337 29191897 31847138 34899131 38441060 42587936 47481291 53306843
55956 53306843 60309016 68791814 79115049 91685089 106917547 125172417 146711627
55949 146711627 171716085 200300219 232375364 267262320 303165752 336881964 364175146
55942 364175146 380924943 384553815 374901880 354044316 325302537 292167073 257645961
55935 257645961 224042319 192924245 165165271 141067659 120546978 103297024 88898699
55928 88898699 76900321 66883073 58491388 51428405 45447676 40354155 35998184 32258156
55920 32258156 29030077 26229861 23792817 21664656 19796791 18150116 16695357 15406417
55912 15406417 14257771 13228995 12305994 11475888 10725080 10043151 9423654 8859542 8341981
55903 8341981 7864618 7424744 7019101 6642515 6291677 5966332 5665446 5385717 5124887
55894 5124887 4882926 4658686 4448724 4250779 4065466 3893347 3733147 3583884 3445995
55885 3445995 3319169 3201633 3092574 2992712 2901330 2814927 2729881 2644563 2558374 2471087 2383997
55874 2383997 2299536 2218786 2141005 2066001 1994896 1928071 1864482 1803613 1746162 1692272 1641041
55863 1641041 1592284 1546870 1504853 1465156 1427370 1391865 1357885 1323751 1289422 1256690 1226429
55852 1226429 1197785 1170426 1145115 1121363 1097003 1071030 1044718 1019082 993495 967771 943283
55841 943283 920773 899132 877586 857059 838110 819560 800675 782869 767600 754128 741015
55830 741015 728427 717311 707480 698120 689243 681203 673577 665737 657746 649633 640650 630292 619167
55817 619167 607908 596172 583687 571375 560389 550782 542030 534041 526843 520211 514414 510450 508613
55804 508613 507786 506992 506758 508048 510812 514502 519047 524245 528995 532276 534270 535645 536439 536531 536421 536557
55788 536557 536487 535602 534066 532189 529625 526094 522102 517865 512183 503564 492066 479083 465849 453172
55774 453172 442231 434456 430633 430846 435011 442667 452372 462049 469841 474252 473971 468351 458046 444801
55760 444801 430713 417723 407096 398836 392019 385993 380714 375759 370035 363017 355362 347581 339059
55747 339059 329270 319121 309963 301860 293949 286053 278839 272661 267333 262915 259789 257951 256930 256396
55733 256396 256214 256053 255502 254530 253341 251963 250369 248697 246881 244387 240876 236775 232691 228609 224240
55718 224240 219813 215922 212901 210966 210636 212315 215593 219559 223680 227962 232449 237002 241380 245131
55704 245131 247667 248799 248917 248284 246533 243299 238878 233770 227981 221283 213862 206261 199029 192755 187969
55689 187969 184575 181913 179783 178753 178932 179283 178987 178803 180053 182765 185896 188999 192538 196625 200537
55674 200537 203543 205404 206002 205289 203742 202126 200672 199030 197092 195283 194012 193327 193134 193274 193393 193236
55658 193236 193106 193579 194753 196119 197174 197817 198253 198786 199637 200733 201873 203208 205076 207113 208169 207642
55642 207642 206303 205184 204204 202647 200415 197826 194561 189954 184243 178531 173436 168632 163761 158945
55628 158945 154332 149976 146350 144151 143341 143010 142410 141544 140577 139402 138094 137208 137186 137806 138461 138674 138202
55611 138202 136985 135223 133239 131159 128925 126657 124728 123450 122862 122705 122406 121315 119379 117376 116081
55596 116081 115355 114494 113258 112070 111314 110990 110938 110839 110152 108614 106774 105448 104732 104146 103628 103680 104445 105408
55578 105408 106270 107534 109931 113548 117643 121034 122781 122965 122811 123634 125668 128313 131225 134449 137600
55563 137600 139776 140496 140088 138974 137222 134995 132737 130616 128297 125555 122689 120043 117625 115462 113901
55548 113901 113209 113185 113372 113467 113408 113305 113333 113447 113290 112757 112418 112835 113644 114039 114099 114769 116396 118169 119326
55529 119326 120054 120776 121333 121411 121166 120824 120193 119136 118040 117213 116227 114544 112440 110680 109484 108426 107175
55512 107175 105720 103951 101693 99219 97192 95887 94869 93645 92321 91354 90802 90205 89282 88538 88800 90111
55496 90111 91410 91639 90939 90310 90237 90232 89808 89263 89166 89473 89580 89049 88022 87089 86960 88036 90031 92105 93464
55477 93464 93809 93270 92228 91249 90793 90816 90931 90993 91173 91352 90951 89628 87770 86046 84853 84431 84985 86212
55459 86212 87124 86944 85994 85207 84881 84482 83632 82696 82230 82262 82384 82288 81984 81588 81179 80856 80811 81135 81567 81624
55439 81624 81153 80573 80286 79987 78988 77304 75909 75695 76529 77642 78605 79534 80567 81620 82619 83543 84219
55422 84219 84407 84165 83856 83716 83671 83640 83779 84181 84515 84285 83459 82601 82219 82158 81882 81220 80511 79990 79395 78413
55402 78413 77163 75946 74766 73486 72336 71800 72022 72702 73563 74551 75501 76003 75816 75187 74632 74540 75069 76168
55384 76168 77558 78851 79785 80305 80429 80151 79462 78389 77082 75962 75552 75978 76859 77907 79296 81073
55368 81073 82564 83037 82801 82955 83977 85225 85905 85953 85758 85554 85398 85308 85161 84733 84033 83299 82637 82002 81510
55349 81510 81384 81569 81875 82437 83414 84279 84147 82982 81712 80969 80524 80280 80836 82410 83964 84235 83238 82060
55331 82060 81522 81685 82320 83155 83805 84070 84236 84648 85136 85241 84856 84281 83843 83706 83797 83690 82957 81930 81565
55312 81565 82183 82924 82981 82738 82959 83418 83290 82555 81989 81920 81934 81816 81851 82044 81869 81067 80065 79389 79194 79452
55292 79452 80038 80552 80664 80799 81796 83652 85252 85694 85332 85116 85375 85701 85690 85384 85137 85394 86336 87515
55274 87515 88020 87364 86040 84909 84214 83523 82518 81485 80973 81239 82203 83746 85789 88023 89847 90850
55258 90850 91261 91611 91885 91409 89769 87508 85607 84503 83944 83548 83098 82487 81851 81680 82316 83389 84181
55241 84181 84584 85191 86304 87274 87115 85618 83693 82642 83072 84416 85587 86090 86231 86207 85647 84515 83875
55224 83875 84839 86963 88627 89010 88781 88702 88558 87970 87419 87716 88914 90392 91633 92377 92312 91342 90044 89316
55206 89316 89525 90330 91274 92165 92936 93513 93922 94264 94549 94712 94775 94858 95104 95689 96706 97846 98391 97863 96580
55187 96580 95278 94298 93411 92440 91638 91361 91603 91979 92054 91665 91060 90733 90965 91465 91633 91171 90280 89286 88287
55168 88287 87266 86297 85464 84712 83979 83378 83083 83097 83331 83862 84861 86194 87346 87852 87745 87408 87123 86923
55150 86923 86801 86828 87049 87380 87706 88011 88394 88983 89767 90465 90677 90308 89739 89410 89348 89314 89298 89546 90151 90954
55130 90954 91862 92852 93631 93743 93167 92441 91992 91726 91466 91343 91485 91716 91945 92482 93495 94555 95215 95737
55112 95737 96629 97665 98049 97527 96757 96487 96894 97781 98894 99870 100309 100154 99769 99499 99398 99368 99379 99492 99909
55093 99909 100876 102287 103594 104479 105417 107003 108864 109906 109647 108641 107477 106171 104848 104311 105281 107431
55077 107431 109592 110775 110755 110057 109598 109983 110841 111241 110972 110885 111571 112309 111972 110598 109331 108991 109393 109959
55059 109959 110289 110114 109322 108264 107514 107161 106774 106222 106016 106521 107207 107100 105843 103959 102243 101206 101007
55042 101007 101527 102352 102970 103193 103266 103430 103546 103308 102760 102269 101984 101592 100844 100099 100045 100911 102188 103134 103326
55023 103326 102765 101699 100517 99667 99489 100086 101287 102734 104110 105409 106883 108540 109881 110412 110293 110168
55007 110168 110346 110541 110486 110371 110451 110489 109911 108441 106444 104700 103965 104628 106595 109356 112164 114309 115504
54990 115504 116061 116452 116599 115985 114609 113326 112780 112516 111752 110620 109783 109199 108282 107195 106783 107074 107051 106380
54972 106380 106170 107261 108765 109264 108681 107991 107688 107686 108326 110221 113090 115697 117126 117449 117171 116733 116581
54955 116581 116965 117531 117629 117095 116231 115174 113897 112749 112199 112009 111469 110541 109992 110158 110398 110168 109881 110159
54937 110159 110832 111294 111451 111680 112097 112351 112123 111494 110882 110862 111864 113869 116489 119423 122561 125616 128149
54920 128149 130248 132794 136625 141665 147204 152840 158738 165072 171519 177342 181796 184478 185371 184512 181725
54905 181725 176973 170948 164812 159187 153824 148482 143592 139658 136432 133343 130421 128237 126999 126280
54891 126280 125586 124727 123660 122468 121495 121071 121082 121226 121636 122734 124428 126056 127341 128876 131367 134838
54875 134838 138942 143619 148988 154852 160832 166847 172982 178901 183766 186799 187649 186265 182782 177654
54861 177654 171596 165223 158927 153140 148385 144786 141722 138320 134384 130677 128207 127294 127355 127493 127259
54846 127259 126823 126490 126187 125556 124492 123319 122324 121316 119938 118323 117103 116672 116703 116517 115745 114452 112874
54829 112874 111378 110537 110770 111758 112531 112376 111532 110762 110496 110582 110779 111043 111345 111539 111620 111875 112533 113386 114003
54810 114003 114254 114384 114608 114818 114788 114522 114307 114523 115367 116608 117567 117587 116712 115759 115498 115822 115927 115285 114183
54791 114183 113309 113062 113433 114335 115737 117423 118863 119481 119122 118189 117298 116826 116787 117097 117754 118700 119695 120618
54773 120618 121814 123837 126764 130012 132982 135672 138514 141822 145633 149924 154673 159768 165143 170953
54759 170953 177326 183831 189491 193450 195451 195580 193879 190472 185865 180724 175380 169811 164120 158656
54745 158656 153552 148501 143384 138911 136131 135158 134759 133544 131359 129188 127795 126976 126279 125939 126592 128245
54729 128245 130103 131509 132649 134046 135707 137196 138451 140128 142995 147233 152423 157972 163457 168780
54715 168780 174172 179868 185522 190092 192569 192762 191121 187960 183292 177447 171284 165507 160146 155035
54701 155035 150459 146852 144049 141401 138644 136183 134433 133265 132249 131082 129626 127860 126023 124523
54687 124523 123448 122415 121186 120157 119864 120173 120358 119976 119285 118774 118565 118432 118145 117638 117003 116429 116066
54670 116066 115867 115681 115517 115572 115895 116245 116484 116944 118114 119910 121525 122153 121767 121030 120597 120666 121110 121716
54652 121716 122170 122112 121462 120626 120122 120019 119957 119777 119831 120509 121562 122190 121895 121133 120971 121984 123603 124710
54634 124710 124867 124732 125170 126250 127325 127866 127825 127316 126391 125240 124170 123220 122084 120647 119321 118596 118447
54617 118447 118439 118278 117985 117674 117449 117509 118063 119038 120007 120539 120593 120508 120555 120581 120213 119474 118957 119210 120074 120934 121472
54596 121472 121804 121932 121629 121024 120789 121414 122585 123604 124152 124378 124514 124723 125100 125508 125633 125488 125597 126297
54578 126297 127150 127513 127457 127542 127796 127603 126709 125758 125547 126094 126743 126950 126729 126433 126260 126020 125429 124662 124404
54559 124404 125048 126033 126341 125684 124790 124492 124866 125434 125889 126351 127071 128023 128821 129043 128705 128304 128212 128238 128056
54540 128056 127898 128304 129273 130162 130592 130956 131794 133009 134025 134438 134250 133682 133015 132417 131720 130572 129037
54523 129037 127801 127488 127910 128306 128246 128005 128059 128492 128965 129094 128756 128141 127572 127270 127224 127247 127115 126705 126113 125659
54503 125659 125665 126174 126973 127858 128750 129475 129661 129013 127629 125942 124389 123215 122614 122848 124081 126037 127995
54486 127995 129327 129963 130155 129849 128762 127176 126111 126336 127542 128951 130367 131962 133309 133579 132841 132340
54470 132340 133044 134535 135805 136579 137234 137808 137910 137582 137519 138175 139147 139787 140090 140474 140859 140566 139406 138358
54452 138358 138543 139679 140273 139538 138378 138020 138326 138266 137658 137415 138059 138921 139066 138286 136886 135213 133766
54435 133766 133120 133236 133328 132905 132505 132899 134013 135162 136058 136957 138073 139342 140697 142029 142978 143180 142722
54418 142722 142083 141754 142115 143402 145390 147307 148492 148995 149230 149333 149248 149150 149233 149260 148866 148173 147569 147075 146546
54399 146546 146420 147502 149887 152679 154896 156145 156384 155727 154744 154319 154830 155857 156947 158135 159419 160264
54383 160264 160155 159240 157982 156503 154845 153561 153307 153864 154263 154085 154095 155223 157220 158801 159083 158601 158737
54366 158737 160284 162727 164953 166517 168068 170598 174466 179182 183891 187850 190616 192170 192981 193665 194319
54351 194319 194263 192677 189554 185799 182307 179139 175782 172043 168363 165212 162565 160148 157974 156371 155526
54336 155526 155216 154954 154376 153493 152629 152024 151487 150640 149496 148560 148245 148511 149216 150457 152164 153637 154022
54319 154022 153224 151961 150906 150175 149692 149573 149886 150341 150562 150572 150725 151123 151296 150648 149236 147947 147647 148164
54301 148164 148434 147739 146502 145606 145310 145265 145349 145817 146604 147095 146823 146051 145385 145115 145178 145554 146359 147621 149166
54282 149166 150728 152114 153289 154348 155294 155876 155758 154950 153951 153412 153608 154165 154318 153581 152270 151198 150735
54265 150735 150510 150219 150242 150954 151787 151811 151152 150966 151793 152798 153090 153056 153658 154923 155944 156221 156283 156902 158319
54246 158319 160324 162540 164394 165249 164907 163803 162449 160885 158970 157057 155948 156019 156688 157026 156815 156642
54230 156642 156904 157106 156469 154999 153546 152888 153123 153991 155302 156811 158025 158530 158399 158090 158015 158366 159079
54213 159079 159772 159855 159062 157822 156813 156189 155470 154218 152549 150956 149857 149388 149429 149687 149903 150107 150587
54196 150587 151452 152320 152606 152164 151478 151150 151288 151510 151413 150890 150088 149346 149195 150080 151823 153526 154282 153983
54178 153983 153297 152944 153171 153748 154220 154195 153705 153359 153933 155694 158169 160509 161958 162165 161361 160212 159242
54161 159242 158397 157393 156314 155485 154821 153833 152404 151064 150280 149880 149471 149118 149207 149813 150514 150808 150538 149970
54143 149970 149571 149666 150281 151321 152716 154185 155100 155100 154791 155177 156309 157142 157005 156484 156401 156542 156154 155258 154694
54124 154694 155004 155985 157264 158608 159626 159834 159274 158610 158414 158682 159161 159818 160758 161964 163304 164615 165691
54107 165691 166358 166612 166561 166282 165893 165639 165592 165373 164546 163364 162707 163120 164214 165188 165733 166248 167340 169286
54089 169286 171897 174822 178013 181810 186438 191555 196550 201198 205675 209862 213054 214483 213900 211552
54075 211552 207960 203915 200369 197896 196303 194930 193310 191445 189658 188401 188102 188905 190426 191882 192634
54060 192634 192655 192400 192151 191644 190510 189042 188112 188181 188792 189318 189870 190939 192437 193784 194919 196502 198964
54043 198964 201992 205281 209249 214538 221103 228210 235096 241373 247073 252706 259001 266191 273586 280143
54029 280143 285321 289179 291874 293493 294227 294370 294117 293578 292858 291863 290276 288038 285680 283828 282449 280953
54013 280953 278875 276067 272404 267847 262823 258054 253930 250427 247547 245247 242933 239744 235650 231756
53999 231756 229099 227543 226175 224321 221801 218618 215079 212002 210150 209376 208694 207277 205187 203185 202008
53984 202008 201761 201746 201061 199553 197993 197130 196906 196884 197000 197325 197492 197098 196496 196374 196669 196768 196792 197675 199604
53965 199604 201389 201972 201759 201754 202107 202371 202669 203595 205160 206741 208071 209507 211330 213500 216151 219667
53949 219667 224135 229333 235320 242424 250567 259297 268710 279665 292597 306508 319400 329382 335278
53936 335278 336851 334934 330993 326162 320912 315691 311243 307915 305228 302686 300587 299474 299201 299213 299488
53921 299488 300538 302574 305314 308592 312557 317264 322508 328138 334086 340112 345911 351407 356488 360522
53907 360522 362800 363583 364124 365382 367111 368401 368678 367862 366059 363585 361062 358990 357227 355078 351889
53892 351889 347372 341535 334640 327274 320232 314092 308858 304017 299057 293981 289238 285076 281109 276750
53878 276750 271947 267214 263025 259488 256552 254116 251833 249223 246187 243054 239966 236588 232753 229031
53864 229031 226190 224208 222284 219860 217245 215127 213741 212741 211772 210930 210579 210805 211192 211184 210543 209292
53848 209292 207402 204890 202250 200386 199822 200196 200746 201061 201100 200712 199644 198063 196668 196129 196548 197528 198580
53831 198580 199390 199950 200532 201406 202490 203420 204004 204391 204682 204707 204470 204510 205372 206761 207758 208034 208353 209584
53813 209584 211555 213338 214490 215550 217323 220066 223433 226864 229908 232487 234943 237637 240438 242902
53799 242902 245055 247596 251175 255756 260844 265959 270645 274474 277424 279966 282398 284405 285697 286676
53785 286676 287877 289013 289343 288902 288592 288854 288960 287900 285433 281931 277687 272870 267879 263262 259269
53770 259269 255693 252093 248166 244076 240445 237793 235936 234187 232169 230033 227886 225488 222748 220070
53756 220070 217890 216174 214649 213262 212113 211219 210609 210406 210516 210515 210173 209841 210025 210743 211588 212204 212405 212091
53738 212091 211416 210903 211052 211906 213213 214741 216149 216858 216538 215656 215153 215629 217069 219097 221135 222589
53722 222589 223445 224559 226764 229693 232058 233140 233485 234020 235011 236190 237453 239031 241146 243744 246491
53707 246491 248941 250868 252494 254306 256668 259698 263336 267198 270503 272663 274043 275769 278639 282496
53693 282496 286694 290721 294229 296973 299037 300862 302676 304100 304501 303565 301368 298176 294461 290898 288039
53678 288039 286013 284667 283849 283433 283326 283611 284448 285645 286625 287058 287211 287359 287158 286121 284547 283349 282899
53661 282899 282530 281410 279567 277833 277024 277407 278707 280312 281472 281639 280813 279584 278749 278748 279420 280304 281142
53644 281142 282035 283075 284080 284874 285703 287082 289205 291712 294128 296347 298551 300815 302967 304869 306718
53629 306718 308968 311915 315359 318748 321689 324301 327039 330260 333986 337981 341960 345915 350351 356000
53615 356000 362951 370170 376292 380937 384790 388388 391385 393414 395091 397438 400484 403179 404769 405646
53601 405646 406621 407943 409357 410655 411686 412163 411958 411442 411096 410937 410709 410434 410250 409797 408445 406235 404036
53584 404036 402534 401515 400396 398984 397397 395639 393694 391860 390527 389720 389109 388301 386970 385005 382857
53569 382857 381479 381499 382599 384014 385343 386434 386846 386194 385007 384493 385241 386720 388219 389688 391272 392574
53553 392574 392976 392486 391819 391703 392413 393872 395886 398278 400997 404106 407572 411144 414572 417861 421240
53538 421240 424985 429304 434181 439267 444185 449148 455026 462550 471563 481325 491363 501748 512672
53525 512672 524188 536385 549392 563053 576860 590429 603952 618025 633145 649539 667328
53514 667328 686588 707167 728677 750862 773868 797974 823088 848724 874516 900517 926856
53503 926856 953336 979504 1004896 1029023 1051473 1072460 1093032 1114156 1135595 1156180 1175196
53492 1175196 1193038 1210492 1228078 1246211 1265173 1284394 1302451 1318551 1333683 1349575 1366789
53481 1366789 1384496 1401864 1418764 1435085 1450263 1463798 1475626 1485627 1493320 1498417 1501186 1501877
53469 1501877 1500094 1495241 1487318 1476926 1464684 1451048 1436544 1421673 1406517 1390804 1374453 1357826
53457 1357826 1341338 1324949 1308131 1290234 1270970 1250720 1230374 1210660 1191524 1172275 1152421
53446 1152421 1132294 1112806 1094684 1078075 1062889 1049358 1038113 1029659 1023865 1020005 1017239 1015064
53434 1015064 1013467 1012848 1013716 1016225 1019950 1024330 1029369 1035636 1043472 1052474 1062044 1072160 1083253 1095422
53420 1095422 1108334 1122045 1137478 1155630 1176466 1198907 1221993 1245807 1271269 1299258 1329922
53409 1329922 1362613 1396324 1430414 1465124 1501322 1539601 1579726 1621100 1663669 1708100 1755078
53398 1755078 1804670 1856358 1909456 1963422 2018070 2073613 2130254 2187553 2244397 2299871 2353963
53387 2353963 2407202 2459724 2511021 2560516 2607917 2652969 2695194 2734086 2769371 2800912 2828489
53376 2828489 2851836 2870818 2885436 2895675 2901320 2901829 2896392 2884316 2865376 2839660 2807114 2767599
53364 2767599 2721616 2670762 2617132 2562240 2506679 2450729 2394968 2340087 2286294 2233242 2180738
53353 2180738 2129377 2080182 2033611 1989253 1946627 1905849 1867031 1829330 1791388 1752886 1714991
53342 1714991 1678950 1644814 1612046 1580884 1552293 1526708 1503592 1482320 1462890 1445566 1430384
53331 1430384 1417313 1406357 1397040 1388102 1378261 1367176 1355290 1342889 1329809 1316051 1302179 1288874
53319 1288874 1276418 1264832 1254264 1244895 1236639 1229276 1222892 1217866 1214370 1212099 1210677 1210143 1210825 1212828
53305 1212828 1215903 1219855 1224889 1231495 1240096 1250942 1264214 1279991 1298095 1318120 1339717 1362807
53293 1362807 1387438 1413449 1440324 1467341 1493850 1519468 1544123 1567913 1590809 1612438 1632210
53282 1632210 1649728 1664969 1677920 1688118 1694816 1697657 1696994 1693345 1686790 1677179 1664823 1650491 1634561
53269 1634561 1616496 1595480 1571435 1545163 1517621 1489347 1460570 1431463 1402131 1372523 1342563
53258 1342563 1312326 1282007 1251804 1221845 1192173 1162785 1133863 1105989 1079846 1055506 1032177
53247 1032177 1008965 985749 963026 941008 919265 897380 875524 854136 833374 813249 794082
53236 794082 776437 760652 746808 735073 725591 717882 710800 703388 695593 687963 680815 673897 666621
53223 666621 658397 648941 638446 627296 615416 602224 587594 572568 558579 545968 533770 520945
53211 520945 507471 494226 482215 471933 462986 454254 444923 435456 427051 420041 413476 406509 399406
53198 399406 392616 385585 377411 368329 359619 352091 345422 339057 332965 327324 322071 317059 312279 307737
53184 307737 303497 299887 297199 295072 292703 289805 286864 284256 281759 279229 277058 275462 273890 271850
53170 271850 269887 268986 269240 269871 270417 271031 271599 271439 270255 268737 267724 267205 266593 265658 264698 263913 263079
53153 263079 261879 260293 258648 257414 256927 257121 257524 257622 257195 256290 255032 253651 252533 251992 252022 252443 253230
53136 253230 254410 255695 256574 256930 257223 257764 258104 257578 256398 255664 256089 257110 257621 257347 257088 257664 259064
53119 259064 260730 262303 263829 265431 267056 268576 269970 271351 272784 274020 274500 273803 272075 269834 267338
53104 267338 264466 261294 258370 256121 254251 252159 249847 248014 247258 247531 248413 249574 250800 251768 252054
53089 252054 251363 249812 248065 247065 247315 248335 249063 248890 248145 247508 247209 246990 246630 246217 245896 245546 244840
53072 244840 243615 242157 241024 240478 240165 239522 238438 237311 236448 235772 235258 235306 236289 237872 239185 239767 240014
53055 240014 240537 241297 241643 241110 239933 238752 238036 237907 238273 238850 239127 238677 237616 236541 235822 235242 234513
53038 234513 233886 233867 234417 234921 235020 235091 235676 236745 237746 238220 238194 238090 238417 239373 240513 240980 240332 239065 238036
53019 238036 237453 236792 235835 235329 236220 238357 240429 241295 241041 240551 240402 240568 240985 241751 242688 243272 243314 243260 243471
53000 243471 243627 243376 243175 243778 244979 245712 245508 245172 245684 247003 248306 249019 249230 249433 250159 251567 253089
52983 253089 253852 253790 253968 255407 257892 260394 262339 263882 265214 266279 267161 268123 269106 269740 269955 270154 270606
52966 270606 271117 271540 272221 273610 275616 277650 279193 280125 280569 280591 280065 278813 276892 274693 272667 270931
52950 270931 269248 267292 264826 261785 258456 255500 253480 252387 251884 251970 252968 254780 256609 257684 257943
52935 257943 257773 257385 256752 255999 255381 254884 254113 252726 250812 248819 247191 246132 245615 245457 245313 244699 243244
52918 243244 241167 239399 238953 240027 241842 243392 244210 244388 244144 243643 243152 242963 243049 242939 242214 241060 240164
52901 240164 239998 240434 241148 242110 243346 244414 244708 244383 244445 245613 247491 249175 250292 250980 251192 250693 249633
52884 249633 248555 247773 247214 246844 246776 246935 247151 247605 248576 249696 250117 249703 249397 249993 251137 252073 252889 254313
52866 254313 256538 258922 260830 262265 263627 265304 267527 270213 272850 274818 275965 276621 276978 276676 275160
52851 275160 272340 268799 265323 262226 259159 255638 251652 247626 243850 240302 237096 234680 233346 232802
52837 232802 232482 232054 231433 230652 230061 230266 231394 232650 233160 233162 233745 235393 237305 238296 237848 236162 233707
52820 233707 231140 229298 228741 229239 229941 230084 229494 228535 227772 227671 228395 229699 230993 231689 231705 231669 232374 233888
52802 233888 235327 235728 235002 233826 232732 231632 230193 228361 226387 224540 222968 221735 220927 220619 220704 220810
52786 220810 220639 220439 220799 221803 222772 223166 223403 224259 225718 227042 227869 228523 229148 229274 228551 227479 227012
52769 227012 227692 229312 231038 231739 230700 228397 226185 224841 223778 222092 219990 218598 218555 219392 220312 221078
52753 221078 221987 223345 225099 226742 227604 227464 226968 227139 228414 230362 232343 234217 236279 238748 241484
52738 241484 244089 246138 247381 247809 247583 246969 246401 246437 247387 248986 250620 251904 252879 253705 254407 254960 255338
52721 255338 255357 254723 253437 251955 250772 249977 249416 249100 249133 249317 249169 248412 247187 245671 243804 241649 239784
52704 239784 238961 239318 240215 240926 241279 241519 241809 242073 242241 242313 242257 242108 242220 243077 244643 246132 246731 246462 246060
52685 246060 246052 246283 246332 246003 245281 244208 243106 242606 242975 243563 243395 242339 241204 240657 240581 240756 241544 243304
52667 243304 245418 246595 246223 244992 244129 244426 245973 248312 250638 252255 253145 253832 254510 254746 254360 254197
52651 254197 255464 258371 261879 264787 266643 267577 267710 267057 265802 264359 263125 262255 261638 261065 260397 259649
52635 259649 258970 258615 258828 259534 260152 259990 258974 257851 257571 258669 261196 264793 268545 271206 272089 271603
52619 271603 270539 269077 266948 264355 262032 260377 259159 258172 257609 257601 257892 258240 258678 259171 259460 259577 260022
52602 260022 260992 261862 261927 261404 261179 261750 262880 264095 265007 265259 264744 263995 263844 264516 265416 265952 266182 266456
52584 266456 266794 266962 266973 267113 267530 268078 268582 269064 269559 269916 269967 269886 270170 271084 272240 272973 273085 272919 272603
52565 272603 271677 269801 267539 265855 264918 263926 262285 260389 258976 258134 257405 256561 255738 254909 253828 252652
52549 252652 252123 252832 254468 256045 256726 256387 255582 255121 255417 256012 255986 255072 254128 254163 255152 256252 257000 257690
52531 257690 258556 259265 259480 259444 259681 260427 261654 263278 265048 266532 267557 268349 268955 268975 268318 267752 268033 268835
52513 268835 269320 269609 270724 273044 275754 278175 280729 283993 287456 289985 291198 291673 291932 291816 290859 288876
52497 288876 286125 283284 281183 280203 279810 278970 277146 274709 272364 270426 268777 267374 266487 266343 266665 266777
52481 266777 266289 265486 264881 264521 264072 263506 263306 263883 265189 267047 269397 271910 273741 274226 273755 273520 274424
52464 274424 276512 279371 282629 285947 288944 291456 293718 296005 298096 299329 299267 298172 296646 294900 292679
52449 292679 289901 287012 284414 281859 278863 275578 272734 270690 269033 267205 265118 263029 261286 260352
52435 260352 260605 261802 263158 264191 265104 266093 266796 266885 266763 267132 268142 269432 270750 271988 272844 273087 273023
52418 273023 273243 273929 274879 276060 277572 279156 280368 281389 283202 286807 292562 300296 309673 320360 332099
52403 332099 344654 357406 369069 378093 383330 384162 380440 372937 363591 354439 346140 338107 330073 322737
52389 322737 316729 311842 307772 304875 303509 303103 302636 301829 301289 301541 302445 303589 304864 306507 308803 311821
52373 311821 315401 319416 323976 329194 334779 340196 345264 350147 354641 357978 359720 360425 360902 361123 360471
52358 360471 358984 357679 357460 358121 358691 358523 357822 357295 357497 358433 359629 360556 361116 361759 363144 365613 369029
52341 369029 373087 377683 382835 388340 393859 399503 405995 413914 422945 432280 441664 451692 463085 476088
52327 476088 490561 506211 522625 539542 557264 576436 597267 619302 642032 665193 688259
52316 688259 710282 730772 750329 769926 789833 809686 829285 848738 868047 887071 905786
52305 905786 924046 941206 956568 970202 982857 995040 1006646 1017479 1027562 1036794 1044795 1051210
52293 1051210 1055753 1057824 1056632 1052011 1044724 1035704 1025369 1013953 1002070 990436 979287 968583
52281 968583 958638 950104 943296 937989 933936 931339 930718 932562 937105 944153 953091 963287 974646 987511
52267 987511 1001924 1017215 1032504 1047370 1061865 1076101 1090130 1104030 1117788 1131134 1143858
52256 1143858 1156270 1168984 1182084 1194845 1206437 1216650 1225699 1233548 1239692 1243511 1244533 1242414
52244 1242414 1236878 1227781 1215249 1199896 1182902 1165603 1148683 1131881 1114629 1096799 1078684 1060538
52232 1060538 1042496 1024747 1007368 990143 972973 956409 941364 928289 917056 907547 899831 893702
52220 893702 888619 884288 880867 878459 876896 876194 876647 878171 880060 881827 883797 886455 889602 892708 895771
52205 895771 899144 902707 905856 908320 910418 912452 914354 916083 917928 920147 922570 924843 927006 929626
52191 929626 933244 937772 942495 946718 950297 953338 955596 956649 956640 956249 955665 954120 950864 946122 940637
52176 940637 934678 928078 920889 913305 905254 896839 889094 883399 880034 877994 876396 875372 875356 876267 877878
52161 877878 880453 884350 889286 894472 899378 904018 908536 912799 916375 918790 919927 920227 920414 920906 921660
52146 921660 922529 923520 924726 926412 929240 933888 940133 946597 951854 955644 958814 962301 966467 971276 976758
52131 976758 983278 991490 1002013 1015058 1030495 1048330 1068851 1092201 1118054 1145968 1175812 1207604
52119 1207604 1241080 1275666 1310760 1345817 1380309 1413800 1445883 1475898 1502962 1526613 1547241
52108 1547241 1565525 1581518 1594550 1603947 1609533 1611598 1610746 1607783 1603430 1598095 1592099 1585925 1579839
52095 1579839 1573334 1565440 1555676 1544342 1531849 1518127 1502849 1485816 1466945 1446259 1424218 1401826
52083 1401826 1380154 1359902 1341591 1325890 1313399 1304224 1298023 1294443 1293324 1294613 1298261 1304154 1312016
52070 1312016 1321536 1332735 1345950 1361278 1378254 1396328 1415291 1434772 1453647 1470669 1485694
52059 1485694 1499624 1513007 1525360 1536110 1545460 1553786 1560764 1565812 1569080 1571241 1572424 1571985 1569308
52046 1569308 1564099 1555844 1543807 1527924 1509142 1488409 1465789 1441026 1414579 1387569 1360936 1335228
52034 1335228 1310972 1288614 1268049 1248860 1231124 1215399 1201600 1188459 1174640 1160110 1145936
52023 1145936 1132872 1120609 1108362 1095629 1082238 1068183 1053855 1040105 1027659 1016459 1005912
52012 1005912 995647 985678 975864 965755 955139 944288 933394 922099 909967 897170 884286 871613
52000 871613 859093 846664 834159 821006 806723 791825 777656 765202 754586 745779 738982 733836
51988 733836 729011 723330 716946 710770 705037 699151 692655 685546 677597 668219 657229 645138 632414
51975 632414 619032 605111 591501 579207 568453 558795 550118 543079 538441 536243 535893 537014 539890
51962 539890 544862 551480 558734 566141 574078 582686 590936 597357 601387 603354 603350 601000 596423 590597 584394
51947 584394 577934 571280 565164 560416 557183 555380 555645 559079 566007 575603 586810 599177 612604 626721
51933 626721 640825 654256 666647 677892 687919 696357 702393 705189 704681 701860 698054 693926 689366
51920 689366 684228 678728 672849 665663 655864 643019 627816 610978 592561 572765 552881 534571
51908 534571 518392 503861 491006 480957 474658 471673 470765 471204 473029 476494 481758 488820 497091 505158
51894 505158 511421 514973 515595 513168 507615 499323 489163 478029 466633 455644 445667 437124 430437
51881 430437 426129 424375 424613 426100 428759 432963 438629 445186 452488 460973 470659 480618 489839 498052
51867 498052 505248 510906 514372 515682 515339 513397 509387 503230 495729 488095 481374 476363 473568 472961 474016
51852 474016 476187 479117 482349 485178 487081 488055 488289 487627 485622 482035 477064 471201 465019 458980 453148
51837 453148 447164 440786 434449 429025 424996 422176 420316 419576 420161 421725 423509 425041 426447 428041 429713
51822 429713 430725 430134 427555 423667 419760 416544 413537 409906 405831 402635 401485 402315 404222 406530 409143
51807 409143 412005 414756 417031 418813 420183 420909 420520 418840 416253 413428 410926 409101 408057 407463 406597
51792 406597 404923 402570 400008 397371 394506 391611 389260 387654 386412 385346 384914 385473 386590 387585 388392
51777 388392 389256 390011 390411 390970 392607 395435 398681 401867 405338 409541 414628 421004 429341 439517 450258
51762 450258 460446 470223 480160 489845 498003 503631 506295 505581 501196 493638 484102 473534 462243 450502
51748 450502 439002 428494 419330 411535 405079 399909 395904 393026 391417 391272 392604 395115 398382 402269
51734 402269 407155 413477 421046 429066 436828 444043 450412 455386 458617 460271 460725 460400 460021 460246 460558
51719 460558 459319 455672 450758 446188 441951 437024 431607 427235 424569 422467 419668 416232 412797 409550
51705 409550 406707 405170 405763 408302 412044 416486 421017 424424 425810 425823 426064 427243 428561 428931 428248 427351
51689 427351 427181 428022 429205 429595 428613 426707 424514 421846 418014 413019 407807 403381 400181 398354 397980
51674 397980 398832 400395 402416 405090 408554 412594 417075 422242 428224 434580 440698 446493 452353 458460
51660 458460 464416 469430 472643 473414 471745 468560 465319 463103 462043 461679 461907 463514 467636 474493 482574
51645 482574 489318 492696 492127 487998 480796 471069 459886 448680 438429 429284 421051 413715 407359 401917
51631 401917 397295 393586 390946 389375 388838 389414 391044 393229 395289 396915 398255 399416 400186 400280 399603 398136
51615 398136 395751 392405 388473 384787 382190 380922 380328 379316 377331 374843 372714 371231 370048 368950
51601 368950 368197 368074 368616 369997 372751 377305 383633 391596 401198 412094 423184 433163 441232 446827
51587 446827 449066 447226 441804 434509 427121 420697 415785 412700 411396 411588 413279 416855 422535 430124
51573 430124 439466 450659 463514 477232 490998 504728 519018 534518 551490 569554 587602 604391
51561 604391 619768 635228 652944 674334 699759 729207 762584 799134 836899 873003 904482
51550 904482 929115 945803 954335 954754 947033 931403 908793 880653 848429 813364 776678 739624
51538 739624 703333 668796 636926 608419 583566 562382 544784 530397 518302 507476 497634 489367
51526 489367 483305 479396 477081 475832 475333 475417 476095 477413 478969 479752 478877 476398 473012 469025 464105 458132
51510 458132 451800 445990 440902 436173 431521 426824 421776 416140 410430 405755 402740 400948 399593 398408
51496 398408 397483 396620 395362 393573 391599 389898 388760 388308 388514 389210 390302 391856 393821 395799 397346
51481 397346 398298 398554 397780 395773 392962 390083 387447 384955 382666 380739 378900 376662 374159 372015 370197
51466 370197 367801 364429 361074 359007 358245 357806 357138 356576 356579 357180 358171 359264 360041 360218 360041 359972 359999 359737
51448 359737 359368 359981 362694 367706 374447 382410 391508 401830 413352 425839 438705 450793 460499
51435 460499 466412 468110 466446 463036 459287 455763 452295 448529 444316 439716 434851 429897 425153 420962
51421 420962 417486 414624 412349 411045 411130 412172 412768 411807 409758 408222 408188 409170 410112 410532 410516 410136 409381
51404 409381 408486 407858 407770 408323 409464 410742 411347 410905 410132 410246 411745 414132 416904 420328 425018 431099
51388 431099 438152 445961 454943 465672 478137 491903 507163 525390 548438 576990 610253 647204
51376 647204 687687 732156 780785 833010 887229 940367 988188 1026933 1054899 1072233 1079490 1076879
51364 1076879 1064612 1043256 1013657 977162 935932 892376 847923 802842 757502 713271 671722
51353 671722 633409 598023 565601 536961 512870 493217 477196 463946 452754 442884 433654 424809
51341 424809 416553 409065 402179 395706 389856 385041 381296 378277 375764 373818 372353 370985 369517 368217
51327 368217 367335 366686 366048 365704 366154 367407 368936 370329 371603 372933 374327 375676 376956 378346 380163
51312 380163 382553 385114 387018 387651 387009 385444 383271 380728 377928 374725 371005 367325 364681 363290 362165
51297 362165 360428 358547 357527 357307 356803 355367 353391 351550 350191 349470 349342 349323 348959 348612 349197 351138
51281 351138 354236 358489 364140 370737 377042 382232 386565 390546 394144 397171 399673 401507 402197 401780 401196
51266 401196 401282 401837 402322 403010 404675 407279 409664 410631 409965 408373 406655 404997 403049 400717 398612 397306
51250 397306 396297 394389 391083 386943 382494 377694 372802 368800 366284 364690 363270 362141 361571 360937 359387
51235 359387 357161 355250 354023 353139 352549 352577 353007 353036 352320 351318 350538 350144 350369 351509 353290 354948 356267
51218 356267 357949 360652 364104 367499 370354 372712 374830 376926 379033 380934 382415 383586 384741 386028
51204 386028 387525 389457 391867 394226 395954 397250 398792 400625 402015 402470 402185 401334 399703 397346 394897
51189 394897 392808 390853 388857 387280 386534 386192 385549 384659 384186 384470 385291 386389 387669 388936 389933 390617
51173 390617 391012 390903 390051 388739 387705 387501 388148 389331 390606 391548 392109 392907 394833 398260 402790 407715
51157 407715 412475 416708 420159 422612 423766 423270 421094 417807 414151 410387 406346 402082 398064 394677
51143 394677 391858 389327 386839 384116 380980 377737 375073 373297 372085 371315 371675 373815 377066 379719 380705
51128 380705 380469 380109 380190 380754 381899 383815 386497 389913 394294 399684 405263 409764 412744 414975 417302
51113 417302 419546 420931 421279 421262 421547 422170 422793 423252 423653 424131 424710 425373 426233 427571 429624 432233 434801
51096 434801 436784 438140 439183 440047 440527 440448 439986 439521 439293 439287 439381 439527 439726 439807 439393 438344 437216 436906 437647
51077 437647 438650 439070 438963 438884 438869 438510 437923 437882 438778 440154 441658 443898 447820 453595 460639 468577 477749
51060 477749 488910 502776 519622 538772 558423 576399 591316 603030 612310 620552 629594 641021
51048 641021 655107 670559 685463 698401 708738 716233 720650 721634 718781 711940 701642 689221 676430
51035 676430 664789 655068 647011 639493 631146 621137 609421 596474 583009 569954 558292 548702
51023 548702 541369 536203 532980 531251 530485 530554 531858 534694 538688 543137 547740 552653 557995 563766 570241
51008 570241 577965 587163 597462 608328 619503 630882 642277 653585 664947 676443 687741 698285
50996 698285 707725 715997 723087 728969 733748 737623 740668 742728 743575 743198 742108 741406 742279 745284 750310
50981 750310 757329 766834 779229 794133 810707 828431 847055 866081 885086 904660 926366 951536
50969 951536 980616 1013855 1051936 1095458 1144327 1198187 1257128 1321421 1390751 1464190 1540763
50958 1540763 1619515 1699160 1778141 1855070 1928695 1997464 2059569 2113516 2158432 2193838 2219515
50947 2219515 2235665 2242916 2242140 2234450 2221263 2203937 2183293 2159790 2134123 2107214 2079541 2050922
50935 2050922 2021120 1990339 1958999 1927433 1895988 1864995 1834332 1803322 1771401 1738574 1704872
50924 1704872 1669590 1631617 1590480 1546746 1501342 1454869 1407652 1360216 1313470 1268480 1226098
50913 1226098 1186749 1150492 1117259 1086951 1059269 1033641 1009576 987161 967063 949944 935796
50902 935796 923751 912510 901125 889536 878399 868366 859592 851876 845081 839185 834091 829642 825880
50889 825880 823107 821609 821434 822434 824358 826868 829642 832550 835664 839016 842604 846805 852532 860515
50875 860515 870363 880737 890718 900735 911948 925018 939865 956372 974666 994668 1015970 1038485
50863 1038485 1062862 1089950 1120095 1153253 1189467 1229028 1272436 1320649 1375074 1436851 1506246
50852 1506246 1583159 1668085 1762210 1866602 1981740 2107654 2243990 2389871 2544178 2706026
50842 2706026 2874589 3048430 3225396 3402996 3578223 3746884 3903851 4044361 4164765
50833 4164765 4262064 4333614 4377886 4395048 4386438 4353930 4300286 4229519 4146162 4054295 3957689
50822 3957689 3860408 3766529 3679363 3601364 3534242 3478198 3431074 3389142 3348965 3308075 3264121
50811 3264121 3214457 3156984 3090731 3015261 2930096 2835248 2731838 2621760 2507097 2390219
50801 2390219 2273923 2160716 2052071 1948813 1852071 1763289 1683315 1612011 1548901 1493805
50791 1493805 1446679 1407196 1374712 1348493 1327744 1311588 1299228 1290090 1283668 1279240 1275861 1272706
50779 1272706 1269372 1265858 1262289 1258726 1255116 1251268 1246774 1241072 1233805 1225098 1215343 1204670 1192823
50766 1192823 1179654 1165545 1151126 1136707 1122237 1107741 1093502 1079779 1066702 1054629 1044243
50755 1044243 1035975 1029499 1024221 1020216 1018250 1018808 1021556 1026009 1032383 1041492 1054073 1070628 1091711
50742 1091711 1117861 1149186 1185378 1226174 1271524 1321341 1375581 1434661 1499333 1569807 1645268
50731 1645268 1724498 1806773 1891926 1979756 2069596 2160258 2250219 2338087 2423111 2505093 2583617
50720 2583617 2657567 2725436 2785511 2835391 2871827 2891876 2894220 2879030 2846905 2798839 2737274
50709 2737274 2666407 2591012 2515190 2442158 2374457 2313827 2261177 2217012 2181535 2154091 2132914
50698 2132914 2115846 2101061 2086774 2070637 2050067 2023187 1989149 1947694 1898954 1843735 1783575
50687 1783575 1720330 1655908 1592371 1531845 1475979 1425571 1380844 1341922 1308990 1282162 1261426
50676 1261426 1246694 1237843 1234746 1237319 1245317 1258005 1274210 1292989 1314148 1337772 1363187 1388747
50664 1388747 1412818 1434764 1454782 1473060 1489539 1504417 1518373 1532169 1546373 1561570 1578334
50653 1578334 1596674 1615883 1635428 1655757 1677809 1701998 1728334 1757426 1790561 1828477 1870732
50642 1870732 1916645 1966331 2020173 2077572 2136923 2196863 2257073 2317738 2378527 2438245 2495348
50631 2495348 2548730 2598204 2644327 2687806 2729206 2769104 2807787 2843931 2873474 2890493 2889931 2870080
50619 2870080 2833158 2784242 2729636 2675228 2625307 2582487 2548500 2524598 2510943 2505995 2507158 2512027
50607 2512027 2518758 2525408 2529515 2528488 2520028 2502104 2473021 2431981 2379474 2316881 2245860 2168271
50595 2168271 2086406 2002810 1919802 1839316 1762984 1691892 1626247 1565612 1509621 1458200 1411101
50584 1411101 1367670 1327355 1290184 1256449 1226169 1199133 1175302 1154719 1137124 1122051 1109470
50573 1109470 1100026 1094450 1092874 1094729 1099172 1105481 1113227 1122253 1132503 1143918 1156599 1171010 1187766
50560 1187766 1207040 1228338 1251032 1275067 1300982 1329197 1359390 1390552 1421632 1452160 1482292
50549 1482292 1512224 1541542 1569160 1594079 1616317 1637195 1658661 1682261 1708580 1737617 1769596
50538 1769596 1805419 1846380 1893571 1947627 2008901 2077727 2154480 2239440 2332593 2433525 2541641
50527 2541641 2656617 2778494 2907167 3041828 3181130 3323797 3468679 3614066 3757154
50518 3757154 3894495 4022913 4139870 4243069 4330025 4398164 4445287 4469790 4470554 4446961 4399466
50507 4399466 4330189 4242521 4139862 4025004 3901139 3773224 3647638 3530283 3425322 3335721
50497 3335721 3264185 3212900 3182675 3172945 3182548 3209912 3252341 3305476 3363659 3420610 3469781 3504525
50485 3504525 3518663 3507369 3467981 3400283 3306271 3189653 3055456 2909640 2758372 2607004
50475 2607004 2459468 2318517 2186159 2063602 1951148 1848718 1756585 1675182 1604164 1542229
50465 1542229 1488119 1441372 1401674 1367830 1337945 1310635 1285656 1263392 1244167 1228215 1215863
50454 1215863 1207336 1202424 1200600 1201431 1204732 1210363 1218067 1227556 1238662 1251390 1265978 1282914 1302665
50441 1302665 1325103 1349122 1372877 1394579 1413186 1428479 1440626 1449802 1456268 1460639 1463834 1466635
50429 1466635 1469399 1472349 1475973 1480882 1487252 1494628 1502401 1510330 1518599 1527696 1538517 1552383 1570553
50416 1570553 1593614 1621548 1654322 1692278 1735914 1785574 1841280 1902632 1968777 2038639 2111178
50405 2111178 2185175 2258806 2329940 2397160 2460210 2519059 2572694 2619138 2656503 2683553 2699204
50394 2699204 2701941 2690073 2662567 2619597 2562483 2493294 2414502 2328969 2240133 2152005 2068551
50383 2068551 1992822 1926583 1870782 1826222 1793754 1773894 1766387 1770114 1783298 1803789 1829241 1857158
50371 1857158 1884858 1909345 1927242 1935130 1930389 1912066 1880923 1838587 1786693 1726831 1661069 1592173
50359 1592173 1523127 1456408 1393557 1335200 1281366 1231879 1186581 1145329 1107961 1074418 1044875
50348 1044875 1019707 999307 983910 973426 967352 964983 965715 968870 973104 976337 976723 973722 967952
50335 967952 960234 951214 941780 933112 926034 920665 916931 914974 914743 915641 917109 919334 922927 928039 934247
50320 934247 941204 948796 956658 964081 970623 976313 980966 983764 983946 981748 978229 974306 970325 966490
50306 966490 963210 960835 959377 958749 959178 961135 964825 969896 975697 981850 988562 996381 1005728 1016777
50292 1016777 1029776 1045202 1063334 1083824 1106094 1130331 1157851 1190117 1227057 1265835 1300848
50281 1300848 1325228 1333533 1324246 1300210 1266636 1228564 1189777 1153099 1120537 1092939 1070085 1051451
50269 1051451 1036611 1024814 1014761 1005322 996237 987830 980355 974097 969752 967958 968338 969722 971556
50256 971556 974658 980278 988914 1000439 1014895 1032412 1052459 1073893 1095915 1118417 1141084 1162680
50244 1162680 1181810 1198342 1213657 1229414 1246208 1263379 1279710 1294048 1305380 1312644 1314787 1311129
50232 1311129 1301686 1287079 1268142 1245702 1220738 1194508 1168328 1143245 1120045 1099430 1081862
50221 1081862 1067050 1053674 1039730 1023264 1003028 978867 951702 923031 894278 866570 840957
50210 840957 818436 799458 783587 770002 758368 748960 741879 736413 731447 726419 721657 717735 714667
50197 714667 711872 708842 705549 702158 698551 694456 689941 685404 680996 676359 671202 665932 661380 657961
50183 657961 655313 652732 649737 646270 642593 639042 635667 632088 627906 623307 619096 616062 614455 614072
50169 614072 614593 615702 617058 618441 619933 621881 624641 628349 632864 637925 643415 649432 656026 662951
50155 662951 669845 676668 683839 691956 701462 712386 724151 735719 746303 756022 765596 775346 784853
50142 784853 793664 802001 810656 820623 833101 849392 870310 895828 925649 959909 998803 1041530
50130 1041530 1086009 1129875 1171747 1211660 1250510 1289060 1327319 1364846 1401489 1437335 1471568
50119 1471568 1501737 1524743 1538548 1542584 1536724 1520660 1494628 1460252 1420153 1376753 1331631 1285877
50107 1285877 1240753 1197776 1158139 1122092 1089109 1058775 1031370 1007332 986304 967091 948548
50096 948548 930251 912284 894773 877832 861776 847195 834849 825345 818709 814322 811533 810240
50084 810240 810609 812359 814816 817664 821012 824562 827367 828891 829823 831225 833082 834245 833737 831614 828518
50069 828518 824896 820897 816755 812924 809736 806956 803796 799573 794399 789040 784007 779138 774246 769830
50055 769830 766630 764557 762564 759786 756564 754225 753973 755941 759116 762169 764630 767390 771957 779126
50041 779126 788348 798280 807839 816874 826070 836142 846948 857520 867193 876478 886395 897044 907365
50028 907365 916380 924061 930834 936864 942368 948091 954794 962387 970207 978083 986588 996256 1007136 1019325
50014 1019325 1033292 1049235 1066437 1083632 1099800 1114348 1126902 1137516 1147026 1156596 1166756 1177203
50002 1177203 1187589 1198025 1208504 1218143 1225313 1228397 1226291 1218514 1205292 1187462 1165914 1141095
49990 1141095 1113310 1083378 1052604 1022119 992619 964792 939368 916401 894933 873851 852893
49979 852893 832419 812466 792710 773356 755436 739876 726581 714704 703549 692980 683252 674783
49967 674783 667891 662393 657542 652679 647873 643591 639856 636159 632277 628709 626060 624385 623518 623811 626101
49952 626101 630886 637794 645934 654670 664007 674396 686203 699213 712498 724722 734704 741948 746929
49939 746929 750812 754571 758169 760745 761595 760577 757353 750812 739895 724951 707723 690026 672838
49926 672838 656604 641716 628428 616799 607048 599620 594631 591562 589792 589098 589404 590395 591752 593515
49912 593515 595833 598573 601456 604353 607141 609609 611954 615092 619891 626263 633494 641362 650355 660844
49898 660844 672652 685510 699318 713625 727253 738783 747339 752939 756326 758436 759599 759159 756138
49885 756138 750369 742699 734103 724923 714962 703885 691431 677611 662907 648104 633882 620776
49873 620776 609292 599601 591267 583910 578069 574698 573689 573696 573681 573927 575128 577280 580065 583691 588633
49858 588633 594893 602155 610378 619666 629808 640431 651385 662590 673858 685279 697276 709627
49846 709627 720872 729421 735066 738729 741099 742244 742276 741352 739039 734566 727867 719644 710382 700098
49832 700098 689214 678732 669224 660371 651926 644453 638697 634778 632402 631345 631283 631660 632263 633604 636377
49817 636377 640813 646854 654518 663719 674098 685406 697592 710081 721503 730813 738268 744651 749794
49804 749794 752777 753490 753092 752618 751778 749514 745328 739648 733203 726398 719223 711354 702304 691728 679827
49789 679827 667453 655610 644700 634361 624271 615043 607916 603395 600552 597955 595033 592165 589678
49776 589678 587328 584857 582631 581501 582179 584843 589154 594508 600466 607085 614767 623657 633238 642638
49762 642638 651290 659192 666483 672901 677869 681225 683696 686372 689593 692495 693654 691991 687049 678866
49748 678866 668039 655875 644019 633658 625114 618131 612354 607531 603521 600369 598279 597322 597085 596770
49734 596770 595808 594409 593464 593961 596460 600939 606808 612994 618371 622413 625446 628241 631574 636257 643099
49719 643099 652309 663148 674722 687037 700697 715580 730417 743703 754398 761562 764274 762540
49707 762540 757783 751729 745060 737591 729422 721239 713815 707816 703914 702256 701786 700720 697897 693280
49693 693280 687189 679744 671242 662483 654375 647531 642471 639768 639639 641716 645568 651188 658656 667541
49679 667541 677150 687407 699139 713337 730282 749488 770283 792054 813685 832938 846932 853795
49667 853795 853957 849803 844063 838500 833794 830201 828234 828887 833246 841645 853013 864913 874102 877250
49653 877250 871887 857548 836210 811269 785829 761830 740298 721760 706329 693830 684035 676617
49641 676617 670976 666544 663239 661261 660465 660458 661247 663141 665826 668168 669262 669140 668124 666020 662448 657532
49625 657532 651733 645334 638578 632045 626310 621347 616758 612438 608545 604980 601463 598165 595754 594674
49611 594674 594672 595106 595483 595753 596325 597754 600072 602543 604391 605694 607159 609083 611023 612540 613724 614818
49595 614818 615767 616478 617186 618209 619506 620774 621916 623112 624451 625700 626607 627376 628626 630720 633172
49580 633172 635014 635856 636274 636967 637858 638477 638928 639892 641721 644155 647073 650887 655910 661817 668169 675189
49564 675189 683609 693837 705486 717454 728274 736698 742367 745787 747409 746955 744050 739248 733862
49551 733862 728740 723728 718472 713266 708817 705512 703299 702077 701776 702064 702387 702495 702806 704016 706435
49536 706435 709714 713207 716483 719609 723114 727738 734023 742062 751696 762925 775966 790849 807279
49523 807279 825089 844532 865653 887327 907299 923360 934419 940593 942727 942035 939837 937138 934402
49510 934402 931945 930618 931932 937288 946770 958534 969503 976944 979525 976918 968891 955373 937333
49497 937333 916812 895724 875036 855369 837767 823134 811189 800760 791161 782696 775770 770122
49485 770122 765355 761703 759758 759535 760249 761043 761726 762678 764225 766230 768194 769632 770344 770543 770837 771952
49469 771952 774161 776934 779330 780868 781881 783065 784914 787600 790993 794562 797609 799924 801959 804062
49455 804062 805861 806805 806968 806753 806032 804339 801808 799147 796465 792880 787678 781342 775031 769573 765345
49440 765345 762630 761458 761383 762030 763784 767387 772930 779676 787005 795111 804758 816580 830627 846295
49426 846295 862673 879311 896699 915786 937082 960535 986248 1014695 1045648 1076752 1103396
49415 1103396 1120450 1124779 1116728 1099496 1077135 1053096 1030177 1010849 996745 988043 984008 984181
49403 984181 988463 996114 1005560 1015628 1026372 1038200 1050641 1062630 1073665 1084081 1094303 1104460
49391 1104460 1114656 1124969 1134912 1143328 1149067 1151519 1150451 1145808 1137994 1127990 1116802 1104874 1092299
49378 1092299 1079428 1066936 1055366 1044962 1035970 1028757 1023563 1020395 1019296 1020476 1023912 1028958 1034606
49365 1034606 1040087 1045006 1048927 1051239 1051668 1050743 1049343 1047720 1045165 1040822 1034645 1027405 1019900 1012512
49351 1012512 1005518 999427 994730 991466 989273 987808 986898 986432 986466 987370 989467 992326 994749 995681 994956 993020
49335 993020 990240 986807 983046 979387 976070 973233 971175 970138 969900 970115 971072 973563 977864 983500 990282
49320 990282 998907 1009879 1022297 1034460 1045581 1056284 1067550 1079807 1093089 1107286 1121871 1135704
49308 1135704 1147304 1155085 1157506 1153773 1144717 1132451 1118743 1104202 1089272 1075262 1063563 1054233
49296 1054233 1046233 1038981 1032944 1028647 1025826 1023784 1022007 1020131 1017785 1014801 1011290 1007275 1002547 997062
49282 997062 991132 984956 978320 971121 963910 957580 952705 949475 948005 948257 949821 952196 955233 958900
49268 958900 962718 965900 968076 969481 970360 970586 969966 968524 966332 963476 960427 958144 957609 959551 964793
49253 964793 974373 988810 1007414 1028754 1051651 1075260 1098250 1118435 1133462 1141722 1142680 1136799
49241 1136799 1125381 1110169 1092748 1074322 1056013 1039057 1024387 1012199 1002230 994483 989462 987603
49229 987603 988568 991246 994492 997897 1001863 1006997 1013465 1020902 1028748 1036490 1043709 1050165 1055949 1061412
49215 1061412 1066864 1072471 1078425 1084929 1091851 1098649 1104939 1111045 1117743 1125509 1134322 1144188 1155458 1168418
49201 1168418 1182843 1198223 1214238 1230727 1247305 1263473 1279108 1294448 1309408 1323319 1335705
49190 1335705 1347008 1358097 1369153 1379453 1388278 1395626 1402032 1408173 1414830 1422742 1432119 1442598 1454084
49177 1454084 1467432 1483939 1504311 1528465 1556190 1587608 1623127 1663307 1708542 1758104 1809152
49166 1809152 1856958 1896424 1923699 1937164 1937909 1929499 1916504 1902594 1889923 1879953 1873933 1872159
49154 1872159 1873487 1876361 1880184 1885215 1891450 1898166 1904555 1910324 1915683 1921161 1927479 1935294 1944889 1956231
49140 1956231 1969219 1983665 1999130 2015005 2030750 2045936 2060292 2074039 2088036 2103190 2119672
49129 2119672 2136943 2154443 2171944 2189303 2206283 2222752 2238786 2254537 2270217 2286204 2302893
49118 2302893 2320358 2338369 2356872 2376356 2397830 2422694 2452542 2488790 2532408 2584318 2646299
49107 2646299 2721436 2813447 2924913 3054925 3197370 3341944 3478869 3604803 3724616 3845883
49097 3845883 3969183 4082161 4163577 4195640 4175212 4114595 4031608 3938065 3835963 3722157
49087 3722157 3595054 3457685 3316783 3180198 3054488 2943610 2849121 2771128 2708637 2659337
49077 2659337 2620165 2588641 2563376 2543168 2526362 2511515 2498074 2485790 2473879 2461458 2448556
49066 2448556 2436021 2424469 2413841 2403945 2394931 2387044 2380239 2374209 2368594 2363126 2357684 2352353 2347404
49053 2347404 2343203 2340010 2337722 2335889 2334262 2333271 2333642 2335542 2338525 2342395 2347539 2354172 2361782 2369790
49039 2369790 2378280 2387495 2396822 2404896 2410704 2414224 2416065 2416913 2417374 2417934 2418865 2420185 2421665 2422848 2423294
49024 2423294 2422938 2421983 2420380 2417819 2414501 2411480 2409832 2409789 2411053 2413608 2417638 2422882 2428710 2434744 2440965
49009 2440965 2447397 2454233 2462151 2471738 2482490 2492969 2502200 2510448 2518461 2526372 2533650 2539849 2545084
48996 2545084 2549795 2554106 2557377 2558519 2556950 2553173 2548197 2542588 2536319 2529274 2521450 2512868 2503786 2494940
48982 2494940 2487039 2480062 2473517 2467333 2461948 2457604 2454163 2451613 2450065 2449153 2448161 2446896 2445744 2444633
48968 2444633 2442725 2439561 2435837 2432531 2429838 2427557 2425970 2425604 2426399 2427801 2429551 2431846 2434874 2438774
48954 2438774 2443994 2451156 2460577 2472336 2486748 2504219 2524577 2547059 2571130 2596894 2624401 2652969
48942 2652969 2681688 2710495 2740317 2771982 2805290 2839445 2874214 2910201 2947903 2987050 3027320
48931 3027320 3069334 3114188 3162034 3211832 3262720 3314991 3369281 3425269 3481797 3538066 3594254
48920 3594254 3651026 3708838 3767645 3826893 3885744 3943504 3999908 4054895 4108226 4159519 4208522
48909 4208522 4255181 4299563 4341902 4382598 4421903 4459623 4495298 4528583 4559384 4587785 4614044
48898 4614044 4638507 4661335 4682463 4701945 4719998 4736365 4749908 4759340 4764351 4765607 4763647 4758189
48886 4758189 4748569 4734520 4716367 4694753 4670350 4643625 4614652 4583216 4549265 4513260 4476026
48875 4476026 4438181 4399591 4359274 4315888 4268573 4217393 4163048 4106285 4047675 3987861 3927787
48864 3927787 3868601 3811317 3756455 3703991 3653797 3606248 3562260 3522609 3487303 3455773 3427475
48853 3427475 3402129 3379532 3359483 3341906 3326820 3314180 3303927 3296209 3291344 3289498 3290574 3294480
48841 3294480 3301311 3311128 3323592 3338004 3353845 3371228 3390644 3412182 3435122 3458565 3482294 3506710
48829 3506710 3531911 3557268 3582054 3606092 3629514 3652267 3674212 3695521 3716550 3737469 3758390
48818 3758390 3779711 3801861 3824683 3847434 3869435 3890427 3910279 3928878 3946529 3964064 3982115
48807 3982115 4000404 4018177 4035426 4053289 4072939 4094278 4116128 4137753 4159764 4183277 4208573
48796 4208573 4234996 4261809 4288451 4314093 4337798 4359399 4379509 4398317 4415048 4429124 4441177
48785 4441177 4452174 4461976 4469612 4474683 4477467 4477595 4473477 4463287 4445966 4421148 4388927 4350148 4306434
$$ [...]
##END NTUPLES=NMR SPECTRUM
##END=
