
##TITLE=AC1328_GUAAH12157_6609849_rhbDizuonw
##JCAMPDX= 6.0         $$ Bruker NMR JCAMP-DX V2.0
##DATA TYPE= NMR SPECTRUM
##DATA CLASS= NTUPLES
##ORIGIN= BRUKER
##OWNER= Administrator
$$ 1.72 TOPSPIN		Version 2.1
$$ 2012-08-02 03:52:05.375 -0500  Administrator@TOPSPIN
$$ Compression mode = diff/dup
##.OBSERVE FREQUENCY= 400.02188249412
##.OBSERVE NUCLEUS= ^1H
##.ACQUISITION MODE= SIMULTANEOUS (DQD)
##.ACQUISITION SCHEME= undefined
##.AVERAGES= 64
##.DIGITISER RES= 22
##SPECTROMETER/DATA SYSTEM= spect
##.PULSE SEQUENCE= noesygpps1d.comp
##.SOLVENT NAME= COFFEE_meoh
##.SHIFT REFERENCE= INTERNAL, COFFEE_meoh, 1, 14.96265
##AUDIT TRAIL= $$ (NUMBER, WHEN, WHO, WHERE, PROCESS, VERSION, WHAT)
$$ ##TITLE= Audit trail, TOPSPIN		Version 2.1
$$ ##JCAMPDX= 5.01
$$ ##ORIGIN= Bruker BioSpin GmbH
$$ ##OWNER= Administrator
$$ $$ C:\Bruker\TOPSPIN/data/COFFEE/nmr/AC1328_GUAAH12157_6609849_rhbDizuonw/12/pdata/1/auditp.txt
$$ ##AUDIT TRAIL=  $$ (NUMBER, WHEN, WHO, WHERE, PROCESS, VERSION, WHAT)
(   1,<2012-08-02 03:52:00.437 -0500>,<Administrator>,<TOPSPIN>,<go>,<TOPSPIN 2.1>,
      <created by zg
	started at 2012-08-02 03:40:30.234 -0500,
	POWCHK enabled, PULCHK disabled,
       configuration hash MD5:
       6B 1B 68 BB D9 2E 58 E2 7F 35 AD 54 07 DF 0E 41
       data hash MD5: 64K
       9E C3 4A 79 3F 0D 6B 1F 18 5B 66 4C C1 E3 4B 9C>)
(   2,<2012-08-02 03:52:03.171 -0500>,<Administrator>,<TOPSPIN>,<proc1d>,<TOPSPIN 2.1>,
      <Start of raw data processing
       efp LB = 0.3 FT_mod = 6 PKNL = 1 PHC0 = 0 PHC1 = 0 SI = 128K 
       data hash MD5: 128K
       7C 53 16 79 ED DD B4 A7 28 F0 2D 4A DB 03 4F 95>)
(   3,<2012-08-02 03:52:04.296 -0500>,<Administrator>,<TOPSPIN>,<proc1d>,<TOPSPIN 2.1>,
      <pk PHC0 = 0.4724121 PHC1 = 0 
       data hash MD5: 128K
       28 BE 3E 50 A7 F9 AA 4D 71 77 B8 D2 0A 85 3A 43>)
(   4,<2012-08-02 03:52:04.968 -0500>,<Administrator>,<TOPSPIN>,<proc1d>,<TOPSPIN 2.1>,
      <abs ABSG = 1 
       data hash MD5: 128K
       EB C1 0E 83 EC 4B A3 51 6B EB EE 27 91 82 8B 82>)
(   5,<2012-08-02 03:52:05.062 -0500>,<Administrator>,<TOPSPIN>,<proc1d>,<TOPSPIN 2.1>,
      <abs ABSG = 2 
       data hash MD5: 128K
       22 6F DD 45 87 98 20 54 A7 47 6C 31 A5 76 83 B2>)
(   6,<2012-08-02 03:52:05.140 -0500>,<Administrator>,<TOPSPIN>,<proc1d>,<TOPSPIN 2.1>,
      <abs ABSG = 3 
       data hash MD5: 128K
       2A 76 4F 9A 54 B2 15 DC 41 46 C5 4F 36 C0 B0 B1>)
(   7,<2012-08-02 03:52:05.234 -0500>,<Administrator>,<TOPSPIN>,<proc1d>,<TOPSPIN 2.1>,
      <abs ABSG = 4 
       data hash MD5: 128K
       C1 DA 36 2B 08 30 16 E3 79 93 E3 0C 44 C6 6D 5E>)
(   8,<2012-08-02 03:52:05.281 -0500>,<Administrator>,<TOPSPIN>,<proc1d>,<TOPSPIN 2.1>,
      <abs ABSG = 5 
       data hash MD5: 128K
       00 BC A7 CE 41 15 60 2D 1B 5D 85 82 3B 95 D5 82>)
$$ ##END=
$$ 
$$ $$ hash MD5
$$ $$ 6C 63 E4 27 56 46 A1 93 37 DA 6A EA AE 33 37 82
##$RELAX= 
##$RELAX= 
##$RELAX= 
##$RELAX= 
##$RELAX= 
##$RELAX= 
##$RELAX= 
##$RELAX= 
$$ Bruker specific parameters
$$ [...]
##$TP07= 0
##$TPNAME0= <>
##$TPNAME1= <>
##$TPNAME2= <>
##$TPNAME3= <>
##$TPNAME4= <>
##$TPNAME5= <>
##$TPNAME6= <>
##$TPNAME7= <>
##$TPOAL= (0..7)
0.5 0.5 0.5 0.5 0.5 0.5 0.5 0.5
##$TPOFFS= (0..7)
0 0 0 0 0 0 0 0
##$TUNHIN= 0
##$TUNHOUT= 0
##$TUNXOUT= 0
##$USERA1= <user>
##$USERA2= <user>
##$USERA3= <user>
##$USERA4= <user>
##$USERA5= <user>
##$V9= 5
##$VALIST= <valist>
##$VCLIST= <CCCCCCCCCCCCCCC>
##$VD= 0
##$VDLIST= <DDDDDDDDDDDDDDD>
##$VPLIST= <PPPPPPPPPPPPPPP>
##$VTLIST= <TTTTTTTTTTTTTTT>
##$WBST= 1024
##$WBSW= 4
##$XGAIN= (0..3)
0 0 0 0
##$XL= 0
##$YL= 0
##$YMAX_a= 17032257
##$YMIN_a= -9668529
##$ZGOPTNS= <>
##$ZL1= 120
##$ZL2= 120
##$ZL3= 120
##$ZL4= 120
##$ABSF1= 14.96265
##$ABSF2= -5.595531
##$ABSG= 5
##$ABSL= 3
##$ALPHA= 0
##$AQORDER= 0
##$ASSFAC= 0
##$ASSFACI= 0
##$ASSFACX= 0
##$ASSWID= 0
##$AUNMP= <proc_prof1d_extract.lims>
##$AXLEFT= 0
##$AXNAME= <>
##$AXNUC= <1H>
##$AXRIGHT= 0
##$AXTYPE= 0
##$AXUNIT= <>
##$AZFE= 0.1
##$AZFW= 0.1
##$BCFW= 0
##$BC_mod= 0
##$BYTORDP= 0
##$COROFFS= 0
##$CY= 15
##$DATMOD= 1
##$DC= 0
##$DFILT= <>
##$DTYPP= 0
##$F1P= 0
##$F2P= 0
##$FCOR= 0.5
##$FTSIZE= 131072
##$FT_mod= 6
##$GAMMA= 0
##$GB= 0
##$INTBC= 1
##$INTSCL= 1
##$ISEN= 128
##$LB= 0.3
##$LEV0= 0
##$LPBIN= 0
##$MAXI= 10000
##$MC2= 0
##$MEAN= 0
##$ME_mod= 0
##$MI= 0
##$NCOEF= 0
##$NC_proc= -2
##$NLEV= 6
##$NOISF1= 0
##$NOISF2= 0
##$NSP= 0
##$NTH_PI= 0
##$NZP= 0
##$OFFSET= 14.96265
##$PC= 1
##$PHC0= 0.4724121
##$PHC1= 0
##$PH_mod= 1
##$PKNL= yes
##$PPARMOD= 0
##$PPDIAG= 0
##$PPIPTYP= 0
##$PPMPNUM= 2147483647
##$PPRESOL= 1
##$PSCAL= 4
##$PSIGN= 0
##$PYNMP= <proc.py>
##$REVERSE= no
##$SF= 400.020008975985
##$SI= 131072
##$SIGF1= 0
##$SIGF2= 0
##$SINO= 400
##$SIOLD= 131072
##$SPECTYP= <>
##$SREGLST= <1H.CDCl3>
##$SSB= 0
##$STSI= 131072
##$STSR= 0
##$SW_p= 8223.68421052631
##$SYMM= 0
##$S_DEV= 0
##$TDeff= 65536
##$TDoff= 0
##$TI= <>
##$TILT= no
##$TM1= 0
##$TM2= 0
##$TOPLEV= 0
##$USERP1= <user>
##$USERP2= <user>
##$USERP3= <user>
##$USERP4= <user>
##$USERP5= <user>
##$WDW= 1
##$XDIM= 131072
##$YMAX_p= 432828302
##$YMIN_p= -10720
##$CURPLOT= <Network HP LaserJet P1505>
##$CURPRIN= <$Network HP LaserJet P1505>
##$DFORMAT= <normdp>
##$LAYOUT= <+/1D_H.xwp>
##$LFORMAT= <normlp>
##$PFORMAT= <normpl>
##$SURQMSG= 1
$$ End of Bruker specific parameters
$$ ---------------------------------
##NTUPLES= NMR SPECTRUM
##VAR_NAME=  FREQUENCY,     SPECTRUM/REAL,   SPECTRUM/IMAG
##SYMBOL=    X,             R,               I
##VAR_TYPE=  INDEPENDENT,   DEPENDENT,       DEPENDENT
##VAR_FORM=  AFFN,          ASDF,            ASDF
##VAR_DIM=   131072,        131072,          131072
##UNITS=     HZ,            ARBITRARY UNITS, ARBITRARY UNITS
##FACTOR=    0.0627417313425164, 1,          1
##FIRST=     8223.62146879497, 1471,         -59273
##LAST=      0,             3303,            -59941
##MIN=       0,             -10720,          0
##MAX=       8223.62146879497, 432828302,    0
$$ Real data points
##PAGE= N=1
##DATA TABLE= (X++(R..R)), XYDATA
$$ [...]
63208A187623J4818R404K155n728j3401k0634k7187l2646l6717l9327m0594m0888
$$ 1187623 1202441 1211845 1214000 1208272 1194871 1174237 1147050 1114404 1077687 1038360 997766 956878
63196I56878m0609l9730l7814l4722l0986k7235k3597j9873j6076j2463r279o686
$$ 956878 916269 876539 838725 804003 773017 745782 722185 702312 686236 673773 664494 657808
63184F57808m719l020q88K024N170P595Q935R632J0242J0898J1518J2078J2446
$$ 657808 653089 650069 649181 651205 656375 663970 672905 682537 692779 703677 715195 727273 739719
63171G39719J2293J1561J0897J1061J1910J2392J1757J0357Q991P824O366M321
$$ 739719 752012 763573 774470 785531 797441 809833 821590 831947 840938 848762 855128 859449
63159H59449J913n78l180o045r199j2441j5279j7058j7535j7249j6908j6507j5544
$$ 859449 861362 860784 857604 851559 842360 829919 814640 797582 780047 762798 745890 729383 713839
63146G13839j4020j2629j1839j1367j0813j0185r558q702p485o274n524n245n121
$$ 713839 699819 687190 675351 663984 653171 642986 633428 624726 617241 610967 605443 600198 595077
63133E95077m941m584l901k947k098j671j529j274o50L34J438K259K563K637L024
$$ 595077 590136 585552 581651 578704 576606 574935 573406 572132 571482 571816 573254 575513 578076 580713 583737
63118E83737L849M725N378N876O223O273O185O440P130P808Q266Q837R619J0061
$$ 583737 587586 592311 597689 603565 609788 616061 622246 628686 635816 643624 651890 660727 670346 680407
63104F80407R766R042Q150O713M557K577J814K005J988J430J152J685K356K319
$$ 680407 690173 699215 707365 714078 718635 721212 723026 725031 727019 728449 729601 731286 733642 735961
63090G35961J740J467J808K261K374K329K463K617K439K143K335K995L216K457
$$ 735961 737701 739168 740976 743237 745611 747940 750403 753020 755459 757602 759937 762932 766148 768605
63076G68605J509J583K838M407N627O500P210Q003R365J1408J3300J4229J4761
$$ 768605 770114 771697 774535 778942 784569 791069 798279 806282 815647 827055 840355 854584 869345
63063H69345J6098J8167J9818K0940K2776K5783K8864L1420L4510L8991M3912
$$ 869345 885443 903610 923428 944368 967144 992927 1021791 1053211 1087721 1126712 1170624
63052A170624M8019N1573N5384N9093O1900O4157O6702O9276P0951P1567P1470
$$ 1170624 1218643 1270216 1325600 1384693 1446593 1510750 1577452 1646728 1717679 1789246 1860716
63041A860716P0380O7949O4954O2479O0391N7990N5702N4570N4360N3822N2611
$$ 1860716 1931096 1999045 2063999 2126478 2186869 2244859 2300561 2355131 2409491 2463313 2515924
63030B515924N1325M9665M6300M0766L3837K5686J5243K020j2761k7521m1629
$$ 2515924 2567249 2616914 2663214 2703980 2737817 2763503 2778746 2780766 2768005 2740484 2698855
63019B698855n4823o6474p6150q3936q9674r2638r2567r0153q6094q0556p3959
$$ 2698855 2644032 2577558 2501408 2417472 2327798 2235160 2142593 2052440 1966346 1885790 1811831
63008A811831o7268o0905n4276m6982l9614l2678k5737j8379j1256n175M3M916
$$ 1811831 1744563 1683658 1629382 1582400 1542786 1510108 1484371 1465992 1454736 1449561 1449604 1454520
62996A454520R087J1929J3834J5778J7775J8879J8786J8447J8766J9476J9640
$$ 1454520 1463607 1475536 1489370 1505148 1522923 1541802 1560588 1579035 1597801 1617277 1636917
62985A636917J8708J6728J3971J0808P749N046K261j487o614j2545j8330k3638
$$ 1636917 1655625 1672353 1686324 1697132 1704881 1709927 1712188 1710701 1704087 1691542 1673212 1649574
62973A649574k8819l4045l8824m2569m5242m7082m8046m7978m7026m5451m3187
$$ 1649574 1620755 1586710 1547886 1505317 1460075 1412993 1364947 1316969 1269943 1224492 1181305
62962A181305m0143l6729l3526l0582k7584k4611k2072j9987j7982j6034j4512
$$ 1181305 1141162 1104433 1070907 1040325 1012741 988130 966058 946071 928089 912055 897543
62951H97543j3463j2430j1197j0107r456r086q672p982o783n109l735l732n221
$$ 897543 884080 871650 860453 850346 840890 831804 823132 815150 808367 803258 799523 795791 790570
62938G90570p070q034p829o952n960n189m746m487m289m351m869n416n287m479
$$ 790570 783500 775466 767637 760685 754725 749536 744790 740303 736014 731663 726794 721378 716091 711612
62924G11612l772l661l836l927m043m272m302m023m037m918o260o970o395m906
$$ 711612 707840 704179 700343 696416 692373 688101 683799 679776 675739 670821 664561 657591 651196 646290
62910F46290l440k702k674k780k591k272k138j991j338l06K58k41j451k478k724
$$ 646290 642850 640148 637474 634694 632103 629831 627693 625702 624364 624058 624316 624075 622624 620146 617422
62895F17422k294j848k087l041l948m145l895l902m296m676m811m596l611j762
$$ 617422 615128 613280 611193 608152 604204 600059 596164 592262 587966 583290 578479 573883 570272 568510
62881E68510j71k04j557k443k002j274j322j626j216l43M1k00m23k98L5O08J510
$$ 568510 568339 568135 566578 564135 562133 560859 559537 557911 556695 556352 556393 556193 555770 555472 555507 556115 557625
62864E57625K341K507K007J417J161J223J449J700J820J810J855J967J846J344
$$ 557625 559966 562473 564480 565897 567058 568281 569730 571430 573250 575060 576915 578882 580728 582072
62850E82072O99J10n40j232j589j455j224j151q89k70Rq08k273l115k749j843
$$ 582072 582771 582881 582341 581109 579520 578065 576841 575690 574801 574531 574540 573732 571459 568344 565595 563752
62834E63752j400j803k694l360l317k854k820l484l920l114j498o13j180k280
$$ 563752 562352 560549 557855 554495 551178 548324 545504 542020 538100 534986 533488 532875 531695 529415
62820E29415k665k301k040k213k225j595p20l08l08%R27J948K555K967L573M172
$$ 529415 526750 524449 522409 520196 517971 516376 515656 515348 515040 515040 515967 517915 520470 523437 527010 531182
62804E31182M422M672N520O711P473P896R011J1140J3178J3987J3788J3522J3544
$$ 531182 535604 540276 545796 552507 559980 567876 576887 588027 601205 615192 628980 642502 656046
62791F56046J3704J4190J5516J7813K0772K4120K7703L1281L4723L8246M2118
$$ 656046 669750 683940 699456 717269 738041 762161 789864 821145 855868 894114 936232
62780I36232M6292N0687N5567O1214O7449P3858Q0346Q7019R3673R9769J04874
$$ 936232 982524 1033211 1088778 1149992 1217441 1291299 1371645 1458664 1552337 1652106 1756980
62769A756980J08790J11278J11874J09958J04951R6604Q5256P1593N6090L8939
$$ 1756980 1865770 1977048 2088922 2198880 2303831 2400435 2485691 2557284 2613374 2652313
62759B652313K0498J480j7430l5660n2398o6741p8459q8121r6077j01814j04721
$$ 2652313 2672811 2674291 2656861 2621201 2568803 2502062 2423603 2335482 2239405 2137591 2032870
62748B032870j05083j03826j01607r8502r4370q9160q3153p7080p1669o6866o1944
$$ 2032870 1927787 1823961 1722354 1623852 1529482 1440322 1357169 1280089 1208420 1141554 1079610
62737A079610n6658n1680m7557m3863l9924l5909l2498k9837k7457k5011k2563
$$ 1079610 1022952 971272 923715 879852 839928 804019 771521 741684 714227 689216 666653
62726F66653k0297j8383j6886j5510j3828j2045j1048j1126j1234j0163q070o113
$$ 666653 646356 627973 611087 595577 581749 569704 558656 547530 536296 526133 518063 511950
62714E11950m858l837k507q43R06K489L631M344N145O464Q029R327J0514J2197
$$ 511950 507092 503255 500748 499905 500811 503300 506931 511275 516420 522884 530913 540240 550754 562951
62700E62951J4474J6860J9143K1602K4376K7231L0075L3103L6328L9452M2283
$$ 562951 577425 594285 613428 635030 659406 686637 716712 749815 786143 825595 867878
62689H67878M4819M6811M7755M7429M6035M3654M0052L5165K9344K2824J5316
$$ 867878 912697 959508 1007263 1054692 1100727 1144381 1184433 1219598 1248942 1271766 1287082
62678A287082O512l077j2131j9550k5413l0744l6158m0933m3822m4674m4627m4576
$$ 1287082 1293594 1290517 1278386 1258836 1233423 1202679 1166521 1125588 1081766 1037092 992465 947889
62666I47889m4185m2819m0752l8645l6424l3544l0224k7455k5766k4647k3347
$$ 947889 903704 860885 820133 781488 745064 711520 681296 653841 628075 603428 580081
62655E80081k1567j9368j6999j5027j4000j3745j3398j2364j0954r872r439r420
$$ 580081 558514 539146 522147 507120 493120 479375 465977 453613 442659 432787 423348 413928
62643D13928r311q696p610o627o347o711p053o831o047n000m056l626l900m394
$$ 413928 404617 395921 388311 381684 375337 368626 361573 354742 348695 343695 339639 336013 332113 327719
62629C27719m196k975j516r17j413k170k261j497l78N72J151J331J111P32P39
$$ 327719 323523 320548 319032 318115 316702 314532 312271 310774 310396 310968 312119 313450 314561 315293 316032
62614C16032J471K550L282L497L623L935M271M568N119O061P138Q246R656J1376
$$ 316032 317503 320053 323335 326832 330455 334390 338661 343229 348348 354409 361547 369793 379449 390825
62600C90825J2891J3979J5269J7320J9806K2221K4955K8724L3219L7336M0644
$$ 390825 403716 417695 432964 450284 470090 492311 517266 545990 579209 616545 657189
62589F57189M3770M7188N0555N3444N5914N7909N8755N7824N5165N1011M5019
$$ 657189 700959 748147 798702 852146 908060 965969 1024724 1082548 1137713 1188724 1233743
62578A233743L6683K6456J5789N902l138j1909k0563k8577l5386m0799m4724m6967
$$ 1233743 1270426 1296882 1312671 1318573 1315435 1303526 1282963 1254386 1219000 1178201 1133477 1086510
62566A086510m7567m7008m5744m3756m1010l8051l5597l3703l1871k9891k7955
$$ 1086510 1038943 991935 946191 902435 861425 823374 787777 754074 722203 692312 664357
62555F64357k6069k4123k2508k1791k1665k1081j9698j8256j7268j6281j4979
$$ 664357 638288 614165 591657 569866 548201 527120 507422 489166 471898 455617 440638
62544D40638j3939j3532j2918j1119q535o497n675n678n844n707m972l737k500
$$ 440638 426699 413167 400249 389130 380595 374098 368423 362745 356901 351194 346222 342485 339985
62531C39985j520n65L79Q60Q75J217K187K878K601K213K844M095M791N018N886
$$ 339985 338465 337900 338279 339139 340014 341231 343418 346296 348897 351110 353954 358049 362840 367858 373744
62516C73744P607R273J0475J1804J3648J5661J7576J9485K1248K2619K4001K5988
$$ 373744 381351 390624 401099 412903 426551 442212 459788 479273 500521 523140 547141 573129
62504E73129K8109K9116K8601K7233K5364K2561J8752J4597J0324N424k9m930
$$ 573129 601238 630354 658955 686188 711552 734113 752865 767462 777786 783210 783181 778251
62492G78251q601j1744j5216j8677k1176k2422k2772k2460k1520k0178j8791j7514
$$ 778251 769650 757906 742690 724013 702837 680415 657643 635183 613663 593485 574694 557180
62480E57180j6312j4978j3113j0538p791n714m477l479k296j100j27O56J253J626
$$ 557180 540868 525890 512777 502239 494448 488734 484257 480778 478482 477382 477255 477911 479164 480790
62466D80790J991K512K823K644K681L885N829P050P162P295Q109Q745Q479Q121
$$ 480790 482781 485293 488116 490760 493441 497326 503155 510205 517367 524662 532771 541516 549995 558116
62452E58116Q738R933J0496J0096R274Q272O845M955K759J81k860n994q806j1417
$$ 558116 566854 576787 587283 597379 606653 614925 621770 626725 629484 629665 626805 620811 612005 600588
62438F00588j4060j6346j7570j7637j7065j6266j5228j3858j2232j0605r324q519
$$ 600588 586528 570182 552612 534975 517910 501644 486416 472558 460326 449721 440397 431878
62426D31878p714o256m289k773k130j552j81J619K930L756M946O732Q320R014
$$ 431878 424164 417908 413619 410846 408716 407164 406983 408602 411532 415288 420234 426966 435286 444300
62412D44300R151R603J0719J1974J2511J1909J0497Q972P680O388M736K659L41
$$ 444300 453451 463054 473773 485747 498258 510167 520664 529636 537316 543704 548440 551099 551440
62399E51440j929l767m887n415n742o020o094o089o481p366q054p782o517m804
$$ 551440 549511 545744 540857 535442 529700 523680 517586 511497 505016 497650 489596 481814 475297 470493
62385D70493l091j513j32J030K092L291M911P216J0244J3654J7011K0154K3092
$$ 470493 467402 465889 465757 466787 468879 472170 477081 484297 494541 508195 525206 545360 568452
62372E68452K5708K8018L0572L3985L7993M1713M4795M7674N0488N2525N3114
$$ 568452 594160 622178 652750 686735 724728 766441 811236 858910 909398 961923 1015037
62361A015037N2476N1206M9438M6813M2820L6927K8826J9071Q928o46r475j7378
$$ 1015037 1067513 1118719 1168157 1214970 1257790 1294717 1323543 1342614 1351542 1350896 1341421 1324043
62349A324043k3631k7727l0169l1913l3384l4499l5317l6031l6510l6289l5026
$$ 1324043 1300412 1272685 1242516 1210603 1177219 1142720 1107403 1071372 1034862 998573 963547
62338I63547l2778k9987k7331k5249k3498k1512j9288j7492j6554j6172j5861
$$ 963547 930769 900782 873451 848202 824704 803192 783904 766412 749858 733686 717825
62327G17825j5414j4601j3086j0978q963p481o299n217m515m340m255l954l873
$$ 717825 702411 687810 674724 663746 654783 647302 641003 635786 631271 626931 622676 618722 614849
62314F14849m496n539o369o830p126p390p910r218j1179j2416j1581r110o945
$$ 614849 610353 604814 598445 591615 584489 577099 569189 559971 548792 536376 524795 515685 508740
62301E08740o439p073p334o315m340k362j015j31Q76K272L760M959N767O240O471
$$ 508740 502301 495228 487894 481579 477239 474877 473862 473731 474607 476879 480639 485598 491365 497605 504076
62286E04076O703P254Q178R269J0340J1203J1485J1071J0610J0962J2056J2941
$$ 504076 510779 518033 526211 535480 545820 557023 568508 579579 590189 601151 613207 626148
62274F26148J3045J2687J2331J2216J2700J4094J5919J7428J9045K2072K6601
$$ 626148 639193 651880 664211 676427 689127 703221 719140 736568 755613 777685 804286
62263H04286L1013L4236L7199M1039M5082M7754M8541M7821M5501M1110L4815
$$ 804286 835299 869535 906734 947773 992855 1040609 1089150 1136971 1182472 1223582 1258397
62252A258397K7135J8190Q266j297r039j4887j9721k3874k7163l0003l3082l6085
$$ 1258397 1285532 1303722 1311988 1310691 1301652 1286765 1267044 1243170 1216007 1186004 1152922 1116837
62240A116837l7976l8491l8181l7027l4385l0490k6774k4169k2088j9533j6466
$$ 1116837 1078861 1040370 1002189 965162 930777 900287 873513 849344 827256 807723 791257
62229G91257j3598j1468j0176r522r060q415p759p602p955q109p539o632o227
$$ 791257 777659 766191 756015 746493 737433 729018 721259 713657 705702 697593 690054 683422 677195
62216F77195o591p039o609n101l323k149j474n95N56J348J772K739M559O139O532
$$ 677195 670604 663565 656956 651855 648532 646383 644909 644314 644870 646218 647990 650729 655288 661427 667959
62201F67959O399O914P989Q785R456J0968J3374J5613J6979J7719J8128J8177
$$ 667959 674358 681272 689261 698046 707502 718470 731844 747457 764436 782155 800283 818460
62189H18460J8068J8106J7937J6909J5273J3949J3039J1697R786Q516Q876J0370
$$ 818460 836528 854634 872571 889480 904753 918702 931741 943438 953224 961740 970616 980986
62177I80986J1883J3070J4348J6108J8526K1734K5626K9735L3515L6493L8131
$$ 980986 992869 1005939 1020287 1036395 1054921 1076655 1102281 1132016 1165531 1202024 1240155
62166A240155L8022L6355L3725L0330K5754J9776J2972O473J368j817l550n121
$$ 1240155 1278177 1314532 1348257 1378587 1404341 1424117 1437089 1443562 1444930 1443113 1439563 1434442
62154A434442p494j0362j2823j4712j6536j8247j9031j8395j6671j4305j1554
$$ 1434442 1426948 1416586 1403763 1389051 1372515 1354268 1335237 1316842 1300171 1285866 1274312
62143A274312q956p249o465n915n323n171n571n724n018l901l051k292j019P51
$$ 1274312 1265356 1258107 1251642 1245727 1240404 1235233 1229662 1223938 1218920 1215019 1211968 1209676 1208657 1209408
62129A209408K476L892N202O647Q335J0281J2244J3731J4518J5021J5934J7602
$$ 1209408 1211884 1215776 1220978 1227625 1235960 1246241 1258485 1272216 1286734 1301755 1317689 1335291
62117A335291J9877K2285K4149K4969K4974K5111K6187K8088L0017L1264L1716
$$ 1335291 1355168 1377453 1401602 1426571 1451545 1476656 1502843 1530931 1560948 1592212 1623928
62106A623928L1840L2314L3509L5211L6958L8473L9594M0059L9944M0074M1295
$$ 1623928 1655768 1688082 1721591 1756802 1793760 1832233 1871827 1911886 1951830 1991904 2033199
62095B033199M3236M4640M5136M5884M7969N0917N3523N5565N7725N9969O0957
$$ 2033199 2076435 2121075 2166211 2212095 2260064 2310981 2364504 2420069 2477794 2537763 2598720
62084B598720N9475N5933N2038M9252M7851M7283M7026M6976M7180M7452M7236
$$ 2598720 2658195 2714128 2766166 2815418 2863269 2910552 2957578 3004554 3051734 3099186 3146422
62073C146422M5975M3769M1724M1291M2995M5934M8833N1308N3603N5366N5503
$$ 3146422 3192397 3236166 3277890 3319181 3362176 3408110 3456943 3508251 3561854 3617220 3672723
62062C672723N3431M9858M6077M3023M1088M0163L9501L8188L6157L4100L2265
$$ 3672723 3726154 3776012 3822089 3865112 3906200 3946363 3985864 4024052 4060209 4094309 4126574
62051D126574L0136K7693K5868K5087K4335K2666K0701J9561J9052J8155J6712
$$ 4126574 4156710 4184403 4210271 4235358 4259693 4282359 4303060 4322621 4341673 4359828 4376540
62040D376540J5277J3747J1527Q831O475M508K261l04k610m759p435j0438j2744
$$ 4376540 4391817 4405564 4417091 4425922 4432397 4436905 4439166 4438862 4436252 4431493 4424058 4413620 4400876
62027D400876j4216j5886j8068j9610j9603j8680j7890j7265j6277j4909j3497
$$ 4400876 4386660 4370774 4352706 4333096 4313493 4294813 4276923 4259658 4243381 4228472 4214975
62016D214975j2087j0570q996p257m960k030J000L643N979Q255J0475J2622J4737
$$ 4214975 4202888 4192318 4183322 4176065 4171105 4169075 4170075 4173718 4179697 4187952 4198427 4211049 4225786
62003D225786J6604J7823J8372J8650J8850J8726J7973J6255J3085Q423L267j226
$$ 4225786 4242390 4260213 4278585 4297235 4316085 4334811 4352784 4369039 4382124 4390547 4393814 4392588
61991D392588n081r052j2951j5769j7522j9621k2927k6667k9845l2559l5255l7742
$$ 4392588 4387507 4378455 4365504 4349735 4332213 4312592 4289665 4262998 4233153 4200594 4165339 4127597
61979D127597l9756m1636m3657m5391m6460m7191m7913m8310m8146m7948m8153
$$ 4127597 4087841 4046205 4002548 3957157 3910697 3863506 3815593 3767283 3719137 3671189 3623036
61968C623036m8293m7681m6434m5061m3565m1685l9650l7963l6682l5416l3878
$$ 3623036 3574743 3527062 3480628 3435567 3392002 3350317 3310667 3272704 3236022 3200606 3166728
61957C166728l2087l0316k8995k8238k7443k5883k3736k1766j9983j7645j4797
$$ 3166728 3134641 3104325 3075330 3047092 3019649 2993766 2970030 2948264 2928281 2910636 2895839
61946B895839j2559j1390j0273q311o137m815m291l745k747j235R24L486N673
$$ 2895839 2883280 2871890 2861617 2853306 2847169 2842354 2838063 2834318 2831571 2830336 2831260 2834746 2840419
61933B840419P263R117J1896J5015J7768K0626K4398K8906L3621L9007M5964N4399
$$ 2840419 2847682 2856799 2868695 2883710 2901478 2922104 2946502 2975408 3009029 3048036 3094000 3148399
61921C148399O3602P3758Q5909J00549J17364J36308J58029J83187K12091K44997
$$ 3148399 3212001 3285759 3371668 3472217 3589581 3725889 3883918 4067105 4279196 4524193
61911D524193K82198L23980L70966M24097M83698N48790O17745O88691P58096
$$ 4524193 4806391 5130371 5501337 5925434 6409132 6957922 7575667 8264358 9022454
61902I022454Q19042Q61353Q73042Q41587P56281O12856M17821J88309n2544k81206
$$ 9022454 9841496 10702849 11575891 12417478 13173759 13786615 14204436 14392745 14340201 14058995
61892A4058995m78212o31432p37201p98294q20565q11267p78899p32117o77721
$$ 14058995 13580783 12949351 12212150 11413856 10593291 9782024 9003125 8271008 7593287
61883G593287o20056n62117n06258m53965m05981l62937l25107k91709k61484
$$ 7593287 6973231 6411114 5904856 5450891 5044910 4681973 4356866 4065157 3803673
61874C803673k34083k10004j89188j70675j53797j38696j25476j13726j03229
$$ 3803673 3569590 3359586 3170398 2999723 2845926 2707230 2581754 2468028 2364799
61865B364799r4191q6459p9228p1936o4857n8462n2845m7974m3895m0371l6852
$$ 2364799 2270608 2184149 2104921 2032985 1968128 1909666 1856821 1808847 1764952 1724581 1687729
61854A687729l3117k9479k6191k3088j9998j7039j4417j2334j1071j0599j0194
$$ 1687729 1654612 1625133 1598942 1575854 1555856 1538817 1524400 1512066 1500995 1490396 1480202
61843A480202r062p414o216n848n710n242m535l741k673j338j70O45J478K520
$$ 1480202 1471140 1463726 1457510 1451662 1445952 1440710 1436175 1432434 1429761 1428423 1428253 1428898 1430376 1432896
61829A432896L282L286K785K419K517L036L813M617N331O273P921J0146J2245
$$ 1432896 1436178 1439464 1442249 1444668 1447185 1450221 1454034 1458651 1463982 1470255 1478176 1488322 1500567
61816A500567J3958J5876J8454K1224K3550K5705K8509L2049L5537L8511M1612
$$ 1500567 1514525 1530401 1548855 1570079 1593629 1619334 1647843 1679892 1715429 1753940 1795552
61805A795552M5844N1297N7043O2314O7471P3468Q0449Q7450R3804J00422J09081
$$ 1795552 1841396 1892693 1949736 2012050 2079521 2152989 2233438 2320888 2414692 2515114 2624195
61794B624195J20511J33815J47774J62317J78500J97497K19905K45813K75272
$$ 2624195 2744706 2878521 3026295 3188612 3367112 3564609 3784514 4030327 4305599
61785D305599L08673L46746L90244M39834M96369N60920O34270P16604Q08027
$$ 4305599 4614272 4961018 5351262 5791096 6287465 6848385 7482655 8199259 9007286
61776I007286R09015J019605J137947J259597J377416J480679J553585J575233
$$ 9007286 9916301 10935906 12073853 13333450 14710866 16191545 17745130 19320363
61768A9320363J522678J376777J129408P89509L84463m5538m57974q17733j102198
$$ 19320363 20843041 22219818 23349226 24138735 24523198 24477660 24019686 23201953 22099755
61759B2099755j301974j419235j464574j452776j399037j317028j218422j112654
$$ 22099755 20797781 19378546 17913972 16461196 15062159 13745131 12526709 11414055
61751A1414055j006595r04768q10033p24003o46985n78126n16308m61143m12900
$$ 11414055 10407460 9502692 8692659 7968656 7321671 6743545 6227237 5766094 5353194
61742E353194l71309l34841l01668k71278k44435k21494k01450j83058j66123
$$ 5353194 4981885 4647044 4345376 4074098 3829663 3608169 3406719 3223661 3057538
61733C057538j51012j37411j24579j12504j01887r2946q5098p7996p1985o7209
$$ 3057538 2906526 2769115 2644536 2532032 2430145 2337199 2252101 2174105 2102120 2034911
61723B034911o2971n8510n3849m9424m5292m1241l7452l4387l2059k9884k7418
$$ 2034911 1971940 1913430 1859581 1810157 1764865 1723624 1686172 1651785 1619726 1589842 1562424
61712A562424k4833k2567k0706j9057j7700j7095j7434j8177j8575j8489j8405
$$ 1562424 1537591 1515024 1494318 1475261 1457561 1440466 1423032 1404855 1386280 1367791 1349386
61701A349386j8697j9319k0137k1014k1446k0793j9245j8042j8209j9279j9813
$$ 1349386 1330689 1311370 1291233 1270219 1248773 1227980 1208735 1190693 1172484 1153205 1133392
61690A133392j8934j7041j5182j4131j3937j3970j3507j2430j1204j0042q560
$$ 1133392 1114458 1097417 1082235 1068104 1054167 1040197 1026690 1014260 1003056 993014 984454
61679I84454o507m387k954k418k514l028l718m042l470j938K09K353L548L059
$$ 984454 977947 973560 970606 968188 965674 962646 958928 954886 951416 949478 949687 952040 955588 958647
61665I58647J411J61Jj85j586l534m405l953l457l801m626n395o039o408o126
$$ 958647 960058 960219 960220 960035 958449 954915 950510 946557 943100 939299 934673 929278 923239 916831 910705
61650I10705n369m923n162n610n743n525n024m185l234k596k251j769j080n50
$$ 910705 905336 900413 895251 889641 883898 878373 873349 869164 865930 863334 861083 859314 858234 857684
61636H57684j82M55J400K194K848M010N845P467Q012P631O985O385N859N503N214
$$ 857684 857502 857957 859357 861551 864399 868409 874254 881721 889733 897364 904349 910734 916593 922096 927310
61621I27310M589L572K785K733L018K896K282J677J320R15J70q17j854k963m302
$$ 927310 931899 935471 938256 940989 944007 946903 949185 950862 952182 953097 953267 952450 950596 947633 943331
61606I43331n811p094p795q048q338q828r071q622p696o870o447o393o599o725
$$ 943331 937520 930426 922631 914583 906245 897417 888346 879724 872028 865158 858711 852318 845719 838994
61592H38994o158m648k782j236J21J652K913L171K843L359N326P831R838J1433
$$ 838994 832836 828188 825406 824170 824291 825943 828856 832027 834870 838229 843555 851386 861224 872657
61578H72657J3226J5291J7307J9182K0981K2578K3909K5289K7063K9118L1015
$$ 872657 885883 901174 918481 937663 958644 981222 1005131 1030420 1057483 1086601 1117616
61567A117616L2419L3242L3563L3630L3705L3764L3489L2525L0690K8044K5074
$$ 1117616 1150035 1183277 1216840 1250470 1284175 1317939 1351428 1383953 1414643 1442687 1467761
61556A467761K2599K1109K0289J9524J8688J7937J6968J5139J2270Q755M992J193
$$ 1467761 1490360 1511469 1531758 1551282 1569970 1587907 1604875 1620014 1632284 1641039 1646031 1647224
61544A647224k369n614q931j2495j5498j6937j7117j7326j7973j8076j6961j5360
$$ 1647224 1644855 1639241 1630310 1617815 1602317 1585380 1568263 1550937 1532964 1514888 1497927 1482567
61532A482567j4261j3526j2350j0432q088n580k977l94K097M699P752J1503J5996
$$ 1482567 1468306 1454780 1442430 1431998 1423910 1418330 1415353 1414959 1417056 1421755 1429507 1441010 1457006
61519A457006K0986K6042L1106L6818M3851N2017O0642O9668P9632R0620J02150
$$ 1457006 1477992 1504034 1535140 1571958 1615809 1667826 1728468 1798136 1877768 1968388 2070538
61508B070538J14269J27899J43758J61615J80853K01075K21845K42431K62032
$$ 2070538 2184807 2312706 2456464 2618079 2798932 3000007 3221852 3464283 3726315
61499C726315K79571K92946K99068K94914K78262K47860K04131J50140R0936L1346
$$ 3726315 4005886 4298832 4597900 4892814 5171076 5418936 5623067 5773207 5864143 5895489
61489E895489k5268p6372j19703j53954j79136j95721k04160k05517k01613j93909
$$ 5895489 5870221 5793849 5674146 5520192 5341056 5145335 4941175 4735658 4534045 4340136
61479D340136j82911j69149j53890j38292j22589j06729r1107p6059o1316m6701
$$ 4340136 4157225 3988076 3834186 3695894 3573305 3466576 3375469 3299410 3238094 3191393
61469C191393l2781k0180q744K011J2085K1191K9275L6350M2218M6755M9922N1254
$$ 3191393 3158612 3138432 3129688 3131699 3143784 3164975 3194250 3230600 3272818 3319573 3369495 3420749
61457C420749N0121M6923M3265M0251L7426L4050L0667K8502K8000K8818L0823
$$ 3420749 3470870 3517793 3561058 3601309 3638735 3672785 3703452 3731954 3759954 3788772 3819595
61446C819595L4162L8559M3377M8288N3272N8140O2491O5877O7695O7279O4508
$$ 3819595 3853757 3892316 3935693 3983981 4037253 4095393 4157884 4223761 4291456 4358735 4423243
61435D423243N9854N3508M4938L3811K0786P000o726j9761l1411m1338m9674n6264
$$ 4423243 4483097 4536605 4581543 4615354 4636140 4643140 4636414 4616653 4585242 4543904 4494230 4437966
61423D437966o0485o2258o2441o1564n9042n4374m8354m2069l5498k8092k0218
$$ 4437966 4377481 4315223 4252782 4191218 4132176 4077802 4029448 3987379 3951881 3923789 3903571
61412C903571j2875o351k19N540J0419J4243J7218J9133J9307J7282J3136P298
$$ 3903571 3890696 3884345 3884126 3889666 3900085 3914328 3931546 3950679 3969986 3987268 4000404 4007702
61400D007702O38n571j0342j3459j4971j4647j2369q414k678N696J7208L1108
$$ 4007702 4008340 4002769 3992427 3978968 3963997 3949350 3936981 3928567 3925889 3931585 3948793 3979901
61388C979901M6485O3521Q2729J03548J24943J46981J70532J95558K20851K45431
$$ 3979901 4026386 4089907 4172636 4276184 4401127 4548108 4718640 4914198 5135049 5380480
61378E380480K68939K90476L07920L18621L20156L10452K88064K52771K05814
$$ 5380480 5649419 5939895 6247815 6566436 6886592 7197044 7485108 7737879 7943693
61369G943693J49887Q9263K9122k6453p5972j19684j57783j90230k17578k40574
$$ 7943693 8093580 8182843 8211965 8185512 8109540 7989856 7832073 7641843 7424265 7183691
61359G183691k58969k71865k79192k81844k80398k74888k65914k54838k42562
$$ 7183691 6924722 6652857 6373665 6091821 5811423 5536535 5270621 5015783 4773221
61350D773221k28980k13933j97874j81398j64862j48725j33416j18683j03777
$$ 4773221 4544241 4330308 4132434 3951036 3786174 3637449 3504033 3385350 3281573
61341C281573q8569p3826o0234m7746l6080k5177j4955n274L751J1933J9574K7136
$$ 3281573 3193004 3119178 3058944 3011198 2975118 2949941 2934986 2929712 2933463 2945396 2964970 2992106
61329B992106L4229L9773M3347M5674M7427M8321M7804M6072M3863M1662L9472
$$ 2992106 3026335 3066108 3109455 3155129 3202556 3250877 3298681 3344753 3388616 3430278 3469750
61318C469750L7082L4320L1261K8477K6694K6085K6055K5844K5096K3801K1938
$$ 3469750 3506832 3541152 3572413 3600890 3627584 3653669 3679724 3705568 3730664 3754465 3776403
61307C776403J9279J5372R809K795m757j1942j8564k4929l1199l7365m3509m9574
$$ 3776403 3795682 3811054 3820863 3823658 3818901 3806959 3788395 3763466 3732267 3694902 3651393 3601819
61295C601819n5083n9583o3191o6190o8335o9029o8002o5333o1131n5711m9781
$$ 3601819 3546736 3487153 3423962 3357772 3289437 3220408 3152406 3087073 3025942 2970231 2920450
61284B920450m3782l7449l0593k3935j8286j3400q625m418j975j483j912k618
$$ 2920450 2876668 2839219 2808626 2784691 2766405 2753005 2744380 2739962 2737987 2736504 2734592 2731974
61272B731974m054o517r303j1517j3015j4134j5113j6027j6718j6572j4997j2175
$$ 2731974 2727920 2721403 2712100 2700583 2687568 2673434 2658321 2642294 2625576 2609004 2594007 2581832
61260B581832q757m703Q00Q217J7229K7547L9283N2197O5441P8486R1615J05134
$$ 2581832 2573075 2568372 2569172 2577389 2594618 2622165 2661448 2713645 2779086 2857572 2949187 3054321
61248C054321J18603J31175J41980J49796J52883J49592J38844J19942R2641N7789
$$ 3054321 3172924 3304099 3446079 3595875 3748758 3898350 4037194 4157136 4249777 4307566
61238D307566J7549k5186o7255j05243j36087j58270j72154j78883j79433j74779
$$ 4307566 4325115 4299929 4232674 4127431 3991344 3833074 3660920 3482037 3302604 3127825
61228C127825j66293j55431j43361j30996j19043j07772r7138q7166p7879o9022
$$ 3127825 2961532 2806101 2662740 2531744 2412701 2304929 2207791 2120625 2042746 1973724
61218A973724o0421n2593m6258m1221l6536l1771k7337k3429j9559j5405j1273
$$ 1973724 1913303 1860710 1814452 1773231 1736695 1704924 1677587 1654158 1634599 1619194 1607921
61207A607921p368l447N09L978O714R101J1303J2804J3226J2882J2026J0300P559
$$ 1607921 1600553 1597106 1597615 1601593 1608307 1617408 1628711 1641515 1654741 1667623 1679649 1689949 1697508
61194A697508M596K305N90j297l650o080q100r581j0857j2550j4903j7277j8888
$$ 1697508 1702104 1704409 1704999 1703702 1700052 1693972 1685872 1676291 1665434 1652884 1637981 1620704 1601816
61181A601816k0042k1749k3976k5434k5478k5086k5197k5243k4373k3159k2799
$$ 1601816 1581774 1560025 1536049 1510615 1485137 1460051 1434854 1409611 1385238 1362079 1339280
61170A339280k3257k3510k3295k3282k3695k3999k3991k4157k4743k5346k5549
$$ 1339280 1316023 1292513 1269218 1245936 1222241 1198242 1174251 1150094 1125351 1100005 1074456
61159A074456k5213k4030k1671j8616j6143j5090j5204j5900j7063j8725k0435
$$ 1074456 1049243 1025213 1003542 984926 968783 953693 938489 922589 905526 886801 866366
61148H66366k1419k1237k0029j8268j6450j4810j3218j1434r500p697o165m794
$$ 866366 844947 823710 803681 785413 768963 754153 740935 729501 720001 712304 706139 701345
61136G01345l457k122p19P89K224L333M145M909N720O406O854P160P444P820Q506
$$ 701345 697888 695766 695047 695836 698060 701393 705538 710447 716167 722573 729427 736587 744031 751851 760357
61121G60357R705J1223J2499J3163J3381J3542J3762J3868J3722J3392J3011J2590
$$ 760357 770062 781285 793784 806947 820328 833870 847632 861500 875222 888614 901625 914215
61109I14215J1862J0386P879M521Q47k665n775q341j0168j1154j1443j1311j1023
$$ 914215 926077 936463 944342 948863 949710 947045 941270 932929 922761 911607 900164 888853 877830
61096H77830j0793j0731j0706j0445r895r415r364r668r930r915r679r266q629
$$ 877830 867037 856306 845600 835155 825260 815845 806481 796813 786883 776968 767289 758023 749394
61083G49394p847p166o709o385o125n954n720n103m077k988k035j048q0K50m54
$$ 749394 741547 734381 727672 721287 715162 709208 703488 698385 694308 691320 689285 688237 688157 688407 687953
61068F87953j597k252k378k657l235l457l009k539k796l602m145l942l137k159
$$ 687953 686356 684104 681726 679069 675834 672377 669368 666829 664033 660431 656286 652344 649207 647048
61054F47048j347p38j2J160K632L851M495M842N376O281P411Q504R337R839J0027
$$ 647048 645701 644963 644951 646111 648743 652594 657089 661931 667307 673588 680999 689503 698840 708679 718706
61039G18706R862R268Q466P934P817P723P427P276P395P132O018M808M568N171
$$ 718706 728568 737836 746302 754236 762053 769776 777203 784479 791874 799006 805024 809832 814400 819571
61025H19571N684N884O223O625O685O832P825R164R547R100R416J1120J2951J3873
$$ 819571 825255 831139 837362 843987 850672 857504 865329 874493 884040 893140 902556 913676 926627 940500
61011I40500J4541J5950J8003K0117K2135K3928K5357K7052L0062L4199L8176
$$ 940500 955041 970991 988994 1009111 1031246 1055174 1080531 1107583 1137645 1171844 1210020
61000A210020M1713M5989N1471N6995O1488O4913O7111O7828O8493P1711P8079
$$ 1210020 1251733 1297722 1349193 1406188 1467676 1532589 1599700 1667528 1736021 1807732 1885811
60989A885811Q5793R4102J04483J17358J30692J43346J56878J72824J91730K16478
$$ 1885811 1971604 2065706 2170189 2287547 2418239 2561585 2718463 2891287 3083017 3299495
60979C299495K52272L00929L59715M28621N13472O18585P43453Q92252J078768
$$ 3299495 3551767 3852696 4212411 4641032 5154504 5773089 6516542 7408794 8487562
60970H487562J314893J604898J960460K395976K863714L188573L125821K551078
$$ 8487562 9802455 11407353 13367813 15763789 18627503 21816076 24941897 27492975
60962B7492975J606442O28644q3736m26425m40288j85359K69090P49510R68830
$$ 27492975 29099417 29728061 29644325 29217900 28777612 28592253 28861343 29610853 30579683
60953C0579683O94991n6226j017959j867193k420225k667553k682953k541218
$$ 30579683 31274674 31218448 30200489 28333296 25913071 23245518 20562565 18021347
60945A8021347k302810k022745j743437j485160j253853j053453q85826p46590
$$ 18021347 15718537 13695792 11952355 10467195 9213342 8159889 7274063 6527473
60937F527473o29507n32507m55147l93839l44143l04644k74361k49201k25195
$$ 6527473 5897966 5365459 4910312 4516473 4172330 3867686 3593325 3344124 3118929
60928C118929k02912j84653j69342j54001j38444j24550j12329j00467q9753q2403
$$ 3118929 2916017 2731364 2562022 2408021 2269577 2145027 2032698 1932231 1842478 1760075
60918A760075p8425p5713p3153p0941o8422o4401n9286n4570n0463m6102m1582
$$ 1760075 1681650 1605937 1532784 1461843 1393421 1329020 1269734 1215164 1164701 1118599 1077017
60907A077017l7688l4235l0579k7222k5049k3631k1966k0077j8291j5965j2742
$$ 1077017 1039329 1005094 974515 947293 922244 898613 876647 856570 838279 822314 809572
60896H09572r947q729p983o070l476j660m21J252K828L155K786K970L230K414
$$ 809572 799625 790896 782913 776843 773367 771707 771286 772538 775366 778521 781307 784277 787507 789921
60882G89921J208R68Q85q47l655n279n426n797o729o877o243o526q035q989q544
$$ 789921 791129 792097 792982 792135 788480 783201 777775 771978 765249 758372 752129 745603 737568 728579 720035
60867G20035p882p785p536o974p163q125q142o376m231l077k347j005O27J619
$$ 720035 712153 704368 696832 689858 682695 674570 666428 660052 655821 652744 650397 649392 650019 651638
60853F51638J912K121K753M090O029P782Q734R598J1554J4251J6106J6547J6490
$$ 651638 653550 655671 658424 662514 668543 676325 685059 694657 706211 720462 736568 753115 769605
60840G69605J6480J5996J4865J3853J3346J2766J1713J0476R174P574N950M983
$$ 769605 786085 802081 816946 830799 844145 856911 868624 879100 888274 895848 901798 906781
60828I06781M698M608M798N538O001M967K827J292R54P42j10j173k171l544n298
$$ 906781 911479 916087 920885 926423 932424 937391 940218 941510 942464 943206 943096 941923 939752 936208 930910
60813I30910o724p616q475r316r679r884j0738j1854j1982j1144j0712j1045j0909
$$ 930910 924186 916570 908095 898779 889100 879216 868478 856624 844642 833498 822786 811741 800832
60800H00832r712q465p868p152n590l646j802K46K473M036M753N716P658R810
$$ 800832 791120 782655 774787 767635 762045 758399 756597 756843 759316 763352 768105 773821 781479 791289
60786G91289J1166J1708J1812J1554J1255J1484J2006J1815J0687R535Q813P919
$$ 791289 802455 814163 825975 837529 848784 860268 872274 884089 894776 904311 913124 921043
60774I21043O657N759N415M712L323K296K266K330J651R03J005J593J817J732
$$ 921043 927700 933459 938874 943586 946909 949205 951471 953801 955452 956355 957360 958953 960770 962502
60760I62502J815J957J874J810J985K022J655J282J304J511J732K194K857L205
$$ 962502 964317 966274 968148 969958 971943 973965 975620 976902 978206 979717 981449 983643 986500 989705
60746I89705L171L361L873L888K928J635P65K97k2k32o35j683k986l508l208l267
$$ 989705 992876 996237 1000110 1003998 1006926 1008561 1009326 1009623 1009601 1009369 1008734 1007051 1004065 1000557 997349 994082
60730I94082m176m879m433l321k404j700j106j119j932k730k779k504k747l727
$$ 994082 989906 985027 980594 977273 974869 973169 972063 970944 969012 966282 963503 960999 958252 954525
60716I54525n279p269r234j0453j0927j1313j1538j0696q862p621p906q505p726
$$ 954525 949246 941977 932743 922290 911363 900050 888512 877816 868954 861333 853427 844922 837196
60703H37196n491k866n04J456K805L603M389N275N565M903L928L043J527j189
$$ 837196 831705 828839 828335 829791 832596 836199 840588 845863 851428 856331 860259 863302 864829 863640
60689H63640m323o698q202r407j0477j1293j1990j2522j2372j1420j0418r953
$$ 863640 859317 852619 844417 835010 824533 813240 801250 788728 776356 764936 754518 744565
60677G44565r594q706p360n851m135k339j014j97Q89K551L911M222L929L763L633
$$ 744565 734971 726265 718905 713054 708919 706580 705566 705369 706258 708809 712720 716942 720871 724634 728267
60662G28267L208K683K193J314n3j131j350j147r94n74L41J184J662K524M287
$$ 728267 731475 734158 736351 737665 737612 736481 735131 733984 732990 732416 732757 733941 735603 738127 742414
60647G42414O044O577N956N112M451L774K988K138J305J010J999M097O085P248
$$ 742414 748458 755035 760991 766103 770554 774328 777316 779454 780759 781769 783768 787865 793950 801198
60633H01198Q116R213J0216J0936J1932J3437J4853J5973J7323J8529J7996J5325
$$ 801198 809314 818527 828743 839679 851611 865048 879901 895874 913197 931726 949722 965047
60621I65047J2524J1377J0984R420O521L368J80l355o481q044q383q864r844j0479
$$ 965047 977571 988948 999932 1009352 1015873 1019241 1019421 1016066 1009585 1001541 993158 984294 974450 963971
60607I63971j0282r528q409o967n557m391l046j376l29p89k181l253l684l881
$$ 963971 953689 944161 935752 928785 923228 918837 915791 914415 914086 913297 911116 907863 904179 900298
60593I00298l944l862m020m431m220k971j687j271j062j53P92O68o3k05J00j37
$$ 900298 896354 892492 888472 884041 879821 876850 875163 873892 872830 872677 873469 874137 874074 873869 873969 873832
60577H73832p76q44k95K48J037K721M652N528N389N269N088L806J597j21r71k118
$$ 873832 873056 872212 871917 872165 873202 875923 880575 886103 891492 896761 901849 905655 907252 907131 906160 904042
60561I04042m164o207p433q081q452q288p637p047o484n177l003r38K50Q15J270
$$ 904042 899878 893671 886238 878157 869705 861417 853780 846733 840249 835072 832069 831131 831381 832196 833466
60546H33466J782K564L905N520O756P680R127J1586J4829J8758K3649K9355L5026
$$ 833466 835248 837812 841717 847237 853993 861673 870800 882386 897215 915973 939622 968977 1004003
60533A004003L9743M2736M3014L9726L3036K3950J3321J880q951j7417k2826k5767
$$ 1004003 1043746 1086482 1129496 1169222 1202258 1226208 1239529 1241409 1232458 1215041 1192215 1166448
60521A166448k6821k5908k2997j8610j3330p609k154K194N244P505R331J0552
$$ 1166448 1139627 1113719 1090722 1072112 1058782 1051173 1049019 1051213 1056457 1063962 1073293 1083845
60509A083845J1015J0901J0382R470Q387P747Q261J0342J3843J8099K2625K7842
$$ 1083845 1094860 1105761 1116143 1125613 1134000 1141747 1150008 1160350 1174193 1192292 1214917 1242759
60497A242759L4522M2525N0999O0072P1110Q4690R9631J14830J30841J48628J68086
$$ 1242759 1277281 1319806 1370805 1430877 1501987 1586677 1686308 1801138 1931979 2080607 2248693
60486B248693J89251K13661K42785K76051L11850L48920L83821M07659M08518
$$ 2248693 2437944 2651605 2894390 3170441 3482291 3831211 4215032 4622691 5031209
60477E031209L78524L17420K29819J21731R59j21285k31635l18398l75050m01732
$$ 5031209 5409733 5727153 5956972 6078703 6079662 5958377 5726742 5408344 5033294 4631562
60467D631562m04008l89373l63967l32078k97290k62565k29498j98847j71674
$$ 4631562 4227554 3838181 3474214 3142136 2844846 2582281 2352783 2153936 1982262
60458A982262j48820j29591j12501r7331q4986p5401o7141n9322n2457m7035m2584
$$ 1982262 1833442 1703851 1591350 1494019 1409033 1333632 1266491 1207169 1154712 1107677 1065093
60447A065093l8577l5024l1811k8505k5232k2756k1393k0654k0140j9722j8919
$$ 1065093 1026516 991492 959681 931176 905944 883188 861795 841141 821001 801279 782360
60436G82360j7155j4841j3118j2300j1621j0527r207p739n920m101l021k615k075
$$ 782360 765205 750364 737246 724946 713325 702798 693591 685852 679932 675831 672810 670195 668120
60423F68120j230p64r02r91o03N3R39K286L699M311M040L599L232K598K006K354
$$ 668120 666890 666126 665224 664233 663630 663683 664622 666908 670607 674918 678958 682557 685789 688387 690393 692747
60407F92747L525M237L905L441L704M363M762M853M707M144L360L050L468M117
$$ 692747 696272 700509 704414 707855 711559 715922 720684 725537 730244 734388 737748 740798 744266 748383
60393G48383M639N147N502N251M513L944L653L036J855N34p14j963k859k939k695
$$ 748383 753022 758169 763671 768922 773435 777379 781032 784068 785923 786457 785743 783780 780921 777982 775287
60378G75287l058l762l601k466j674j910k326k058j292l82P00J575J437M35j67
$$ 775287 772229 768467 764866 762400 760726 758816 756490 754432 753140 752758 753458 755033 756470 756905 756738
60363G56738K43Q98J144J345J856K336K712L476M513M970M835N289O742Q039Q439
$$ 756738 756981 757879 759023 760368 762224 764560 767272 770748 775261 780231 785066 790355 797097 805136 813575
60348H13575Q925J0441J2131J2586J1830J0923J0368J0004R747R440Q552O868
$$ 813575 822500 832941 845072 857658 869488 880411 890779 900783 910530 919970 928522 935390
60336I35390M963L422K228J415J488K490L582M186M808O112P942R731J1090J1524
$$ 935390 940353 943775 946003 947418 948906 951396 954978 959164 963972 970084 978026 987757 998847 1010371
60322A010371J0494Q312O048L990J213k713o711r545j1135j1797j1320r729p978
$$ 1010371 1020865 1029177 1035225 1039215 1040428 1037715 1031004 1021459 1010324 998527 987207 977478 969500
60309I69500o842n878m474l062k388k242j860j022J06J624L530N288O443P271
$$ 969500 962658 956780 952306 949244 946856 944614 942754 941732 941838 943462 946992 952280 958723 965994
60295I65994Q128Q781Q873Q521P836O477M254J615r23l219n103o275o926p623
$$ 965994 974122 982903 991776 1000297 1008133 1014610 1018864 1020479 1019556 1016337 1011234 1004959 998033 990410
60281I90410q213p782o113m106k373n52J442K825L384M212O115Q290R681J0571
$$ 990410 982197 974415 968302 964196 961823 961271 962713 965538 968922 973134 979249 987539 997220 1007791
60267A007791J1817J3442J5074J6922J9260K1655K3849K6616L0718L5521L9795
$$ 1007791 1019608 1033050 1048124 1065046 1084306 1105961 1129810 1156426 1187144 1222665 1262460
60256A262460M3399M7213N1828N7183O3102O9454P6047Q3024R0860R9497J08088
$$ 1262460 1305859 1353072 1404900 1462083 1525185 1594639 1670686 1753710 1844570 1944067 2052155
60245B052155J15953J23105J29316J33632J35452J35166J33013J28323J20671
$$ 2052155 2168108 2291213 2420529 2554161 2689613 2824779 2957792 3086115 3206786
60236C206786J10833R9650Q6896P2206N6284M0133K3858P294q862k3546l6378
$$ 3206786 3317619 3417269 3504165 3576371 3632655 3672788 3696646 3703940 3695078 3671532 3635154
60225C635154m7241n5459o0290o1759o0198n5655m8558m0073l0910k0476q164
$$ 3635154 3587913 3532454 3472164 3410405 3350207 3294552 3245994 3205921 3175011 3154535 3146371
60214C146371N271J8692L2151M6409O1393P6266R0544J04164J16850J28182J37783
$$ 3146371 3151642 3170334 3202485 3248894 3310287 3386553 3477097 3581261 3698111 3826293 3964076
60203C964076J44684J47308J44952J38577J29297J16850J00656Q1497O0905L9492
$$ 3964076 4108760 4256068 4401020 4539597 4668894 4785744 4886400 4967897 5028802 5068294
60193E068294J7139n747k8328n0293p1354r0184j05065j15408j21594j23663j21194
$$ 5068294 5085433 5079686 5051358 5001065 4929711 4839527 4734462 4619054 4497460 4373797 4252603
60182D252603j14396j04332r2114p8468o3765m7771k9892j0334R427K8090M5744
$$ 4252603 4138207 4033875 3941761 3863293 3799528 3751757 3721865 3711531 3720958 3749048 3794792
60171C794792O2822P8531R1416J00900J07074J09410J06919R9498Q8223P4328
$$ 3794792 3857614 3936145 4027561 4128461 4235535 4344945 4451864 4551362 4639585 4713913
60161D713913N8645M1809K4337O663j0479k6041l9338n0095n7454n9921n6921
$$ 4713913 4772558 4814367 4838704 4845367 4834888 4808847 4769509 4719414 4661960 4602039 4545118
60150D545118m9544l9054k5601r262Q769K7215M6093O5938Q6394J06756J27210
$$ 4545118 4495574 4456520 4430919 4421657 4430426 4457641 4503734 4569672 4656066 4762822 4890032
60139D890032J48472J70737J94010K18714K45044K72258K99497L26366L51814
$$ 4890032 5038504 5209241 5403251 5621965 5867009 6139267 6438764 6765130 7116944
60130G116944L73589L90050M01562M08723M10284M04231L90017L68206L38933
$$ 7116944 7490533 7880583 8282145 8690868 9101152 9505383 9895400 10263606 10602539
60121A0602539L02423K60216K14099J64449J11282N6083P56n4529j10252j64874
$$ 10602539 10904962 11165178 11379277 11543726 11655008 11711091 11711847 11657318 11547066 11382192
60111A1382192k15394k60170k99046l30794l52870l63979l64840l56182l38157
$$ 11382192 11166798 10906628 10607582 10276788 9923918 9559939 9195099 8838917 8500760
60102H500760l12190k81340k47868k11928j73367j33397r3681n4986j7445J8798
$$ 8500760 8188570 7907230 7659362 7447434 7274067 7140670 7046989 6992003 6974558 6993356
60092F993356N3598Q6466J15756J39164J55352J64178J65281J57736J41480J17946
$$ 6993356 7046954 7133420 7249176 7388340 7543692 7707870 7873151 8030887 8172367 8290313
60082H290313Q8892N5645J9940j5664m9053p9674j07977j34291j58408j79674
$$ 8290313 8379205 8434850 8454790 8439126 8390073 8310399 8202422 8068131 7909723 7730049
60072G730049j97281k10848k20592k26456k27522k23237k14752k03963j91428
$$ 7730049 7532768 7321920 7101328 6874872 6647350 6424113 6209361 6005398 5813970
60063E813970j76500j59313j41099j22395j02401q0633n8023l5819j4260P147
$$ 5813970 5637470 5478157 5337058 5214663 5112262 5031629 4973606 4937787 4923527 4930674
60053D930674K8710N0344P1708R2122J10702J26535J38494J45226J46007J41310
$$ 4930674 4959384 5009728 5081436 5173558 5284260 5410795 5549289 5694515 5840522 5981832
60043E981832J31879J17676R8599P5697N0536K3735m685l3801o1954q8310j12877
$$ 5981832 6113711 6231387 6329986 6405683 6456219 6479954 6475269 6441468 6379514 6291204 6178327
60032F178327j34923j52680j64888j71606j73366j70610j64080j54724j42883
$$ 6178327 6043404 5890724 5725836 5554230 5380864 5210254 5046174 4891450 4748567
60023D748567j28417j11720r3860p5697n7585l9705k1759k681J8241M0128O1511
$$ 4748567 4620150 4508430 4414570 4338873 4281288 4241583 4219824 4217143 4235384 4275512 4337023
60012D337023Q2332J03638J25580J47121J67593J86807K03421K14781K19118K16672
$$ 4337023 4419355 4522993 4648573 4795694 4963287 5150094 5353515 5568296 5787414 6004086
60002F004086K08167J93431J72261J45649J15381Q3038M9805J6572j6314m8914
$$ 6004086 6212253 6405684 6577945 6723594 6838975 6922013 6971818 6988390 6972076 6923162
59992F923162q0856j10897j37263j58209j72466j79794j80900j76443j66516j51737
$$ 6923162 6842306 6731409 6594146 6435937 6263471 6083677 5902777 5726334 5559818 5408081
59982E408081j34009j15250r5824p5272n3912l2524j1032J0987L2836N3146P1480
$$ 5408081 5274072 5158822 5062998 4987726 4933814 4901290 4890258 4901245 4934081 4987227 5058707
59971E058707Q8021J01977J11965J17908J20963J21521J18843J12749J04129R3555
$$ 5058707 5146728 5248705 5360670 5478578 5599541 5721062 5839905 5952654 6056783 6150338
59961F150338Q0890O6449N1208L5691J9983M970p887j8178k6503l2653l5197l3126
$$ 6150338 6231228 6297677 6348885 6384576 6404559 6409529 6401642 6383464 6356961 6324308 6289111 6255985
59949F255985k6486j5271P88K1153M4749P1550J02398J37017J73922K12550K53723
$$ 6255985 6229499 6214228 6215016 6236169 6280918 6352468 6454866 6591883 6765805 6978355 7232078
59938G232078K97437L41927L85540M27821M67823N02765N29218N44294N44896
$$ 7232078 7529515 7871442 8256982 8684803 9152626 9655391 10184609 10728903 11273799
59929A1273799N27221M88246M27155L45109K45083J32676J5641r8647k04801k98466
$$ 11273799 11801020 12289266 12716421 13061530 13306613 13439289 13454930 13356283 13151482 12853016
59919A2853016l75361m32471m69453m88079m90847m80433m59480m30182l94491
$$ 12853016 12477655 12045184 11575731 11087652 10596805 10116372 9656892 9226710 8832219
59910H832219l54725l13041k70297k26563j82775j40580j00336o0741k0795J9078
$$ 8832219 8477494 8164453 7894156 7667593 7484818 7344238 7243902 7183161 7162366 7181444
59900G181444N8160R6188J32466J65564J94438K18588K36721K46553K46342K35292
$$ 7181444 7239604 7335792 7468258 7633822 7828260 8046848 8283569 8530122 8776464 9011756
59890I011756K12233J75706J26117O6399P5o9818j39388k03471k57887l01044
$$ 9011756 9223989 9399695 9525812 9592211 9592286 9522468 9383080 9179609 8921722 8620678
59880H620678l32664l52464l60927l59884l51146l35685l14810k90812k65432
$$ 8620678 8288014 7935550 7574623 7214739 6863593 6527908 6213098 5922286 5656854
59871E656854k39016k12046j86217j62967j42315j24198j09700r9762r3772r0565
$$ 5656854 5417838 5205792 5019575 4856608 4714293 4590095 4480395 4380633 4286861 4196296
59861D196296q9663r0507r1510r1168q9274q6091q1183p4064o5129n5007m3873
$$ 4196296 4106633 4016126 3924616 3833448 3744174 3658083 3576900 3502836 3437707 3382700 3338827
59850C338827l2192k1259j2101m774M63K383J00n776j4073k4136l5077m5009n2219
$$ 3338827 3306635 3285376 3273275 3268501 3268964 3271347 3271447 3265671 3251598 3227462 3192385 3147376 3095157
59837C095157n6399n7976n7104n4001m9301m3294l5756k7223j9277j2695o412
$$ 3095157 3038758 2980782 2923678 2869677 2820376 2777082 2741326 2714103 2694826 2682131 2675719
59826B675719Q28Q853J6913K5036L3571M2393N1441O0995P0642P8976Q5087Q9127
$$ 2675719 2676547 2685400 2702313 2727349 2760920 2803313 2854754 2915749 2986391 3065367 3150454 3239581
59814C239581R0683Q8074Q0389O9036N6188M2969L0181J9297J1144M634j770q091
$$ 3239581 3330264 3418338 3498727 3567763 3623951 3666920 3697101 3716398 3727542 3732176 3730406 3722315
59802C722315j3342j6880j8033j5512q744J096J2641K6106M2337O1015Q1211J02970
$$ 3722315 3708973 3692093 3674060 3658548 3649804 3650900 3663541 3689647 3731984 3792999 3874210 3977180
59790C977180J27061J53761J83079K15627K52191K92904L37408L84766M32039
$$ 3977180 4104241 4258002 4441081 4656708 4908899 5201803 5539211 5923977 6356016
59781F356016M73433N01179N06269M78743M10824L03241J68331K5304j07757k18121
$$ 6356016 6829449 7330628 7836897 8315640 8726464 9029705 9198036 9223340 9115583 8897462
59771H897462k98649l47805l69315l69476l53995l27706k95642k62192k29421
$$ 8897462 8598813 8251008 7881693 7512217 7158222 6830516 6534874 6272682 6043261
59762F043261j97674j67498j39735j14399r0951o9429n0069l2246j4921K292J9408
$$ 6043261 5845587 5678089 5538354 5423955 5333004 5263575 5213506 5181260 5166339 5168631 5188039
59751E188039L6698N4080P0700Q6315J02301J20097J39488J59532J80323K02552
$$ 5188039 5224737 5278817 5349517 5435832 5538133 5658230 5797718 5957250 6137573 6340125
59741F340125K26234K51244K78377L08494L41423L76802M15073M56281M98848
$$ 6340125 6566359 6817603 7095980 7404474 7745897 8122699 8537772 8994053 9492901
59732I492901N40961N82222O22219O58317O86433P03347P06815O94589O65587
$$ 9492901 10033862 10616084 11238303 11896620 12583053 13286400 13993215 14687804 15353391
59723A5353391O21975N68687N11385M55970M08921L75822L59528L60858L80225
$$ 15353391 15975366 16544053 17055438 17511408 17920329 18296151 18655679 19016537 19396762
59714A9396762M16973M67859N28042N93210O59266P20630P70786Q04160Q16000
$$ 19396762 19813735 20281594 20809636 21402846 22062112 22782742 23553528 24357688 25173688
59705B5173688Q01221P55703O79016N74718M48572L07972J62429K2229j03984
$$ 25173688 25974909 26730612 27409628 27984346 28432918 28740890 28903319 28925548 28821564
59696B8821564k09682k89713l40964l63575l59810l31941k82396k14957j33738
$$ 28821564 28611882 28322169 27981205 27617630 27257820 26925879 26643483 26428526 26294788
59687B6294788m1209O1217J71352K86926M07562N33859O64581P96590R26952J052588
$$ 26294788 26253579 26314796 26486148 26773074 27180636 27714495 28379076 29175666 30102618 31155206
59677C1155206J167308J260893J321253J336108J293240J182248R98278P44589
$$ 31155206 32322514 33583407 34904660 36240768 37534008 38716256 39714534 40459123
59669D0459123M32928Q3390k77074o19677r20194j161916j335127j436977j472050
$$ 40459123 40892051 40975441 40698367 40078690 39158496 37996580 36661453 35224476 33752426
59660C3752426j450408j383876j284946j168545j052212r53292q86152q60184
$$ 33752426 32302018 30918142 29633196 28464651 27412439 26459147 25572995 24712811
59652B4712811q76518r25196r87959j046238j087343j104994j097583j067564
$$ 24712811 23836293 22911097 21923138 20876900 19789557 18684563 17586980 16519416
59644A6519416j020484r62305q97537q29757p62298o97439o35864n77780n23904
$$ 16519416 15498932 14536627 13639090 12809333 12047035 11349596 10713732 10135952 9612048
59635I612048m74985m31054l91569l55677l22267k90546k60694k33266k08049
$$ 9612048 9137063 8706009 8314440 7958763 7636496 7345950 7085256 6851990 6643941
59626F643941j84286j61804j41016j22062j04911q9999p7786o7985o0290n5404
$$ 6643941 6459655 6297851 6156835 6034773 5929862 5839863 5762077 5694092 5633802 5578398
59616E578398n4157n6073o0084o6138p4622q4618r4372j03182j11248j17857j21582
$$ 5578398 5524241 5468168 5408084 5341946 5267324 5182706 5088334 4985152 4873904 4756047 4634465
59605D634465j22253j21048j18579j14355j08172j00619r2157q3095p4226o6104
$$ 4634465 4512212 4391164 4272585 4158230 4050058 3949439 3857282 3774187 3699961 3633857
59595C633857n7921m8678l9094l0655k3171j5272p090k03N028R831J4419J7341
$$ 3633857 3575936 3527258 3488164 3457509 3434338 3419066 3411976 3411773 3416801 3426632 3441051 3458392
59583C458392J7955J7507J7050J6175J4544J3029J2459J2846J4462J8195K4081
$$ 3458392 3476347 3493854 3510904 3527079 3541623 3554652 3567111 3579957 3594419 3612614 3636695
59572C636695L0862L7694M5032N3312O2102P1153Q1038R2140J04132J16897J30917
$$ 3636695 3667557 3705251 3750283 3803595 3865697 3936850 4017888 4110028 4214160 4331057 4461974
59561D461974J46364J62941J80687J99955K20368K41057K61895K83223L04439
$$ 4461974 4608338 4771279 4951966 5151921 5372289 5613346 5875241 6158464 6462903
59552F462903L24175L41773L57108L69131L76320L78493L76523L70429L59706
$$ 6462903 6787078 7128851 7485959 7855090 8231410 8609903 8986426 9356855 9716561
59543I716561L45445L29921L13998K97197K80469K66083K53863K40109K21941
$$ 9716561 10062006 10391927 10705925 11003122 11283591 11549674 11803537 12043646 12265587
59534A2265587K01122J82327J69015J61835J59236J58049J54370J45008J27764
$$ 12265587 12466709 12649036 12818051 12979886 13139122 13297171 13451541 13596549 13724313
59525A3724313J00422O1150J0317m9465j15587j86273k58809l28694l91382m43671
$$ 13724313 13824735 13885885 13896202 13846737 13731150 13544877 13286068 12957374 12565992 12122321
59515A2122321m83258n08826n21316n23390n16941n02514m81555m57112m31352
$$ 12122321 11639063 11130237 10608921 10085531 9568590 9066076 8584521 8127409 7696057
59506G696057m04142l75083l45356l16488k88790k62049k36441k11885j87787
$$ 7696057 7291915 6916832 6571476 6254988 5966198 5704149 5467708 5255823 5068036
59497E068036j64363j42918j24004j06524q9401p2799n7005m1535k6110j1179
$$ 5068036 4903673 4760755 4636751 4530227 4440826 4368027 4311022 4269487 4243377 4232198
59487D232198L240J7957L3253M8514O3736P9936R7451J15496J33985J54013J75821
$$ 4232198 4235438 4253395 4286648 4335162 4398898 4478834 4576285 4691781 4825766 4979779 5155600
59476E155600J98029K19802K41960K64781K86369L04300L17283L24105L22514
$$ 5155600 5353629 5573431 5815391 6080172 6366541 6670841 6988124 7312229 7634743
59467G634743L10535K87739K54121K09160J53288Q9257K1013m7919j14356j75179
$$ 7634743 7945278 8233017 8487138 8696298 8849586 8938843 8959856 8911937 8797581 8622402
59457H622402k28173k72177l05954l28308l39908l43336l40599l32015l18168
$$ 8622402 8394229 8122052 7816098 7487790 7147882 6804546 6463947 6131932 5813764
59448E813764l01020k82174k61834k40484k19858k01044j83292j65764j48956
$$ 5813764 5512744 5230570 4968736 4728252 4508394 4307350 4124058 3958294 3809338
59439C809338j33327j18403j04245r2012q1750p1580o0498n0058m1773l4722k7490
$$ 3809338 3676011 3557608 3453363 3361351 3279601 3208021 3147523 3097465 3055692 3020970 2993480
59428B993480k0612j5056r911l875K282O873R993J3032J6357J9392K2257K5431
$$ 2993480 2972868 2957812 2947901 2944026 2946308 2953181 2963174 2976206 2992563 3011955 3034212 3059643
59416C059643K8543L1397L5456M2189N0069N5127N4897N0732M6340M5068M8578
$$ 3059643 3088186 3119583 3155039 3197228 3247297 3302424 3357321 3408053 3454393 3499461 3548039
59405C548039N6870O9035Q4245J02188J22801J45895J70731J95277K16662K34078
$$ 3548039 3604909 3673944 3758189 3860377 3983178 4129073 4299804 4495081 4711743 4945821
59395D945821K51117K73486L04039L41557L84094M31028M81279N31982N80136
$$ 4945821 5196938 5470424 5774463 6116020 6500114 6931142 7412421 7944403 8524539
59386H524539O23532O59019O82002O89177O80227O56029O17395N66850N09379
$$ 8524539 9148071 9807090 10489092 11178269 11858496 12514525 13131920 13698770 14208149
59377A4208149M49600L89735L31545K77924K30647J88237J47911J08109O7579
$$ 14208149 14657749 15047484 15379029 15656953 15887600 16075837 16223748 16331857 16399436
59368A6399436K3783k5642q0993j41431k05971k71866l33610l85558m24385m47944
$$ 16399436 16423219 16397577 16316584 16175153 15969182 15697316 15363706 14978148 14553763 14105819
59358A4105819m54089m42795m17803l83996l44661l03108k64791k35088k16045
$$ 14105819 13651730 13208935 12791132 12407136 12062475 11759367 11494576 11259488 11043443
59349A1043443k07518k09885k23096k44392k69592k95931l21459l42985l57286
$$ 11043443 10835925 10626040 10402944 10158552 9888960 9593029 9271570 8928585 8571299
59340H571299l63738l63527l57094l44466l27180l07389k85709k61993k37491
$$ 8571299 8207561 7844034 7486940 7142474 6815294 6507905 6222196 5960203 5722712
59331E722712k14070j91894j69951j48344j28099j09412r1905p5931o1868m8924
$$ 5722712 5508642 5316748 5146797 4998453 4870354 4760942 4669037 4593106 4531238 4482314
59321D482314l6329k4717j4557m466P020J9241L0996M2884N5755O8287P8778Q8130
$$ 4482314 4445985 4421268 4406711 4402245 4409265 4428506 4459502 4502386 4558141 4626428 4705206 4793336
59309D793336R8169J07931J14655J17745J18755J17873J13467J05050R3891Q0602
$$ 4793336 4891505 4999436 5114091 5231836 5350591 5468464 5581931 5686981 5780872 5861474
59299E861474O4752M7089K9757J3999k64j2515k1344k6161k7407k5089j8979r930
$$ 5861474 5926226 5973315 6003072 6017071 6016807 6004292 5982948 5956787 5929380 5904291 5885312 5875382
59287E875382R60J4183L0877N0252O9934Q8602J06405J23122J37895J50376J60080
$$ 5875382 5876342 5890525 5921402 5971654 6041588 6130190 6236595 6359717 6497612 6647988 6808068
59276F808068J64997J62985J54131J39766J19877R3993O4113L3995N687k0629
$$ 6808068 6973065 7136050 7290181 7429947 7549824 7643817 7707930 7741925 7747612 7726983
59266G726983m3416n9652o8663p3649p8173q2768q5431q3930p7125o5639n1792
$$ 7726983 7683567 7623915 7555252 7481603 7403430 7320662 7235231 7151301 7074176 7008537 6956745
59255F956745l7875k4544j1847j005O486J0864J3428J4429J3659J2448J2928J5650
$$ 6956745 6918870 6894326 6882479 6881474 6887960 6898824 6912252 6926681 6940340 6952788 6965716 6981366
59243F981366K0171K7573M0025N8105Q0788J07878J40104J76938K16606K58091
$$ 6981366 7001537 7029110 7069135 7127240 7208028 7315906 7456010 7632948 7849554 8107645
59233H107645L00805L42370L78961M07583M25617M28660M11938L74317L18343
$$ 8107645 8408450 8750820 9129781 9537364 9962981 10391641 10803579 11177896 11496239
59224A1496239K46283J59032N9328m6964j53804k56756l51111m31036m92122n33300
$$ 11496239 11742522 11901554 11960882 11913918 11760114 11503358 11152247 10721211 10229089 9695789
59214I695789n55512n60330n50543n30116n02370m69392m33338l96644l60603
$$ 9695789 9140277 8579947 8029404 7499288 6996918 6527526 6094188 5697544 5336941
59205E336941l25429k91972k61617k34400k09231j86106j66028j48658j32389
$$ 5336941 5011512 4719540 4457923 4223523 4014292 3828186 3662158 3513500 3381111
59196C381111j17127j04561r5080q6763p8271p0570o4795o0367n6257n2340m8553
$$ 3381111 3263984 3159423 3064343 2977580 2899309 2828739 2763944 2703577 2647320 2594980 2546427
59185B546427m4323l9655l5416l1810k8001k3647j9398j5398j0915n828r08L718
$$ 2546427 2502104 2462449 2427033 2395223 2367222 2343575 2324177 2308779 2297864 2292036 2291128 2294846
59173B294846Q863J4625K0038K4682K9153L3720L8088M2614M8029N3885N9009
$$ 2294846 2303709 2318334 2338372 2363054 2392207 2425927 2464015 2506629 2554658 2608543 2667552
59162B667552O3582O8937P5229Q1249Q6803R3125J00698J08565J16070J23351
$$ 2667552 2731134 2800071 2875300 2956549 3043352 3136477 3237175 3345740 3461810 3585161
59152C585161J29809J34158J36281J37034J35984J31496J23310J12764J00112
$$ 3585161 3714970 3849128 3985409 4122443 4258427 4389923 4513233 4625997 4726109
59143D726109Q4091O4851M4880K6077Q038r706k5732l8212m6827n2179n4629n4349
$$ 4726109 4810200 4875051 4919931 4946008 4954046 4944340 4918608 4880396 4833569 4781390 4726761 4672412
59131D672412n1306m4807l4315k0904o412Q857K6019M5326O5886Q7497J10732
$$ 4672412 4621106 4576299 4541984 4521080 4514668 4523525 4549544 4594870 4660756 4748253 4858985
59120D858985J35113J59373J83530K08572K33903K57326K77650K95006L08312
$$ 4858985 4994098 5153471 5337001 5545573 5779476 6036802 6314452 6609458 6917770
59111F917770L14630L11363K97056K70134K29592J77326J17691N4619q573o6951
$$ 6917770 7232400 7543763 7840819 8110953 8340545 8517871 8635562 8690181 8681608 8614657
59101H614657j14891j49994j73725j88002j93896j93709j90989j87734j84240
$$ 8614657 8499766 8349772 8176047 7988045 7794149 7600440 7409451 7221717 7037477
59092G037477j81992j83433j88318j93640j98002k02858k08645k13168k15026
$$ 7037477 6855485 6672052 6483734 6290094 6092092 5889234 5680589 5467421 5252395
59083E252395k15287k14533k11466k05823j99387j92632j83649j72019j60422
$$ 5252395 5037108 4822575 4611109 4405286 4205899 4013267 3829618 3657599 3497177
59074C497177j50618j41034j30236j19626j10498j01571r1757q2509p5019o7786
$$ 3497177 3346559 3205525 3075289 2955663 2845165 2743594 2651837 2569328 2494309 2426523
59064B426523n9495n1636m5811m0807l5040k9660k6674k5911k6375k8608l3224
$$ 2426523 2367028 2315392 2269581 2228774 2193734 2164074 2137400 2111489 2085114 2056506 2023282
59053B023282l8751m3291m6836m9947n1822n1673n0297m8434m5295m0594l6100
$$ 2023282 1984531 1941240 1894404 1844457 1792635 1740962 1690665 1642231 1596936 1556342 1520242
59042A520242l3199l0795k7523k4063k1300j8271j4154j0321q093o320l451k36
$$ 1520242 1487043 1456248 1428725 1404662 1383362 1365091 1350937 1340616 1332523 1326203 1322752 1322516
59030A322516J895L463N597P592Q135P598P002O114M518L074K392J462l22j487
$$ 1322516 1324411 1327874 1333471 1341063 1349198 1356796 1363798 1369912 1374430 1377504 1379896 1381358 1381036 1379549
59016A379549q19M02P08J119L207O101P952Q892J0168J1563J2103J2217J2867
$$ 1379549 1378730 1379132 1379840 1380959 1384166 1390267 1398219 1407111 1417279 1428842 1440945 1453162 1466029
59003A466029J3521J3072J1822J0728R654Q192P090P118P592P636P651Q126Q369
$$ 1466029 1479550 1492622 1504444 1515172 1524826 1533018 1540108 1547226 1554818 1562454 1570105 1578231 1586600
58990A586600Q010Q181R639J1220J1749J1897J2570J3220J3357J3870J5240J6286
$$ 1586600 1594610 1602791 1612430 1623650 1635399 1647296 1659866 1673086 1686443 1700313 1715553 1731839
58978A731839J6472J7352J9990K3031K5221K7615L1206L4698L6964L9477M3781
$$ 1731839 1748311 1765663 1785653 1808684 1833905 1861520 1892726 1927424 1964388 2003865 2047646
58967B047646M8648N2212N4865N7356N8169N5789N1692M8218M5141M1319L8000
$$ 2047646 2096294 2148506 2203371 2260727 2318896 2374685 2426377 2474595 2519736 2561055 2599055
58956B599055L7347L9056M1401M4450M9403N5915O2743O9949P7958Q5799R2842
$$ 2599055 2636402 2675458 2716859 2761309 2810712 2866627 2929370 2999319 3077277 3163076 3255918
58945C255918J00804J11342J23125J34044J44857J57798J72947J88941K06026
$$ 3255918 3356722 3468064 3591189 3725233 3870090 4027888 4200835 4389776 4595802
58936D595802K25350K46451K68298K91885L18998L49456L82195M17923M57974
$$ 4595802 4821152 5067603 5335901 5627786 5946784 6296240 6678435 7096358 7554332
58927G554332N01766N48034N97307O50311P05265P59574Q12737Q64447R10995
$$ 7554332 8056098 8604132 9201439 9851750 10557015 11316589 12129326 12993773 13904768
58918A3904768R46549R66663R67579R43655Q89216Q02342O84098N35842L61159
$$ 13904768 14851317 15817980 16785559 17729214 18618430 19420772 20104870 20640712 21001871
58909B1001871J69476k6249k15389l90579n44600o70771p66519q33229q72799
$$ 21001871 21171347 21145098 20929709 20539130 19994530 19323759 18557240 17724011 16851212
58900A6851212q87333q81419q60953q29598p89199p42983o94917o46284n96365
$$ 16851212 15963879 15082460 14221507 13391909 12602710 11859727 11164810 10518526 9922161
58891I922161n46301m98917m54977m13074l73369l38182l08678k83990k63689
$$ 9922161 9375860 8876943 8421966 8008892 7635523 7297341 6988663 6704673 6440984
58882F440984k48096k35961k24715k13359k02638j92414j81489j69881j58606
$$ 6440984 6192888 5956927 5732212 5518853 5316215 5123801 4942312 4772431 4613825
58873D613825j47429j35488j23749j14049j05875r6970q6998p7821p0266o3400
$$ 4613825 4466396 4330908 4207159 4093110 3987235 3890265 3803267 3725446 3655180 3591780
58863C591780n6800n0827m4830l7775l0472k4528j9418j3324o409m14M659J0473
$$ 3591780 3534980 3484153 3439323 3401548 3371076 3346548 3327130 3313806 3307397 3306983 3311642 3322115
58851C322115J7234K3639K9792L7123M5439N2888N8998O5226P2577Q1062R1078
$$ 3322115 3339349 3362988 3392780 3429903 3475342 3528230 3587228 3652454 3725031 3806093 3897171
58840C897171J02797J14764J25711J37078J50969J66536J81469J96217K13327
$$ 3897171 3999968 4114732 4240443 4377521 4528490 4695026 4876495 5072712 5286039
58831E286039K33237K54319K76655L02209L31386L62956L97239M36024M79360
$$ 5286039 5519276 5773595 6050250 6352459 6683845 7046801 7444040 7880064 8359424
58822H359424N25679N74912O28055O83708P38462P90445Q39063Q81215R11200
$$ 8359424 8885103 9460015 10088070 10771778 11510240 12300685 13139748 14020963 14932163
58813A4932163R24233R16696Q83371Q18593P20749N92608M37759K60716P0502
$$ 14932163 15856396 16773092 17656463 18475056 19195805 19788413 20226172 20486888 20557390
58804B0557390j20297l01150m65308o06587p19083q01010q55094q84284q90436
$$ 20557390 20437093 20135943 19670635 19064048 18344965 17543955 16688861 15804577 14914141
58795A4914141q77389q51167q15993p73538p26625o79838o35344n91761n48252
$$ 14914141 14036752 13185585 12369592 11596054 10869429 10189591 9554247 8962486 8414234
58786H414234n06529m67838m31392l96860l65274l36633l09528k83895k61171
$$ 8414234 7907705 7439867 7008475 6611615 6246341 5909708 5600180 5316285 5055114
58777E055114k41250k22429k04716j89950j78277j67892j58500j51339j45530
$$ 5055114 4813864 4591435 4386719 4196769 4018492 3850600 3692100 3540761 3395231
58768C395231j38274j29204j20689j13232j04678r4685q5755p8716p1287o2396
$$ 3395231 3256957 3127753 3007064 2893832 2789154 2694469 2608714 2529998 2458711 2396315
58758B396315n3999m7291m0976l4699l0407k8681k7353k5222k3711k3455k2816
$$ 2396315 2342316 2295025 2254049 2219350 2188943 2160262 2132909 2107687 2083976 2060521 2037705
58747B037705k1226k0485k1231k1545k0494j9750k0264k0717k0551k1181k2883
$$ 2037705 2016479 1995994 1974763 1953218 1932724 1912974 1892710 1871993 1851442 1830261 1807378
58736A807378k3903k3853k4564k6407k7336k6784k6794k8061k8698k8176k8561
$$ 1807378 1783475 1759622 1735058 1708651 1681315 1654531 1627737 1599676 1570978 1542802 1514241
58725A514241l0365l1196l0183k9598l0365l0049k7415k4895k4262k3691k1540
$$ 1514241 1483876 1452680 1422497 1392899 1362534 1332485 1305070 1280175 1255913 1232222 1210682
58714A210682j9317j8365j7115j4309j1773j1317j1728j1179r910q528o383l601
$$ 1210682 1191365 1173000 1155885 1141576 1129803 1118486 1106758 1095579 1085669 1077141 1070758 1067157
58702A067157j945j926j825j003j057k460l442l742n675r817j3347j4577j5326
$$ 1067157 1065212 1063286 1061461 1060458 1059401 1056941 1053499 1049757 1044082 1034265 1020918 1006341 991015
58689I91015j6866j7407j5843j4227j4053j3647j1590r304p960o282l679k028
$$ 991015 974149 956742 940899 926672 912619 898972 887382 878078 870118 863836 860157 858129
58677H58129j996j248J351L346K922J880J892J566j13j041M04K466L538N148Q583
$$ 858129 856133 854885 856236 859582 862504 864384 866276 867842 867729 866688 867092 869558 873096 878244 886827
58662H86827J1757J2362J1112R328O489K734M64Q42J839K100L290O268Q756R439
$$ 886827 898584 910946 922058 931386 937875 940609 941073 941915 943754 945854 949144 955412 964168 973607
58648I73607J0570J3690J6643J7791J9232K2639K5783K6733K7764L1483L6493
$$ 973607 984177 997867 1014510 1032301 1051533 1074172 1099955 1126688 1154452 1185935 1222428
58637A222428M0498M4394M9708N5284O0120O6242P5287Q5269R4286J04234J17407
$$ 1222428 1262926 1307320 1357028 1412312 1472432 1538674 1613961 1699230 1793516 1897750 2015157
58626B015157J32681J48502J66361J87577K09881K30945K52027K74254K94360
$$ 2015157 2147838 2296340 2462701 2650278 2860159 3091104 3343131 3617385 3911745
58617C911745L07808L13044L08849K90938K55808K05501J44845P6789M317o6100
$$ 3911745 4219553 4532597 4841446 5132384 5388192 5593693 5738538 5815327 5819644 5753544
58607E753544j27587j77447k15438k40353k52083k54264k50805k42138k28193
$$ 5753544 5625957 5448510 5233072 4992719 4740636 4486372 4235567 3993429 3765236
58598C765236k12139j97337j83348j68691j54704j42935j31718j19254j07228
$$ 3765236 3553097 3355760 3172412 3003721 2849017 2706082 2574364 2455110 2347882
58589B347882r7518q8349p7623o7055n9014n2276m5068l9128l6520l5430l3534
$$ 2347882 2250364 2162015 2084392 2017337 1958323 1906047 1860979 1821851 1785331 1749901 1716367
58578A716367l2418l4216l6801l7025l5886l5891l6003l3921l0730k8618k6509
$$ 1716367 1683949 1649733 1612932 1575907 1540021 1504130 1468127 1434206 1403476 1374858 1348349
58567A348349k2593j8591j6961j6409j4735j3457j4879j7192j7280j5880j5334
$$ 1348349 1325756 1307165 1290204 1273795 1259060 1245603 1230724 1213532 1196252 1180372 1165038
58556A165038j4812j2485r808q845p872m396L6K639M170O178O648L538m25j768
$$ 1165038 1150226 1137741 1127933 1119088 1111216 1106820 1106856 1109495 1113665 1119843 1126491 1130029 1129604 1127836
58542A127836k193n013q720r960j0036j2356j5799j6801j5885j6061j6792j5548
$$ 1127836 1125643 1120630 1111910 1101950 1091914 1079558 1063759 1046958 1031073 1015012 998220 982672
58530I82672j3545j3832j5408j5120j3763j4415j6285j6086j4041j2911j2513
$$ 982672 969127 955295 939887 924767 911004 896589 880304 864218 850177 837266 824753
58519H24753j0821q878q999r694p981n085m243m626l203q32o12j823j411R4Qp97
$$ 824753 813932 805054 796055 786361 778380 773295 769052 764426 761223 760391 759779 757956 756545 756639 756647 755850
58503G55850M79K839L238K428L199M571L738K025K749M845M899L708M551O600
$$ 755850 756329 759168 762406 764834 768033 772604 776342 778367 781116 785961 790860 794568 799119 805719
58489H05719O603N513O804R656J0446R645J0631J2929J3311J2258J2685J3564
$$ 805719 812322 817835 824639 834295 844741 854386 865017 877946 891257 903515 916200 929764
58477I29764J1561P648N327L707o50o416r253r667j1785j5393j6542j5242j5163
$$ 929764 941325 948973 954300 958007 957357 950941 941688 932021 920236 904843 888301 873059 857896
58464H57896j6391j5724j3499j2977j3631j2153r330q720r472p794m537l822n154
$$ 857896 841505 825781 812282 799305 785674 773521 764191 755471 745999 738205 733668 729846 724692
58451G24692m569k552k827m316k631J133J681q95j283J491L218L095M488P050
$$ 724692 720123 717571 714744 710428 707797 708930 710611 709716 708433 709924 713142 716237 720725 727775
58437G27775O749M093L866O206O484M348M293O720P254N620O341R697J0803Q852
$$ 727775 734524 738617 742483 748689 755173 759521 763814 770534 777788 783408 789749 799446 810249 819101
58423H19101Q497J0746J1188Q741P586Q768Q243M909K527K055J93l238m411l235
$$ 819101 827598 838344 849532 858273 865859 874627 882870 887779 890306 892361 892554 889316 884905 881670
58409H81670l776o031n560k338j387l516m070k045j669l659l722j184k75j608
$$ 881670 877894 871863 866303 863965 862578 859062 854992 852947 851278 847619 843897 842713 842438 840830
58395H40830j108J352J340j037o82K690L749J693J520L933M086J823K783P405
$$ 840830 839722 841074 842414 841377 840695 843385 847134 848827 850347 854280 858366 860189 862972 870377
58381H70377R273O613N089O899P531N812O509J0179J0934P366N366P014P105L768
$$ 870377 879650 886263 891352 898251 905782 911594 918103 928282 939216 946582 951948 958962 966067 969835
58367I69835K020L588L608O81j70K216K498m29p32L103N141L340K983N603N741
$$ 969835 971855 975443 979051 979732 979562 981778 984276 983847 983115 986218 991359 994699 997682 1003285 1009026
58352A009026K222J156M107M850J622P48M221N751L303L247P579R502O506N380
$$ 1009026 1011248 1012404 1016511 1021361 1022983 1023731 1027952 1033703 1037006 1040253 1047832 1057334 1063840 1069220
58338A069220R128J1427R285Q698J2285J3840J0791R477J2477J3318R477P697
$$ 1069220 1078348 1089775 1099060 1107758 1120043 1133883 1144674 1154151 1166628 1179946 1189423 1197120
58326A197120J0703J1732Q123O876J0552J1586P037N040R590J3037J0838R548
$$ 1197120 1207823 1219555 1227678 1234554 1245106 1256692 1263729 1268769 1278359 1291396 1302234 1311782
58314A311782J2709J3316Q244N681R842J2752R560P561J1304J3530J0052Q692
$$ 1311782 1324491 1337807 1346051 1351732 1361574 1374326 1383886 1391447 1402751 1416281 1426333 1435025
58302A435025J4035J8030J5408J3635J7737K0269J6457J4225J8805K2369J9401
$$ 1435025 1449060 1467090 1482498 1496133 1513870 1534139 1550596 1564821 1583626 1605995 1625396
58291A625396J7207K0810K2885J9252J8311K4322K7725K3225K0627K6232L0797
$$ 1625396 1642603 1663413 1686298 1705550 1723861 1748183 1775908 1799133 1819760 1845992 1876789
58280A876789K7975K6892L3683L8597L4776L1809L6879M0811L6849L4536M0286
$$ 1876789 1904764 1931656 1965339 2003936 2038712 2070521 2107400 2148211 2185060 2219596 2259882
58269B259882M3512L7267L3087L9362M4938M0772L7582M4540N1047M7807M5373
$$ 2259882 2303394 2340661 2373748 2413110 2458048 2498820 2536402 2580942 2631989 2679796 2725169
58258B725169N2846N9202N5126N2162O0213O7638O4313O2184P1516P9642P5565
$$ 2725169 2778015 2837217 2892343 2944505 3004718 3072356 3136669 3198853 3270369 3350011 3425576
58247C425576P2363Q1902R1255Q8447Q7033R9655J12359J11678J11575J25749
$$ 3425576 3497939 3579841 3671096 3759543 3846576 3946231 4058590 4170268 4281843 4407592
58237D407592J39518J38360J37369J52136J67880J69112J71419J90632K10000
$$ 4407592 4547110 4685470 4822839 4974975 5142855 5311967 5483386 5674018 5884018
58228E884018K12766K16928K41108K67410K76566K87063L18925L52840L68226
$$ 5884018 6096784 6313712 6554820 6822230 7098796 7385859 7704784 8057624 8425850
58219H425850L86165M29226M76094N04134N37418O01375O71954P24599P88731
$$ 8425850 8812015 9241241 9717335 10221469 10758887 11360262 12032216 12756815 13545546
58210A3545546Q94457J013748J118809J246901J437253J660438J887809K169596
$$ 13545546 14440003 15453751 16572560 17819461 19256714 20917152 22804961 24974557
58202B4974557K558577L024108L537177M164432M969909N912396O969668Q268489
$$ 24974557 27533134 30557242 34094419 38258851 43228760 49141156 56110824 64379313
58194F4379313R945808J2000902J4466492J7582970K1580334K6481829L2392601
$$ 64379313 74325121 86326023 100792515 118375485 139955819 166437648 198830249
58187A98830249L9507739M6889041N1176860M7766665L4490193J4167555p032789
$$ 198830249 238337988 285227029 336403889 384170554 418660747 432828302 425795513
58180D25795513k3820971l4334375l9345539m0283123l8375234l4768743l0482849
$$ 425795513 401974542 367640167 328294628 288011505 249636271 214867528 184384679
58173A84384679k6138093k2016477j8331647j5240799j2708252j0593862q843472
$$ 184384679 158246586 136230109 117898462 102657663 89949411 79355549 70512077
58166G0512077p453912o334527n363459m524284l851026l294544k770161k280937
$$ 70512077 63058165 56723638 51360179 46835895 42984869 39690325 36920164 34639227
58158C4639227j869062j496063j090682o64625k60733J64370O85057J290555J957955
$$ 34639227 32770165 31274102 30183420 29518795 29258062 29422432 30107489 31398044 33355999
58149C3355999K765978L720496M455212M337526L025736Q53279j415183l150252
$$ 33355999 36121977 39842473 44297685 48635211 51660947 52514226 51099043 47948791
58141D7948791m155460m549303m525973m239827l803606l306430k816446k374529
$$ 47948791 43793331 39244028 34718055 30478228 26674622 23368192 20551746 18177217
58133A8177217j992861j669026j402642j192063j022684q76030p48292o44921
$$ 18177217 16184356 14515330 13112688 11920625 10897941 10021911 9273619 8628698
58125H628698n61969m89987m30675l90385l62163l33522l06720k91417k82685
$$ 8628698 8066729 7576742 7146067 6755682 6393519 6059997 5753277 5461860 5179175
58116E179175k67037k45246k28243k14965j95523j72220j56176j46123j31231
$$ 5179175 4912138 4666892 4438649 4223684 4028161 3855941 3699765 3553642 3422411
58107C422411j12290j00272r6377r2606q9341r3257j00372r9945r2988q9159q8069
$$ 3422411 3310121 3209849 3113472 3020866 2931525 2838268 2737896 2637951 2544963 2455804 2367735
58096B367735q1465p0933o5508o4242n8805n0739m8613n0556m7030l8766l4813
$$ 2367735 2286270 2215337 2149829 2085587 2026782 1976043 1927430 1876874 1829844 1791078 1756265
58085A756265l5025l1516k5441k5277l0038l0735k7112k6763k9239k7172k1729
$$ 1756265 1721240 1689724 1664283 1639006 1608968 1578233 1551121 1524358 1495119 1467947 1446218
58074A446218k0991k4114k2873j7735j6792j9749j8572j3288j1809j4567j4319
$$ 1446218 1425227 1401113 1378240 1360505 1343713 1323964 1305392 1292104 1280295 1265728 1251409
58063A251409j0743j0456j2947j1181n947n095q706r377o913q367j3371j4002
$$ 1251409 1240666 1230210 1217263 1206082 1200135 1195040 1186334 1176957 1170044 1161677 1148306 1134304
58051A134304r726q291j0957j0778o554m931p208p268l998l026m841l632P72K078
$$ 1134304 1124578 1116287 1105330 1094552 1087998 1083067 1075859 1068591 1064593 1061567 1056726 1053094 1053866 1055944
58037A055944k13J48L868M979K916L603P222P106K299o47j7j274n408o654l894
$$ 1055944 1055731 1055879 1059747 1064726 1067642 1071245 1078467 1085573 1087872 1087225 1087208 1085934 1080526 1073872 1069978
58022A069978l064n987p628o427o740r144q883n799n323p888p786m265l211o025
$$ 1069978 1066914 1060927 1053299 1046872 1040132 1030988 1022105 1016306 1010983 1003095 995309 991044 987833 981808
58008I81808p284n333m858o940o895m078l559o018o097k917j982m445m775j381
$$ 981808 974524 969191 964333 957393 950498 946420 942861 936843 930746 927829 925847 921402 916627 915246
57994I15246N56o54l20K700L363N71j01L141N022L406K970N390N741K430J019
$$ 915246 915802 915148 914828 917528 920891 921462 921361 924502 929524 932930 935900 941290 947031 949461 950480
57979I50480M065O289M186J615J620J186j572l150j898j718m435o090m730m260
$$ 950480 954545 960834 965020 966635 968255 969441 967869 964719 962821 961103 956668 950578 945848 941588
57965I41588o671p933n656l501m043m317k321r49j765j700M39J042j216k292k49
$$ 941588 934917 926984 921328 917827 913784 909467 907146 906197 904432 902732 903171 904213 902997 900705 900456
57950I00456J107l56j011J456L616K814J620K143K210P36N39K339K290j025l471
$$ 900456 901563 901207 900196 901652 905268 908082 909702 911845 914055 914791 915330 917669 919959 918934 915463
57935I15463k554j385k179k319m44J29k313m327l733l357m911n391l182j436j820
$$ 915463 912909 911524 909345 907026 906582 906711 904398 900071 896338 892981 888070 882679 879497 878061 876241
57920H76241j186J900L731K360J570L919O114N431M596O015P117N909N263P301
$$ 876241 875055 876955 880686 883046 884616 888535 894649 900080 904676 910691 917808 923717 928980 936281
57906I36281R045Q068O965P890Q112N404K488J832J223j277l245k911k989n191
$$ 936281 945326 953394 960359 968249 976361 981765 984253 986085 987308 986031 982786 979875 976886 971695
57892I71695o331m279k470l952o053n637m628n555o465n045l233l119k712k18
$$ 971695 965364 961085 958615 954663 948610 942973 938345 932790 926325 921280 918047 914928 912216 911998
57878I11998J871J443R35K543L920L015K529M869P310O935N938P217Q978Q565
$$ 911998 913869 915312 916247 918790 922710 925725 928254 933123 940433 947368 953306 960523 969501 978066
57864I78066P496P920Q093O129M217M458M498J997o12n12L86o08j935j481j183
$$ 978066 985562 993482 1001575 1007704 1011921 1016379 1020877 1022874 1022262 1021750 1022136 1021528 1019593 1018112 1016929
57849A016929l027m484k991j115j986l479k239R3J66j003o64J38q98k268j494
$$ 1016929 1013902 1009418 1006427 1005312 1003326 999847 997608 997701 997867 996864 996200 996338 995440 993172 991678
57834I91678j27p71j967j215k13j810m480n048m363n014o054n225m014n099p003
$$ 991678 991551 990780 988813 987598 987385 985575 981095 976047 971684 966670 960616 955391 951377 946278 939275
57819I39275o532m483l782m036k957j285j174j600k84J612J546N04J057K440K332
$$ 939275 932743 928260 924478 920442 917485 916200 915026 913426 913142 914754 916300 916804 917861 920301 922633
57804I22633J711K897M652M249K780L374N571O438O090P080R433J0936J1467J2572
$$ 922633 924344 927241 931893 936142 938922 942296 947867 954305 960395 967475 976908 987844 999311 1011883
57790A011883J3711J3175J1705J1103J0465P852M333K279J088j160l419l393k083
$$ 1011883 1025594 1038769 1050474 1061577 1072042 1079894 1084227 1086506 1087594 1086434 1083015 1079622 1077539
57777A077539k192l282l000j764j727k301j213R98J908J655K177L104K655J627
$$ 1077539 1075347 1072065 1069065 1067301 1065574 1063273 1062060 1063058 1064966 1066621 1068798 1071902 1074557 1076184
57763A076184K242L980M664M541N252O041N284M374N588P388O627M209L690N171
$$ 1076184 1078426 1082406 1087070 1091611 1096863 1102904 1108188 1112562 1118150 1125538 1132165 1136374 1140064 1145235
57749A145235N650M794N196P187Q321Q108Q635J0254J1014J0550J0440J0660R652
$$ 1145235 1150885 1155679 1160875 1168062 1176383 1184491 1193126 1203380 1214394 1224944 1235384 1246044 1255696
57736A255696P954P843R315J0246J0329J1109J2401J2542J1970J2676J4318J4832
$$ 1255696 1263650 1271493 1280808 1291054 1301383 1312492 1324893 1337435 1349405 1362081 1376399 1391231
57724A391231J4522J5626J8075J9752K0743K3121K6583K8509K8547K9141L1223
$$ 1391231 1405753 1421379 1439454 1459206 1479949 1503070 1529653 1558162 1586709 1615850 1647073
57713A647073L3239L4764L7223M0747M3978M7261N2442N9389O6252P3203Q2187
$$ 1647073 1680312 1715076 1752299 1793046 1837024 1884285 1936727 1996116 2062368 2135571 2217758
57702B217758R3004J03441J13578J26106J41994J59485J77784J98077K20386K42777
$$ 2217758 2310762 2414203 2527781 2653887 2795881 2955366 3133150 3331227 3551613 3794390
57692C794390K64083K84067L00523L09433L08148K95376K68442K24665J66016
$$ 3794390 4058473 4342540 4643063 4952496 5260644 5556020 5824462 6049127 6215143
57683F215143R9127L0378l5894r4810j40959j72076j89635j95295j89585j73947
$$ 6215143 6314270 6344648 6308754 6213944 6072985 5900909 5711274 5515979 5326394 5152447
57673E152447j50653j20456q3151m0267N215M9845Q6000R9107P5770J7180n9052
$$ 5152447 5001794 4881338 4798187 4757920 4763135 4812980 4898980 4998087 5073857 5091037 5031985
57662E031985j31389j85953k17645k27128k19676k02690j81054j56358j30633
$$ 5031985 4900596 4714643 4496998 4269870 4050194 3847504 3666450 3510092 3379459
57653C379459j07158q6914o8058m9958l4311k1411r193L055J3777K3060L3650
$$ 3379459 3272301 3185387 3117329 3067371 3033060 3011649 3002456 3005511 3019288 3042348 3075998
57642C075998M6685O0053P2465Q5688J01164J17736J34321J51843J70995J90758
$$ 3075998 3122683 3182736 3255201 3340889 3442053 3559789 3694110 3845953 4016948 4207706
57632D207706K10361K29709K46809K57680K59907K53323K36450K05808J60343
$$ 4207706 4418067 4647776 4894585 5152265 5412172 5665495 5901945 6107753 6268096
57623F268096J03722M1123k3316q5006j38539j80785k11955k32585k42300k42441
$$ 6268096 6371818 6412941 6389625 6304619 6166080 5985295 5773340 5540755 5298455 5056014
57613E056014k36657k27416k14638j98849j82520j67123j51795j36318j22470
$$ 5056014 4819357 4591941 4377303 4178454 3995934 3828811 3677016 3540698 3418228
57604C418228j11134j00891r0735q1529p3699o6275n9208n3773m9692m4863l8915
$$ 3418228 3307094 3206203 3115468 3033939 2960240 2893965 2834757 2780984 2731292 2686429 2647514
57593B647514l4021l1165k8741k5780k3333k1610j9075j5574j3069j2132j0937
$$ 2647514 2613493 2582328 2553587 2527807 2504474 2482864 2463789 2448215 2435146 2423014 2412077
57582B412077q908p821q075p460n104l015k222r60J607L575L969M658O737Q552
$$ 2412077 2403169 2395348 2387273 2379813 2374709 2371694 2369472 2368512 2370119 2373694 2377663 2382321 2389058 2397610
57568B397610R256J0623J3306J4973J4530J4570J7068K0112K1584K2734K5248
$$ 2397610 2406866 2417489 2430795 2445768 2460298 2474868 2491936 2512048 2533632 2556366 2581614
57557B581614K7972K9543L1344L4852L8769M1687M5018N0463N6989O3164P0020
$$ 2581614 2609586 2639129 2670473 2705325 2744094 2785781 2830799 2881262 2938251 3001415 3071435
57546C071435P8883Q8722R8358J08989J21831J35588J48841J62655J78068J93330
$$ 3071435 3150318 3239040 3337398 3446387 3568218 3703806 3852647 4015302 4193370 4386700
57536D386700K06206K16690K24610K26772K19380K01420J73231J34250Q5331L1325
$$ 4386700 4592906 4809596 5034206 5260978 5480358 5681778 5855009 5989259 6074590 6105915
57526F105915k1701p0384j12992j46871j69978j83266j88767j87024j78853j67419
$$ 6105915 6084214 6013830 5900838 5753967 5583989 5400723 5211956 5024932 4846079 4678660
57516D678660j55624j43179j28995j14543j01992r0801p9302o8063n8699n0824
$$ 4678660 4523036 4379857 4250862 4136319 4034327 3943526 3864224 3796161 3737462 3686638
57506C686638m3041l5600k9322k3243j6164r258m460j393J598M724P526J0906
$$ 3686638 3643597 3607997 3578675 3555432 3539268 3530010 3525550 3524157 3525755 3530479 3538005 3548911
57494C548911J5823K1233K5775L0133L5408M0838M5646N1442N9963O9916P9011
$$ 3548911 3564734 3585967 3611742 3641875 3677283 3718121 3763767 3815209 3875172 3945088 4024099
57483D024099Q7696R8083J10407J23460J37277J52475J67916J81709J93645K03947
$$ 4024099 4111795 4209878 4320285 4443745 4581022 4733497 4901413 5083122 5276767 5480714
57473E480714K10596K10312K01174J82126J51600J09541N9757P596m3627r1643
$$ 5480714 5691310 5901622 6102796 6284922 6436522 6546063 6605820 6613416 6569789 6478146
57463F478146j32580j62711j81878j92396j95531j91745j83080j72130j59424
$$ 6478146 6345566 6182855 6000977 5808581 5613050 5421305 5238225 5066095 4906671
57454D906671j44625j29334j15753j03603r1341p9545p0033o2524n5252m8208
$$ 4906671 4762046 4632712 4516959 4413356 4322015 4242470 4172437 4109913 4054661 4006453
57444D006453m2677l8159l2934k7280k3060k0422j7753j4654j2164j0263p928
$$ 4006453 3963776 3925617 3892683 3865403 3842343 3821921 3804168 3789514 3777350 3767087 3759159
57433C759159n397l829k920j336P28J952K393L224M427N106N587O718P692P238
$$ 3759159 3753762 3749933 3747013 3745677 3746405 3748357 3750750 3753974 3758401 3763507 3769094 3775812 3783504 3790742
57419C790742O372P211R526J1147J1436J1591J1909J1572J0996J1643J3382J4606
$$ 3790742 3797114 3804325 3813851 3824998 3836434 3848025 3859934 3871506 3882502 3894145 3907527 3922133
57407C922133J4891J5272J6026J6523J6978J8095J9226J9173J8415J8328J8731
$$ 3922133 3937024 3952296 3968322 3984845 4001823 4019918 4039144 4058317 4076732 4095060 4113791
57396D113791J8511J7964J8044J8105J7037J5890J6448J7946J8154J7266J7379
$$ 4113791 4132302 4150266 4168310 4186415 4203452 4219342 4235790 4253736 4271890 4289156 4306535
57385D306535J8635J9102J8390J8077J8519J8459J7938J8381J9535J9430J7864
$$ 4306535 4325170 4344272 4362662 4380739 4399258 4417717 4435655 4454036 4473571 4493001 4510865
57374D510865J6940J7629J8578J8805J8865J8897J8285J7604J8269J9799K0133
$$ 4510865 4527805 4545434 4564012 4582817 4601682 4620579 4638864 4656468 4674737 4694536 4714669
57363D714669J9044J8468J9074J9353J8668J8326J8916J9281J9041J9400K0629
$$ 4714669 4733713 4752181 4771255 4790608 4809276 4827602 4846518 4865799 4884840 4904240 4924869
57352D924869K1208K0434J9569J9499J9557J9424J9983K1374K2364K2397K2332
$$ 4924869 4946077 4966511 4986080 5005579 5025136 5044560 5064543 5085917 5108281 5130678 5153010
57341E153010K2470K1955K0713J9963K0183K0459K0368K0425K0453J9648J8659
$$ 5153010 5175480 5197435 5218148 5238111 5258294 5278753 5299121 5319546 5339999 5359647 5378306
57330E378306J9245K1390K3006K3040K2676K2926K3300K3491K4097K4954K4913
$$ 5378306 5397551 5418941 5441947 5464987 5487663 5510589 5533889 5557380 5581477 5606431 5631344
57319E631344K3956K3513K4077K4525K4324K4345K4917K5182K4962K5282K6435
$$ 5631344 5655300 5678813 5702890 5727415 5751739 5776084 5801001 5826183 5851145 5876427 5902862
57308E902862K7404K7678K7815K7983K7806K7743K8660K9953L0334L0305L1518
$$ 5902862 5930266 5957944 5985759 6013742 6041548 6069291 6097951 6127904 6158238 6188543 6220061
57297F220061L3776L5252L5737L6874L9037M0797M1745M2988M4494M4888M4297
$$ 6220061 6253837 6289089 6324826 6361700 6400737 6441534 6483279 6526267 6570761 6615649 6659946
57286F659946M4366M5000M4224M1869L9957L8646L5248K8509K0623J3532O395
$$ 6659946 6704312 6749312 6793536 6835405 6875362 6914008 6949256 6977765 6998388 7011920 7018315
57275G018315j642r213j5033j9751k3816k6029k5950k5272k5117k4297k1880j9132
$$ 7018315 7016673 7007460 6992427 6972676 6948860 6922831 6896881 6871609 6846492 6822195 6800315 6781183
57263F781183j7299j5679j3543j1743j0815r653p613n906n368m941l845l125l586
$$ 6781183 6763884 6748205 6734662 6722919 6712104 6702451 6694838 6688932 6683564 6678623 6674778 6671653 6668067
57250F668067m177l925l468l301k604j150k87p08j292j367j879l008l195j928
$$ 6668067 6663890 6659965 6656497 6653196 6650592 6649442 6649155 6648447 6647155 6645788 6643909 6640901 6637706 6635778
57236F635778j103j966l119l191l081l718l971k815j459j311j836k206l088m921
$$ 6635778 6634675 6632709 6629590 6626399 6623318 6619600 6615629 6612814 6611355 6610044 6608208 6606002 6602914 6597993
57222F597993o433o725o931q027q940q659q355r445j1359j2951j4438j6288j7890
$$ 6597993 6591560 6584835 6577904 6569877 6560937 6552278 6543923 6534478 6523119 6510168 6495730 6479442 6461552
57209F461552j8905k0189k2004k3195k3508k4473k6701k8581k9179k9861l1436
$$ 6461552 6442647 6422458 6400454 6377259 6353751 6329278 6302577 6273996 6244817 6214956 6183520
57198F183520l2352l1732l1400l2651l3606l2389l0495l0332l1473l2028l1864
$$ 6183520 6151168 6119436 6088036 6055385 6021779 5989390 5958895 5928563 5897090 5865062 5833198
57187E833198l1792l1310k9847k8654k9018k9995l0180l0143l0984l2099l2499
$$ 5833198 5801406 5770096 5740249 5711595 5682577 5652582 5622402 5592259 5561275 5529176 5496677
57176E496677l2713l3270l3101l1548l0139l0224l0694l0160k9369k9257k8796
$$ 5496677 5463964 5430694 5397593 5366045 5335906 5305682 5274988 5244828 5215459 5186202 5157406
57165E157406k7201k6134k7054k8355k7865k6264k5308k4597k2941k1134k0455
$$ 5157406 5130205 5104071 5077017 5048662 5020797 4994533 4969225 4944628 4921687 4900553 4880098
57154D880098j9986j8271j6076j4826j3912j2171j0377r657r211q317q579j1321
$$ 4880098 4860112 4841841 4825765 4810939 4797027 4784856 4774479 4764822 4755611 4747294 4738715 4727394
57142D727394j4746j6690j8227k1348k5050k7139k8125k9812l1746l2581l3312
$$ 4727394 4712648 4695958 4677731 4656383 4631333 4604194 4576069 4546257 4514511 4481930 4448618
57131D448618l5462l7531l7066l4933l3754l3328l1526k8516k6224k4371k0953
$$ 4448618 4413156 4375625 4338559 4303626 4269872 4236544 4205018 4176502 4150278 4125907 4104954
57120D104954j6033j1458p464k945J731N442Q972J3636J8367K1555K4596L0078
$$ 4104954 4088921 4077463 4069999 4067054 4068785 4074227 4083199 4096835 4115202 4136757 4161353 4191431
57108D191431L7810M6417N7424P3853R6028J22904J56168J98828K51076L12079
$$ 4191431 4229241 4275658 4333082 4406935 4502963 4625867 4782035 4980863 5231939 5544018
57098E544018L84551M72968N78534P00636Q41703J005517J192053J398935J625034
$$ 5544018 5928569 6401537 6980071 7680707 8522410 9527927 10719980 12118915 13743949
57089A3743949J865287K103078K314958K481793K588302K615231K544537K373261
$$ 13743949 15609236 17712314 20027272 22509065 25097367 27712598 30257135 32630396
57081C2630396K109994J755765J305141P76840K30315k65715o81175j033007j350281
$$ 32630396 34740390 36496155 37801296 38578136 38808451 38542736 37861561 36828554 35478273
57072C5478273j641818j895309k092907k220706k271497k247843k162741k033863
$$ 35478273 33836455 31941146 29848239 27627533 25356036 23108193 20945452 18911589
57064A8911589j876601j702458j521065j340950j168639j008399q63109p35011
$$ 18911589 17034988 15332530 13811465 12470515 11301876 10293477 9430368 8695357
57056H695357o25510n34100m57859l92981l37088k89281k48156k11415j77957
$$ 8695357 8069847 7535747 7077888 6684907 6347819 6058538 5810382 5598967 5421010
57047E421010j48856j25677j09112r9594r7313j00727j06642j12774j18898j24956
$$ 5421010 5272154 5146477 5037365 4937771 4840458 4739731 4633089 4520315 4401417 4276461
57037D276461j29795j32675j34374j35805j36926j37741j38801j39947j40037
$$ 4276461 4146666 4013991 3879617 3743812 3606886 3469145 3330344 3190397 3050360
57028C050360j38692j36851j35034j32713j29875j27418j25419j22925j19976
$$ 3050360 2911668 2774817 2639783 2507070 2377195 2249777 2124358 2001433 1881457
57019A881457j17826j16495j14297j10488j06219j02098r7127r0901q4542p8460
$$ 1881457 1763631 1647136 1532839 1422351 1316132 1214034 1116907 1026006 941464 863004
57009H63004p1555o3679n6446n0446m4002l5936k7131j8186q172L218J5082K8170
$$ 863004 791449 727770 671324 620878 576876 540940 513809 495623 487451 490669 505751 533921
56997E33921M5109O6528R0986J20431J59439K02985K28845K11132J44013M8784
$$ 533921 579030 645558 736544 856975 1016414 1219399 1448244 1659376 1803389 1852173
56987A852173m3145j11289j51508j68184j66855j53255j34302j16527j03089r3072
$$ 1852173 1809028 1697739 1546231 1378047 1211192 1057937 923635 807108 704019 610947
56977F10947q4038p4896o5920n6971m7427l7781k9582k3294j7683j1980p087l912
$$ 610947 526909 452013 386093 329122 281695 243914 214332 191038 173355 161375 154288 150376
56965A50376j918j10J812M075P202J1074J5010J9334K5064L1090L3519K9344J9520
$$ 150376 148458 148348 150160 154235 161437 172511 187521 206855 231919 263009 296528 325872 345392
56952C45392P418m278j4019k0552k3544k4169k3701k2179j9328j5744j2202q777
$$ 345392 352810 348532 334513 313961 290417 266248 242547 220368 201040 185296 173094 164317
56940A64317n510k871p78J751N300R456J4000J9404K5750L2400L8721M3237M2220
$$ 164317 158807 155936 155158 156909 162209 171665 185665 205069 230819 263219 301940 345177 387397
56927C87397L2046J4187m639j8633k7240l2491l4960l4388l1849k8757k5133k0859
$$ 387397 419443 433630 428991 410358 383118 350627 315667 281279 249430 220673 195540 174681
56915A74681j7235j5339j4220j2443j0228q402o691m756l569l894m622m311l274
$$ 174681 157446 142107 127887 115444 105216 96814 90123 85367 81798 77904 73282 68971 65697
56902F5697k521j879q36rp7k63N13K019L601N595Q428J1450J4096J7000K0718
$$ 65697 63176 61297 60461 60452 60375 60112 60625 62644 66245 71840 80268 91718 105814 122814 143532
56887A43532K4654K8399L2442L5981L5809K9486J8465O380m391j2880j8022j9362
$$ 143532 168186 196585 229027 265008 300817 330303 348768 355148 350757 337877 319855 300493
56875C00493j8376j6953j5178j2115p844l172J640O358J0154J3154J7423K4658
$$ 300493 282117 265164 249986 237871 230027 226855 228495 234853 245007 258161 275584 300242
56863C00242L3891M3213N2704O3779P5951Q5431Q6512P4271M8173J4479j6686
$$ 300242 334133 377346 430050 493829 569780 655211 741723 815994 864167 878646 861960
56852H61960l8541n1124n7240n7810n3013m5185l7310k9859k1647j2670l802N156
$$ 861960 823419 772295 715055 657245 604232 559047 521737 491878 470231 457561 453759 458915
56840D58915J4902K5195L5893M8234O3245Q0424R9564J20999J40691J47376J29664
$$ 458915 473817 499012 534905 583139 646384 726808 826372 947371 1088062 1235438 1365102
56829A365102Q6883L0647k3966o6775r4080j06861j08986j04714r6285q4427p0565
$$ 1365102 1451985 1482632 1458666 1391891 1297811 1190950 1081964 977250 880965 796538 725973
56818G25973n6831m4305l2871k2413j2630k317R464K1970L4167M6942O2198P9801
$$ 725973 669142 624837 591966 569553 556923 554606 564070 586040 620207 667149 729347 809148
56806H09148R6091J04538R7676P1371K9951j4360m9767p2382q4641q9126q6929
$$ 809148 905239 1009777 1107453 1178824 1208775 1194415 1144648 1072266 987625 898499 811570
56795H11570q0097p1528o2422n2534m2543l3714k5700j7291q861j632M991J2766
$$ 811570 731473 659945 597523 544989 502446 468732 443032 425741 416880 415248 420239 433005
56783D33005K1758L0649L9251M7727N3348N1059L8257J7466n822k6435m1102m9201
$$ 433005 454763 485412 524663 572390 625738 676797 715054 732520 726698 700263 659161 609960
56771F09960n2418n2551m9867m4545l8421l3508k9664k5655k1568j8257j5387
$$ 609960 557542 504991 455124 410579 372158 338650 308986 283331 261763 243506 228119
56760B28119j2214r359p742o716n369m526n166o094n634m480m243m413l583k559
$$ 228119 215905 206546 198804 192088 186719 182193 177027 170933 165299 160819 156576 152163 148580 146021
56746A46021l080m353m113k479j583j823j720j129j406k503k941k540k476k732
$$ 146021 142941 138588 134475 131996 130413 128590 126870 125741 124335 121832 118891 116351 113875 111143
56732A11143k334j690j928k396j672n36p23j332n5K416K945R88o93o72n26j230
$$ 111143 108809 107119 105191 102795 101123 100587 99864 98532 98477 100893 103838 104826 104133 103461 102935 101705
56716A01705j496o79j30n26o96n6M40M85R80J715J191n58j559r56j05k6k18m04
$$ 101705 100209 99530 99400 98874 98178 98122 98562 99047 100027 101742 102933 102375 100816 99860 99755 99729 99511 99107
56698I9107r80j374m40J152J493N80K44Q69J037O25J077K253K203O82k33L20Q79
$$ 99107 98127 96753 96313 97465 98958 99538 99782 100651 101688 102313 103390 105643 107846 108528 108295 108615 109494
56681A09494P69J083J786J144q35j544J85K150K228J125K62m58j336j705j401
$$ 109494 110263 111346 113132 114276 113441 111897 112082 114232 116460 117585 117847 117389 116053 114348 112947
56666A12947j388j835j654p18l62r17j119n58k81m02K44J376J106p07j759j011
$$ 112947 111559 109724 108070 107352 106990 106073 104954 104396 104115 103713 103957 105333 106439 105732 103973 102962
56650A02962k15o91j397j418j584k245k132q50mm25p23J29J118J398J790K751
$$ 102962 102747 102056 100659 99241 97657 95412 93280 92430 92426 92001 91278 91407 92525 93923 95713 98464
56634I8464L166K475J818J897J866J341J236J632J230n4m28P18J537P55n09j080
$$ 98464 101630 104105 105923 107820 109686 111027 112263 113895 115125 115071 114643 115361 116898 117653 117144 116064
56618A16064j561k508l045k569j819j284n26J80j61j066q10N23Q92k44j110r20
$$ 116064 114503 111995 108950 106381 104562 103278 102752 102932 102771 101705 100895 101418 102310 102066 100956 100036
56602A00036r78j605j129R06K524K463J807J451Q91M04J234K660K211r5j195J58
$$ 100036 99058 97453 96324 97230 99754 102217 104024 105475 106366 106770 108004 110664 112875 112780 111585 111743
56586A11743J544J329J158K252K976K204J599K306K674J603Q96J925L062K836
$$ 111743 113287 114616 115774 118026 121002 123206 124805 127111 129785 131388 132284 134209 137271 140107
56572A40107K588L565M287L417K465L063M139M317M518N730O682O092N040M840
$$ 140107 142695 146260 150547 153964 156429 159492 163631 167948 172466 178196 184878 190970 196010 200850
56558B00850M873M487M599N474N510M081K916K825K057j37j512o82K11q39k431
$$ 200850 205723 210210 214809 220283 225793 229874 232790 235615 237672 237535 236023 235341 235552 234713 232282
56543B32282k680k380k715k736j785j539k949m023l274k410l006l581k822k469
$$ 232282 229602 227222 224507 221771 219986 218447 215498 211475 208201 205791 202785 199204 196382 193913
56529A93913l938n139m001k265k390l434l323k688l006l403k671j999k536k649
$$ 193913 189975 184836 180835 178570 176180 172746 169423 166735 163729 160326 157655 155656 153120 150471
56515A50471q82Q99N71n00j27Q03M57l56j45J41o80j167l6P70o04k197j542j72
$$ 150471 149589 150488 151059 150559 150432 151235 151692 151336 151191 151332 150652 149485 149449 150219 149615 147418 145876 145704
56497A45704p64k229j901m93n32j569j244L00J053R48J388K237K561L002M191
$$ 145704 144940 142711 140810 140317 139785 138216 136972 137272 138325 139273 140661 142898 145459 148461 152652
56482A52652M610L108J608K017K738J780Q31K328M691M734K920J958J976J316
$$ 152652 157262 160370 161978 163995 166733 168513 169344 171672 176363 181097 184017 185975 187951 189267
56468A89267N87J557L238L214J765J005J133J142J698L643N229M496K818K494
$$ 189267 189854 191411 194649 197863 199628 200633 201766 202908 204606 208249 213478 217974 220792 223286
56454B23286K609J152p40o58O65R90P61J583K349J137p09o72M74M72n6N69R75
$$ 223286 225895 227047 226307 225649 226314 227304 228065 229648 231997 233134 232425 231753 232227 232699 232643 233212 234187
56437B34187q68l031k458o48j329l899m625l141k421l048k846j698j606k347j837
$$ 234187 233319 230288 227830 227182 225853 221954 217329 214188 211767 208719 205873 204175 202569 200222 198385
56422A98385m50l63j183p00O28N56l99N6J330J009k61J80J836J881M82L50J499
$$ 198385 197935 197572 196389 195689 196317 196873 196474 196530 197860 198869 198608 198788 200624 202505 202987 203337 204836
56405B04836J499L72K38O04q66l338l725k301k124l289k997j202p08j642j222
$$ 204836 206335 206707 206945 207549 206683 203345 199620 197319 195195 191906 188909 187707 186999 185357 184135
56390A84135P72J648J218K168M532N193L588K802M092N157M796M588N089M832
$$ 184135 184907 186555 187773 189941 194473 199666 203254 206056 210148 215305 220101 224689 229778 234610
56376B34610L822L770M287L162P76j17P11P17n32p79L97R35M45N91J213N08r54
$$ 234610 238432 242202 246489 249651 250427 250310 251021 251738 251206 250427 250824 251759 252204 252795 254008 254516 253562
56359B53562q20N45P34J13J152L311L714K611K854M246L915K184K290M202M552
$$ 253562 252742 253287 254021 254134 255286 258597 262311 264922 267776 272022 275937 278121 280411 284613 289165
56344B89165L124L339N775P082O307O286P836Q291P063O983Q766R593Q470P796
$$ 289165 292289 295628 301403 308485 314792 321078 328914 337205 344268 351251 360017 369610 378080 385876
56330C85876Q458Q497P700Q267J0005J0022Q059O798O417M375J131Q7J199P43
$$ 385876 394334 402831 410531 418798 428803 438825 446884 453682 460099 464474 465605 465692 466891 467634
56316D67634j745k620j207j161l455m575l336k912m282m173j591p9j144j647J6
$$ 467634 465889 463269 462062 460901 457446 452871 449535 446623 442341 438168 436577 436498 435354 433707 433723
56301D33723J150N19P77K793L584K301K400N255P535P333P213Q711R678R445J0795
$$ 433723 434873 435392 436169 438962 442546 444847 447247 452502 460037 467370 474583 483294 492972 502417 513212
56286E13212J4246J6322J5976J6782K0179K2651K2408K2740K5781K8915L0359
$$ 513212 527458 543780 559756 576538 596717 619368 641776 664516 690297 719212 749571
56275G49571L2489L6560M0007M1995M5867N2954N9839O4777P1081Q0909R1536
$$ 749571 782060 818620 858627 900622 946489 999443 1059282 1124059 1195140 1276049 1367585
56264A367585J00980J11578J24710J37694J49125J61582J75908J88497J97383
$$ 1367585 1468565 1580143 1704853 1842547 1991672 2153254 2329162 2517659 2715042
56255B715042K05126K12539K15670K12274K05195J95893J80846J58082J31271
$$ 2715042 2920168 3132707 3348377 3560651 3765846 3961739 4142585 4300667 4431938
56246D431938J03684P3991M1786J1172j4957l8416n9974p6174q5605r2254r8771
$$ 4431938 4535622 4609613 4651399 4662571 4647614 4609198 4549224 4473050 4387445 4295191 4196420
56235D196420j02503j01857j00435j00856j00841r9260r9799j04395j09313j11913
$$ 4196420 4093917 3992060 3891625 3790769 3689928 3590668 3490869 3386474 3277161 3165248
56225C165248j14958j20169j23973j24087j23822j25452j25685j22172j17994
$$ 3165248 3050290 2930121 2806148 2682061 2558239 2432787 2307102 2184930 2066936
56216B066936j15206j10630j02672r5485r1556q6936p8803p0860o6086o1168n3505
$$ 2066936 1951730 1841100 1738428 1642943 1551387 1464451 1385648 1314788 1248702 1187534 1134029
56205A134029m6769m3770m0737l4554k8943k7346k6333k2279j8145j7306j6934
$$ 1134029 1087260 1043490 1002753 968199 939256 911910 885577 863298 845153 827847 810913
56194H10913j3763j0366r413p981l661j94p29j632Q22L719L659L250N326P002
$$ 810913 797150 786784 777371 769390 765729 765535 764806 763174 763996 767715 771374 774624 779950 786952
56180G86952N693M649O309O828L503P26J969K965l13l988l783k975n380p467n325
$$ 786952 792645 797294 803603 810431 813934 814660 816629 819594 819281 815293 811510 808535 803155 795688 790363
56165G90363k665l910n920m468k358l192l710m69K580J392oL065P059P177O464
$$ 790363 787698 783788 777868 773400 771042 767850 764140 763671 766251 767643 767637 770702 777761 784938 791402
56150G91402R270J2356J1566J0696J4638K0077K2110K3792K9936L7811M3274M9723
$$ 791402 800672 813028 824594 835290 849928 870005 892115 915907 945843 983654 1026928 1076651
56138A076651O1576P5209Q5847R6767J11983J26207J32010J30655J26315J16560
$$ 1076651 1138227 1213436 1299283 1396050 1508033 1634240 1766250 1896905 2023220 2139780
56128B139780R8989Q0560O9470O3766N7908N3544N3141N0199L7782K0676P821
$$ 2139780 2238769 2319329 2388799 2452565 2510473 2564017 2617158 2667357 2705139 2725815 2733636
56117B733636j088j0364j6934j6531j5075k1394l4068m6883o1053p9873r7620
$$ 2733636 2732548 2722184 2705250 2688719 2673644 2652250 2618182 2571299 2510246 2430373 2332753
56106B332753j06536j09144j11654j11376j03185r1921q5167p9807o8989n6215
$$ 2332753 2226217 2117073 2005419 1894043 1790858 1698937 1613770 1533963 1464974 1408759
56096A408759m9054m4991l7262k8691k5804k5163j9718j2809j1575j2536q305
$$ 1408759 1359705 1314714 1277452 1248761 1222957 1197794 1178076 1165267 1153692 1141156 1132851
56085A132851k515k963n978l072K701K750l73J667O490O042K863N037J0015R782
$$ 1132851 1130336 1127373 1121395 1118323 1121024 1123774 1123401 1125068 1131558 1137600 1140463 1145500 1155515 1165297
56071A165297O946R278J3546J1541O878Q704J4010J3461R525J1135J5712J4457
$$ 1165297 1172243 1181521 1195067 1206608 1213486 1222190 1236200 1249661 1259186 1270321 1286033 1300490
56059A300490J0229J1964J6714J5660J2285J5685K1616J9758J4022J5548K1401
$$ 1300490 1310719 1322683 1339397 1355057 1367342 1383027 1404643 1424401 1438423 1453971 1475372
56048A475372K0845J6896K0279K7654K7759K3708K6766L3604L2701K7764L1131
$$ 1475372 1496217 1513113 1533392 1561046 1588805 1612513 1639279 1672883 1705584 1733348 1764479
56037A764479L9302L9361L4395L7355M5003M3809L6868L8217M5085M3246L5566
$$ 1764479 1803781 1843142 1877537 1914892 1959895 2003704 2040572 2078789 2123874 2167120 2202686
56026B202686L6991M5094M4590L7484L9163M7791M7842M1177M3630N3403N4456
$$ 2202686 2239677 2284771 2329361 2366845 2406008 2453799 2501641 2542818 2586448 2639851 2694307
56015B694307M8863N3380O5983O9019O3670O7325P8558P9712P2715P6240Q8657
$$ 2694307 2743170 2796550 2862533 2931552 2995222 3062547 3141105 3220817 3293532 3369772 3458429
56004C458429R0826Q4633R0367J06738J12980J10015J18624J37041J42905J37413
$$ 3458429 3549255 3633888 3724255 3830993 3943973 4053988 4172612 4309653 4452558 4589971
55994D589971J43692J60941J65680J59217J66480J86730J94652J91802K05359
$$ 4589971 4733663 4894604 5060284 5219501 5385981 5572711 5767363 5959165 6164524
55985F164524K34185K49900K53719K75626L14554L38924L49900L81294M32799
$$ 6164524 6398709 6648609 6902328 7177954 7492508 7831432 8181332 8562626 8995425
55976H995425M69714M93619N42905O17637O78847P28946Q12728R31046J039664
$$ 8995425 9465139 9958758 10501663 11119300 11798147 12527093 13339821 14270867 15310531
55967A5310531J142852J295507J502245J715447J945569K263322K678624L139099
$$ 15310531 16453383 17748890 19251135 20966582 22912151 25175473 27854097 30993196
55959C0993196L664092M343607N187166O132273P228675Q636423J0415797J2535594
$$ 30993196 34657288 39000895 44188061 50320334 57549009 66185432 76601229 89136823
55951H9136823J5125231J8455988K2637820K7683552L3838812M1009472M7215580
$$ 89136823 104262054 122718042 145355862 173039414 206878226 247887698 295103278
55944B95103278M8279001M0446565K3935644L465711j5038778k8107774l5444622
$$ 295103278 343382279 383828844 407764488 411230199 396191421 368083647 332639025
55937C32639025l8247842l7766100l5101227l1316113k7209626k3184013j9460497
$$ 332639025 294391183 256625083 221523856 190207743 162998117 139814104 120353607
55930A20353607j6234376j3569020j1359116r503889p994253o797648n806501
$$ 120353607 104119231 90550211 79191095 69687206 61692953 54895305 49088804
55923D9088804m953565m258822l720356l266823k854289k509610k242402k005022
$$ 49088804 44135239 39876417 36156061 32889238 30034949 27525339 25282937 23277915
55915B3277915j772185j575948j430296j297995j160538j048558r75359r07606
$$ 23277915 21505730 19929782 18499486 17201491 16040953 14992395 14017036 13109430
55907A3109430q27676p61697p21305o77789o17662n67139n38646n06840m59512
$$ 13109430 12281754 11520057 10798752 10120963 9503301 8936162 8397516 7890676 7431164
55898G431164m20729m02135l80356l43586l13683l01678k86358k56791k33226
$$ 7431164 7010435 6608300 6227944 5884358 5570675 5268997 4982639 4725848 4492622
55889D492622k26227k16350j93356j75921j73786j68563j50486j37225j38162
$$ 4492622 4266395 4050045 3856689 3680768 3506982 3338419 3187933 3050708 2912546
55880B912546j35704j20083j08225j10109j09510r5959q4102q3777q1439o8500
$$ 2912546 2776842 2656759 2548534 2438425 2328915 2232956 2148854 2065077 1983638 1915138
55870A915138n8692o0475o0574n1094m5372n0929n3777m5318l8413m1227m1158
$$ 1915138 1856446 1795971 1735397 1684303 1638931 1588002 1534225 1488907 1450494 1409267 1368109
55859A368109l0314k1481k3024k2655j1981l137m888n405M825J4946J4422J0632
$$ 1368109 1337795 1316314 1293290 1270635 1258654 1255517 1250629 1245224 1250049 1264995 1279417 1290049
55847A290049J0371M688j2120k7998l3079l5563m3280m8151m3423l8156l9921
$$ 1290049 1300420 1305108 1292988 1264990 1231911 1196348 1153068 1104917 1061494 1023338 983417
55836I83417m0505l2995k6087k7399k9085k3775j8708k0549k1845j6047j0558
$$ 983417 942912 909917 883830 856431 827346 803571 784863 764314 742469 726422 715864
55825G15864j1882j2791p095k335n106q268n247k654o322r004m382N42q42k387
$$ 715864 703982 691191 684096 681761 676655 668387 663140 660486 654164 645160 640778 641320 640478 638091
55811F38091J518L998q44n951m859l971r224j3704j0940p647j0643j3542r269
$$ 638091 639609 643607 642763 636812 631953 627982 618758 605054 594114 586467 575824 562282 553013
55798E53013l958n492r453r042q147j2105j5908j3831j0867j2823j4966j1922
$$ 553013 549055 543563 534110 525068 516921 504816 488908 475077 464210 451387 436421 424499
55786D24499q818j1081j3092q648l033l046m397o71M080L314n0p65j926p560j2748
$$ 424499 415681 404600 391508 382860 379827 376781 372384 371713 375793 379107 379057 378292 376366 368806 356058
55771C56058j1983r407j0562j1998r077n708o108n534L34N277K452l611n539n436
$$ 356058 344075 334668 324106 312108 303031 297323 291215 285681 286015 291292 293744 290133 284594 279158
55757B79158q115j0111o676k297l197o121n231l217n108p732n995l160m532p165
$$ 279158 271043 260932 254256 251959 248762 242641 237410 234193 229085 221353 215358 212198 207666 200501
55743B00501n928l502m438n623k683N45r92l538j527J716N38j958Q0L971L665
$$ 200501 194573 191071 186633 181010 178327 178872 177880 174342 172815 174531 175069 173111 173191 177162 180827
55728A80827Q30N03R21k144n915n531l580m981p309n797k983l656n171k583J442
$$ 180827 181657 182160 183081 180937 175022 169491 165911 160930 153621 147824 144841 141185 136014 133431 134873
55713A34873J651K97K315N258M187J942M233Q704R312P662R524J3466J3358R311
$$ 134873 136524 136821 139136 144394 148581 150523 154756 163460 172772 180434 189958 203424 216782 226093
55699B26093O155L852r01o174p385o052o892q860p771n143n420p097n544k085
$$ 226093 232248 236100 235199 229025 221640 215588 208696 199836 192065 186922 181502 174405 168861 166776
55685A66776j409k438o04L131M244L408M661P038O486M094M069N533M399J437
$$ 166776 165367 162929 162325 165456 169700 173108 177769 184807 191293 195387 199456 204989 209388 210825
55671B10825M64P02j146l524k713n37j292l380k201Q03N08k508l273j437q12j519
$$ 210825 211289 211991 210845 207321 204608 204071 202779 199399 197198 198001 198509 196001 192728 191291 190479 188960
55655A88960o83N80j142m257m357k281k433m609n092m328n755q486q723p144p301
$$ 188960 188277 188857 187715 183458 179101 176820 174387 169778 164686 160358 154603 146117 137394 130250 122949
55640A22949q292o565l480l318n192m701k295k156l938l532j138p77k504k643
$$ 122949 114657 108092 104612 101294 96102 91401 89106 86950 83012 79480 78342 77565 75061 72418
55626G2418j153j333k905k581p97q16j959r20J233O53j726j632L98o1k968l955
$$ 72418 71265 69932 67027 64446 63649 62833 60874 59954 61187 61840 60114 58482 58880 58819 55851 51896
55610E1896k389j812k656j833M69Q47n73l79J316J129p25p60R07Q10r59r40Q27
$$ 51896 49507 47695 45039 43206 43675 44522 43949 43570 44886 46015 45290 44530 45437 46247 45288 44348 45175
55593D5175R47o35q01K48m33k033j034J631J649p24j048J106J699k9o76J92n54
$$ 45175 46122 45487 44686 44934 44501 42468 41434 43065 44714 43990 42942 44048 45747 45718 45042 45234 44680
55576D4680k710k524m7N28j410j930j05N43q57r42J148K153J022N43J436J220
$$ 44680 41970 39446 39399 39927 38517 36587 36482 37025 36168 35226 36374 38527 39549 40092 41528 42748
55560D2748j47K99K438K701O82j24R74P97j207j777k39L12q00o51J238J962J240
$$ 42748 42601 42900 45338 48039 48721 48597 49571 50368 49161 47384 47145 47457 46657 46006 47244 49206 50446
55543E0446K051M239M111J420L06J844K386P49L89K581L862K396P73M44o57k950
$$ 50446 52497 56736 60847 62267 62573 64417 66803 67552 67941 70522 74384 76780 77553 77997 77340 74390
55527G4390l530j748r09k369l418k793k820m319m831l649l264m175l753j772j467
$$ 74390 70860 69112 68203 65834 62416 59623 56803 52484 47653 44004 40740 36565 32812 31040 29573
55512B9573l440m196k500j444k374k418j66J729J694J660K453K077L81J05J477
$$ 29573 26133 21937 19437 17993 15619 13201 13035 14764 16458 18118 20571 22648 23029 23134 24611
55497B4611J185j459k897j643o35j426j674m09r9j430j645k02k94k581l221o72
$$ 24611 25796 24337 21440 19797 19162 17736 16062 15653 15554 14124 12479 12277 11983 9402 6181 5509
55481E509J406O47l25N25R82m55j391k90O02m8o9J371J536n47j725n16O4j706
$$ 5509 6915 7562 7237 7762 8744 8289 6898 6608 7210 7162 7093 8464 10000 9453 7728 7212 7276 5570
55463E570B674A159j48A89a114P1f5j58q12b63A803J020l29k70o56h50k745k87
$$ 5570 2674 1159 1011 189 -1114 -1043 -65 -223 -1035 -263 1803 2823 2494 2224 1568 -850 -3595 -3882
55445c882J601N68o04O69C42P68C18Q1J640J213J78R35K264J918Q23P82R79L18
$$ -3882 -2281 -1713 -2317 -1648 342 1110 318 399 2039 3252 3430 4365 6629 8547 9370 10152 11131 11449
55427A1449K12J615K431J148j18N75J481O29n71l86n9q74j308l46r1j824k969
$$ 11449 11661 13276 15707 16855 16737 17312 18793 19422 18851 18465 18406 17532 16224 15878 15787 13963 10994
55410A0994j392P93J089P84J745K592J687O09J042J372Oj170k68Q72J8j448j446
$$ 10994 9602 10395 11484 12268 14013 16605 18292 18901 19943 21315 21321 20151 19883 20755 20773 19325 17879
55393A7879j064j909k637j733p82j491k340j661j009A288a430j435M5m21j231
$$ 17879 16815 14906 12269 10536 9754 8263 5923 4262 3253 1288 -1430 -2865 -2820 -3241 -4472
55378d472k17J159O48m75K1J118P62j74J32f35b4E58K130L524K776J227R63J110
$$ -4472 -4689 -3530 -2882 -3357 -3336 -2218 -1456 -1630 -1498 -635 -24 558 2688 6212 8988 10215 11178 12288
55360A2288J47p57k21J75j227k676k007n17l20n00M51J115j48j639j294n26A056
$$ 12288 12435 11678 11457 11632 10405 7729 5722 5205 4885 4385 4836 5951 5803 4164 2870 2344 1056
55342i74p01f95b45r60n68Q10a25A27J011K060J380K36R18K178J438k68j87J038
$$ -974 -1675 -695 -245 -1205 -1773 -963 -125 127 1138 3198 4578 4814 5732 7910 9348 9080 8893 9931
55324I931O94r21j276l54k50j021j047n85j055j769j042L97O49J67N19J048K37
$$ 9931 10625 9704 8428 8074 7824 6803 5756 5171 4116 2347 1305 1702 2351 2518 3037 4085 4322
55307D322j015j019n89D38a446p41P30K43j016m98R75Q11m74l84Q30c4G1K66J039
$$ 4322 3307 2288 1699 438 -1446 -2187 -1457 -1214 -2230 -2728 -1753 -942 -1416 -1800 -970 -34 71 337 1376
55288A376N67m84K6J526J669P03P18J405P68o77o66M11J60j186j099N25J130J4
$$ 1376 1943 1459 1485 3011 4680 5383 6101 7506 8274 7597 6931 7342 7502 6316 5217 5742 6872 6886
55270F886q78p77r12j413r80J69L91k40n8R69J220N30K53M82J34n36l74J61j21
$$ 6886 6008 5231 4319 2906 1926 2095 2486 2246 2188 3157 4377 4907 5160 5642 5776 5240 4866 5027 4906
55251D906n21L69J640J391K00L7N97J18r52o74O50R90K42r8j42j072k020j162
$$ 4906 4385 4754 6394 7785 7985 8022 8619 8737 7785 7111 7761 8751 8993 8895 8753 7681 5661 4499
55233D499P14J266N65M49P29q6j057J0K144K256L32o19J92M39o87j200k47O17
$$ 4499 5213 6479 7044 7493 8222 8136 7079 7089 9233 11489 11821 11202 11394 11833 11146 9946 9699 10316
55215A0316P16J244K259K166Q08r3n1k67o78J15J735K087R52K60N08J73j020j463
$$ 10316 11032 12276 14535 16701 17509 17416 17365 17098 16420 16535 18270 20357 21309 21569 22077 22250 21230 19767
55197A9767p98m74p86m30O40R25K56l2O1p94k232k384j242p63j394j672j367j732
$$ 19767 18969 18495 17709 17279 17919 18844 19100 19068 19129 18335 16103 13719 12477 11714 10320 8648 7281 5549
55179E549k418j519R28K677K846K653K441J308j31l2J246J403K01j73R01J666
$$ 5549 3131 1612 2540 5217 8063 10716 13157 14465 14334 14302 15548 16951 17152 16979 17880 19546
55163A9546J599K149L288L050J311M31J135J257j94j265o53J87mk38L42P78M36
$$ 19546 21145 23294 26582 29632 30943 31374 32509 33766 33572 32307 31654 31841 31837 31599 31941 32719 33155
55146C3155K88Q98J423J647K583M283N361N445N693O375O467O141O918Q809J0059
$$ 33155 33443 34341 35764 37411 39994 44277 49638 55083 60776 67151 73618 79759 86677 95486 105545
55131A05545J0209J0670J1804J2328J2039J2097J2060R893N632J866k99k616o126
$$ 105545 115754 126424 138228 150556 162595 174692 186752 196645 202277 204143 203844 201228 195102
55118A95102r348j1050j1826j1902j0404p905o751p564q224p390o253n765n097
$$ 195102 185754 174704 162878 150976 140572 132667 125916 118352 110128 102738 96485 90720 85623
55105H5623l935l442l728l174j449m16q77j198m43rp58j289n40L95M64L36O33
$$ 85623 81688 78246 74518 71344 69895 69479 68602 67404 66961 66952 66194 64905 64365 64760 65224 65560 66193
55088F6193Q06Q51J761L343L969L380L230L975M043K914K214K646K759J897J490
$$ 66193 66999 67850 69611 72954 76923 80303 83533 87508 91551 94465 96679 99325 102084 103981 105471
55073A05471K130K314J368Q52J628K301J995J996L140M215M350M491N145N213
$$ 105471 107601 109915 111283 112135 113763 116064 118059 120055 123195 127410 131760 136251 141396 146609
55059A46609M410M168M879M822L189J510R06N93L40J452L962N746N867N933O767
$$ 146609 151019 155187 160066 164888 168077 169587 170493 171086 171426 172878 176840 182586 188453 194386 201153
55044B01153O884N783N456O672P009M712J574l28j804m052n776n446m219m016
$$ 201153 208037 213820 219276 225948 232957 237669 239243 238915 237111 233059 227283 221837 217618 213602
55030B13602m616m841m751m620l722j993j038j722k789l389m553o564p449o149
$$ 213602 208986 204145 199394 194774 191052 189059 188021 186299 183510 180121 175568 169004 161555 155406
55016A55406m674m945n764n143l496k328j736j278j417k264k733k574l095m434
$$ 155406 150732 145787 140023 134880 131384 129056 127320 126042 124625 122361 119628 117054 113959 109525
55002A09525m670l255k521l760m755l553j840j827k436j590qL69j48j04J62m57
$$ 109525 104855 101600 99079 95319 90564 87011 85171 83344 80908 79318 79310 79679 79531 79427 79589 79132
54986G9132j345j263o05k69K24J326J866J086N08J520K958L377L772N444P184
$$ 79132 77787 76524 75919 75650 75874 77200 79066 80152 80660 82180 85138 88515 92287 97731 104915
54971A04915P309O832P663R226R812R983J1652J4765J7582J9469K0986K2042K2248
$$ 104915 112224 119056 126719 135945 145757 155740 167392 182157 199739 219208 240194 262236 284484
54958B84484K2241K2572K2244K0292J7535J4818J0992M860k270q281j3178j7962
$$ 284484 306725 329297 351541 371833 389368 404186 415178 420038 417768 409487 396309 378347
54946C78347k1918k3585k3454k3224k3168k2402k0909j9241j7157j4425j1990
$$ 378347 356429 332844 309390 286166 262998 240596 219687 200446 183289 168864 156874
54935A56874j0488q901o500m712m921n865n458l908k696j786k55J388K019K114
$$ 156874 146386 137485 130985 126273 121352 115487 110029 106121 103425 101639 101384 102772 104791 106905
54921A06905K915M200M990N564O725Q126R226J0881J3855J6866J8076J7484J5942
$$ 106905 109820 114020 119010 124574 131299 139425 148651 159532 173387 190253 208329 225813 241755
54908B41755J3190Q865M118n9m638j0414j5468j7376j6773j6162j6122j5280j3187
$$ 241755 254945 263810 267928 267869 263231 252817 237349 219973 203200 187038 170916 155636 142449
54895A42449j0773q526o437n124m974m998m268l516l537l394k135q34p47r39j56
$$ 142449 131676 123150 116713 111589 106615 101617 97349 93833 90296 86902 84767 83933 83186 82247 82091
54880H2091N23m66k111k383j632j665k471k671k334k536k959k570j909k124k522
$$ 82091 82614 82148 80037 77654 76022 74357 71886 69215 66881 64345 61386 58816 56907 54783 52261
54865E2261j714l32m3o44p19l13m17o62j72K20o86j843j481k39%m91p1R02P01
$$ 52261 50547 50215 50172 49528 48809 48496 48079 47417 47245 47465 46779 44936 43455 43216 43216 42725 42654 43556 44257
54846D4257m66r05o84j252k253j882k60P13O54Q86J466J094lp5J088J832J561
$$ 44257 43791 42886 42202 40950 38697 36815 36555 37268 37922 38808 40274 41368 41365 41290 42378 44210 45771
54829D5771J281J294R61P28J660K968K741J183M40J130J747J596J588J940J820
$$ 45771 47052 48346 49307 50035 51695 54663 57404 58587 59027 60157 61904 63500 65088 67028 68848
54814F8848J497K256L873M753M772N463P156Q501R103J0157J2114J4132J5987
$$ 68848 70345 72601 76474 81227 85999 91462 98618 107119 116222 126379 138493 152625 168612
54801A68612J8133J9760J9290J7013J4726J2628R171M132q63n044r067j2614j4177
$$ 168612 186745 206505 225795 242808 257534 270162 279333 283465 282602 277558 268491 255877 241700
54788B41700j3738j3072j2867j2125j0722r823r301p601m826l184l484l852k949
$$ 241700 227962 214890 202023 189898 179176 169353 160052 152451 147625 144441 140957 137105 134156
54775A34156j838j626j614j066n28k29P74K716M243M507M458N168O506Q166J0336
$$ 134156 132318 130692 129078 128012 127484 127255 128029 130745 134988 139495 143953 149121 155627 163793 174129
54760A74129J2695J4400J5586J7214J8986J9254J7433J4670J1707Q021L518q26
$$ 174129 186824 201224 216810 234024 253010 272264 289697 304367 316074 324095 327613 326787
54748C26787m541q029j1030j2581j2925j3478j4580j5161j4853j4371j3632j1784
$$ 326787 322246 314217 303187 290606 277681 264203 249623 234462 219609 205238 191606 179822
54736A79822r482q655r475r875q738p304o638o024m788l600l017k575k129k285
$$ 179822 170340 161685 152210 142335 133597 126293 119655 113631 108843 105243 102226 99651 97522 95237
54722I5237k877k823k011j451j226l55R31J017l98j715k099k449l047k683j046
$$ 95237 92360 89537 87526 86075 84849 84494 85425 86442 86044 84329 82230 79781 76734 74051 73005
54707G3005L26M51K16L34J85l60j39J177K170J925J348J275J233Q95Q17R07J49
$$ 73005 73331 73782 73998 74332 74517 74157 74018 75195 77365 79290 80638 81913 83146 84041 84858 85765 85914
54690H5914j239j537k94P01K74l97m8P12Q49N26J56m40r47m56P74J273P57O13
$$ 85914 84675 83138 82844 83545 83819 83422 83374 84086 84935 85461 85617 85177 84230 83774 84548 85821 86578 87191
54672H7191J300J588J181J620L410M721M268L271L124L348L376M035N613O509
$$ 87191 88491 90079 91260 92880 96290 101011 105279 108550 111674 115022 118398 122433 128046 134555
54658A34555N645M340M067M129L358K369K280K626K406J905J840J885J547J450
$$ 134555 140200 144540 148607 152736 156094 158463 160743 163369 165775 167680 169520 171405 172952 174402
54644A74402K389M126O163Q525J0813J1931J1624J0882R962P673L594q00m234
$$ 174402 176791 180917 187080 195605 206418 218349 229973 240855 250817 258490 262084 261284 257050
54631B57050p083r710j1257j1385j1319j1881j2211j1599j0736j0005q548o317
$$ 257050 249967 240257 229000 217615 206296 194415 182204 170605 159869 149864 141316 134999
54619A34999m902m910m694l208j889j965k171j182j13l40q58j81Q36O72MK71P42
$$ 134999 130097 125187 120493 117285 115396 113431 111260 110078 109965 109625 108767 108586 109422 110094 110098 110369 111111
54602A11111k65k223l120k597j990j814j467j016j171j750j928j737j798k007
$$ 111111 110846 108623 105503 102906 100916 99102 97635 96619 95448 93698 91770 90033 88235 86228
54588H6228j899j789k122k345j790j024j083j893k674l131l177k434j125m37p98
$$ 86228 84329 82540 80418 78073 76283 75259 74176 72283 69609 66478 63301 60867 59742 59305 58507
54573E8507r42R0J283J344P19L85j6j121k126j905r33l34j8O21J079O68P6K72
$$ 58507 57565 57655 58938 60282 61001 61386 61370 60249 58123 56218 55285 54951 54933 55554 56633 57301 57377 57649
54555E7649P00L92%P47K077K319J286L66K98N98R16J352J601J210O02O43J323
$$ 57649 58349 58741 58741 59488 61565 63884 65170 65536 65834 66432 67348 68700 70301 71511 72113 72756 74079
54538G4079J934K220K406K572K875L777N221O234O198N763N657N542M833L602
$$ 74079 76013 78233 80639 83211 86086 89863 95084 101318 107516 113279 118936 124478 129311 132913
54524A32913J923n24l272m894n074n272o227o542n239l871m108m867m127k301
$$ 132913 134836 134312 131040 126146 121072 115800 109573 103031 97792 93921 89813 84946 80819 78518
54510G8518j409j771j977j533j273j428j423j348j775k292j887o64L01N82N55
$$ 78518 77109 75338 73361 71828 70555 69127 67704 66356 64581 62289 60402 59738 60039 60621 61176
54495F1176L70L6J06R28J727J682J263J293J453J109P37J059J494J109L59K97
$$ 61176 61546 61582 61688 62616 64343 66025 67288 68581 70034 71143 71880 72939 74433 75542 75901 76198
54479G6198P28P33M05M28O14M36L76J062J685J014n14j372j233j047j239j396
$$ 76198 76926 77659 78064 78492 79106 79542 79918 80980 82665 83679 83165 81793 80560 79513 78274 76878
54463G6878j437j588j578j125q03j159j549j167n72p22j207r28mN67N27K33m42
$$ 76878 75441 73853 72275 71150 70347 69188 67639 66472 65900 65178 63971 63043 63039 63606 64133 64366 63924
54446F3924j608k363j849p43l18p13j333k121k925k707j084L73J64p58n96L56
$$ 63924 62316 59953 58104 57361 57043 56330 54997 52876 49951 47244 46160 46533 46697 45939 45343 45699
54430D5699N41P1L70J413J734J047O36J080J591J641J521J255N90nJ01N04M72
$$ 45699 46240 46311 46681 48094 49828 50875 51511 52591 54182 55823 57344 58599 59189 59184 59285 59789 60261
54413F0261L86R02J270L86r93j080K12J351J683J894K156J837J079Q78J414J937
$$ 60261 60647 61549 62819 63205 62212 61132 61344 62695 64378 66272 68428 70265 71344 72222 73636 75573
54397G5573K221K621K920K601K109K231K567K139J209Q61J166J285R96N68k82
$$ 75573 77794 80415 83335 85936 88045 90276 92843 94982 96191 97052 98218 99503 100499 101067 100785
54382A00785j669k500j882q63r15j532j386r40j484k386j954n99l67j538k379
$$ 100785 99116 96616 94734 93871 92956 91424 90038 89098 87614 85228 83274 82675 82308 80770 78391
54367G8391k193j974j944j153K10O56l7m86k88n76j565j890r60J51O35P72N75
$$ 78391 76198 74224 72280 71127 71337 71993 71956 71470 71182 70606 69041 67151 66191 66342 66977 67749 68324
54350F8324k65r09j14J356J482M37N75K500L883L167J804J582K126K333K295K394
$$ 68324 68059 67150 67036 68392 69874 70311 70886 73386 77269 80436 82240 83822 85948 88281 90576 92970
54334I2970K206J576J200J169N12r45j950j893j812k409k783k194j411j272j390
$$ 92970 95176 96752 97952 99121 99633 98688 96738 94845 93033 90624 87841 85647 84236 82964 81574
54319H1574j347j686k657l318k896j940j239p34k48j25m27o05n61q86j710k361
$$ 81574 80227 78541 75884 72566 69670 67730 66491 65757 65509 65384 64957 64352 63791 62905 61195 58834
54303E8834k510k366j737l19R94Q03o01j510j420j380j601j019K84O75j99o05
$$ 58834 56324 53958 52221 51902 52896 53699 53098 51588 50168 48788 47187 46168 46452 47127 46928 46323
54287D6323K91R79M06r7O87J571J034j69m20J05J22l99m43K11Q24R68P52K99j23
$$ 46323 46614 47593 47999 47902 48589 50160 51194 51025 50605 50710 50832 50433 49990 50201 51025 51993 52745 53044 52921
54268E2921q0L00K69l52q01o82n56o94n48K1K31j62k34N10J167R00J91j32n3J91
$$ 52921 52841 53141 53410 53058 52257 51575 51019 50325 49777 49798 50029 49867 49633 50143 51310 52210 52401 52269 52216 52407
54248E2407O38R94O48j09j20P70J302P81L0k69n63j051r59j25L05k59q09n88l24
$$ 52407 53045 54039 54687 54578 54458 55228 56530 57311 57341 57072 56509 55458 54499 54374 54679 54420 53611 53023 52699
54229E2699n84n32L66R49J90r75j147o53o34j047r96l19M78J150J435P76n78j117
$$ 52699 52115 51583 51949 52898 53088 52113 50966 50313 49679 48632 47636 47317 47795 48945 50380 51156 50578 49461
54211D9461L6J639J948J000J30q1j00k54m21n09m39j8N23M64l37j020r55n92n02
$$ 49461 49497 51136 53084 54084 54214 54133 54033 53779 53358 52849 52410 52392 52915 53379 53042 52022 51067 50475 49973
54192D9973m35K5O57J025J028O47J0j37Q66K239K433J416P24R19Q05k02q79l66
$$ 49973 49538 49563 50220 51245 52273 52920 52930 52793 53659 55898 58331 59747 60471 61390 62195 61993 61114 60748
54174F0748L06P1m22k55P9j95n81l36Q2n9m16m00k95m22k78M12Q61M82o3j54l26
$$ 60748 61054 61125 60703 60448 60527 60332 59751 59415 59497 59438 59022 58622 58327 57905 57627 58039 58900 59382 59319 59165 58839
54153E8839r72j257n65K05J12k27J67R37J219J106R82M96m82j006m73K10J97K39
$$ 58839 57867 56610 56045 56250 56362 56135 56302 57239 58458 59564 60546 61042 60560 59554 59081 59291 59488 59727
54135E9727J163K046J608M14m1L23M45P3j84k09l23l48o3jn82j167j096r55j506
$$ 59727 60890 62936 64544 64958 64917 65240 65685 65758 65574 65365 65042 64694 64631 64630 64048 62881 61785 60830 59324
54116E9324k154j877r02j55K32N37L73n24j206o86L75O78L39L87P61M44o56j513
$$ 59324 57170 55293 54391 54236 54468 55005 55378 54854 53648 52962 53337 54015 54354 54741 55502 55946 55290 53777
54098E3777j577j307j127r50o98m78l51m31q58j273r51J7O01L92J75M20M47n9
$$ 53777 52200 50893 49766 48816 48118 47640 47289 46858 46000 44727 43776 43793 44394 44786 44961 45381 45828 45769
54080D5769j76N71J039L21o56o84k07j70k71J24M87K10M6P62J418Q63j04O6J108
$$ 45769 45593 46164 47203 47524 46868 46184 45977 45807 45536 45660 46147 46357 46403 47165 48583 49446 49342 49408 50516
54061E0516J577J262J062J042N85m2q7J14k49p57l75O73J261J220J172J028L23
$$ 50516 52093 53355 54417 55459 56044 56002 55915 56029 55780 55023 54648 55321 56582 57802 58974 60002 60325
54044F0325k68M02K027L168L267K931K512J934J553J754K068J999K187L340M720
$$ 60325 60057 60459 62486 65654 68921 71852 74364 76298 77851 79605 81673 83672 85859 89199 93919
54029I3919N232N242N607N746M672L205K962L584L253J864J331K538M096M502
$$ 93919 99151 104393 110000 115746 120418 123623 126585 130169 133422 135286 136617 139155 143251 147753
54015A47753L762K511J139J70R1N06O11M32M33K09q78k084k049r96n09j052j476
$$ 147753 151515 154026 155165 155335 155426 155932 156543 156975 157408 157617 156739 154655 152606 151610 151101 150049 148573
53998A48573j093o05o26q22p83n92l31m6j66r15j590j507j180j323j377n83J74
$$ 148573 147480 146875 146249 145427 144644 144052 143721 143675 143509 142594 141004 139497 138317 136994 135617 135034 135208
53981A35208m67j822j981q28j36o24j146j018r70j357j388p08q9L9J63L99J01
$$ 135208 134741 132919 130938 130110 129974 129350 128204 127186 126216 124859 123471 122763 122674 122713 122876 123275 123376
53964A23376p59j295j170j014j068q09j73K22L47P74J268Q69k80o79M84K369L803
$$ 123376 122617 121322 120152 119138 118070 117261 117088 117310 117657 118431 119699 120568 120288 119609 120093 122462 126265
53947A26265M410M220L577L504M768O438O847O065N837O986Q545R648J0455J0835
$$ 126265 130675 134895 138472 141976 146744 153182 160029 166094 171931 178917 187462 197110 207565 218400
53933B18400R933P677N147K854J96k861n146o018o232o424o102m945l716l081
$$ 218400 228333 236010 241157 244011 244207 241346 236200 230182 223950 217526 211424 206479 202763 199682
53919A99682k544j440K7J260J961J952J295Q39J573L215M426M670M623M727M661
$$ 199682 197138 195698 195725 196985 198946 200898 202193 203032 204605 207820 212246 216916 221539 226266 230927
53904B30927M428M528M724M087K614J441J038N74m62j403j675j643j716j741j735
$$ 230927 235355 239883 244607 248694 251308 252749 253787 254361 253899 252496 250821 249178 247462 245721 243986
53889B43986k067k558k595k333k581l355l884m151m906n990o343n908n836o350
$$ 243986 241919 239361 236766 234433 231852 228497 224613 220462 215556 209566 203223 197315 191479 185129
53875A85129o256n150m311m571n007m610l793l282k913k441k281k608k828k649
$$ 185129 178873 173723 169412 164841 159834 155224 151431 148149 145236 142795 140514 137906 135078 132429
53861A32429k538k601k253j563j537k451l295l454l501l716l367k229j272j001
$$ 132429 129891 127290 125037 123474 121937 119486 116191 112737 109236 105520 102153 99924 98652 97651
53847I7651n87L84Q49l2j441k212k376k335j877r96n40r42j356j051n51m62l27
$$ 97651 97064 97448 98297 98265 96824 94612 92236 89901 88024 87028 86488 85546 84190 83139 82588 82126 81799
53830H1799L24Q64O68K94N44J157J393J116N34l12j070j091n43m58j044j154j33
$$ 81799 82123 82987 83655 83949 84493 85650 87043 88159 88693 88381 87311 86220 85677 85219 84175 83021 82888
53813H2888J076J477J377J362J201P88Q49J634K173J855J494J793K053J618J287
$$ 82888 83964 85441 86818 88180 89381 90169 91018 92652 94825 96680 98174 99967 102020 103638 104925
53798A04925J945K965L416L713M521N157M721L919L997M591M410L520L201L694
$$ 104925 106870 109835 113251 116964 121485 126642 131363 135282 139279 143870 148280 151800 155001 158695
53784A58695L791K747J243K93J38M39P56P67N10L49L00r7r21j537j620j835k748
$$ 158695 162486 165233 166476 166769 166907 167346 168102 168869 169379 169728 170028 169931 169010 167473 165853 164018 161270
53767A61270l813m166l850l385k783j793p28j78k28n42r07j207j252j115j116
$$ 161270 157457 153291 149441 146056 143273 141480 140752 140574 140346 139804 138897 137690 136438 135323 134207
53752A34207j244j099o92n75q89j080q82o85o88n84m28o88j214j237q32r60j705
$$ 134207 132963 131864 131172 130597 129708 128628 127746 127061 126373 125789 125361 124673 123459 122222 121390 120430 118725
53735A18725j866r91k71n89j130r12l60k17j93R5N7p36j344p63N53J555K168K777
$$ 118725 116859 115868 115597 115008 113878 112966 112606 112389 112196 112291 112348 111612 110268 109505 110058 111613 113781 116558
53717A16558L068K586J763J298J106P75L62n4p36j475j476p63n42j223j492m72
$$ 116558 119626 122212 123975 125273 126379 127154 127516 127462 126726 125251 123775 123012 122470 121247 119755 119283
53701A19283O57N95P7N35J686K270K213K330K504J958R24M28P02J101J298J424
$$ 119283 119940 120535 120612 121147 122833 125103 127316 129646 132150 134108 135032 135460 136162 137263 138561 139985
53685A39985J403J276J598K558L332L288L030L150K929J603N8k93L92Q67P72O73
$$ 139985 141388 142664 144262 146820 150152 153440 156470 159620 162549 164152 164210 163917 164309 165176 165948 166621
53669A66621O89N49N02Q11Q45L5q23o09L02O64L67L42Q81J419J736K018K019J383
$$ 166621 167310 167859 168361 169172 170017 170052 169229 168620 168922 169586 169953 170295 171176 172595 174331 176349 178368 179751
53651A79751M94r5o31j461j994j568p74o19r02p50k15N1J28L99M03l88j135o42
$$ 179751 180245 180150 179519 178058 176064 174496 173722 173103 172201 171451 171236 171287 171415 171814 172217 171829 170694 170052
53633A70052O39J199P92N11P45P22J08m51n40m32k44K81J064J793K525L292L463
$$ 170052 170691 171890 172682 173193 173938 174660 174768 174317 173777 173345 173101 173382 174446 176239 178764 182056 185519
53616A85519K554J288P36Q56R33R52J374K015K451K946L779M275L803L055K941
$$ 185519 188073 189361 190097 190953 191886 192838 194212 196227 198678 201624 205403 209678 213481 216536 219477
53601B19477L008K510K147K919L964L724K672K685L965M845M562M050L836L350
$$ 219477 222485 224995 227142 230061 234025 237749 240421 243106 247071 251916 256478 260528 264364 267714
53587B67714K638K686L543L991L599L331L656L732L112K552K550K563K293K331
$$ 267714 270352 273038 276581 280572 284171 287502 291158 294890 298002 300554 303104 305667 307960 310291
53573C10291K851L006K320J474J128J055R01P73O34K33j00L08J208J583J260J151
$$ 310291 313142 316148 318468 319942 321070 322125 323026 323799 324433 324666 324566 324874 326082 327665 328925 330076
53557C30076J614J979K004K413L414L971L316K083J340J317J698K230K610K532
$$ 330076 331690 333669 335673 338086 341500 345471 348787 350870 352210 353527 355225 357455 360065 362597
53543C62597K248K403L069L602L638L436L253L120L173L408L252K414J794K402
$$ 362597 364845 367248 370317 373919 377557 380993 384246 387366 390539 393947 397199 399613 401407 403809
53529D03809L671M176L823L772M310M459L869L467L879M650N370O191O961P205
$$ 403809 407480 411656 415479 419251 423561 428020 431889 435356 439235 443885 449255 455446 462407 469612
53515D69612P281Q101R458J0074R698R562J0353J1306J1839J2488J3516J4143
$$ 469612 476893 484994 494452 504526 514224 523786 534139 545445 557284 569772 583288 597431
53503E97431J4037J4161J5275J6787J7916J8813J9698K0102J9890J9927K0766
$$ 597431 611468 625629 640904 657691 675607 694420 714118 734220 754110 774037 794803
53492G94803K1666K1772K1443K1461K1827K2127K2323K2383K1883K0778J9875
$$ 794803 816469 838241 859684 881145 902972 925099 947422 969805 991688 1012466 1032341
53481A032341J9757J9890J9505J8705J8094J7840J7771J7933J8392J8905J9175
$$ 1032341 1052098 1071988 1091493 1110198 1128292 1146132 1163903 1181836 1200228 1219133 1238308
53470A238308J9140J8729J7813J6645J5827J5633J5754J5737J5162J3607J1130
$$ 1238308 1257448 1276177 1293990 1310635 1326462 1342095 1357849 1373586 1388748 1402355 1413485
53459A413485Q704P333O791O019M573K847J072q63k790m563o654r308j1456j1938
$$ 1413485 1422189 1429522 1436313 1442332 1446905 1449752 1450824 1449961 1447171 1442608 1435954 1426646 1415190 1403252
53445A403252j1437j1663j2780j3525j3733j4623j6393j7655j7794j7860j8469
$$ 1403252 1391815 1380152 1367372 1353847 1340114 1325491 1309098 1291443 1273649 1255789 1237320
53434A237320j8791j8522j8791k0073k1053k0715j9954j9777j9537j8320j6636
$$ 1237320 1218529 1200007 1181216 1161143 1140090 1119375 1099421 1079644 1060107 1041787 1025151
53423A025151j5313j3882j1557q783o491m767l400k754k863k726j667m85o1K08
$$ 1025151 1009838 995956 984399 975616 969125 964358 960958 958204 955341 952615 950948 950463 950402 950610
53409I50610J329K974M227N166O353P503Q082Q650J0204J2514J4378J5242J5556
$$ 950610 951939 954913 959140 964306 970659 978162 986244 994894 1005098 1017612 1031990 1047232 1062788
53396A062788J5874J6535J7890J9936K2013K3641K5162K6978K8708K9921L0996
$$ 1062788 1078662 1095197 1113087 1133023 1155036 1178677 1203839 1230817 1259525 1289446 1320442
53385A320442L2466L4116L5581L7128L9017M0713M1634M2103M2705M3333M3740
$$ 1320442 1352908 1387024 1422605 1459733 1498750 1539463 1581097 1623200 1665905 1709238 1752978
53374A752978M4295M5197M5651M4912M3601M2840M2585M1874M0390L8644L6812
$$ 1752978 1797273 1842470 1888121 1933033 1976634 2019474 2062059 2103933 2144323 2182967 2219779
53363B219779L4428L1207K7428K3583K0133J7317J4751J1538P332K778j502n716
$$ 2219779 2254207 2285414 2312842 2336425 2356558 2373875 2388626 2400164 2407496 2410274 2408772 2403056
53351B403056j0169j4439j8010k1071k3985k6518k8372k9854l1393l2914l4419
$$ 2403056 2392887 2378448 2360438 2339367 2315382 2288864 2260492 2230638 2199245 2166331 2131912
53340B131912l6366l8767m0559m0768l9707l8232l6590l4705l2957l1684l0668
$$ 2131912 2095546 2056779 2016220 1975452 1935745 1897513 1860923 1826218 1793261 1761577 1730909
53329A730909k9897l0051l1234l2029l1094k9022k7354k6259k4593k1936j9202
$$ 1730909 1701012 1670961 1639727 1607698 1576604 1547582 1520228 1493969 1469376 1447440 1428238
53318A428238j7278j6153j5386j4524j3028j0716q219o447n776o198p728r965
$$ 1428238 1410960 1394807 1379421 1364897 1351869 1341153 1332934 1326487 1320711 1314513 1306785 1296820
53306A296820j1800j2434j2268j1961j1256r716q029p286p280o792n387l793k604
$$ 1296820 1285020 1272586 1260318 1248357 1237101 1227385 1219356 1212070 1204790 1197998 1192611 1188818 1186214
53293A186214j695r12k55O17K065L584M234M141M551O223Q555J0570J2062J3404
$$ 1186214 1184519 1183607 1183352 1183969 1186034 1189618 1193852 1197993 1202544 1208767 1217322 1227892 1239954 1253358
53279A253358J4884J6541J8173J9361J9812J9820J9943K0217K0079J9181J7881
$$ 1253358 1268242 1284783 1302956 1322317 1342129 1361949 1381892 1402109 1422188 1441369 1459250
53268A459250J6788J6105J5502J4453J2715J0588Q679P296O212N019L541J791
$$ 1459250 1476038 1492143 1507645 1522098 1534813 1545401 1554080 1561376 1567588 1572607 1576148 1577939
53256A577939r9j858l302m681o422q479j0341j1784j3079j4402j5679j6997j8528
$$ 1577939 1577840 1575982 1572680 1567999 1561577 1553098 1542757 1530973 1517894 1503492 1487813 1470816 1452288
53243A452288j9912k0514k0418k0359k0508k0271j9518j8943j8828j8434j7267
$$ 1452288 1432376 1411862 1391444 1371085 1350577 1330306 1310788 1291845 1273017 1254583 1237316
53232A237316j5974j5388j5449j5694j5948j6037j5576j4661j3927j3500j2753
$$ 1237316 1221342 1205954 1190505 1174811 1158863 1142826 1127250 1112589 1098662 1085162 1072409
53221A072409j1571j0782j0753j0694r992r143q593p876o719n850n697n553m988
$$ 1072409 1060838 1050056 1039303 1028609 1018617 1009474 1000881 993005 986286 980436 974739 969186 964198
53208I64198m965o297q172r444j0360j1609j2778j3192j3394j4183j5025j4998
$$ 964198 959233 952936 944764 935320 924960 913351 900573 887381 873987 859804 844779 829781
53196H29781j4597j4918j5664j5604j4644j3781j3381j3059j2951j3510j4250
$$ 829781 815184 800266 784602 768998 754354 740573 727192 714133 701182 687672 673422
53185F73422j4192j3456j3079j3419j3992j4700j5769j6710j6684j5858j5121
$$ 673422 659230 645774 632695 619276 605284 590584 574815 558105 541421 525563 510442
53174E10442j4688j4201j3860j4036j3967j2534j0198q669q524q716q520q430
$$ 510442 495754 481553 467693 453657 439690 427156 416958 408289 399765 391049 382529 374099
53162C74099q762q885q374p732p413p112o484n721n069m498m110m074m144l919
$$ 374099 365337 356452 348078 340346 332933 325821 319337 313616 308547 304049 299939 295865 291721 287802
53148B87802l590l607l733l370k675k319k244j751q61m38q26j393j594j537j346
$$ 287802 284212 280605 276872 273502 270827 268508 266264 264513 263652 263214 262388 260995 259401 257864 256518
53133B56518r36o15r30j748k272k183j953j997k220k527k974l365l420l247l098
$$ 256518 255582 254967 254037 252289 250017 247834 245881 243884 241664 239137 236163 232798 229378 226131 223033
53118B23033k804k229j930k438l229l465l388l838m603m601l602k479j749j176
$$ 223033 220229 218000 216070 213632 210403 206938 203550 199712 195109 190508 186906 184427 182678 181502
53104A81502r36j754l457m637m306l017j974j777k291k933k921j976q84o28j080
$$ 181502 180566 178812 175355 170718 166412 163395 161421 159644 157353 154420 151499 149523 148639 148011 146931
53089A46931j361j321j568k127k316j979j713j642j189l07K55K10K22P02J134
$$ 146931 145570 144249 142681 140554 138238 136259 134546 132904 131715 131408 131663 131873 132095 132797 133931
53074A33931R75L83k64q50j286j491j673j977j937j163l20k70m71L63K024K776
$$ 133931 134906 135289 135025 134175 132889 131398 129725 127748 125811 124648 124328 124058 123587 123950 125974 128750
53058A28750J868N13n4n8j13p7J74J7q68j704j712j263j057r32l81L51N42K4p45
$$ 128750 130618 131131 131077 131019 130906 130829 131003 131020 130152 128448 126736 125473 124416 123484 123103 123454 123996 124020 123275
53039A23275j353j597j304n28K82O50M89L0m44o51m97k07k1J28L28L44M6j01L43
$$ 123275 121922 120325 119021 118493 118775 119425 119914 119944 119500 118849 118352 118145 118124 118252 118580 118924 118970 118869 119212
53020A19212R74J137J033J330J929K030J469R51R31J140J287J379J236N89k70
$$ 119212 120186 121323 122356 123686 125615 127645 129114 130065 130996 132136 133423 134802 136038 136627 136357
53005A36357p14n96k02M41J357K038K051J884K191K520K058J264J299K052K332
$$ 136357 135643 135047 134845 135286 136643 138681 140732 142616 144807 147327 149385 150649 151948 154000 156332
52990A56332J915J736J929J507L56k34L14Q65M29m24q43j060j598k201k413k303
$$ 156332 158247 159983 161912 163419 163775 163541 163855 164720 165149 164725 163882 162822 161224 159023 156610 154307
52974A54307j962j215m31n03j435k008j521p37m70l40J91O62M19k14m98l45j03
$$ 154307 152345 151130 150699 150196 148761 146753 145232 144495 144025 143685 143876 144538 144957 144743 144245 143900 143797
52957A43797O9N7k83n62MJ309K080J534M29j19p8k4j5K25N72P06O51O01N62N52
$$ 143797 143866 143923 143640 143078 143082 144391 146471 148005 148434 148315 148237 148213 148198 148423 148995 149701 150352 150953 151515 152067
52937A52067O81Q06O83N43Q56J435J560J110O40K73l71j058r52l8O30N14K25K03
$$ 152067 152748 153554 154237 154780 155636 157071 158631 159741 160381 160654 160283 159225 158273 158235 158865 159379 159604 159807
52919A59807P7k36j05N23P60L25J18N90R09N32K92Q37J376J080N92Q49J438J438
$$ 159807 159884 159648 159543 160066 160826 161151 161269 161859 162768 163300 163592 164429 165805 166885 167477 168326 169764 171202
52901A71202J073J181J638J629J081O70O81P67O56L47j47o52p62l53J88N91J067
$$ 171202 172275 173456 175094 176723 177804 178474 179155 179922 180578 180925 180778 180126 179364 179011 179199 179790 180857
52884A80857J699K145K210K115J949J597J306J503J871J701J233J446K318K735
$$ 180857 182556 184701 186911 189026 190975 192572 193878 195381 197252 198953 200186 201632 203950 206685
52870B06685K431K385K864K769J729J069J649K345J876O90j85p94j384j308k41
$$ 206685 209116 211501 214365 217134 218863 219932 221581 223926 225802 226492 226307 225513 224129 222821 222580
52855B22580O88M32l78p12q52j349j493n86L24j07j167j093J04P40J05p37p56
$$ 222580 223268 223700 223322 222610 221758 220409 218916 218330 218654 218547 217380 216287 216391 217131 217236 216499 215743
52838B15743p4P08J059N44o45j433j132n30o62j139r19j79ln59r83r14q12r40
$$ 215743 215669 216377 217436 217980 217335 215902 214770 214240 213578 212439 211520 211341 211338 210779 209796 208882 208070 207130
52820B07130j130j445j984k278j916j431j586k090k108j682j451j322p16Q4J44
$$ 207130 206000 204555 202571 200293 198377 196946 195360 193270 191162 189480 188029 186707 185991 186075 186219
52805A86219n96j133r15m78m91r26j350j468j378j574k405l212k747r20O86P81
$$ 186219 185623 184490 183575 183097 182606 181680 180330 178862 177484 175910 173505 170293 167546 166626 167312 168093
52789A68093l3m76m51o03q97r08q55j132j406j303j357k065k715k457j829j814
$$ 168093 168060 167584 167133 166530 165633 164725 163870 162738 161332 160029 158672 156607 153892 151435 149606 147792
52773A47792k088j669q15n87r93j109p66n62m67N3O99N91k69j138j920k963l785
$$ 147792 145704 144035 143220 142633 141640 140531 139765 139203 138736 138789 139488 140079 139810 138672 136752 133789 130004
52756A30004l515k518j974k024j784j096o98p08n38l01o69j317j159l16j44j035
$$ 130004 126489 123971 121997 119973 118189 117093 116395 115687 115149 114848 114179 112862 111703 111387 111243 110208
52740A10208j826j806j672j906j801q26L01P30O68P45J039J372J737K008J903
$$ 110208 108382 106576 104904 102998 101197 100371 100672 101402 102070 102815 103854 105226 106963 108971 110874
52725A10874J591J582J853J857J475J114P46j04j291j984j932j760j788j615j135
$$ 110874 112465 114047 115900 117757 119232 120346 121092 120988 119697 117713 115781 114021 112233 110618 109483
52710A09483r85j528k317k857l082k838j870o61l51j312k497k650j647m26k4p88
$$ 109483 108498 106970 104653 101796 98714 95876 94006 93345 92994 91682 89185 86535 84888 84462 84438 83650
52694H3650j978k301j380l70m29j025q63n6Q7p44j386j121n85l76j28M29P35L93
$$ 83650 81672 79371 77991 77621 77192 76167 75304 75248 75335 74591 73205 72084 71499 71123 70995 71424 72159 72552
52676G2552j09k36k23m32p66j083j476j706j205j46L59k78j160j047M5R84Q65
$$ 72552 72443 72207 71984 71552 70786 69703 68227 66521 65316 65170 65529 65251 64091 63044 63089 64073 64938
52659F4938j69j232j499q80m8L62L65K53K3l08k94L66J079J055M66J14K23L61
$$ 64938 64769 63537 62038 61158 61110 61472 61837 62090 62113 61805 61511 61877 62956 64011 64477 64591 64814 65175
52641F5175L78M24L43q5m81l87j55l67p07m83Q2K55J43L74P12M13k43k70K75L78
$$ 65175 65553 65977 66320 66235 65754 65367 65212 64845 64138 63655 63737 63992 64135 64509 65221 65634 65391 65121 65396 65774
52621F5774j36m31l26m84q31m45O50J226Q82P07J337J869J419L97m40r84j175
$$ 65774 65638 65207 64881 64397 63566 63121 63771 64997 65879 66586 67923 69792 71211 71608 71168 70184 69009
52604F9009o45L20O83J70j94K37P42O10L45O03J004R10N29L69L29N6l67o92q52
$$ 69009 68364 68684 69367 69537 69343 69580 70322 70932 71277 71880 72884 73794 74323 74692 75021 75077 74710 74018 73166
52585G3166o83J7Q45J075Q27R67J603J774J105N27P27J032N99k43o13k60N04J370
$$ 73166 72483 72500 73345 74420 75247 76214 77817 79591 80696 81223 81950 82982 83581 83338 82725 82465 82969 84339
52567H4339J935J798J226J066J568K033J942J616J456J353J183J087J021Q46R08
$$ 84339 86274 88072 89298 90364 91932 93965 95907 97523 98979 100332 101515 102602 103623 104469 105377
52552A05377J540K039J405J00l48L71J038J057J177J689J688Q98L81O63Q42M30
$$ 105377 106917 108956 110361 110461 110113 110484 111522 112579 113756 115445 117133 118031 118412 119075 119917 120347
52536A20347L35R45J077Q8o89j24P40M95k70j87N39P95O17P06P77J33p55r27o60
$$ 120347 120682 121627 122704 122792 122103 121979 122719 123214 122944 122757 123296 124091 124708 125414 126191 126324 125569 124642 123982
52517A23982r35j560j499o50J35N59R54J163P23K9p1L35M10O9NL03K25n04j225
$$ 123982 123047 121487 119988 119338 119473 120032 120986 122149 122872 122901 122830 123165 123575 123644 123649 123952 124177 123673 122448
52498A22448j305q13j96J14j39o99q44l10K81M44O38J296J741J137j0m07K16R44
$$ 122448 121143 120330 120134 120248 120109 119410 118566 118256 118537 118981 119619 120915 122656 123793 123783 123376 123592 124536
52480A24536J108R11P48P42R18J140J069O93N69R59J191O88j2p8K46J96o5K72
$$ 124536 125644 126555 127303 128045 128963 130103 131172 131865 132434 133393 134584 135272 135260 135182 135428 135624 135559 135831
52462A35831J174J685J379Q06M43J04l40m82M3J005J774J881J340P02O36J249
$$ 135831 137005 138690 140069 140875 141318 141422 141082 140600 140643 141648 143422 145303 146643 147345 147981 149230
52446A49230K038K640L136L416K950J661M13j4J08K5m65j104j756k233k133j530
$$ 149230 151268 153908 157044 160460 163410 165071 165484 165470 165578 165603 165138 164034 162278 160045 157912 156382
52430A56382j206j529j737j098j91q8p44j209j083q43q51j014j327k020k987l628
$$ 156382 155176 153647 151910 150812 150621 150533 149789 148580 147497 146654 145803 144789 143462 141442 138455 134827
52414A34827l386k230p64J24Q2j29M46J439J483L06o68l24N69O57j85j179j852
$$ 134827 131441 129211 128447 128571 128653 128524 128970 130409 131892 132198 131530 131206 131775 132432 132247 131068 129216
52397A29216j922q83J103K667K693J751J010N18k72q84l48J051J924J628Q44L43
$$ 129216 127294 126411 127514 130181 132874 134625 135635 136153 135881 134997 134649 135700 137624 139252 140096 140439
52381A40439K24L71O78Q72P93P57J050J315J112P38P42R95R55N83K63J99M52J167
$$ 140439 140663 141034 141712 142584 143377 144134 145184 146499 147611 148349 149091 150086 151041 151624 151887 152086 152538 153705
52363A53705K125K631K483K399K820K938J941M92pQ79K484M067N067M960L818
$$ 153705 155830 158461 160944 163343 166163 169101 171042 171534 171527 172406 174890 178957 184024 188984 192802
52348A92802K553J813J344R98J399K610L338K693J743J846K480K335J676J780
$$ 192802 195355 197168 198512 199510 200909 203519 206857 209550 211293 213139 215619 217954 219630 221410
52334B21410K620L011K692K391K187J552R41J436K758L402K876K311K574L186
$$ 221410 224030 227041 229733 232124 234311 235863 236804 238240 240998 244400 247276 249587 252161 255347
52320B55347L395L116K539J883J574J790K019K003K573M281N865N725M424L904
$$ 255347 258742 261858 264397 266280 267854 269644 271663 273666 276239 280520 286385 292110 296534 300438
52306C00438M565N058M894N118O221P324P887Q345Q730Q476Q029Q766J0691J2057
$$ 300438 305003 310061 314955 320073 326294 333618 341505 349850 358580 367056 375085 383851 394542 406599
52292D06599J2026J1926J2936J4206J4439J3956J3962J4801J6017J7237J8163
$$ 406599 418625 430551 443487 457693 472132 486088 500050 514851 530868 548105 566268
52281E66268J8474J8511J9156K0382K0940K0116J8859J8355J8510J8570J8353
$$ 566268 584742 603253 622409 642791 663731 683847 702706 721061 739571 758141 776494
52270G76494J7990J7273J6145J5166J4691J4191J3108J1766J0744R978R072Q098
$$ 776494 794484 811757 827902 843068 857759 871950 885058 896824 907568 917546 926618 934716
52258I34716P312O556N437L823J847j93j726k280k138k120k493k787k786k914
$$ 934716 942028 948584 954021 957844 959691 959498 957772 955492 953354 951234 948741 945954 943168 940254
52244I40254l327l544l284k894k578j983r77n2N06J206K641M720O971Q995J0385
$$ 940254 936927 933383 930099 927205 924627 922644 921667 921615 922121 923327 925968 930688 937659 946654 957039
52229I57039J0905J1020J1554J2545J3143J2976J2751J3151J3819J3926J3180
$$ 957039 967944 978964 990518 1003063 1016206 1029182 1041933 1055084 1068903 1082829 1096009
52218A096009J1865J0421R264Q519P720O320M543L133K167Q76j193l593n752p611
$$ 1096009 1107874 1118295 1127559 1136078 1143798 1150118 1154661 1157794 1159961 1160837 1159644 1156051 1150299 1142688
52204A142688r294j0759j2005j3120j4040j4772j5626j6686j7373j7355j7330
$$ 1142688 1133394 1122635 1110630 1097510 1083470 1068698 1053072 1036386 1019013 1001658 984328
52193I84328j7873j8075j6791j4796j3953j4349j4243j2981j1880j1721j1424
$$ 984328 966455 948380 931589 916793 902840 888491 874248 861267 849387 837666 826242
52182H26242j0110q631p923p486o743o395o992p474o648n209m714n290n730n385
$$ 826242 816132 807501 799578 792092 785349 778954 771962 764488 757840 752631 747917 742627 736897 731512
52168G31512m643l923l284k841k686k651k771l456m581n074m243k914k432l003
$$ 731512 726869 722946 719662 716821 714135 711484 708713 705257 700676 695602 691359 688445 686013 683010
52154F83010l889m615n052m856l828k629k196k532k809k574k185k138k453k778
$$ 683010 679121 674506 669454 664598 660770 658141 655945 653413 650604 648030 645845 643707 641254 638476
52140F38476k834k736k923l492l753l043j882j542k353l362l768l712l369k447
$$ 638476 635642 632906 629983 626491 622738 619695 617813 616271 613918 610556 606788 603076 599707 597260
52126E97260j074j01J06J37K29l48j825k984k698j546q12p45p97q38r45p00J35
$$ 597260 596186 596085 596191 596328 596557 596209 594384 591400 588702 587156 586344 585599 584802 583964 583019 582319 582454
$$ [...]
##END NTUPLES=NMR SPECTRUM
##END=
