
##TITLE=AC1329_ISIAH12158_6535987_FYheWWhY05
##JCAMPDX= 6.0         $$ Bruker NMR JCAMP-DX V2.0
##DATA TYPE= NMR SPECTRUM
##DATA CLASS= NTUPLES
##ORIGIN= BRUKER
##OWNER= Administrator
$$ 1.72 TOPSPIN		Version 2.1
$$ 2012-07-17 20:48:29.906 -0500  Administrator@TOPSPIN
$$ Compression mode = diff/dup
##.OBSERVE FREQUENCY= 400.02188249412
##.OBSERVE NUCLEUS= ^1H
##.ACQUISITION MODE= SIMULTANEOUS (DQD)
##.ACQUISITION SCHEME= undefined
##.AVERAGES= 8
##.DIGITISER RES= 22
##SPECTROMETER/DATA SYSTEM= spect
##.PULSE SEQUENCE= zg30
##.SOLVENT NAME= COFFEE_meoh
##.SHIFT REFERENCE= INTERNAL, COFFEE_meoh, 1, 14.98509
##AUDIT TRAIL= $$ (NUMBER, WHEN, WHO, WHERE, PROCESS, VERSION, WHAT)
$$ ##TITLE= Audit trail, TOPSPIN		Version 2.1
$$ ##JCAMPDX= 5.01
$$ ##ORIGIN= Bruker BioSpin GmbH
$$ ##OWNER= Administrator
$$ $$ C:\Bruker\TOPSPIN/data/COFFEE/nmr/AC1329_ISIAH12158_6535987_FYheWWhY05/10/pdata/1/auditp.txt
$$ ##AUDIT TRAIL=  $$ (NUMBER, WHEN, WHO, WHERE, PROCESS, VERSION, WHAT)
(   1,<2012-07-17 20:48:23.046 -0500>,<Administrator>,<TOPSPIN>,<go>,<TOPSPIN 2.1>,
      <created by zg
	started at 2012-07-17 20:47:16.156 -0500,
	POWCHK enabled, PULCHK disabled,
       configuration hash MD5:
       6B 1B 68 BB D9 2E 58 E2 7F 35 AD 54 07 DF 0E 41
       data hash MD5: 64K
       B8 87 B6 A8 B0 79 28 A2 1D A2 E4 85 99 D3 55 84>)
(   2,<2012-07-17 20:48:25.781 -0500>,<Administrator>,<TOPSPIN>,<proc1d>,<TOPSPIN 2.1>,
      <Start of raw data processing
       efp LB = 0 FT_mod = 6 PKNL = 1 PHC0 = 0 PHC1 = 0 SI = 32K 
       data hash MD5: 32K
       3F EB 6F 94 BC 5A 21 F5 62 27 3B D9 FC FA 92 B8>)
(   3,<2012-07-17 20:48:26.187 -0500>,<Administrator>,<TOPSPIN>,<proc1d>,<TOPSPIN 2.1>,
      <pk PHC0 = 177.171 PHC1 = 0 
       data hash MD5: 32K
       43 21 4C 19 C8 8D 31 03 B8 03 3B F1 63 16 9E 9C>)
(   4,<2012-07-17 20:48:26.296 -0500>,<Administrator>,<TOPSPIN>,<proc1d>,<TOPSPIN 2.1>,
      <abs ABSG = 1 
       data hash MD5: 32K
       AB 0E C2 D9 01 FF 4B 96 46 E7 FD 1F D4 B5 20 74>)
(   5,<2012-07-17 20:48:26.328 -0500>,<Administrator>,<TOPSPIN>,<proc1d>,<TOPSPIN 2.1>,
      <abs ABSG = 2 
       data hash MD5: 32K
       07 99 0E 03 24 50 38 6E 4F 4F 2A B1 4D 32 F6 2F>)
(   6,<2012-07-17 20:48:26.359 -0500>,<Administrator>,<TOPSPIN>,<proc1d>,<TOPSPIN 2.1>,
      <abs ABSG = 3 
       data hash MD5: 32K
       D9 09 88 9A BA FC FB E5 F2 7B E7 BF B5 83 AE D2>)
(   7,<2012-07-17 20:48:26.406 -0500>,<Administrator>,<TOPSPIN>,<proc1d>,<TOPSPIN 2.1>,
      <abs ABSG = 4 
       data hash MD5: 32K
       E7 2C 9D 0C 29 62 46 C4 B4 B9 F6 EB 23 38 4A 1B>)
(   8,<2012-07-17 20:48:26.421 -0500>,<Administrator>,<TOPSPIN>,<proc1d>,<TOPSPIN 2.1>,
      <abs ABSG = 5 
       data hash MD5: 32K
       FB F2 92 DD 09 DB F7 B0 E7 CF 15 D0 EB 5A 2B 14>)
$$ ##END=
$$ 
$$ $$ hash MD5
$$ $$ 77 2D D9 D9 C1 B0 A1 B4 EA 00 D5 D6 EE 65 87 C1
##$RELAX= 
##$RELAX= 
##$RELAX= 
##$RELAX= 
##$RELAX= 
##$RELAX= 
##$RELAX= 
$$ Bruker specific parameters
$$ --------------------------
$$ [...]
150 150 150 150 150 150 150 150
##$TP07= 0
##$TPNAME0= <>
##$TPNAME1= <>
##$TPNAME2= <>
##$TPNAME3= <>
##$TPNAME4= <>
##$TPNAME5= <>
##$TPNAME6= <>
##$TPNAME7= <>
##$TPOAL= (0..7)
0.5 0.5 0.5 0.5 0.5 0.5 0.5 0.5
##$TPOFFS= (0..7)
0 0 0 0 0 0 0 0
##$TUNHIN= 0
##$TUNHOUT= 0
##$TUNXOUT= 0
##$USERA1= <user>
##$USERA2= <user>
##$USERA3= <user>
##$USERA4= <user>
##$USERA5= <user>
##$V9= 5
##$VALIST= <valist>
##$VCLIST= <CCCCCCCCCCCCCCC>
##$VD= 0
##$VDLIST= <DDDDDDDDDDDDDDD>
##$VPLIST= <PPPPPPPPPPPPPPP>
##$VTLIST= <TTTTTTTTTTTTTTT>
##$WBST= 2048
##$WBSW= 25
##$XGAIN= (0..3)
0 0 0 0
##$XL= 0
##$YL= 0
##$YMAX_a= 497100
##$YMIN_a= -634284
##$ZGOPTNS= <>
##$ZL1= 120
##$ZL2= 120
##$ZL3= 120
##$ZL4= 120
##$ABSF1= 14.98509
##$ABSF2= -5.573092
##$ABSG= 5
##$ABSL= 3
##$ALPHA= 0
##$AQORDER= 0
##$ASSFAC= 0
##$ASSFACI= 0
##$ASSFACX= 0
##$ASSWID= 0
##$AUNMP= <proc_prof1d_extract_pilot.lims>
##$AXLEFT= 0
##$AXNAME= <>
##$AXNUC= <1H>
##$AXRIGHT= 0
##$AXTYPE= 0
##$AXUNIT= <>
##$AZFE= 0.1
##$AZFW= 0.1
##$BCFW= 0
##$BC_mod= 0
##$BYTORDP= 0
##$COROFFS= 0
##$CY= 15
##$DATMOD= 1
##$DC= 0
##$DFILT= <>
##$DTYPP= 0
##$F1P= 0
##$F2P= 0
##$FCOR= 0.5
##$FTSIZE= 32768
##$FT_mod= 6
##$GAMMA= 0
##$GB= 0
##$INTBC= 1
##$INTSCL= 1
##$ISEN= 128
##$LB= 0
##$LEV0= 0
##$LPBIN= 0
##$MAXI= 10000
##$MC2= 0
##$MEAN= 0
##$ME_mod= 0
##$MI= 0
##$NCOEF= 0
##$NC_proc= -8
##$NLEV= 6
##$NOISF1= 0
##$NOISF2= 0
##$NSP= 0
##$NTH_PI= 0
##$NZP= 0
##$OFFSET= 14.98509
##$PC= 1
##$PHC0= 177.171
##$PHC1= 0
##$PH_mod= 1
##$PKNL= yes
##$PPARMOD= 0
##$PPDIAG= 0
##$PPIPTYP= 0
##$PPMPNUM= 2147483647
##$PPRESOL= 1
##$PSCAL= 4
##$PSIGN= 0
##$PYNMP= <proc.py>
##$REVERSE= no
##$SF= 400.02
##$SI= 32768
##$SIGF1= 0
##$SIGF2= 0
##$SINO= 400
##$SIOLD= 32768
##$SPECTYP= <>
##$SREGLST= <1H.CDCl3>
##$SSB= 0
##$STSI= 32768
##$STSR= 0
##$SW_p= 8223.68421052631
##$SYMM= 0
##$S_DEV= 0
##$TDeff= 65536
##$TDoff= 0
##$TI= <>
##$TILT= no
##$TM1= 0
##$TM2= 0
##$TOPLEV= 0
##$USERP1= <user>
##$USERP2= <user>
##$USERP3= <user>
##$USERP4= <user>
##$USERP5= <user>
##$WDW= 1
##$XDIM= 32768
##$YMAX_p= 473107293
##$YMIN_p= -663656
##$CURPLOT= <Network HP LaserJet P1505>
##$CURPRIN= <$Network HP LaserJet P1505>
##$DFORMAT= <normdp>
##$LAYOUT= <+/1D_H.xwp>
##$LFORMAT= <normlp>
##$PFORMAT= <normpl>
##$SURQMSG= 1
$$ End of Bruker specific parameters
$$ ---------------------------------
##NTUPLES= NMR SPECTRUM
##VAR_NAME=  FREQUENCY,     SPECTRUM/REAL,   SPECTRUM/IMAG
##SYMBOL=    X,             R,               I
##VAR_TYPE=  INDEPENDENT,   DEPENDENT,       DEPENDENT
##VAR_FORM=  AFFN,          ASDF,            ASDF
##VAR_DIM=   32768,         32768,           32768
##UNITS=     HZ,            ARBITRARY UNITS, ARBITRARY UNITS
##FACTOR=    0.250966925370066, 1,           1
##FIRST=     8223.43324360094, 194595,       -133720
##LAST=      0,             5835,            -69834
##MIN=       0,             -663656,         0
##MAX=       8223.43324360094, 473107293,    0
$$ Real data points
##PAGE= N=1
##DATA TABLE= (X++(R..R)), XYDATA
$$ [...]
19574b67645m6263D324h8175A12082a4062q7060E3575d52955B63154F1493A8175
19562c1755A03954j0930J99728b66890b4909j9136j19274A65652b60837J28076
19552a32761p6671m9814B7747b51409A00343I577a05490C46098b66403a10380
19541b5852j6799n39859b51123L0288P6175j47895a12621K7373B325a3990k36494
19530b50484I5880L9145i2703d4216r9422B05478H7597c14327A8361J54401a30969
19518a25326H7482a68590A38310j2928f3763n2290A32271a06795D3078a05037
19507C0813J79837B262a39100B5995J02577m9251k2598g2831q8240d3842a4621
19495A51755a17064N3402A11964b28238R6019j51851J38507j06078j39111a67162
$$ plain form
19574 -267645 -313908 4324 -88175 112082 -14062 -101122 53575 -452955 263154 61493 18175
19562 -31755 103954 93024 292752 -266890 -24909 -44045 -163319 165652 -260837 -132761
19552 -132761 -209432 -259246 27747 -251409 100343 9577 -105490 346098 -266403 -110380
19541 -25852 -42651 -582510 -251123 -220835 -144660 -292555 -112621 -85248 2325 -13990 -250484
19530 -250484 95880 135025 -92703 -44216 -143638 205478 87597 -314327 18361 172762 -130969
19518 -125326 87482 -168590 138310 125382 -63763 -116053 132271 -106795 43078 -105037
19507 30813 210650 2262 -139100 25995 128572 79321 56723 -72831 -161071 -43842 -14621
19495 151755 -117064 -63662 111964 -228238 -132219 -284070 -145563 -251641 -390752 -167162
19484B71886a99400N8423A64064a01790h980l455k97636B37608b9601B87768a06475
19472i1418c9876j70349A643a29367a1395D8785b53639g3031I1119a57556g2147
19460f2023A72206i1340o4106A92896C1899b00060A92298a28890A74015o4468
19450A09547O6013a01763m0513j30212B90467b44256P7048Q3503p585K2431k8799
19439i7658A41199a909j79950G8522q329K18208a06325J0579c5727k1104A46695
19427I6534a81404A34327P709p0190a46534F2587P9447D3112b66650J32876A25256
19415a28528n999A9540L9270J46085E1034O6425A388b32073h1695C4467c7863
19403F0293a32549N863l8850f348B36124j2003b75590j7220a37790k1477d7135
$$ plain form
19484 271886 -199400 -140977 164064 -101790 -8980 -12435 -310071 237608 -29601 287768 -106475
19472 -91418 -39876 -210225 1643 -129367 -11395 48785 -253639 -73031 91119 -157556 -72147
19460 -62023 172206 -91340 -155446 192896 31899 -200060 192298 -128890 174015 109547
19450 109547 175560 -101763 -142276 -272488 290467 -244256 -167208 -83705 -91290 -68859 -97658
19439 -97658 141199 -1909 -181859 78522 70193 288401 -106325 -95746 -35727 -56831 146695
19427 96534 -181404 134327 142036 71846 -146534 62587 142034 43112 -266650 -133774 125256
19415 -128528 -134527 19540 58810 204895 51034 117459 1388 -232073 -81695 34467 -37863
19403 60293 -132549 -126686 -165536 -6348 236124 224121 -275590 -292810 -137790 -159267 -47135
19391H2104E661a9564j28459L6980A55853b48024i9901k5106l3878O9912L9961
19380d9012c987q3299N561o832B1559a40073A02719c8143A1856a86390l2698l2725
19368b51813f2043j23168n4584K4790A64078n512G3594C096J92473c01773A746
19356g8698A40912D9504a53514A5083a53982J6682m0177h5723l5745B49322j08018
19345A41304i3523l05090A97852a20546E0602Q5511b29863a10188B10012d14326
19334a5052j80565A73497a35367e4518a0961j50724j04492A69061J58747G4991
19323a47958j76839E7684c97027l0581C3321K9378h2076A78792a34841k95027
19313d29868J47634B4680a28610M0819A41059b2912D7429O4691i4488F2993a67888
$$ plain form
19391 82104 5661 -19564 -148023 -111043 155853 -248024 -99901 -125007 -158885 -88973 -49012
19380 -49012 -3987 -87286 -81725 -88557 21559 -140073 102719 -38143 11856 -186390 -219088 -251813
19368 -251813 -62043 -185211 -239795 -215005 164078 158566 73594 3096 195569 -301773 1746
19356 -78698 140912 49504 -153514 15083 -153982 -137300 -177477 -85723 -121468 249322 141304
19345 141304 -93523 -398613 197852 -120546 50602 136113 -229863 -110188 210012 -414326
19334 -15052 -195617 173497 -135367 -54518 -10961 -161685 -266177 169061 327808 74991
19323 -147958 -324797 57684 -397027 -427608 33321 62699 -82076 178792 -134841 -429868
19313 -429868 -282234 24680 -128610 -87791 141059 -22912 47429 112120 -94488 62993 -167888
19301h2526K8620M567g421r8487A6178h4211n1603L9720B10803a13260C81016
19289C21759j28682h0898G4738b79447N6771g6613j26050a4423A32957E6500J23177
19278A79677q2694b23212j2401O0935g7615a5854m9063K2317j99686k7788A53248
19266b44045f5052J7870a7012j67970p1993o5247E8931K99431m3673b04663q8801
19255b93464B6858b26771I9796l3867l1445a28366B2483a88300g6169A52580K0416
19244A72996N7192c55891j26362B4281i5929j393B02090C7238a21745e9812k23012
19233b82824b4531l83904H7905K2835h6630A19800a8647j14891m03730i4980p8968
19222a73948A99655c79200A00830Q138e899G292a33520o4413q2757l0251A37305
$$ plain form
19301 -82526 -53906 -49339 -7421 -105908 16178 -84211 -135814 -96094 210803 -113260 381016
19289 321759 193077 -80898 74738 -279447 -222676 -76613 -202663 -14423 132957 56500 179677
19278 179677 96983 -223212 -235613 -174678 -77615 -15854 -64917 -42600 -242286 -270074 153248
19266 -244045 -65052 -47182 -17012 -184982 -256975 -322222 58931 358362 314689 -204663 -293464
19255 -293464 26858 -226771 99796 65929 34484 -128366 22483 -188300 -76169 152580 172996
19244 172996 230188 -355891 -482253 24281 -95929 -97322 202090 37238 -121745 -59812 -282824
19233 -282824 -24531 -408435 87905 110740 -86630 119800 -18647 -133538 -537268 -94980 -173948
19222 -173948 199655 -379200 100830 108968 -5899 7292 -133520 -197933 -280690 -310941 137305
19210i4220A99576a20589l27729G1248b16774N4426f5092k24028g8329j3563I4677
19198a66655p2888j16889A33692b67293d4030l2885K2956G3118j9866a58404N9000
19187i9404A02551b19544B17291r3345a65404h1438j61855A01374j3817A3153
19176d709j00039j58526M9116g9485j6193k0734k3186e4637j32567A63348b7081
19164a20385A13807c8042j28531A71332b73189a2871D69878b9508p717k6994C68863
19152a75243D654b74080A58873J29755a34527H044L458c082p6210A48313l1798
19141A16515a0870A6997a38342E8520e5012m07039a16201E0309B2534b33316c8731
19129d6842A91111p777a2161j58572I8982a2592j09977k04436e2481A56470a94919
$$ plain form
19210 -94220 199576 -120589 -448318 71248 -216774 -162348 -65092 -289120 -78329 -91892 94677
19198 -166655 -239543 -356432 133692 -267293 -44030 -76915 -53959 73118 53252 -158404 -99404
19187 -99404 102551 -219544 217291 123946 -165404 -81438 -243293 101374 87557 13153
19176 -4709 -104748 -263274 -214158 -79485 -95678 -116412 -139598 -54637 -187204 163348 -27081
19164 -120385 113807 -38042 -166573 171332 -273189 -12871 469878 -29508 -37225 -64219 368863
19152 -175243 4654 -274080 158873 288628 -134527 8044 11502 -3082 -79292 148313 116515
19141 116515 -10870 16997 -138342 58520 -55012 -462051 -116201 50309 22534 -233316 -38731
19129 -46842 191111 183334 -12161 -170733 98982 -12592 -122569 -327005 -52481 156470 -194919
19117A88368b17493j36407a57824g1778L2482q4022I4190c0096j35784L3196f5785
19105h9276A77363F9896b60204D48844d6152B01042B8987b1249A08652c2859j46525
19094a79384d4861B24112a72509Q0560I1610b44230m7386a3450k57754d8628A70656
19082a88825d4920j74769B74516b72379A68612c86219J82033P3072H5077a76116
19071C3736J79136I3879a46206A45831a25871D2546R8271a20676q0464a0548m6909
19060e7457p9193B26843h0631H4383a20218d8446j43396I1725a85203b5732m3661
19049f9393B81671h7922l93269B37739D642b44034I2283a90196B5260J23594p4400
19038G4454f2635L0046N13k07308a16366A05890R4513J59484F7720j4896c10986
$$ plain form
19117 188368 -217493 -353900 -157824 -71778 -39296 -123318 94190 -30096 -165880 -132684 -65785
19105 -89276 177363 69896 -260204 448844 -46152 201042 28987 -21249 108652 -32859 -179384
19094 -179384 -44861 224112 -172509 -91949 91610 -244230 -291616 -13450 -271204 -48628 170656
19082 -188825 -44920 -219689 274516 -272379 168612 -386219 -204186 -131114 85077 -176116
19071 33736 212872 93879 -146206 145831 -125871 42546 140817 -120676 -201140 -10548 -57457
19060 -57457 -136650 226843 -80631 84383 -120218 -48446 -191842 91725 -185203 -25732 -69393
19049 -69393 281671 -87922 -481191 237739 4642 -244034 92283 -190196 25260 148854 74454
19038 74454 -62635 -32589 -32076 -239384 -116366 105890 200403 359887 67720 52824 -310986
19026b63342A39878k1761m6482g7643D32453j38779j06443D3623Q7280r251c00835
19014b45632I035N0990K88998h4275k5127C15377H6374a15931A25213F0192J9952
19003H0144J54680I9135a56209f0058m9249g014j35405H5372d34097J46779R5491
18992a91827P4524A99075q4539o465c70471B18904a3590D085a25875o6832g9169
18980i5842j91658o5733a37360G9606c25841E2367a49414D8463h6380A69712G8370
18968i662j18207A92382d44064h9151A25776a13140A3209a88112j330h5253A88854
18956f6276l1D5956A281J58136f4598A56023K27196D9249c07919f1356j34196
18945a95552A22646n7516b23939g2330I3834b55540M8802a00588r6721k46620
$$ plain form
19026 -263342 139878 118117 71635 -77643 432453 293674 187231 43623 130903 121652 -300835
19014 -245632 9035 60025 349023 -84275 -109402 315377 86374 -115931 125213 60192 80144
19003 80144 234824 99135 -156209 -60058 -109307 -7014 -142419 85372 -434097 -287318 -191827
18992 -191827 -117303 199075 114536 108071 -370471 218904 -13590 4085 -125875 -192707 -79169
18980 -95842 -287500 -353233 -137360 79606 -325841 52367 -149414 48463 -86380 169712 78370
18968 -9662 -127869 192382 -444064 -89151 125776 -113140 13209 -188112 -189442 -85253 188854
18956 -66276 -66307 45956 1281 159417 -64598 156023 383219 49249 -307919 -61356 -195552
18945 -195552 122646 65130 -223939 -72330 93834 -255540 -206738 -100588 -197309 -443929
18935d43929J67833N1735b1713k41281J27600N7229j16836B00661b3122A92574
18924C1104k294a21826B542N5955b76581C94447B5602a21922K7088B33292F135
18912a83715A87440a98772R8293j00629A0278c73836F2581d9847A14322B9615
18901a89944A41438P7793O2874i2070k34241C59426D6494L75389e6071j64054
18891b20125N3961d8714A6405a65636E9293g0290j72865N2793A46938A6511b33923
18879d1939A74296D4614K2117b30587F9201b2952F8305a32370j18409A20338a02766
18867e7353p8930c4972A86684D4933b91821h7625o5022j48808d4656A14152b386
18855a7772D806R3778L6683a13396j03441B29744e051A54128e0716K3146A38482
$$ plain form
18935 -443929 -276096 -224361 -21713 -262994 -135394 -78165 -195001 200661 -23122 192574
18924 31104 28810 -121826 2542 58497 -276581 394447 25602 -121922 -94834 233292 6135
18912 -183715 187440 -198772 -100479 -201108 10278 -373836 62581 -49847 114322 29615
18901 -189944 141438 219231 282105 -92070 -326311 359426 46494 421883 -56071 -220125
18891 -220125 -166164 -48714 16405 -165636 59293 -70290 -243155 -190362 146938 16511 -233923
18879 -41939 174296 44614 66731 -230587 69201 -22952 68305 -132370 -250779 120338 -102766
18867 -57353 -136283 -34972 186684 44933 -291821 -87625 -152647 -301455 -44656 114152 -2386
18855 -17772 4806 98584 135267 -113396 -216837 229744 -5051 154128 -50716 -27570 138482
18843a19616l8824k9253A63487c85669Q0090I2327L1138b47558C7383c0758C6332
18831a34570d5458B69204D7915b11695I2814c01007i1019G8827a77996B2089b74512
18819a8086p8474B09997a94500A39727k496J474b20393B81187a05881l0721B07788
18807i1602A49443g7534B02006b86332h0716j2656K2276l60027C48251D512c16645
18795I5134f7800j29222A31181P0429a22371n8938A5165a94597D424Q7896L7255
18784A29575E3000J09855c5460A00685K75212A58090f9978j32416J00326i827
18773a55791B74772f22191A10474K3929b87445A6201a36798o9862o963j33202
18763c46825J30752q9536C23974f6437E6365b81026P0150D4437h9063j81126E3618
$$ plain form
18843 -119616 -158440 -187693 163487 -385669 -305579 92327 123465 -247558 37383 -30758 36332
18831 -134570 -45458 269204 47915 -211695 92814 -301007 -91019 78827 -177996 22089 -274512
18819 -18086 -96560 209997 -194500 139727 137231 138705 -220393 281187 -105881 -136602 207788
18807 -91602 149443 -77534 202006 -286332 -80716 -93372 -71096 -431123 348251 4512 -316645
18795 95134 -67800 -197022 131181 201610 -122371 -181309 15165 -194597 4424 92320 129575
18784 129575 53000 162855 -35460 100685 375897 158090 -69978 -202394 -102068 -9827
18773 -155791 274772 -622191 110474 134403 -287445 16201 -136798 -206660 -213623 -346825
18763 -346825 -216073 -305609 323974 -66437 56365 -281026 -210876 44437 -89063 -270189 53618
18751a2934A00253a66085b5876o8984j14695A07761b08718H0895d8330b3997j11865
18740a35862J2411B9445j0483c84466B77767f3711j0937A05919B2366a0195A44033
18728a93582P9311c0239B7841J79345f504C4374g2018K4547k00272O5589A5174
18716G2072A2952f8438j09684M1115N8255o387a2968A6997K64308A19661R1478
18705B11139a23199A5409K5169b08967C85129f12k25152C65258C9163a8430j9073
18694c7503k74109J48091A1888a16490l83754A58041C812a12977J5269b4350j69512
18683a93862R5932k77062c5086A4079N708a70697B5491N6668R001a61188A47841
18671A9257a29899c6943A70316D5253g2000k55730A12617F858a95867M3082j16026
$$ plain form
18751 -12934 100253 -166085 -25876 -94860 -209555 107761 -208718 80895 -48330 -23997 -135862
18740 -135862 -123451 29445 18962 -384466 277767 -63711 -74648 105919 22366 -10195 144033
18728 -193582 -114271 -30239 27841 207186 -6504 34374 -72018 -47471 -247743 -182154 15174
18716 72072 12952 -68438 -178122 -137007 -78752 -85139 -12968 16997 281305 119661 211139
18705 211139 -123199 15409 40578 -208967 385129 -612 -225764 365258 39163 -18430 -37503
18694 -37503 -311612 -163521 11888 -116490 -500244 158041 3812 -112977 -97708 -24350 -193862
18683 -193862 -97930 -374992 -35086 14079 19787 -170697 25491 82159 91160 -161188 147841
18671 19257 -129899 -36943 170316 45253 -72000 -327730 112617 6858 -195867 -152785 -268811
18660b68811A2777b32869b4359k04615g8924L7506J5629A08128a57778B04875
18649a48260f8122D1501a97596A59091b76869F790M00438a03792a9343A89656
18638b64569D76830A05208a23389C81L11554b39989b4563l85517Q5293D9006a39959
18626B17078E2767b0358m4502j16514O8549D5701a34240D50935c75261d8906L993
18615d4913C50a76780a7779k83060J3120o5711C1316i4913A73292e4488q5762
18604a40250d3570p6661D1199J36816j3617b34500E6946P0397d049j21596o2647
18593a88292P4780D8532L061i8477r4666d2517j55352G8611b66378c9589j94583
18582b34172O4865E687e6368A19217b66577N3397g1958p1931B03724b14184A16618
$$ plain form
18660 -268811 12777 -232869 -24359 -228974 -78924 -41418 -25789 108128 -157778 204875
18649 -148260 -68122 41501 -197596 159091 -276869 6790 407228 -103792 -19343 189656
18638 -264569 476830 105208 -123389 381 311935 -239989 -24563 -410080 -324787 49006 -139959
18626 217078 52767 -20358 -64860 -181374 -112825 45701 -134240 450935 -375261 -48906 -44913
18615 -44913 350 -176780 -17779 -300839 -287719 -353430 31316 -94913 173292 -54488 -140250
18604 -140250 -43570 -120231 41199 178015 164398 -234500 56946 127343 -4049 -125645 -188292
18593 -188292 -113512 48532 51593 -98477 -193143 -42517 -197869 78611 -266378 -39589 -234172
18582 -234172 -169307 5687 -56368 119217 -266577 -213180 -71958 -143889 203724 -214184 116618
18570b49784E4663a75628e8090B48919A23917D4689J64255b2704A25842Q524c2285
18558a32510E2628L7870b8391B7585K27678a43723J5359B8116i4986G6561a78096
18546b9215A3593b02070B91510a05058F3625a58975B10789d43226g1892C24332
18535a32459m923d5113j14762K8455p8951A77654d5319C2000b26375R0480C9664
18523c8842J7683A16663a3031q858k43912A62857K52663c02213B67113a00619
18512A12963a47676E5858b4586r2159b913j12603L9090A42720N3728f0937k0393
18501h1330j39889b8461A20420A7957K7076i6188d1500Q968A11753C3527d62073
18489c7740A26392O0570d9374A40728a38274B14292l4617E717J0113M1427b71143
$$ plain form
18570 -249784 54663 -175628 -58090 248919 123917 44689 208944 -22704 125842 134366 -32285
18558 -132510 52628 90498 -28391 27585 255263 -143723 -128364 28116 -94986 76561 -178096
18546 -29215 13593 -202070 291510 -105058 63625 -158975 210789 -443226 -71892 324332
18535 -132459 -137382 -45113 -159875 -131420 -210371 177654 -45319 32000 -226375 -135895 39664
18523 -38842 -21159 116663 -13031 -21889 -265801 162857 415520 -302213 267113 -100619
18512 112963 -147676 55858 -24586 -116745 -2913 -115516 -76426 142720 196448 -60937 -81330
18501 -81330 -221219 -28461 120420 17957 45033 -96188 -41500 -32532 111753 33527 -462073
18489 -37740 126392 186962 -49374 140728 -138274 214292 179675 5717 15830 57257 -271143
18477D437b9327J2808A22386F0660O402d7402G6852a50458K9895M8928H5052a26427
18464H5183C0444M1093J841c83725g6435j25327R790A9913O5928b347k08974A84414
18451d0015n4777k8035J3781k16635a3522G8514a72214J01j9293L9982K4856C4623
18438F3853b03320m1271j43806J50921A7636J88853a26913B23553F8892k1688
18428D7204d5889j08917k01867C03619j30353q0841d5980B26972f7453D23358
18417d31864B72168C2256b17752K460N5005H4893f5405D27050a02526A2570L507
18406A6077L7125N1907M947O1819a28769e2897Q633A11181a51216C09800e271
18394B28712j01296a39060N135E9124J25274F0807J19443J8587a72704l7260J380
$$ plain form
18477 4437 -29327 -16519 122386 60660 67062 -47402 76852 -150458 -120563 -71635 85052 -126427
18464 85183 30444 71537 73378 -383725 -76435 -201762 -191972 19913 85841 -2347 -211321 184414
18451 -40015 -94792 -122827 -109046 -325681 -13522 78514 -172214 -172113 -191406 -151424 -126568 34623
18438 63853 -203320 -244591 -388397 -237476 17636 206489 -126913 223553 68892 47204
18428 47204 -45889 -154806 -356673 303619 173266 92425 -45980 226972 -67453 423358
18417 -431864 272168 32256 -217752 -215292 -160287 84893 -65405 427050 -102526 12570 16077
18406 16077 53202 105109 110056 171875 -128769 -52897 -44264 111181 -151216 309800 -5271
18394 228712 127416 -139060 -133925 59124 184398 60807 180250 198837 -172704 -209964 -208584
18383b08584N9528j98089A68438c53136m2024f6169A23972c07571J5102G2413
18372A53431a55736N1678B26374a94802j20967b1359F411g4544I0194a02371b9898
18360A84113h5365A41967a3534E538b51125R8727D1209a27800I0506P3954a21617
18348h3117B96658a70017c7372i59C5626N5467h5506d0825E8255P3521b04434
18336A92028f860j6963I9634P1225a64144R772r7637m6711A31875C5550K81511
18325C17061a15954G4239a98053c4420C85065j24969a79457e7718K5120k38661
18315b71259B48582A8364J692b45931O9347B5546J52264c63344d9A47535c23578
18303B04327e6311G5002J2202b5135A3456K07382e2294r6106E6289b46399i3227
$$ plain form
18383 -208584 -149056 -347145 168438 -353136 -395160 -66169 123972 -307571 -292469 72413
18372 153431 -155736 -104058 226374 -194802 -315769 -21359 6411 -74544 90194 -102371 -29898
18360 184113 -85365 141967 -13534 5538 -251125 -152398 41209 -127800 90506 164460 -121617
18348 -83117 296658 -170017 -37372 -959 35626 91093 -85506 -40825 58255 131776 -204434
18336 192028 -6860 -23823 99634 170859 -164144 -154372 -252009 -298720 131875 35550 317061
18325 317061 -115954 74239 -198053 -34420 385065 260096 -179457 -57718 -32598 -271259
18315 -271259 248582 18364 20056 -245931 -176584 25546 177810 -363344 -49 147535 -323578
18303 204327 -56311 75002 87204 -25135 13456 220838 -52294 -148400 56289 -246399 -93227
18291a61238o1533B81167j01435o5027J20891D8708i6278d1892B713a07130p0424
18280a77554A90388a6137k71299N8707D5546a38849f2625j39777l794A13101e9420
18268b5068P564I8916J477g7726j76712O8868K764k46907C3888j3577c7404o9677
18256a07081N0475j80587h2138b6227H2971C840b20194l5473B2354a6977K924
18245a4053j29033B89561o6368a4111B3594O0939m0350b67893B45612o3285h4125
18233D15888h2613j40735R5301J2666E5305b30171f9900A31499B0988L62925c49552
18221e3321B29211a83115E308O999a38705k48447c59q8542k78269F3505J0890
18210G4395A5990J66210a80137A48913b41845h0182K5269a9949l18277O712B6284
$$ plain form
18291 -161238 -222771 281167 179732 114705 235596 48708 -96278 -41892 2713 -107130 -177554
18280 -177554 190388 -16137 -287436 -228729 45546 -138849 -62625 -202402 -206196 113101 -59420
18268 -25068 -17504 98916 100393 -77726 -254438 -185570 -182806 -429713 33888 20311 -37404 -107081
18256 -107081 -56606 -237193 -82138 -26227 82971 3840 -220194 -255667 22354 -16977 -14053
18245 -14053 -143086 289561 223193 -14111 23594 84533 44183 -267893 245612 182327 -84125
18233 415888 -82613 -223348 -128047 -115381 55305 -230171 -69900 131499 20988 383913 -349552
18221 -53321 229211 -183115 5308 12307 -138705 -387152 -359 -88901 -367170 63505 74395
18210 74395 15990 182200 -180137 148913 -241845 -80182 -54913 -19949 -338226 -331514 26284
18198a50720p6093J12850m43683a13345D5222i0333C39191g7960l00689c5570
18187a50513k74922a75900k39351G1967b40011H5274g2239j84632C08809a86889
18176I1483k5287j9056a46607j55504A6051b05799e39A09869K21812D0342c3692
18164A7645a31740A28152j8934g1869a5299k46418E6076j9981a416N98m0372C4043
18151A87741b24713A42897a93939f3701A36617a32914A17542k1682m6255h7691
18140b04740q520J00629K9473B53821I7504a44139a5642p1605L5442q02A9687
18128C6968Q8022m4790e2460n3802L4444p1135B2404b79961c3965N885A60802
18116d9601C07089b04761F216a75431P790A29899D8312b51694o7536h9757C3876
$$ plain form
18198 -150720 -226813 -113963 -557646 -113345 45222 -90333 339191 -77960 -378649 -35570
18187 -150513 -425435 -175900 -415251 71967 -240011 85274 -72239 -256871 308809 -186889
18176 91483 66196 47140 -146607 -302111 16051 -205799 -539 109869 331681 40342 -33692
18164 17645 -131740 128152 109218 -71869 -15299 -261717 56076 36095 -1416 -818 -41190 34043
18151 187741 -224713 142897 -193939 -63701 136617 -132914 117542 95860 49605 -87691
18140 -204740 -213260 -112631 -83158 253821 97504 -144139 -15642 -87247 -51805 -52607 19687
18128 36968 124990 80200 -52460 -106262 -71818 -142953 22404 -279961 -33965 -28080 160802
18116 -49601 307089 -204761 6216 -175431 -167641 129899 48312 -251694 -319230 -89757 33876
18104a91163D20952d0852h089j37711C23057j46840q612b96572O5987A53609l0161
18093A23448d47952J14573J56163A0825K78820j21530n2130a39608B9956a41096
18082i3926b1292A20330E928J66295A5713J67813a3751I7515L6353K85947b38715
18070a26303f1942a1579o6919I2448N6266b99828A15546e1541l4793m7588f0959
18058h8422B02744D6716h833j45677c382j35884B24770I3855d4232A74406a12963
18046h9433G9809J78662j21623c94614a07208A02162L4222h6095C5766e0924A39584
18034A96350a66280F9286c44175I9310k9779l1391c23576g5221F9945A8284b38260
18022C44389e02205D22131a37107M516B93186I0118b04121c2302j06370o2762
$$ plain form
18104 -191163 420952 -40852 -8089 -145800 323057 176217 167605 -296572 -230585 153609 123448
18093 123448 -447952 -333379 -177216 10825 289645 168115 115985 -139608 29956 -141096
18082 -93926 -21292 120330 5928 172223 15713 183526 -13751 97515 133868 419815 -238715
18070 -126303 -61942 -11579 -78498 92448 148714 -299828 115546 -51541 -86334 -133922 -60959
18058 -88422 202744 46716 -8833 -154510 -3382 -139266 224770 93855 -44232 174406 -112963
18046 -89433 79809 258471 136848 -394614 -107208 102162 136384 -86095 35766 -50924 139584
18034 196350 -166280 69286 -344175 99310 69531 38140 -323576 -75221 69945 18284 -238260
18022 344389 -502205 422131 -137107 -132591 293186 90118 -204121 -32302 -138672 -201434
18012b01434E5831L940J06490b68931a05282A05556P2716a80973A38996g8682
18001c27240J33108E7259a19372B72072E6357c9850a0126C06503H0002k8151a00358
17989d2603j50060A05770K43615a59157d0344l4779K2565m9294R051I5645l6522
17978E9123k2890a2178j83584p9428F6698K36117H0279b65953A00430i669p0776
17967h0445j3391j93043R8858A53451c06708Q4458R2001a3290k10954A44126h2824
17955H2280b06159B9730b47947n9829h3020H7935a3643H9228P4989a69203q2026
17944b51229k50848J63713G7759a63370j82149A80334a07708B21214b8539A0558
17933E8367e34890g4792A55049i0733A21974c49009A44024A4647i6530L4080m1585
$$ plain form
18012 -201434 55831 59771 166261 -268931 -105282 105556 178272 -180973 138996 -78682
18001 -327240 -194132 57259 -119372 272072 56357 -39850 -10126 306503 80002 51851 -100358
17989 -42603 -192663 105770 349385 -159157 -40344 -75123 -52558 -101852 -92801 95645 59123
17978 59123 36233 -12178 -195762 -275190 66698 302815 80279 -265953 100430 -9669 -80445
17967 -80445 -93836 -286879 -188021 153451 -306708 -222250 -130249 -13290 -224244 144126 -82824
17955 82280 -206159 29730 -247947 -307776 -83020 87935 -13643 89228 164217 -169203 -251229
17944 -251229 -502077 -338364 77759 -163370 -345519 180334 -107708 221214 -28539 10558
17933 58367 -534890 -74792 155049 -90733 121974 -349009 144024 14647 -96530 -62450 -104035
17922a04035P388K5704B99595e0081E00741A23794e0199q3060A74362N1910c7554
17910B13621O0845a90678b3909k36941B44877j17026M8100A5477J14912e5180
17899a38035j01829B28711a92617m4832c9590p5465J5080C05191h9281A52115
17888b41202c328C15328a21312A32509j073b95497a41750D20701A73452e6855
17877a09242k13141A44871E2496a40131F9149a32899e9904l803q6119A41658P874
17866A49532a63442K1209G0480L256K7772J68705j13596a15118B58330G8423M481
17855H2904i1975j54103k30492g9473L5451b0793C60662A21297J8203N7320h8924
17843B3824O788M5240b26153A34074l9786l0765l26e3188l5735M4458H8034a19372
$$ plain form
17922 -104035 -96647 -70943 299595 -50081 500741 123794 -50199 -133259 174362 226272 -37554
17910 213621 274466 -190678 -23909 -260850 244877 127851 175951 15477 130389 -55180
17899 -138035 -239864 228711 -192617 -237449 -39590 -115055 -99975 305191 -89281 152115
17888 -241202 -3328 315328 -121312 132509 131436 -295497 -141750 420701 173452 -56855
17877 -109242 -322383 144871 52496 -140131 69149 -132899 -59904 -63707 -149826 141658 149532
17866 149532 -163442 -142233 70480 73736 101508 270213 156617 -115118 258330 78423 82904
17855 82904 -91975 -246078 -476570 -79473 -44022 -20793 360662 121297 139500 196820 -88924
17843 23824 30612 75852 -226153 134074 94288 63523 63197 -53188 -88923 -44465 88034 -119372
17830B25880A7544d8847m47244K35927A76651d1344B7781K6959h9550D36283A6169
17818A32126l8593K7938j3428a51348K8670A66746i7265C57182D9887K42688g0923
17806A23671N4388b38199e080j04526A18278a03724C19552c2894m5959B07547
17795B4969J78071a52941D01132o7960a03738m2177j70406Q432R5467B3912a21318
17783a23712j63026a1602j14363A9213M920J40733D4771g1708F4609a85225B47237
17771f8032D8266a39460c1754j74529A26146c7459k36379A40029a39239R216e8816
17759a83164b3283k1936j26946C3437O0095b96956j55936J90178A29765n548j5091
17748A09126d5146j17423C9189R1206a37316n6660I8184b4019F093K58760a09443
$$ plain form
17830 225880 17544 -48847 -496091 -260164 176651 -41344 27781 54740 -89550 436283 16169
17818 132126 93533 121471 108043 -151348 -122678 166746 -97265 357182 49887 292575 -70923
17806 123671 178059 -238199 -5080 -109606 118278 -103724 319552 -32894 -78853 207547
17795 24969 203040 -152941 401132 333172 -103738 -145915 -316321 -307889 -212422 23912 -121318
17783 -123712 -286738 -11602 -125965 19213 24133 164866 44771 -71708 64609 -185225 247237
17771 -68032 48266 -139460 -31754 -206283 126146 -37459 -273838 140029 -139239 -130023 -58816
17759 -183164 -23283 -45219 -172165 33437 93532 -296956 -452892 -262714 129765 124217 109126
17748 109126 -45146 -162569 39189 130395 -137316 -193976 98184 -24019 6093 264853 -109443
17736A02019d0619A76407a09557A49921K37340a89437C24028a72169d9426r6666
17726a46092C14597m6231b62407F6402K29109j47319b19139A02956o992C9854
17715C6745K076b94132G3400c71565J76572D253A284i1375b5771n4826K3247K3168
17703c4182n1547C5722a06029j14174B25670b17243A7949O6576b44979C58837
17692B42258L5178i9740B57763b02386C12529G8793k6430a84604e1954j50654
17682b02608A83599B8181L45777a48893j1933a3962j38620C4861E386N9497e819
17670C77102a47322C00579a47901e9791I4416G47a2276j60793g7446A77169F4884
17658b09170D4259d4789P020l6522J5243j6212G2154L51421A0892N0502N8041
$$ plain form
17736 102019 -40619 176407 -109557 149921 387261 -189437 324028 -172169 -49426 -146092
17726 -146092 314597 268366 -262407 66402 295511 148192 -219139 102956 95964 39854
17715 36745 38821 -294132 73400 -371565 -194993 4253 1284 -91375 -25771 -80597 -57350 -34182
17703 -34182 -85729 35722 -106029 -220203 225670 -217243 17949 84525 -244979 358837
17692 242258 277436 -99740 257763 -202386 312529 78793 52363 -184604 -51954 -202608
17682 -202608 183599 28181 373958 -148893 -160826 -13962 -152582 34861 5386 64883 -5819
17670 377102 -147322 300579 -147901 -59791 94416 747 -12276 -173069 -77446 177169 64884
17658 -209170 44259 -44789 -37769 -74291 -59048 -75260 72154 423575 10892 61394 119435
17647A19435M8604K15596j08610G6659a67709A04658a16516a7978F0338J64828
17637B25166a23482H5198a14458L2385c1408k28560B07204a07289I6551K53395
17627C49946a12516m1599B3998J22171C3685J79019f3192R389B35897J56500b17216
17615D2327a18503C39227A64496a3506l9551j4573b3663o4583j83653E4801q599
17604D6202a99764Q5358N1160D40792A92506E1128J07300M6061F4553J02185c9916
17592A29015J02727C1023J07191a10254D0566c64686B11846e6403k18107R6062
17582a78448r9478E587f1317K8623n5525I5818a90038G5547j8700K29262g1035
17570H6746G483O5954J40347Q6771P8953a94221h3546C09183p8528n6601k4636
$$ plain form
17647 119435 168039 383635 275025 76659 -167709 104658 -116516 -17978 60338 225166
17637 225166 -123482 85198 -114458 -82073 -31408 -259968 207204 -107289 96551 349946
17627 349946 -112516 -154115 23998 146169 33685 212704 -63192 -53803 235897 392397 -217216
17615 42327 -118503 339227 164496 -13506 -53057 -67630 -23663 -88246 -271899 54801 46202
17604 46202 -199764 -114406 -63246 440792 192506 51128 158428 204489 64553 166738 -39916
17592 129015 231742 31023 138214 -110254 40566 -364686 211846 -56403 -274510 -178448
17582 -178448 -277926 5587 -61317 -32694 -88219 95818 -190038 75547 56847 286109 -71035
17570 86746 7483 73437 213784 300555 379508 -194221 -83546 309183 230655 174054 149418
17559A49418C0074c7591C90393A88657g1110j2906A1029L3828c33837J46440D4974
17547D8648R9511E1553c2200l6618K7438I8594O1995K25968C9762L2413e9876
17535B83703C6984J2139j7918J89706J69771h5185j43747A2842L5114N7279i7467
17523d8523F8065M5040m1958c8543A47159J3549o3631B6615Q4341C6379J49124
17512A85503b90368E2403J76418a1995A33827E995b40961E231J83701E6927L5098
17501I2025k0923a63225C8362K13014a02952j6327H5129a00800m1777A09325J4266
17490A23591a18191B01383q6140d6486l5481A09434a14178D9107J91097h0022
17479a38797B42472h9915B39221L5459n8806J54287j01915K77031G4550m141J21565
$$ plain form
17559 149418 30074 -37591 390393 188657 -71110 -84016 11029 44857 -333837 -187397 44974
17547 48648 148159 51553 -32200 -68818 -41380 98594 160589 386557 39762 72175 -59876
17535 283703 36984 49123 31205 220911 390682 -85185 -228932 12842 47956 105235 -97467
17523 -48523 68065 113105 71147 -38543 147159 160708 97077 26615 110956 36379 185503
17512 185503 -290368 52403 228821 -11995 133827 5995 -240961 5231 188932 56927 92025
17501 92025 71102 -163225 38362 251376 -102952 -119279 85129 -100800 -142577 109325 123591
17490 123591 -118191 201383 115243 -46486 -81967 109434 -114178 49107 240204 -80022
17479 -138797 242472 -89915 239221 274680 215874 370161 268246 545277 74550 70409 191974
17468A91974j6710k4001n6979D2929L15563L7537i9595o5225D5501b01142r572
17457b10714B76321q1005J7432p0908J8166K21809R9820K0109r6864b3490B59108
17445A09433j6155L00564A85873J5456p4377j8676L09714m3417j53407K73752
17435D94918A17327J81395B4299K66119o9991K08674I9764K62607f0159A86148
17424C44672k8286Q8203m9940b4925A76654J51079A06391K82305H3292K4803P4434
17413A82529A103K52141i680C20661N8504b2183A28023J5091m2757K8732C8355
17401A12713J46457j3871D7024J70128E0474J23818C4247K3547A8914J38820F6627
17389B688J84692a5610C52925A26045a7199A31452J04477Q4649A44422b5262A74462
$$ plain form
17468 191974 175264 151263 94284 42929 358492 396029 -99595 -164820 45501 -201142 -210714
17457 -210714 276321 195316 212748 141840 160006 381815 481635 501744 404880 -23490 259108
17445 109433 93278 393842 185873 201329 126952 108276 417990 374573 221166 494918
17435 494918 117327 298722 24299 290418 220427 429101 99764 362371 -60159 186148
17424 344672 316386 404589 354649 -24925 176654 327733 106391 388696 83292 108095 182529
17413 182529 1103 253244 -9680 320661 379165 -22183 128023 143114 100357 129089 38355
17401 112713 259170 245299 47024 217152 50474 174292 34247 57794 18914 157734 66627
17389 2688 187380 -15610 352925 126045 -17199 131452 235929 320578 144422 -25262 174462
17377A32850J67075k5126a56267B8409M90392A6682a3682A56240a58410A918R6909
17366I8827I709J18879K03259j64402J33668a35992C83900B9321J87072r3870
17356A22523D8691E646b09541A59906i17F00b57677A8597d7224B74385i5059C1367
17343a3448r5255B88245R386B6572L1725o967c2958H3924K9592b05684D57809
17331D50036j57898D7625J61830H0640M6989J28529p5581k2152f8977C96017A91263
17319e1190K0422j22787F0224Q8451R1666R6961a6245A93969O2112i6163b3531
17307C13406A18136m4893P8036D830L77877a42905B2641h224A8726e7887D81281
17295E1525K01667O8981O2744j56917a7701C43753b08695I2228J94781o2307J41917
$$ plain form
17377 132850 299925 274799 -156267 28409 518801 16682 -13682 156240 -158410 1918 98827
17366 98827 9709 128588 331847 167445 301113 -135992 383900 29321 216393 122523
17356 122523 48691 5646 -209541 159906 -917 600 -257677 18597 -47224 274385 -95059 31367
17343 -13448 -108703 288245 297631 26572 58297 51330 -32958 83924 113516 -205684 457809
17331 450036 292138 47625 209455 80640 127629 256158 180577 158425 -68977 396017 191263
17319 -51190 -30768 -153555 60224 148675 240341 337302 -16245 193969 256081 -96163 -23531
17307 313406 118136 73243 151279 4830 382707 -142905 22641 -8224 18726 -57887 481281
17295 51525 253192 322173 384917 228000 -17701 343753 -208695 92228 287009 224702 366619
17284C66619p1803J3598j04644a34266C22171n4570L5766P2654j25775C3104Q3104
17273A16208K27843O4172A66021l9122K3838L18525j91692l8624A3829g047I9384
17261i080B32310J41876a38505A52755J0281L80984D6244K06268H8100M741A4683
17249B25011H0983K08548h995j00909B07196q2335J59623f1292C01762A11545
17238B74325j05773J36304i3124E0289J63074B8310a53068B10931J15621j34050
17228A92502J6039H371j476e5558a2367A42816J771M4216A8867L53625a53776
17216D58574I7380K08132A28529B6699b7141B63969r4745i1866A22490m9172K17752
17205B91070i872C60287j32997G6826a3486B89514K6670J41437G0194N98555B90210
$$ plain form
17284 366619 294816 308414 203770 -134266 322171 267601 303367 376021 250246 33104 116208
17273 116208 344051 408223 166021 126899 150737 469262 277570 238946 13829 -7047 99384
17261 -9080 232310 374186 -138505 152755 163036 544020 46244 252512 88100 92841 14683
17249 225011 80983 289531 -8995 -109904 207196 124861 284484 -61292 301762 111545
17238 274325 168552 304856 -93124 50289 213363 28310 -153068 210931 326552 192502
17228 192502 208541 8371 6895 -55558 -12367 142816 144587 188803 18867 372492 -153776
17216 458574 97380 305512 128529 26699 -27141 263969 169224 -91866 122490 73318 291070
17205 291070 -9872 360287 227290 76826 -13486 289514 316184 457621 70194 668749 290210
17193B12049l355P3400J50486H8717K84730o5657j10970C583L52638p1072r1990
17182A93159n3917J78034N9359n1002J01220A4765M9094g7854C12516J8628L5658
17171C66802A23657J77244q6676F0609N5647C6128a5635A32929L02267G4149J20313
17160A94462n6044n6666J10040J61873n7112B073O16425k16589k4781j25560l3710
17149B17858E8813N35876b8785B81571j28227K96309j49262A15501M86514j19151
17139D82864k07635j03902J21628k4548N1781R5519l9358j59424G8957A7350L20672
17128C38022J54105A74974L31340A98722j3993Q3703L04463B86031J25278M2166
17118D53475j12005k575J01904r5973N697K16864B45518O1727m6609k0430J53482
$$ plain form
17193 212049 208694 282094 432580 88717 373447 307790 196820 3583 356221 285149 193159
17182 193159 139242 317276 376635 325633 426853 14765 63859 -77854 312516 331144 366802
17171 366802 123657 300901 214225 60609 116256 36128 -15635 132929 435196 74149 194462
17160 194462 138418 81752 191792 353665 296553 2073 618498 401909 377128 251568 217858
17149 217858 58813 594689 -28785 281571 153344 449653 300391 115501 602015 482864
17139 482864 275229 171327 292955 268407 320188 415707 376349 216925 78957 17350 338022
17128 338022 492127 174974 506314 198722 184729 268432 572895 286031 411309 453475
17118 453475 341470 338895 440799 344826 350523 567387 245518 307245 260636 240206 393688
17107C93688j39811K65884k46183K9471L42970k29364n7809J32807J15963l2781
17097E74835k194K10573l29541j5892j04648m9311K16762j66990k7318L01343
17087F07619k45475J80822A66194L94345l5987j00810A36303M85202k24961k5679
17077C70865L54166B65416L31962r5523B50160K34427A84412N10459j42211j64027
17067C88633l4325j29828J99162k6049l5055J40407J2596J6384q0469p948o7299
17056C76209J24917J7854J30547j82886j0278j33652J71312r7637l7197M8204
17046D07393l012L0677j06471J45727K26805L3200O3725k68541J10325k99438
17036C40390N22990j13119E0762O06404k04583J3366j60362L43831j44541N1028
$$ plain form
17107 393688 253877 519761 273578 303049 646019 416655 358846 491653 607616 574835
17097 574835 572641 783214 453673 437781 333133 283822 500584 333594 306276 607619
17087 607619 362144 542966 166194 560539 524552 423742 136303 621505 396544 370865
17077 370865 725031 265416 597378 501855 250160 484587 184412 694871 552660 388633
17067 388633 354308 224480 423642 397593 362538 502945 515541 531925 451456 443508 376209
17056 376209 501126 518980 649527 466641 456363 322711 494023 396386 359189 407393
17046 407393 404381 435058 328587 474314 701119 734319 798044 529503 639828 340390
17036 340390 863380 750261 50762 657166 452583 465949 305587 649418 504877 555905
17026E55905l5355J92731K2835k66215K58864j88236j22602K62823l01215M36602
17016H16137l67054M14298k56774M0932p084J83699k9700M9399j38427L82658
17006A088084l20232m3522r2759L0304J76404A90212M99080J04238L49553m63897
16996F79186K81631D75475Q249J73411M6021K26785r6821j93423L52803p8702
16986I13798m34220K42006m0485P2265R9339L69943l52832O7412j44337K69581
16976A062470l57577m0942K91457m55498O42007l29911K83477m51206J66005l7432
16966G72850L8963J42748j40502N10287o55470M77533k23763K40221l05571K85831
16956A143127J90355n20373L44891j5782j9133k9315j33828j23208J19646K36162
$$ plain form
17026 555905 520550 713281 736116 469901 728765 540529 417927 680750 379535 816137
17016 816137 449083 863381 606607 647539 640455 824154 794454 843853 705426 1088084
17006 1088084 767852 724330 631571 661875 838279 190212 689292 793530 1143083 679186
16996 679186 960817 475475 483724 657135 703156 929941 833120 639697 992500 913798
16986 913798 479578 721584 681099 753364 852703 1222646 869814 937226 792889 1062470
16976 1062470 704893 663951 955408 499910 1141917 812006 1095483 644277 810282 772850
16966 772850 811813 954561 814059 1324346 668876 1146409 922646 1162867 857296 1143127
16956 1143127 1333482 813109 1158000 1142218 1123085 1093770 959942 836734 956380 1192542
16946A192542j49037K16662n05408L93437q3898J44897J31775o40888M52060N1549
16936A203691l5783J37114n8077M9837l4058l4220r488j52584J01127p9353L56803
16925A445009J6027k52737j47247M85699j9619j8178j96507J96076K09847m72143
16915A246227L25151j87079q4413J88077J08749l57581P03020l08352K40111l26798
16905A547112q9270L40094l45530J35119K25316o2544r2341L53O1491J0485p1396
16894A658889K24076N762j4585o9123k32234L85617K09339m49076L16560J519
16884B036744O1026j23403K65355l19026K85972r6025K42375p34669O04215K3316
16874B245880R4028K63616j90062n9802J25991N4974J60243k70066L18983j76904
$$ plain form
16946 1192542 1043505 1260167 754759 1148196 1064298 1209195 1340970 700082 1152142 1203691
16936 1203691 1167908 1305022 1246945 1296782 1262724 1228504 1219016 1066432 1167559 1088206 1445009
16925 1445009 1461036 1208299 1061052 1546751 1527132 1508954 1312447 1508523 1718370 1246227
16915 1246227 1571378 1384299 1299886 1487963 1596712 1239131 1942151 1633799 1873910 1547112
16905 1547112 1457842 1797936 1452406 1587525 1812841 1750297 1657956 1658309 1719800 1730285 1658889
16894 1658889 1882965 1888727 1874142 1805019 1572785 1958402 2167741 1718665 2035225 2036744
16884 2036744 2097770 1974367 2239722 1920696 2206668 2110643 2353018 1618349 2222564 2245880
16874 2245880 2339908 2603524 2413462 2353660 2479651 2534625 2694868 2424802 2743785 2566881
16864B566881j05229J80452j75932O89484k54529n7644m418j10801K3684J9454
16854B771402J58525K1645N9538q3385K81061K12950l12952j22616J70915K00289
16844C357372M3476Q1958J40664J21276j2104Q9500p0579J23176J08917J40769
16834D124425n6919R5641j72309L35953R1918Q6J55113m2851L46968j312n0506
16823D826207P7883j9795M04872j90605J06960J56579J87979L9076j31155J09665
16813E567666L65353j67720K77098M8538L03103k04374O15841K21032j95093M26380
16803G257824K0245L52186O2623j05410L65749K99280m9499J23715K33646M52528
16793I012887K30546M4877K66318L09216j29381M68074K13217M53217J79447L11980
$$ plain form
16864 2566881 2461652 2642104 2466172 3155656 2901127 2843483 2839065 2728264 2751948 2771402
16854 2771402 2929927 2951572 3011110 2927725 3208786 3421736 3108784 2986168 3157083 3357372
16844 3357372 3400848 3482806 3623470 3744746 3732642 3822142 3751563 3874739 3983656 4124425
16834 4124425 4067506 4163147 3990838 4326791 4418709 4418795 4573908 4531057 4878025 4876713 4826207
16823 4826207 4904090 4884295 5289167 5098562 5205522 5362101 5550080 5589156 5458001 5567666
16813 5567666 5933019 5765299 6042397 6090935 6394038 6189664 6805505 7026537 6831444 7257824
16803 7257824 7278069 7630255 7692878 7587468 7953217 8252497 8202998 8326713 8560359 9012887
16793 9012887 9243433 9288310 9554628 9863844 9734463 10202537 10415754 10868971 11048418 11360398
16783A1360398K29688O09819K68492J65851L35193M25288M77943O93361K00023
16774A4766056L89701M24844Q04793L38801O26089L30257P93623Q14149N62082
16765A9850395J001797K45664Q67629R95883Q25978R22844O87395J451619R36581
16756B7785785J114593J494130J383912J435356J072009J934710J541458J908223
16748C9670176J677334K240777K436063J995394K752668K410149K832379L086555
16740E9101495L508662L439995M109700M151826M230647M757629N019225N757197
16732I4076376N267360O088819O556768P147474P124281P442652Q041442P790675
16724A49535847Q187487P900582P737572P424635O767710O046009M576704L332170
$$ plain form
16783 11360398 11590086 12199905 12468397 12634248 12969441 13394729 13872672 14566033 14766056
16774 14766056 15155757 15580601 16385394 16724195 17350284 17680541 18474164 19288313 19850395
16765 19850395 20852192 21097856 21965485 22961368 23787346 24710190 25397585 26849204 27785785
16756 27785785 28900378 30394508 31778420 33213776 34285785 36220495 37761953 39670176
16748 39670176 41347510 43588287 46024350 48019744 50772412 53182561 56014940 59101495
16740 59101495 62610157 66050152 70159852 74311678 78542325 83299954 88319179 94076376
16732 94076376 99343736 105432555 111989323 119136797 126261078 133703730 141745172 149535847
16724 149535847 157723334 165623916 173361488 180786123 187553833 193599842 198176546 201508716
16716B01508716K589396O50821r37173k071336l515858m747791n807325o712593
16708A80956857p779900p494634q130946q179371q349110p912828p906557p510450
16700A17693061o898834p084500o258312o035466n506205n119445m860881m465462
16692G1463956m498384l428045l946592l257872k951819l263369k390411k362647
16684D5364817k584992k275526k024684j814155j553684j510326j827144j407438
16676C0366868j262373j312460r30070j263717q20712j201590r27512j205590
16668B1442844o75601o37515j049944n77769m70054r12690k64806o77826p94664
16659A5381975l01525n59379m44493o03633l60254o45427j3197m50784l72193
$$ plain form
16716 201508716 204098112 204748933 203811760 201740424 198224566 193476775 187669450 180956857
16708 180956857 173176957 165682323 157551377 149372006 141022896 133110068 125203511 117693061
16700 117693061 110794227 103709727 97451415 91415949 85909744 80790299 75929418 71463956
16692 71463956 66965572 63537527 59590935 56333063 53381244 50117875 47727464 45364817
16684 45364817 42779825 40504299 38479615 36665460 35111776 33601450 31774306 30366868
16676 30366868 29104495 27792035 26861965 25598248 24777536 23575946 22648434 21442844
16668 21442844 20767243 20129728 19079784 18502015 18031961 17119271 16854465 16176639 15381975
16659 15381975 15080450 14521071 14076578 13472945 13112691 12467264 12454067 12003283 11631090
16650A1631090l90706n87429q5079k09077m71569l76786k04964k07050J62827
16641I261257n77633J04842o96220l0284k90565J8408p82287R3937j39523R0059
16631G051991k15333q2438k31881j96495k27087j33626k67383J20698j63674l70121
16621E284651J76912m35202P4503l03518K81944Q1805l66503o3856k27449K22324
16611D725611k95909j59122j64763K8782p5294j02355l98332P1662J05623n17093
16601C218810N82966m01445o2695K48314k17626p2871J49683k66856R9920n99905
16591B678295J69792K58287k22409m09507L4322J93786j07938M27467m68065o0168
16581B493862K8620j07538Q6588n3319j46854o0198K0942J58549o2414j7656k34962
$$ plain form
16650 11631090 11240384 10652955 10567876 10358799 9887230 9510444 9305480 9098430 9261257
16641 9261257 8683624 8788466 8092246 8061962 7771397 7789805 7007518 7101455 6961932 7051991
16631 7051991 6836658 6754220 6522339 6325844 6098757 5965131 5697748 5818446 5654772 5284651
16621 5284651 5461563 5026361 5100864 4797346 5079290 5161095 4794592 4730736 4503287 4725611
16611 4725611 4429702 4270580 4105817 4134599 4059305 3956950 3558618 3630280 3735903 3218810
16601 3218810 3801776 3400331 3337636 3585950 3368324 3295453 3445136 3178280 3278200 2678295
16591 2678295 2848087 3106374 2883965 2474458 2508780 2702566 2594628 3022095 2554030 2493862
16581 2493862 2522482 2414944 2501532 2448213 2301359 2241161 2262103 2420652 2358238 2340582 2105620
16570B105620K34332j65005K06556k84118k07665J79599k39512l35762J80891
16561A674936j25468J85774r7161k39206K38453L9168j03949L64654k33469o7078
16551A636654J49437p6856k62759L31307m87564P7586J94061j75870J28981M7649
16541A562626k33774k5798L87261m20509j10169L92680l23186J7991J09348j21232
16531A235238k11999K32460K52119k73527k19552j13872M04964j61719K02168
16522A346280j26925j33143J84962l27783P0669o3696j6204K26265J6499k77097
16512H99827J08492j04412j09491K74802j64395J91350q1139j45512L12j41010
16502G28824K24484J00065j84656J5845j9219k19288L52442p3291k55745K07332
$$ plain form
16570 2105620 2339952 2174947 2381503 2097385 1889720 2069319 1829807 1494045 1674936
16561 1674936 1549468 1735242 1638081 1398875 1637328 1676496 1572547 1937201 1703732 1636654
16551 1636654 1786091 1709235 1446476 1777783 1290219 1367805 1561866 1385996 1514977 1562626
16541 1562626 1328852 1303054 1690315 1269806 1159637 1552317 1229131 1247122 1356470 1235238
16531 1235238 1023239 1255699 1507818 1234291 1014739 900867 1305831 1144112 1346280
16522 1346280 1219355 1086212 1271174 943391 1014060 950364 934160 1160425 1176924 899827
16512 899827 1008319 903907 794416 1069218 904823 1096173 1015034 869522 869834 728824
16502 728824 953308 1053373 868717 884562 865343 646055 998497 925206 669461 876793
16492H76793q9154J91561k918j80611j06218P4971j47422k76529O54246C79712
16481F76768M0789j51281p7878L76230l68350J73431o0130p5607q6601L5171K32418
16470G14960p779j65184p072K14310j95975L14732C18491P4162N46513k42345
16460F96821l4977r0664J74938C61795K3501k3526L23337J2386m2408k26111r1131
16449C37843R3929J28248p8080L0538j13023J76509O7537k37875P2165q9443L9243
16438D27591j56151L58873j96893L12541j54173A08956M25272J92160j27212k41353
16428C57823N0039o9242J74809k31732r261O1684O4247A57725M47966j45721k07955
16417B52015N6749K61945j21805j28899k4035K45316B21801N14562l46848j5474
$$ plain form
16492 876793 787639 979200 976282 795671 689453 764424 617002 340473 994719 379712
16481 676768 717557 566276 488398 864628 496278 669709 609579 533972 447371 482542 714960
16470 714960 707181 541997 534925 749235 553260 867992 318491 392653 939166 696821
16460 696821 661844 571180 746118 361795 385296 361770 685107 697493 655085 428974 337843
16449 337843 431772 560020 481940 512478 399455 575964 643501 405626 477791 388348 427591
16438 427591 271440 630313 433420 745961 591788 108956 534228 726388 599176 357823
16428 357823 407862 338620 513429 281697 272436 334120 398367 157725 605691 459970 252015
16417 252015 308764 570709 448904 320005 295970 541286 221801 736363 389515 374041
16407C74041K26476C5917O3475K45192A66279K55352c41730E72154K9503B94116
16396D06487E384O09144k88348K14224k27849r2315J90779D1425L18453g7928
16385I3261M86156l0036F5201M50145A97504K2381M273j02357M98166B74129O6282
16374C40411M3707j50793j8481J36491A27569J34203P7844I9830j1126d5996C43489
16362C40646d4521A04135M7295M0809L2811K8610o4889J17305r8904R8K45085
16351D52355j4608A69486K21858j07091A19948A4556K10415L08408A95847M1420
16341B37267L76653B08162a9043D76966j04710b86869G8897j7973K49666m7950
16331B62640f196C65182K3756A22458g2274C17601q8860J59148F5110J60676B8309
$$ plain form
16407 374041 600517 35917 99392 344584 166279 421631 -341730 572154 601657 294116
16396 406487 5384 614528 326180 540404 312555 220240 411019 41425 359878 -77928
16385 93261 579417 549381 65201 515346 197504 219885 224158 121801 619967 274129 340411
16374 340411 384118 233325 214844 351335 127569 261772 339616 99830 88704 -45996 343489
16362 340646 -44521 104135 151430 192239 225050 253660 188771 306076 207172 207270 452355
16351 452355 437747 169486 391344 284253 119948 14556 224971 533379 195847 237267
16341 237267 613920 208162 -19043 476966 372256 -286869 78897 60924 310590 262640
16331 262640 -6196 365182 388938 122458 -72274 317601 228741 387889 65110 225786 28309
16319i2210A95847J90511e6679A53861Q0163r7432K69423A5418N54992A89296
16308G5535f0070K8795B03990C2261P214P4243i7899B38088l4681p3777J88583
16297C18213A28248J50277A18446C0127d2562B46922I3487a42029b0338r660B95703
16285i6527A33062J93074A25535M9146p7615e7713A69034R3300A27995b67690
16274B67364K34598C2613a69168B57630F294K05548I7784K44276A19753a97337
16263F9806J48112A5547K8783L76948A65751G6768J81242J57379E9731b06275
16252A41516p135j9886J31494c58699e5231G2569K74541A57403l0451b5941d133
16240A4315a13228F1640J24022D6074a0429l03869A67889a02255B01014J513a27582
$$ plain form
16319 -92210 195847 386358 -56679 153861 234024 136592 406015 15418 570410 189296
16308 75535 -60070 -31275 203990 32261 39475 113718 -97899 238088 203407 129630 318213
16297 318213 128248 278525 118446 30127 -42562 246922 93487 -142029 -20338 -29998 295703
16285 -96527 133062 326136 125535 174681 97066 -57713 169034 262334 127995 -267690
16274 267364 501962 32613 -169168 257630 6294 211842 97784 342060 119753 -197337
16263 69806 217918 15547 44330 421278 165751 76768 258010 415389 59731 -206275
16252 141516 134381 114495 245989 -358699 -55231 72569 347110 157403 126952 -25941 -4133
16240 14315 -113228 61640 185662 46074 -10429 -314298 167889 -102255 201014 202527 -127582
16228B08930B9700N05476A2351L48328l2893a04938H6716d9443m9332C75921g9151
16216c7583n5913F2218b21081C3960d1725J4836j20181k95F6373O9093m4192N9294
16204A50568C2092c8444B15053C5286K48854b27822D23016b61730D3694a36759
16193a99955A14542J49217b36917D23102A36271a30545a804A57382a75478A57335
16182a31176e8501j51609A25633b33585h2125m1471B64126G7796c21193h2390
16171a67930H3755b00503g8557A37349R6865B8138J22990b52698H0895J45702
16161B26597k8534g5841O118A79657f8795I0653C5812N5544J02771G571R5776
16150A03347K05347F6189e0305j71136A85156q2970Q7086J12794D1476e3732A69147
$$ plain form
16228 208930 29700 535176 12351 360679 327786 -104938 86716 -49443 -98775 375921 -79151
16216 -37583 -93496 62218 -221081 33960 -41725 -26889 -147070 -147365 66373 135466 91274 150568
16204 150568 32092 -38444 215053 35286 284140 -227822 423016 -261730 43694 -136759
16193 -199955 114542 263759 -236917 423102 136271 -130545 -1804 157382 -175478 157335
16182 -131176 -58501 -210110 125633 -233585 -82125 -123596 264126 77796 -321193 -82390
16171 -167930 83755 -200503 -78557 137349 234214 28138 151128 -252698 80895 226597
16161 226597 198063 -75841 -69723 179657 -68795 90653 35812 91356 194127 7571 103347
16150 103347 308694 66189 -50305 -221441 185156 102186 189272 302066 41476 -53732 169147
16138A30786F826J58233j5452B6572k736a4152A017M3577d8969l7754E7166e7322
16125a19465l4704B1476J62090b22579a5636B92542L4324F3264L6773b5586A6333
16113B17713E9066b41751R6676C1286f5409E4139g6937D4015R5160A1787K50906
16102B62693E8340J02836e3067H2533K15224F6562a68B80634I9259K8766b3658
16090A4753J92761D7455K7787a81558C01843f6612h785I0259B7018N6006j9838
16079F3186L0782D3188K92924I446i8750F9778f4395c2120j07310H873J80165
16068A89038b11432A24528R778l6837d0976A37166a69890m7753B110L34343k0346
16057C16107a97360L6392g5793q6919A34276d29586i5636M265B85979c15768B49577
$$ plain form
16138 130786 6826 165059 149607 26572 23836 -14152 1017 44594 -48969 -86723 57166 -57322
16125 -119465 -154169 21476 183566 -222579 -15636 292542 326866 63264 100037 -25586 16333
16113 217713 59066 -241751 -145075 31286 -65409 54139 -76937 44015 139175 11787 262693
16102 262693 58340 161176 -53067 82533 297757 66562 -168 280634 99259 128025 -23658
16090 14753 207514 47455 75242 -181558 301843 -66612 -8785 90259 27018 83024 63186
16079 63186 93968 43188 336112 9446 -98750 69778 -64395 -32120 -139430 8873 189038
16068 189038 -211432 124528 134306 97469 -40976 137166 -169890 -217643 2110 336453 316107
16057 316107 -197360 -160968 -75793 -162712 134276 -429586 -95636 -91371 285979 -315768 249577
16045B30777a28358B30425A00852h1387A56879B2741b52710A32425c6306A73233
16034G4322m471N4345l5052a83385j808k4462j29761H891b32345i4927G6823a61619
16021E8736i5760j10022L631A11756b92257G4105a50658A68639a15434c7280G197
16009a68401J4932C68860a28831A90018b36406G4509a4355I2032L07983I9150
15998C36617f3793o3996B73735n7451c48125F9300j9625M257c340l14874g7735
15986a86161E507K54316C4173K91380j9712o2658q8864c06765J42614d2006F5402
15974a16883j53919D1701c3419j02708D3434Q2745a65750I6205b30569D7190f6493
15962a74760h1211c8139a6550j48536F6806b80223J19717o1560P5272d4706p1585
$$ plain form
16045 230777 -128358 230425 100852 -81387 156879 22741 -252710 132425 -36306 173233
16034 74322 69851 124196 89144 -183385 -185193 -209655 -339416 8891 -232345 -94927 76823 -161619
16021 58736 -95760 -205782 -202151 111756 -292257 74105 -150658 168639 -115434 -37280 7197
16009 -168401 -153469 368860 -128831 190018 -236406 74509 -14355 92032 400015 99150
15998 336617 -63793 -127789 273735 216284 -348125 69300 49675 53932 -3340 -318214 -77735
15986 -186161 5507 259823 34173 325553 305841 243183 154319 -306765 -164151 -42006 65402
15974 -116883 -270802 41701 -33419 -136127 43434 126179 -165750 96205 -230569 47190 -66493
15962 -174760 -81211 -38139 -16550 -165086 66806 -280223 -160506 -222066 -146794 -44706 -116291
15951a16291i655B3688f3915j56619b527k61079I311P5773J12155b36448K3404
15940b13044i9986B15218J0263a00033A00282h8635C71635b01103C07728c97185
15929a9317o9169r3453L9555j00022j20006E4601c6136A61896a77700J6405A71827
15917C0151a77991j08789d534n942E9937b14071L5827K9076O9726k6879b8780
15905F5856c52695J33255B21693b84446c1945p495J6550o7917A27934a4318A15544
15893a51895E200f4109C1448j479N8852C1828c67795A74778f1942B2064r828m942
15881G294e43o9643A93735a31323m2401F6330Q2187a89074B0720b76359K3320
15870b53039l4279N0773D9328K39813d0808j27523L7130l2569f5625A64454m3019
$$ plain form
15951 -116291 -9655 23688 -63915 -220534 -2527 -263606 9311 85084 197239 -236448 -213044
15940 -213044 -99986 215218 225481 -100033 100282 -88635 371635 -201103 307728 -397185
15929 -19317 -88486 -181939 -142384 -242406 -362412 54601 -36136 161896 -177700 -161295 171827
15917 30151 -177991 -286780 -4534 -10476 59937 -214071 -178244 -149168 -79442 -106321 -28780
15905 65856 -352695 -219440 221693 -284446 -31945 -39440 -22890 -90807 127934 -14318 115544
15893 -151895 5200 -64109 31448 29969 88821 31828 -367795 174778 -61942 22064 12236 7294
15881 7294 -543 -70186 193735 -131323 -173724 66330 148517 -189074 20720 -276359 -253039
15870 -253039 -287318 -236545 49328 289141 -40808 -168331 -131201 -163770 -65625 164454 121435
15859A21435k6559i3183C57380B6764b6410B5676a98446C9854N400b48709D466
15847A17298B531J70573e8615j41493h489k9820j64015j03844d9206j86019k3724
15836b58949A1567A478b09166f9936B53417c29782a51278B52825d7404k85272
15826c32676h1458D4639b00950c9667n2927B4593c02504d5702l7549q1136j85603
15815c49990a23087e4558K6657C6795K0475e3688j12005G3046a37828a8616n6826
15804g5442K8750o1275B22103L9432g5398A36205B5128e8525C66799j37449c55716
15792g2634D7779a69358k3467a0555A10373E5134M562K4212J61731F7045a44691
15780B71076d0215G4006J10463b21158d2193A83780b88633a06625a574B90554
$$ plain form
15859 121435 94876 -93183 357380 26764 -26410 25676 -198446 39854 45254 -248709 4466
15847 117298 2531 173104 -58615 -200108 -8489 -38309 -202324 -306168 -49206 -235225 -258949
15836 -258949 11567 1478 -209166 -69936 253417 -329782 -151278 252825 -47404 -332676
15826 -332676 -81458 44639 -200950 -39667 -92594 24593 -302504 -45702 -83251 -164387 -349990
15815 -349990 -123087 -54558 -27901 36795 57270 -53688 -165693 73046 -137828 -18616 -75442
15804 -75442 -46692 -107967 222103 261535 -75398 136205 25128 -58525 366799 229350 -355716
15792 -72634 47779 -169358 -192825 -10555 110373 55134 59696 83908 245639 67045 -144691
15780 271076 -40215 74006 184469 -221158 -42193 183780 -288633 -106625 -1574 290554
15769b02809D3012c94665b5088A05763B5551d6701q8880p3773n1934B34199I6396
15757D04559j56739j10822Q1823a45177A27296R2257b50497A78992K430p1582
15747A09840b36970B30561H6638d8283C097a07804K9959j82360A8793L74181D2452
15735e8865I1947k8394b5168k6061m3733m3661d8127k6192E1375a9598B05193
15723A0667L24192j37670c6412A76969a7355k85686O6111d6442J945l8690l502
15712h6689B25627A6500J08612A6514J29012a59694D6700B0946K62988a58083
15701H3647a15517N1189k0446B20937C89d29166B56878D2790a72684C2995L81227
15690D14222A8346J0994K16468G7179g0850c2047B2075d72820A42234e8506D28011
$$ plain form
15769 -202809 43012 -394665 -25088 105763 25551 -46701 -135581 -209354 -261288 234199 96396
15757 404559 247820 136998 218821 -145177 127296 219553 -250497 178992 181422 109840
15747 109840 -236970 230561 86638 -48283 3097 -107804 -77845 -260205 18793 392974 42452
15735 -58865 91947 63553 -25168 -51229 -94962 -138623 -48127 -74319 51375 -19598 205193
15723 10667 334859 197189 -36412 176969 -17355 -303041 -236930 -46442 -44497 -83187 -86689
15712 -86689 225627 16500 125112 16514 145526 -159694 46700 20946 283934 -158083
15701 83647 -115517 -64328 -84774 220937 389 -429166 256878 42790 -172684 32995 414222
15690 414222 18346 29340 245808 77179 -70850 -32047 22075 -472820 142234 -58506 428011
15678F358i0625H8113c4025D935a51049B26745b42321H1910b12266A21779J05874
15667B27653f8984j88921A27670l9747b62854i0523J0206q3033k09358a30984
15656b41831R2589l5282j32097e8643j87420F3015d32805A12770k9726J87268
15646B70312H502K2846b1260l34190a4037q9675G5037b47475Q6748L0064B386
15634b94304A7930J34045c4519B4539K4222b83061B15596g698k8274p4493A06178
15622b73578B8788b34333i7334c8067B37918j00729N5536l5527i7019o8230H4754
15610b06771A67874a77549N1834E4004a75442p7627f0883m1691C3884a75280b8319
15598B5334R586a2874E8892c4571B1572N7155a23865F3809f9133q7567A86892
$$ plain form
15678 6358 -90625 88113 -34025 4935 -151049 226745 -242321 81910 -212266 121779 227653
15667 227653 -68984 -257905 127670 87923 -262854 -90523 -80317 -163350 -372708 -130984
15656 -241831 -149242 -184524 -316621 -58643 -246063 63015 -432805 112770 83044 270312
15646 270312 8502 31348 -21260 -355450 -14037 -103712 75037 -247475 -160727 -130663 2386
15634 -294304 17930 151975 -34519 24539 48761 -283061 215596 -7698 -35972 -110465 106178
15622 -273578 28788 -234333 -97334 -38067 237918 137189 192725 157198 -97019 -165249 84754
15610 -206771 167874 -177549 -125715 54004 -175442 -253069 -60883 -102574 33884 -175280 -28319
15598 25334 34920 -12874 58892 -34571 21572 78727 -123865 63809 -69133 -156700 186892
15586A38461d614B86351a1907j00219j6301B84574C7661K46006a6560D2719K16280
15575B58999b5505C14097j11954D3415i6471j99804a20565B46072f2764j4442
15565g7206Q162F26875a92737C76122C1957J86153a65457j03575A51515C4630
15554a85295b2909l03240a19031j14986B00564d5022j68759F4032K66461K12753
15544E43246g4960A08677f9029l6164C0214b3104B05918a75353I1624D5668J2661
15533E8329a34626A20227J89388a0419j71391A73365A2800K64703a15440A1052
15522C8315P4448a32758j0838A51158a85929D9644b32026K0411D7524a36054A83808
15510B17111e120j88488q6112f1166k1195l9629q4212H5650J94262a42170e2270
$$ plain form
15586 138461 -4614 286351 -11907 -112126 -128427 284574 37661 283667 -16560 42719 258999
15575 258999 -25505 314097 202143 43415 -96471 -296275 -120565 246072 -62764 -77206
15565 -77206 -69044 626875 -192737 376122 31957 218110 -165457 -269032 151515 34630
15554 -185295 -22909 -326149 -119031 -234017 200564 -45022 -213781 64032 330493 543246
15544 543246 -74960 108677 -69029 -105193 30214 -23104 205918 -175353 91624 45668 58329
15533 58329 -134626 120227 309615 -10419 -181810 173365 12800 277503 -115440 11052
15522 38315 112763 -132758 -143596 151158 -185929 49644 -232026 -211615 47524 -136054 183808
15510 217111 -5120 -193608 -279720 -61166 -82361 -121990 -206202 85650 279912 -142170 -52270
15498c12368J23588A4865b02094I7206K7827b3146k11334A79165k3621D5071a58306
15486D5108R4426k7840b33507G1755a63902B30462B6483J95966h0817a9574o7788
15475h7362j1493k0872A11096n1849M326O4327b10264c9128m47005h3741k08983
15464b92724c7934l9302p4908e8593B50093C0381K15465c08797M6046C32601e4211
15452c5523E1432A690i1407j30660P119A95160C2492c44800M7001h1857r0745
15441a72602A35733C9237J09174i8578A76117n2062B6095K56297h0290j72260
15431b52550J26156l09172b16585b3542n7836C41317e2997b5779q9538k65111
15421c80428a08681p4230A59795B9231J07699e0717Q638A46454a60266n0426a0097
$$ plain form
15498 -312368 -188780 14865 -202094 97206 125033 -23146 -234480 179165 155544 45071 -158306
15486 45108 139534 111694 -233507 71755 -163902 230462 26483 222449 -80817 -19574 -87362
15475 -87362 -98855 -119727 111096 59247 63573 127900 -210264 -39128 -486133 -83741 -292724
15464 -292724 -37934 -77236 -152144 -58593 250093 30381 245846 -308797 -262751 332601 -54211
15452 -35523 51432 1690 -91407 -222067 -214948 195160 32492 -344800 -297799 -81857 -172602
15441 -172602 135733 39237 148411 -98578 176117 124055 26095 282392 -80290 -252550
15431 -252550 -126394 -435566 -216585 -23542 -81378 341317 -52997 -25779 -115317 -380428
15421 -380428 -108681 -182911 159795 29231 136930 -50717 -42079 146454 -160266 -210692 -10097
15409A22988J32791p1839N0093I9535J7696B4292c0945A3111K06648a58783e0498
15397E4070e9898B11184f32064b11954O3847C4806M2123J76073q9400b9556p1246
15386a00802r5889B22683a18506j22172C34168A39752h883l10335B71173I1375
15375I677K2196J30832a07668j88716J25753j47050J41314B62942j30636J8413
15365A50719C7732e6346k10415d6021B3736b1418A10092Q9067D2541a39782H4994
15353I3942e3558n8722A20090c3323E25249H4827a67510H9929A3848b20953B36448
15341b36092F387f6782j29872A26399g1876D8822Q4642C4494a31059A05184R893
15330A15077a17475C32767a16466B00677k6974G7276L7568C9253J23263d2536
$$ plain form
15409 122988 255779 183940 234033 99535 117231 24292 -30945 13111 219759 -158783 -50498
15397 54070 -59898 211184 -632064 -211954 -148107 34806 76929 253002 163602 -29556 -100802
15386 -100802 -196691 222683 -118506 -240678 334168 139752 -8883 -319218 271173 91375
15375 9677 31873 162705 -107668 -296384 -170631 -317681 -176367 262942 132306 150719
15365 150719 37732 -56346 -266761 -46021 23736 -21418 110092 199159 42541 -139782 84994
15353 93942 -53558 -112280 120090 -33323 525249 84827 -167510 89929 13848 -220953 236448
15341 -236092 6387 -66782 -196654 126399 -71876 48822 133464 34494 -131059 105184 115077
15330 115077 -117475 332767 -116466 200677 173703 77276 114844 39253 162516 -42536
15319A26188g382j1436q6827M7886a2249k2229m52753c1000B99157b2994o8123
15308i1117g997B30147K6135A16278P3676j7551k11f6772o2198N0737A30395J33522
15296B63917H7100h41A41775a2010j5840B0131d4921a9269r8003K6079A83263
15284a26387e014I7425a27777A30299Q663J02329I9180h6833B77215l2427c1205
15272B26865h4713o1781j01595i0334B07678e381D05584A73782B0385K8336M39193
15261D87914k17860A1627K39917a88695C82907j73663J36030j58333b68129D47068
15250A90529K01582A22812J615950m57104r1186M37845D36058B17338q3638A2779
15239a9153k79110N0565B53732Q1148A53391b03109N5763o711A86010k9150C9656
$$ plain form
15319 126188 -7382 -18818 -105645 -57759 -12249 -34478 -487231 -31000 299157 -22994 -91117
15308 -91117 -7997 230147 256282 116278 189954 172403 172192 -66772 -128970 -78233 130395 263917
15296 263917 87100 -841 141775 -12010 -27850 20131 -44921 -19269 -117272 -91193 183263
15284 -126387 -5014 97425 -127777 130299 138962 241291 99180 -86833 277215 244788 -31205
15272 226865 -84713 -146494 -248089 -90334 207678 -5381 405584 173782 20385 48721 487914
15261 487914 270054 11627 251544 -188695 382907 209244 345274 186941 -268129 447068
15250 190529 392111 122812 1738762 1281658 1190472 1628317 436058 217338 133700 12779
15239 -19153 -298263 -247698 253732 334880 153391 -203109 -147346 -154057 186010 156860 39656
15227c78954J77890b3758A7710P6310l8871L87288A26091B9831J61887n5158b0329
15215B20733H4554J75754a31436i96k45879A21197e8242a8781H5163K98277a07311
15203B13445D9786J12103a22115e1597E7750J63080i3346A56472B4121Q8953a95822
15191b3370o1247F3492c56350c6710C44482p3649b81973H5937c9581D4987J05307
15180A50294J1178g7090j87696A47695b53462A5111L22661d2089A08674B0408
15169B42059h6786B82691b4356l514A03579a33788A24571a67920D39453j72388
15159B67065j31427a92907g9376A88042a21915D735e9651E4820J36229o5592a75142
15147A66423a4450k3136I779g7983a9711C9004d1368D1722J89247q5457b06687
$$ plain form
15227 -378954 -201064 -23758 17710 94020 55149 442437 126091 29831 191718 136560 -20329
15215 220733 84554 260308 -131436 -996 -246875 121197 -58242 -18781 85163 383440 -107311
15203 213445 49786 161889 -122115 -51597 57750 220830 -93346 156472 24121 113074 -195822
15191 -23370 -84617 63492 -356350 -36710 344482 270833 -281973 85937 -39581 44987 150294
15180 150294 161472 -77090 -264786 147695 -253462 15111 337772 -42089 108674 20408
15169 242059 -86786 282691 -24356 -27870 103579 -133788 124571 -167920 439453 267065
15159 267065 135638 -192907 -79376 188042 -121915 4735 -59651 54820 191049 125457 -175142
15147 166423 -14450 -37586 9779 -77983 -19711 39004 -41368 41722 230969 145512 -206687
15135d9960A37114o4989L00240j61337a48488b8199o4838j3445b7435m1796A5969
15123B31625h5695A78089N1741J72100r5980d68187B61726a5808f724C30764L8049
15112C68813a22841B46643o2844A4519L85665A5189a99471M0711A92041K1376
15102B13417J61203a00900G9286k4538J17691k6272b35249f893A51388o9712L74750
15091D56426B8697J25058A54a72425D94645A5463a08676H2948K35653j29204C2556
15079D61937B00585l4190M90577h1084F7023g1023B74754R929J10567A52217l6912
15068A15305a21940C362L59349l3760a20931A01161K16199A57744b87848C69018
15057D92969E0492K20539Q4623G0748J24776K84043j01933N6204B7131J1737N23908
$$ plain form
15135 -49960 137114 72125 372365 211028 -148488 -28199 -93037 -106482 -27435 -69231 15969
15123 231625 -85695 178089 229830 401930 305950 -468187 261726 -15808 -6724 330764 368813
15112 368813 -122841 246643 183799 14519 400184 15189 -199471 -158760 192041 213417
15102 213417 374620 -100900 79286 54748 172439 146167 -235249 -6893 151388 81676 456426
15091 456426 28697 153755 154 -172425 494645 15463 -108676 82948 318601 189397 32556
15079 461937 200585 166395 656972 -81084 67023 -71023 274754 284683 395250 152217 115305
15068 115305 -121940 3362 362711 328951 -120931 101161 317360 157744 -287848 369018
15057 492969 50492 271031 355654 70748 195524 479567 377634 433838 27131 38868 562776
15046E62776B08884J85580A79889f4483B05543C3043J39460K31353A85717a01447
15035C93029O9505a41937A34664k7872J26856j13059m6794D023a99728C72188
15024C65852H4413j8221K07515A0140J39524K77237C9619K37177K15698c8227
15013A63645A0837b30611C45884D3006K79623Q1930a3308B32877P4987n2078K0624
15002B76410j36817L5908N06265A6665a9100J652C01208M592I1506K36109C489
14990B76206p7380N1899C5789J97576A16014l8790M02787k18523L16150c8662
14979B17185r680H8656i9316B70441j24815L10662E6031Q8489K44065j4699A1187
14967A77039M8019a42177D19268A01886K9330J59978K4247J6868A56114J02483
$$ plain form
15046 562776 208884 394464 179889 -64483 205543 33043 172503 403856 185717 -101447
15035 393029 462534 -141937 134664 106792 233648 120589 73795 4023 -199728 372188
15024 365852 84413 66192 273707 10140 149664 426901 39619 276796 492494 -38227
15013 163645 10837 -230611 345884 43006 322629 404559 -13308 232877 307864 255786 276410
15002 276410 139593 175501 681766 16665 -19100 -17448 301208 305800 91506 327615 3489
14990 276206 198826 250725 35789 233365 116014 77224 480011 261488 577638 -38662
14979 217185 207505 88656 -99316 270441 145626 456288 56031 144520 388585 373886 11187
14967 177039 225058 -142177 419268 101886 131216 291194 315441 332309 156114 258597
14957B58597K2127n4988F4048O6116J30612N9245l0476p9559M12103I4664N05104
14946E99768j89889j15829G8753K8754N3980M23705j55878Q7199P190B15764J17115
14935C32879F3310M44996k05403J28575O8198B26427J5584K30207I7094i185A30975
14923D0643M8935L15230j41396m9355m8231F216L33087J38954l5799k10247M79051
14912G11262b57062A0328N18830k04797K21441p7321A56949K79580n1057j83038
14902B02434L5512K19963A67189J14274J4266p8255m5028K05151J23262c4102
14891C16588N8228j0815k6722j35896J22015j8672L676K94349j68069j28440L49649
14880F55891k83413m8308J21333p2845j40746L99605i3855D4581J19898J31710
$$ plain form
14957 258597 280724 225736 64048 130164 260776 320021 289545 209986 622089 94664 599768
14946 599768 409879 294050 78753 107507 161487 585192 429314 516513 523703 215764 332879
14935 332879 63310 508306 302903 431478 499676 226427 242011 472218 97094 -9185 130975
14923 40643 89578 404808 263412 214057 165826 6216 339303 478257 442458 232211 711262
14912 711262 -257062 10328 529158 324361 545802 468481 156949 436529 385472 202434
14902 202434 237946 457909 167189 281463 295729 217474 172446 377597 500859 -34102
14891 316588 374816 364001 337279 201383 323398 304726 308402 602751 434682 306242 655891
14880 655891 372478 324170 445503 372658 231912 631517 -93855 44581 164479 296189
14870B96189O3141r7748J47801j73458n8534N2223I2721M53567j06206k9254O0631
14859D71459J36165P0375B51135P9641P5860J01006k10066A21373N11865B68261
14848D02020A86092M44837j48244G1469L47859p079j98618L11299A77627J57080
14838C34707g6751C11604G2198L33070Q1646r4851L46987k99145n4809J63533
14828E48629m3824B29909L90744J88446k36572j41888K03707j93340L4305q853
14818D66458A81083N94220C87089J90935J42190j24459K8096J09844j43992n0383
14808E39320J36672M884l9840J87127l05448J98551k37859j08630J18154K8435
14798E21366n352j22636K43378m1057k02597J72171J61734l60048L26737k87090
$$ plain form
14870 296189 359330 261582 409383 235925 177391 229614 92721 546288 440082 410828 471459
14859 471459 607624 677999 251135 330776 406636 507642 297576 121373 633238 268261
14848 402020 186092 630929 482685 71469 419328 412249 213631 524930 177627 334707
14838 334707 -76751 311604 72198 405268 486914 392063 739050 439905 385096 548629
14828 548629 504805 229909 620653 809099 572527 430639 634346 441006 475311 466458
14818 466458 181083 775303 387089 578024 720214 595755 623851 733695 589703 539320
14808 539320 675992 680876 641036 828163 522715 721266 483407 374777 492931 521366
14798 521366 516014 393378 636756 595699 393102 565273 727007 366959 693696 406606
14788D06606J43157p498j40203R2465K4227J13770n0266K22349n6502j93915R1536
14777F45726j20415K40025J17806C48437l0269J50491J53581j83732J78174J24148
14767G40830l53539J18859K45315l8229B16871O30648j26036J25549k0094k83584
14757E43354K98817l25713j94715O2384K77891j11790j44633L66907k1554k66495
14747D84453J85592J67716p6519j8943j09898L6221j32015K69626j92438k94810
14737C18985L69802R2664C90480M93953r5726K05128k2330k68240k6857L89169
14727A065577n12368J10515J63787K6759o2146j26632p3642M68928L6301l71654
14717G25425j72728L32937J07589k46883J17262Q0722q9035j42414Q3157k3655
$$ plain form
14788 406606 549763 542265 402062 494527 518754 632524 582258 804607 748105 554190 645726
14777 645726 525311 765336 883142 348437 318168 468659 622240 438508 616682 740830
14767 740830 387291 506150 751465 713236 216871 847519 721483 847032 826938 543354
14757 543354 842171 516458 321743 384127 662018 550228 405595 772502 750948 484453
14747 484453 670045 837761 761242 742299 632401 668622 536607 806233 613795 318985
14737 318985 688787 781451 390480 884433 788707 993835 971505 703265 676408 1065577
14727 1065577 553209 663724 827511 854270 792124 665492 591850 1060778 1097079 725425
14717 725425 552697 885634 993223 746340 863602 944324 855289 712875 796032 772377
14707G72377J48719l28433r573L46519k4144q634K2679m3173J47472k82413L0102
14696G71498k7785K97043p9989O7587o252j74339j95830M14600j7085j04292j54827
14685G90329P5618j8758L0574O978K47627j58614J54609q378l77709K00352k67586
14674F75042O7919K16996J40134n2616r4215k20369K16337K25918K31438m62567
14664I44017K51011k78138J31750J35180k19801L17048R8710j61310J50065k26248
14654A142284l03646M52450k82966J01725j03211J31555j2900R6491J47083m36853
14644I32012K71363n4660J12241j95510L45199m2398L5811k70379K68440l47024
14634A055095L77323L728j90893J15431q3165j64396J07904O0498K2308J83830
$$ plain form
14707 772377 921096 592663 583090 929609 905465 896831 919510 876337 1023809 741396 771498
14696 771498 743713 1040756 960767 1028354 1022102 847763 651933 1066533 1049448 945156 790329
14685 790329 865947 847189 877763 884741 1132368 973754 1128363 1119985 742276 942628 675042
14674 675042 742961 959957 1100091 1047475 953260 732891 949228 1175146 1406584 944017
14664 944017 1195028 916890 1048640 1183820 964019 1281067 1379777 1218467 1368532 1142284
14654 1142284 838638 1291088 1008122 1109847 1006636 1138191 1125291 1221782 1368865 932012
14644 932012 1203375 1148715 1260956 1065446 1410645 1368247 1404058 1133679 1402119 1055095
14634 1055095 1432418 1436146 1245253 1360684 1277519 1113123 1221027 1281525 1303833 1487663
14624A487663l42387J64199M73464l97674K25508j81682k26952K52296J05590
14615A560025q7115m1551K13251j12940O8915p3330J16118j0753j16850K00349
14605A716119k364p2896M4125k66944j45332K28417L08049j76709L3685k12481
14595A453669M2136K60260p9084o0659J14552J20322k67158L18253o6616J16729
14585A952404O0231l56787L34181r871R7320q4450k1469J06598J68857o5835l6826
14574B144353j84288M11822k04262r630j98217k5661M92791l124n8931R1247J40680
14563B596780j2018K18962j4387j15723K33432K67215p2997j29871L98987M32634
14553C803014m20703N74961O01005P77050J818869L936537R926723K3612489Q09878
$$ plain form
14624 1487663 1145276 1309475 1782939 1385265 1610773 1429091 1202139 1454435 1560025
14615 1560025 1472910 1431359 1644610 1531670 1600585 1527255 1643373 1632620 1515770 1716119
14605 1716119 1713755 1640859 1684984 1418040 1272708 1501125 1809174 1632465 1666150 1453669
14595 1453669 1495805 1756065 1676981 1616322 1730874 1851196 1584038 1902291 1835675 1952404
14585 1952404 2012635 1655848 1990029 1980158 2077478 1993028 1971559 2078157 2247014 2181179 2144353
14574 2144353 1960065 2371887 2167625 2157995 1959778 1934117 2426908 2423784 2364853 2456100 2596780
14563 2596780 2584762 2803724 2789337 2673614 2907046 3174261 3101264 2971393 3370380 3803014
14553 3803014 3382311 3957272 4558277 5335327 7154196 11090733 21017456 44629945 45439823
14544D5439823B2091039I127234m109259j582588r63801j92743r045K35878n08222
14535A997454Q4233k28875N10414m43655J75498J75794K51427k44677Q8327Q0486
14525B446426l14352L11318n4886R2451L52346k07002p3913l5549k4832L83250
14515B875257j55782K7632n7322K52931j50643k47049M57344L6601j21771k13556
14505B703642L74122R9180j93960J71707J22716L6624m66m04506N90838j64684
14495C335213k25448O61200k12092k33784K82959J21981J21205j93552J19207
14486C776889j3798N2294j049J4850L2195P4402k8073M50686m74532k4955L54094
14475D213003K99157k23100k58446J67848N10535k0066p5278J34310j087q9767
$$ plain form
14544 45439823 22091039 9127234 5017975 3435387 2471586 2278843 2269798 2505676 1997454
14535 1997454 2081687 1852812 2363226 1919571 2095069 2270863 2522290 2277613 2365940 2446426
14525 2446426 2132074 2443392 2388506 2480957 2833303 2626301 2552388 2516839 2492007 2875257
14515 2875257 2719475 2747107 2689785 2942716 2792073 2545024 3002368 3038969 2917198 2703642
14505 2703642 3077764 3176944 2982984 3154691 3277407 3314031 3313565 2909059 3499897 3335213
14495 3335213 3109765 3770965 3558873 3325089 3608048 3730029 3851234 3657682 3776889
14486 3776889 3763091 3815385 3814336 3829186 3861381 3935783 3907710 4358396 3883864 3858909 4213003
14475 4213003 4512160 4289060 4030614 4198462 4708997 4688931 4613653 4747963 4746876 4657109
14465D657109K95111n470j34487K33356M0076k30785K06346Q7591l5504K84812
14455E398155j1405J01305k87282O1555M49446M2338j69330k005O7537M76319
14445F126633j5331m1390k20822J81154L86656k4779j9587K46702j20158K2115
14435F521193J15131m841J30451o6312O42154j68149N44194o61843J85489M50662
14425G688129k88000K29142m1375N30918k4686J82608K51883n4L8818L18561j39803
14414H746141M53318l86879L72859j52084L92109K6934M08305O5892K77440L6512
14404A0240547J91763J92815M4094k63937N90575j2231L64768J95849M09667k63556
14394A1690354K63419K93543K16270J73886L20794M31025q0703K83220L52174
$$ plain form
14465 4657109 4952220 4946750 4812263 5045619 5085695 4854910 5061256 5148847 5113343 5398155
14455 5398155 5386750 5488055 5200773 5262328 5711774 5754112 5584782 5582777 5650314 6126633
14445 6126633 6111302 6069912 5849090 6030244 6416900 6392121 6372534 6619236 6499078 6521193
14435 6521193 6636324 6631483 6761934 6695622 7337776 7169627 7713821 7051978 7237467 7688129
14425 7688129 7400129 7629271 7587896 8118814 8094128 8276736 8528619 8528565 8567383 8885944 8746141
14414 8746141 9199459 8812580 9185439 9033355 9425464 9452398 9860703 9926595 10204035 10240547
14404 10240547 10432310 10625125 10669219 10405282 10995857 10983626 11348394 11544243 11953910 11690354
14394 11690354 11953773 12247316 12463586 12637472 12958266 13389291 13308588 13591808 13943982
14385A3943982p7249K75306L32126O30395j64420M48266J61798J56052N19981
14376A6226237M48106J82919L43624K82146L49403N56882K11923n3788R42928
14367A9490380N39260L92769M5513O07605N41059L39895Q23008J99637M74994
14358B3454120M72820Q53225L3493Q12340O75541N91955M94724Q83980O40500
14349B8912698N51138Q60497N08464Q77877J117242L83537J206070J228233O26351
14340C6272107P81030J266850J077309J094984J255493P99535J504291J747663
14332D5799262Q99348J472923J275447J856734J622197J661201J449319K334187
14324E8370618J845656J705056K088802K605884K417975K333343K556112K835971
$$ plain form
14385 13943982 13866733 14142039 14474165 15104560 14940140 15388406 15550204 15706256 16226237
14376 16226237 16674343 16857262 17200886 17483032 17832435 18389317 18601240 18547452 19490380
14367 19490380 20029640 20422409 20467922 21075527 21616586 21956481 22779489 22979126 23454120
14358 23454120 23926940 24780165 24813658 25625998 26301539 26893494 27388218 28272198 28912698
14349 28912698 29463836 30324333 30832797 31710674 32827916 33211453 34417523 35645756 36272107
14340 36272107 37053137 38319987 39397296 40492280 41747773 42547308 44051599 45799262
14332 45799262 46698610 48171533 49446980 51303714 52925911 54587112 56036431 58370618
14324 58370618 60216274 61921330 64010132 66616016 69033991 71367334 73923446 76759417
14316G6759417L007845K761873L468234L517184L095533M044041L749135M346881
14308A04750143M313239M401565M936780N388163N497259O044500N924760O740020
14300A47996429O856619P189491Q210917Q315965Q341147R305581R909972J0287415
14292B16413536J0455768J1689067J1496668J2706274J3028328J3269485J3955782
14285C03014908J4500897J4963832J5111619J5060172J4994760J4981823J4621816
14278D07249827J3814491J3070989J1653035J0119578Q564652O246016K388705
14271D73107293j624999l621641l914030l822290n644444q342048r376312j0796180
14263D25965349j2335504j3365061j4442696j4941435j5446948j5630267j5726364
$$ plain form
14316 76759417 79767262 82529135 85997369 89514553 92610086 96654127 100403262 104750143
14308 104750143 109063382 113464947 118401727 123789890 129287149 135331649 141256409 147996429
14300 147996429 154853048 162042539 170253456 178569421 186910568 196216149 206126121 216413536
14292 216413536 226869304 238558371 250055039 262761313 275789641 289059126 303014908
14285 303014908 317515805 332479637 347591256 362651428 377646188 392628011 407249827
14278 407249827 421064318 434135307 445788342 455907920 464472572 470718588 473107293
14271 473107293 471482294 467860653 463946623 460124333 454479889 446137841 436761529 425965349
14263 425965349 413629845 400264784 385822088 370880653 355433705 339803438 324077074
14256C24077074j5504854j4268528j4230232j3472700j3726706j2315771j1735629
14249B28822654j1695624j0856388r934792r772135q669794q058463p776103q041518
14241A54017837p266880o747438n780322n667467n296592n775759m893993m706939
14233A07882447m635737l717533l877795l243379m144430l658120k680275l311714
14225G8613464k931414k910634k574800k180482k254153k300306k067507k001972
14217E9392196k023595j963700j828854j109097j476442j656092j883865j123416
14209D6327135j542160p27242j360560o73063j448401j386001j196934r45196
14201C7047578o56852q45065q31372j015872j206624p96774o32041l69224j066404
$$ plain form
14256 324077074 308572220 294303692 280073460 266600760 252874054 240558283 228822654
14249 228822654 217127030 206270642 196335850 186563715 177893921 169835458 162059355 154017837
14241 154017837 146750957 140003519 134223197 128555730 123259138 117483379 112589386 107882447
14233 107882447 103246710 99529177 95651382 92408003 88263573 84605453 81925178 78613464
14225 78613464 75682050 72771416 70196616 68016134 65761981 63461675 61394168 59392196
14217 59392196 57368601 55404901 53576047 52466950 50990508 49334416 47450551 46327135
14209 46327135 44784975 44057733 42697173 42024110 40575709 39189708 37992774 37047578
14201 37047578 36390726 35545661 34714289 33698417 32491793 31695019 31062978 30693754 29627350
14192B9627350o58917q25837n73150n39844j031401q77307l83502k39517l55942
14183B4141933q51130m03789m94645k73686q23010o32556j88254q9331o12465
14174A9773067l02874k66496m60064l11485m75462m15408m02643J52662l17130
14165A6974167m39494m97385L2039p89513q441n44458k53930J20391k63882o03418
14155A3726076q4176M9648l11835L9484o01971l13957j07929m13039O9534l36231
14145A1715604k18074J23890m77768n6030N996r7822q7420m09353k15880l0413
14135A0252730m1680m15798j16096p6282j24220q1940l72502M9001j18141k71028
14125H684044K06302k62852k35669r8685j44697o6028q8089j38194P6723o34178
$$ plain form
14192 29627350 28968433 28142596 27569446 27029602 25998201 25120894 24737392 24497875 24141933
14183 24141933 23290803 22887014 22392369 22118683 21295673 20663117 20474863 20385532 19773067
14174 19773067 19470193 19203697 18743633 18432148 17956686 17541278 17138635 17291297 16974167
14165 16974167 16534673 16037288 16069327 15279814 15271373 14726915 14472985 14593376 14329494 13726076
14155 13726076 13641900 13691548 13379713 13419197 12817226 12503269 12395340 11982301 12051835 11715604
14145 11715604 11497530 11621420 11143652 11087622 11093618 10995796 10908376 10499023 10283143 10252730
14135 10252730 10211050 9795252 9679156 9602874 9478654 9396714 9024212 9073213 8955072 8684044
14125 8684044 8890346 8627494 8391825 8293140 8148443 8082415 7994326 7856132 7932855 7298677
14115G298677J95316k13655J92901k27886P8677k67242R1640k0864l30670l5304
14105F761590k06567o3908K8977K7911p5140k03154P6010q5432j77527J83993
14095F266753r3076k06571j24063n0861r394m11513J46185j70416N16866l59294
14085E504616k57344J9773K2696j94233K90600m13223j49081J91888j52053J03106
14075D966745j72656j2408j30295K45511l38311r7561O9184M559P9276l46031
14065D268013K15522m25138K18060J07939P1269m40662L51710K0305j94079l14375
14055C878564J94242J21803k91699j55117J08939j36993K41274K304n11562Q706
14045C460461K70916l33262K66336k52793K28938l29554J9311J08858K00093l86306
$$ plain form
14115 7298677 7493993 7280338 7473239 7245353 7324030 7056788 7148428 7127564 6796894 6761590
14105 6761590 6555023 6491115 6520092 6548003 6472863 6269709 6345719 6260287 6082760 6266753
14095 6266753 6173677 5967106 5843043 5792182 5782788 5371275 5517460 5347044 5863910 5504616
14085 5504616 5247272 5267045 5289741 5095508 5386108 4972885 4823804 5015692 4863639 4966745
14075 4966745 4794089 4781681 4651386 4896897 4558586 4461025 4530209 4534768 4614044 4268013
14065 4268013 4483535 4058397 4276457 4384396 4455665 4015003 4366713 4387018 4192939 3878564
14055 3878564 4072806 4194609 3902910 3747793 3856732 3719739 3961013 3963317 3451755 3460461
14045 3460461 3731377 3398115 3664451 3411658 3640596 3311042 3330353 3439211 3639304 3252998
14035C252998p9365J15764j03018P1300j90197M1805j70340L10608J33732m16109
14025B967178n3414K02206j26530k77463L47073j34556j21734j4315n4268j78001
14015B556176K46947q6522K64874m60680K04293m8593q044j98735J06524j29897
14005B446343j08461Q0616j64942Q8291n7540J78787j500k95656J22058K84416
13995B572412m07147L14000m15447L52064l41308M89148Q56416J760864P883911
13986A3064913K3704771J0365842k1140155j2555975m891582j926824j439634
13979E181356r08236m92911m64581l9189k69627O327m7697j4591k29461k794l10443
13968B408153L20706K11162k54254o5959k99542K16157l43905K8264k52492M10206
$$ plain form
14035 3252998 3173633 3289397 3186379 3257679 3067482 3109287 2938947 3249555 3383287 2967178
14025 2967178 2913764 3115970 2989440 2711977 3059050 2924494 2802760 2788445 2734177 2556176
14015 2556176 2803123 2716601 2981475 2520795 2725088 2676495 2668451 2469716 2576240 2446343
14005 2446343 2337882 2418498 2253556 2341847 2284307 2463094 2461594 2165938 2287996 2572412
13995 2572412 2165265 2479265 2063818 2415882 2074574 2563722 3420138 5181002 13064913
13986 13064913 36769684 47135526 25995371 13439396 8547814 6620990 5181356
13979 5181356 4273120 3780209 3315628 3276439 3006812 3013139 2965442 2950851 2721390 2718596 2408153
13968 2408153 2728859 2940021 2685767 2619808 2320266 2536423 2192518 2220782 1968290 2378496
13958B378496l73947m9579J16535K39049q0551k35027J63658J37393l42148j40101
13948A813778L48502p3795P5893l10978J49787L059P1689k0579k35547L60908
13938B182717n54184K14584k20772M18530m54495J41452j77632J53066K20874
13929A924140l3981j05243k08705r0189L1290M82508m84563j03063K08003m1746
13919A578451j40035M45661k60206K72753k27196k45213J24046k31670K28455
13910A545046j24859L33168J30148o61434K88702M9827n7962j30891L06531k72472
13900A405804j42684j35926L25736J69658j04447k72234K40640j98732k85011
13891A002804M02090j79818P5149P2435J31007n28174L35160J51739j86097j23481
$$ plain form
13958 2378496 2004549 1954970 2071505 2310554 2230003 1994976 2158634 2296027 1953879 1813778
13948 1813778 2162280 2088485 2164378 1853400 2003187 2006246 2077935 2057356 1821809 2182717
13938 2182717 1628533 1843117 1622345 2040875 1586380 1727832 1550200 1703266 1924140
13929 1924140 1890159 1784916 1576211 1486022 1517312 1999820 1515257 1412194 1620197 1578451
13919 1578451 1438416 1884077 1623871 1896624 1669428 1424215 1548261 1316591 1545046
13910 1545046 1420187 1753355 1883503 1222069 1510771 1560598 1502636 1371745 1678276 1405804
13900 1405804 1263120 1127194 1452930 1622588 1518141 1245907 1486547 1287815 1002804
13891 1002804 1404894 1225076 1300225 1372660 1503667 975493 1310653 1462392 1276295 1152814
13881A152814J96244j09724k67648J37539J00694R2876M4248m0366q2248j43705
13871A080724L06041l7879J89741n03210P9447J46945o2018j66195L0707M6522
13861A110825J90143k47224L75622n93229K92813m3689R5054n2031N508R4067
13851A227859j22828O6643r0848j67766R8147K16023n3581j58975j8553l8519
13841I57602n3332L06371k87154K98168l76557K23032q652M79255o82429m9582
13831H06722J63842p7158j21125N30738n23065K64423k42007L94566o2548k19049
13821I15339K90398n8922j81624l48781M72919k33517R2113j79119J9775K22041
13811A010622r6603q7998n788L26972k58912j83378J53024N0971J92128k43175
$$ plain form
13881 1152814 1349058 1239334 971686 1109225 1209919 1302795 1347043 1306677 1224429 1080724
13871 1080724 1386765 1348886 1538627 1035417 1114864 1261809 1199791 1033596 1064303 1110825
13861 1110825 1300968 1053744 1429366 836137 1128950 1085261 1180315 1128284 1133792 1227859
13851 1227859 1105031 1171674 1080826 913060 1011207 1227230 1173649 1014674 996121 957602
13841 957602 904270 1210641 923487 1221655 845098 1068130 1059478 1538733 856304 806722
13831 806722 970564 893406 772281 1303019 779954 1044377 802370 1196936 1134388 915339
13821 915339 1205737 1146815 965191 616410 1089329 855812 947925 768806 788581 1010622
13811 1010622 914019 826021 820233 1147205 888293 704915 857939 908910 1101038 857863
13801H57863L21676J57964F17962L38640j28625O2677j8131N6513o8435J84391
13791A044992l71563L05885j71056K04343k31938k45876L96546m22992Q5524J49377
13781G43242j74872K72727C27284L79619J5533L35764D18666N32914k62168J72029
13771H61441A95373P03693q5828J31155C77592L28704Q9888M5978n2497j24093
13761F65572Q2620L1164L9713P9452l72083q593K25494j8510J93204l68087j86165
13750C63781K93858O6695L12811k9361D63131L50265l39485j7967J44024J52663
13740G52631j41345O8851N3543k42646L34079j47668L9946n6780N9309J25952
13730H45872l95524K06515l23761J6659K54153J6838k94868J62592p3041J63407
$$ plain form
13801 857863 1179539 1337503 617962 956602 827977 890654 872523 929036 860601 1044992
13791 1044992 673429 979314 808258 1012601 780663 534787 931333 508341 593865 743242
13781 743242 568370 841097 327284 706903 722436 1058200 418666 951580 689412 861441
13771 861441 195373 899066 813238 944393 377592 706296 796184 842162 789665 665572
13761 665572 748192 779356 819069 898521 526438 517845 743339 724829 918033 549946 363781
13750 363781 657639 724334 1037145 1007784 463131 813396 473911 455944 599968 752631
13740 752631 611286 680137 733680 491034 825113 677445 717391 660611 719920 845872
13730 845872 450348 656863 333102 349761 603914 620752 325884 488476 415435 578842
13720E78842j20932m8339j19837N00071r0650j36457R8842R6693j44258j17889
13710D96086J2130k0774R6005j96791M12221j94435K28756C20277J38128N0708
13700E09113J26717J9888J7272j20595K5410k35988L87709j28759J39977j57247
13690E83497N6113O8938k61150K10320j95131J14161K77095k07909j99044K47910
13680F94800j86227J96552p9870k32611j6404L23193j85173A98919J47558K29680
13670E76157D5264N51938m3578A51163L21714R3949k7254j04900J70713j23891
13660D81494M32M0859B03250J82131L14928j66172j10795K30044j41099k23931
13650B88356o4822M43030l829q6861J12301j80048L1144k43793l8937J06084J9894
$$ plain form
13720 578842 457910 409571 289734 789805 699155 562698 661540 758233 613975 496086
13710 496086 508216 487442 583447 386656 798877 604442 833198 320277 458405 509113
13700 509113 635830 655718 672990 552395 577805 341817 729526 600767 740744 583497
13690 583497 639610 708548 447398 657718 462587 576748 853843 645934 446890 694800
13680 694800 508573 705125 625255 392644 376240 699433 514260 198919 346477 576157
13670 576157 45264 597202 553624 151163 472877 566826 539572 434672 605385 481494
13660 481494 481926 522785 203250 385381 700309 534137 423342 653386 512287 288356
13650 288356 223534 666564 662735 575874 688175 508127 539271 295478 256541 362625 382519
13639C82519J78367k76524J3528L30417o4049k01075L25543k06770K75285k43060
13629E14181j22717J89482M9334B9664L12345Q0734K0149A30617M83578o0304
13619E53891O1812B38765M62055B47765P5277m7761K78468r7564R9844K4132q0279
13608D99882K8523B20232L22812j79902J06364A70888K3069r123J34133q8472
13598B30495l5219J47595J4455A77966K86055j19189j1642J7785r7619J29322
13588C82678M2251p7994J31189A31165C3288L61110F7669J02971l2477K05049
13578C43212J48762k26769M58929k52315j40860k8111J04295L8508O1055A76758
13567A89808p6330k3908R4174K13225L803K82840C18529J11165Q299j76878P7728
$$ plain form
13639 382519 560886 284362 297890 628307 564258 363183 688726 481956 757241 514181
13629 514181 391464 580946 630280 29664 342009 422743 442892 130617 614195 553891
13619 553891 615703 238765 700820 247765 323042 275281 553749 456185 556029 580161 499882
13608 499882 528405 220232 543044 363142 469506 170888 193957 184834 318967 230495
13598 230495 195276 342871 357326 177966 464021 344832 333190 350975 253356 382678
13588 382678 424929 346935 478124 131165 33288 394398 67669 170640 138163 343212
13578 343212 491974 265205 724134 471819 330959 302848 407143 445651 506706 176758
13567 189808 113478 89570 183744 396969 400772 683612 318529 429694 437993 261115 338843
13556C38843K43095B65831I7082L69479R3602k10901J44056j79840J50004j21617
13546C41865J40712j06441j11582K45472C6820J79654K90320A64047k2265K74798
13536D16580A46315K79915i6681C47409l6289q4010m958L50139j03533j79412
13526B89346A12104K63891j18367J9619L2964j43348L43450j56434j45970J41914
13516C49823c4366E85845B44622L31714n3150k29597j9289k0452K6782A20091
13505C27533A22844a0727B52000J02047j66443N29563j11339E6518A3220K27924
13495B41144E4981J62520Q7132n1308O2051F4332Q9020J23963O1048p5730k0060
13484B42573M7694j01141K00027j09629j01614K704L99696k63665N4022r4344
$$ plain form
13556 338843 581938 265831 97082 466561 560163 349262 493318 313478 463482 341865
13546 341865 482577 376136 264554 510026 36820 216474 506794 164047 141782 416580
13536 416580 146315 426230 -96681 347409 311120 227110 222152 572291 468758 289346
13526 289346 112104 375995 257628 277247 310211 166863 510313 353879 207909 349823
13516 349823 -34366 585845 244622 576336 523186 293589 274300 253848 280630 120091
13505 327533 122844 -10727 252000 354047 187604 717167 605828 56518 13220 241144
13495 241144 54981 217501 304633 253325 315376 64332 153352 277315 338363 262633 242573
13484 242573 290267 189126 389153 279524 177910 180614 580310 316645 370667 276323
13474B76323A06391J70823N52K2173o4100d3540A20889n2958J95053j12672f2456
13462D90746A19933M5469J87604J84211k50336r1608l0885L0347K3516K29108
13452D47359A07593K78024A92660K81455a04549C47683j30526J71608A23460J10324
13442B33784J26023J4021j85555J16816m3039K65179j35591l4241A606L96197
13432C97803G4493K59458m7774A7129J25337c7158C72869f9961A57909K0364J2988
13421A91261P517p6457R186R8408J0397K16666m1155j29016j08036j9203K07786
13410C67354j27283A16008K85456p0331h6771B55189q8006G8239M81693B18610
13399H3435M7472n9374a74910F7221Q7525J58081J83223P6347A73166J45196l4855
$$ plain form
13474 276323 106391 277214 277766 299939 235839 -43540 120889 67931 262984 150312 -62456
13462 490746 119933 165402 353006 537217 286881 195273 164388 194735 218251 447359
13452 447359 107593 385617 192660 474115 -104549 347683 217157 388765 123460 233784
13442 233784 359807 373828 188273 305089 262050 527229 391638 357397 1606 397803
13432 397803 74493 333951 286177 17129 142466 -37158 372869 -69961 157909 178273 191261
13421 191261 198778 122321 131507 229915 240312 456978 415823 286807 178771 159568 367354
13410 367354 240071 116008 401464 331133 -86771 255189 167183 78239 559932 218610
13399 83435 130907 71533 -174910 67221 154746 312827 496050 572397 173166 318362 283507
13388B83507A4192L7720K94477J03793B03308e1826A20806J44366L1103J06562
13378D02837N1185J4754j93992J86774j59687r9080A5586F616N6658d6948C19133
13366B25151P3351l4926c7502C53687m9234A13653a9066B82247N7623p3895J6422
13355B82397g7358C78306A66096l2962J99796p8184j6764M3225b2991A93093L42003
13344E35096r1795r5978j52702K43755j06024M2720j4669a49657C70355j34820
13334B35535J92387K5087B02621O857J69082j71144J2887l6211J4856r6439R1103
13323A93612k239k291Q1262A01064L82440j56432j00538K80250A94114n1579J53582
13312B96117b35569D87753d089I9933O1737m8371J55748f1374A89159P014M1099
$$ plain form
13388 283507 14192 51912 346389 450182 203308 -51826 120806 265172 296275 402837
13378 402837 454022 468776 274784 461558 301871 202791 15586 6616 63274 -46948 319133
13366 225151 298502 263576 -37502 353687 304453 113653 -19066 282247 339870 265975 282397
13355 282397 -77358 378306 166096 133134 332930 254746 237982 281207 -22991 193093 535096
13344 535096 443301 347323 194621 438376 332352 375072 360403 -149657 370355 235535
13334 235535 427922 453009 202621 209478 378560 207416 220303 184092 198948 102509 193612
13323 193612 191373 189082 270344 101064 483504 327072 226534 506784 194114 142535 296117
13312 296117 -235569 487753 -4089 99933 161670 113299 269047 -61374 189159 196173 237272
13301B37272d3944A84033q0451K44133A68738A6993K71166b8818B60626F4104
13290B40515F5614N1676K79370I6449k2711Q6651L13469j22944C0457c849j12629
13279a16478C22110A04032a08958n4905p4852C58452m1928D7636K37787A22689
13268i5360L0322a8865j4171H0860J66728J21455l2740a2189j04733A44704B471
13256A51228J80924A4077L86588o9337a05771m3042A55058A4084b3418A64821
13245C30395d877G1244J35102N817I1996J6645M2820p5177a06605d0479A57644
13233B43944K10420f217A64627J63900n3796A25246m987a18818H5891C4667Q9952
13222A24619A0760J53912L01729A44149m871K62733A18508g6365F5058a0647H3261
$$ plain form
13301 237272 -43944 184033 103582 347715 168738 16993 288159 -28818 260626 64104
13290 240515 65614 117290 396660 96449 73738 160389 473858 350914 30457 -3849 -116478
13279 -116478 322110 104032 -108958 -163863 -238715 358452 316524 47636 285423 122689
13268 -95360 -65038 -18865 -33036 80860 247588 369043 336303 -12189 -116922 144704 2471
13256 151228 332152 14077 400665 331328 -105771 -148813 155058 14084 -23418 164821
13245 330395 -4877 71244 206346 212163 91996 108641 151461 76284 -106605 -40479 157644
13233 243944 454364 -6217 164627 328527 274731 125246 120259 -118818 85891 34667 124619
13222 124619 10760 164672 466401 144149 139278 402011 118508 -76365 65058 -10647 83261
13210B98725b02665b0736B01085a43203H4151a24233A88502h0798k1178B69187
13199F11066k68733j15294A08158c9993J8129B52576R5007A53581E4118j9044
13189C5074J0963b2482a0531A08932J7258b16810C83774D5706a33307B5705K0409
13178D6114R5386F4244J48542C9445J48767D8157L57730G2683J10469n5278O7148
13167A95022M6850K47115A90886o7777a263B02248b19318C68596D323L10969E959
13155A56752g4621m0171d3073B01257i8129M1627C00394G312K3568J20555m4536
13144A06899d9970A86533K0311J40448I8316f2439A59237e0317B40563a01894
13133C2177J11554b10877h3870A0138a39452c7513b79q88A67726B5506K42612
$$ plain form
13210 298725 -202665 -20736 201085 -143203 84151 -124233 188502 -80798 -101976 269187
13199 611066 342333 227039 108158 -39993 -21864 252576 347583 153581 54118 35074
13189 35074 46037 -22482 -10531 108932 126190 -216810 383774 45706 -133307 25705 46114
13178 46114 141500 64244 212786 39445 188212 48157 405887 72683 183152 127874 195022
13167 195022 241872 488987 190886 123109 -1263 202248 -219318 368596 4323 315292 5959
13155 156752 -74621 -114792 -43073 201257 -98129 -56502 300394 7312 30880 151435 106899
13144 106899 -49970 186533 206844 347292 98316 -62439 159237 -50317 240563 -101894
13133 32177 143731 -210877 -83870 10138 -139452 -37513 -279 -1167 167726 25506 268118
13122B68118a55111J3210R60m203A90603m1290M910B6296j2102J07346p618J00393
13110B14315J0654p6618J74412q1773p3129g8764j60902A19141L80520A83749
13099G4045b84349B61095D6178J20931R2322G1047B9981d26069E145a68609B25932
13087I3689c65891J40728A3287A256c4337A03238P4871N8513o9257D1708d4486
13075B8921Q9306K66714g5134k0703A44541d9321F4266E816J50318R6905G3372
13063B21056A9370L35003A64068M8384d5015A54712a95883B18610b0125A56987
13052a86320O6307B26979c30767B53884p8161N1734L5140j30844j4008c07250
13041C13392n1508m1465b4524A86129B8106J47909E9694b4132B08378q0242P5936
$$ plain form
13122 268118 -155111 -141901 -140941 -145144 190603 149313 154223 26296 14194 121540 113922 214315
13110 214315 224969 148351 322763 240990 167861 -78764 -239666 119141 499661 183749
13099 74045 -284349 261095 46178 167109 259431 71047 29981 -426069 5145 -168609 225932
13087 93689 -365891 -225163 13287 1256 -34337 103238 178109 236622 167365 41708 -44486
13075 28921 118227 384941 -75134 -95837 144541 -49321 64266 5816 156134 253039 73372
13063 221056 19370 354373 164068 212452 -45015 154712 -195883 218610 -20125 156987
13052 -186320 -120013 226979 -330767 253884 175723 227457 262597 131753 117745 -307250
13041 313392 261884 220419 -24524 186129 28106 176015 59694 -24132 208378 128136 204072
13030B04072H1926K32231b53155C26124r8841D0300J45086J45203L2533A04343
13019D25500b15128A11249L66356A21971D5081J62083n5891o4382F106L18702
13009C24808o0441j03299J05164c4372A83732c78520D24614A01903B3277K47171
12999B70448F5564h2850G3458K24072c8024k81803A89987J7063a08906I7070b41912
12987H7604K30885f7643o522p4852G5689C1062O0630J55995a27371A55335B8442
12975B72893A30903M0338O8962i713C04503j32266K06754A32927n3605e2653J5701
12964c6952O032A40133b48944B307g9370q7868o4742L6295g120B41409K32093
12953D73502e232E0570b17805E0920e3555a4374j24306B93733j12970a01102J8730
$$ plain form
13030 204072 81926 314157 -253155 326124 227283 40300 185386 330589 363122 104343
13019 425500 -215128 111249 477605 121971 45081 207164 151273 86891 6106 324808
13009 324808 264367 161068 266232 -34372 183732 -378520 424614 101903 23277 270448
12999 270448 65564 -82850 73458 297530 -38024 -319827 189987 207050 -108906 97070 -241912
12987 87604 318489 -67643 -74165 -149017 75689 31062 91692 247687 -127371 155335 28442
12975 272893 130903 171241 240203 -9713 304503 172237 378991 132927 79322 -52653 -36952
12964 -36952 -30920 140133 -248944 2307 -79370 -167238 -231980 -195685 -7120 241409 473502
12953 473502 -5232 50570 -217805 50920 -53555 -14374 -138680 293733 180763 -101102 -82372
12942h2372M1179j46309M0270l2095A87501B5843a36807A99314h151k01436B27402
12930E7227j1898J2613a97445H6822B4669J52194P4405K54780a3549I4478B7233
12918B02086r456c74080c5041j32471J7054f7498k1866A80542o7096O0056J4069
12907A87571b79872d0527B4814J44666j83P8542p2640a12978B42447A00369R8041
12896A98410A869a91484o3577A24671a10990L7452f150l07254b6855k67427H5933
12884C7079i4026B11728R192b12707C656h1224E8327P3447A63c6309I8361J85860
12872B84221g808n7123D8028J19288p6729i1800C34308A2388Q1551J62771A15512
12860A48890b95418B11950L86097a54314i813j13889c3793F1066Q4d02132h8424
$$ plain form
12942 -82372 -41193 -187502 -147232 -179327 187501 25843 -136807 199314 -8151 -209587 227402
12930 57227 45329 57942 -197445 86822 24669 176863 251268 506048 -13549 94478 27233
12918 202086 192630 -374080 -35041 -167512 -150458 -67498 -89364 180542 113446 173502 187571
12907 187571 -279872 -40527 24814 169480 169297 247839 175199 -112978 242447 100369 198410
12896 198410 1869 -191484 -255061 124671 -110990 -73538 -6150 -313404 -26855 -294282 85933
12884 37079 -94026 211728 220920 -212707 3656 -81224 58327 131774 163 -36309 98361 284221
12872 284221 -7808 -64931 48028 167316 90587 -91800 334308 12388 93939 256710 115512
12860 148890 -295418 211950 598047 -154314 -9813 -123702 -33793 61066 61150 -402132 -88424
12848c5537J4314j80105I5653J40504f0724r1490D76256j00909c1744A06870J802
12837A08672j7485a72103B22557A04250L0164M5755a12465Q917k14980A48868
12826g5457o2811B08788a68069A8901b68077A96792i4513j22812A82164G5186
12815A87037J53866a86553D7767K54563i6047n5172b3058A61304F1994b7561O494
12804b1067B79999j3658A17680K9672a55757P5781l80744A04951m8894d12174
12793g130B02249a48825B07974q7617n1064d5128n300k04007o5238c3381A01389
12781c02487a02309A90310D5171J09810d33719E7399B0168c8943q1981K1343j51175
12770b50756F8007J52232b94630C33400a8250j93496a001A23095K60241b58199
$$ plain form
12848 -35537 -21223 -201328 95653 236157 -60724 -152214 476256 375347 -31744 106870 108672
12837 108672 91187 -172103 222557 104250 134414 180169 -112465 -103548 -318528 148868
12826 -75457 -138268 208788 -168069 18901 -268077 196792 -94513 -217325 182164 75186
12815 187037 340903 -186553 47767 302330 -96047 -151219 -23058 161304 61994 -27561 -21067
12804 -21067 279999 266341 117680 147352 -155757 -79976 -460720 104951 56057 -412174
12793 -7130 202249 -148825 207974 120357 69293 -45128 -50428 -254435 -319673 -33381 101389
12781 -302487 -102309 190310 45171 154981 -433719 57399 20168 -38943 -120924 -99581 -250756
12770 -250756 68007 220239 -294630 333400 -18250 -211746 -1001 123095 383336 -258199
12759H3967B4337a6758B32244i0260o5564B3165b5515A64970p7343b99218C1018
12747A45562C074P8308O8605J890a70424B2316K79929a70590A15413J25068a74409
12735C0723c4632C02209A6909K22122D2585b44659B83467g4681A79513h4427C87079
12723I2400R7857A0493J3494c8760A145R5108A1413d8325K0795A21401K29979
12712C51380n5357a18425B10555L2096J24417j55969m8124m0511M40191A32767
12701A82726J01199h9072G092g7707D63457b85752C61198d2153k1623I7065N2065
12690A49130F1025L05828j82418b9392B80250m5195q2583p3909M4593f7626K8864
12679c8762B47393G8544a02984B26067j10248b00380A37114c5305C4254A4911
$$ plain form
12759 83967 24337 -16758 232244 -90260 -155824 23165 -25515 164970 87627 -299218 31018
12747 145562 3074 81382 149987 151877 -170424 22316 302245 -170590 115413 240481 -174409
12735 30723 -34632 302209 16909 239031 42585 -244659 283467 -74681 179513 -84427 387079
12723 92400 190257 10493 23987 -38760 1145 96253 11413 -48325 -27530 121401 351380
12712 351380 296023 -118425 210555 242651 367068 211099 162975 122464 562655 132767
12701 182726 283925 -89072 7092 -77707 463457 -285752 361198 -42153 -63776 97065 149130
12690 149130 61025 366853 184435 -29392 280250 235055 152472 78563 123156 -67626 -38762
12679 -38762 247393 78544 -102984 226067 115819 -200380 137114 -35305 34254 14911
12668a33322C97341I5927J21455K2962H227i7960B46541O8j21511A8605a3885
12656B00545a61963A94812d5130n3017C27746i120A37154A0416N78991A34412
12645B3833N9033a06406C66187e3530A21604L88724k11956m2791G3821J8598b03947
12633D57103A37852b80897I6844a61952A57425J20839l5477j18777j5652J22121
12623B30479l7803P6971L33069A16520J43284j9040a03887d6818m3682L453G8149
12611A81725I676a16817E5581k3534K84828b08668e0030a7124d724C68783a81602
12599C4325K85369A49601b21986l7546F1510R0229F3783A5905b01132i8531C9702
12587b69610b1020B38249a3024q0199j01220A27719i2986J460j07351C36530A27971
$$ plain form
12668 -133322 397341 95927 217382 240344 8227 -97960 246541 246609 125098 18605 -13885
12656 200545 -161963 194812 -45130 -98147 327746 -9120 137154 10416 589407 134412
12645 23833 82866 -106406 366187 -53530 121604 510328 298372 255581 73821 92419 -203947
12633 457103 137852 -280897 96844 -161952 157425 278264 242787 124010 108358 230479
12623 230479 192676 269647 602716 116520 259804 240764 -103887 -46818 -90500 -87047 78149
12611 181725 9676 -116817 55581 32047 316875 -208668 -50030 -17124 -4724 368783 -181602
12599 34325 319694 149601 -221986 -259532 61510 151739 63783 15905 -201132 -98531 39702
12587 -269610 -21020 238249 -13024 -93223 -194443 127719 -92986 -91526 -198877 336530 127971
12575H1366A2412L04472a00037j558B9998h1710A79241c36523g5824B13632n70
12564B13062F7364j5911K02737b0646A36467b3274h506l31862A63089G9649d3342
12552A00657b73023E2137f3312a8488B2458a96661B73323c6857A72833B0692J65607
12541A86299a43771A71676K7392g6756I7771a44047k0796A3870R6158b9814j12488
12530a42302k977B04250b16399q92E6144f1410k8176F8170b37251a4713A15592
12518D77885a55109N2643J47c4020A79420b10532B4749J62137i5220m7361C1022
12506A28215K05168A54439F4318K24180C6209a84772b7497A39731a988G7119c26271
12494b72963A61791a84055B04274b48913d4874j21059k51542K01662J7573A50794
$$ plain form
12575 81366 12412 316884 -100037 -101595 29998 -81710 179241 -336523 -75824 213632 213062
12564 213062 67364 51453 254190 -20646 136467 -23274 -8506 -340368 163089 79649 -43342
12552 100657 -273023 52137 -63312 -18488 22458 -196661 273323 -36857 172833 20692 186299
12541 186299 -143771 171676 199068 -76756 97771 -144047 -164843 13870 110028 -29814 -142302
12530 -142302 -145279 204250 -216399 -217291 56144 -61410 -89586 68170 -237251 -14713 115592
12518 477885 -155109 -102466 -102319 -34020 179420 -210532 24749 186886 -95220 -142581 31022
12506 128215 333383 154439 64318 288498 36209 -184772 -27497 139731 -1988 77119 -326271
12494 -272963 161791 -184055 204274 -248913 -44874 -165933 -417475 -215813 -198240 150794
12483G9602O9414a06829p8087A38289a36284B71762C7334b5404j06881q1140j00587
12472c14012a07493r8849G6123K07622b9435j63284Q1150n8179A13556d1907C20171
12460c6799j67800h441A88445D0093a14273B3774J32209L736a09267K7545a8614
12448a4031A5496J31381h6199B00110K01716b38008O8283j00895A35248d5023
12437a06193A95853A5060e2755j79955G1452J7181c42253a17449M520I3343b79941
12425b46658J17846d0370B82394a24916A47612a35613B29815A2398a51859a6847
12414F4424B8309a76637H7659b8515k61983A14672b73277A0026L0563b13761C9947
12402a46456F956a93778C32096a21731A83946i665j06607A67421b76181c241q8790
$$ plain form
12483 79602 149016 -106829 -184916 138289 -136284 271762 37334 -25404 -132285 -213425 -314012
12472 -314012 -107493 -206342 76123 283745 -29435 -192719 -111569 -169748 113556 -41907 320171
12460 -36799 -204599 -8441 188445 40093 -114273 23774 155983 159719 -109267 -81722 -18614
12448 -14031 15496 146877 -86199 200110 401826 -238008 -169725 -270620 135248 -45023
12437 -106193 195853 15060 -52755 -232710 71452 88633 -342253 -117449 -112929 93343 -279941
12425 -246658 -128812 -40370 282394 -124916 147612 -135613 229815 12398 -151859 -16847
12414 64424 28309 -176637 87659 -28515 -290498 114672 -273277 10026 40589 -213761 39947
12402 -146456 6956 -193778 332096 -121731 183946 -9665 -116272 167421 -276181 -3241 -92031
12391i2031A19660f9927A1598M657N571J8105J04093a6319B44447P9417b02844
12379b76547A76368A1508e3342A17363J34949C1159f2201b2964k33770f4519F3661
12367B11911f1398F3976J07632b6841A22846j6042Q1731h5536I9795k1604N2876
12356A31067J1936a06936I9618a00544C06560d697I0729A3085J01182A2963P4319
12345H7282J3904K47521A59559k4784b71385A98355L205A375N9549f6703p8700
12334a45403a6738m7726l54131c9266A38030k539e13056I6518Q7733i122j97883
12323b07005F9038K8625P0242B4619a32204G4940J6561N1626m4663a57288A2099
12311a24079E6016M3669P2238A1236i2958j7717d1468B5137R0282m3329h9018
$$ plain form
12391 -92031 119660 -69927 11598 16255 21826 39931 144024 -16319 244447 323864 -202844
12379 -276547 176368 11508 -53342 117363 252312 31159 -62201 -22964 -256734 -64519 63661
12367 211911 -61398 63976 171608 -26841 122846 106804 188535 -85536 99795 78191 131067
12356 131067 143003 -106936 99618 -100544 306560 -4697 90729 13085 114267 12963 87282
12345 87282 101186 348707 159559 134775 -271385 198355 201560 1375 60924 -66703 -145403
12334 -145403 -16738 -64464 -418595 -39266 138030 135491 -513056 96518 184251 -9122 -207005
12323 -207005 69038 97663 167905 24619 -132204 74940 91501 143127 98464 -157288 12099
12311 -124079 56016 99685 171923 11236 -92958 -110675 -41468 25137 115419 72090 -89018
12299C39166a12822C12441o3267E0829b4345k8762c185C31046d528A57936p0481
12288H7455J69266l0427K0130l2596A005K15280J61109A44828c2293k3822A8494
12276i2903D01658A64749J03262K21174C6240a73916B91661a87196E1953J65764
12266B17717A9931J83307C3028k815a92933e0710G2157g2025B02041k0106a31830
12254g161l3178H6199f7675o0835H0578N29923G6673r083R8609D6471J15627J19535
12242B81633l042o1221M303I5997J69405L0228A32592m4169b8694a2223B87202
12230B98196k0737a806C82208G5637J7875M5062O268K09566F7025L42996r0903
12219C19118C4042M08466a06336A83837Q9998A19625J1085b6154l4130F5708c827
$$ plain form
12299 339166 -112822 312441 249174 50829 -24345 -53107 -3185 331046 -4528 157936 87455
12288 87455 256721 226294 246424 213828 1005 216285 377394 144828 -32293 -56115 18494
12276 -92903 401658 164749 268011 489185 36240 -173916 291661 -187196 51953 217717
12266 217717 19931 203238 33028 30213 -192933 -50710 72157 -72025 202041 181935 -131830
12254 -7161 -40339 86199 -67675 -128510 80578 610501 76673 67590 166199 46471 162098 281633
12242 281633 278591 217370 221673 95997 265402 295630 132592 88423 -28694 -12223 287202
12230 298196 277459 -1806 382208 75637 93512 138574 144842 354408 67025 410021 319118
12219 319118 34042 442508 -106336 183837 273835 119625 130710 -26154 -60284 65708 -3827
12207B82110q7766J9600o6504p1977L08667i7713F5581N1111K00214A18470C1896
12195B86465G2277a18184E0835N10231B67475D3836J68952K4924I8259a53630
12184b17316g9403q0540A37191J85417j14297a21380q3183A80062P478K17634
12174D05174a5836A22215A9787K48698b78129A37052N0663R2462b44729d6987
12163a08488B7776K7129L60687A35046P725K4531b55828A94834p1664j7587k8666
12152G6917K59972a20653D2026N49238A97922J26323f8363a1342r5996c2892B52255
12140A05826J56569I844b06449C28561H8824a36887c5602j44653A0340b4873q6173
12129a11046C8465K56358A15324k0160G080Q9231B3057J59285a9587E8481J23441
$$ plain form
12207 282110 194344 213944 147440 75463 384130 -97713 65581 116692 316906 118470 31896
12195 286465 72277 -118184 50835 561066 267475 43836 212788 237712 98259 -153630
12184 -217316 -79403 -159943 137191 322608 208311 -121380 -204563 180062 187540 405174
12174 405174 -15836 122215 19787 268485 -278129 137052 187715 280177 -244729 -46987
12163 -108488 27776 54905 415592 135046 142771 167302 -255828 194834 123170 105583 76917
12152 76917 336889 -120653 42026 591264 197922 324245 -68363 -11342 -107338 -32892 252255
12140 105826 262395 9844 -206449 328561 88824 -136887 -35602 -180255 10340 -24873 -111046
12129 -111046 38465 294823 115324 95164 7080 96311 23057 182342 -19587 58481 181922
12118A81922b02981C59553a46445L0670C14165a1620p3963A90217M8568r6833
12108A41952b78804a8924A23144k3492M3272c4377C4134c62422A14218J57138
12098B71356b3753k30833A71338e5189B13203a31322A43847d9668F6053c4037
12087H961a85589e3168k04228f2267B39931k6009l32L7892m9191M39939R10020
12076A552250n2620C19720E6764K7595J3881p593F966c1500n7546B1171a91409
12064B0121f8166D7974f3309A95466F5652k874P7284g4867L0501B52426a77782
12052a23103d7733F0487b5785E19974B03760i6491B50842G656a03726e1805B26936
12040a30486N1061n8834c7477B16799J18713H6707B6350a11989A3980Q6103a64416
$$ plain form
12118 181922 -202981 359553 -146445 -115775 314165 -11620 -85583 190217 238785 141952
12108 141952 -278804 -18924 123144 99652 142924 -34377 34134 -362422 114218 271356
12098 271356 -23753 -254586 171338 -55189 213203 -131322 143847 -49668 66053 -34037
12087 8961 -185589 -53168 -257396 -62267 239931 213922 213590 251482 202291 642230 1552250
12076 1552250 1499630 319720 56764 84359 98240 90647 6966 -31500 -89046 21171 -191409
12064 20121 -68166 47974 -63309 195466 65652 62778 140062 -74867 -44366 252426 -177782
12052 -123103 -47733 60487 -25785 519974 203760 -96491 250842 7656 -103726 -51805 226936
12040 -130486 -79425 -138259 -37477 216799 335512 86707 26350 -111989 13980 100083 -164416
12028a02805B64852F8268e5782k20517D2526j8474e24187E56196a99861A16482
12017b88056A36011c7543C7380i2068A09788a74870F4908K3847f4176A34716b50202
12005g27j1960D5361r765K8128a5301j1524j26613D7046a34633A12571R7013J53197
11993C62781H1455a50140A62563a5340k77722D27294e4523K4989l270J6250A0012
11981B63299g3306N317F6425J92141A18334J0209L8338K7791p4273a15075B21867
11969b0666R536A40243e2478C03231k0095A35394b22696j12474a41852B16522
11958A68998c21692l9475J7031b5347K716I5164l8757K15975o9491d6089j22132
11947a68221A25831b07135D66326D595d8097A046h8342E2743c5905C97928I0778
$$ plain form
12028 -102805 264852 68268 -55782 -276299 42526 24052 -524187 556196 -199861 116482
12017 -288056 136011 -37543 37380 -92068 109788 -174870 64908 88755 -64176 134716 -250202
12005 -727 -12687 45361 35596 63724 -15301 -26825 -153438 47046 -134633 112571 209584 362781
11993 362781 81455 -150140 162563 -15340 -293062 427294 -54523 -29534 -32804 -16554 10012
11981 263299 -73306 -67989 66425 258566 118334 128543 166881 194672 120399 -115075 221867
11969 -20666 -11130 140243 -52478 303231 283136 135394 -222696 -335170 -141852 216522
11958 168998 -321692 -361167 -344136 -25347 -22631 95164 56407 272382 202891 -46089 -168221
11947 -168221 125831 -207135 466326 4595 -48097 1046 -88342 52743 -35905 397928 90778
11935a29265A32432a0487j35071n9849C64546a58646B42857g4944j5182A31b93962
11923E7064J93119e8278j42846A29408a73782A35191J11795c4867k63589F5018
11912g1878m03056D3702P6609d99206D2217L5918M9862a02258B54533a46263E3842
11900d2024n476J7408A8426a64178a6448j13250p1108I6934J22221a36163A6139
11888d11445a60290H1137C5830N0314i3272A21299a65145j6424a0479r270A36070
11876f46270e9042b2485A97635j9061c2046k59047J40143A70980c66652I4219
11865D8556a06493j81871E6223A2162d2995C75221a88732b0725B69641n791c67314
11853A98933C1743d5975k23998N3257A29202g3703j5594j344A27540m8487N679
$$ plain form
11935 -129265 132432 -10487 -145558 -205407 364546 -158646 242857 -74944 -90126 131 -293962
11923 57064 250183 -58278 -201124 129408 -173782 135191 246986 -34867 -298456 65018
11912 -71878 -474934 43702 120311 -499206 42217 78135 127997 -102258 254533 -146263 53842
11900 -42024 -47500 -30092 18426 -164178 -16448 -129698 -200806 96934 219155 -136163 16139
11888 -411445 -160290 81137 35830 86144 -93272 121299 -165145 -181569 -10479 -19749 136070
11876 -646270 -59042 -22485 197635 178574 -32046 -291093 -150950 170980 -366652 94219
11865 48556 -106493 -288364 56223 12162 -42995 375221 -188732 -20725 269641 263850 -367314
11853 198933 31743 -45975 -269973 -216716 129202 -73703 -89297 -90641 127540 79053 84732
11842H4732k2319c9605r6823A52869e5896I3471K77903a1362A35076i9168j0373
11831a09541L0691A28370L5414G0015N847e436p2092B91443a49628C25381l8285
11820B87096A7680b22537P0597E1259J05691J22065C3061g2656B1325r489a0739
11808A15661C8642J25287C2024e8540n1107L8306j07800N4841l0287A9067a74999
11796I8152P5030A0630b36610n9368A84482a95065A07713L2342A4147J97877n095
11785B06929a48064C2906b24938B07770b45229A75376J59048b60514B30884c4740
11774B1644M0292L2817k5086R9831a06955j94730J21060E5983k5365R1263a06112
11762B563d64540a06662k71510f4173k300I6344b7435J0223B45840a22161M047
$$ plain form
11842 84732 62413 -39605 -136428 152869 -55896 93471 371374 -11362 135076 -99168 -109541
11831 -109541 -78850 128370 163784 70015 75862 -5436 -77528 291443 -149628 325381 287096
11820 287096 17680 -222537 -151940 51259 156950 279015 33061 -72656 21325 11836 -10739
11808 115661 38642 163929 32024 -58540 -109647 -71341 -179141 -124300 -154587 19067 -174999
11796 98152 173182 10630 -236610 -295978 184482 -195065 107713 140055 14147 212024 206929
11785 206929 -148064 32906 -224938 207770 -245229 175376 334424 -260514 230884 -34740
11774 21644 61936 94753 69667 169498 -106955 -301685 -180625 55983 30618 121881 -106112
11762 2563 -464540 -106662 -378172 -64173 -66473 96344 -27435 -17212 245840 -122161 -118114
11751a18114B6848b93490C53269c0598k7362j21603O4642J1120d4771j78344A93568
11739B1576K07077h3238C67655E3956L5074b7049H7770b15600A35803D8882h5573
11727g6662A1591J80112i2243h136B96085p2399q6377D2298M1806P2205f3163
11715a1776A46527k0342L45573A20467e0640n8075B32035d5940B65848j8644C1234
11703B5485K75863F1533L9941n337K7256K0498n1542a28823C21487j45904J83362
11692C58945G5453b52460C48004A13345B4441K63249B9602R7869b06953c906k0938
11681b4844A68676i3926A52837n4690J52069h1327B54853F0643b5511A09828e6851
11669A75533p3885C4650a27971K6533D6618J47924b55397J5083j00217J29776
$$ plain form
11751 -118114 26848 -293490 353269 -30598 -57960 -179563 -114921 -103801 -44771 -223115 193568
11739 21576 228653 -83238 367655 53956 89030 -27049 87770 -215600 135803 48882 -85573
11727 -76662 11591 191703 -92243 -8136 296085 223686 137309 42298 84104 156309 -63163
11715 -11776 146527 126185 471758 120467 -50640 -108715 232035 -45940 265848 247204 31234
11703 25485 301348 61533 101474 96137 123393 143891 92349 -128823 321487 175583 358945
11692 358945 75453 -252460 348004 113345 24441 287690 29602 127471 -206953 -3906 -24844
11681 -24844 168676 -93926 152837 98147 250216 -81327 254853 60643 -25511 109828 -56851
11669 175533 101648 34650 -127971 -101438 46618 194542 -255397 -240314 -340531 -210755
11659b10755i6004F7807L6182L05445O183c2734a3063r001o3533l7452J5303r4715
11647b02461L5736b5846m1473D6029J48385c32064B7963c8848d040A79003J22755
11636C01758I4301K17445A2525h3103j5892c5462G1064J35008j2782a34525D80748
11624i2790B85903b10263K3260H3954C323K26952M2916m7395b65862G521e753
11612A68438i7392H0747L1020R0564b20155d0660n0045K7100B12077c2610k1153
11601e3763B56108A02298J93694a53765A11898j6539b36484B8939G954f0941A29051
11589h1847B0597M1351B6302b6265D8428M3366h654E2322d0460B39047q3714E1520
11576b15119B07189F5910K19187A09978a0847I4610c30520A92034G2843m654M14613
$$ plain form
11659 -210755 -96004 67807 103989 409434 415617 -32734 -13063 -22064 -85597 -123049 -107746 -202461
11647 -202461 -166725 -25846 -67319 46029 194414 -332064 27963 -38848 -4040 179003 301758
11636 301758 94301 311746 12525 -83103 -98995 -35462 71064 206072 193290 -134525 480748
11624 -92790 285903 -210263 -187003 83954 3323 230275 273191 225796 -265862 7521 -5753
11612 168438 -97392 80747 111767 202331 -220155 -40660 -90705 -63605 212077 -32610 -53763
11601 -53763 256108 102298 295992 -153765 111898 95359 -236484 28939 7954 -60941 129051
11589 -81847 20597 61948 26302 -26265 48428 91794 -8654 52322 -40460 239047 155333 51520
11576 -215119 207189 65910 285097 109978 -10847 94610 -330520 192034 72843 68189 482802
11565D82802K29355C40589h9915a5382l0350C63258e4229D6501b9058B63848C2012
11553i1748c1441B43520g3071b1769A22948a31765A89481b33037A03607a23625
11542b3194k07129D06566d0737A96793E943M07332A670M84609A01341J28792J71904
11531D02037e0272A26955A8346R1625K21405n3213P3486j19507P7130j26565k0743
11520A61964a48156B9814Q0837j9336K7545b03064C13014A17789K03469j31077
11510A90181H1380M01324a60565C77578D0109J23255C3921K73431b5432F9743
11499d7819r4503O3542A54362O4939H4811J20717N1754m3252C3485Q2522J92291
11488C08298D2088J78272J43980A52000o9986K08947r4897L8551L60661A64684
$$ plain form
11565 482802 712157 340589 -89915 -15382 -45732 363258 -54229 46501 -29058 263848 32012
11553 -91748 -31441 243520 -73071 -21769 122948 -131765 189481 -233037 103607 -123625
11542 -23194 -230323 406566 -40737 196793 5943 413275 1670 486279 101341 230133 402037
11531 402037 -50272 126955 18346 109971 331376 278163 351649 232142 309272 182707 161964
11520 161964 -148156 29814 110651 91315 118860 -203064 313014 117789 321258 190181
11510 190181 81380 482704 -160565 377578 40109 163364 33921 307352 -25432 69743
11499 -47819 -142322 -78780 154362 219301 84811 205528 257282 214030 33485 116007 308298
11488 308298 42088 220360 364340 152000 82014 290961 196064 234615 595276 164684
11477D61567j38987A38451j6978e6620E17672B0668i4831D6328j972J06320Q9234
11466B39910h9743l15293B74835m9164a1792j24885B97569a48073F7658c75334
11455B03278F2727g2019p8655A62118h4301f661r0049A79652C9180J46834C3875
11443A22127f0365j35823C590J84427b09560A00308R27n0594K8310j0362e1548
11431a76900H8198L09140E1990K9467c056j69660F1031b53166G3047c0797B19951
11419A60633h3200j72122i4273D4825L3484d0394A21812b53420a26591C91499
11408B34501I5465J53125g911D5918J65255h3546A17703b43404A38112l2886N691
11397A10917c05155C3433J12554b198j17707p5450A88976b13476A49158b82395
$$ plain form
11477 461567 322580 138451 121473 -56620 517672 20668 -94831 46328 44356 150676 239910
11466 239910 -89743 -405036 274835 225671 -11792 -136677 297569 -148073 67658 -375334
11455 203278 62727 -72019 -150674 162118 -84301 -6661 -96710 179652 39180 186014 33875
11443 122127 -60365 -196188 3590 188017 -209560 100308 101235 50641 78951 68589 -51548
11431 -176900 88198 397338 51990 81457 -3056 -172716 61031 -253166 73047 -30797 219951
11419 160633 -83200 -255322 -94273 44825 78309 -40394 121812 -253420 -126591 391499
11408 234501 95465 248590 -7911 45918 211173 -83546 117703 -243404 138112 105226 110917
11397 110917 -305155 33433 145987 -2198 -119905 -195355 188976 -213476 149158 -282395
11386b6505k30403j0866r281a4161B733J62944f5256A23867c6413G091b98703
11374F7228a24291j22790o4075a27920H4307f8208j32877C46144A28677d5808
11363C27799j62453a05317d6448j19175A16350a18409j09103a02099K7025B34228
11352c17340o9256G5522d2425A10627l0204K93778C1508J8342a0030E7548h4757
11340c60635N3339A93386D8722a60270p5498H4715h2207H6919a64247D9286F159
11328b02079J4364L8158A62858l2711c90726P9764J53375B9621K667J28030o2376
11317I7942d6414k5431B81671a28155a3326k07397C35451f3654j88144D9603b96974
11305a2765j93307C0324a6645E829Q574J55320d8698A44206a91694G9165b31590
$$ plain form
11386 -26505 -256908 -267774 -277055 -14161 2733 165677 -65256 123867 -36413 7091 -298703
11374 67228 -124291 -247081 -311156 -127920 84307 -68208 -201085 346144 128677 -45808
11363 327799 165346 -105317 -46448 -165623 116350 -118409 -227512 -102099 -75074 234228
11352 -317340 -386596 75522 -42425 110627 80423 374201 31508 49850 -10030 57548 -84757
11340 -360635 -307296 193386 48722 -160270 -235768 84715 -82207 86919 -164247 49286 6159
11328 -202079 -187715 -149557 162858 130147 -390726 -310962 -157587 29621 32288 160318 97942
11317 97942 -46414 -71845 281671 -128155 -13326 -220723 335451 -63654 -251798 49603 -296974
11305 -12765 -206072 30324 -16645 5829 14403 169723 -48698 144206 -191694 79165 -231590
11293E7168g1931B09008a58332K1914M2888a1446l74898h9615F9869P4493a23288
11281A57923b25827J02181L9325a915I294N0526b71624F1943a91397B6041a1046
11269B39205p8520J31147b05049k04588j14011b162A18415J36719f2201p1147
11259a33348k8404e4001q0649A66153b47451D634a48206E2023B1116a73311B3377
11247G0190a53037d1794k24947A71946a74917I0726P3990a64781A12328J46558
11237B58886a39112p7653A5649b06814l6295F1681d63143f8508b4910j2947C6759
11225c2017l5368q7833B13734a27275f3054n749B46397a86619i2568E2377L6727
11214H9104m2074r598K09038a97413C2870a0745p2201B22052c98820J09514A94783
$$ plain form
11293 57168 -71931 209008 -158332 -136418 -93530 -11446 -386344 -89615 69869 144362 -123288
11281 157923 -225827 -123646 -84321 -1915 9294 59820 -271624 61943 -191397 26041 -11046
11269 239205 160685 291832 -205049 -409637 -523648 -2162 118415 255134 -62201 -133348
11259 -133348 -161752 -54001 -134650 166153 -247451 4634 -148206 52023 21116 -173311 23377
11247 70190 -153037 -41794 -266741 171946 -174917 90726 164716 -164781 112328 258886
11237 258886 -139112 -216765 15649 -206814 -243109 61681 -463143 -68508 -24910 -37857 36759
11225 -32017 -67385 -155218 213734 -127275 -63054 -68803 246397 -186619 -92568 52377 89104
11214 89104 47030 37432 246470 -197413 32870 -10745 -82946 222052 -398820 -289306 194783
11202e3426A90379k4938K90565c4501j39460A50060n2560g2475l1542L1929A8116
11190B56453a59238B32294a82106D8981J22118e2304a9552B5007K8397c38872
11179b54617C97483b31526E5885B5740g7886j7754j25090f0912A29410b24565
11168h0868A77959B0488e758m36897h6071d0716j83218c8059l095k37246A02049
11156a37448j01662n9963a5346n703p7648B47796d1534g913A55206a23000a3863
11144C9828g4906B7978a85229G7289a43799B10131D885J01945C4568J03711b1581
11132d2279C60053I947K28851e30501a02430a9961j09846C83785b3516L907B06450
11120B57033Q0985g9281A7432J8786P7201b2489D427K54118a64004G7352o735
$$ plain form
11202 -53426 190379 165441 456006 -34501 -173961 150060 97500 -72475 -104017 -72088 18116
11190 256453 -159238 232294 -182106 48981 171099 -52304 -19552 25007 53404 -338872
11179 -254617 397483 -231526 55885 25740 -77886 -95640 -220730 -60912 129410 -224565
11168 -80868 177959 20488 -5758 -442655 -86071 -40716 -223934 -38059 -41154 -278400 102049
11156 -137448 -239110 -299073 -15346 -21049 -98697 247796 -41534 -7913 155206 -123000 -13863
11144 39828 -74906 27978 -185229 77289 -143799 210131 4885 106830 34568 138279 -21581
11132 -42279 360053 9947 238798 -530501 -102430 -19961 -129807 383785 -23516 -19609 206450
11120 257033 338018 -79281 17432 36218 113419 -22489 4427 258545 -164004 77352 70617
11109G0617J31403A8108K3784J21705J35768a13691B11236j00332K06857c6651
11098D02224m6372j56793q0811K10407j3078D0488J54545K9863K27746o101A76251
11086B94038A34547J66047N8700l216A29937J22981l4868J76677l8555d4315C54222
11074E23529A58166J62464j23678O8754K53868j64536n7284e0499I13636m26991
11064D86645n7554A78931J28458J30496n5671n1722K61543j82387N26277l34984
11054F00941J76653K7801J03136m03025J78134p2855M38453l92499k23087L23033
11044G56685q8231o739j98352J00568q968J83315J14490o2987L5842B20974N20596
11033G41570K91177D00307M30710m6507K75835D89361M32801P529Q4317l99688
$$ plain form
11109 70617 202020 18108 41892 163597 299365 -113691 211236 110904 317761 -36651
11098 402224 355852 199059 118248 328655 315577 40488 195033 224896 452642 446541 176251
11086 294038 134547 300594 359294 356078 129937 252918 218050 394727 356172 -44315 354222
11074 523529 158166 320630 196952 265706 519574 355038 297754 -50499 913636 486645
11064 486645 429091 178931 307389 437885 382214 330492 592035 409648 935925 600941
11054 600941 777594 805395 908531 505506 683640 610785 1049238 656739 433652 756685
11044 756685 668454 661715 463363 563931 554963 738278 852768 789781 825623 220974 741570
11033 741570 1032747 400307 831017 784510 1060345 489361 922162 929691 1014008 614320
11023F14320M36544m49932K95837k59828n4999K694L13553j85502C56070K69158
11013F25228J27927r6843M611k72912J60956J74273j22663J09907O632o1111k14019
11002D41986J01712P8174L29088k14555j43490J31911j1708L24071l57240p7416
10992F02533K26831o1409J37715q2264q3134l7193M71182l10623j37161K89852
10982A016329l0586M51210j16522J05057M7855m312L46459P19075j64983K06261
10972B575843N544K83445k99035j20332J5462l77594q4632l38162J32701l89797
10962A403443J75287j68266Q3551L89333k05172K6449L47507P4047l29769R506
10952A805916k71026o11359P4508o3736K9785k00638l00491K79794k23364J49151
$$ plain form
11023 614320 1050864 600932 896769 636941 581942 584636 898189 712687 356070 625228
11013 625228 753155 656312 660923 388011 548967 723240 600577 710484 717116 656005 441986
11002 441986 543698 621872 950960 736405 592915 724826 713118 1037189 679949 602533
10992 602533 829364 767955 905670 823406 740272 703079 1174261 863638 726477 1016329
10982 1016329 985743 1436953 1320431 1425488 1473343 1469031 1815490 2534565 2369582 2575843
10972 2575843 2581387 2864832 2565797 2445465 2460927 2083333 1998701 1660539 1793240 1403443
10962 1403443 1578730 1410464 1494015 1883348 1678176 1704625 2052132 2126179 1796410 1805916
10952 1805916 1534890 923531 998039 934303 964088 763450 462959 742753 519389 668540
10942F68540k59942D2645L87236k3938I6031J18900e7087K3026D1264a06834F75
10930A49836m6212O2738J2863e456B296J39581a37356c8371A6920i4275j81131
10919b75406B8856P2569a62563m911o5336k37173B51739a18809l2008a3092C2018
10907e7407B9784L7416a24227O1402B7379g9682F2739n979a51833B28227m7225
10896A81002b63273e9637D4562O5152d84947A57170E6791k7272M5116A215a2846
10884D36384C9807a00839B8982c7061B98662a46047H028h2703D5729a4764A06252
10872b3891j23029C32361a61269c3115B30357e9514E6921c33331d9067B08980
10861A22037D9146K43323j13634a58034q626j70398b7589q0842k85760B24773
$$ plain form
10942 668540 408598 42645 429881 405943 96031 214931 -57087 -34061 41264 -106834 675
10930 149836 103624 166362 179225 -5456 2296 141877 -137356 -38371 16920 -94275 -275406
10919 -275406 28856 101425 -162563 -167474 -232810 -469983 251739 -118809 -150817 -13092 32018
10907 -57407 29784 67200 -124227 -62825 27379 -79682 62739 56760 -151833 228227 181002
10896 181002 -263273 -59637 44562 109714 -484947 157170 56791 29519 74635 1215 -12846
10884 436384 39807 -100839 28982 -37061 298662 -146047 8028 -82703 45729 -14764 106252
10872 -23891 -146920 332361 -161269 -33115 230357 -59514 56921 -333331 -49067 208980
10861 122037 49146 292469 178835 -158034 -166660 -337058 -27589 -108431 -394191 224773
10850b2219A46890K0330p5576P8532m5450g065H2P5714J88945o6122I8773K3224
10838A21997b90474J13372b3796j68390n8688B47135a85185A54868a61209H3114
10827C10335b17785k3137i1536B8780a98239D2162M6150e11k16788j3644g5520
10815E7476K57280c50902B29920A8303f8064m0988f985D351c33792P6980B32785
10803b28853A17256J27694a15934B4661b82931J07445C20993c2937q6679n6337
10793a75953A55609N1740a06348G3578b8520G7287a40255f7256A47596c2755k2250
10782e5005B02409b34407o0184A04855c32022b1651j38211I0058J46673g5607
10771a38815j46308i6465A55418a23032r754k15476J54844c4114m3332l3690B9792
$$ plain form
10850 -22219 146890 167220 91644 170176 124726 -7065 82 75796 264741 198619 98773 121997
10838 121997 -290474 -177102 -23796 -192186 -250874 247135 -185185 154868 -161209 83114
10827 310335 -217785 -240922 -91536 28780 -198239 42162 88312 -511 -217299 -230943 -75520
10815 57476 314756 -350902 229920 18303 -68064 -109052 -6985 4351 -333792 -256812 232785
10803 -228853 117256 244950 -115934 24661 -282931 -175486 320993 -32937 -119616 -175953
10793 -175953 155609 207349 -106348 73578 -28520 77287 -140255 -67256 147596 -32755 -55005
10782 -55005 202409 -234407 -294591 104855 -332022 -21651 -159862 90058 236731 -75607
10771 -138815 -285123 -96465 155418 -123032 -132786 -348262 -193418 -34114 -77446 -111136 29792
10759B03924A9889L96150c6k8108k85490n8189a15135a1594n830C5823M8837e8142
10746B45461a69002A11940d2277A92425G7683a57927f0370A23611b69213a07547
10735B59933f0550j45465M4154A79234e7957C78956P6331b25249B6548a28307
10724F0073a30844C1465P0309Q0264a60017b6949B72361h6743d1881G7336a4611
10712G3687c36032f0575E2527L8530c36804B0672Q5626c1225B24386I439K71394
10701B80833H7830A5349b94947J11569I9014i3251n8759B3697K9940a61728E4476
10689c30144D5277a95741c0024j12873l1394B4540J73653h4729j8780H3242a68241
10677a0048A22169a73792L4449j30058B56095n8971a30186n7225j08251N8451
$$ plain form
10759 203924 19889 416039 -36 -28144 -313634 -371823 -115135 -11594 -17424 35823 84660 -58142
10746 245461 -169002 111940 -42277 192425 77683 -157927 -60370 123611 -269213 -107547
10735 259933 -60550 -206015 -161861 179234 -57957 378956 455287 -225249 26548 -128307
10724 60073 -130844 31465 101774 182038 -160017 -26949 272361 -86743 -41881 77336 -14611
10712 73687 -336032 -60575 52527 91057 -336804 20672 106298 -31225 224386 9439 280833
10701 280833 87830 15349 -294947 -183378 99014 -93251 -152010 23697 53637 -161728 54476
10689 -330144 45277 -195741 -30024 -142897 -174291 24540 198193 -84729 -103509 83242 -168241
10677 -10048 122169 -173792 -139343 -269401 256095 197124 -130186 -187411 -295662 -237211
10667b37211h587k21597M5133J0040f4163A48462a83702J5305f793l2486A7051
10655C39558a29924l909b8895r6679A53763o3397R2579a62014p3778A95913a87339
10643d3224j93698B04104e5854j93996C07616c4819k06927e5805k07640g632k55527
10632b63159h827G9229b94196f1493D2642e9659l03754B66380c98051a00698j77575
10621b78273A72221a11763a341q8479j54153A01654d1484j15764k22631i6654
10610a0261k09317B4501a10670A72960h9261B06299f2036n3312N1781j3809l08236
10599c85612a11411A07060i0485p2427L7796N2665j01707M6549n4645j130k8687
10588b12071D8390b21508g5043H3697i2152A08586O8641b56440C22884b44177
$$ plain form
10667 -237211 -8587 -230184 -185051 -175011 -64163 148462 -183702 -168397 -6793 -39279 17051
10655 339558 -129924 -133833 -28895 -125574 153763 90366 182945 -162014 -235792 195913 -187339
10643 -43224 -236922 204104 -55854 -249850 307616 -34819 -241746 -55805 -263445 -7632 -263159
10632 -263159 -8827 79229 -294196 -61493 42642 -59659 -363413 266380 -398051 -100698 -278273
10621 -278273 172221 -111763 -1341 -89820 -243973 101654 -41484 -157248 -379879 -96654
10610 -10261 -219578 24501 -110670 172960 -89261 206299 -62036 -115348 -63567 -77376 -385612
10599 -385612 -111411 107060 -90485 -162912 -125116 -72451 -174158 -127609 -182254 -183384 -212071
10588 -212071 48390 -221508 -75043 83697 -92152 108586 177227 -256440 322884 -244177
10577E901P7504L00295D9296e993G2666N596K21058A05619a2478j96477l0569
10566b39524D324a07980d7769j88662g8312n7275b8760k4229R87j7088o8815j70863
10554c08768d2148A92683o6175a08436n3300C20363d5675A43547d03800g3544
10543a98056L5004K583A26273j6916a83412a451k72964L9947d9186A52808a17519
10531A3840L9881b27494A22364g9474r8H2512b21495F7270K7297d4360E1458g782
10518c40464e5637p4973L1039j39649B32826I3379a69717I6990j9776b09707B95095
10506A46348f63656c2452o4112I3781K12470I1923l8549a47421B3692J74619I2444
10494A85413h1713k72439A3509b27826g567l3311p1719B39915K2808Q2284A34371
$$ plain form
10577 5901 83405 383700 49296 -5993 72666 78262 299320 105619 -12478 -208955 -239524
10566 -239524 4324 -107980 -47769 -236431 -78312 -135587 -28760 -52989 -52002 -69090 -137905 -308768
10554 -308768 -42148 192683 126508 -108436 -161736 320363 -45675 143547 -403800 -73544
10543 -198056 -163052 -160469 126273 109357 -183412 -1451 -274415 -234468 -49186 152808 -117519
10531 13840 53721 -227494 122364 -79474 -79572 82512 -221495 67270 94567 -44360 51458 -7782
10518 -340464 -55637 -130610 -99571 -239220 232826 93379 -169717 96990 77214 -209707 295095
10506 146348 -663656 -32452 -96564 93781 306251 91923 53374 -147421 23692 198311 92444
10494 185413 -81713 -354152 13509 -227826 -7567 -40878 -112597 239915 262723 345007 134371
10482A15475K30045K18673N8078k56941K1303j84311r3369J9824A934R8617b19470
10470D74948C5293K29265A06652a42847A75284a72199I2602b84343A20551E0431
10459A34275h6495r1546A15572a84675Q7028K0774k90865J45000B12779a42257
10448a65922B60523B7912R279P1819f1833K9551A76065k4599a36363L583d5793
10436a32489A22106a07192a5078B50955a14252f137D3029a19165b5018m53940
10426d78958A40727a74371C58050n221a3465A19812B9758N240b75560B9754J20293
10415A50047D0596a37817A84878F2701a1752m02676a46120a2576B11849c59798
10404f1150j5691B18334q7038b639A10191b82422B79973d5295A13151J83518J00020
$$ plain form
10482 115475 345520 564193 622271 365330 386633 202322 108953 128777 1934 100551 -219470
10470 474948 35293 264558 106652 -142847 175284 -172199 92602 -284343 120551 50431
10459 134275 -86495 -178041 115572 -184675 -97647 -76873 -367738 -222738 212779 -142257
10448 -165922 260523 27912 37191 109010 -61833 -32282 176065 151466 -136363 -132780 -45793
10436 -132489 122106 -107192 -15078 250955 -114252 -6137 43029 -119165 -25018 -478958
10426 -478958 140727 -174371 358050 352829 -13465 119812 29758 34998 -275560 29754 150047
10415 150047 40596 -137817 184878 62701 -11752 -414428 -146120 -12576 211849 -359798
10404 -61150 -76841 218334 131296 -2639 110191 -282422 279973 -45295 113151 296669 396689
10393C96689c96788A37552A0991K63861j07687l7243d26265D43812a03411B99417
10382C20108b40522f4745B37400H0207K1602L77609j35895B9394J65938L95641
10372E90973I4795J65564J9691O2207I0134L94358M13149B19350K61737A58673
10361D0860J59002R3773J11429M3965k20341q8045M9791K99891A92166l1632J72438
10350C32972K74443p5278a11024H1996O92399l30334J48033j12405B18945A04482
10339C04144I1153Q3903m9741O1824B0200J38335r403Q310c2618l8023n4446E2341
10326A24572f1846F59375A24032J20956E4238J80082a21315L562A35570N0910
10316A86480k3416n2357K72118j27005a92654g0756K4091j88577B81065D4650
$$ plain form
10393 396689 -396788 137552 10991 274852 167165 129922 -426265 443812 -103411 299417
10382 320108 -240522 -64745 237400 80207 101809 479418 343523 29394 195332 590973
10372 590973 94795 260359 280050 342257 90134 484492 897641 219350 481087 158673
10361 40860 199862 293635 405064 449029 228688 140643 190434 490325 192166 160534 332972
10350 332972 607415 532137 -111024 81996 774395 444061 592094 479689 218945 104482
10339 304144 91153 175056 125315 187139 20200 158535 149132 157442 -32618 -70641 -125087 52341
10326 124572 -61846 659375 124032 244988 54238 234320 -121315 -117753 135570 186480
10316 186480 163064 110707 382825 255820 -192654 -70756 -46665 -235242 281065 44650
10305f7333j72963b0320m2203B92329F5337c44854A67091M974a93836A0141M8513
10294E8654i6439k24659a25256B3324K53738A0079L3369c38648a19995J0926I284
10282E6709J21690E4899g3529k24414J15435C26367j62749a90739B5295J67432
10272A92727J04122A21524b45235a3758B49600B3924L4651M87333A41691h9623
10261B95754i27C32216A50147a51106a6164C9258b920p0327R604A26883a97220
10249A00386g2485l66055J87924F5145b92854A52871k55b89076A7724a13183a2127
10237g2581K9027j97609a18950E6193J28634a12188j17086d6896F5392N638a27280
10225a67015O9061o7430r1314J21176B7909a37124j25472C2806b08163A78815
$$ plain form
10305 -67333 -240296 -20320 -62523 292329 65337 -344854 167091 172065 -193836 10141 58654
10294 58654 -96439 -321098 -125256 23324 277062 10079 43448 -338648 -119995 -109069 9284
10282 56709 178399 54899 -73529 -297943 -182508 326367 163618 -190739 25295 192727
10272 192727 296849 121524 -245235 -13758 249600 23924 58575 545908 141691 -89623
10261 295754 -927 332216 150147 -151106 -16164 39258 -2920 -73247 -63643 126883 -197220
10249 100386 -72485 -438540 -250616 65145 -292854 152871 152616 -289076 17724 -113183 -12127
10237 -72581 -43554 -241163 -118950 56193 184827 -112188 -229274 -46896 65392 71030 -127280
10225 -167015 -97954 -165384 -256698 -135522 27909 -137124 -262596 32806 -208163 178815
10214C3163c88087A34403b72403J21389F2548J41797a70601N4501L1801A71500
10203a19615E8072N9416l011c4547A21689a32903H1030J1066J33064b23136L3791
10192a89345F0806a39381j67259b0519l21008L7145B13799j8762b50152M7641
10182b02511E8258a31253j28757A8143L2954a60397E8025b08690a4990E9285c20144
10170B65123F2362b74037J09088L2353b0119A16343b20624r7292a25750r1838
10160b17588J5173b5701I2603D5033d3190B071b27931A13815m1475c1787B57762
10148A38321j8773E5157d3930m0090l1623C8388K9739O2973O1682H569e2291j54175
10136b06466Q98R4666F7763b85311O3734F70J00011B5102L1265a20626B69351
$$ plain form
10214 33163 -388087 134403 -272403 -151014 62548 204345 -170601 -116100 -84299 171500
10203 -119615 58072 117488 114477 -34547 121689 -132903 81030 92096 225160 -223136 -189345
10192 -189345 60806 -139381 -306640 -20519 -341527 -304382 213799 195037 -250152 -202511
10182 -202511 58258 -131253 -260010 18143 51097 -160397 58025 -208690 -14990 59285 -320144
10170 265123 62362 -274037 -164949 -132596 -20119 116343 -220624 -317916 -125750 -217588
10160 -217588 -202415 -25701 92603 45033 -43190 2071 -227931 113815 72340 -31787 257762
10148 138321 119548 55157 -43930 -84020 -115643 38388 68127 131100 192782 8569 -52291 -206466
10136 -206466 -205568 -110902 67763 -285311 -221577 670 100681 25102 56367 -120626 269351
10124F2745a16060B29662a09091J3089k52058J27526I0384L608Q0669b74614j9256
10113b93870J04016I0400a47702A24947g5151I3079J39896F3703h7022j9993E0458
10101h7766B7305M6329B3534K6415b03250R4501a197l51724F0671B2794K61313
10090B84107b13173G508b27003B09239H7644f2573B62340c27475J24449b4449
10079d15333f9614L4465j28453D4349a09318M5112j51310H7637c21022g9700m17725
10068d97425m9538G1888c8724D0552i9077M2791A38322b00814B32468G7515a24245
10056i8031A5180c76443A665N0335b10842R4406p9060n6111d2107E7699b59351
10044E0082c20601a48477m4215N5875c0949o1394k07404d7958j35738A17146K0751
$$ plain form
10124 62745 -116060 229662 -109091 -96002 -348060 -220534 90384 93992 174661 -274614 -293870
10113 -293870 -189854 90400 -147702 124947 -75151 93079 232975 63703 -87022 -107015 50458
10101 -87766 27305 73634 23534 49949 -203250 -108749 -1197 -352921 60671 22794 284107
10090 284107 -213173 7508 -227003 209239 87644 -62573 262340 -327475 -203026 -24449
10079 -415333 -69614 -35149 -163602 44349 -109318 -64206 -215516 87637 -321022 -79700 -497425
10068 -497425 -546963 71888 -38724 40552 -99077 -56286 138322 -200814 232468 77515 -124245
10056 -98031 15180 -376443 1665 52000 -210842 -116436 -195496 -251607 -42107 57699 -259351
10044 50082 -320601 -148477 -192692 -136817 -30949 -92343 -299747 -47958 -183696 117146 137897
10033A37897J43277h4172A37637d9052C3208J42587b93565R2329J1429A06822
10022B8375R631J41520a80359I947f2911F8096b80692g5822k9450k2932N2444
10011g5760k60292a56246e3025k86210N6956A1732K77272b1835l45110A6033P6725
10000I2758c59991h025k06312A32241a27472B8959a19402A8687e9803A2889b33187
9988a23697B0709b65453n3884I0196a78149I8441b57470g9737A03601g3898j14485
9977a88383j24338A56244b67074J19061j92935a31519A06517k6492a19037j92789
9967c11826G3199l781f1205b0148j36482A74347e5871C6073b7892A39716K66527
9956D06243h1713k4753F715d74565d0222C298P6611J0457f851j71184f5817B04156
$$ plain form
10033 137897 281174 -84172 137637 -49052 33208 175795 -293565 -201236 -189807 106822
10022 28375 38006 179526 -180359 9947 -62911 68096 -280692 -75822 -105272 -128204 -75760
10011 -75760 -336052 -156246 -53025 -339235 -282279 11732 289004 -21835 -366945 16033 92758
10000 92758 -359991 -8025 -214337 132241 -127472 28959 -119402 18687 -59803 12889 -233187
9988 -123697 20709 -265453 -319337 90196 -178149 98441 -257470 -79737 103601 -73898 -188383
9977 -188383 -312721 156244 -267074 -148013 -340948 -131519 106517 80025 -119037 -311826
9967 -311826 73199 69418 -61205 -20148 -156630 174347 -55871 36073 -27892 139716 406243
9956 406243 -81713 -106466 6715 -474565 -40222 3298 79909 90366 -6851 -178035 -65817 204156
9943b20340A4432a54021o0211B51686q8819F0105b20954G4952L78768a35104f1256
9931b78254J22841B8936a47865J6004l20543b99j45866p6479m7053B41383i9369
9919A45659c65392C00327j26745A941b67957O7977A06845a11191D85502d4324
9908e423j95668B15076a59793d2308j47709B9301b7901l12151B48859h8307j84829
9897b73136h1758q3010o299J9528p5518O0687B0023b28327r8056P3010h562k5609
9885c4171r8934j10438A7076B578a11030m1814B32868p0083d2108B15181A8401
9873f4423l2510b7941J1151A86685g5200L1340A00201i5974k9999P212d5088o45
9861d5733A00269K02055b70460a34438k351A3423h5724j41352A38746K4977q484
$$ plain form
9943 -220340 14432 -154021 -214232 251686 162867 60105 -220954 74952 453720 -135104 -61256
9931 -278254 -155413 28936 -147865 -131861 -452404 -299 -146165 -222644 -269697 241383 -99369
9919 145659 -365392 300327 173582 1941 -267957 -199980 106845 -111191 485502 -44324
9908 -5423 -201091 215076 -159793 -42308 -190017 29301 -27901 -340052 248859 -88307 -273136
9897 -273136 -81758 -164768 -171067 -151539 -227057 -166370 20023 -228327 -326383 -253373 -8562 -34171
9885 -34171 -133105 -243543 17076 2578 -111030 -152844 232868 162785 -42108 215181 18401
9873 -64423 -96933 -27941 -16790 186685 -75200 -43860 100201 -95974 -125973 -118761 -45088 -45733
9861 -45733 100269 302324 -270460 -134438 -136789 13423 -85724 -227076 138746 163723 155239
9850A55239k3120f1228l27871a84346F5769g390k52767J05762k85930a91030j03376
9839b94406A582J23959a46583G5188a01581K3387j17240h0416o9229N6359n4935
9828a48221N7996A28766F4266N9560c44359A34994b3917j17613c8288l06851i1000
9816d5707F7992c09828b1551r5684D7485O6169a38729f3756H6056f2545F834c17310
9803D8483g932q3687K6473j46929n9319M3976B0826J68302c08066A35063a34691
9791b886n3145A76153a5544F229a77336a0155j00307N1655j01641B7281b29379
9779A00566d3036C69700a85290O896N8959q678B74356D8866J85624H1643a23129
9767A23500a32822C53914c77524e2743B87522E4905b55489A36035B556c48309
$$ plain form
9850 155239 132119 -61228 -389099 -184346 65769 -7390 -260157 -154395 -440325 -191030 -294406
9839 -294406 1582 125541 -146583 75188 -101581 -78194 -195434 -80416 -149645 -93286 -148221
9828 -148221 -90225 128766 64266 123826 -344359 134994 -23917 -141530 -38288 -345139 -91000
9816 -45707 67992 -309828 -21551 -117235 47485 113654 -138729 -63756 86056 -62545 6834 -317310
9803 48483 -7932 -91619 -65146 -212075 -271394 -227418 20826 189128 -308066 135063 -134691
9791 -2886 -56031 176153 -15544 6229 -177336 -10155 -110462 -58807 -160448 27281 -229379
9779 100566 -43036 369700 -185290 -178394 -119435 -128113 274356 48866 234490 81643 -123129
9767 123500 -132822 353914 -377524 -52743 287522 54905 -255489 136035 2556 -348309
9756b64346C858a32043l3307b9847A90356f010B1610a08858B67O2812j5505e5995
9743a94759B88603b27686c6818j82937B09851H7490g1593l7318d3527j21504A04859
9731a2848l03581A14769b81094a23680e7237j0135r8105N1527p0791C7663a37163
9719a60600k5575A3432a67366A26729C3792J00213J7977a27927K1929J9016D5253
9707A20574e93348a33909c1230l051B09126a58144a1215j73834Q2383J0879b5065
9695c49205l7508A42956N2166D0947i2387q7317I2626a23516M5312m04946a20708
9683a38802l7460A03902C1797a1269D2991h0411r6502A31827o3607c96192a40811
9671D00842g7985j44121d8696r9466N6796A7369a15086j3054F9630a53140j23766
$$ plain form
9756 -264346 3858 -132043 -165350 -29847 190356 -6010 21610 -108858 267 63079 47574 -55995
9743 -194759 288603 -227686 -36818 -219755 209851 87490 -71593 -108911 -43527 -165031 104859
9731 -12848 -316429 114769 -281094 -123680 -57237 -67372 -165477 -113950 -184741 37663 -137163
9719 -160600 -186175 13432 -167366 126729 33792 134005 151982 -127927 -105998 -86982 45253
9707 120574 -593348 -133909 -31230 -34281 209126 -158144 -11215 -185049 -102666 -91787 -25065
9695 -349205 -386713 142956 195122 40947 -92387 -179704 92626 -123516 -78204 -483150 -120708
9683 -138802 -176262 103902 31797 -11269 42991 -80411 -176913 131827 68220 -396192 -140811
9671 400842 -77985 -222106 -48696 -148162 -91366 17369 -115086 -128140 69630 -153140 -276906
9660b76906B70370a22574m05266B18469a38628C7187a72478B40382a48246f3026
9649a54693A38558d5092j05027A22276e2122l1112A09765f5267l020B03968q2522
9638A21446a96379A28131b58003M620h7527k01688h6900A96583a72763P9810j88326
9627b81279B15727h8924r9471j8332f0298k75003a35781j5319I6844a32732k68987
9616d01719H0388b21916J1049M564A357P5051a72008C46479f7613n6737p8732
9605b03082j76116P9518J06245c9550j82833R9177p7361k0211A89803a64691b2672
9593E2647j8671b23141C6363J4183f1813K2245o5999n9890B56204D0869D904b24983
9580D9464a72730d7631k23963a24837K0017B28728a56771b5500C02725a26699
$$ plain form
9660 -276906 270370 -122574 -527840 218469 -138628 37187 -172478 240382 -148246 -63026
9649 -154693 138558 -45092 -150119 122276 -52122 -83234 109765 -65267 -68287 203968 121446
9638 121446 -196379 128131 -258003 -253383 -87527 -289215 -86900 196583 -172763 -92953 -281279
9627 -281279 215727 -88924 -188395 -206727 -60298 -335301 -135781 -151100 96844 -132732 -401719
9616 -401719 80388 -221916 -210867 -206303 1357 76408 -172008 346479 -67613 -124350 -203082
9605 -203082 -379198 -299680 -193435 -39550 -222383 -123206 -200567 -220778 189803 -164691 -22672
9593 52647 33976 -223141 36363 50546 -61813 -39568 -105567 -165457 256204 40869 4904 -224983
9580 49464 -172730 -47631 -271594 -124837 -104820 228728 -156771 -25500 302725 -126699
9569d90092F9864b58270j3788j08303J66313D4399J59863B6042a87688F2684N1550
9558A14234R0442N1181g6242B7518a72822A20497J06201b0025j07867N5369B3359
9546c86014A72993b97783C7715a15650A86668b45024k9536A40293a69927L4840
9536a35087F1118a59268I7794L0489f5657j08081A38498i150B2345L98907c03061
9524d05129c2775H4523e2509F6179i7779A93024G0312b62834O1218P9809A7478
9512f6881C09728F7536c44467G2905a18413r8451f0696D2918A2761b13053f6143
9500b19964g4041C00596E014b02216G4176j1117f1010E9064b84354b9058r2786
9489a21844k82589A93803K37897a54068C94704G653K30521a47698r3090d2723
$$ plain form
9569 -490092 69864 -258270 -272058 -380361 -214048 44399 204262 26042 -187688 62684 114234
9558 114234 204676 255857 -76242 27518 -172822 120497 226698 -20025 -127892 -72523 23359
9546 -386014 172993 -297783 37715 -115650 186668 -245024 -274560 140293 -169927 -135087
9536 -135087 61118 -159268 97794 128283 -65657 -173738 138498 -9150 22345 421252 -303061
9524 -405129 -32775 84523 -52509 66179 -97779 193024 70312 -262834 -201616 -121807 17478
9512 -66881 309728 67536 -344467 72905 -118413 -216864 -60696 42918 12761 -213053 -66143
9500 -219964 -74041 300596 5014 -202216 74176 63059 -61010 59064 -284354 -29058 -121844
9489 -121844 -404433 193803 431700 -154068 394704 7653 238174 -147698 -240788 -42723
9478b74804j03925A91513A8190a10470G6473J51765q3922B7864J77685P071a91956
9466f2604L0822f379k16083Q6091a2508E3215c1954A34249J7554a33038e4649
9454A63585p0448D4170a29451j12097A2620a07284j04473a00735b2831j69353
9444a92184p3914i0143n3878j71169a08424d6251j9229a8814j29470f9564j77275
9433b46839J11805b9048B07987b04100I1581m4184d08445R9154r5034E0580b26699
9421b55444H2981a88550F078f1922I4193b07092j21301G4315R878A1726J25359
9410A37085c04780C79528R4680a81237A3195b73508i9927B07690b83703b742k40765
9399b43507b4917F4975A444a11208k10377g2003q6977F5251e6516r4734b7986
$$ plain form
9478 -274804 -378729 191513 18190 -110470 76473 228238 144316 27864 205549 212620 -191956
9466 -62604 -31782 -6379 -222462 -136371 -12508 53215 -31954 134249 151803 -133038 -54649
9454 163585 93137 44170 -129451 -241548 12620 -107284 -211757 -100735 -22831 -192184
9444 -192184 -266098 -90143 -144021 -315190 -108424 -46251 -65480 -18814 -148284 -69564 -246839
9433 -246839 -135034 -29048 207987 -204100 91581 47397 -408445 -309291 -404325 50580 -226699
9421 -255444 82981 -188550 6078 -61922 94193 -207092 -328393 74315 84193 11726 137085
9410 137085 -304780 379528 474208 -181237 13195 -273508 -99927 207690 -283703 -2742 -243507
9399 -243507 -24917 64975 1444 -111208 -321585 -72003 -158980 65251 -56516 -151250 -27986
9387a64899M1594D2737b54156g6538l43562F9889J06212n2670c69662a38533e8294
9375a53062A11326c14489J53165A67142j4384b05734F2240c39956a12082q3130
9365a95212O0035G0604B7102a1823j03787A0613l648a92299k44864H1795b23135
9353a76753b7204j10975P479I3407d6668A01526J1655L71678I3078D3665a07775
9341F219h9492A55404e3795j93230E5735P467a05165b7751k40851A23378b81888
9329a7349A69127a38121A30600B2983a19856l27513a71855E5573L8382O4703a527
9317a79133b8795h79j45320j22511L4917M2383A83623G2338N7083b31663N6093
9306a75570K5803c4883j13544A1667a02699A18840c20595p1728B1384b40485G6189
$$ plain form
9387 -164899 -123305 42737 -254156 -76538 -420100 69889 176101 123431 -369662 -138533 -58294
9375 -153062 111326 -314489 -161324 167142 152758 -205734 62240 -339956 -112082 -195212
9365 -195212 -135177 70604 27102 -11823 -115610 10613 6965 -192299 -437163 81795 -223135
9353 -176753 -27204 -138179 -130700 93407 -46668 101526 113181 484859 93078 43665 -107775
9341 6219 -89492 155404 -53795 -247025 55735 63202 -105165 -27751 -268602 123378 -281888
9329 -17349 169127 -138121 130600 22983 -119856 -447369 -171855 55573 93955 158658 -1527
9317 -179133 -28795 -879 -146199 -268710 -233793 -191410 183623 72338 129421 -231663 -175570
9306 -175570 -149767 -34883 -148427 11667 -102699 118840 -320595 -392323 21384 -240485 76189
9294A3899R3383a38036n0988P7249C763J92073a07874A44735a51249J3944L0594
9283a06711e3l17243B34413b7070b519o7142A68929a07933l9290A26022J07351
9272B33373F681J21597C443K3086J20347b26325B03034N6296j9797G4788g1771
9260d06017J56068R3877j79655J09831H242Q0761d80211f1079G1231a55043H1302
9248a8055l1858j39354j97285a9861I9789b60333k7644j56404A97260D8364a32743
9236a56358k0198p0957j57370J08960e0398j29678l5670c9517j642k4983K4977
9225d1165j60432Q5041N213o9181A63159c09647K2015A8248J76369b6201q6522
9214a12723q1317c2682P953k06401D17127c1941j587B98991b89230R9271N6369
$$ plain form
9294 13899 107282 -138036 -189024 -111775 3763 195836 -107874 144735 -151249 -137305 -106711
9283 -106711 -53 -317296 234413 -27070 -2519 -69661 168929 -107933 -147223 126022 233373
9272 233373 6681 128278 3443 26529 146876 -226325 203034 259330 239533 74788 -71771
9260 -406017 -249949 -156072 -335727 -225896 8242 89003 -480211 -61079 71231 -155043 81302
9248 -18055 -49913 -189267 -386552 -19861 99789 -260333 -287977 -444381 197260 48364 -132743
9236 -156358 -176556 -247513 -404883 -295923 -50398 -180076 -215746 -39517 -41159 -66142 -41165
9225 -41165 -201597 -116556 -111343 -180524 163159 -309647 -287632 18248 194617 -26201 -112723
9214 -112723 -194040 -32682 -24729 -231130 417127 -31941 -33528 298991 -289230 -189959 -133590
9203a33590r522f4272A40063b75214i0636L9414l44465g8796A65590a11930b6041
9191D22526I4156C9426b60681A20982h7175B68290f768I7205c03010J33917B49305
9179H112c1933A743L4469g8274m8018K0069a9772A10914a42763r5489a15189L844
9167a11345A09605J79188a91656k38112E454f796k75164q4335F9032b93556f8823
9155C2598c85277i3763q5823h7175J0829M564c2592J5655C358a88755n742l0117
9143b24614K4651d9664p638B98134a0446m65I2838d58074g3902B7546b20639L4780
9131a85859A37449a09801N774L8339l8433d4901D96159d4480C0887J67014b11898
9119a87983J9962A2461K30019i3033A34468B3997b01117o196A13278l9691K0715
$$ plain form
9203 -133590 -143112 -64272 140063 -275214 -90636 -51222 -395687 -78796 165590 -111930 -26041
9191 422526 94156 39426 -260681 120982 -87175 268290 -6768 97205 -303010 -169093 249305
9179 8112 -31933 1743 36212 -78274 -126292 -106223 -19772 110914 -142763 -238252 -115189 -111345
9167 -111345 109605 288793 -191656 -429768 5454 -6796 -281960 -366295 69032 -293556 -68823
9155 32598 -385277 -93763 -179586 -87175 -76346 -71782 -32592 -16937 3358 -188755 -194497 -224614
9143 -224614 -199963 -49664 -57302 298134 -10446 -10911 92838 -458074 -73902 27546 -220639 -185859
9131 -185859 137449 -109801 -104027 -65688 -104121 -44901 496159 -44480 30887 197901 -211898
9119 -187983 -168021 12461 242480 -93033 134468 23997 -201117 -207313 113278 73587 94302
9108I4302A6832c1706F5229b22375k5878E7071d8067H5524b72056a23641p718
9097a31359A87919L5595g6121L1844C8601D721f1876C5377b60616l0130h4701
9085b9502n8925K0187A86605m0141b21224A3313b53593a2237k82951C62201G2074
9073h5831a7813E8742a60805k0715E6342f23j71210B80582a49400A18737b20352
9061b32379l7606G1001a26600B10764e2851b0479j03509o4110F1489J3890b01146
9049i8496B3570e2932k99439A14974a04510K3726A15739f2169B31077b64117G9689
9037b4115m5666M379C3665a57072B4570f6940l61522e2987o1579D7766a12307
9025a55972Q785k86896a03279d467j01983l3146M4916A00946a21880N7942p5482
$$ plain form
9108 94302 16832 -31706 65229 -222375 -248253 57071 -48067 85524 -272056 -123641 -131359
9097 -131359 187919 223514 -76121 -44277 38601 4721 -61876 35377 -260616 -290746 -84701
9085 -29502 -88427 -68240 186605 146464 -221224 13313 -253593 -12237 -295188 362201 72074
9073 -85831 -17813 58742 -160805 -181520 56342 -623 -171833 280582 -149400 118737 -220352
9061 -232379 -269985 71001 -126600 210764 -52851 -20479 -123988 -188098 61489 75379 -201146
9049 -98496 23570 -52932 -352371 114974 -104510 -80784 115739 -62169 231077 -264117 79689
9037 -24115 -69781 -65402 33665 -157072 24570 -66940 -428462 -52987 -114566 47766 -112307
9025 -155972 -147187 -434083 -103279 -4467 -106450 -139596 -94680 100946 -121880 -63938 -139420
9014a39420l4750d0113a7557l9041k85632a35555c7652K721m0675B76439G3676
9002a84374B21978c06490N8349j20734G5765K32396c5589p9681E079Q6162a32993
8990B31845a00290c4649n55298b12300h4361M0664A09854i4602C36886a7911l01212
8979c19123A6371b63563G3174a93883P8541A29823e4159B75633q0403j4846O10
8968A80994G0382d37841I7184a19755A10831I922O7051b57058k04085A77431g7267
8956I0593a21780B13222e7618K6041C56892a53578j59961a9025A0766J96436b57528
8944C17912A43384c93609D4481b5578A77252c6893l86909E31359b57126B40281
8933d7093k4623q2498A34531a76916A46244o9758a5159C01549E3309L85486J022395
$$ plain form
9014 -139420 -174170 -40113 -17557 -56598 -342230 -135555 -37652 -34931 -75606 276439 73676
9002 -184374 221978 -306490 -248141 -368875 75765 308161 -35589 -115270 5079 91241 -132993
8990 231845 -100290 -34649 -589947 -212300 -84361 -43697 109854 -94602 336886 -17911 -319123
8979 -319123 16371 -263563 73174 -193883 -115342 129823 -54159 275633 195230 180384 180994
8968 180994 70382 -437841 97184 -119755 110831 9922 76973 -257058 -461143 177431 -77267
8956 90593 -121780 213222 -57618 -31577 356892 -153578 -313539 -19025 10766 207202 -257528
8944 317912 143384 -393609 44481 -25578 177252 -36893 -423802 531359 -257126 240281
8933 -47093 -71716 -154214 134531 -176916 146244 76486 -15159 301549 53309 438795 1461190
8922A461190M534908k856131I20283I8082A2916C974d78313H5058b40087h4171
8911F3196B4043a19856r0000A30093d1249g134j00861n17101K75638l1538E7201
8899b32595B3665d35673C43420c02078d1544F2061O0313h3369A68589g8129C2885
8887B2168b4251j87389B12413M6607a554r8085A13432c89463J55299C60590a7601
8875C30949A26524M5018f910l80192A84979F3615b79806P4711N3256A57504D1914
$$ plain form
8922 1461190 5996098 3139967 920283 98082 12916 3974 -478313 85058 -240087 -84171
8911 63196 24043 -119856 -209856 130093 -41249 -7134 -107995 -625096 -349458 -380996 57201
8899 -232595 23665 -435673 343420 -302078 -41544 62061 122374 -83369 168589 -78129 32885
8887 22168 -24251 -211640 212413 259020 -1554 -99639 113432 -389463 -234164 360590 -17601
8875 330949 126524 171542 -6910 -387102 184979 63615 -279806 -205095 -151839 157504 41914
$$ [...]
##END NTUPLES=NMR SPECTRUM
##END=
