
##TITLE=AC1329_ISIAH12158_6535987_FYheWWhY05
##JCAMPDX= 6.0         $$ Bruker NMR JCAMP-DX V2.0
##DATA TYPE= NMR SPECTRUM
##DATA CLASS= NTUPLES
##ORIGIN= BRUKER
##OWNER= Administrator
$$ 1.72 TOPSPIN		Version 2.1
$$ 2012-07-17 21:01:34.109 -0500  Administrator@TOPSPIN
$$ Compression mode = diff/dup
##.OBSERVE FREQUENCY= 400.02188249412
##.OBSERVE NUCLEUS= ^1H
##.ACQUISITION MODE= SIMULTANEOUS (DQD)
##.ACQUISITION SCHEME= undefined
##.AVERAGES= 64
##.DIGITISER RES= 22
##SPECTROMETER/DATA SYSTEM= spect
##.PULSE SEQUENCE= noesygpps1d.comp
##.SOLVENT NAME= COFFEE_meoh
##.SHIFT REFERENCE= INTERNAL, COFFEE_meoh, 1, 14.96073
##AUDIT TRAIL= $$ (NUMBER, WHEN, WHO, WHERE, PROCESS, VERSION, WHAT)
$$ ##TITLE= Audit trail, TOPSPIN		Version 2.1
$$ ##JCAMPDX= 5.01
$$ ##ORIGIN= Bruker BioSpin GmbH
$$ ##OWNER= Administrator
$$ $$ C:\Bruker\TOPSPIN/data/COFFEE/nmr/AC1329_ISIAH12158_6535987_FYheWWhY05/12/pdata/1/auditp.txt
$$ ##AUDIT TRAIL=  $$ (NUMBER, WHEN, WHO, WHERE, PROCESS, VERSION, WHAT)
(   1,<2012-07-17 21:01:29.234 -0500>,<Administrator>,<TOPSPIN>,<go>,<TOPSPIN 2.1>,
      <created by zg
	started at 2012-07-17 20:49:59.031 -0500,
	POWCHK enabled, PULCHK disabled,
       configuration hash MD5:
       6B 1B 68 BB D9 2E 58 E2 7F 35 AD 54 07 DF 0E 41
       data hash MD5: 64K
       E1 8F 68 59 DE 3E 61 E7 A7 1A B4 EC 7C EE CC 11>)
(   2,<2012-07-17 21:01:32.187 -0500>,<Administrator>,<TOPSPIN>,<proc1d>,<TOPSPIN 2.1>,
      <Start of raw data processing
       efp LB = 0.3 FT_mod = 6 PKNL = 1 PHC0 = 0 PHC1 = 0 SI = 128K 
       data hash MD5: 128K
       E7 AA BD A1 1E 1E 6A 3B 07 62 56 C3 17 15 5F C8>)
(   3,<2012-07-17 21:01:33.359 -0500>,<Administrator>,<TOPSPIN>,<proc1d>,<TOPSPIN 2.1>,
      <pk PHC0 = 0.3295898 PHC1 = 0 
       data hash MD5: 128K
       82 5D A3 DD 5E 5A CA 51 DA E8 6F 91 9A 11 B6 09>)
(   4,<2012-07-17 21:01:33.578 -0500>,<Administrator>,<TOPSPIN>,<proc1d>,<TOPSPIN 2.1>,
      <abs ABSG = 1 
       data hash MD5: 128K
       6A 46 60 1A 3D D4 90 BC 67 FD 68 2A 40 96 8B AF>)
(   5,<2012-07-17 21:01:33.671 -0500>,<Administrator>,<TOPSPIN>,<proc1d>,<TOPSPIN 2.1>,
      <abs ABSG = 2 
       data hash MD5: 128K
       C6 C2 D6 B5 C8 79 40 47 EF 42 CD 77 C1 6B 89 1B>)
(   6,<2012-07-17 21:01:33.765 -0500>,<Administrator>,<TOPSPIN>,<proc1d>,<TOPSPIN 2.1>,
      <abs ABSG = 3 
       data hash MD5: 128K
       A7 0F 74 19 6D 38 E5 1D 36 10 C6 1E 95 0E 30 47>)
(   7,<2012-07-17 21:01:33.968 -0500>,<Administrator>,<TOPSPIN>,<proc1d>,<TOPSPIN 2.1>,
      <abs ABSG = 4 
       data hash MD5: 128K
       65 14 50 DF 98 3C 88 72 24 8A 16 14 0B 0D 9C 56>)
(   8,<2012-07-17 21:01:34.015 -0500>,<Administrator>,<TOPSPIN>,<proc1d>,<TOPSPIN 2.1>,
      <abs ABSG = 5 
       data hash MD5: 128K
       6D 76 CC AF 9B 1A 65 61 3C 66 FA 36 0A 03 FF 38>)
$$ ##END=
$$ 
$$ $$ hash MD5
$$ $$ F9 DA F4 26 C0 B4 6D A9 62 1B 81 0F 8D 2B A1 44
##$RELAX= 
##$RELAX= 
##$RELAX= 
##$RELAX= 
##$RELAX= 
##$RELAX= 
##$RELAX= 
##$RELAX= 
$$ Bruker specific parameters
$$ [...]
##$TP07= 0
##$TPNAME0= <>
##$TPNAME1= <>
##$TPNAME2= <>
##$TPNAME3= <>
##$TPNAME4= <>
##$TPNAME5= <>
##$TPNAME6= <>
##$TPNAME7= <>
##$TPOAL= (0..7)
0.5 0.5 0.5 0.5 0.5 0.5 0.5 0.5
##$TPOFFS= (0..7)
0 0 0 0 0 0 0 0
##$TUNHIN= 0
##$TUNHOUT= 0
##$TUNXOUT= 0
##$USERA1= <user>
##$USERA2= <user>
##$USERA3= <user>
##$USERA4= <user>
##$USERA5= <user>
##$V9= 5
##$VALIST= <valist>
##$VCLIST= <CCCCCCCCCCCCCCC>
##$VD= 0
##$VDLIST= <DDDDDDDDDDDDDDD>
##$VPLIST= <PPPPPPPPPPPPPPP>
##$VTLIST= <TTTTTTTTTTTTTTT>
##$WBST= 2048
##$WBSW= 25
##$XGAIN= (0..3)
0 0 0 0
##$XL= 0
##$YL= 0
##$YMAX_a= 11998460
##$YMIN_a= -9278482
##$ZGOPTNS= <>
##$ZL1= 120
##$ZL2= 120
##$ZL3= 120
##$ZL4= 120
##$ABSF1= 14.96073
##$ABSF2= -5.597452
##$ABSG= 5
##$ABSL= 3
##$ALPHA= 0
##$AQORDER= 0
##$ASSFAC= 0
##$ASSFACI= 0
##$ASSFACX= 0
##$ASSWID= 0
##$AUNMP= <proc_prof1d_extract.lims>
##$AXLEFT= 0
##$AXNAME= <>
##$AXNUC= <1H>
##$AXRIGHT= 0
##$AXTYPE= 0
##$AXUNIT= <>
##$AZFE= 0.1
##$AZFW= 0.1
##$BCFW= 0
##$BC_mod= 0
##$BYTORDP= 0
##$COROFFS= 0
##$CY= 15
##$DATMOD= 1
##$DC= 0
##$DFILT= <>
##$DTYPP= 0
##$F1P= 0
##$F2P= 0
##$FCOR= 0.5
##$FTSIZE= 131072
##$FT_mod= 6
##$GAMMA= 0
##$GB= 0
##$INTBC= 1
##$INTSCL= 1
##$ISEN= 128
##$LB= 0.3
##$LEV0= 0
##$LPBIN= 0
##$MAXI= 10000
##$MC2= 0
##$MEAN= 0
##$ME_mod= 0
##$MI= 0
##$NCOEF= 0
##$NC_proc= -2
##$NLEV= 6
##$NOISF1= 0
##$NOISF2= 0
##$NSP= 0
##$NTH_PI= 0
##$NZP= 0
##$OFFSET= 14.96073
##$PC= 1
##$PHC0= 0.3295898
##$PHC1= 0
##$PH_mod= 1
##$PKNL= yes
##$PPARMOD= 0
##$PPDIAG= 0
##$PPIPTYP= 0
##$PPMPNUM= 2147483647
##$PPRESOL= 1
##$PSCAL= 4
##$PSIGN= 0
##$PYNMP= <proc.py>
##$REVERSE= no
##$SF= 400.020009745552
##$SI= 131072
##$SIGF1= 0
##$SIGF2= 0
##$SINO= 400
##$SIOLD= 131072
##$SPECTYP= <>
##$SREGLST= <1H.CDCl3>
##$SSB= 0
##$STSI= 131072
##$STSR= 0
##$SW_p= 8223.68421052631
##$SYMM= 0
##$S_DEV= 0
##$TDeff= 65536
##$TDoff= 0
##$TI= <>
##$TILT= no
##$TM1= 0
##$TM2= 0
##$TOPLEV= 0
##$USERP1= <user>
##$USERP2= <user>
##$USERP3= <user>
##$USERP4= <user>
##$USERP5= <user>
##$WDW= 1
##$XDIM= 131072
##$YMAX_p= 404898307
##$YMIN_p= -14733
##$CURPLOT= <Network HP LaserJet P1505>
##$CURPRIN= <$Network HP LaserJet P1505>
##$DFORMAT= <normdp>
##$LAYOUT= <+/1D_H.xwp>
##$LFORMAT= <normlp>
##$PFORMAT= <normpl>
##$SURQMSG= 1
$$ End of Bruker specific parameters
$$ ---------------------------------
##NTUPLES= NMR SPECTRUM
##VAR_NAME=  FREQUENCY,     SPECTRUM/REAL,   SPECTRUM/IMAG
##SYMBOL=    X,             R,               I
##VAR_TYPE=  INDEPENDENT,   DEPENDENT,       DEPENDENT
##VAR_FORM=  AFFN,          ASDF,            ASDF
##VAR_DIM=   131072,        131072,          131072
##UNITS=     HZ,            ARBITRARY UNITS, ARBITRARY UNITS
##FACTOR=    0.0627417313425164, 1,          1
##FIRST=     8223.62146879497, 4066,         -55541
##LAST=      0,             5138,            -55779
##MIN=       0,             -14733,          0
##MAX=       8223.62146879497, 404898307,    0
$$ Real data points
##PAGE= N=1
##DATA TABLE= (X++(R..R)), XYDATA
$$ [...]
63936C678718K57578K51256K38759K19125J93109J62337J28064R1342N3529J5666
63926E289483k2242o0550r8701j35123j68048j96064k18322k34747k45850k51989
63916C657847k53149k49631k42407k32371k19719k04582j87753j70308j52938
63907A744989j36111j20404j06136r3064q0992p0256o1170n3457m6808m1447l7464
63896H97680l4102l0490k6833k4042k2439k1558k1049k0900k0784k0009j8385
63885F37089j6613j5534j5231j5010j4001j1891r180o674m627k631m87J302K276
63872E28788K882M048O144Q694J0918J2211J2390J1876J1426J1372J1386J1122
63860F43257J0670J0063Q975P373N917N088M356K869O13j742l802n635p271q682
$$ y = [3678718, 3936296, 4187552, 4426311, 4645436, 4838545, 5000882, 5128946, 5220288, 5273817, 5289483, 5267241, 5206691, 5107990, 4972867, 4804819, 4608755, 4390433, 4155686, 3909836, 3657847, 3404698, 3155067, 2912660, 2680289, 2460570, 2255988, 2068235, 1897927, 1744989, 1608878, 1488474, 1382338, 1289274, 1208282, 1138026, 1076856, 1023399, 976591, 935144, 897680, 863578, 833088, 806255, 782213, 759774, 738216, 717167, 696267, 675483, 655474, 637089, 620476, 604942, 589711, 574701, 560700, 548809, 539629, 532955, 528328, 525697, 525210, 526512, 528788, 531670, 535718, 541862, 550556, 561474, 573685, 586075, 597951, 609377, 620749, 632135, 643257, 653927, 663990, 672965, 680338, 686255, 691343, 695699, 698568, 699181, 697439, 693637, 688002, 680731, 672049]
63846F72049j0030j1375j2434j3088j3811j4967j6182j6984j7595j8342j8789
63835E08452j8360j7474j7034j7072j6865j6138j5216j4109j2542j0814r617q998
63823C34213q441p959p977q126p435n918m802m699m715l955k854k257k073j699
63809B61303j158q81p82m13J99N78N69M94N95O66K90p24k057k944k811j936j240
63792B49748j299j897k639l429m115m179l285j873p79m13n61q45j024j019r15
63777B21476q80r83j146j264j241r01j59P33J358J556J425R74K10n02p17n95p53
63760B18591j257j380p02J38K55k80o42l96J00L92M77O01Q25J047J251J508J746
63743B22274J712J332J002J206J775J979J580J360K129L463M127L582K488J686
$$ y = [672049, 662019, 650644, 638210, 625122, 611311, 596344, 580162, 563178, 545583, 527241, 508452, 490092, 472618, 455584, 438512, 421647, 405509, 390293, 376184, 363642, 352828, 343211, 334213, 325772, 317813, 309836, 301710, 294275, 288357, 283555, 278856, 274141, 270186, 267332, 265075, 263002, 261303, 260145, 259264, 258482, 258069, 258268, 258846, 259415, 259909, 260504, 261170, 261460, 260736, 258679, 255735, 252924, 250988, 249748, 248449, 246552, 243913, 240484, 236369, 232190, 228905, 227032, 226253, 225840, 225279, 224434, 223410, 222391, 221476, 220596, 219613, 218467, 217203, 215962, 215061, 214902, 215635, 216993, 218549, 219974, 220948, 221158, 220656, 219939, 219344, 218591, 217334, 215954, 215252, 215390, 215645, 215365, 214723, 214327, 214427, 214819, 215296, 215897, 216722, 217769, 219020, 220528, 222274, 223986, 225318, 226320, 227526, 229301, 231280, 232860, 234220, 236349, 239812, 243939, 247521, 250009, 251695]
63729B51695J432J694K441L365L871L775L559L671M046M477M962N278M882L642
63715C02790K239J271M81n64j506j767j717k356l714m564m016k645j583j112p46
63700B80491k81N0L24J008K083K724K285J197M99O45J259J822K122K102J801J567
63684C01698J814K402K698K422J901J345M44q21j602j085L09J312J296Q75R87
63669C15995J853K815K937J853K76o05m35r4m72j339j996k502l400m531n111m917
63653C00327m488m106l466k559j980k049k273k074j483q03j43M26O77N71M34N59
63637B77570R62J623K521L347L664L515L472L929M777N781O757P396P429P155
63623C39898P268Q075R405J1120J3059J4523J4882J4744J5523J7526J9563K0849
$$ y = [251695, 253127, 254821, 257262, 260627, 264498, 268273, 271832, 275503, 279549, 284026, 288988, 294266, 299148, 302790, 305029, 306300, 306781, 306217, 304711, 302944, 301227, 298871, 295157, 290593, 286577, 283932, 282349, 281237, 280491, 280210, 280260, 280584, 281592, 283675, 286399, 288684, 289881, 290380, 291025, 292284, 294106, 296228, 298330, 300131, 301698, 303512, 305914, 308612, 311034, 312935, 314280, 314724, 313903, 312301, 311216, 311525, 312837, 314133, 315008, 315995, 317848, 320663, 323600, 325453, 325729, 325124, 324689, 324595, 324123, 322784, 320788, 318286, 314886, 310355, 305244, 300327, 295839, 291733, 288267, 285708, 283728, 281679, 279406, 277332, 275849, 275046, 274903, 275329, 276006, 276577, 277011, 277570, 278532, 280155, 282676, 286023, 289687, 293202, 296674, 300603, 305380, 311161, 317918, 325314, 332743, 339898, 347166, 355241, 364646, 375766, 388825, 403348, 418230, 432974, 448497, 466023, 485586, 506435]
63611E06435K2110K4108K6210K7508K8419K9887L1531L1847L0055K6684K2410
63600H07204J7370J1723O007P16l886p417r474j0156j0126j0039j0326j1347j3230
63587G57019j5522j7548j9181k0824k2570k3860k4157k3437k1914j9725j7148
63576E31133j4749j2946j1520r861p714n398l316j421N79K640M304N256N685N917
63562D88589O115O543P648R314J0517J0527J0182J1017J3157J5253J6631J8245
63550F23738K0974K4176K6800K8995L1536L4370L6755L8261L8483L6173L0076
63539I70337K0661J0112N32p062j2175j4547j4696j3847j2926j2171j1800j2268
63527H90150j3622j5464j7794k1142k5416k9410l2007l3200l3438l2625l0587
$$ y = [506435, 528545, 552653, 578863, 606371, 634790, 664677, 696208, 728055, 758110, 784794, 807204, 824574, 836297, 842304, 843020, 839134, 831717, 822243, 812087, 801961, 791922, 781596, 770249, 757019, 741497, 723949, 704768, 683944, 661374, 637514, 613357, 589920, 568006, 548281, 531133, 516384, 503438, 491918, 482057, 474343, 468945, 465629, 464208, 464787, 467427, 471731, 476987, 482672, 488589, 494704, 501247, 508895, 518209, 528726, 539253, 549435, 560452, 573609, 588862, 605493, 623738, 644712, 668888, 695688, 724683, 756219, 790589, 827344, 865605, 904088, 940261, 970337, 990998, 1001110, 1001642, 994580, 982405, 967858, 953162, 939315, 926389, 914218, 902418, 890150, 876528, 861064, 843270, 822128, 796712, 767302, 735295, 702095, 668657, 636032, 605445]
63516F05445k7995k5833k4086k1844j8859j6134j4586j3786j2571j0602q710p707
63504D02732p426p092o298n231m123k977j863j139j120j650k195k311j906j146
63490C56255l05L38N90M61J75M9L05R29J719K512L301M039M412M047K913J418
63474C83158J19n80n83k55k75j050k261l265l852m227m421m205l647l155k791
63459C48710k143j081k01q4n26q56o95n7J020K455L885M903N489N998O746P748
63443C81311Q809R758J0589J1398J2135J2659J3187J4370J6503J9026K1442K4222
63431E55409K7759L0577L0089K5580J9355J4243J1013Q967P969Q598J0861J4027
63419G64447J7543K1267K4982K8470L1783L4665L6055L4983L1704K7120K1390
$$ y = [605445, 577450, 551617, 527531, 505687, 486828, 470694, 456108, 442322, 429751, 419149, 410439, 402732, 395306, 388214, 381916, 376685, 372562, 369585, 367722, 366583, 365463, 363813, 361618, 359307, 357401, 356255, 355950, 356288, 356878, 357339, 357514, 357563, 357868, 358797, 360516, 363028, 366329, 370368, 374780, 378827, 381740, 383158, 383277, 382697, 382114, 381859, 381584, 380534, 378273, 375008, 371156, 366929, 362508, 358303, 354656, 351501, 348710, 346567, 345486, 345285, 345201, 344675, 343819, 343124, 343067, 344087, 346542, 350427, 355330, 360819, 366817, 373563, 381311, 390120, 399878, 410467, 421865, 434000, 446659, 459846, 474216, 490719, 509745, 531187, 555409, 583168, 613745, 643834, 669414, 688769, 703012, 714025, 722992, 730961, 739559, 750420, 764447, 781990, 803257, 828239, 856709, 888492, 923157, 959212, 994195, 1025899, 1053019, 1074409]
63408A074409J4138N904j718p479j1241j3322j4066j4131j4383j5130j6167j7655
63396I69159k0216k3880k7707l0781l3001l4524l5037l4119l1982k9404k6996
63385F41512k4812k2526j9905j7106j4497j2163r866p570n614l969j926R02L742
63372E06202N653O957Q683J0807J2264J2769J3412J4988J6880J8286J9548K1455
63360F67904K3850K5967K7747K9876L2555L5008L6366L6460L5504L3386K9693
63349A014316K4389J8174J1970O070J33n866j0960j3921j4603j4191j4073j4837
63337I86601j6321j8245k0505k3089k5833k8276k9849l0315k9913k8980k7584
63326G07691k5775k3767k1590j8886j5536j2141r257o526l315k01J065p59n203
$$ y = [1074409, 1088547, 1094451, 1092733, 1085254, 1074013, 1060691, 1046625, 1032494, 1018111, 1002981, 986814, 969159, 948943, 925063, 897356, 866575, 833574, 799050, 764013, 729894, 697912, 668508, 641512, 616700, 594174, 574269, 557163, 542666, 530503, 520637, 513067, 507453, 503484, 501558, 502460, 506202, 511855, 518812, 527495, 538302, 550566, 563335, 576747, 591735, 608615, 626901, 646449, 667904, 691754, 717721, 745468, 775344, 807899, 842907, 879273, 915733, 951237, 984623, 1014316, 1038705, 1056879, 1068849, 1074919, 1075052, 1069186, 1058226, 1044305, 1029702, 1015511, 1001438, 986601, 970280, 952035, 931530, 908441, 882608, 854332, 824483, 794168, 764255, 735275, 707691, 681916, 658149, 636559, 617673, 602137, 589996, 580739, 574213, 570898, 570697, 571762, 571003, 565800]
63313E65800j0628j5363j8300j9142j8456j7113j5505j3522j1208q942o990n380
63301D05251m173l360k637j816j301j455j783j594j269j788k986l584l194k969
63287C71342l713m578m496l810l493l561l372k873k446j901p91M57Q16N8r24j295
63271C35420j063o36k90k35n33p64k27J196K783L723L920L797L652L443L168L176
63255C60530L884N198O435P033P207P587Q246Q596Q349Q151Q842J0398J2024J3235
63241D75715J4462J6501J9446K2414K4416K5526K6755K8654L0566L1738L2621
63230G48814L4083L5767L6377L5674L4837L4483L3672L1733K9880K9786L1227
63219A116333L2430L2415L1796L1385L1087L0334K8723K5883K1423J5319Q046
$$ y = [565800, 555172, 539809, 521509, 502367, 483911, 466798, 451293, 437771, 426563, 417621, 410631, 405251, 401078, 397718, 395081, 393265, 391964, 390509, 388726, 387132, 385863, 384075, 381089, 377505, 374311, 371342, 367629, 363051, 358555, 354745, 351252, 347691, 344319, 341446, 339000, 337099, 336308, 336765, 337581, 337639, 336715, 335420, 334357, 333721, 333431, 333196, 332663, 331899, 331672, 332868, 335651, 339374, 343294, 347091, 350743, 354186, 357354, 360530, 364414, 369612, 376047, 383080, 390287, 397874, 406120, 414716, 423065, 431216, 440058, 450456, 462480, 475715, 490177, 506678, 526124, 548538, 572954, 598480, 625235, 653889, 684455, 716193, 748814, 782897, 818664, 855041, 890715, 925552, 960035, 993707, 1025440, 1055320, 1085106, 1116333, 1148763, 1181178, 1212974, 1244359, 1275446, 1305780, 1334503, 1360386, 1381809, 1397128, 1405174]
63208A405174J71p964j6195k4445l2520l9755m5127m8231m9760n0479n0026m7553
63196I93290m3352l8958l5478l2586k9394k5596k1467j7401j3862j1284r537p826
63184G06549n495k726j45J987L814N401O584P279P611P757P809P832P847P823
63170G69927P694P380O733N582L921J958q9k168m299o426q497j0605j2858j5078
63156G43175j6823j7836j8369j8870j9317j9109j7796j5788j4053j3081j2450
63145E59683j1453r875q026o253m729l547k724k128j596j112p34m02K7N37R28
63130E08596J050J007J063J431K149L090M061M931N665O267O703O926O888O573
63116E66400N994N234M485L954L645L208K263J025M23J085K336K829K255J718
$$ y = [1405174, 1405345, 1397381, 1381186, 1356741, 1324221, 1284466, 1239339, 1191108, 1141348, 1090869, 1040843, 993290, 949938, 910980, 875502, 842916, 813522, 787926, 766459, 749058, 735196, 723912, 714375, 706549, 701054, 698328, 698183, 700170, 703984, 709385, 715969, 723248, 730859, 738616, 746425, 754257, 762104, 769927, 777621, 785001, 791734, 797316, 801237, 803195, 803106, 800938, 796639, 790213, 781716, 771111, 758253, 743175, 726352, 708516, 690147, 671277, 651960, 632851, 615055, 599267, 585214, 572133, 559683, 548230, 538355, 530329, 524076, 519347, 515800, 513076, 510948, 509352, 508240, 507506, 507104, 507131, 507668, 508596, 509646, 510653, 511716, 513147, 515296, 518386, 522447, 527378, 533043, 539310, 546013, 552939, 559827, 566400, 572394, 577628, 582113, 586067, 589712, 592920, 595183, 596208, 596631, 597716, 600052, 602881, 605136, 606854]
63102F06854K098K725K447J364N61M72N44M21M32O77P11M06L33Q10J387J680J948
63085F25870K334K314J632J152J863L458M757N256N469N849O271O664P386Q647
63071F88922J0014J0901J1345J2030J3584J5930J8367K0282K1806K3599K6087
63060H72867K9135L2478L6022L9711M3491M7626N2571N8221O3710O8306P2140
63049A416278P5643P8641Q0539Q1192Q1076Q0722Q0342P9963P9526P8875P7893
63038B290690P6690P5522P4664P4314P4291P3698P1286O6398N9257N0161L9004
63027C025975K5866J1383m045k0922l9660n9156p7083r1641j02531j10312j15392
63016B442482j17722j17111j13663j08002j00999r3188q4750p6049o7648n9574
$$ y = [606854, 608952, 611677, 614124, 615488, 616049, 616521, 617065, 617486, 617918, 618595, 619306, 619712, 620045, 620855, 622242, 623922, 625870, 628204, 630518, 632150, 633302, 635165, 638623, 643380, 648636, 654105, 659954, 666225, 672889, 680275, 688922, 698936, 709837, 721182, 733212, 746796, 762726, 781093, 801375, 823181, 846780, 872867, 902002, 934480, 970502, 1010213, 1053704, 1101330, 1153901, 1212122, 1275832, 1344138, 1416278, 1491921, 1570562, 1651101, 1732293, 1813369, 1894091, 1974433, 2054396, 2133922, 2212797, 2290690, 2367380, 2442902, 2517566, 2591880, 2666171, 2739869, 2811155, 2877553, 2936810, 2986971, 3025975, 3051841, 3063224, 3059179, 3038257, 2998597, 2939441, 2862358, 2770717, 2668186, 2557874, 2442482, 2324760, 2207649, 2093986, 1985984, 1884985, 1791797, 1707047, 1630998, 1563350, 1503776]
63006A503776n1220m2486l4371k7721k2007j6185j0382n649k315L34K752M588
62994A299114N651O486P546Q545R083R338R692J0029R835Q813P067M846K216j068
62980A397193n283j0171j4882j8928k2867k7429l2082l5316l6461l6456l6487
62969A120831l6577l5994l4507l2581l0626k8623k6455k4207k2114k0427j9267
62958H09453j8486j7719j6717j5574j4546j3794j3400j3384j3601j3721j3507
62947F45004j3064j2618j2114j1250j0031r088r162j0152j0940j0445q718o756
62935E20666n338m461l830l335k940k565k314k375k513k183j417j014j406j886
62921D83089j574o35N5J04k45p97j485j968j894j575j700k369k947k940k553k290
$$ y = [1503776, 1452556, 1410070, 1375699, 1347978, 1325971, 1309786, 1299404, 1293755, 1291440, 1291774, 1294526, 1299114, 1304765, 1311251, 1318797, 1327342, 1336425, 1345763, 1355455, 1365484, 1375319, 1384132, 1391199, 1396045, 1398261, 1397193, 1391910, 1381739, 1366857, 1347929, 1325062, 1297633, 1265551, 1230235, 1193774, 1157318, 1120831, 1084254, 1048260, 1013753, 981172, 950546, 921923, 895468, 871261, 849147, 828720, 809453, 790967, 773248, 756531, 740957, 726411, 712617, 699217, 685833, 672232, 658511, 645004, 631940, 619322, 607208, 595958, 585927, 576839, 567677, 557525, 546585, 536140, 527422, 520666, 515328, 510867, 507037, 503702, 500762, 498197, 495883, 493508, 490995, 488812, 487395, 486381, 484975, 483089, 481515, 480880, 480935, 481039, 480794, 479997, 478512, 476544, 474650, 473075, 471375, 469006, 466059, 463119, 460566, 458276]
62905D58276k433k908l331l251k608j828j268q45n13n43q95q30P1J051J085L04
62889D39534l85o85r18r19k02Q47J154N30p9j04o4l56m78k2M83L62k11n95n14
62870D37378q2M27M88l43j602k074j282j65K12orL79O91P65R40J388J779J671
62852D40555R87K01M3P61J693J946J501J045Q13L53l93p49l77J64M18O76J109
62835D50746J111L75k27J76J024J140N61L86J055J837K087J969J853J796J887
62820D67776K324K964L419L786M605N858O688O546O034O088O700P062O817O551
62806E43218O968P997Q988R568J0029J0862J2216J3885J5625J7252J8601J9679
62794F94888K0789K2271K4181K6517K9645L3929L8992M3929M8495N3531N9861
$$ y = [458276, 455843, 452935, 449604, 446353, 443745, 441917, 440649, 439804, 439291, 438748, 437853, 437023, 437094, 438145, 439230, 439534, 439149, 438464, 437546, 436627, 436425, 437272, 438426, 438956, 438877, 438773, 438709, 438353, 437875, 437853, 438336, 438698, 438487, 437892, 437378, 437296, 437723, 438211, 437868, 436266, 434192, 432910, 432745, 432957, 432951, 432942, 433321, 434012, 434777, 435717, 437105, 438884, 440555, 441542, 441743, 441786, 442547, 444240, 446186, 447687, 448732, 449545, 449898, 449505, 448756, 448379, 448543, 448961, 449637, 450746, 451857, 452232, 452005, 452181, 453205, 454345, 454906, 455292, 456347, 458184, 460271, 462240, 464093, 465889, 467776, 470100, 473064, 476483, 480269, 484874, 490732, 497420, 503966, 510000, 516088, 522788, 529850, 536667, 543218, 550186, 558183, 567171, 576739, 586768, 597630, 609846, 623731, 639356, 656608, 675209, 694888, 715677, 737948, 762129, 788646, 818291, 852220, 891212, 935141, 983636, 1037167, 1097028]
62783A097028O7267P5008Q2896R1286J00167J09009J17407J25267J32168J37083
62773B134586J39100J38171J34722J28628J18930J04854Q6863O6365M4420K1220
62763C117859k962k6871m8995o8878q6930j02896j15409j23468j27698j29575
62753B284177j29812j28097j24204j18782j12892j07176j01502r5246q7956p9854
62743A198656p1741o4339n7856n2151m7052m2390l7997l3877l0185k6964k4077
62732G10027k1518j9514j8105j6864j5273j3231j1092r279p990p143o462n750
62720E57806n071m546l986k995j466K75J827L072M133N253O679Q415J0125J1550
62706E91071J2935J4714J6974J9552K2537K6033K9505L2062L3517L4650L6259
$$ y = [1097028, 1164295, 1239303, 1322199, 1413485, 1513652, 1622661, 1740068, 1865335, 1997503, 2134586, 2273686, 2411857, 2546579, 2675207, 2794137, 2898991, 2985854, 3052219, 3096639, 3117859, 3114897, 3088026, 3039031, 2970153, 2883223, 2780327, 2664918, 2541450, 2413752, 2284177, 2154365, 2026268, 1902064, 1783282, 1670390, 1563214, 1461712, 1366466, 1278510, 1198656, 1126915, 1062576, 1004720, 952569, 905517, 863127, 825130, 791253, 761068, 734104, 710027, 688509, 668995, 650890, 634026, 618753, 605522, 594430, 585151, 577161, 570018, 563556, 557806, 552735, 548189, 544203, 541208, 539742, 540017, 541844, 544916, 549049, 554302, 560981, 569396, 579521, 591071, 604006, 618720, 635694, 655246, 677783, 703816, 733321, 765383, 798900, 833550, 869809]
62695H69809L8388M0551M2226M2986M2668M1517L9763L7025L2629K6471J9057
62684A273090J0859K266n997j3330k0072k6825l3057l7535m0271m2608m4987m6112
62672I75421m5100m3044m1336l9683l7111l3980l1515k9834k7941k5396k2726
62661E97755k0262j7697j4918j2369j0461r272q670q212p218n563m150l881m466
62648D70616m963n114n308n525n246m268k870j328J7N65J73j96N40K172L613M363
62632D47241M556L939K180J10p59j58O36P55P60J253J697J376O77N53J242K198
62616D68256K972L618M480N860P629R040R389Q966Q855R681J1122J2781J4814
62603E77463J7348J9999K2411K4854K7831L1479L5662M0225M4857M9150N3138
$$ y = [869809, 908197, 948748, 990974, 1033960, 1076628, 1118145, 1157908, 1194933, 1227562, 1254033, 1273090, 1283949, 1286215, 1280218, 1266888, 1246816, 1219991, 1186934, 1149399, 1109128, 1066520, 1021533, 975421, 930321, 887277, 845941, 806258, 769147, 735167, 703652, 673818, 645877, 620481, 597755, 577493, 559796, 544878, 532509, 522048, 512776, 504106, 495894, 488676, 483113, 478963, 475082, 470616, 465653, 460539, 455231, 449706, 444460, 440192, 437322, 435994, 436011, 436576, 436749, 436553, 437093, 439265, 442878, 447241, 451797, 455736, 457916, 458026, 457267, 457109, 457745, 458500, 459260, 460513, 462210, 463586, 464263, 464816, 466058, 468256, 471228, 474846, 479326, 485186, 492815, 501855, 511244, 520210, 529065, 538746, 549868, 562649, 577463, 594811, 614810, 637221, 662075, 689906, 721385, 757047, 797272, 842129, 891279, 944417]
62592I44417N7334O1779O5461O7168O6588O4190O0244N4522M6811L7282K6346
62581A552142J4468K198r883k1305l1709m0695m7812n2837n6075n8248n9843o0603
62569A129798n9951n7868n4939n1475m7283m2592l8538l5937l4090l1623k8198
62558F47304k4605k1442j8620j6102j4158j2778j1598j0544r718q700o849m536
62546D87654l068l026l532l550l089k617k110j356o34l96p38j589k898m139m280
62531D50632k915j018J15L82O94J658L087M599N988P080P765Q279R068J0410J2388
62516E18212J5048J8184K1141K3258K4468K5208K5843K6469K7065K7463K7238
62505G79597K6065K4114K1810J9235J6169J2685R370O734M602K293n33l264m669
$$ y = [944417, 1001751, 1063530, 1128991, 1196159, 1262747, 1326937, 1387181, 1441703, 1488514, 1525796, 1552142, 1566610, 1568808, 1558925, 1537620, 1505911, 1465216, 1417404, 1364567, 1308492, 1250244, 1190401, 1129798, 1069847, 1011979, 957040, 905565, 858282, 815690, 777152, 741215, 707125, 675502, 647304, 622699, 601257, 582637, 566535, 552377, 539599, 528001, 517457, 507739, 499039, 492190, 487654, 484586, 481560, 478028, 474478, 471389, 468772, 466662, 465306, 464672, 464276, 463538, 461949, 459051, 454912, 450632, 447717, 446699, 446814, 447196, 447890, 449548, 452635, 457234, 463222, 470302, 478067, 486346, 495414, 505824, 518212, 533260, 551444, 572585, 595843, 620311, 645519, 671362, 697831, 724896, 752359, 779597, 805662, 829776, 851586, 870821, 886990, 899675, 909045, 915779, 920381, 922674, 922141, 918877, 914208]
62492I14208l962j452J986N871J0249J4997J9566K3633K7607L2122L7238M2318
62480A124381M6590M9675N1756N3203N3803N2303M7244L8479K7635J6903P568
62469A569540m85q404j7735k9273m1828n2518n8963o1263o1462o1368o1311o0689
62457A054241n8929n5806n1439m6285m0929l5674l0486k5406k0755j6821j3539
62446F58172j0654q114o101m656l425j953k82R89J412J361J576K151K323J430
62432F34229l16k179l768n156o442p576q619r769j0993j1854j1878j1089j0014
62419E34576r121q420p686p013o760o958p068o627n839n237m977m816m607m365
62405D45082l983l385k876k814k971k677j730o12K89J095J942K547K602K217J725
$$ y = [914208, 910246, 908794, 910780, 916651, 926900, 941897, 961463, 985096, 1012703, 1044825, 1082063, 1124381, 1170971, 1220646, 1272402, 1325605, 1379408, 1431711, 1478955, 1517434, 1545069, 1561972, 1569540, 1569055, 1560651, 1542916, 1513643, 1471815, 1419297, 1360334, 1299071, 1237609, 1176241, 1114930, 1054241, 995312, 939506, 888067, 841782, 800853, 765179, 734693, 709287, 688532, 671711, 658172, 647518, 639404, 633303, 628647, 625222, 623269, 622987, 623976, 625388, 626749, 628325, 630476, 632799, 634229, 633913, 631734, 627966, 622810, 616368, 608792, 600173, 590404, 579411, 567557, 555679, 544590, 534576, 525455, 517035, 509349, 502336, 495576, 488618, 481550, 474923, 469084, 463847, 458870, 454054, 449447, 445082, 441099, 437714, 434838, 432024, 429053, 426376, 424646, 424034, 424323, 425418, 427360, 429907, 432509, 434726, 436451]
62390D36451J327J191J486K159K883L448L901M239M365M514N174O359P358P592
62376D92447P348P354P876Q631R288R762J0205J0987J2452J4406J6205J7559J8995
62363F43515K1177K4105K7331L0676L4266L8081M1910M5709M9512N3007N5553
62352A064842N6673N6301N4406N0658M4592L6224K6389J6380P160j042q366j4858
62340A389359k0598k5921l0989l5337l8386m0313m1691m2404m1710l9601l7100
62329I95309l4864l2368k9048k5479k2627k0536j8655j7049j6364j6756j7642
62318G43921j8450j8934j8804j7824j6400j5409j5222j5276j4791j3516j1683
62307E67612r572p371n222l292j758o95R7R44J888K656L239M030N067N603N023
$$ y = [436451, 437778, 438969, 440455, 442614, 445497, 448945, 452846, 457085, 461450, 465964, 471138, 477497, 484855, 492447, 499795, 507149, 515025, 523656, 532944, 542706, 552911, 563898, 576350, 590756, 606961, 624520, 643515, 664692, 688797, 716128, 746804, 781070, 819151, 861061, 906770, 956282, 1009289, 1064842, 1121515, 1177816, 1232222, 1282880, 1327472, 1363696, 1390085, 1406465, 1413625, 1412583, 1404217, 1389359, 1368761, 1342840, 1311851, 1276514, 1238128, 1197815, 1156124, 1113720, 1072010, 1032409, 995309, 960445, 928077, 899029, 873550, 850923, 830387, 811732, 794683, 778319, 761563, 743921, 725471, 706537, 687733, 669909, 653509, 638100, 622878, 607602, 592811, 579295, 567612, 558040, 550669, 545447, 542155, 540397, 539702, 539799, 540743, 542631, 545287, 548526, 552556, 557623, 563226, 568249]
62292E68249L953L641M332M946M518L293K128J434J099J009J090J008L76o91j493
62277E98892j375l36J050K197K913L304L554L907M727O283Q380J0468J2237J3964
62263F70165J6179J9109K2528K6069K9554L3107L6994M1358M6063N0855N5461
62252A047442N9303O1348O0659N7164N1477M4070L5052K4840J4428M710m029j1800
62240A444664j8612k4801l1083l7794m4332m9709n3369n5173n5095n3481n1171
62229I70044m8771m5939m1995l7042l2025k7718k4221k1317j8842j6602j4407
62218F41165j2284j0492r217q393p758o898n530l945k940k912l290l174k356j327
62204E60649m74K43R17J521K152K992M021N042O051P202Q478R666J0657J1432
$$ y = [568249, 572202, 575843, 580175, 585121, 589639, 592932, 595060, 596494, 597593, 598602, 599692, 600700, 601076, 600385, 598892, 597517, 597181, 598231, 600428, 603341, 606645, 610199, 614106, 618833, 625116, 633496, 643964, 656201, 670165, 686344, 705453, 727981, 754050, 783604, 816711, 853705, 895063, 941126, 991981, 1047442, 1106745, 1168093, 1228752, 1285916, 1337393, 1381463, 1416515, 1441355, 1455783, 1460493, 1456464, 1444664, 1426052, 1401251, 1370168, 1332374, 1288042, 1238333, 1184964, 1129791, 1074696, 1021215, 970044, 921273, 875334, 833339, 796297, 764272, 736554, 712333, 691016, 672174, 655572, 641165, 628881, 618389, 609172, 600779, 593021, 586123, 580593, 576648, 573708, 570796, 567506, 564332, 561976, 560649, 560175, 560418, 561335, 562856, 565008, 568000, 572021, 577063, 583114, 590316, 598794, 608460, 619117, 630549]
62190F30549J1858J1847J1773J2249J3358J4461J4935J4901J4977J5452J5854
62179G82214J5387J3751J1491R483Q150P392P092P392Q323R648J1263J3439J6393
62166I21418J9972K4003K8571L3518L7947M0804M1749M1002L8451L3578K6401
62155A287414J8034J0009L213k423p380j1916j6020j9835k3831k8231l2365l5061
62143A141608l5824l5286l4353l3303l1866k9788k6972k3461j9591j5935j2796
62132H42433j0088p857o411n691n002l854k618j913j687j392o84N37K343M478
62118H02594O209P089P502P912P872O594M182J605m72k113l466m350m588m292
62104H32278l855l928n053o884q107p769o400n180m388l412k005n59P16K053L440
$$ y = [630549, 642407, 654254, 666027, 678276, 691634, 706095, 721030, 735931, 750908, 766360, 782214, 797601, 811352, 822843, 832326, 840476, 847868, 854960, 862352, 870675, 880323, 891586, 905025, 921418, 941390, 965393, 993964, 1027482, 1065429, 1106233, 1147982, 1188984, 1227435, 1261013, 1287414, 1305448, 1315457, 1318670, 1316247, 1308867, 1296951, 1280931, 1261096, 1237265, 1209034, 1176669, 1141608, 1105784, 1070498, 1036145, 1002842, 970976, 941188, 914216, 890755, 871164, 855229, 842433, 832345, 824488, 818077, 812386, 807384, 803530, 800912, 798999, 797312, 795920, 795236, 795773, 798116, 802594, 808803, 815892, 823394, 831306, 839178, 845772, 849954, 851559, 851087, 848974, 845508, 841158, 836570, 832278, 828423, 824495, 819442, 812558, 804451, 796682, 790282, 785102, 780714, 777302, 775297, 774738, 775454, 777507, 780947]
62089G80947M430M770M601M040L157K304J831J603J412J668K926M892O790Q550
62075H33921J0660J2873J4267J4717J5208J6351J7556J8125J8320J8854K0103
62064A010955K2173K4979K7832K9693L0223K9869K8583K5469K0186J3778P376
62053A271116R74n681j1799j6319j9494k2587k6200k9807l2817l5182l6963l8087
62041I97154l8684l8957l8613l7096l4537l1907k9908k8194k6079k3606k1434
62030F48139j9793j8046j5523j2467r888q498q081p933p634p225o905o812o957
62017E12377p049o619n609m679m446m599m245l110j809q97k17O11J618K662L739
62002D77728M791N543N820N795N712N531N100M457L822L330K907K274J111n81
$$ y = [780947, 785377, 790147, 794748, 798788, 801945, 804249, 806080, 807683, 809095, 810763, 813689, 818581, 825371, 833921, 844581, 857454, 871721, 886438, 901646, 917997, 935553, 953678, 971998, 990852, 1010955, 1033128, 1058107, 1085939, 1115632, 1145855, 1175724, 1204307, 1229776, 1249962, 1263740, 1271116, 1272090, 1266409, 1254610, 1238291, 1218797, 1196210, 1170010, 1140203, 1107386, 1072204, 1035241, 997154, 958470, 919513, 880900, 843804, 809267, 777360, 747452, 719258, 693179, 669573, 648139, 628346, 610300, 594777, 582310, 572422, 563924, 555843, 547910, 540276, 533051, 526146, 519334, 512377, 505328, 498709, 493100, 488421, 483975, 479376, 475131, 472021, 470212, 469315, 469098, 469709, 471327, 473989, 477728, 482519, 488062, 493882, 499677, 505389, 510920, 516020, 520477, 524299, 527629, 530536, 532810, 533921, 533340]
61988E33340k371l858n108o372p535q300q749r251r824j0085r823r152q144o894
61974D27874n848n464n432m932l784k739k367k342k145j847j748j774j684j514
61960C84254j367j059l33P23J789K569K857K605K123J936K241K735L076L196L182
61945D10527L287M013N648P594Q791R031R290J0439J2150J3431J3796J3455J2769
61932E34221J1895J0851R648Q472P758P746P970P595O300M439K359J48j912l371
61918F14119m313n322o490p096o568n151l339j285Q72K825M613O699R010J0602
61904F09176J0849J0300R784R160P758N587L314J255q65l212n483p307q607r498
61890F32211j0039j0085r407q184p160o935p143o959o351o102o520p021p221p519
$$ y = [533340, 530969, 527111, 522003, 515631, 508096, 499796, 491047, 481796, 471972, 461887, 452064, 442912, 434768, 427874, 422026, 416562, 411130, 406198, 402414, 399675, 397308, 394966, 392821, 390974, 389226, 387452, 385768, 384254, 382887, 381828, 381495, 382218, 384007, 386576, 389433, 392038, 394161, 396097, 398338, 401073, 404149, 407345, 410527, 413814, 417827, 423475, 431069, 439860, 448891, 458181, 468620, 480770, 494201, 507997, 521452, 534221, 546116, 556967, 566615, 575087, 582845, 590591, 598561, 606156, 612456, 616895, 619254, 619402, 617490, 614119, 609806, 604484, 597994, 590898, 584330, 579179, 575840, 574555, 575427, 578252, 582865, 589564, 598574, 609176, 620025, 630325, 640109, 649269, 657027, 662614, 665928, 667183, 666318, 663106, 657623, 650316, 641709, 632211, 622172, 612087, 602680, 594496, 587336, 580401, 573258, 566299, 559948, 553846, 547326, 540305, 533084, 525565]
61876E25565q188q791q969q924q670p673n935m423l671k909j417R9O58P06J404
61861D58862K792L924M525N270O588Q304J0299J2559J4652J6142J7373J8921K0500
61848F00711K1425K1905K2688K3493K3143K1393J9357J7708J5676J2321P955L601
61836H11376j85l350n834p649r059j0119j0280q933o194k840L87L166N504P480
61822G63470R085J0173J0552R955P989M418k54m846q529j1463j4104j6288j7594
61809G42564j8234j8772j9118j8616j7159j5503j4332j3647j3185j2843j2502
61798E68653j1941j1130j0242r282q121o919o066n632n251m643l898l239k804
61785D79485k650k643k468k075j897k216k578k405j916j701j631j057m4N37L53
$$ y = [525565, 517377, 508586, 499617, 490693, 482023, 474350, 468415, 463992, 460321, 457412, 455995, 456094, 456752, 457458, 458862, 461654, 465578, 470103, 475373, 481961, 490265, 500564, 513123, 527775, 543917, 561290, 580211, 600711, 622136, 644041, 666729, 690222, 713365, 734758, 754115, 771823, 787499, 799820, 807775, 811376, 811191, 807841, 802007, 794358, 785299, 775180, 764900, 755967, 749773, 746933, 747320, 750486, 755990, 763470, 772555, 782728, 793280, 803235, 811224, 815642, 815388, 810542, 802013, 790550, 776446, 760158, 742564, 724330, 705558, 686440, 667824, 650665, 635162, 620830, 607183, 593998, 581155, 568653, 556712, 545582, 535340, 526058, 517937, 511018, 504952, 499320, 494069, 489426, 485528, 482289, 479485, 476835, 474192, 471724, 469649, 467752, 465536, 462958, 460553, 458637, 456936, 455305, 454248, 454204, 454741, 455094]
61770D55094J25N09J162J402J167Q53O98P66J185J945K660K876K507J900J636
61755D76485K195L422M330L930K342O14n41j313j996k404k473k692l345l719k875
61740D71960j052L19J63j101k159k257j781j442j295q27J07R44J161R58R19J247
61724D65864J682J962J988J760J469J450J701J777J511J483K194L074L067K021
61710D93003Q17J57q4k54l71l46k56k68n77j367k428l043k778k214k258k989l797
61693D70947m399m865m901m171l276l228l849l830k699j544j308j541j535j551
61679D28250k054k572k424j933j899k308k509k348k177j981j441p83o94j249j673
61664D00205j378n72K68R95J586J889J891J959K412L044L384L338L244L261L007
$$ y = [455094, 455219, 455728, 456890, 458292, 459459, 460312, 461010, 461776, 462961, 464906, 467566, 470442, 472949, 474849, 476485, 478680, 482102, 486432, 490362, 492704, 493318, 492777, 491464, 489468, 487064, 484591, 481899, 478554, 474835, 471960, 470908, 471227, 471390, 470289, 468130, 465873, 464092, 462650, 461355, 460528, 460635, 461579, 462740, 463698, 464617, 465864, 467546, 469508, 471496, 473256, 474725, 476175, 477876, 479653, 481164, 482647, 484841, 487915, 490982, 493003, 493820, 493977, 493893, 493639, 493268, 492922, 492666, 492398, 491821, 490454, 488026, 484983, 482205, 479991, 477733, 474744, 470947, 466548, 461683, 456782, 452611, 449335, 446107, 442258, 438428, 435729, 434185, 432877, 431336, 429801, 428250, 426196, 423624, 421200, 419267, 417368, 415060, 412551, 410203, 408026, 406045, 404604, 403821, 403127, 401878, 400205, 398827, 398255, 398523, 399518, 401104, 402993, 404884, 406843, 409255, 412299, 415683, 419021, 422265, 425526, 428533]
61649D28533K078P50k36n61n65m45J95J579K993L474L022K387J868J114J45m08
61633D45923l69m68j233k140k342j782j023m71k92o64j501k213k382k397k876
61618D23770l607l769l201k754l155m015m291l537k425k023k743m015m905m920
61604C74410m274l521l144l349l985m632m917m761m220l332k306j668j785k335
61590C26181k654k582k485k511k399k083j901j959j787j025k8M90K58l76q87j021
61574C03231q91p75o97l83K06N05j3r05j092j49J210K088K273K032J573J009N33
61557C09755K74K28L34M37K34k52l18O76K190K857K109Q00Nr9P3K49K94J01p7
61538C19870K92J251K104K232J728R93K77j74j77p8m87j233j387o88p9k92q11
$$ y = [428533, 430611, 431361, 431125, 430564, 429999, 429554, 429749, 431328, 434321, 437795, 440817, 443204, 445072, 446186, 446331, 445923, 445554, 445086, 443853, 441713, 439371, 437589, 436566, 436095, 435803, 435139, 433638, 431425, 429043, 426646, 423770, 420163, 416394, 413193, 410439, 407284, 403269, 398978, 395441, 393016, 390993, 388250, 384235, 379330, 374410, 370136, 366615, 363471, 360122, 356137, 351505, 346588, 341827, 337607, 334275, 331969, 330301, 328516, 326181, 323527, 320945, 318460, 315949, 313550, 311467, 309566, 307607, 305820, 304795, 304767, 305257, 305515, 305139, 304252, 303231, 302340, 301565, 300868, 300485, 300691, 301196, 301183, 300278, 299186, 299037, 300247, 302335, 304608, 306640, 308213, 309222, 309755, 310029, 310257, 310591, 311028, 311262, 311010, 310692, 311368, 313558, 316415, 318524, 319324, 319329, 319230, 319303, 319552, 319846, 319947, 319870, 320162, 321413, 323517, 325749, 327477, 328470, 328747, 328573, 328396, 328318, 327831, 326598, 325211, 324523, 324444, 324152, 323341]
61521C23341q99p67r01j035p69n77j082j873k096j762j393q15L97J575J478K42
61505C13064n89k11M71N00K96P36J631K107J893J438J043N42j22o27n96O3J146
61488C22785K253K870K632J658O02K34Q00J789K469K651K658K600K128J195N11
61473C49835P79J727K425K384J786Q14m90j748k248j833j179r63j116j267j460
61458C47446j937k427k276j379n05m13r10j142p22j22R4K6R8L68O37J016J757
61441C39609K563K685J915J015Q19J378K206K884L072K415J035j52j69R05K010
61426C64190K245J641Q21K65M0K0J80O31J347K077K591K981L377L510K904J564
61410C90384Q9r69j491j535j187q29r48j457j663j243p37p48j078j136p79l22
$$ y = [323341, 322442, 321675, 320774, 319739, 318970, 318393, 317311, 315438, 313342, 311580, 310187, 309372, 309769, 311344, 312822, 313064, 312475, 312264, 312735, 313235, 313531, 314267, 315898, 318005, 319898, 321336, 322379, 322921, 322799, 322172, 321576, 321639, 322785, 325038, 327908, 330540, 332198, 332800, 333034, 333834, 335623, 338092, 340743, 343401, 346001, 348129, 349324, 349835, 350614, 352341, 354766, 357150, 358936, 359750, 359260, 357512, 355264, 353431, 352252, 351289, 350173, 348906, 347446, 345509, 343082, 340806, 339427, 338922, 338509, 337599, 336457, 335735, 335613, 335707, 335733, 335831, 336199, 336836, 337852, 339609, 342172, 344857, 346772, 347787, 348606, 349984, 352190, 355074, 358146, 360561, 361596, 361444, 361275, 362180, 364190, 366435, 368076, 368897, 369162, 369202, 369222, 369402, 370033, 371380, 373457, 376048, 379029, 382406, 385916, 388820, 390384, 390473, 389504, 388013, 386478, 385291, 384462, 383514, 382057, 380394, 379151, 378414, 377666, 376588, 375452, 374673, 374351]
61394C74351k3j8m33j139j593j344m98N45J533K264K443K099J745J740J799J611
61378C85082J494J921K668L097L104L135L384L512L247K704K023J096j21j240
61364D15106j644j090p8N18L64rj0J49n7m14k28M93J072J517K610M348N516N472
61346D33635N125N248N001L415J372N75J139J729J803K058K768L159K754K090
61332D71871J674J318Q20M27J53n11j713k751k926k351j566q26j23N28J089J572
61316D66685J966K351L077M405O017P244P796P942Q092Q553R539J0934J2213J2985
61302E69799J3325J3141J1730Q766N255K540O35j383l561m948n335n834p232q905
61288E87993r851r882r287q202o946o233o316o440n741m325k937j997j425j007
$$ y = [374351, 374328, 374310, 373877, 372738, 371145, 369801, 369303, 369848, 371381, 373645, 376088, 378187, 379932, 381672, 383471, 385082, 386576, 388497, 391165, 394262, 397366, 400501, 403885, 407397, 410644, 413348, 415371, 416467, 416346, 415106, 413462, 412372, 412294, 412812, 413176, 413167, 413157, 413306, 413249, 412835, 412607, 413100, 414172, 415689, 418299, 422647, 428163, 433635, 438760, 444008, 449009, 452424, 453796, 454371, 455510, 457239, 459042, 461100, 463868, 467027, 469781, 471871, 473545, 474863, 475683, 476110, 476263, 475752, 474039, 471288, 468362, 466011, 464445, 463619, 463496, 464024, 465113, 466685, 468651, 471002, 474079, 478484, 484501, 491745, 499541, 507483, 515575, 524128, 533667, 544601, 556814, 569799, 583124, 596265, 607995, 616761, 622016, 624556, 625191, 623808, 620247, 615299, 609964, 604130, 596898, 587993, 578142, 568260, 558973, 550771, 543825, 537592, 531276, 524836, 519095, 514770, 511833, 509836, 508411, 507404]
61274E07404m81M66J774K901L426L494L413L134K475J619J050J126J848K858L639
61259E40146L976M241M919N793O107N482M259K920J674P49M49O85R44Q97O26J87
61243E84054n24j363j981k410k969l382k836j284M6Nj060j886j848j347r51o51
61227E59613J8J419L325M893N411N119M925N214N469N280N081N467O269O843O982
61212F31328O959O859O384N286L717K172J216J103J487J757J787K121L186M617
61198F79979N649O072O542P900J0288J2871J4462J4556J3653J2454J0957Q804
61186H04187O248M122K759J575J4j581k420k259j690j584k463m164n965p151p559
61171G82069p495p283p132p281p829q541r108r552r985j0154r763r085q742q879
$$ y = [507404, 506923, 507389, 509163, 512064, 515490, 518984, 522397, 525531, 528006, 529625, 530675, 531801, 533649, 536507, 540146, 544122, 548363, 553282, 559075, 565182, 570664, 574923, 577843, 579517, 580266, 580715, 581400, 582344, 583241, 583867, 584054, 583530, 582167, 580186, 577776, 574807, 571425, 568589, 567305, 567351, 567356, 566296, 564410, 562562, 561215, 560264, 559613, 559631, 561050, 564375, 569268, 574679, 579798, 584723, 589937, 595406, 600686, 605767, 611234, 617503, 624346, 631328, 638287, 645146, 651530, 656816, 660533, 662705, 663921, 665024, 666511, 668268, 670055, 672176, 675362, 679979, 685628, 691700, 698242, 706142, 716430, 729301, 743763, 758319, 771972, 784426, 795383, 804187, 810435, 814557, 817316, 818891, 818905, 817324, 814904, 812645, 810955, 809371, 806908, 802744, 796779, 789628, 782069, 774574, 767291, 760159, 752878, 745049, 736508, 727400, 717848, 707863, 697709, 687946, 678861, 670119, 661240]
61157F61240r086r041q699p941o659n160l854k667j329j49L35K75K62J33r13k877
61141F03870m653n383n293m898m257l404k594j757n13R36J763J775J869K762M090
61126E84313N306O621Q430J0499J2351J3886J5090J5787J6238J7295J9337K1638
61114G46791K3329K4416K5312K5978K6187K6083K5862K5321K4273K2917K1421
61103A017890J9623J7577J5723J4044J1760Q421M680J391j410m010o239p845r107
61090A082498j0369j1473j2203j2697j2884j2217j0634r010p998p065n476l473
61078I66999j686o7J663L174M156N178O967R203J1055J2480J4065J5921J7617
61065A066725J8959K0053K0868K1369K1767K2107K2034K1495K0984K0568J9550
$$ y = [661240, 652154, 643113, 634414, 626473, 619814, 614654, 610800, 608133, 606804, 606655, 606990, 607265, 607527, 607660, 606747, 603870, 599217, 593834, 588541, 583643, 579386, 575982, 573388, 571631, 571118, 572054, 573817, 575592, 577461, 580223, 584313, 589619, 596240, 604670, 615169, 627520, 641406, 656496, 672283, 688521, 705816, 725153, 746791, 770120, 794536, 819848, 845826, 872013, 898096, 923958, 949279, 973552, 996469, 1017890, 1037513, 1055090, 1070813, 1084857, 1096617, 1105038, 1109718, 1111109, 1109699, 1105689, 1099450, 1091605, 1082498, 1072129, 1060656, 1048453, 1035756, 1022872, 1010655, 1000021, 991011, 983013, 975948, 970472, 966999, 965313, 965246, 966909, 970083, 974239, 979417, 986384, 995587, 1006642, 1019122, 1033187, 1049108, 1066725, 1085684, 1105737, 1126605, 1147974, 1169741, 1191848, 1213882, 1235377, 1256361, 1276929, 1296479]
61054A296479J7741J6107J5297J4533J2982J1164R868Q739P271O125N924N722
61042A427952M474L181L575N246O134N600N039N561O922Q745J1016J3330J5276
61029A522051J7482K0690K4010K5867K6427K7209K8541K9526L0437L2822L7243
61018A822305M3168N1069O1925P4497Q5987R6059J07482J22456J41644J67585
61008B774177K05102K56550L19935L93466M78071N73733O78154P92301R22299
60999G393788J072768J245720J449946J693236J938407K068377J934579J481048
60991B0277869Q25913J98688k16173l73849l26974j36810J37518L81702M23834
60982B1191718J42194m19087j062134j572763j848250j910514j833479j679851
$$ y = [1296479, 1314220, 1330327, 1345624, 1360157, 1373139, 1384303, 1394171, 1402910, 1410181, 1416306, 1422230, 1427952, 1432426, 1435607, 1439182, 1444428, 1450562, 1456162, 1461201, 1466762, 1473684, 1482429, 1493445, 1506775, 1522051, 1539533, 1560223, 1584233, 1610100, 1636527, 1663736, 1692277, 1721803, 1752240, 1785062, 1822305, 1865473, 1916542, 1978467, 2052964, 2138951, 2235010, 2342492, 2464948, 2606592, 2774177, 2979279, 3235829, 3555764, 3949230, 4427301, 5001034, 5679188, 6471489, 7393788, 8466556, 9712276, 11162222, 12855458, 14793865, 16862242, 18796821, 20277869, 21103782, 21302470, 21086297, 20712448, 20385474, 20248664, 20386182, 20767884, 21191718, 21333912, 20914825, 19852691, 18279928, 16431678, 14521164, 12687685, 11007834]
60974A1007834j489595j291088j103322r33346p81687o49753n39250m48271l72784
60965C398738l10791k61887k24064j93933j69488j50180j34747j21109j08283
60956A724256r6633q6222p6379o6896n8325n0957m4542l9134l5292l3246l2462
60945A104168l2064l1320k9886k8063k6586k5660k4575k2758k0810j9775j9700
60934H22971j9610j8816j7522j6269j5388j4952j4709j4104j2807j1168r743q644
60922F49239p726p085o783o386n461m353l757l679l559l339l518m096m251l418
60908E81828k028r18m53l97l20K5L67M8j111k266k523k161k128k443k291j735
60892E61494k018l637n326n826n622n869o469o485n994o093p083p910p660o702
$$ y = [11007834, 9518239, 8227151, 7123829, 6190483, 5408796, 4759043, 4219793, 3771522, 3398738, 3087947, 2826060, 2601996, 2408063, 2238575, 2088395, 1953648, 1832539, 1724256, 1627623, 1541401, 1465022, 1398126, 1339801, 1288844, 1244302, 1205168, 1169876, 1136630, 1104168, 1072104, 1040784, 1010898, 982835, 956249, 930589, 906014, 883256, 862446, 842671, 822971, 803361, 784545, 767023, 750754, 735366, 720414, 705705, 691601, 678794, 667626, 657883, 649239, 641513, 634428, 627645, 621259, 615798, 611445, 607688, 604009, 600450, 597111, 593593, 589497, 585246, 581828, 579800, 578882, 578429, 578032, 577712, 577737, 578104, 578152, 577041, 574775, 572252, 570091, 567963, 565520, 563229, 561494, 559476, 555839, 550513, 544687, 539065, 533196, 526727, 520242, 514248, 508155, 501072, 493162, 485502, 478800]
60878D78800n987n868n999n928n425m527l468k452j469n04K40O30Q78J194J409
60863D41524J403J703K951M838O222O371N615M685L933L288K553J653R42J139
60849D88820K475M037M628M167L509K948J887K01j171j568j694k646m416o091
60835D95086p042p225o666n506m400m115m620n065m791l949l072k480k227k370
60821D31558k926l644m040l878l541l671m294m701m440m076m392n099n129m171
60807C73556l061k562k464k292k096k053j834j036J33J101J552J488R75K09m08
60792C61208o10m14J23R50J688J863J692J896K478K459J371J97M9N88O45J8m04
60775C75797n8O09R19O69J7p75j370j491j089k36Q86J750J663N99n76j104j151
$$ y = [478800, 472813, 466945, 460946, 455018, 449593, 445066, 441598, 439146, 437677, 437173, 437413, 438043, 438921, 440115, 441524, 442927, 444630, 447581, 452419, 458641, 465012, 470627, 475312, 479245, 482533, 485086, 486739, 487681, 488820, 491295, 495332, 499960, 504127, 507636, 510584, 512471, 512672, 511501, 509933, 508239, 505593, 501177, 495086, 488044, 480819, 474153, 468647, 464247, 460132, 455512, 450447, 445656, 441707, 438635, 436155, 433928, 431558, 428632, 424988, 420948, 417070, 413529, 409858, 405564, 400863, 396423, 392347, 387955, 382856, 377727, 373556, 370495, 367933, 365469, 363177, 361081, 359028, 357194, 356158, 356291, 357392, 358944, 360432, 361407, 361616, 361208, 360598, 360184, 360307, 361257, 362945, 364808, 366500, 368396, 370874, 373333, 374704, 374901, 374950, 375538, 376183, 376201, 375797, 375739, 376348, 377267, 377936, 377953, 377178, 375808, 374317, 373228, 372992, 373878, 375628, 377291, 377890, 377314, 376210, 375059]
60758C75059j187j161q34n09o71j231j740j993j891j194o3N85J34p16p86Q0J074
60741C62956J614J585P85q61k694l843m254m424m371l793k961k431k052j274k80
60726C33702K46L78Q26J601J943J608J102O35M3k16O66K318L250K873K156J883
60710C55014J597R25O54J480K723L228K761J729L31j129j817j284l18j3l87p33
60694C64761q70j179j701k056k062j862j496r79n83n43o54n47j78K78P41J093
60678C52163J115Q75Q58J239J530J342J053J124J262Q87J43l26m29p44j535k325
60662C58232k560k269j875j623j357p67J53R33J077O90M15P12J523K644L890M780
60646C64598M667L571K394J836J477M94j036k174k396k216k423l077l569l478
$$ y = [375059, 373872, 372711, 371877, 371368, 370697, 369466, 367726, 365733, 363842, 362648, 362585, 363170, 363304, 362588, 361802, 361882, 362956, 364570, 366155, 366940, 366079, 363385, 359542, 355288, 350864, 346493, 342700, 339739, 337308, 335256, 333982, 333702, 333948, 334326, 335152, 336753, 338696, 340304, 341406, 342041, 342084, 341868, 342534, 344852, 348102, 350975, 353131, 355014, 356611, 357536, 358190, 359670, 362393, 365621, 368382, 370111, 370442, 369313, 367496, 366212, 365894, 365881, 365494, 364761, 363891, 362712, 361011, 358955, 356893, 355031, 353535, 352556, 351973, 351430, 350776, 350229, 350051, 350329, 351070, 352163, 353278, 354153, 355011, 356250, 357780, 359122, 360175, 361299, 362561, 363448, 363591, 363265, 362836, 362092, 360557, 358232, 355672, 353403, 351528, 349905, 348548, 347781, 347934, 348867, 349944, 350634, 351049, 351761, 353284, 355928, 359818, 364598, 369265, 372836, 375230, 377066, 378543, 379037, 378001, 375827, 373431, 371215, 368792, 365715, 362146, 358668]
60632C58668l088k905k841k274j029J01L03j45l19K5L11K75L66Q61J412J781K224
60615C53726K714K533J254l88j250j066m55L8L81O91R83J204J350J466J629J733
60599C66543J435O15j95l57L3L80N73R61J429J413R60Q00J122J281J078J197J837
60582C81105K080J379O26Q33J592J940J959K348L050L449L607M125N036N949P076
60567D26154Q996J1406J3184J3754J3560J3064J2099J0371P873M619O24l602p008
60554E25094q769q858p894o580n300l903k061P6J892L154M428O260Q410J0367
60540E16316J2090J3687J4944J5853J7052J8909K0600K0986K0036J8367J5737
60529G04577J1292N292o17n118q246j0439j1563j1460j0633r858r390r011q462
$$ y = [358668, 355580, 352675, 349834, 347560, 346531, 346632, 346935, 346790, 346471, 346496, 346807, 347082, 347448, 348309, 349721, 351502, 353726, 356440, 358973, 360227, 359839, 358589, 357523, 357068, 357106, 357487, 358178, 359161, 360365, 361715, 363181, 364810, 366543, 367978, 368593, 368398, 368041, 368074, 368454, 369027, 369988, 371417, 372830, 373790, 374590, 375712, 376993, 378071, 379268, 381105, 383185, 384564, 385190, 386023, 387615, 389555, 391514, 393862, 396912, 400361, 403968, 408093, 413129, 419078, 426154, 435150, 446556, 459740, 473494, 487054, 500118, 512217, 522588, 530461, 535080, 535704, 532102, 525094, 516325, 507467, 499573, 492993, 487693, 483790, 481729, 481805, 483697, 486851, 491279, 497539, 505949, 516316, 528406, 542093, 557037, 572890, 589942, 608851, 629451, 650437, 670473, 688840, 704577, 715869, 721161, 720544, 715426, 707180, 696741, 685178, 673718, 663085, 653227, 643837, 634826, 626364]
60516F26364p585o367n086m132l522k804j523L83K651M893O824Q599J0816J3875
60502F43386J7532K1358K5369K9789L4460L9025M3449M7727N1402N3899N5146
60491A062542N5159N3390M9251M3108L5677K6709J5312J770j2150k4977l6573
60480A269218m7006n5427o0818o3159o3155o1307n7917n3540m8765m3705l8291
60469F76128l2849k7983k4016k0866j8281j5909j3452j1075r401q767q660q321
60457D76548p633p068o878o790o526o110n641n030m227l472l102l134l229l084
60443D04624k656k037j322p21n99r72j195o17M13P60q6j310j817j547j237j286
60427C88395j447j448j318j101p30k86k5j5%L18R43J539J715J506J495K152L047
$$ y = [626364, 618779, 612412, 607326, 603194, 599672, 596868, 595345, 595728, 598379, 603272, 610096, 618695, 629511, 643386, 660918, 682276, 707645, 737434, 771894, 810919, 854368, 902095, 953497, 1007396, 1062542, 1117701, 1171091, 1220342, 1263450, 1299127, 1325836, 1341148, 1342918, 1330768, 1305791, 1269218, 1222212, 1166785, 1105967, 1042808, 979653, 918346, 860429, 806889, 758124, 714419, 676128, 643279, 615296, 591280, 570414, 552133, 536224, 522772, 511697, 502296, 493529, 484869, 476548, 468915, 461847, 454969, 448179, 441653, 435543, 429902, 424872, 420645, 417173, 414071, 410937, 407708, 404624, 401968, 399931, 398609, 397888, 397289, 396317, 395122, 394505, 394918, 395678, 395592, 394282, 392465, 390918, 389681, 388395, 386948, 385500, 384182, 383081, 382351, 382065, 382040, 382025, 382025, 382343, 383286, 384825, 386540, 388046, 389541, 391693, 394740]
60410C94740L216K430J517J217J347J457J526J522J055K49J96J502L013L146K107
60395D20240J538K133K933L002K558K156J932K024K718L653L841L031K298K615
60381D56672L541L900L267K165J225P14O49Q79J206J620K234K860L096K947K829
60366D89804K788K337J344M90M15R51J685K649L973N221N779N705N650O086O965
60351E41842P976Q685Q646P815O729N908N141L782J612q86l047m505n210n344
60337E79144n247n190n142m898m387l789l388l400l818m289m394m190m218m692
60323E18102m956m224k687j332n84K15J728L484M441M480M627N781P722R637J1132
60308E57566J2272J3015J3150J2744J2165J1723J1527J1512J1138R345N537O28
$$ y = [394740, 397956, 400386, 401903, 403120, 404467, 405924, 407450, 408972, 410027, 410276, 410472, 411974, 414987, 418133, 420240, 421778, 423911, 426844, 429846, 432404, 434560, 436492, 438516, 441234, 444887, 448728, 451759, 454057, 456672, 460213, 464113, 467380, 469545, 470770, 471484, 472133, 473012, 474218, 475838, 478072, 480932, 484028, 486975, 489804, 492592, 494929, 496273, 496763, 497178, 498129, 499814, 502463, 506436, 511657, 517436, 523141, 528791, 534877, 541842, 549818, 558503, 567149, 574964, 581693, 587601, 592742, 596524, 598136, 597250, 594203, 589698, 584488, 579144, 573897, 568707, 563565, 558667, 554280, 550491, 547103, 543703, 539885, 535596, 531202, 527012, 522794, 518102, 513146, 508922, 506235, 504903, 504319, 504534, 506262, 509746, 514187, 518667, 523294, 529075, 536797, 546434, 557566, 569838, 582853, 596003, 608747, 620912, 632635, 644162, 655674, 666812, 676157, 681694, 682322]
60296F82322l630o546r010j1870j4702j6582j7310j7155j5996j3637j0608p883
60284E37393n812m083k550j530j228j402j704j976k219k573l168l798l930l400
60270D98020k832k919l558m146m449m687m864m619l835k921k457k649l107l122
60256D47855k346j272o97p09o69k65J65M84J011J592J494Q18Q19J961K704J561
60240D54506n55j492q07M7P1k67l71l78m27l15p3R9N43J747L212L801L334K757
60222D65432K677K806K929L300L840M072M088M526N381N934O082O552P496Q090
60208E33205P945P755P969Q005P454P020P392Q039P978P131O131N345M740M307
60194F30416M017L654L078K348J410J44j141j880k101k482l362m330n034n692
$$ y = [682322, 678692, 672146, 663136, 651266, 636564, 619982, 602672, 585517, 569521, 555884, 545276, 537393, 531581, 527498, 524948, 523418, 522190, 520788, 519084, 517108, 514889, 512316, 509148, 505350, 501420, 498020, 495188, 492269, 488711, 484565, 480116, 475429, 470565, 465946, 462111, 459190, 456733, 454084, 450977, 447855, 445509, 444237, 443540, 442831, 442162, 441897, 442062, 442546, 443557, 445149, 446643, 447461, 448280, 450241, 452945, 454506, 453951, 452459, 451652, 451699, 451770, 451503, 451132, 450754, 450327, 450012, 449939, 450038, 450581, 452328, 455540, 459341, 462675, 465432, 468109, 470915, 473844, 477144, 480984, 485056, 489144, 493670, 499051, 504985, 511067, 517619, 525115, 533205, 541150, 548905, 556874, 564879, 572333, 579353, 586745, 594784, 602762, 609893, 616024, 621369, 626109, 630416, 634433, 638087, 641165, 643513, 644923, 645067, 643926, 642046, 639945, 637463, 634101, 629771, 624737, 619045]
60180F19045o508p229p574p570p293o792o275n851n200m180l498l802m413m094
60166E38766k921k054j730j067RL44m36j153r99o56o90l36J027K467K736J918
60150E35225Q66r9q98j077m91J31K85N03J269K061K318K510L226M086M550M954
60134E59419N824O826P396P620P656P180O237N731N990N892M537K831K112K152
60120F37403J967J732K349L651M610M918M965M615L455K030J400J579J641J172
60106F77487N25k15j251k226k540k426k691l466m160m451m390l774k446j018k93
60091F42665k04k31m60j201j950j936j406j215j436j558j690k279k880k608j779
60076F19832j629k451l295l637l971m617n232n762o634p692q106p672p170p114
$$ y = [619045, 612537, 605308, 597734, 590164, 582871, 576079, 569804, 563953, 558753, 554573, 551075, 547273, 542860, 538766, 535845, 533791, 532061, 530994, 531003, 531347, 530911, 529758, 528759, 528103, 527413, 527077, 528104, 530571, 533307, 535225, 536091, 535992, 535094, 534017, 533526, 533657, 533942, 534445, 535714, 537775, 540093, 542603, 545829, 549915, 554465, 559419, 565243, 572069, 579465, 587085, 594741, 601921, 608158, 613889, 619879, 625771, 630308, 633139, 635251, 637403, 639370, 641102, 643451, 647102, 651712, 656630, 661595, 666210, 669665, 671695, 673095, 674674, 676315, 677487, 678012, 677797, 676546, 674320, 671780, 669354, 666663, 663197, 659037, 654586, 650196, 646422, 643976, 642958, 642665, 642461, 642230, 641770, 640569, 638619, 636683, 635277, 634062, 632626, 631068, 629378, 627099, 624219, 621611, 619832, 618203, 615752, 612457, 608820, 604849, 600232, 595000, 589238, 582604, 574912, 566806, 559134, 551964, 544850]
60062E44850p141o906o609o332n822n074m334l391j897m35n6n97o61L53J485J907
60046D99340K133K879L845M487N056N951O753O844O507O533O986P116O395N071
60032E75896L708K555J448K36q08j230j171j489k766m568o203p696r275j0419
60018E38218j0429r747r509r859r797q752p239n824m552l594l321l430l039k042
60004D47084j342j359j418j044p59r23r07k37L82J65l46K7J426K858L480L231
59988D50318K563K137K579L810M870M917M148L283K547J732R23L84p9r21k024
59973D81187k772l003l266l920m418l985k661j359q23q98q82m19K31P10J015J307
59957D56044J542J582J481J441J535J631J536J097L02n51j041j053q04l61M13
$$ y = [544850, 537709, 530803, 524194, 517862, 512040, 506966, 502632, 499241, 497344, 496909, 496853, 496256, 495595, 495948, 497433, 499340, 501473, 504352, 508197, 512684, 517740, 523691, 530444, 537288, 543795, 550328, 557314, 564430, 570825, 575896, 579604, 582159, 583607, 583843, 583035, 581805, 580634, 579145, 576379, 571811, 565608, 557912, 548637, 538218, 527789, 518042, 508533, 498674, 488877, 480125, 472886, 467062, 462510, 458916, 455595, 452165, 449126, 447084, 445742, 444383, 442965, 441921, 441162, 440239, 439332, 439095, 439477, 439642, 439296, 439323, 440749, 443607, 447087, 450318, 452881, 455018, 457597, 461407, 466277, 471194, 475342, 478625, 481172, 482904, 483827, 484211, 484132, 483211, 481187, 478415, 475412, 472146, 468226, 463808, 459823, 457162, 455803, 454980, 454082, 453200, 452781, 453012, 453722, 454737, 456044, 457586, 459168, 460649, 462090, 463625, 465256, 466792, 467889, 468191, 467640, 466599, 465546, 464742, 464381, 464794]
59942D64794J256J434O70l64r00j021j238j563j598j122j10J442L124M066M000
59927D72870L906M768O175O952O742N932M491K120n79k357k904l083l526l922
59913D97585l866l369k374p50J016J978J935J639J638J711J652J702J861J616
59899E03974P60j55n57m57p8N12J150J578J837K195K582K777L101M138N650O628
59883E35635O585O048N585N184M803M719M984N273N488N816N979N283L649J865
59869F06896N53m21j234j706j851k064k323k046j053j0M83N47N03L99L86Q35J705
59852E99599K475K941L480M282N124O007P184Q248Q122O362L625O66k235m462
59838F51418m895l233o54J425K494K442J007j529l958n318n783n796n137l669
$$ y = [464794, 466050, 467484, 468154, 467790, 466890, 465869, 464631, 463068, 461470, 460348, 460238, 461680, 464804, 468870, 472870, 476776, 481544, 487719, 494671, 501413, 507345, 511836, 513956, 513377, 511020, 508116, 505033, 501507, 497585, 493719, 490350, 487976, 487226, 488242, 490220, 492155, 493794, 495432, 497143, 498795, 500497, 502358, 503974, 504734, 504579, 504022, 503565, 503487, 503999, 505149, 506727, 508564, 510759, 513341, 516118, 519219, 523357, 529007, 535635, 542220, 548268, 553853, 559037, 563840, 568559, 573543, 578816, 584304, 590120, 596099, 601382, 605031, 606896, 607449, 607028, 605794, 604088, 602237, 600173, 597850, 595804, 594751, 594741, 595224, 595771, 596274, 596673, 597059, 597894, 599599, 602074, 605015, 608495, 612777, 617901, 623908, 631092, 639340, 647462, 653824, 657449, 658115, 655880, 651418, 646523, 643290, 642636, 644061, 646555, 648997, 650004, 648475, 644517, 639199, 633416, 627620, 622483, 618814]
59824F18814k209j721k115k673l197l948m841n446n513m977l849k550j850j923
59810E72002k038j641j166j133j181p19oK99J87J15J06j88p70j381k050k904l645
59793E53887l893l857m017m361m502m373m184l816k931j735j027j306k170k758
59779E08957k645k118j675j379r20k66J55J93M70J558K979L720L591L292L286
59764E19198L458L807M510N196N210M708M554M912N073M935N382O651P520P037
59750E92151N986N721O317O795O618O039N423N006M992N181M887L720K130P92
59736F61758j25o86q47p82r57j422j617j301j008j184j526j643j641j593j184
59721F44242m13Q1p9n04q17j170j501j237l59K32P4n6N20J261J513J738K565L452
$$ y = [618814, 616605, 614884, 612769, 610096, 606899, 602951, 598110, 592664, 587151, 582174, 578325, 575775, 573925, 572002, 569964, 568323, 567157, 566024, 564843, 564124, 564118, 564417, 564604, 564719, 564825, 564637, 563867, 562486, 560436, 557532, 553887, 549994, 546137, 542120, 537759, 533257, 528884, 524700, 520884, 517953, 516218, 515191, 513885, 511715, 508957, 506312, 504194, 502519, 501140, 500220, 499954, 500109, 500302, 500772, 502330, 505309, 509029, 512620, 515912, 519198, 522656, 526463, 530973, 536169, 541379, 546087, 550641, 555553, 560626, 565561, 570943, 577594, 585114, 592151, 598137, 603858, 610175, 616970, 623588, 629627, 635050, 640056, 645048, 650229, 655116, 658836, 660966, 661758, 661633, 660947, 660100, 659318, 658361, 656939, 655322, 654021, 653013, 651829, 650303, 648660, 647019, 645426, 644242, 643829, 643910, 643831, 643327, 642510, 641340, 639839, 638602, 638243, 638475, 638549, 638493, 639013, 640274, 641787, 643525, 646090, 649542]
59703F49542L457K735K163J984J852J766J974K340K632L044L614L696K882J824
59689F85505J210N68q87k746l870l949l576l091k462k018k284l115l886m346m640
59674F46413m797m873n278o095o554n952m732l837l402k938k397k063j827j488
59660E90180j436k053k663k187o79P01J245J337J589K117K745L242L318K838J987
59645F02281J024R4n58p00p56j562l145m538n213n712o243n901m219k407j798
59630E60647k036k031j849k142k595k502k378l245m666n141m316l301k835k624
59616E18986k503k773l179k889j825r45q86j202j159n15N56J601K012J666J237
59601E08182J236J143M00l44r0Q48J245Q09L72M62Q80J529K408K901K317J136
$$ y = [649542, 652999, 655734, 657897, 659881, 661733, 663499, 665473, 667813, 670445, 673489, 677103, 680799, 683681, 685505, 686715, 687283, 686396, 683650, 679780, 675831, 672255, 669164, 666702, 664684, 662400, 659285, 655399, 651053, 646413, 641616, 636743, 631465, 625370, 618816, 612864, 608132, 604295, 600893, 597955, 595558, 593495, 591668, 590180, 588744, 586691, 584028, 581841, 581162, 581863, 583108, 584445, 586034, 588151, 590896, 594138, 597456, 600294, 602281, 603305, 603399, 602841, 602141, 601385, 599823, 596678, 592140, 586927, 581215, 574972, 569071, 564852, 562445, 560647, 558611, 556580, 554731, 552589, 549994, 547492, 545114, 541869, 537203, 532062, 527746, 524445, 521610, 518986, 516483, 513710, 510531, 507642, 505817, 504872, 503986, 502784, 501625, 501110, 501666, 503267, 505279, 506945, 508182, 509418, 510561, 510961, 510617, 510527, 511375, 512620, 513429, 513801, 514263, 515143, 516672, 519080, 521981, 524298, 525434]
59585E25434M89M89K73l62p78r92j880l512m600m137k625j251o33p28j178j521
59569E02488j612j847k458k833k365j568j325j363p12M69R56L63l93o59p81r77
59553D85383p50R0Q98J213J351J653J937K120K563L465M519N478O437P449Q422
59538E32228R499J1051J3275J6053J8661J9191J5361P152j942p791r480r006p848
59525F06404n710k591J83J648K369L137L729L604K768J406m05k190l212l513l998
59510F03629n156o491p392p727p531o963o618o849o933n966m489l868m163m096
59496E19387l221k442k105j340P0Q82L99k60J25J036J306J023J176K004K813L115
59480E23968L111L237L694M340M769M737M579M697M853M469L587K767K128J346
$$ y = [525434, 525923, 526412, 526685, 526323, 525545, 524553, 522673, 519161, 514561, 510424, 507799, 506548, 505915, 505187, 504009, 502488, 500876, 499029, 496571, 493738, 491373, 489805, 488480, 487117, 486405, 486874, 487830, 488193, 487800, 487141, 486360, 485383, 484633, 484723, 485621, 486834, 488185, 489838, 491775, 493895, 496458, 499923, 504442, 509920, 516357, 523806, 532228, 541727, 552778, 566053, 582106, 600767, 619958, 635319, 642471, 640529, 632738, 623258, 614252, 606404, 600694, 598103, 598286, 599934, 602303, 605440, 609169, 612773, 615541, 616947, 616542, 614352, 611140, 607627, 603629, 598473, 591982, 584590, 576863, 569332, 562369, 555751, 548902, 541969, 536003, 531514, 527646, 523483, 519387, 516166, 513724, 511619, 510279, 510349, 511231, 511630, 511370, 511495, 512531, 513837, 514860, 516036, 518040, 520853, 523968, 527079, 530316, 534010, 538350, 543119, 547856, 552435, 557132, 561985, 566454, 570041, 572808, 574936, 576282]
59466E76282N49K94N82P32L12m38j083j191l86J092K299K869L781N740P620P956
59450F07010P264P065P263O561N123M447M571L797J506r95k923n000p328q488
59436F29873p839o680o102n526m422l643l727l604k286m96O35J224J907K720L767
59421E95801N686Q445J0872J2374J3897J6244J8723K0357K1326K2428K4223K7064
59409G97440L0119K9995K2841R313m581j3189j6157j6364j5243j2295p392j010
59397H03477O509J3452J5696J0047j465j2910j9989k2602k2458k0578j7528j4148
59385G17503j1111q529o288m203j997J74J496J547J111J233J947K598K844K584
59371G00909J706O22K72O86N70p40j937j572k63L28m1k32L67J370K371L200L562
$$ y = [576282, 576831, 577125, 577707, 578439, 578751, 578313, 577230, 576039, 575653, 576745, 579044, 581913, 585694, 591434, 599054, 607010, 614274, 621339, 628602, 635163, 640286, 644733, 649304, 653101, 654607, 653612, 650689, 645689, 638361, 629873, 622034, 615354, 609252, 603726, 599304, 595661, 591934, 588330, 586044, 585548, 586183, 587407, 589314, 592034, 595801, 601487, 609932, 620804, 633178, 647075, 663319, 682042, 702399, 723725, 746153, 770376, 797440, 827559, 857554, 880395, 889708, 885127, 871938, 855781, 839417, 824174, 811879, 804487, 803477, 809986, 823438, 839134, 849181, 847716, 834806, 814817, 792215, 769757, 749179, 731651, 717503, 706392, 697863, 691575, 687372, 685375, 685549, 687045, 688592, 689703, 690936, 692883, 695481, 698325, 700909, 702615, 703237, 703509, 704195, 704765, 704025, 702088, 700516, 700253, 700581, 700540, 700308, 700675, 702045, 704416, 707616, 711178]
59354G11178L528L897N113O424P146P933R640J1639J2730J3044J3588J4388J4550
59341H34798J3886J3107J2541J1795J0556Q719O032K615n77k728m238n909p627
59328H92970q829r685j0692j1629j1981j1950j1990j1892j1394j1069j1459j1902
59316G58498j1416j0241r298q714q061p481p301p028o058m895m372m074k944j021
59302F65594P69K168L684N424P114Q758R993R218N020j656q097j2486j4877j5845
59288F64781j5616j4474j2798j0659q207o194n077m036k069M07K187L152M176
59275E95573N539O731P602Q452R245R856J0738J2160J3299J3243J2403J1569J0261
59262G26671P643M527K590J824O55j486l540m808n766o630o804o172n494n103
$$ y = [711178, 714706, 718603, 723716, 730140, 737286, 745219, 754859, 766498, 779228, 792272, 805860, 820248, 834798, 848684, 861791, 874332, 886127, 896683, 905402, 911434, 914049, 913472, 910744, 906506, 900597, 892970, 884141, 874456, 863764, 852135, 840154, 828204, 816214, 804322, 792928, 781859, 770400, 758498, 747082, 736841, 727543, 718829, 710768, 703287, 695986, 688958, 682900, 678005, 673633, 669559, 666615, 665594, 666363, 668531, 672215, 677639, 684753, 693511, 703504, 712722, 717742, 716086, 707989, 695503, 680626, 664781, 649165, 634691, 621893, 611234, 603027, 596833, 591756, 587720, 585651, 586058, 588245, 591397, 595573, 601112, 607843, 615445, 623897, 633142, 642998, 653736, 665896, 679195, 692438, 704841, 716410, 726671, 734314, 738841, 741431, 743255, 743910, 742424, 738884, 734076, 728310, 721680, 714876, 708704, 703210, 698107]
59248F98107m467l347k209j238j67Q76J493K062L352N045N958N837N580N555N141
59233G27578M156L329K949K419J541J031J175J128J4k098m619o930q302q356p867
59218G07148q068r011r624r480r314r531r426q363o777n489m754m351l980l374
59204F05606k600k215k470k625j854n71J68L04O62J423J956K128K473L008L153
59189F08546K958L145L834M436M919N843O974P178O196N240N278N837N972N526
59175F81882M885M256L688L181K511J532O94O15J106J386J209R91R39Q20N06K
59159G10203q83k101l006l388m256o410q753r518q845q536r361j0268j0320r818
59145F14740r224q415p431o699o281n962o069p001p950p581o038m759m208l380
$$ y = [698107, 693640, 690293, 688084, 686846, 686679, 687555, 689048, 691110, 694462, 699507, 705465, 711302, 716882, 722437, 727578, 731734, 735063, 738012, 740431, 741972, 743003, 744178, 745306, 745320, 743222, 738603, 731673, 723371, 715015, 707148, 699080, 690069, 680445, 670965, 661651, 652120, 642694, 634331, 627554, 622065, 617311, 612960, 608980, 605606, 603006, 600791, 598321, 595696, 593842, 593271, 593439, 593743, 594405, 595828, 597784, 599912, 602385, 605393, 608546, 611504, 614649, 618483, 622919, 627838, 633681, 640655, 647833, 654029, 659269, 664547, 670384, 676356, 681882, 686767, 691023, 694711, 697892, 700403, 701935, 702629, 703244, 704350, 705736, 706945, 707936, 708875, 709695, 710201, 710203, 709320, 707219, 704213, 700825, 696569, 690159, 681406, 671888, 663043, 654507, 645146, 634878, 624558, 614740, 605516, 597101, 589670, 582971, 576690, 570728, 564659, 557658, 549708, 542127, 536089, 531330, 527122, 523742]
59131E23742j768k29N99J176J912K453K662L009L591L968M308N374P013Q096Q323
59116E74229Q665R541J0065R725R319R521R760R377Q655P990P114N943N135N061
59102F90100N062M445L426K492J594N59m10j068j391j348j020r86j657k368k143
59087F95287j267q45r91q72n70j237l054m726n457n990o996p929q129p863p512
59072F31849o887o018n526n655n784n406m690l839k923k453k981l896l968l197
59058E68626k771l016k933k134j591j907k392k398k219k061j551q27o44r23o19
59043E40640L64P70P2o18m56j00j99k24K82P42Q08J223K420L544L851L954M691
59026E61764N857O942Q038R268J0308J1121J2162J3306J3753J3373J2824J1978
$$ y = [523742, 521974, 521745, 522344, 523520, 525432, 527885, 530547, 533556, 537147, 541115, 545423, 550797, 557810, 565906, 574229, 582894, 592435, 602500, 612225, 621544, 631065, 640825, 650202, 658857, 666847, 673961, 679904, 685039, 690100, 695162, 699607, 703033, 705525, 707119, 707678, 707268, 706200, 704809, 703461, 702441, 701455, 699798, 697430, 695287, 694020, 693175, 692184, 691312, 690742, 689505, 686451, 681725, 676268, 670278, 663282, 655353, 647224, 639361, 631849, 624962, 618944, 613418, 607763, 601979, 596573, 591883, 588044, 585121, 582668, 579687, 575791, 571823, 568626, 565855, 562839, 559906, 557772, 556181, 554274, 551882, 549484, 547265, 545204, 543653, 542826, 542182, 541259, 540640, 541004, 541774, 541846, 541228, 540772, 540672, 540473, 540249, 540531, 541273, 542081, 543304, 545724, 549268, 553119, 557073, 561764, 567621, 574563, 582601, 591869, 602177, 613298, 625460, 638766, 652519, 665892, 678716, 690694]
59014F90694R807O367L172R80j100l517n152n248m720m371l546j736P1R90J661
58999F84352K807L744L687L242L208L203K677K121J987J642O57j76l43q15k353
58984G09640l859l936k988k287j984j437o52M0R54K441M007N127O130P370Q453
58969G27019R199J0178J1369J1631J0538R437R380R506Q732P659P205O666M913
58956H43432K400K91j487l602n685p060q309j0366j2696j4118j4810j5755j6589
58943G35646j5829j3185j0177q312p654p284o330m629k923k142k184k056j417
58930F51524j026j234j269o63j63l89q50j076j495k286k670k272j881j931j692
58915F30627r37q01j758k363j429Q6Q45J355K692M434N579O410P653Q907R573
$$ y = [690694, 700501, 706868, 710040, 711020, 709920, 706403, 701251, 696003, 691283, 686912, 683366, 681630, 681701, 682691, 684352, 687159, 690903, 694590, 697832, 701040, 704243, 706920, 709041, 711028, 712670, 713327, 713151, 712808, 711993, 709640, 705781, 701845, 698857, 696570, 694586, 693149, 692497, 692537, 693491, 695932, 699939, 705066, 711196, 718566, 727019, 736218, 746396, 757765, 769396, 779934, 789371, 798751, 808257, 816989, 824648, 831853, 838519, 843432, 845832, 846123, 844636, 841034, 835349, 828289, 819980, 809614, 796918, 782800, 767990, 752235, 735646, 719817, 706632, 696455, 688143, 680489, 673205, 666875, 662246, 659323, 657181, 654997, 652941, 651524, 650498, 649264, 647995, 647332, 647169, 646780, 645930, 644854, 643359, 641073, 638403, 636131, 634250, 632319, 630627, 629690, 628889, 627131, 624768, 623339, 623425, 624270, 625625, 628317, 632751, 638330, 644740, 652393, 661300, 670873]
58900F70873J0314J1848J3284J3396J2635J2169J1827J0775R442R062R848J1134
58888H06607J2715J4596J6121J6705J6779J6828J6284J4516J1999R393O518L400
58876I62461R81m55k201n062p824r249j0025j1073j1547j0491q980q510q534p716
58862H61775o456n943n852n251m824n833p707q867r207r695j0274j0246r955j0016
58848G51649r754q413p040o987p508p088o244o545p671p990p492p561q240q215
58834F44901p254o376n833n058m334m375m568l686k057j024o57kR05J310J486
58819F03378K161K810K626K468L523M760M331K880K667L776M057K822J732J714
58805F45705J642O55n12j141j559k106k719l685n187o187n532l936l195l652m272
$$ y = [670873, 681187, 693035, 706319, 719715, 732350, 744519, 756346, 767121, 776563, 785625, 795473, 806607, 819322, 833918, 850039, 866744, 883523, 900351, 916635, 931151, 943150, 952543, 959061, 962461, 963442, 962987, 960786, 955724, 947900, 938651, 928626, 917553, 906006, 895515, 886535, 878025, 869491, 861775, 855319, 849376, 843524, 838273, 833449, 827616, 819909, 811042, 801835, 792140, 781866, 771620, 761665, 751649, 741895, 733482, 726442, 719455, 711947, 704859, 698615, 692070, 684399, 676409, 668917, 661356, 653116, 644901, 637647, 631271, 625438, 620380, 616046, 611671, 607103, 603417, 601360, 600336, 599679, 599677, 600582, 601892, 603378, 605539, 608349, 610975, 613443, 616966, 621726, 626057, 628937, 631604, 635380, 639437, 642259, 643991, 645705, 647347, 648002, 647490, 646349, 644790, 642684, 639965, 636280, 631093, 624906, 619374, 615438, 612243, 608591, 604319]
58790F04319m705n281n406m156k206j015m43P21K279L022L145L860M906M973M339
58775F08352M539N505N589M357K841J057j979n645p831q004p716p781p458o696
58761E79130o536o815n991l957k548k581k629j533k2R59J558J942J680Q99M96
58746E54052P42J049J278J819K490K928L784N720P602P762O705O340O859O778
58732F15908N860N447N875O007N522N306N483N297M903N057N193M213K893K946
58718F85910L995M250L926M899P014P991P254O636O878O575N186M006L342J760
58704G59622j072l659n573q129j1391j3504j3944j4583j6377j7764j7507j6463
58692F19656j5432j3798j1488r821r237q443o850n566n123m572l605l206l443
$$ y = [604319, 599614, 594333, 588927, 584771, 582565, 581550, 581107, 581828, 584107, 587129, 590274, 594134, 599040, 604013, 608352, 612891, 618396, 623985, 628342, 631183, 632240, 630261, 624616, 616785, 608781, 601065, 593284, 585826, 579130, 572594, 565779, 559788, 555831, 553283, 550702, 548073, 546540, 546518, 547477, 549035, 550977, 552657, 553556, 554052, 554794, 555843, 557121, 558940, 561430, 564358, 568142, 573862, 581464, 589226, 595931, 602271, 609130, 615908, 621768, 627215, 633090, 639097, 644619, 649925, 655408, 660705, 665608, 670665, 675858, 680071, 682964, 685910, 689905, 694155, 698081, 702980, 709994, 717985, 725239, 731875, 738753, 745328, 750514, 754520, 757862, 759622, 758550, 754891, 749318, 741189, 729798, 716294, 702350, 687767, 671390, 653626, 636119, 619656, 604224, 590426, 578938, 569117, 559880, 551437, 544587, 539021, 533898, 529326, 525721, 522515, 519072]
58679E19072l074k110k136l331l768k596j238n68M05K076L222L485M266O027P339
58664E27071P632Q305R993J1308J1338J0848R956P370L063q95l330n274p305q348
58650E81732q183q306r083q780o792n056m869m953m072l018k557j936p23J98O22
58635E14224J575K932L095K006J583K231J970J88r76l59K74m44j275j067o80o54
58619E24623J14J746K453J757J722L306M552M012K944K499J843P38P61K185K870
58604E58125K004J651K766L197J691K77L90K19j535k811j863n01p60j415p26L69
58588E61078O75J541M143O753P592P857R089J0157R739R141R718J0024Q540O786
58574F62833O737P430P132O645P577R391J0854J2416J4671J6570J7569J9208K2345
$$ y = [519072, 515998, 513888, 511752, 508421, 504653, 502057, 500819, 500251, 500656, 502732, 505954, 509439, 513705, 519732, 527071, 534703, 543008, 553001, 564309, 575647, 586495, 596451, 603821, 606884, 605989, 602659, 597385, 590080, 581732, 573549, 565243, 556160, 547380, 540588, 535532, 530663, 525710, 521638, 518620, 516063, 514127, 513404, 513602, 514224, 515799, 518731, 521826, 523832, 525415, 527646, 529616, 529804, 528828, 528469, 528743, 528299, 527024, 525957, 525277, 524623, 524737, 526483, 528936, 530693, 532415, 535721, 540273, 544285, 547229, 549728, 551571, 552309, 553070, 555255, 558125, 560129, 561780, 564546, 567743, 569434, 569711, 570101, 570320, 568785, 565974, 564111, 563610, 562850, 561435, 560709, 561078, 561753, 563294, 567437, 574190, 581782, 589639, 598728, 608885, 618624, 627765, 637483, 647507, 656047, 662833, 669570, 677000, 684132, 690777, 698354, 707745, 718599, 731015, 745686, 762256, 779825, 799033, 821378]
58561H21378K5239K6570K7606K9144K9301K6950K4126K2183J8830J2136M536n59
58549A067440l392n846p588p691p483q300q711p378o267p747j0854j3586j6392
58536I56205k0097k2938k3214k2547k3084k3731k2427j9894j7795j5579j2435
58525G32464r904r200q455n977l669l752m696m018k533k258k630k406k659m209
58511F66098m826k778m90o99j845j256n7n98j762j337n04j357k468j504J01k69
58495F44449j467q15R15J403J369K675M087L703L329N556Q626R259Q498R653J2275
58480G13515J3411J3177J3955J5506J5858J5590J6491J7427J6148J3490J1274
58469H75842Q112K174m080p161q377j1004j3731j2798q880n938m510j944J878
$$ y = [821378, 846617, 873187, 900793, 929937, 959238, 986188, 1010314, 1032497, 1051327, 1063463, 1067999, 1067440, 1064048, 1058202, 1050614, 1042923, 1035440, 1027140, 1018429, 1011051, 1004784, 997037, 986183, 972597, 956205, 936108, 913170, 889956, 867409, 844325, 820594, 798167, 778273, 760478, 744899, 732464, 722560, 713360, 704905, 698928, 695259, 691507, 686811, 682793, 680260, 678002, 675372, 672966, 670307, 666098, 661272, 658494, 658004, 657305, 655460, 654204, 654147, 653549, 651787, 650450, 649946, 648589, 646121, 644617, 644718, 644449, 642982, 642167, 643082, 644485, 645854, 648529, 652616, 656319, 659648, 665204, 673830, 683089, 691587, 701240, 713515, 726926, 740103, 754058, 769564, 785422, 801012, 817503, 834930, 851078, 864568, 875842, 883954, 886128, 882048, 874887, 866510, 855506, 841775, 828977, 820097, 814159, 809649, 807705, 809583]
58456H09583M709O727R669J2342J2469J1688J3127J5273J4006R485N261J750l338
58443I22751r125j2292j3035j4414j6324j5952j3543j1866j0665p456l259j552
58431G93268j980r50J915L721M190N750Q162Q897Q433R439J1180J0579Q145O923
58417H77672O249K792k671n926o420p458r564r988q736q764j0108r820p835o894
58403G92529o942n473l072k484k803q65K174K333K54K91K654L500K485K917M586
58388G92084L914J377J265L661M170K080J374K922L170J534J673M356O083N899
58374H35562O643Q590Q755P291P688R955J0475R046R028J0398R985Q646J0405
58361I52467J4304J5270J3285J3346J5880J5980J2899J1323J2127J0814O590M062
$$ y = [809583, 814292, 821019, 830688, 843030, 855499, 867187, 880314, 895587, 909593, 919078, 924339, 926089, 922751, 913626, 901334, 888299, 873885, 857561, 841609, 828066, 816200, 805535, 798079, 794820, 793268, 791288, 790338, 792253, 795974, 800164, 805914, 814076, 822973, 831406, 840845, 852025, 862604, 870749, 877672, 883921, 886713, 884042, 878116, 871696, 864238, 854674, 844686, 835950, 827186, 817078, 807258, 799423, 792529, 785587, 780114, 777042, 774558, 771755, 770890, 773064, 775397, 775651, 775942, 778596, 782096, 784581, 787498, 792084, 795998, 797375, 798640, 802301, 806471, 808551, 809925, 812847, 816017, 817551, 819224, 823580, 829663, 835562, 842205, 850795, 859550, 866841, 874529, 884484, 894959, 904005, 913033, 923431, 933416, 942062, 952467, 966771, 982041, 995326, 1008672, 1024552, 1040532, 1053431, 1064754, 1076881, 1087695, 1094285, 1098347]
58349A098347M344L348N09K33K917L575J305J087M192O015N403O855J1132J3154
58335A162416J1741J2010J5467J7135J5385J5063J7787J8643J5795J3917J4791
58324A330150J3807R352O327O802O347L143J601L456M357K725K828N905P468O503
58310A410771P799J2151J4109J2442J2655J6141J7350J4913J4674J8284J9852
58299A571141J7505J6940J9802K0220J6803J6110K0008K1674J8688J7660K1214
58288A777765K2977K0537K0511K5345K8066K5775K5364K9952L2865L1070L1205
58277B071432L6065L8725L6442L6466M1486M3626L9785L8358M3481M7464M6300
58266B519630M7388N3934N7451N4242N3517O0151O5420O4044O4068P0188P3930
$$ y = [1098347, 1102691, 1106039, 1106548, 1106781, 1109698, 1113273, 1114578, 1115665, 1119857, 1125872, 1131275, 1138130, 1149262, 1162416, 1174157, 1186167, 1201634, 1218769, 1234154, 1249217, 1267004, 1285647, 1301442, 1315359, 1330150, 1343957, 1353309, 1359636, 1366438, 1372785, 1375928, 1377529, 1380985, 1385342, 1388067, 1390895, 1396800, 1404268, 1410771, 1418570, 1430721, 1444830, 1457272, 1469927, 1486068, 1503418, 1518331, 1533005, 1551289, 1571141, 1588646, 1605586, 1625388, 1645608, 1662411, 1678521, 1698529, 1720203, 1738891, 1756551, 1777765, 1800742, 1821279, 1841790, 1867135, 1895201, 1920976, 1946340, 1976292, 2009157, 2040227, 2071432, 2107497, 2146222, 2182664, 2219130, 2260616, 2304242, 2344027, 2382385, 2425866, 2473330, 2519630, 2567018, 2620952, 2678403, 2732645, 2786162, 2846313, 2911733, 2975777, 3039845, 3110033, 3183963]
58255C183963P0566O9013P4370P7724P4041P2727P9290Q4400Q2709Q4068R3960
58244D046831J01780J01302J03338J14753J24885J26729J31154J45343J58043
58235E154158J61577J67202J82613J96264K00635K08441K28308K47669K57840
58226G004707K71733K98003L23017L38340L59447L96296M33194M59932M93596
58217A0378265N46055O00768O46940P03979P85258Q72273R53655J053023J187023
58208A7727239J335358J486661J672159J917056K204318K528042K934280L465406
58200C5270519M119558M915785N935690P235232Q774561J0501666J2438746J4614004
58192A03805761J6987553J9529293K2284596K5286335K8523239L2017547L5524848
$$ y = [3183963, 3254529, 3323542, 3397912, 3475636, 3549677, 3622404, 3701694, 3786094, 3868803, 3952871, 4046831, 4148611, 4249913, 4353251, 4468004, 4592889, 4719618, 4850772, 4996115, 5154158, 5315735, 5482937, 5665550, 5861814, 6062449, 6270890, 6499198, 6746867, 7004707, 7276440, 7574443, 7897460, 8235800, 8595247, 8991543, 9424737, 9884669, 10378265, 10924320, 11525088, 12172028, 12876007, 13661265, 14533538, 15487193, 16540216, 17727239, 19062597, 20549258, 22221417, 24138473, 26342791, 28870833, 31805113, 35270519, 39390077, 44305862, 50241552, 57476784, 66251345, 76753011, 89191757, 103805761, 120793314, 140322607, 162607203, 187893538, 216416777, 248434324, 283959172]
58185B83959172L7734157L6081209K8285724J4635878j502343j5856124k5955661
58178C57382012l1789249l4436129l4746006l3234190l0479139k7117928k3597774
58171A41981597k0170814j7037071j4330628j2042802j0097858q470551p155706
58164E2676167o089340n189481m432466l820060l313930k866309k477577k165461
58156B2321543j909927j679116j477883j322671j197030j075698r65719q82894
58148A1810605q13032p35146o59047o03320n58400n06120m54371m18883l90640
58139F671646l53806l17374k97887k87713k70037k49281k38358k30958k13997
58130D212235j93726j83239j77063j62905j46061j38214j34045j22150j07746
$$ y = [283959172, 321693329, 357774538, 386060262, 400696140, 399193797, 383337673, 357382012, 325592763, 291156634, 256410628, 223176438, 192697299, 165579371, 141981597, 121810783, 104773712, 90443084, 78400282, 68302424, 59831873, 52676167, 46586827, 41397346, 36964880, 33144820, 29830890, 26964581, 24487004, 22321543, 20411616, 18732500, 17254617, 15931946, 14734916, 13659218, 12693499, 11810605, 10997573, 10262427, 9603380, 9000060, 8441660, 7935540, 7481169, 7062286, 6671646, 6317840, 6000466, 5702579, 5414866, 5144829, 4895548, 4657190, 4426232, 4212235, 4018509, 3835270, 3658207, 3495302, 3349241, 3211027, 3076982, 2954832, 2847086]
58121B847086j02234j01097r3652q4026q1759q1856p4576o5051o3423o5113o0169
58110A974130n2699n2040n3842m8833m1555m1766m5464m2822l7112l7695m1526
58099A478776l9385l3774l3267l5431l2267k6586k6472k9093k6127j9997j8973
58088A157404k1225j9128j4549j4774j7764j6266j2360j3512j8075j8696j6311
58077I74744j7226j9980j8462j4574j4795j7565j6626j3472j4055j6612j5069
58066G96308j1214j1350j4018j2972r202q360r357p132l668m678q250q278o238
58053F81591q125j2391j2463q891p714q945p652m502m366o326n581l334m485p506
58039E79310o972m115m545p370o989l944l662n954n978m250n492q788q978o714
$$ y = [2847086, 2744852, 2643755, 2550103, 2466077, 2384318, 2302462, 2227886, 2162835, 2099412, 2034299, 1974130, 1921431, 1869391, 1815549, 1766716, 1725161, 1683395, 1637931, 1595109, 1557997, 1520302, 1478776, 1439391, 1405617, 1372350, 1336919, 1304652, 1278066, 1251594, 1222501, 1196374, 1176377, 1157404, 1136179, 1117051, 1102502, 1087728, 1069964, 1053698, 1041338, 1027826, 1009751, 991055, 974744, 957518, 937538, 919076, 904502, 889707, 872142, 855516, 842044, 827989, 811377, 796308, 785094, 773744, 759726, 746754, 737552, 729192, 719835, 712703, 709035, 704357, 696107, 687829, 681591, 673466, 661075, 648612, 639721, 632007, 623062, 615410, 610908, 606542, 600216, 594635, 591301, 586816, 579310, 572338, 568223, 563678, 556308, 549319, 545375, 541713, 535759, 529781, 525531, 520039, 511251, 502273, 495559]
58025D95559p202r929r575o334n468p166o517l261k101l516l368j510j864m070
58011D23678l826j338r76k754k641r06j614m171l962j232p74k858l021q96p08
57996C92001k766k859o28k00j895j371K089M200L435K870L500K887J063Q50J828
57981D05004P89j656j776K3k74k695l325j883j896l371k767m19m06k745l150j008
57965C78445j03j039m31J773J784m72q39J187J544m84j001P00O28k234l994l153
57949C72311k735l620k876k67N78p97m73K381L771K462K239M603O083N166N139
57934C93965P488Q953P754O643P165O801M378K518K263Q94k576n212n685o489
57920D28860q589r421q283q065r485r310o521m470m662m155j637k66j675k754
$$ y = [495559, 488357, 478428, 468853, 462519, 457051, 449885, 443368, 440107, 438006, 434490, 431122, 429612, 427748, 423678, 419852, 418514, 417538, 414784, 412143, 411237, 409623, 405452, 401490, 400258, 399484, 396626, 393605, 392709, 392001, 389235, 386376, 385748, 385548, 383653, 382282, 384371, 388571, 392006, 394876, 398376, 401263, 402326, 403176, 405004, 405793, 404137, 402361, 402384, 402110, 399415, 396090, 394207, 392311, 388940, 386173, 385754, 385348, 382603, 379453, 378445, 378342, 377303, 376872, 378645, 380429, 379957, 379118, 380305, 381849, 381365, 380364, 381064, 381692, 379458, 375464, 372311, 369576, 365956, 363080, 362813, 363391, 362594, 362121, 364502, 368273, 370735, 372974, 377577, 383660, 388826, 393965, 401453, 410406, 418160, 424803, 431968, 438769, 443147, 445665, 447928, 448822, 446246, 441034, 435349, 428860, 420271, 410850, 402567, 394502, 385017, 375707, 369186, 364716, 360054, 355899, 354262, 353996, 352321, 349567]
57906C49567j325K85J57J09J209J109j220k891k108j070j354j108N74J335K07
57891C43476j52J527K653J868J679L300L912J974M13J379K531J768J069K281L438
57876C73116K591J333J265R94l27n22J524L184K522J544K071K387J012j21O32
57861C93205J527J053Q76K159K775J335K03J338K796K542K099L114L938K937J760
57846D23657J923J631o50k797k677j971k878m078l482k110j730j446k2J075L41
57831D04786n61M72K418L299L512M051M006K736K044L216M380L617K211J940J840
57816D43967N78m86K16J275N63j492l645o329r620j1261r795p407o738p017o285
57801C76524n093m973n288m667l713l506l248k031j008j256j492l79R22R60N92
$$ y = [349567, 348242, 348527, 348684, 348793, 350002, 351111, 349891, 347000, 344892, 343822, 342468, 341360, 341934, 343269, 343476, 343324, 344851, 347504, 349372, 351051, 354351, 358263, 360237, 360650, 362029, 364560, 366328, 367397, 369678, 373116, 375707, 377040, 378305, 379299, 378972, 378450, 379974, 383158, 385680, 387224, 389295, 391682, 392694, 392573, 393205, 394732, 395785, 396661, 398820, 401595, 402930, 403133, 404471, 407267, 409809, 411908, 415022, 418960, 421897, 423657, 425580, 427211, 426561, 423764, 421087, 419116, 416238, 412160, 408678, 406568, 404838, 403392, 403370, 404445, 404786, 404225, 404697, 407115, 410414, 413926, 417977, 421983, 424719, 426763, 429979, 434359, 437976, 440187, 442127, 443967, 444545, 444059, 444275, 445550, 446113, 444621, 440976, 434647, 425027, 413766, 403971, 396564, 389826, 382809, 376524, 371431, 366458, 361170, 356503, 352790, 349284, 346036, 344005, 342997, 341741, 340249, 339870, 340792, 341752, 342344]
57786C42344J013J336O75L37J505K910L262L635N009N918N151M350N151O119N381
57771C94096L921L382K905J188n27o20k76j499l704n126n788o420o323m977l842
57756C66390m067m303l231k027j889j483M63K488L019L205M375N197M443L808
57742C76388M797N438L706J648K222M201M287K454J182R22K81n18j89O59M80k57
57726D07701j65K89N9P5J359K318J206l48J77J785J679L8p38l47m59j146j126
57709D12357p15j191j932j476n61q03j420n12J309J977J713K300L479L587K976
57694D21088L329M213L806K438K001K367J802M30o3K84k5p84m96N77R71J148K759
57677D45845N341P154Q746J2126J6763K0213K2575K6475L2416L7975M2187M6821
$$ y = [342344, 343357, 344693, 345368, 345705, 347210, 350120, 353382, 357017, 362026, 367944, 373095, 377445, 382596, 388715, 394096, 398017, 401399, 404304, 405492, 404965, 404345, 404069, 402570, 398866, 393740, 387952, 381532, 375209, 370232, 366390, 362323, 358020, 354789, 352762, 350873, 349390, 349853, 352341, 355360, 358565, 362940, 368137, 372580, 376388, 381185, 386623, 390329, 391977, 394199, 398400, 402687, 405141, 406323, 407245, 407526, 407008, 406819, 407478, 407958, 407701, 407536, 407825, 407884, 407959, 409318, 411636, 412842, 412494, 412671, 414456, 416135, 416173, 415435, 415088, 414629, 413483, 412357, 411642, 410451, 408519, 407043, 406482, 405679, 404259, 403747, 405056, 407033, 408746, 411046, 414525, 418112, 421088, 424417, 428630, 432436, 434874, 436875, 439242, 441044, 441474, 441411, 441695, 441670, 440886, 440390, 440967, 441938, 443086, 445845, 451186, 458340, 467086, 479212, 495975, 516188, 538763, 565238, 597654, 635629, 677816, 724637]
57665G24637N1976N3506M6570L0034O936j7266l6636m7582n0856m9717m6364m1572
57653F23666l6589l2670k9129k4398j8789j3930j0145o867m841n055o027n251
57641D29975k963j490j286p46L52O02J58P77K424K991J857P47N55K77l93k81P58
57624D34314J201N00r0J00K44l2n4J07m94j635j932j156m70j87M40J201J065L91
57606D33513O15J577J675P40L07P68Q63K79J71P33P66P9o3O85J176J031J103J426
57588D47444J003rk54L59N44K01P15K207L086K762K453K715K537J524P19N73K59
57571D68838m31n72j7K67J66O46J621J716O76l7M66J519K475L352L737L059K100
57554D89581K288L440M210M581N619O953P042N924N089M654L431J813J602K664
$$ y = [724637, 776613, 830119, 876689, 906723, 913659, 896393, 859757, 812175, 761319, 711602, 665238, 623666, 587077, 554407, 525278, 500880, 482091, 468161, 458016, 451149, 446308, 441253, 435226, 429975, 427012, 425522, 424236, 423490, 423842, 424444, 424602, 425379, 427803, 430794, 432651, 433398, 433953, 434230, 433837, 433556, 434314, 435515, 436015, 435925, 436025, 436269, 436237, 436183, 436290, 435796, 434161, 432229, 431073, 430603, 430416, 430856, 432057, 433122, 433513, 434128, 435705, 437380, 438120, 438427, 439195, 440058, 440337, 440508, 441241, 442007, 442086, 442023, 442708, 443884, 444915, 446018, 447444, 448447, 448438, 448184, 448543, 449087, 449288, 450003, 452210, 455296, 458058, 460511, 463226, 465763, 467287, 468006, 468579, 468838, 468407, 467835, 467818, 468085, 468251, 468897, 470518, 472234, 472910, 472873, 473339, 474858, 477333, 480685, 484422, 487481, 489581, 491869, 495309, 499519, 504100, 509719, 516672, 523714, 529638, 534727, 539381, 542812, 544625, 546227, 548891]
57540E48891K760J303L06R58K035K530L079L858L796K848K570L423L933L343K773
57525E88406K907K981K825L482M967N752N406N299N995O374O081O313P324P681
57511F61793O866O187O181N725M533L943M309M193L067K184J866Q38p71p94J241
57496G11361K717J844K35r2L93N68Q49J632J940J392J361K487L260K769K523L754
57480G38993N178N347N075N508N817M867L503L111L473L783M246N040N277M537
57466H03755L923M180M427M050L982M759N263M869M893O268P630P431O220N230
57452H76880M536M048M486N797O455N858N520O378P013O261N425N997P145P453
57438I59252P248P292O978N899N348O186P002O490N832O555P793P985P640Q000
$$ y = [548891, 551651, 552954, 553260, 554218, 556253, 558783, 561862, 565720, 569516, 572364, 574934, 578357, 582290, 585633, 588406, 591313, 594294, 597119, 600601, 605568, 611320, 616726, 622025, 628020, 634394, 640475, 646788, 654112, 661793, 668659, 674846, 681027, 686752, 691285, 695228, 699537, 703730, 706797, 708981, 710847, 711685, 710914, 710120, 711361, 714078, 715922, 716157, 716065, 716458, 717026, 717875, 719507, 721447, 722839, 724200, 726687, 729947, 732716, 735239, 738993, 744171, 749518, 754593, 760101, 765918, 770785, 774288, 777399, 780872, 784655, 788901, 793941, 799218, 803755, 807678, 811858, 816285, 820335, 824317, 829076, 834339, 839208, 844101, 850369, 857999, 865430, 871650, 876880, 881416, 885464, 889950, 895747, 902202, 908060, 913580, 919958, 926971, 933232, 938657, 944654, 951799, 959252, 966500, 973792, 980770, 986669, 992017, 998203, 1005205, 1011695, 1017527, 1024082, 1031875, 1039860, 1047500, 1055500]
57424A055500Q526Q131P564Q045Q808Q459P618P799Q665Q772Q158P923Q030P779
57410A169777P687Q703J0211J0870J0824J1067J1313J0528R099Q445Q845R388
57398A286757R699J0096J0433J0353J0258J0653J0998J0483R497R113R636J0595
57386A408571J1497J1818J1174J0299J0642J2255J3446J3331J3072J3560J3850
57375A543515J3245J2856J3410J3507J1998J0214R777R940R375Q873R768J1070
57363A677548J0892R692R472J0581J1724J2450J3308J4094J4162J3972J4391J5028
57351A827314J5082J5169J6277J7714J8051J7409J6919J6622J5883J5176J5390
57340B007006J5989J5791J5094J5042J5492J5355J4666J4390J4629J4699J4616
$$ y = [1055500, 1064026, 1072157, 1079721, 1087766, 1096574, 1105033, 1112651, 1120450, 1129115, 1137887, 1146045, 1153968, 1161998, 1169777, 1177464, 1186167, 1196378, 1207248, 1218072, 1229139, 1240452, 1250980, 1260079, 1268524, 1277369, 1286757, 1296456, 1306552, 1316985, 1327338, 1337596, 1348249, 1359247, 1369730, 1379227, 1388340, 1397976, 1408571, 1420068, 1431886, 1443060, 1453359, 1464001, 1476256, 1489702, 1503033, 1516105, 1529665, 1543515, 1556760, 1569616, 1583026, 1596533, 1608531, 1618745, 1628522, 1638462, 1647837, 1656710, 1666478, 1677548, 1688440, 1698132, 1707604, 1718185, 1729909, 1742359, 1755667, 1769761, 1783923, 1797895, 1812286, 1827314, 1842396, 1857565, 1873842, 1891556, 1909607, 1927016, 1943935, 1960557, 1976440, 1991616, 2007006, 2022995, 2038786, 2053880, 2068922, 2084414, 2099769, 2114435, 2128825, 2143454, 2158153, 2172769]
57329B172769J4889J5277J5300J5367J5977J6535J6372J6086J6405J6757J6470
57318B348204J6295J7037J7858J7729J7338J7687J8016J7294J6506J7213J8786
57307B539963J9456J9167J9050J9041J8364J7646J8020J8803J8494J7470J7305
57296B742779J7984J8196J7887J8125J8871J9244J9506K0465K1377K0896J9673
57285B955003J9575K0640K1274K1140K1389K2138K2222K1429K0732K0420K0090
57274C186052K0190K1297K2228K1301J9242J8346J8950J9321J8884J8886J9640
57263C404337J9864J9132J8573J8620J8370J7708J7840J9104K0213K0279J9840
57252C613880J9493J9190J9099J9546J9913J9221J7885J7182J7151J6721J5791
$$ y = [2172769, 2187658, 2202935, 2218235, 2233602, 2249579, 2266114, 2282486, 2298572, 2314977, 2331734, 2348204, 2364499, 2381536, 2399394, 2417123, 2434461, 2452148, 2470164, 2487458, 2503964, 2521177, 2539963, 2559419, 2578586, 2597636, 2616677, 2635041, 2652687, 2670707, 2689510, 2708004, 2725474, 2742779, 2760763, 2778959, 2796846, 2814971, 2833842, 2853086, 2872592, 2893057, 2914434, 2935330, 2955003, 2974578, 2995218, 3016492, 3037632, 3059021, 3081159, 3103381, 3124810, 3145542, 3165962, 3186052, 3206242, 3227539, 3249767, 3271068, 3290310, 3308656, 3327606, 3346927, 3365811, 3384697, 3404337, 3424201, 3443333, 3461906, 3480526, 3498896, 3516604, 3534444, 3553548, 3573761, 3594040, 3613880, 3633373, 3652563, 3671662, 3691208, 3711121, 3730342, 3748227, 3765409, 3782560, 3799281, 3815072]
57241C815072J5293J5313J5018J4410J4260J4533J4559J4538J4993J5267J4557
57230C977813J3840J4473J5556J5249J4158J4508J6229J6890J5678J4388J4137
57219D142919J3954J3283J3072J3514J3287J1857J0359R421Q240O453M901L939
57207D265199K961K024J892K259K031J547K205L756M466M211M748O499P756P700
57193D319254P523P937Q191Q340R777J2581J4873J5781J6573J7901J8517J7824
57181D475072J7125J7173J6835J5487J4334J4103J3640J2088J0286Q791O717L721
57169D625372J060o20k409m846o743p491q327r902j0872j0328r520r605r736q975
57155D527058q074p778p219n654l971k902j492J009L487M880O070Q223J0678J2122
$$ y = [3815072, 3830365, 3845678, 3860696, 3875106, 3889366, 3903899, 3918458, 3932996, 3947989, 3963256, 3977813, 3991653, 4006126, 4021682, 4036931, 4051089, 4065597, 4081826, 4098716, 4114394, 4128782, 4142919, 4156873, 4170156, 4183228, 4196742, 4210029, 4221886, 4232245, 4241666, 4249906, 4256359, 4261260, 4265199, 4268160, 4270184, 4272076, 4274335, 4276366, 4277913, 4280118, 4283874, 4288340, 4292551, 4297299, 4303798, 4311554, 4319254, 4326777, 4334714, 4342905, 4351245, 4361022, 4373603, 4388476, 4404257, 4420830, 4438731, 4457248, 4475072, 4492197, 4509370, 4526205, 4541692, 4556026, 4570129, 4583769, 4595857, 4606143, 4614934, 4621651, 4625372, 4626432, 4625812, 4623403, 4618557, 4611814, 4604323, 4595996, 4586094, 4575222, 4564894, 4555374, 4545769, 4536033, 4527058, 4518984, 4511206, 4503987, 4498333, 4494362, 4491460, 4489968, 4490977, 4494464, 4499344, 4505414, 4513637, 4524315, 4536437]
57141D536437J2495J2356J1623J0300R024P825N736K664O8j245k211l459m141
57128D597472l822l387k823l16M955J1322J7434K4253L2577M0913M7875N4506
57116D820959O2067O9503P5519Q1335Q9123R9242J11363J26685J46603J70612
57106E853011J97864K29607K68000L14023L68971M36644N21771O27629P57554
57097I575074R17153J111949J343751J611461J913579K246492K601667K968421
57089B4289547L338822L706442M060926M387176M667290M875665M972173M912587
57081E9210628M678167M293651L804449L228349K532838J667520O23754n34894
57073G9504462j696989k755455l643053m333515m823826n119470n230050n171408
$$ y = [4536437, 4548932, 4561288, 4572911, 4583211, 4592235, 4600060, 4605796, 4608460, 4608528, 4607283, 4605072, 4601613, 4597472, 4593650, 4590263, 4587440, 4587124, 4592079, 4603401, 4620835, 4645088, 4677665, 4718578, 4766453, 4820959, 4883026, 4952529, 5028048, 5109383, 5198506, 5297748, 5409111, 5535796, 5682399, 5853011, 6050875, 6280482, 6548482, 6862505, 7231476, 7668120, 8189891, 8817520, 9575074, 10492227, 11604176, 12947927, 14559388, 16472967, 18719459, 21321126, 24289547, 27628369, 31334811, 35395737, 39782913, 44450203, 49325868, 54298041, 59210628, 63888795, 68182446, 71986895, 75215244, 77748082, 79415602, 80039356, 79504462, 77807473, 75052018, 71408965, 67075450, 62251624, 57132154, 51902104, 46730696]
57065D6730696m968869m657226m275272l858066l433090l021155k637237k289435
57057A7590346j979711j707533j472036j270787j099273r53209q29832p26123
57049G551842o37947n62269m98254m44832l99152l58846l23757k93845k67380
57040C765560k42935k21195k02794j86228j69880j54284j40306j26879j12718
57031B208341r8626q5715p2990n8869m3369k6642q168Q916J4907N00l2473p0591
57019A735221r9967j15543j19995j17680j11438j02764r2488q1481p1146o2554
57009G60165n5346m8490m2002l6685l2515k8744k5324k2794k0860j8600j6065
56998D12740j4268j3529j3062j2253j1250j0191q784o834m477k005J48J624K803
$$ y = [46730696, 41761827, 37104601, 32829329, 28971263, 25538173, 22517018, 19879781, 17590346, 15610635, 13903102, 12431066, 11160279, 10061006, 9107797, 8277965, 7551842, 6913895, 6351626, 5853372, 5408540, 5009388, 4650542, 4326785, 4032940, 3765560, 3522625, 3301430, 3098636, 2912408, 2742528, 2588244, 2447938, 2321059, 2208341, 2109715, 2024000, 1951010, 1892141, 1848772, 1822130, 1813962, 1822878, 1837785, 1838285, 1805812, 1735221, 1635254, 1519711, 1399716, 1282036, 1170598, 1067834, 975346, 893865, 822719, 760165, 704819, 656329, 614327, 577642, 545127, 516383, 491059, 468265, 447405, 428805, 412740, 398472, 384943, 371881, 359628, 348378, 338187, 329403, 322569, 318092, 316087, 316235, 317859, 320662]
56985C20662M593P147R632J1555J2964J2862R239J877o408j2657j6515j8877j9604
56972C16470j8348j6107j3934j1375p984n005l514k251M17L629N572O772R244
56959B63586J3158J6972K0258K3528K5492K3278J5836N219n640j4725k0838k3777
56947C42347k4727k4782k3310j9338j3996r585o565l514J74L656O566R618J3090
56934B49634J6470J9715K3328K7193L0497L2399L1421K5202J2937k357j5944k5434
56922D25061l1162l3567l2702k9897k7237k5095k2200j8284j4647j2112j0276
56911A67882q914q212p694o606n350m821m602l638k348k046k538k424j538r46
56897A06205o75L07J913L065L956N905Q808J1092J2438J4284J7320K0659K3713
$$ y = [320662, 325255, 332402, 342034, 353589, 366553, 379415, 388654, 390531, 384123, 371466, 354951, 336074, 316470, 298122, 282015, 268081, 256706, 248722, 243717, 240203, 237952, 238369, 241998, 247570, 254342, 263586, 276744, 293716, 313974, 337502, 362994, 386272, 402108, 407327, 401687, 386962, 366124, 342347, 317620, 292838, 269528, 250190, 236194, 226609, 220044, 216530, 216704, 220360, 226926, 236544, 249634, 266104, 285819, 309147, 336340, 366837, 399236, 430657, 455859, 468796, 466439, 450495, 425061, 393899, 360332, 327630, 297733, 270496, 245401, 223201, 204917, 190270, 178158, 167882, 158968, 150756, 143062, 136456, 131106, 126285, 121683, 118045, 115697, 113651, 111113, 108689, 107151, 106205, 105530, 105837, 107750, 110815, 114771, 120676, 129484, 140576, 153014, 167298, 184618, 205277, 228990]
56884B28990K6473K7540K4363J6500O744j784q016j1987j3609j3182j1514q793
56872B61725m712mL748O276Q993J2856J7424K2251K7517L2944L7863M2795M9217
56859E18893N6963O3032O3387N5186L7903J4231j0064k9212m1051m6816m7998
56848F34454m5177l9363l2051k3704j4165m439L976J1496J9985K9885L9948M9714
56836F30559N9868P0135P9431Q8010R6100R9655R0844O5056K6126j6276n2751
56825A236757p7652q9801r2015q8649q2136p2510o0188m7245l5296k4109j3132
56814E54024k773O608J5442K4020L2256M0713N0237O0192O8249P1681O7329N1568
56802A039546K3724j0207m0394o0815p2005p6486p5105o8861o0574n2379m3859
$$ y = [228990, 255463, 283003, 307366, 323866, 330610, 328826, 320810, 308823, 295214, 282032, 270518, 261725, 257013, 257009, 260757, 267033, 276026, 288882, 306306, 328557, 356074, 389018, 426881, 469676, 518893, 575856, 638888, 702275, 757461, 795364, 809595, 799531, 770319, 729268, 682452, 634454, 589277, 549914, 517863, 494159, 479994, 475555, 479531, 491027, 511012, 540897, 580845, 630559, 690427, 760562, 839993, 928003, 1024103, 1123758, 1214602, 1279658, 1305784, 1289508, 1236757, 1159105, 1069304, 977289, 888640, 806504, 733994, 673806, 626561, 591265, 567156, 554024, 551251, 557859, 573301, 597321, 629577, 670290, 720527, 780719, 848968, 920649, 987978, 1039546, 1063270, 1053063, 1012669, 951854, 879849, 803363, 728258, 659397, 598823, 546444, 502585]
56791E02585l4491k5732j8941j3235p168p79N409J1639J7777K2806K6785L1199
56779E17854L5682L6243K8907J4062m098k1118l4143m1959m5130m5356m3732m0308
56767C56904l5669l1299k7709k3970j9847j6613j4892j3507j1530r677q664p933
56755A35594p022o436o196n279l515k291k386k842k845k882l124k706j574j089
56741H5407j710k022j107L2M33N08N08j58j158j007L76J223R76J208K367K566
56725H8442J003k34L83J347J075O61J485K572K585K286K680K907K134J424J563
56710A12313J246l19j277j68J225P23o05m87P61J360J260J392J265K29l71Q38
56694A19385K445K284R91O73J266J180N70Q89J917K096J444J414K167K424J790
$$ y = [502585, 468094, 442362, 423421, 410186, 403018, 402239, 407648, 419287, 437064, 459870, 486655, 517854, 553536, 589779, 618686, 632748, 628650, 607532, 573389, 531430, 486300, 440944, 397212, 356904, 321235, 289936, 262227, 238257, 218410, 201797, 186905, 173398, 161868, 152191, 143527, 135594, 128572, 122136, 115940, 110661, 107146, 104855, 102469, 99627, 96782, 93900, 90776, 88070, 86496, 85407, 83697, 81675, 80568, 80600, 81033, 81541, 82049, 81891, 80733, 79726, 80102, 81325, 82301, 83509, 85876, 88442, 89445, 89211, 89594, 90941, 92016, 92677, 94162, 96734, 99319, 101605, 104285, 107192, 109326, 110750, 112313, 113559, 113240, 111963, 111795, 113020, 113743, 113138, 112651, 113412, 114772, 116032, 117424, 118689, 118918, 118547, 119385, 121830, 124114, 125105, 125778, 127044, 128224, 128794, 129683, 131600, 133696, 135140, 136554, 138721, 141145, 142935]
56679A42935J097P69P71J517L023L805K566L06j052j258j232j064m22Q3j23k22
56663A51499M80R17O8r32o26J44j86j059r86l91p07j675k070k209l103m069l811
56646A31284l038l333m140l591j769n00l48l06J0K71J031K884M531M162K412J502
56630A31062J880K097J680J561J882J764J195R95R82K16j109j938k206k564k719
56615A34778k002j063j023j562j677j619k097k411j534k41N8k64m3K31n98j833
56599A17100j983j481j738k304j727n06k75o78m9J361J833J415J669K445K067
56584A17149O51J37Q96J348J080J412K535K975K342J933K187K083J520J729K923
56569A42900L852M107M594N526O198O854Q451J0443J1293J1323J2574J5458J7946
$$ y = [142935, 144032, 144801, 145572, 147089, 150112, 153917, 156483, 156789, 155737, 154479, 153247, 152183, 151761, 151844, 151721, 151499, 151979, 152896, 152964, 152032, 151406, 151550, 151364, 150305, 149319, 148928, 148221, 146546, 144476, 142267, 139164, 135095, 131284, 128246, 124913, 120773, 117182, 115413, 114913, 114565, 114259, 114269, 114540, 115571, 118455, 122986, 127148, 129560, 131062, 132942, 135039, 136719, 138280, 140162, 141926, 143121, 144116, 145098, 145314, 144205, 142267, 140061, 137497, 134778, 132776, 131713, 130690, 129128, 127451, 125832, 123735, 121324, 119790, 119549, 119607, 119343, 119300, 119531, 118933, 117100, 115117, 113636, 111898, 109594, 107867, 107361, 107086, 106408, 106359, 107720, 109553, 110968, 112637, 115082, 117149, 117800, 117937, 118833, 120181, 121261, 122673, 125208, 128183, 130525, 132458, 134645, 136728, 138248, 139977, 142900, 146752, 150859, 155453, 160979, 167177, 174031, 182482, 192925, 204218, 215541, 228115, 243573, 261519]
56556B61519J8340J6649J3132P923K426j268k765l283l310k498j567j795k681
56543C00822k636j885k120l393m092l956m263n048n000m277m458n506n794n339
56529B43055n857p215p109n012l188k912k779j834j355k192l073l000k870l436
56515A91223l872l571l295l456l282k555k177k316k033j353j469k351k502j652
56501A55339j326k002k207j265m40n14n67p6Q5l36k29O95J199Q54Q45J680K231
56484A53966J906J549J482Q50l01o06K22Q11O11P00J448J722J171R05J193Q71
56468A68500k08n94R7M43j31l22N14J276J304J321J455P94l77m94M90Q00N1o8
56450A74851R31J332M65Q1J250K674L231L484L526K187l36j822j352o80j060j440
$$ y = [261519, 279859, 296508, 309640, 317563, 319989, 318721, 315956, 312673, 309363, 306865, 305298, 303503, 300822, 298186, 296301, 294181, 290788, 286696, 282740, 278477, 273429, 268429, 264152, 259694, 254188, 248394, 243055, 237198, 229983, 222874, 217862, 214674, 211762, 208983, 207149, 205794, 203602, 200529, 197529, 194659, 191223, 187351, 183780, 180485, 177029, 173747, 171192, 169015, 166699, 164666, 163313, 161844, 159493, 156991, 155339, 154013, 152011, 149804, 148539, 148099, 147585, 147018, 146942, 147027, 146691, 146462, 147157, 148356, 149210, 150055, 151735, 153966, 155872, 157421, 158903, 159753, 159452, 158846, 159068, 159879, 160490, 161190, 162638, 164360, 165531, 166436, 167629, 168500, 168292, 167698, 167795, 168238, 168107, 167785, 168299, 169575, 170879, 172200, 173655, 174449, 174072, 173578, 174068, 174868, 174919, 174851, 175782, 177114, 177579, 177660, 178910, 181584, 184815, 188299, 191825, 194012, 193676, 191854, 190502, 189822, 188762, 187322]
56434A87322j038r36j597j563j88R08N42k57n28q84j430q53J039K366K088J405
56418A86396J166O34j48J77J261O80j906l459k140j0O41M89P64P27k18p28k6M85
56400A84785jl6J024J278k32j355m50P54L54m89j06O31M37K98J322K297J991J630
56382A94132K557L657L589L335L953M094K395K46m65m26j189k260k404k016j955
56367B07243j714q71m86j106j378n42l3o85p95Q72K641K747K169K332K429J524
56351B14347Q72J575K232J455N18R85J868J634R22Q70R36O18J024K464K988J701
56335B37009Q75K345M443N069N031N542N377L566K197L240N065N286M614M673
56321B94332M434K324l90j608j824k400k674j858j493k765l697k313l10j81r65
$$ y = [187322, 186284, 185348, 183751, 182188, 182000, 182908, 183450, 183193, 182665, 181781, 180351, 179498, 180537, 182903, 184991, 186396, 187562, 188196, 188048, 188225, 189486, 190166, 188260, 184801, 182661, 182651, 183292, 183781, 184545, 185272, 185054, 184326, 184300, 184785, 184784, 184748, 185772, 187050, 186818, 185463, 185013, 185767, 186121, 185632, 185526, 186157, 186594, 186892, 188214, 190511, 192502, 194132, 196689, 200346, 203935, 207270, 211223, 215317, 217712, 217958, 217493, 217067, 215878, 213618, 211214, 209198, 207243, 205529, 204658, 204172, 203066, 201688, 201146, 201113, 200428, 199633, 200505, 203146, 205893, 208062, 210394, 212823, 214347, 215219, 216794, 219026, 220481, 220999, 221984, 223852, 225486, 226408, 227278, 228214, 228832, 229856, 232320, 235308, 237009, 237884, 240229, 244672, 249741, 254772, 260314, 265691, 269257, 271454, 274694, 279759, 285045, 289659, 294332, 298766, 301090, 300700, 299092, 297268, 294868, 292194, 290336, 288843, 286078, 282381, 280068, 279758, 279577, 278612]
56306B78612l21J336K243K773M030N064M879N032O850Q314P243N250M882N188
56292C41375M032K571L208N010N318M345M232N079N629O276P781Q652P449N950
56278D16907O430P736P701P355Q835J1118J1841J1583J2358J3719J4248J4975
56266E44806J7351J9805K0437K1010K4069K8162L0423L1875L5448M0624M4915
56255H58925M9002N5512O3966P1752P8930Q7437R6750J04800J12062J20200J27888
56244A827224J32463J34408J35825J35754J31549J23562J13892J01841Q5247O5056
56234B986821M4075K2543n28k3189m2523n9251p5591r0133r9886j05807j11073
56223B445458j15336j15958j13687j11619j09724j05720j00287r5872r1567q4739
$$ y = [278612, 278291, 279627, 281870, 284643, 288673, 293737, 298616, 303648, 310498, 318812, 326055, 331305, 336187, 341375, 345407, 347978, 351186, 356196, 361514, 365859, 370091, 375170, 380799, 387075, 394856, 403508, 410957, 416907, 423337, 431073, 438774, 446129, 454964, 466082, 477923, 489506, 501864, 515583, 529831, 544806, 562157, 581962, 602399, 623409, 647478, 675640, 706063, 737938, 773386, 814010, 858925, 907927, 963439, 1027405, 1099157, 1178087, 1265524, 1362274, 1467074, 1579136, 1699336, 1827224, 1959687, 2094095, 2229920, 2365674, 2497223, 2620785, 2734677, 2836518, 2921765, 2986821, 3030896, 3053439, 3052911, 3029722, 2987199, 2927948, 2852357, 2762224, 2662338, 2556531, 2445458, 2330122, 2214164, 2100477, 1988858, 1879134, 1773414, 1673127, 1577255, 1485688, 1400949]
56213A400949p6683p1053o7518o2707n6529n1851m8607m4095l8550l4780l2693
56202H15883k9763k6273k4559k3838k1394j8091j6858j6691j4251j0609r819j1404
56190E92333j0946p940o350p150p020m926l608l785l047j180p96k009k135r83
56176E30458r22j573k91K150K311N02M34K487L496L199M429O868P141N444N494
56161E71627P581Q234P100P498R688J0402R558J0708J4171J6490J7280J9896K4756
56148G34989K8795L2038L7732M5492N1596N6486O4504P5483Q4347Q9920R6205
56137A397587J03599J06766J02943R4942Q4536P0613N5420M4828M0314L7666L4858
56126B174072L3599L2061K4714J1458j007r018j5404k1738k5731k8471l5663m8875
$$ y = [1400949, 1324266, 1253213, 1185695, 1122988, 1066459, 1014608, 966001, 921906, 883356, 848576, 815883, 786120, 759847, 735288, 711450, 690056, 671965, 655107, 638416, 624165, 613556, 603737, 592333, 581387, 573447, 567097, 559947, 552927, 548001, 544393, 540608, 537561, 536381, 535585, 533576, 531441, 530458, 529536, 527963, 527672, 529822, 532133, 532635, 533069, 535556, 539052, 542251, 546680, 553548, 560689, 566133, 571627, 579208, 587442, 594542, 602040, 611728, 622130, 631688, 642396, 656567, 673057, 690337, 710233, 734989, 763784, 795822, 833554, 879046, 930642, 987128, 1051632, 1127115, 1211462, 1301382, 1397587, 1501186, 1607952, 1710895, 1805837, 1890373, 1960986, 2016406, 2061234, 2101548, 2139214, 2174072, 2207671, 2239732, 2264446, 2275904, 2274897, 2265879, 2250475, 2228737, 2203006, 2174535, 2138872, 2089997]
56114B089997o3200p5701q8084r9106j03206r9467r3504q7891p9103o6503n5414
56103A178818m8192m0852l1693k4770k1670j8414j3605j1075j1469r950n315k470
56091I39343k885j723K382M278K385K061N318O887M537L467O241Q124O734O568
56077I93717R531J0808Q651Q351J1937J3931J1975J1460J4835J6781J4914J4682
56065A141573J8437K0405J7930J6809J9877K1323J8145J6129J8467J9631J6761
56054A345487J5636J9032K0662J7350J5412J8253J9613J6177J4638J8780K1948
56043A542988K0047J9571K4640K8675K7295K6779L1215L4182L1951L1766L7780
56032A856889M2166L9675L7603M1507M4802M2609M1841M6988N0194M6435M4088
$$ y = [2089997, 2026797, 1951096, 1863012, 1763906, 1660700, 1561233, 1467729, 1379838, 1300735, 1234232, 1178818, 1130626, 1089774, 1058081, 1033311, 1011641, 993227, 979622, 968547, 957078, 947128, 941813, 939343, 936458, 934735, 937117, 941395, 943780, 945841, 951159, 958046, 962583, 966050, 972291, 980415, 987149, 993717, 1003248, 1014056, 1022707, 1031058, 1042995, 1056926, 1068901, 1080361, 1095196, 1111977, 1126891, 1141573, 1160010, 1180415, 1198345, 1215154, 1235031, 1256354, 1274499, 1290628, 1309095, 1328726, 1345487, 1361123, 1380155, 1400817, 1418167, 1433579, 1451832, 1471445, 1487622, 1502260, 1521040, 1542988, 1563035, 1582606, 1607246, 1635921, 1663216, 1689995, 1721210, 1755392, 1787343, 1819109, 1856889, 1899055, 1938730, 1976333, 2017840, 2062642, 2105251, 2147092, 2194080, 2244274, 2290709, 2334797]
56021B334797M9153N3770N2027N1962N9447O5769O4187O3256P0078P6224P4479
56010C015149P3516Q1058Q8558Q8051Q7998R6512J05062J05322J05781J14861
56000C961868J24230J26012J29346J42323J55073J58836J63495J77731J91159
55991E330073J95425K02712K22752K42668K51278K61494K85708L11870L28239
55982G632219L48008L83471M20516M46197M76037N24957N78091O21402O72862
55973A2103760P50051Q36690R16926J011306J140371J286336J432962J608116
55965B1086518J841687K119960K432380K823179L342346L991287M779189N781578
55957D8198124P065641Q603172J0335902J2274226J4445028J6806906J9322307
$$ y = [2334797, 2383950, 2437720, 2489747, 2541709, 2601156, 2666925, 2731112, 2794368, 2864446, 2940670, 3015149, 3088665, 3169723, 3258281, 3346332, 3434330, 3530842, 3635904, 3741226, 3847007, 3961868, 4086098, 4212110, 4341456, 4483779, 4638852, 4797688, 4961183, 5138914, 5330073, 5525498, 5728210, 5950962, 6193630, 6444908, 6706402, 6992110, 7303980, 7632219, 7980227, 8363698, 8784214, 9230411, 9706448, 10231405, 10809496, 11430898, 12103760, 12853811, 13690501, 14607427, 15618733, 16759104, 18045440, 19478402, 21086518, 22928205, 25048165, 27480545, 30303724, 33646070, 37637357, 42416546, 48198124, 55263765, 63866937, 74202839, 86477065, 100922093, 117728999, 137051306]
55950A37051306K2047268K5046926K8323667L1905727L5651726L8459294L7806718
55943C56292632L0972370J7459814J73491j6207455k8165636l4818250l7137257
55936B88569709l6492281l3994864l0527120k6749693k3025876j9525509j6393380
55929A01860986j3733917j1523288r669759q130171o890408n887090n038393m318950
55921C6669010l733669l250576k823507k450381k149162j901874j675416j472666
55913A7211759j312914j183975j059652r43919q54496p81974p05823o32894n81439
55904I154673n43519m99571m54443m24198m02026l70807l35883l13324k98269
55895E512633k75486k49378k33994k24391k06423j84663j73152j67902j55041
$$ y = [137051306, 159098574, 184145500, 212469167, 244374894, 280026620, 318485914, 356292632, 387265002, 404724816, 404898307, 388690852, 360525216, 325706966, 288569709, 252077428, 218082564, 187555444, 160805751, 137779875, 118254366, 101860986, 88127069, 76603781, 66934022, 58803851, 51913443, 46026353, 40987960, 36669010, 32935341, 29684765, 26861258, 24410877, 22261715, 20359841, 18684425, 17211759, 15898845, 14714870, 13655218, 12711299, 11856803, 11074829, 10369006, 9736112, 9154673, 8611154, 8111583, 7657140, 7232942, 6830916, 6460109, 6124226, 5810902, 5512633, 5237147, 4987769, 4753775, 4529384, 4322961, 4138298, 3965146, 3797244, 3642203]
55886C642203j37450j27752j22999j11108r5193q7889q8024q5123q0577q2863
55876B623225q8024q5690p8677p6971p8284p3574o5711o3855o5290o1174n4403
55865A831572n3707n5838n1541m3644m1530m3042l9407l2996l2672l6173l4294
55854A366728k8438k7243k9575k7363k1918k1280k4515k4190k1466k3382k8068
55843A089290k7653k3296k2666k5091k3566j9058j8499k0821j9102j4524j4218
55832H60796j7138j5894j1103j0236j3344j3266r308p805r571r268o885p836j1824
55819G17318j3033j1126j1126j2977j1960q754q405j0133q720n007m516o652n828
55806E99081k384j763l641k565J353K825J892L574P505Q227N590M705N740L881
$$ y = [3642203, 3504753, 3377001, 3254002, 3142894, 3047701, 2959812, 2871788, 2786665, 2706088, 2623225, 2535201, 2449511, 2370834, 2293863, 2215579, 2142005, 2076294, 2012439, 1947149, 1885975, 1831572, 1777865, 1722027, 1670486, 1626842, 1585312, 1542270, 1502863, 1469867, 1437195, 1401022, 1366728, 1338290, 1311047, 1281472, 1254109, 1232191, 1210911, 1186396, 1162206, 1140740, 1117358, 1089290, 1061637, 1038341, 1015675, 990584, 967018, 947960, 929461, 908640, 889538, 875014, 860796, 843658, 827764, 816661, 806425, 793081, 779815, 770507, 762702, 753131, 743863, 736978, 729142, 717318, 704285, 693159, 682033, 669056, 657096, 648342, 639937, 629804, 621084, 616077, 611561, 604909, 599081, 596697, 594934, 591293, 588728, 590081, 592906, 594798, 598372, 605877, 614104, 619694, 624399, 630139, 634020]
55792F34020o73k668j789k938o476p780o596p168r057p533l481l117p228j0082
55778E57434r757j0164j2006j1080o777l459k051J268O914J0720J1697J2645J2372
55765E57756O076n252j4266j7527j8477j9276j7855j4436j2766j3218j2119r201
55753D09439q256r385q394n014l836n729o174l735k371l624m080k487j987l292
55739C41075k869O5J678N38l20j6j622n387p117n312l516l675l585k610l360n868
55723B98099o598m939m327n379m611j557k43j647j672J278L482L104L318N684
55709B83992O984N544M311M782L998N90k121k129k185m256o048n980o223p891
55695B73368q440o713n486o237o411m557l181l771l944k195o38m70M12K764L896
$$ y = [634020, 633347, 630679, 628890, 625952, 619476, 611696, 605100, 597932, 588875, 581342, 577861, 574744, 567516, 557434, 547677, 537513, 525507, 514427, 507650, 504191, 502140, 503408, 510322, 521042, 532739, 545384, 557756, 563832, 558580, 544314, 526787, 508310, 489034, 471179, 456743, 443977, 430759, 418640, 409439, 401183, 391798, 383404, 378390, 374554, 368825, 362651, 358916, 356545, 352921, 348841, 346354, 344367, 341075, 338206, 338271, 339949, 340487, 340167, 340151, 338529, 333142, 326025, 320713, 317197, 313522, 309937, 307327, 303967, 298099, 291501, 286562, 282235, 276856, 272245, 270688, 270445, 268798, 267126, 268404, 271886, 274990, 278308, 283992, 290976, 296520, 300831, 305613, 309611, 310201, 308080, 305951, 303766, 299510, 293462, 287482, 281259, 273368, 264928, 258215, 252729, 246492, 240081, 235524, 232343, 228572, 224628, 222433, 221795, 221325, 221737, 224501, 228397]
55680B28397K735K120L534M433L360K678L567L347O08j786j806j613k935l744
55666B42895k548j522k242k633j138K67Q2J69J752K757J861J150J947K221Q46
55651B45864J97J619K499R94m97K37J301M52r42j016r37k145l325l242l370m907
55635B32782o196n825n186n475n358m060l417m420n045l909k708k717k385q20
55621A75261n4j279k369j747j159k026k590j416k79q00j496q89k70q28j276q56
55605A55927j221k904l470j793n34j586k719j721k32l41q47j24N72j04o99O4M92
55588A38760p55j728o55P13L94k57N34J454P97j43L41J069M11n47k68L69L03O77
55570A41469K238L195K431J927L125M008K775J195J173J165n67k299k033j345
$$ y = [228397, 231132, 233252, 236786, 241219, 244579, 247257, 250824, 254171, 254779, 252993, 251187, 249574, 246639, 242895, 240347, 238825, 236583, 233950, 232812, 233079, 233161, 233330, 235082, 237839, 239700, 240850, 242797, 245018, 245864, 246061, 247680, 250179, 251173, 250676, 250913, 252214, 252666, 251724, 250708, 249771, 247626, 244301, 241059, 237689, 232782, 226586, 220761, 215575, 210100, 204742, 200682, 197265, 192845, 187800, 183891, 181183, 178466, 176081, 175261, 175207, 173928, 171559, 169812, 168653, 166627, 164037, 162621, 162342, 161542, 160046, 159157, 158887, 158059, 156783, 155927, 154706, 151802, 148332, 146539, 146005, 144419, 141700, 139979, 139747, 139406, 138559, 138435, 139007, 138903, 138204, 138268, 138760, 138005, 136277, 135622, 136335, 136729, 136472, 137006, 138460, 139257, 139114, 139455, 140524, 140935, 140388, 140120, 140489, 140792, 141469, 143707, 146902, 149333, 151260, 154385, 158393, 161168, 162363, 163536, 164701, 164134, 161835, 159802, 158457]
55556A58457k339l573k847j340j219j629q52o8j132k793k822j872j725j851j096
55541A31299n46j279j564J95K119J997J267K130L147J839n31j008J05L88k67l51
55525A38940k41j185k229j873j191j829k665k096j675l514n950n896l855k444
55511A02297j595L38K233J607o41j386l68Q6k93K52J432J218o2p6J163J308K7
55494A07540n23K70O27j44p44p35j124j836j540k50O22P99J164J484P87l23l91
55477A05683K42J39m28j48M82q8j309j234j4L24n91j110o71m34p87q77o39p88
55459I7752r47j88Q46P09k53m70R7J59l81n36l45m98m67O20J846J735Q03N16O06
55440A01604O9k60R21K353J739l37j274o52l74r81j194q29j011j515r67L13O65
$$ y = [158457, 156118, 152545, 149698, 148358, 147139, 145510, 144658, 144590, 143458, 140665, 137843, 135971, 134246, 132395, 131299, 130753, 129474, 127910, 128105, 130224, 132221, 133488, 135618, 138765, 140604, 140073, 139065, 139170, 139558, 139291, 138940, 138699, 137514, 135285, 133412, 132221, 130392, 127727, 125631, 123956, 120442, 114492, 108596, 104741, 102297, 100702, 101040, 103273, 104880, 104239, 102853, 102485, 102571, 102278, 102530, 103962, 105180, 105118, 105042, 106205, 107513, 107540, 107017, 107287, 107914, 107770, 107026, 106291, 105167, 103331, 101791, 101541, 102163, 102962, 104126, 105610, 106397, 106074, 105683, 105925, 106064, 105636, 105488, 105970, 105882, 104573, 103339, 103325, 103649, 103058, 101948, 101277, 100843, 100056, 99179, 98540, 97752, 96805, 96617, 97463, 98172, 97919, 97449, 97546, 97705, 97324, 96788, 96443, 95945, 95478, 96098, 97944, 99679, 100482, 100998, 101604, 101673, 101413, 102334, 104687, 106426, 106089, 104815, 104163, 103789, 102808, 101614, 100785, 99774, 98259, 97292, 97605, 98270]
55423I8270J26J78O19j61j827k262j128k76l44q5P12O94k10l67N48R09P4o24m08
55404I4438r2j23P4M44K60l0O91J762J305n20j426n22O01O97L89L38K43J74P68
55385I9471J664J682Q49L35L45M7m43j52P40J036N78J09m93j606k072o17J395
55368A02868J447k06j083o67q01j850j889l43Q45N16m7K34O08M09K56L84Lr76
55350I9708j531j377j192q63L18J591J338o4n51K56O55J09j7N54K95j097j822
55333I6310j070l27n75p60j34L41M0j15L66N23j16n60k62l2k09J1P13P66l6l90
55313I4484K50Q21P28P29J098J024L88J20K64j58r32o80M32N53o50j235k69P61
55295I7728P43N74R46R47J83q8P57J388Q18j8j20M5n9L6M41L67k24k71L37M10
$$ y = [98270, 98396, 98574, 99193, 99032, 97205, 94943, 93815, 93539, 93195, 93110, 93822, 94516, 94306, 93939, 94487, 95396, 95470, 94846, 94438, 94346, 94223, 94297, 94741, 95001, 94971, 95662, 97424, 98729, 98209, 96783, 96261, 96862, 97559, 97948, 98286, 98529, 98703, 99471, 101135, 102817, 103666, 104001, 104346, 104393, 103950, 103798, 104538, 105574, 106152, 106261, 105768, 104162, 102090, 101473, 102868, 104315, 104109, 103026, 102359, 101558, 99708, 97819, 97476, 98321, 98837, 98790, 99024, 99632, 100041, 100297, 100681, 100684, 99708, 98177, 96800, 95608, 94745, 95063, 96654, 97992, 97928, 97377, 97633, 98288, 98397, 98380, 98934, 99229, 98132, 96310, 95240, 94913, 94338, 93578, 93444, 93785, 93825, 93710, 94076, 94599, 94483, 93923, 93661, 93629, 93420, 93431, 94144, 94910, 94874, 94484, 94734, 95555, 96283, 97012, 98110, 99134, 99522, 99642, 99906, 99748, 98816, 98136, 98568, 99121, 98471, 97236, 96967, 97728, 98471, 99045, 99991, 100938, 101121, 101033, 101790, 103178, 103996, 103978, 103858, 103903, 103844, 103880, 104321, 104688, 104464, 104193, 104530, 104940]
55275A04940k55l73L29N48J2J41J162J220m09j840j684j095j239j193o8R24M83
55258A01603n83q77m83OQ16J917K210J205P7q8K98N84Q89J032K74j027j424p80
55240A05649n62j117j029m4Q3j196j916r54M4l09p69n8P20L35k21J71N05l63j424
55221I7545j418j086j379j300J40J576J296R0k60Q4j09o08l39M39P12N82O48N14
55203I7127l09j020p53j64k68o78o29n61j113j627j209k38N38J186J686J282Q7
55186I3337l54N17R82j21j245p35K47k85j744k065r59K63J115J934K285J538M64
55169I5174L20R46J360J429J426R90J09k9J137K117J522L52K09N70Q5o67j51J248
55151A08147J773J072J93n63j613k372j862p40o38j635k254j840j139p07l73j78
$$ y = [104940, 104685, 104312, 104641, 105189, 105201, 105342, 106504, 107724, 107315, 105475, 103791, 102696, 101457, 100264, 100196, 101120, 101603, 101020, 100143, 99660, 99666, 100482, 102399, 104609, 105814, 105891, 105803, 106101, 106685, 107574, 108606, 108880, 107853, 106429, 105649, 105087, 103970, 102941, 102897, 102980, 101784, 99868, 98914, 98958, 98649, 97880, 97822, 98542, 98877, 98656, 98827, 99332, 98969, 97545, 96127, 95041, 93662, 92362, 92502, 94078, 95374, 95464, 95204, 95288, 95179, 94571, 94232, 94671, 95383, 95965, 96613, 97127, 96818, 95798, 95045, 94881, 94613, 93935, 93306, 92745, 91632, 90005, 88796, 88558, 89096, 90282, 91968, 93250, 93337, 92983, 93500, 94482, 94361, 93116, 92381, 92628, 92343, 90599, 88534, 87575, 87838, 88953, 90887, 93172, 94710, 95174, 95494, 96440, 97800, 99229, 100655, 101645, 101754, 101725, 102862, 104979, 106501, 106853, 107062, 107632, 107717, 107050, 106899, 108147, 109920, 110992, 111185, 110622, 109009, 106637, 104775, 104035, 103397, 101762, 99508, 97668, 96529, 95822, 95449, 95271]
55135I5271l40l77L40J363J679J157M05l70j189j561j029k8P52J240J456J043
55119I9812J83j82J56J83l76k65J052K082J677Q69P59N12n84j110P3J250M07j208
55101A05290j048N07J031K20m7O82Q82O9n31m20m47p07k62Q36J378J097R32J105
55083A10567Q67K01m1K23L09K93P56J201N81p02j196p03l24l81k12J58M7k47K10
55064A11607J126J347R51R80J233M50j186k011j517j026j312j541j057l91L4N06
55048A08193Q75L95p87j489j218o61k29M29J206J320O64j0m62j106j643j139K56
55031A04594J160R30M40M65O60N49L59L33K83J31K2j43m78m72L59J370J454P15
55013A12731K54M55O62M46M0l78p35o12J27P05N01K30P41J331P96m43j007p93
$$ y = [95271, 94931, 94554, 94894, 96257, 97936, 99093, 99498, 99128, 97939, 96378, 95349, 95321, 96073, 97313, 98769, 99812, 99995, 99813, 99969, 100152, 99776, 99511, 100563, 102645, 104322, 105191, 105950, 106462, 105878, 104768, 104841, 106091, 106498, 105290, 104242, 104749, 105780, 106000, 105953, 106635, 107517, 107586, 107055, 106635, 106188, 105481, 105219, 106055, 107433, 108530, 109462, 110567, 111434, 111635, 111594, 111817, 112126, 112419, 113175, 114376, 114957, 114255, 113059, 112356, 112032, 111651, 111439, 111597, 111644, 111397, 111607, 112733, 114080, 115031, 116011, 117244, 117694, 116508, 114497, 112980, 111954, 110642, 109101, 108044, 107653, 107687, 108193, 109068, 109463, 108676, 107187, 105969, 105308, 105079, 105508, 106714, 108034, 108698, 108688, 108226, 107120, 105477, 104338, 104594, 105754, 106684, 107124, 107589, 108249, 108798, 109157, 109490, 109773, 109904, 109926, 109783, 109305, 108833, 109192, 110562, 112016, 112731, 112985, 113440, 114102, 114548, 114588, 114210, 113475, 112863, 112990, 113695, 114196, 114426, 115167, 116498, 117294, 116851, 115844, 115051]
54995A15051o99o12K21J193Q99l45p65J0M95Ol76k1J60m68j105j005n16n8N75
54976A12640J248J209L67l67m24j20L68J299K389K772K281J587R89K41l80k18
54960A25881M30N24m3l22M1L88K85q5p34j673k052j065L85O05l53q44l07R5k69
54941A20887n58j53L67M76L50k2q26j372p02N37O92k50m05J112K901L498L104
54924A29636K546K136K177L128M586N496N761O244O918O654N183L577K413J150
54910A87605l53j468k359l974o004o821o025n132n030m715l378j828r00l09M6
54895A39355n57j937k484j447j93o6n88q13q45r07m49O37J304J048R11J729K756
54878A37454L156L441M304N266N687N868O080N725M514L277K549J584k17k103
$$ y = [115051, 114352, 113740, 113961, 115154, 116053, 115708, 114943, 114953, 115448, 115454, 115078, 115057, 115217, 114749, 113644, 112639, 112123, 112065, 112640, 113888, 115097, 115464, 115097, 114673, 114553, 114921, 116220, 118609, 121381, 123662, 125249, 126238, 126479, 126099, 125881, 126311, 126835, 126792, 126470, 126511, 126899, 127184, 127099, 126365, 124692, 122640, 121575, 121960, 122565, 122212, 121368, 121061, 121156, 120887, 120329, 120176, 120543, 121019, 121369, 121347, 120521, 119149, 118447, 118984, 119676, 119426, 119021, 120133, 123034, 126532, 129636, 132182, 134318, 136495, 139623, 144209, 149705, 155466, 161710, 168628, 175282, 180465, 184042, 186455, 187605, 187252, 185784, 183425, 179451, 173447, 166626, 160601, 155469, 150439, 145724, 142346, 140518, 139618, 139309, 139355, 138798, 136861, 134377, 132930, 132737, 132671, 132083, 131270, 130425, 129518, 129069, 129706, 131010, 132058, 132969, 134698, 137454, 140610, 144051, 148355, 153621, 159308, 165176, 171256, 176981, 181495, 184772, 187321, 188905, 188688, 186585]
54864A86585l278m158n242n967n814n425n500n646n314m781m336l574k455j791
54850A23304j783j415k99L76j97q87n07J92j20j091j434j027p24p41o29l46j83
54833A12489n4K06L77M31Q19J480J514N87l08l17M2N3L3M08O02L4o89o81p3N59
54813A17512J194J865J994J225J85l91n41m39O5O43L98o47j192o28l3k87o18j73
54795A20132L68J26l27p5M56L53j48k95k21m16n67j90L57O05Q93J460J602Q99
54777A25012K68O11J341J537J569K222L073L197K750K556K780L184L957N146O052
54762A65255O234O279O544O168M490K339O66r82l193n095n596n255n302n661n548
54747A61343n114m858m270k773j292j150j942k222j714j207q17j4R85J475J507
$$ y = [186585, 183307, 179149, 173907, 167940, 162126, 156701, 151201, 145555, 140241, 135460, 131124, 127550, 125095, 123304, 121521, 120106, 119807, 120183, 119986, 119099, 118592, 118784, 118664, 117573, 116139, 115112, 114388, 113647, 113018, 112672, 112489, 112435, 112641, 113018, 113449, 114268, 115748, 117262, 117849, 117541, 117224, 117266, 117319, 117352, 117760, 118362, 118396, 117707, 117026, 116953, 117512, 118706, 120571, 122565, 123790, 123975, 123584, 123043, 122604, 122669, 123312, 123710, 123063, 121871, 121243, 121210, 120923, 120305, 120132, 120500, 120626, 120299, 120224, 120680, 121033, 120885, 120590, 120369, 119953, 119386, 119196, 119553, 120158, 121051, 122511, 124113, 125012, 125280, 125891, 127232, 128769, 130338, 132560, 135633, 138830, 141580, 144136, 146916, 150100, 154057, 159203, 165255, 171489, 177768, 184312, 190480, 194970, 197309, 197975, 196993, 193800, 188705, 183109, 177854, 172552, 166891, 161343, 156229, 151371, 147101, 144328, 143036, 141886, 139944, 137722, 136008, 134801, 133984, 133970, 134955, 136430, 137937]
54732A37937J489J045k31j394j117L28J563K112K480K758K694K750L563M656N119
54717A65752N161N505N736M838K959J097n91k572m400n076m777m638m923m921
54703A59150m462m100l887l374k644k076j394k80M31l05j869k608k103j362r49
54688A28168n01K8J65m1m8J61K45L94Q18Q75Nr44r23n60j120k095j870m90L56
54669A22623Q2j55K31L49l18r14p15j03L43N05K23n84j112m17R31J405P67K02
54651A23343J69j48j018j505j132n91l00J95Q85Q92L5o22m14j7n4l3O26J554K088
54632A23953K056J492M69m67o09j26J50N3J39L93K32j62O4P48N97p32j949k041
54614A24260j498r94k62R00J717J497P16K39J78J62P6p8l36m61j40K52p5j060
$$ y = [137937, 139426, 140471, 140240, 138846, 137729, 138057, 139620, 141732, 144212, 146970, 149664, 152414, 155977, 160633, 165752, 170913, 176418, 182154, 186992, 189951, 191048, 190457, 187885, 183485, 178409, 173632, 168994, 164071, 159150, 154688, 150588, 146701, 143327, 140683, 138607, 137213, 136933, 137364, 137059, 135190, 132582, 130479, 129117, 128168, 127667, 127695, 127860, 127819, 127771, 127932, 128177, 128571, 129389, 130264, 130269, 129325, 128402, 127842, 126722, 124627, 122757, 122267, 122623, 122705, 122550, 122781, 123130, 122812, 121898, 121183, 121080, 121423, 121928, 122151, 121567, 120455, 120038, 120969, 122374, 123141, 123343, 123512, 123364, 122346, 120841, 119709, 119118, 118818, 119013, 119898, 120790, 120825, 120203, 119789, 119772, 119718, 119685, 120311, 121865, 123953, 126009, 127501, 127970, 127503, 126894, 126768, 126918, 126971, 127110, 127503, 127735, 127573, 127637, 128385, 128982, 128250, 126301, 124260, 122762, 121768, 121506, 122406, 124123, 125620, 126336, 126575, 126753, 126915, 126991, 126913, 126577, 126116, 125976, 126228, 126153, 125093]
54596A25093j673j366p10k84R3O49J068J061P29J29p52j446j279m12L13N87P62
54579A22562Q23L97j31J35J009J284O73L53J040J877J830J019jj063j850j631
54563A28326m06O65P12K78L20Q33J105P26j71j058j146p4J307J659R13K61K82
54546A34532J96n79j334j182k84O98J496K020J995J393O19j7m70n35o8L52L5n75
54528A38292m53K01J34q04j298p78l32p23j121p26k00l84q16o90j88J64N44J139
54510A31961J358P82M9j88l40r21j362q77J91R32J143J099P05j11p25n80j38j58
54492A32820m70l83R1L45J76o9q9K48J049J995K322J698Q03M03L81K41J7PJ9l10
54472A41294q17r54n00L24J128J526J372J070J155J476J437J034Q28P52J29q15
$$ y = [125093, 123420, 122054, 121344, 121060, 121153, 121802, 122870, 123931, 124660, 124789, 124037, 122591, 121312, 120900, 121213, 121800, 122562, 123385, 123782, 123651, 123786, 124795, 126079, 126752, 127105, 128145, 130022, 131852, 132871, 132870, 131807, 129957, 128326, 127920, 128585, 129297, 129575, 129895, 130728, 131833, 132559, 132388, 131330, 130184, 130110, 131417, 133076, 133989, 134250, 134532, 134728, 134149, 132815, 131633, 131349, 132047, 133543, 135563, 137558, 138951, 139570, 139553, 139083, 138548, 138480, 138832, 138867, 138292, 137839, 138040, 138174, 137370, 136072, 135294, 134962, 134239, 133118, 132392, 132192, 131808, 130992, 130302, 130114, 130278, 130822, 131961, 133319, 134101, 134150, 133962, 133622, 132701, 131339, 130462, 130653, 131585, 132728, 133827, 134532, 134421, 133696, 133116, 132978, 132820, 132350, 131967, 132058, 132403, 132579, 132510, 132421, 132669, 133718, 135713, 138035, 139733, 140536, 140939, 141320, 141561, 141578, 141585, 141604, 141294, 140477, 139523, 139023, 139347, 140475, 142001, 143373, 144443, 145598, 147074, 148511, 149545, 150373, 151125, 151254, 150439]
54456A50439q01N12J553Q56r04j936j565n13L69O30Q0r17j413r46k13%o1K25O28
54437A46023M56k63q21p90k47N73J275J357Q41L77K74L7o17j023n90J24K13k17
54419A46982l52O5O31J014J133R10M51Q6k60j095k236k424j006Q04J306M70l60
54402A46119m82l26j74L78J521K709L296L095K173P03q52j842j863r38N95K139
54386A56251K952K602J280l85j646j895j075J4M24J33m4L60J052J748K503L068
54370A67342K912K177J702J735J611J109J007J687K364K389K199K123J441k92
54356A91506k019k530k186k113k298j903q72j6J84j99j107k271k890k583k220
54341A66483k604k931j868J57J300Q24j45n40n91p78p61j10P89J204J005N47o
$$ y = [150439, 149638, 150150, 151703, 152559, 151655, 149719, 148154, 147641, 148010, 148640, 148720, 147803, 146390, 145444, 145231, 145231, 145170, 145395, 146023, 146479, 146216, 145395, 144605, 144358, 144931, 146206, 147563, 148404, 148781, 149055, 149092, 148475, 147452, 146862, 146986, 147199, 146982, 146630, 146695, 147326, 148340, 149473, 150383, 150834, 150920, 150660, 149565, 147329, 144905, 143899, 144703, 146009, 146479, 146119, 145637, 145311, 145137, 145515, 147036, 149745, 153041, 156136, 158309, 159012, 158160, 156318, 154455, 153517, 154112, 156251, 159203, 161805, 163085, 162700, 161054, 159159, 158084, 158098, 158522, 158655, 158611, 158971, 160023, 161771, 164274, 167342, 170254, 172431, 174133, 175868, 177479, 178588, 179595, 181282, 183646, 186035, 188234, 190357, 191798, 191506, 189487, 186957, 184771, 182658, 180360, 178457, 177585, 177569, 177753, 177554, 176447, 174176, 171286, 168703, 166483, 163879, 160948, 159080, 159237, 160537, 161361, 161216, 160676, 160085, 159307, 158546, 158436, 159225, 160429, 161434, 161981, 161975]
54324A61975p39j523j848j286m2J098J510J312J024P69L11k67n45m82m42m12P
54307A60420O10N54l28j118j225j242j720k081j607p33m23p26q45k53Q80J948
54291A52111K184J202k67r03m72j01m11n35K44J058P47l29q84m67M44J412K096
54274A57129K043J347Q38Q04M66l99n66O51J758J106n51j270q84o57o86J15J602
54257A62846K251J665J214J726K256J844J005O97R62J247J212P50j03r62j406
54242A77204j560j732j636q09L54R64R38Q58P48P7r91j554j302q46o13l61K5K18
54224A69982Q5k38q17j657k086j478m28p0l27j33O17P66j66j149j230p08k17K27
54206A60973O30N45j30o65n07r6r5m29o01m48j01L79Q99J214J149P39M2q00j391
$$ y = [161975, 161236, 159713, 157865, 156579, 156537, 157635, 159145, 160457, 161481, 162250, 162561, 162294, 161749, 161267, 160825, 160413, 160420, 161030, 161584, 161256, 160138, 158913, 157671, 155951, 153870, 152263, 151530, 151107, 150381, 149536, 149283, 150163, 152111, 154295, 155497, 155230, 154327, 153855, 153754, 153343, 152808, 153052, 154110, 154857, 154528, 153644, 153177, 153621, 155033, 157129, 159172, 160519, 161357, 162161, 162627, 162228, 161662, 162313, 164071, 165177, 164626, 163356, 162472, 161815, 161129, 161244, 162846, 165097, 166762, 167976, 169702, 171958, 173802, 174807, 175504, 176466, 177713, 178925, 179675, 179572, 178610, 177204, 175644, 173912, 172276, 171467, 171821, 172785, 173723, 174581, 175329, 175406, 174415, 172861, 171559, 170713, 170100, 169739, 169764, 169982, 170067, 169829, 169012, 167355, 165269, 163791, 163363, 163293, 162966, 162833, 163450, 164216, 164050, 162901, 161671, 160963, 160746, 160973, 161603, 162148, 162018, 161353, 160846, 160750, 160655, 160226, 159625, 159177, 159076, 159455, 160354, 161568, 162717, 163456, 163498, 162698, 161307]
54187A61307j394j015o58l02K72P66O49O2k55P3Q00J602K244K311J619P18L00
54170A69099K05j76p47q44m11p3o8l6J04j0m52q80j158j321j073k01O75O81r1
54151A63223q52j309j567j228Q6J443J381O4p88l46L44K36k33j93K78N00J49n97
54133A60591j203q60P12K445K790J625L19j81j96j76J3L07K14j51M2R17J477J172
54115A69857P53J008J638K134K765L856M841M834L706K095P71K85O62J193J131
54100B01529O62N20P14N39j63q02j147j466j520o81O43J092K18r84j733k283k704
54083A92434k370j325p31j144j586j161l08K67O48Q46L24p37j027p5P32K94m08
54066A84673q4N74J98p23n61O85J302M40q37j295r17l47N7K53L57O23J157J632
$$ y = [161307, 159913, 158898, 158240, 157938, 158210, 158976, 159625, 159687, 159432, 159505, 160305, 161907, 164151, 166462, 168081, 168799, 169099, 169304, 169128, 168381, 167537, 167126, 167053, 166985, 166949, 167053, 167043, 166591, 165711, 164553, 163232, 162159, 161958, 162633, 163314, 163223, 162371, 161062, 159495, 158267, 158353, 159796, 161177, 161241, 160453, 160107, 160451, 160687, 160454, 160261, 160539, 161039, 161188, 160591, 159388, 158528, 159240, 161685, 164475, 166100, 166419, 166238, 166042, 165866, 165879, 166186, 166400, 166249, 166291, 167208, 168685, 169857, 170610, 171618, 173256, 175390, 178155, 182011, 186852, 191686, 195392, 197487, 198258, 198543, 199205, 200398, 201529, 202191, 202711, 203425, 203964, 203801, 202999, 201852, 200386, 198866, 198185, 198828, 199920, 200138, 199154, 197421, 195138, 192434, 190064, 188739, 188008, 186864, 185278, 184117, 183809, 184076, 184724, 185570, 185894, 185157, 184130, 184055, 184787, 185081, 184673, 184589, 185163, 185361, 184638, 184077, 184762, 186064, 186504, 185667, 184372, 183455, 183108, 183165, 183418, 183775, 184398, 185555, 187187]
54048A87187J718J567J457J327J122J235K036L264M319M841M756M243L944M450
54034B27466N264N147L945L099L649M747N041M515L984L571K928K220J715R80
54020B78271k77j159p72J2n47k504m024l819k580j727j867k752l859m512m190
54005B43694l135k326k533l548m398m158k743j076l25p09j449j920k277k715k833
53990B07549k325j586j044n22J03L49l0k91K62J163J564J593J843K085J681Q75
53974B13269N29Q05J218J804L053M785O276P408Q508Q962P391L641n27l312m680
53959B59130n711o850p459o802m973k903j606j254j043k25R07J459J202Q70J210
53944B25952K226L445M475N186N582N653N285M512L806L699L922L533K272J123
$$ y = [187187, 188905, 190472, 191929, 193256, 194378, 195613, 197649, 200913, 205232, 210073, 214829, 219072, 223016, 227466, 232730, 237877, 241822, 244921, 248570, 253317, 258358, 262873, 266857, 270428, 273356, 275576, 277291, 278271, 277994, 276835, 276063, 276075, 275528, 273024, 269000, 265181, 262601, 260874, 259007, 256255, 252396, 247884, 243694, 240559, 238233, 235700, 232152, 227754, 223596, 220853, 219777, 219452, 218743, 217294, 215374, 213097, 210382, 207549, 205224, 203638, 202594, 202072, 202175, 202524, 202494, 202203, 202465, 203628, 205192, 206785, 208628, 210713, 212394, 213269, 213798, 214603, 215821, 217625, 220678, 225463, 231739, 239147, 247655, 256617, 264008, 267649, 267122, 263810, 259130, 253419, 246569, 239110, 232308, 227335, 224432, 222826, 221572, 220529, 220304, 221211, 222670, 223872, 224742, 225952, 228178, 231623, 236098, 241284, 246866, 252519, 257804, 262316, 266122, 269821, 273743, 277276, 279548, 280671]
53930B80671R50J255J080N96O75J334J733J703K068L242M465M830M416L952L918
53915C16888M293M825N251N449N464N260M618L535K448J716J121L71k59m86p96
53900C59698j881l340l917l190k232k316l508m866n548n483n281n631o519p072
53886B98914o581n520n020n333n508m765l488k510k022j739j718k307l349m079
53872B44975l977l371k920k704k264j484r78j305k110k528k284j921j901k012
53858B13216j759r66J37J035J138L22o78r95p54q04j286j326m64M61M93j60o92
53841B06918r03j109j342j338j077o58lQ03J252J049O44O11Q81J090J233J407
53825B09458J290O08k39o26n01k40k6J28J63K40P79J702K240K051J869K360L015
$$ y = [280671, 281621, 282876, 283956, 284552, 285227, 286561, 288294, 289997, 292065, 295307, 299772, 304602, 309018, 312970, 316888, 321181, 326006, 331257, 336706, 342170, 347430, 352048, 355583, 358031, 359747, 360868, 361239, 360980, 360494, 359698, 357817, 354477, 350560, 347370, 345138, 342822, 339314, 334448, 328900, 323417, 318136, 312505, 305986, 298914, 292333, 286813, 281793, 276460, 270952, 266187, 262699, 260189, 258167, 256428, 254710, 252403, 249054, 244975, 240998, 237627, 234707, 232003, 229739, 228255, 227277, 225972, 223862, 221334, 219050, 217129, 215228, 213216, 211457, 210491, 210628, 211663, 212801, 213123, 212445, 211450, 210696, 209892, 208606, 207280, 206816, 207277, 207770, 207610, 206918, 206015, 204906, 203564, 202226, 201149, 200491, 200488, 201291, 202543, 203592, 204236, 204847, 205728, 206818, 208051, 209458, 210748, 211356, 211117, 210491, 209990, 209750, 209724, 209852, 210015, 210255, 211034, 212736, 214976, 217027, 218896, 221256, 224271]
53808B24271L024K588K437K633K814L080L574L718L075K469L014M281M834M329
53794B70141L734L539L227K633K356K472K184J249O42J097J948K062J211q1j408
53779B97006k598l464m009m547n255n817n816n249m474l881l676l765l848l777
53765B36830l644l359k599j526r99j425j916j436m18j50q47j406j051k20L72M97
53749B16703J67n00r64o35J64M55j9m84l92p4J43N52J357K135K450K384K058J302
53731B26802K28m78l57K04O21Q70J208J561J658J534J406J272R70M96Q3j6K46
53714B38308O16P69P73J132K070L038L396L316L468L955M179L747K919K146J674
53699B75506J645K051K595K973L284L751M249M526M609M502L827K443J024K36
$$ y = [224271, 227295, 229883, 232320, 234953, 237767, 240847, 244421, 248139, 251214, 253683, 256697, 260978, 265812, 270141, 273875, 277414, 280641, 283274, 285630, 288102, 290286, 291535, 292177, 293274, 295222, 297284, 298495, 298414, 297006, 294408, 290944, 286935, 282388, 277133, 271316, 265500, 260251, 255777, 251896, 248220, 244455, 240607, 236830, 233186, 229827, 227228, 225702, 224703, 223278, 221362, 219926, 219508, 219358, 218511, 217105, 216054, 215834, 216206, 216703, 216870, 216370, 215406, 214771, 214935, 215390, 215371, 214887, 214495, 214421, 214564, 215116, 216473, 218608, 221058, 223442, 225500, 226802, 227030, 226552, 226195, 226399, 227020, 227890, 229098, 230659, 232317, 233851, 235257, 236529, 237499, 237995, 238078, 238062, 238308, 238924, 239693, 240466, 241598, 243668, 246706, 250102, 253418, 256886, 260841, 265020, 268767, 271686, 273832, 275506, 277151, 279202, 281797, 284770, 288054, 291805, 296054, 300580, 305189, 309691, 313518, 315961, 316985, 317221]
53685C17221k61j112j957j952j399j476k373k959k634k185k278k287j370P5R08
53670B93961P26J64r3j5n9n22j047r86k89K56J03k92l85n33j140j340J2K273L386
53651B94180K524R85J82R7K08O18J517K475L057L382L558L346K853K761L255L528
53635C28526K915J871J273J385J925K540K809K440J811J638J849J649R44P02J396
53620C55673K134K050J533J344J395J370J703K895M383N065M688L923L336L019
53606C94511K956L096L210L115K844K384J614P83M43N62L48o11j624j837j299
53591D10495n65Q8M96L31l86r49q99p43j212k175k977l326l248k626j498m90k72
53574C90044p48j276j451j245q19n53q57j535j817j425r92j004j074q15o68r89
$$ y = [317221, 316960, 315848, 313891, 311939, 310540, 309064, 306691, 303732, 301098, 298913, 296635, 294348, 292978, 293053, 293961, 294687, 294851, 294758, 294743, 294684, 294162, 293115, 292129, 291840, 292096, 292199, 291907, 291522, 290989, 289849, 288509, 288521, 290794, 294180, 296704, 297689, 297871, 297968, 298176, 298794, 300311, 302786, 305843, 309225, 312783, 316129, 318982, 321743, 324998, 328526, 331441, 333312, 334585, 335970, 337895, 340435, 343244, 345684, 347495, 349133, 350982, 352631, 353575, 354277, 355673, 357807, 359857, 361390, 362734, 364129, 365499, 367202, 370097, 374480, 379545, 384233, 388156, 391492, 394511, 397467, 400563, 403773, 406888, 409732, 412116, 413730, 414513, 414956, 415518, 415866, 415255, 413631, 411794, 410495, 409930, 410018, 410514, 410845, 410459, 409510, 408611, 407868, 406656, 404481, 401504, 398178, 394930, 392304, 390806, 390316, 390044, 389296, 388020, 386569, 385324, 384505, 383952, 383095, 381560, 379743, 378318, 377326, 376322, 375248, 374433, 373765, 372776]
53558C72776j050J7J706K613K211J251N77M16O84J190J518J419J265J559K074
53543C90226K220K078K371L290M155M339M012L753L921M563N593O808P939Q840
53529D54108R459R772R846R969J0417J1105J1621J1667J1433J1504J2333J3725
53517E86959J4980J5720J6356J7403J8658J9587K0293K1328K2582K3223K2931
53506H00020K2376K2221K2370K2525K2699K2775K2221K0804J9050J7622J6677
53495A031360J6155J6062J6188J6105J5840J5916J6446J6819J6665J6372J6284
53484A210212J6103J5581J5057J4780J4376J3528J2578J1882J1207J0252R125
53473A354681P845O034L620J126j150l526o007p960r237j0628j2431j3605j3305
$$ y = [372776, 371726, 371743, 373449, 376062, 378273, 379524, 380101, 380517, 381201, 382391, 383909, 385328, 386593, 388152, 390226, 392446, 394524, 396895, 400185, 404340, 408679, 412691, 416444, 420365, 424928, 430521, 437329, 445268, 454108, 463567, 473339, 483185, 493154, 503571, 514676, 526297, 537964, 549397, 560901, 573234, 586959, 601939, 617659, 634015, 651418, 670076, 689663, 709956, 731284, 753866, 777089, 800020, 822396, 844617, 866987, 889512, 912211, 934986, 957207, 978011, 997061, 1014683, 1031360, 1047515, 1063577, 1079765, 1095870, 1111710, 1127626, 1144072, 1160891, 1177556, 1193928, 1210212, 1226315, 1241896, 1256953, 1271733, 1286109, 1299637, 1312215, 1324097, 1335304, 1345556, 1354681, 1362526, 1368560, 1372180, 1373306, 1372156, 1368630, 1362623, 1354663, 1345426, 1334798, 1322367, 1308762, 1295457]
53460A295457j2366j2176j2846j3592j4260j5248j6421j7280j7844j8393j8622
53449A126409j8079j7078j6329j5901j5404j4734j3863j2347r942p321n316l857
53437I76238k431j073j02O16J280J641J703K265L725N163N719O103P429R249J0348
53422A027873J0881J2023J3844J5289J6145J7288J8896K0053K0437K0865K1840
53411A215434K2952K4063K5763K8119L0161L1220L1721L2340L3267L4667L6835
53400A546542L9478M1731M3304M4783M6508M8023M8962M9547M9961N0060M9971
53389B058870N0073N0075M9151M7298M5573M4507M3307M1129L8228L5112L1477
53378B534800K6891K1916J7696J4568J1731Q221L885o78n017r612j5457k2550
$$ y = [1295457, 1283091, 1270915, 1258069, 1244477, 1230217, 1214969, 1198548, 1181268, 1163424, 1145031, 1126409, 1108330, 1091252, 1074923, 1059022, 1043618, 1028884, 1015021, 1002674, 992732, 985411, 980095, 976238, 973807, 972734, 972632, 973248, 974528, 976169, 977872, 980137, 983862, 989025, 994744, 1000847, 1008276, 1017525, 1027873, 1038754, 1050777, 1064621, 1079910, 1096055, 1113343, 1132239, 1152292, 1172729, 1193594, 1215434, 1238386, 1262449, 1288212, 1316331, 1346492, 1377712, 1409433, 1441773, 1475040, 1509707, 1546542, 1586020, 1627751, 1671055, 1715838, 1762346, 1810369, 1859331, 1908878, 1958839, 2008899, 2058870, 2108943, 2159018, 2208169, 2255467, 2301040, 2345547, 2388854, 2429983, 2468211, 2503323, 2534800, 2561691, 2583607, 2601303, 2615871, 2627602, 2635823, 2639708, 2639030, 2634013, 2624401, 2608944, 2586394]
53366B586394k9377l4511l8212m1569m4551m6220m6627m6963m7640m7734m6810
53355B116180m5843m5574m5223m3742m1404l9105l6999l4788l2814l1778l1675
53344A687235l1791l1505l0548k8851k6676k4578k2718k0662j8335j6527j5767
53333A419277j5209j3532j0682p939o387o090o651p829r365j0865j2063j2966
53321A299699j3547j3592j2968j1852j0624r655r160r061q918q186o714m966l608
53308A176848k836k245j406m10M53J389K989N379P917R991J1621J3047J4314J5583
53294A252634J7301J9482K1336K2229K2545K2877K2893K1890K0071J8376J7181
53283A478815J6126J5058J4088J2775J0287O588K611r14m030o836r149j1087j3152
$$ y = [2586394, 2557017, 2522506, 2484294, 2442725, 2398174, 2351954, 2305327, 2258364, 2210724, 2162990, 2116180, 2070337, 2024763, 1979540, 1935798, 1894394, 1855289, 1818290, 1783502, 1750688, 1718910, 1687235, 1655444, 1623939, 1593391, 1564540, 1537864, 1513286, 1490568, 1469906, 1451571, 1435044, 1419277, 1404068, 1390536, 1379854, 1371915, 1365528, 1359438, 1352787, 1344958, 1335593, 1324728, 1312665, 1299699, 1286152, 1272560, 1259592, 1247740, 1237116, 1227461, 1218301, 1209240, 1200322, 1192136, 1185422, 1180456, 1176848, 1174012, 1171767, 1170361, 1169951, 1170404, 1171793, 1174782, 1180161, 1188078, 1198069, 1209690, 1222737, 1237051, 1252634, 1269935, 1289417, 1310753, 1332982, 1355527, 1378404, 1401297, 1423187, 1443258, 1461634, 1478815, 1494941, 1509999, 1524087, 1536862, 1547149, 1553737, 1556348, 1555434, 1551404, 1544568, 1535419, 1524332, 1511180]
53270A511180j5371j7065j7844j8243j9049k0501k2332k4088k5260k5677k5842
53259A279908k6304k6750k6438k5545k5170k5728k6262k5683k4033k2126k0641
53248A005228j9912j9936k0138j9741j8763j8121j8358j8770j8160j6147j3450
53237H03732j1208j0145r995r706q509o802n513m854m371m003m146m717n152n448
53223G09163o287p859r550j1015j2583j4236j5217j5178j4866j5025j5316j4910
53211E57121j3615j1921j0435r561r247q859p903o941p038q185r212r436r357
53198D35411r490r611r620r951j0554j0519r477q295p693p135n998m806m350m376
53184C23536m184l860l874m015l776l324l173l226l010k515k026j496q20l11k55
$$ y = [1511180, 1495809, 1478744, 1460900, 1442657, 1423608, 1403107, 1380775, 1356687, 1331427, 1305750, 1279908, 1253604, 1226854, 1200416, 1174871, 1149701, 1123973, 1097711, 1072028, 1047995, 1025869, 1005228, 985316, 965380, 945242, 925501, 906738, 888617, 870259, 851489, 833329, 817182, 803732, 792524, 782379, 772384, 762678, 754169, 747367, 741854, 737000, 732629, 728626, 724480, 719763, 714611, 709163, 702876, 695017, 685467, 674452, 661869, 647633, 632416, 617238, 602372, 587347, 572031, 557121, 543506, 531585, 521150, 511589, 502342, 493483, 485580, 478639, 471601, 463416, 454204, 444768, 435411, 425921, 416310, 406690, 396739, 386185, 375666, 366189, 357894, 350201, 343066, 337068, 332262, 327912, 323536, 319352, 315492, 311618, 307603, 303827, 300503, 297330, 294104, 291094, 288579, 286553, 285057, 284237, 283926, 283671]
53169B83671l67l46m74r28j092m23M88O55J05l44l86l92n04m93l83m42o10o35
53151B77100o58j003j515j732j603j429j297j138j066j134r69l12K94J13o91j211
53135B61749r73k98L75R23J313J473J424J190P00J09p4M18J106J321R90N46L20
53118B72612L94P72J227J388J283J399J786J698O71n95j126r37p21p59r20j301
53102B76871j969k384j976j103o52q25j154j397j687j920j910j954k466l069k955
53087B49450k057j080m16J09M70K80l71p56m36K34P26Q33M93k31q06n40M51J143
53069B47496P93j95q91q93n35k63k25l44o07j151j998k723k680j746n35L23Q26
53052B34652J250J572J640J626J767J883J628J014K99m55j228j684j532j051p98
$$ y = [283671, 283304, 282958, 282484, 281556, 280464, 280041, 280529, 281184, 281289, 280945, 280559, 280167, 279663, 279170, 278787, 278345, 277735, 277100, 276442, 275439, 273924, 272192, 270589, 269160, 267863, 266725, 265659, 264525, 263556, 263244, 263538, 263651, 262960, 261749, 260776, 260478, 260853, 261776, 263089, 264562, 265986, 267176, 267876, 267985, 267911, 268329, 269435, 270756, 271746, 272292, 272612, 273006, 273778, 275005, 276393, 277676, 279075, 280861, 282559, 283230, 282635, 281509, 280572, 279851, 279092, 278172, 276871, 274902, 272518, 270542, 269439, 268787, 267962, 266808, 265411, 263724, 261804, 259894, 257940, 255474, 252405, 249450, 247393, 246313, 245897, 246006, 246476, 246756, 246385, 245629, 245193, 245427, 246153, 246986, 247479, 247248, 246442, 245902, 246353, 247496, 248289, 248094, 247203, 246310, 245775, 245512, 245287, 244943, 244336, 243185, 241187, 238464, 235784, 234038, 233503, 233826, 234652, 235902, 237474, 239114, 240740, 242507, 244390, 246018, 247032, 247331, 246876, 245648, 243964, 242432, 241381, 240583]
53037B40583q37p98m90l1M76R41J127R22O42N98O24M51K81M46P38O52J81k11k98
53018B45997k11k5K97O31Q38J050J333J346Q22K30K73Q52J191Q63J55n48j145
53001B53949j526j488j074o26l80k37L9N75J201J463J029K56r0J11J70k28l69
52984B52775M43J751K563K635K412K153J887J804J915J633M86j024j954k021j524
52969B65934o64L28Q06M48m1K01R43J387J439J476J302N59k34l23j77q95k319
52952B70170l092k687j962j594j279p79m58l88j91q2q27k203k741j665L8J079
52936B51339J360J350R83O1r75j540j622j420q77j30K38J2j52L17R82J053N03
52919B51482j12n37q79j093r53m23L65J303K163K495J971P67n35j248r33J55J046
$$ y = [240583, 239746, 238948, 238458, 238427, 238903, 239844, 240971, 241893, 242535, 243133, 243757, 244208, 244489, 244935, 245673, 246325, 246506, 246295, 245997, 245786, 245761, 246058, 246689, 247527, 248577, 249910, 251256, 252078, 252308, 252581, 253433, 254624, 255487, 255642, 255094, 253949, 252423, 250935, 249861, 249235, 248855, 248618, 248657, 249232, 250433, 251896, 252925, 253181, 253091, 253202, 253372, 253144, 252775, 253218, 254969, 257532, 260167, 262579, 264732, 266619, 268423, 270338, 271971, 272457, 271433, 269479, 267458, 265934, 265270, 265598, 266404, 266852, 266811, 267012, 267955, 269342, 270781, 272257, 273559, 274118, 273884, 273561, 273384, 272489, 270170, 267078, 264391, 262429, 260835, 259556, 258777, 258319, 257931, 257740, 257658, 256831, 254628, 251887, 250222, 250260, 251339, 252699, 254049, 255032, 255093, 254118, 252578, 250956, 249536, 248659, 248529, 248767, 248779, 248627, 248944, 249926, 250979, 251482, 251370, 250833, 249954, 248861, 247908, 247485, 247850, 249153, 251316, 253811, 255782, 256549, 256014, 254766, 253833, 253988, 255034]
52902B55034R39J53l50k52r7k44l80j67K65O58Q60P00J97j25J11L46j77j017j052
52883B55402l46j38p23q40K31J364J373Q42J077K132L008L156K674J649L78k03
52867B71036N94K083K937K806K385K079J555O28k82p45q62j030j518k270k955
52852B76441l279l394l667l972l699k757j938j879k174k034j393q05o25q70j447
52837B42508k047k157j655j053p06k79M67R71O56n7k96rJ96J11P1J43O9r1j5J53
52817B36980n6n44o60k68j6k75m31K25J403K070J662O04k67n31l31j4K05K35K8
52798B40019l51p17j026j500k144k420j797o22J32J03q8J29N00N32L41L66O16
52781B32073O69K89k98o50m44J78N51J55n78o60R5P12M15l54p05n09j90J42N71
$$ y = [255034, 255973, 256126, 255776, 255524, 255427, 255183, 254803, 254636, 254901, 255559, 256419, 257119, 257316, 257191, 257302, 257648, 257471, 256454, 255402, 255056, 254918, 254195, 253355, 253586, 254950, 256323, 257165, 258242, 260374, 263382, 266538, 269212, 270861, 271239, 271036, 271630, 273713, 276650, 279456, 281841, 283920, 285475, 286103, 285821, 285076, 284214, 283184, 281666, 279396, 276441, 273162, 269768, 266101, 262129, 258430, 255673, 253735, 251856, 249682, 247648, 246255, 245450, 244825, 243955, 242508, 240461, 238304, 236649, 235596, 234890, 234611, 235078, 236049, 236705, 236648, 236352, 236343, 236539, 236650, 236721, 236864, 236933, 236842, 236827, 236980, 236924, 236380, 235720, 235452, 235436, 235161, 234730, 234955, 236358, 238428, 240090, 240694, 240427, 239896, 239565, 239551, 239756, 239991, 240019, 239668, 238951, 237925, 236425, 234281, 231861, 230064, 229442, 229574, 229677, 229589, 229718, 230218, 230750, 231091, 231457, 232073, 232742, 233031, 232733, 232083, 231639, 231817, 232368, 232523, 231945, 231285, 231380, 232092, 232507, 232153, 231448, 230939, 230749, 230891, 231462]
52762B31462P15P8j028j552q79N47J798K287K011J305N70P9k6K99Q67J233J162
52745B40928J046J345J733J508Q69Q49J668K153J445L40R7N79O52l6p25q13m74
52728B53164r8J33N4l35n96l15J84K24k33o23p18p89q45m86K95Q43P06K25o8j99
52708B50523n12r91j231r96n26k06j09J6K79M20K48J02M60J148J465J164O42J02
52690B51998p48j784k085j150J88P88O86P27J157J432J177M62o34j885k518j904
52674B45907o15O0j84l50L30J357J808J514R92P02P59J032J177R17M71M04R03
52657B57184J455J469R50M47N42J405K623L380L098J886K82j315k660l399l281
52642B64066k640k116j904j655j180p24m93k99J23P93J560K178K303J779J050
$$ y = [231462, 232177, 232255, 231227, 229675, 228796, 229343, 231141, 233428, 235439, 236744, 237314, 237393, 237367, 237666, 238533, 239766, 240928, 241974, 243319, 245052, 246560, 247429, 248278, 249946, 252099, 253544, 253884, 253981, 254560, 255212, 255176, 254451, 253638, 253164, 253066, 253199, 253253, 252918, 252322, 252007, 252191, 252415, 252182, 251559, 250841, 250052, 249207, 248721, 249016, 249859, 250565, 250790, 250722, 250523, 250011, 249020, 247789, 246793, 246267, 246061, 245952, 245968, 246247, 246667, 246915, 247017, 247477, 248625, 250090, 251254, 251896, 251998, 251250, 249466, 247381, 246231, 246419, 247207, 247893, 248620, 249777, 251209, 252386, 252848, 252214, 250329, 247811, 245907, 245292, 245352, 245168, 244818, 245148, 246505, 248313, 249827, 250819, 251521, 252280, 253312, 254489, 255406, 255877, 256281, 257184, 258639, 260108, 261058, 261505, 262047, 263452, 266075, 269455, 272553, 274439, 274721, 273406, 270746, 267347, 264066, 261426, 259310, 257406, 255751, 254571, 253847, 253354, 253055, 253178, 253971, 255531, 257709, 260012, 261791, 262841]
52627B62841Q37J373K200K745K658J705m6j810k488j892j053r16j181r72k58R1
52611B63834l55r45q53j28N32P25O57N69M01P6k20l07k80k94k91k18k58m50l56
52592B61839L82J306J592J205R07J049J134P77L09L2l52r96j301p78L1L04J55
52575B67595L30R33J365J302R69N12j04o00n33qM04N07N78O15K58l97p43o64r28
52556B71391k003l117l131k001q18m11n22m36J6L66K97J10K62O20O33J84j42P1
52538B61369L94J38o02j036o96O5O76J018J355J765J897J354L26l58m0R33J598
52521B70156J538J206J024Q42N46M88Q51J136Q91N23P33J569K568L426L904L511
52505B94912K095M68m20p18j301k365l236l491l405l217k752j948j088l87J04
$$ y = [262841, 263678, 265051, 267251, 269996, 272654, 274359, 274313, 272503, 270015, 268123, 267070, 266154, 264973, 264001, 263743, 263834, 263479, 262534, 261681, 261553, 262085, 262810, 263467, 264036, 264437, 264513, 264293, 263986, 263706, 263412, 263121, 262903, 262645, 262195, 261839, 262221, 263527, 265119, 266324, 267231, 268280, 269414, 270191, 270500, 270532, 270180, 269184, 267883, 267105, 267136, 267440, 267595, 267925, 268858, 270223, 271525, 272494, 273006, 272902, 272302, 271769, 271761, 272165, 272672, 273250, 273865, 274123, 273726, 272983, 272319, 271391, 269388, 266271, 263140, 261139, 260321, 259910, 259388, 258952, 258968, 259334, 259631, 259741, 260003, 260623, 261256, 261440, 261298, 261369, 261763, 261901, 261299, 260263, 259567, 259632, 260308, 261326, 262681, 264446, 266343, 267697, 268023, 267665, 267625, 268558, 270156, 271694, 272900, 273924, 274766, 275312, 275800, 276651, 277787, 278678, 279201, 279934, 281503, 284071, 287497, 291401, 294912, 297007, 297475, 297055, 296337, 295036, 292671, 289435, 285944, 282539, 279322, 276570, 274622, 273534, 273147, 273251]
52490B73251J50m83j427j846j361l55N89J128J101O29K33L18O14O45N65Q51J304
52473B75906J224N37p1k02o8K37R32J782K106J850J873K714L804M275L937L105
52457C03941K065J060K56m96j410k156k217j936k296l351l922l333k417k100j964
52442B79724j196k05k9o41j037q99r58j517j739q79M78J122P60K68M03Q31O61
52425B75147k56j008o96M75J538J933J907J839J680J303R15Q94J396K309L335
52410B92711M089M409M708N637P279Q989J0110J0521J0328R397P381M115o5m225
52396C75384p140q196p955p412o752n463l625k237j931k086j735q43r9J56J73
52381C20239K54M60P61J090J299J367J562K097K790L292L570L917M550N382O112
$$ y = [273251, 273401, 272918, 271491, 269645, 268284, 267929, 268518, 269646, 270747, 271376, 271609, 271927, 272541, 273186, 273751, 274602, 275906, 277130, 277667, 277596, 277394, 277326, 277563, 278495, 280277, 282383, 284233, 286106, 288820, 292624, 296899, 300836, 303941, 306006, 307066, 307322, 306826, 305416, 303260, 301043, 299107, 296811, 293460, 289538, 286205, 283788, 281688, 279724, 278528, 278323, 278294, 277653, 276616, 275717, 274759, 273242, 271503, 270624, 271102, 272224, 272984, 273252, 273655, 274486, 275147, 274891, 273883, 273187, 273662, 275200, 277133, 279040, 280879, 282559, 283862, 284777, 285671, 287067, 289376, 292711, 296800, 301209, 305917, 311554, 318833, 327822, 337932, 348453, 358781, 368178, 375559, 379674, 379609, 375384, 368244, 360048, 352093, 344681, 337929, 332466, 328841, 326604, 324673, 322587, 320852, 320009, 319910, 320066, 320239, 320493, 320953, 321714, 322804, 324103, 325470, 327032, 329129, 331919, 335211, 338781, 342698, 347248, 352630, 358742]
52366C58742O397N945M611K463p3k171k992k387j075J35J034J663J758J142M04
52351C75596L35Q19J052R47J330K546L704L834L135K558K619L143L794M381M895
52336D14688N558O640Q049R358J0362J1248J2158J3022J3945J5170J6547J7614
52324E54359J8440J9767K1934K4244K5761K6241K5966K5194K4241K3602K3489
52313H13238K3546K3378K3036K2738K2575K2713K3330K4024K3877K2535K0719
52302A065709J9165J7697J5786J3581J1735J0496R507Q175N924K467j702n486
52290A173054q204j0065j1435j2308j2863j3695j4826j5165j3877j1649r751q267
52278A030949o297l598r33J087K635M076N605P466R812J2197J3886J4743J5279
$$ y = [358742, 365139, 371084, 375695, 378158, 378085, 375914, 372922, 370535, 369460, 369595, 370629, 372292, 374050, 375192, 375596, 375931, 376750, 377802, 378749, 380079, 382625, 386329, 390163, 393298, 395856, 398475, 401618, 405412, 409793, 414688, 420246, 426886, 434935, 444293, 454655, 465903, 478061, 491083, 505028, 520198, 536745, 554359, 572799, 592566, 614500, 638744, 664505, 690746, 716712, 741906, 766147, 789749, 813238, 836784, 860162, 883198, 905936, 928511, 951224, 974554, 998578, 1022455, 1044990, 1065709, 1084874, 1102571, 1118357, 1131938, 1143673, 1154169, 1163676, 1171851, 1177775, 1180242, 1178540, 1173054, 1164850, 1154785, 1143350, 1131042, 1118179, 1104484, 1089658, 1074493, 1060616, 1048967, 1039216, 1030949, 1024652, 1021054, 1020121, 1021208, 1023843, 1027919, 1033524, 1040990, 1050802, 1062999, 1076885, 1091628, 1106907]
52265A106907J5826J6214J6327J6345J6408J6511J6798J7393J7877J7545J6283
52254A290434J4728J3364J1980J0215Q119N894L414M43k865o058q970j1897j5071
52241A313730j8114k0323k1587k2619k4026k5414k5986k5821k5788k6151k6101
52230A051800k5022k3483k2363k1646k0656j9066j7085j5022j3214j1963j1019
52219H51261r577p416n546n009n409n479m739l712k740j602k62Q81J602J998J952
52204H06203J252K54k34rL21L24L42Q36J730K666L477M103M408M370M203M131
52188H38377M230M505M775M553L441J722J44j025k304m196o383p930q159p202
52174H24548n924n250n395n723n448m409l006j621m29M52J013J562K491L814N144
$$ y = [1106907, 1122733, 1138947, 1155274, 1171619, 1188027, 1204538, 1221336, 1238729, 1256606, 1274151, 1290434, 1305162, 1318526, 1330506, 1340721, 1348840, 1354734, 1358148, 1358591, 1355726, 1349668, 1340698, 1328801, 1313730, 1295616, 1275293, 1253706, 1231087, 1207061, 1181647, 1155661, 1129840, 1104052, 1077901, 1051800, 1026778, 1003295, 980932, 959286, 938630, 919564, 902479, 887457, 874243, 862280, 851261, 841684, 834268, 828722, 823713, 818304, 812825, 808086, 804374, 801634, 800032, 799770, 800651, 802253, 804251, 806203, 807455, 807709, 807475, 807466, 807787, 808111, 808453, 809289, 811019, 813685, 817162, 821265, 825673, 830043, 834246, 838377, 842607, 847112, 851887, 856440, 859881, 861603, 861747, 860722, 858418, 854222, 847839, 839909, 831750, 824548, 818624, 813374, 807979, 802256, 796808, 792399, 789393, 787772, 787343, 787795, 788808, 790370, 792861, 796675, 801819]
52159H01819O137O688O824O624O154N341M110K768J948J892K131K200K281K713
52145H59630L294L644L919M523N358N950O178O300O450O677P276Q402R578J0325
52131I47504J1164J3155J6413J9842K2485K4508K6623K9161L1871L4291L6050
$$ y = [801819, 807956, 814644, 821468, 828092, 834246, 839587, 843697, 846465, 848413, 850305, 852436, 854636, 856917, 859630, 862924, 866568, 870487, 875010, 880368, 886318, 892496, 898796, 905246, 911923, 919199, 927601, 937179, 947504, 958668, 971823, 988236, 1008078, 1030563, 1055071, 1081694, 1110855, 1142726, 1177017, 1213067]
$$ [...]
##END NTUPLES=NMR SPECTRUM
##END=
