##TITLE=AC1329_ISIAH12158_6535987_FYheWWhY05
##JCAMPDX= 6.0         $$ Bruker NMR JCAMP-DX V2.0
##DATA TYPE= NMR SPECTRUM
##DATA CLASS= NTUPLES
##ORIGIN= BRUKER
##OWNER= Administrator
$$ 1.72 TOPSPIN		Version 2.1
$$ 2013-07-18 15:05:23.747 -0700  Administrator@X
$$ Compression mode = diff/dup
##.OBSERVE FREQUENCY= 400.02188249412
##.OBSERVE NUCLEUS= ^1H
##.ACQUISITION MODE= SIMULTANEOUS (DQD)
##.ACQUISITION SCHEME= undefined
##.AVERAGES= 8
##.DIGITISER RES= 22
##SPECTROMETER/DATA SYSTEM= spect
##.PULSE SEQUENCE= zg30
##.SOLVENT NAME= COFFEE_meoh
##.SHIFT REFERENCE= INTERNAL, COFFEE_meoh, 1, 14.98509
##AUDIT TRAIL= $$ (NUMBER, WHEN, WHO, WHERE, PROCESS, VERSION, WHAT)
$$ ##TITLE= Audit trail, TOPSPIN		Version 2.1
$$ ##JCAMPDX= 5.01
$$ ##ORIGIN= Bruker BioSpin GmbH
$$ ##OWNER= Administrator
$$ $$ E:\/data/COFFEE/nmr/AC1329_ISIAH12158_6535987_FYheWWhY05/10/pdata/1/auditp.txt
$$ ##AUDIT TRAIL=  $$ (NUMBER, WHEN, WHO, WHERE, PROCESS, VERSION, WHAT)
(   1,<2013-07-18 15:05:16.997 -0700>,<Administrator>,<X>,<go>,<TOPSPIN 2.1>,
      <created by zg
	started at 2013-07-18 15:04:10.169 -0700,
	POWCHK enabled, PULCHK disabled,
       configuration hash MD5:
       C8 4E 4E 5D D3 5C D8 9E 9F 52 82 E0 59 8A DE 15
       data hash MD5: 64K
       FF F5 2C 6B 6A 76 8D 09 79 FB 51 52 92 99 44 5E>)
(   2,<2013-07-18 15:05:19.794 -0700>,<Administrator>,<X>,<proc1d>,<TOPSPIN 2.1>,
      <Start of raw data processing
       efp LB = 0 FT_mod = 6 PKNL = 1 PHC0 = 0 PHC1 = 0 SI = 32K 
       data hash MD5: 32K
       58 42 3F 3F 78 4F 4F 3B 90 30 C6 80 6A 76 20 81>)
(   3,<2013-07-18 15:05:20.075 -0700>,<Administrator>,<X>,<proc1d>,<TOPSPIN 2.1>,
      <pk PHC0 = 97.8717 PHC1 = 0 
       data hash MD5: 32K
       C8 AA 0D C7 45 22 97 FC 23 4E DE 04 A4 1F 53 58>)
(   4,<2013-07-18 15:05:20.185 -0700>,<Administrator>,<X>,<proc1d>,<TOPSPIN 2.1>,
      <abs ABSG = 1 
       data hash MD5: 32K
       76 B7 C5 3D 8F 1A 9B C0 77 FF 74 FD EA B1 74 CF>)
(   5,<2013-07-18 15:05:20.247 -0700>,<Administrator>,<X>,<proc1d>,<TOPSPIN 2.1>,
      <abs ABSG = 2 
       data hash MD5: 32K
       BD 72 CA 1B 1A 04 06 F8 EC 9A 84 8A AE C7 FE 3D>)
(   6,<2013-07-18 15:05:20.310 -0700>,<Administrator>,<X>,<proc1d>,<TOPSPIN 2.1>,
      <abs ABSG = 3 
       data hash MD5: 32K
       93 89 55 CA 59 41 F7 98 28 B0 B1 19 6C AC 0D 37>)
(   7,<2013-07-18 15:05:20.372 -0700>,<Administrator>,<X>,<proc1d>,<TOPSPIN 2.1>,
      <abs ABSG = 4 
       data hash MD5: 32K
       7E 96 13 E2 01 4A E3 05 2B BB 65 AF 9D F1 9A 53>)
(   8,<2013-07-18 15:05:20.419 -0700>,<Administrator>,<X>,<proc1d>,<TOPSPIN 2.1>,
      <abs ABSG = 5 
       data hash MD5: 32K
       34 83 07 1F 79 6F F5 29 00 5E AA 42 4A E4 8D EF>)
$$ ##END=
$$ 
$$ $$ hash MD5
$$ $$ 04 3F 5E 97 B4 14 2E B9 A8 A1 C0 11 CA 0B 3A B1
##$RELAX= 
##$RELAX= 
##$RELAX= 
##$RELAX= 
##$RELAX= 
##$RELAX= 
##$RELAX= 
$$ Bruker specific parameters
$$ --------------------------
##$DU= <E:\>
##$EXPNO= 10
##$NAME= <AC1329_ISIAH12158_6535987_FYheWWhY05>
$$ [...]
##$TP= (0..7)
150 150 150 150 150 150 150 150
##$TP07= 0
##$TPNAME0= <>
##$TPNAME1= <>
##$TPNAME2= <>
##$TPNAME3= <>
##$TPNAME4= <>
##$TPNAME5= <>
##$TPNAME6= <>
##$TPNAME7= <>
##$TPOAL= (0..7)
0.5 0.5 0.5 0.5 0.5 0.5 0.5 0.5
##$TPOFFS= (0..7)
0 0 0 0 0 0 0 0
##$TUNHIN= 0
##$TUNHOUT= 0
##$TUNXOUT= 0
##$USERA1= <user>
##$USERA2= <user>
##$USERA3= <user>
##$USERA4= <user>
##$USERA5= <user>
##$V9= 5
##$VALIST= <valist>
##$VCLIST= <CCCCCCCCCCCCCCC>
##$VD= 0
##$VDLIST= <DDDDDDDDDDDDDDD>
##$VPLIST= <PPPPPPPPPPPPPPP>
##$VTLIST= <TTTTTTTTTTTTTTT>
##$WBST= 1024
##$WBSW= 4
##$XGAIN= (0..3)
0 0 0 0
##$XL= 0
##$YL= 0
##$YMAX_a= 591426
##$YMIN_a= -503769
##$ZGOPTNS= <>
##$ZL1= 120
##$ZL2= 120
##$ZL3= 120
##$ZL4= 120
##$ABSF1= 14.98509
##$ABSF2= -5.573092
##$ABSG= 5
##$ABSL= 3
##$ALPHA= 0
##$AQORDER= 0
##$ASSFAC= 0
##$ASSFACI= 0
##$ASSFACX= 0
##$ASSWID= 0
##$AUNMP= <proc_prof1d_extract_pilot.lims>
##$AXLEFT= 0
##$AXNAME= <>
##$AXNUC= <1H>
##$AXRIGHT= 0
##$AXTYPE= 0
##$AXUNIT= <>
##$AZFE= 0.1
##$AZFW= 0.1
##$BCFW= 0
##$BC_mod= 0
##$BYTORDP= 0
##$COROFFS= 0
##$CY= 15
##$DATMOD= 1
##$DC= 0
##$DFILT= <>
##$DTYPP= 0
##$F1P= 0
##$F2P= 0
##$FCOR= 0.5
##$FTSIZE= 32768
##$FT_mod= 6
##$GAMMA= 0
##$GB= 0
##$INTBC= 1
##$INTSCL= 1
##$ISEN= 128
##$LB= 0
##$LEV0= 0
##$LPBIN= 0
##$MAXI= 10000
##$MC2= 0
##$MEAN= 0
##$ME_mod= 0
##$MI= 0
##$NCOEF= 0
##$NC_proc= -8
##$NLEV= 6
##$NOISF1= 0
##$NOISF2= 0
##$NSP= 0
##$NTH_PI= 0
##$NZP= 0
##$OFFSET= 14.98509
##$PC= 1
##$PHC0= 97.8717
##$PHC1= 0
##$PH_mod= 1
##$PKNL= yes
##$PPARMOD= 0
##$PPDIAG= 0
##$PPIPTYP= 0
##$PPMPNUM= 2147483647
##$PPRESOL= 1
##$PSCAL= 4
##$PSIGN= 0
##$PYNMP= <proc.py>
##$REVERSE= no
##$SF= 400.02
##$SI= 32768
##$SIGF1= 0
##$SIGF2= 0
##$SINO= 400
##$SIOLD= 32768
##$SPECTYP= <>
##$SREGLST= <1H.CDCl3>
##$SSB= 0
##$STSI= 32768
##$STSR= 0
##$SW_p= 8223.68421052631
##$SYMM= 0
##$S_DEV= 0
##$TDeff= 65536
##$TDoff= 0
##$TI= <>
##$TILT= no
##$TM1= 0
##$TM2= 0
##$TOPLEV= 0
##$USERP1= <user>
##$USERP2= <user>
##$USERP3= <user>
##$USERP4= <user>
##$USERP5= <user>
##$WDW= 1
##$XDIM= 32768
##$YMAX_p= 402979195
##$YMIN_p= -742149
##$CURPLOT= <Network HP LaserJet P1505>
##$CURPRIN= <$Network HP LaserJet P1505>
##$DFORMAT= <normdp>
##$LAYOUT= <+/1D_H.xwp>
##$LFORMAT= <normlp>
##$PFORMAT= <normpl>
##$SURQMSG= 1
$$ End of Bruker specific parameters
$$ ---------------------------------
##NTUPLES= NMR SPECTRUM
##VAR_NAME=  FREQUENCY,     SPECTRUM/REAL,   SPECTRUM/IMAG
##SYMBOL=    X,             R,               I
##VAR_TYPE=  INDEPENDENT,   DEPENDENT,       DEPENDENT
##VAR_FORM=  AFFN,          ASDF,            ASDF
##VAR_DIM=   32768,         32768,           32768
##UNITS=     HZ,            ARBITRARY UNITS, ARBITRARY UNITS
##FACTOR=    0.250966925370066, 1,           1
##FIRST=     8223.43324360094, -216948,      -79020
##LAST=      0,             -3497,           -100060
##MIN=       0,             -742149,         0
##MAX=       8223.43324360094, 402979195,    0
$$ Real data points
##PAGE= N=1
##DATA TABLE= (X++(R..R)), XYDATA
$$ [...]
23889 31698 -176248 -71124 54861 -197306 -87113 -32860 -94796 18869 242461 25306 27057
23878 27057 -300764 -111728 -36625 61553 -43290 -209856 103259 -218553 -61588 82454 61884
23867 61884 -103374 -14285 73913 159032 -74449 -79423 -159713 34449 98626 21854 -59410 244539
23854 -33422 -73005 121788 -22222 -84699 26094 368507 -73555 141561 -139368 -272366 -19507
23842 167295 87694 -10625 169201 -102771 68054 34811 154066 9052 -34643 -132167 -5492
23830 -192143 -58653 106832 133347 260819 18592 -7766 124445 -60045 32957 -136319 -152546
23819 -152546 19514 41554 -156938 52235 -87722 69267 64605 52539 41617 -147999 -37614
23807 170110 49770 25380 -42982 446046 -11089 150091 60334 -98797 42723 -36524 -179009
23796 -179009 164816 -302455 -123293 146205 267147 -45370 -97039 2353 -27931 59404 -18322
23784 -25167 224596 -191030 -75577 -362290 -28054 -57414 -111127 -74188 14105 -79621 -78712
23773 -78712 -113328 -35395 -265633 14686 123873 -223837 74585 -169436 4644 -1073 -29736
23762 -29736 106506 -141955 -121320 -99120 125150 -35385 -189288 90559 -148574 -345525
23752 -345525 36660 -144298 -86269 -270439 415545 -102798 -74927 -73437 103436 -298219
23741 244731 95494 11690 51525 -74033 -93422 -307422 99998 198581 -273417 -58473 -107330
23730 -107330 -29094 -19213 219399 -29711 -41358 68685 177633 152891 70407 -131336 241646
23718 40780 31481 82411 -85717 56094 -310212 69098 -101694 -110148 -103132 -129554 -167618 157007
23705 -145803 -217899 113599 -28152 -3904 84018 221051 -120193 278260 -96381 -147994 -34410
23693 -196814 -295861 -373463 264016 120957 161099 -14233 -3149 297786 -39122 -25437 6537
23681 -203501 34655 -59836 -96727 -134405 -128605 200648 40955 -172002 104442 65844 184834
23670 184834 154828 93651 -83078 -100557 233696 56127 167421 -71736 -63426 170813 34280
23658 -194319 198075 -112872 -227155 -17079 -138494 -208475 -2564 -94493 -145260 8060 103743
23647 103743 -345390 84283 31856 71380 83167 -69892 -19918 -28249 87424 44680 131028
23636 131028 392442 -232774 54825 -191383 -282254 25000 -47971 82826 22020 117791 -46796
23624 -156870 61903 -42338 -152333 -192983 -224861 -298553 -431578 -264626 76453 -43316 115696
23612 76 56808 -25553 73489 -180221 372912 196316 -119460 -80450 -40723 104580 -16997
23600 -74927 -208530 1403 136539 -92510 -335761 -157174 -268262 -88242 55133 -169569 -38884
23588 113750 102541 -44453 -176839 114619 113982 -43550 -203180 81435 74445 -362813 126104
23576 -178445 -96405 108330 -224115 -33874 -278506 -30365 -65812 163332 -470683 -9909 28059
23564 -213092 119224 9173 -14072 43902 -104812 280752 217099 -193206 107057 -117784
23553 106074 -18577 -459554 -67717 74443 66705 -228647 -214846 14618 16060 45535 -492613
23541 67429 -69544 123650 -213146 -80434 19701 66906 129452 299730 -121503 154408 101018
23530 101018 101222 -15621 110087 132630 -21322 85766 116373 72003 136222 -125098 -114078
23519 -114078 -100080 121748 -340877 85263 -179990 223837 -38557 -87640 79270 -129026
23508 -106769 -103845 -70674 328047 -10542 140225 -20395 53112 -68432 182768 153455 -297243
23496 -136346 18065 206788 -90490 -41216 181216 32968 69524 114802 -240135 -14460 -32562
23485 -32562 -1865 -148065 96544 256486 115139 -231282 -113214 -756 264033 -119715 198001
23473 404336 130874 16836 -232021 131183 -27074 38279 124435 114264 -89292 38409 -275290
23461 -410456 -46546 -39680 -211489 6234 -105706 209086 -159261 -37619 -435436 -313804 160697
23449 -305980 292721 44509 50487 4815 29083 -39059 78214 -39489 127954 -128031 15897
23437 138570 145917 -221867 -70034 -155753 112957 92661 -41410 267263 45780 -293178 -292148
23426 -292148 168188 -23885 -37963 -129390 25232 -114757 -170248 298149 -204248 -43223 -230949
23415 -230949 -231093 108440 -42993 1711 264461 34324 -95593 -469040 53942 -159912 73832
23403 -386789 -115503 46341 -261058 8201 385444 63362 -92854 -100298 248712 190520 84056
23391 199181 -22988 59060 -136840 -21833 -87169 -170785 -172545 20151 144851 237964 -8095
23379 108431 121743 85294 3672 93746 -194920 118582 -42721 -121232 141424 222689 -224741
23367 169767 -78747 304675 50792 106022 -241452 -133056 -242048 -263453 -244223 60245 -18397
23355 -80585 1319 168347 -267604 -270312 -313231 188755 -92016 207139 -62608 24347 -223469
23343 109754 463621 -211023 46960 -24639 -206827 75475 309945 -297468 308560 -158178
23332 -363858 -93099 173241 60864 67698 -355104 -175536 214767 195734 -284017 37328 -119961
23320 -1376 31356 -8923 -30521 12069 20213 -158956 -362998 143584 252722 163051 -65462
23308 145003 45684 -72239 -109184 765 -26768 101051 -114755 61112 97153 -84076 -14698
23296 -188597 6287 -68404 -142472 14223 75496 155070 48796 214881 -58705 226586 112600
23284 187459 -17361 142449 -129958 -331059 -60507 -291466 -106601 -65024 -233998 139105
23273 24413 10874 98349 -43609 -8540 35056 -167692 59901 108587 199101 133362 153769 116822
23261 116822 32606 -69900 182441 168798 -66424 384456 -75316 -135392 62142 -217009 286025
23249 -15550 -115296 20243 -169507 61661 94049 271007 -85747 -22032 -120770 26410 -5958
23237 -75960 25527 -331506 -241650 133549 282309 -72354 93393 12239 -48029 -350583 14747
23225 -377246 -232935 218041 -98649 34253 -1646 -28050 -189275 250954 -82267 -17814 -67993
23214 -67993 56689 144526 18247 90698 56057 -541211 -249087 -110039 51406 119387 107654
23203 107654 -174740 -172200 -189143 -166506 69820 128345 -224142 96438 218069 56133 207203
23192 207203 207996 267545 -203068 -448194 -74357 -5396 68037 32841 50252 154768 8969 124774
23180 124774 121016 -179288 -30932 -224969 147077 140445 -323965 173601 281608 39242 184921
23169 184921 -399958 -16082 -1412 197153 154420 199194 1793 -294828 52202 -187445 -298331
23158 -298331 1 92174 -152980 169598 35133 157761 -211792 -15841 -43255 -30279 49937
23146 33485 -222817 235681 -34587 -15020 -173336 -75933 -176120 -166877 -155047 203491 -176363
23134 -295710 26693 102548 -386911 285746 -434870 195386 -118740 -64558 30425 46045
23124 46045 220951 -24501 316813 6957 60026 -158678 -209780 121418 -156308 -43525 224656
23112 99516 -83767 -275683 110078 104753 41683 -72630 -88633 -74614 -165309 106758 -6419
23100 -250428 36989 333492 38307 258833 258102 52498 -58982 -245364 -12424 -50366 -47359
23089 -47359 -309080 -165951 103508 -283286 -223842 47838 -191151 -99799 195866 -131791
23078 -73514 -129435 206374 -102213 -271841 -16733 66739 83334 207178 110782 -195766 -100016
23067 -100016 -360351 -268846 99855 143442 361633 16815 382005 -102363 1883 -43964 -187721
23056 -187721 -12267 -47320 69166 -176874 -212630 77439 232095 56582 16701 165156 -95918
23044 1175 397131 67531 -210756 104698 276875 75730 171637 -387757 -93616 30590 -477533
23032 39834 140852 105313 211572 120221 203204 10596 225860 -48166 40686 -341619 -99682
23020 -50311 144203 43355 7518 39640 -11407 -41533 106878 13121 344629 -101050 -182771
23009 -182771 -187564 107476 -36682 191927 201769 -32525 5699 373518 -47002 207081 11026
22997 -138275 -262532 180859 86852 -37741 39958 -132804 -34227 -126151 -159867 -1921 -79927
22986 -79927 -273817 -203394 104877 -48802 188453 195163 -40565 -263240 50011 -124304 -197560
22975 -197560 343289 -155527 232160 121081 -150633 173366 293110 108112 -147261 62650
22964 29735 -19257 26021 -153685 -236150 207502 -24986 51533 -396087 -20259 -165716 185466
22952 121364 49257 240773 -12579 -71071 -185243 -407220 183412 240330 -273233 212986
22941 -79203 -241714 -87206 37376 357291 -170796 30834 -136058 2681 -122415 -204099 58256
22929 -22929 -21123 -87481 32272 42244 -16429 154978 -208037 -211344 -68582 -234056 -7970 -314165
22917 -314165 157783 79322 -209730 -16030 -125859 108295 79953 95920 -35048 -135158
22907 -135158 -64384 77837 -160420 -134470 -342885 106576 117824 20753 -95455 2520 -115601
22895 -16015 -185665 16829 -169564 59930 -130939 -21128 -543907 -59682 283593 14949 -127419
22883 -52989 -239376 -148749 -74919 -70933 -130186 -171461 -82971 -329043 -126133 -76048 228711
22871 100517 -128530 83433 -21109 -62546 21513 155854 -54089 -95026 277675 -282504 -111268
22859 214136 31247 193523 -127217 109953 -101374 -85744 -5769 162837 236631 -74718 -34412
22847 117178 -196751 16557 -66960 -236553 -160417 111782 -190341 95270 -181608 49423
22836 147188 23627 -117541 -135707 115172 -154498 43190 122308 -252252 -14772 -48724 -284051
22825 -284051 -157824 45291 -207386 -1295 126053 204404 -83342 -81189 -103948 292654 62269
22813 47443 -72057 73692 82616 -16728 -190066 25486 -287610 -66261 271862 -19765 93932
22801 -46470 -236674 226984 342371 -212280 -334733 -225546 18563 -35965 35595 29044 -148597
22789 28747 -4504 36016 -22782 -145377 -159190 -160281 -53646 -180631 -130695 -68101 61350 438382
22777 438382 211871 53014 89505 -119817 -31719 -169758 93312 219366 269428 -161800
22766 137567 207311 -152163 -14018 178519 -163532 -137588 -258556 231196 -153273 -159150
22756 -159150 90780 114547 308682 126841 -22572 -75856 -51422 -136121 192967 -10513 -142954
22745 -142954 47893 131112 -103251 61869 55028 -214921 -320514 -63659 91095 101549 -55124
22733 90815 -431179 -15864 45611 -136749 116886 -93534 -119619 -220080 -5784 230013 51379
22721 118215 -73061 -168681 146905 -18915 -23037 204988 175109 58875 24290 98330 -199403
22709 -372424 -136103 -5652 -35478 -25081 74652 -118089 179889 390962 146189 -13720 82727
22697 -67814 -45711 119804 -98725 -283354 -182066 -58613 -59052 152938 400247 6121 -224500
22685 47816 -144704 -233212 -137123 -275953 120128 51645 -198211 225543 99405 -48683 -81975
22674 -81975 -314666 -17913 -353859 -300075 -31925 344584 -35920 247396 21799 382855 -77779
22662 -178325 -375179 -225765 136025 18472 -33645 299457 -46462 69132 63489 214133 -74828
22650 -55231 -312097 -344843 -47299 208644 -150290 -37553 -49934 -126927 -13658 116730 -148070
22638 16535 -51401 208026 94280 45685 174789 43913 -349869 -43192 171359 -40990 193815
22626 109422 626293 144212 -161301 -163433 156831 -139201 186803 127766 -16737 -151828
22616 -151828 101761 -156312 -170773 -117794 -327050 280711 7394 -44860 156749 49595 -181048
22604 -113131 -11372 79050 -21720 -56416 -39788 291677 -180981 -61800 252827 -137216 169580
22592 1797 -187768 -83407 11228 141339 -24206 -155977 -196351 519273 63754 -54581 -484431
22581 -484431 68634 -164923 -107841 19421 -15375 -57871 -130151 -127197 -122348 47401 39052 -167661
22568 -391497 443207 68846 -93739 89655 -375175 -151234 39091 72527 -13729 -110932 -189776
22557 -189776 -8597 -58170 -155215 -6791 -48003 84397 -272306 45194 -215252 -74709 -189673
22546 -189673 -208287 31446 90872 167644 42525 48090 13674 181426 -422648 235962 115525
22534 31657 80860 -174431 39016 -68258 -72878 180651 36494 39727 19503 17997 -68581 189222
22521 967 -206476 98890 45983 -74521 74886 -182949 -98652 37782 47266 -88026 -203524 -149763
22509 -149763 -360438 73408 135526 -41479 -145208 -177465 125145 70793 20477 34121 -41383
22497 -54058 -36157 -115609 -81143 -242763 187797 36404 -214256 -20583 309902 -285544 -8152
22485 -85662 -58247 52327 -334056 -22449 -164738 245003 -236750 64765 147011 -30950 -197092
22474 -197092 -159481 -297593 66861 -248323 -6336 92862 333026 -75686 198410 -190346 -44427
22462 -134298 28035 -65320 -29465 -121271 -194415 -21045 -209910 -56648 -370018 -76524 -18689
22450 41928 -108291 27700 -45482 142862 84542 -7618 166950 -63455 -229782 -351813 -456599
22439 -456599 -71216 -65421 -179961 22443 -117048 -64029 33598 -128102 78481 -154825 -80265
22428 -80265 -106715 -260361 -231547 -110043 68130 -172193 74152 -6672 41513 -207479 134113
22416 -10328 -12663 -3439 38108 152296 76368 -220190 -50924 125734 -160387 -41541 -107322
22405 -107322 170102 122808 -61959 199628 200660 83795 -179084 265752 123010 94623 -40003
22393 -120073 5119 -77108 -224976 197943 -449544 88820 -174675 -40441 35732 -68908 -67788
22382 -67788 109577 44835 153324 -22484 -174029 79321 -238060 -53979 3234 98499 -240285
22370 91685 226460 -207067 -341965 29083 -87782 -50164 -62831 18550 37786 65060 -202213
22358 140521 -189352 -325377 -113956 -233656 -24856 -89505 -191631 46365 16680 122828
22348 122828 -167308 -254888 -255560 54169 -27581 -190440 106538 147742 -254381 -9482 -75315
22337 -75315 -169596 6431 44723 41643 -65596 -82598 51160 -2149 -34057 -139473 4601 48654
22325 48654 58291 -171198 110029 156113 40242 -42161 -164576 -165907 -179121 -201578 208964
22313 -142284 -16780 -252376 119819 105010 42933 3658 -65715 158868 99159 -243090 -214081
22302 -214081 281946 -134372 -102034 53450 -284081 -295241 3915 234458 -277178 63287 -19354
22290 230126 -18631 -326910 -15110 125359 86368 327115 150047 -197475 202271 122578
22280 122578 88384 109934 24397 -134462 -112447 -311681 75743 4607 40406 129202 106516
22269 106516 196324 189961 406866 -77081 -27793 143635 -59344 92669 -221904 -251200 -58837
22257 -349506 238966 -10896 308312 -63426 114278 158901 259864 97180 72589 -113231
22246 -58687 2941 110098 -325748 210242 169720 244923 292183 309998 32468 -217109 -275027
22235 -275027 -124438 -73370 107028 299458 -32260 8704 -182 152869 300195 -155022 -254737
22224 -254737 -219353 18481 -104780 -88393 145775 112228 -230491 -15832 -284168 112641
22213 -14390 83870 -148496 -70789 229199 -8681 142391 -490976 -137932 -182590 148653 -135436
22201 284514 -95915 -72039 29658 -233407 76214 -140850 -9263 64223 30656 -175827 111265
22189 -124002 -24292 -256317 -146214 -259574 -248210 -492302 66163 -209090 -297089 60426
22178 -6242 -20315 -404610 -142090 257331 -77033 -5208 1784 -74450 -25404 26615 139238
22167 139238 -359602 -98062 73889 10228 -319894 6819 214114 -28300 242226 -66571 -1779
22155 -248861 -218413 -214824 108411 39122 341771 -250772 -42781 -78718 -28965 -305393 153445
22143 180463 -55907 -73989 53223 -352560 -39204 -30612 -182686 -22477 -473614 -145572 -90860
22132 -90860 84268 -42825 -59142 -152172 -46370 -195854 237092 -245835 290186 135684 35540
22120 161821 183826 -47736 -112373 -353877 -271523 37922 -176957 32735 59451 -315816 -153200
22108 62412 59327 -62200 -110101 -121272 -85962 218366 -52678 64912 82168 -237022 35630
22096 -293369 -227633 -61133 155217 -88830 128908 -620272 -249160 133956 -290625 260500
22085 -52191 162835 -184075 -98141 121113 -114829 -209741 16889 3786 -97420 174942 -5137
22073 189305 -63978 -37564 -63360 -95121 -39326 -180390 131811 -174452 -434011 -32665 122632
22061 138756 73455 -243193 147181 -161017 -99940 -195566 -232710 -191584 -9634 -221797 276171
22049 -261965 -232556 157957 185683 123525 80173 -212269 -88214 7872 154664 -219166 -214212
22038 -214212 146016 178151 -176678 -124670 102184 -240420 111538 198 92277 -20653 -363754
22027 -363754 105730 2171 -188343 174091 70455 -8102 86598 -325133 -80722 24761 151685
22016 151685 280000 294316 -118522 -73848 -431617 -11387 51196 126033 19956 -185658 72790
22004 -41612 125058 -135022 -89809 262614 -131533 108217 183575 -250759 -216545 -83257
21993 -131896 -8124 241447 151480 261076 80696 -112708 178071 -221807 -119855 174479
21982 -126980 -186059 -111844 190678 -29070 67453 -172293 -101485 75539 -21459 131941 -317287
21970 109158 140414 4139 -169716 -46257 -10288 -204934 -268850 253240 104329 150073 888
21958 -149617 -154799 -187218 -228474 -12839 244020 -174643 -15293 -131654 125260 -585206 167008
21946 92973 -117414 26584 -288455 266418 73765 134649 54640 -428150 -213359 36134 12347
21934 -36550 22150 -293168 -3195 -42219 50393 -197032 105156 76456 -162139 -180979 293651
21922 -244959 133943 -95180 -240210 -30350 -4305 -174321 459510 -145177 -100627 -266029
21912 -266029 -30532 -416134 -226748 -213318 -25562 283832 -176000 -213837 67516 -60936 -289328
21901 -289328 -123663 37328 438337 -188734 -9578 86651 202030 -268928 19990 -122930
21890 29075 21698 -39332 -71415 47880 -260256 95977 68840 -353622 -103317 -94647 -185144
21879 -185144 -38507 180028 146559 239339 -91728 84273 -84936 288463 -381950 157863 -109583
21867 116026 15975 69064 -97367 -13324 -43063 -115133 274029 9138 50462 176853 -221417
21855 -117291 78617 14831 34880 -17940 -43613 -85493 -438478 122077 -196667 -98741 -133648
21844 -133648 286891 -319287 -89190 -71491 168302 -164225 -5828 70340 -144459 -93666 92322
21832 106475 -345135 -112161 -291993 -323304 -12640 129583 227534 -124871 -58160 -3363 -9580
21821 -9580 324593 -98080 -176025 -304277 -70846 -86300 155269 -38468 99455 -111447 72020
21809 -411 262480 155271 -340404 233321 -144000 120464 -456 32911 -92530 27101 -219815
21797 10784 -111893 -59631 -64763 -15765 136144 194292 -10375 131499 208167 114095 35639
21785 159325 -327831 48909 146380 -131991 -306278 -84673 -257823 86932 92561 99016 -409250
21773 -3744 -250030 -54657 10345 -211962 -180615 16085 -11261 81951 68365 -32884 185700
21761 -14541 237768 -86835 83068 -82569 74308 147136 -17378 -169631 -27184 -12269 12156
21749 364122 -201816 74879 -75309 -330893 -35209 -232417 -78159 -54336 -112911 200873 -308724
21737 63813 -195758 -120155 -48610 -212680 35128 -125466 -140273 -161746 -106385 -370799 -133981
21725 -240677 -31549 -63694 -92376 113662 -27331 26577 117765 117737 79176 -120213 -73546 209387
21712 -290633 76483 -118739 21908 -224553 65382 -173980 -11863 -254566 -146565 384864
21701 159251 55970 101617 43745 -42715 -27204 -140315 155281 -95340 -319273 108221 91308
21690 91308 238506 22167 -57174 -218584 -225157 -173943 -44095 -328072 -37250 206662 124472
21679 124472 -119590 15467 -89463 124920 196471 -71981 91841 -199050 -219757 -31957 17154
21667 115871 234874 -110068 27802 65604 -156359 -148729 -103105 -21109 -108852 -186439 -13734
21655 -270046 64831 165487 -50844 208305 -162728 -206741 -299875 -73270 -157689 -57254 -123814
21644 -123814 -314486 -67021 -82705 -128670 36927 -147239 42776 112764 216301 -232462 -50029
21632 -118223 15899 134167 -10624 -323524 3701 95604 385785 -29678 -19737 -267933 57073
21620 107218 26113 33976 -168300 235003 73258 -261592 -14649 61746 308132 -59731 195466
21608 -252139 -63113 -45990 78231 9757 30114 309350 8824 -351018 111532 122103 -39161
21596 88366 -226437 -108698 152321 68337 233645 -304613 -92204 -119305 277230 -385534
21585 -67426 376734 -42825 115431 -2398 128588 -451652 50045 -168346 -148776 -95752 -170389
21574 -170389 155132 186556 -234080 -116157 -379614 -80822 -157757 320772 -56074 253355
21563 -31345 141852 -48323 -329667 -67895 124568 -29043 -6971 -330414 -90698 -100716 184614
21551 -126687 -84421 -207366 106155 25829 -58822 -9418 59880 -64402 108513 -188756 -294132
21540 -294132 -185891 101143 -129565 -73052 -398889 -107673 1090 112607 -70799 -241146
21530 -241146 -247706 198172 134520 29452 -129318 -33974 321670 67705 -20880 -305500 -305797
21519 -305797 270412 59082 -167421 -190525 239142 217067 142687 358370 189674 -82799
21508 79092 -235271 199519 -15794 -194105 -401340 -140773 38112 -328366 88241 312575
21498 312575 -87351 -204458 -245221 6995 255271 -76322 -128600 -20828 -87192 -164314 19710
21486 -288848 -259234 150054 17047 -461519 -119768 -54945 -378105 25577 -314272 116405
21475 180784 -108067 -218496 -150164 121632 -335137 -98423 -524351 161165 110918 -149837
21464 81975 -76668 -180064 -285547 -12428 -1327 -331675 -27477 -146709 564 -488508 139254
21452 204272 77844 -56429 93139 -84514 -49296 -5401 -166270 -130120 -172276 143286 56937
21440 -62669 74096 -298183 169873 220397 321838 -88652 40049 119136 275891 430852 91445
21428 56933 -83687 7551 -260716 197490 -140607 103438 -96551 -91112 255417 104794 -161523
21416 144192 -72088 -22067 -68757 12656 105046 -120018 1739 51206 -73358 44989 -58278
21404 -284851 -39691 -100867 181637 172741 -177910 177060 -219706 156336 184915 -39287 -2666
21392 -173644 -50512 -172472 -166752 12800 -263070 54218 -49087 -330257 186446 -152594 409073
21380 175957 -199846 -38878 -121796 221609 189475 426429 -50527 -143986 -26499 -108088 -128662
21369 -128662 -19659 128139 -157375 239405 -121629 271941 242887 -212384 -50168 -19258
21358 -3456 -129965 186133 -266181 -136082 -117581 9059 16122 -211865 -136936 178529 -155502
21346 -37465 -175288 -137973 -97200 86699 -72528 -14919 123416 -5372 41746 -234447 -92558
21334 -132133 -388488 -36877 -49544 -175470 -152540 -77886 124016 170381 -168538 86163 -11709
21322 -150228 -157950 -121362 -70519 -105322 -317636 -383714 101838 -141893 -130951 -218162 50603
21310 -69922 124355 17984 -160070 -51341 -164902 -86396 105343 -175804 -41614 -117347 187809
21298 -68960 -221626 -154898 -226201 -28951 -252168 -267980 -65346 -428374 -331725 -137652 -120870
21287 -120870 -181748 -66109 -30833 82053 -333466 -115921 12370 164106 191870 -425181 -537553
21276 -537553 -205527 158097 49135 91382 -21007 -3202 -200118 -27364 -7271 -67429 234767
21264 353909 -330737 86372 -101826 103872 -58397 32033 -81612 -136491 -14173 -183304 132468
21252 -180657 -29452 -133347 -140948 197194 -170533 107217 -139123 49300 -38345 -216320
21242 -216320 -262551 -138717 8215 213359 171962 -148241 183937 -87452 -162265 -195665 -871
21230 -21616 -81437 -2877 -161117 -170785 -181327 -79086 77591 239835 133613 375981 39317
21218 184386 -119417 -403456 82292 -81611 6095 -205913 -198150 -104936 -58979 -30556 257217
21206 -119583 -155494 -36345 6225 -82989 -146543 -95497 242440 -208707 -232248 -97741 -99980
21195 -99980 -179656 163636 -206619 217858 75690 -87299 10599 21854 -57377 -53449 -273062
21184 -273062 -76933 43076 225507 -109717 -200991 -141429 -112447 -123564 -221012 -148538 -155089
21173 -155089 -262122 64367 -113690 -242978 -113350 -211935 -2667 -157291 -108058 241004
21162 -558029 -221188 -55984 -163651 -204445 167198 -134989 405455 -1630 -353911 -280529
21152 -280529 7849 -69210 -94070 98977 -432172 -92240 94032 -194591 -370288 36212 -36506
21140 33662 -199663 23607 -189843 128945 14003 -123569 -213197 315404 -71108 26409 -123734
21128 -181624 -307667 -42616 -428756 -156005 107273 -231894 -85799 126357 -281842 -252406
21118 -252406 -213015 48726 -33536 208591 85254 257492 41713 -98088 140382 -179610 -65599
21106 -99636 -97686 -229185 370988 123963 55155 78282 -288601 -186052 -76707 -216121 -127833
21095 -127833 207850 -157253 -253273 -195094 -14795 41549 -208454 -357058 -90980 -176640 -265108
21084 -265108 -21835 -10499 -110174 -123689 -49927 -158674 -141967 44570 241 -19901 61133 -192194
21071 -114399 -318188 135451 -39255 -380247 221767 -1454 161132 -68565 -168047 173750
21060 70587 -109891 235856 -104053 80718 -38274 -203008 235107 4965 -43103 -245474 -15243
21048 -230825 183493 19897 -217111 -344278 198750 -73698 -426882 -216119 -36024 120511
21037 107155 59196 63149 -97482 103930 -94531 33742 39453 -88889 -1266 -89806 -99589 47814
21024 238261 232291 -98777 104897 -63330 62535 33304 -64227 136470 32341 -133074 -54094
21012 181141 -280321 127500 -86343 148560 -31552 -23245 -34237 -311954 -107489 -28459 -191571
21001 -191571 12949 -7114 -38293 110098 138222 139334 104750 -86272 56428 54812 -22129 -20737
20989 -20737 297468 -35329 -57248 -73625 106232 -173687 166798 -268628 24638 -349404
20978 -390129 328323 -202349 17954 -253605 59634 -55503 -163810 -149835 116963 205118
20968 205118 -185137 165734 179409 434810 -155328 105274 -268571 -89207 3667 -268094
20957 -83383 -140353 -95866 78769 -192180 28781 67463 -257550 217470 -281300 -84716 -48838
20946 -48838 -29134 -110339 -496916 -212100 -185717 -134194 -213544 173133 101756 -130460 302970
20934 -141716 125552 -126511 -130477 -384011 84024 228570 49314 -148592 -142624 -1922 346838
20922 -148912 97651 -11476 328811 -93607 32387 -104702 21602 -87189 -293926 209060 -271908
20910 197250 -51628 246243 -162180 -210599 152717 -196914 140174 -14926 -64269 127262
20899 30259 -283171 -146914 46376 93054 -130457 -10468 -304062 -338124 -250989 -198720 -133683
20888 -133683 -150531 -146114 -42189 -248203 51408 268219 -133691 241054 -180140 207833
20877 219179 -208709 -52719 -186119 -73606 -78263 -105404 -11824 125156 -42156 -115523 921
20865 99419 -231070 229698 600 25041 -156343 126751 34339 232545 -211620 -109425 -191377
20854 -191377 51733 -324779 -88972 -254751 -162221 -189336 -197535 -186222 -330017 52725 123335
20843 123335 -52058 -133171 41966 -17498 -258740 -108053 -183185 -414421 -59872 -189213 -79158
20831 -45059 -112918 -152836 -165517 230475 110557 -58344 -209858 -169573 -264354 -42545 18037
20819 -148048 -171180 276733 343496 180014 -90529 -397191 -9330 -352869 -17418 635 -303274
20807 -251763 -161875 -137638 43956 21860 18197 253564 -158586 -5138 -447062 -138257 -79711
20796 -79711 -185202 -33799 144798 132706 -297717 76854 -24251 -90202 -101262 29695 -189478
20784 -284242 19512 -312649 -76948 -80482 82968 38736 -4895 363919 -151030 1689 -114653
20772 -95858 51227 -65523 53209 129816 -296675 296217 91425 -138026 -128261 -190929 -25661
20760 -67759 227154 -239525 -62064 -416613 -134206 -98530 -23146 -87658 -132688 134069 141315
20749 141315 105951 -142757 -134084 -219132 12705 -119520 -266406 -25626 -132605 -13054 -219792
20738 -219792 -108441 151593 -69744 -147846 94816 -50364 -178371 -19607 -65893 -185301 264640
20726 144659 170832 -129915 96100 89267 -92551 277 141752 -92016 148278 -243999 32213
20714 -176728 -116326 -141058 -204603 -199673 -27755 -107100 -36516 -39376 -77794 -34873 -92918 151887
20701 -33445 206347 277480 265326 431148 -230445 328446 -190799 -63363 337295 -28049
20690 -200903 -184910 128712 125556 -77432 252357 -358552 -3460 -198117 -173031 36747 -9577
20678 188541 120469 -107388 217269 -24547 144691 35268 -189063 -195530 -47744 -61213 20691
20666 -260285 -82723 75521 -344737 285544 -31678 -39087 -55067 17735 73951 232298 32452
20654 7031 -196441 33065 17044 35621 -69159 -243949 -254373 -117231 -2043 -103279 81788
20642 114498 -353692 -86413 -184194 21080 -180011 53198 -239333 225216 159190 -295597
20631 -268099 -221653 -118112 21308 -46859 -204110 197556 -212007 -41708 15484 167676
20621 167676 -61958 -187069 134409 39368 -271938 -32331 -10921 -107876 -85262 -106747 -122928
20610 -122928 107259 -48799 -194090 -81607 -754 -220582 -321589 -129301 121591 52393 -1374
20598 -173429 177021 -213212 -174916 -211542 50747 -8927 -73019 41828 -116011 -117783 -144168
20587 -144168 -111327 129875 262920 274092 -14525 160669 340950 69737 -2231 155715 282717
20576 282717 57103 -157365 -98063 -115793 -13550 27502 68113 -229595 210520 -232163 106570
20564 196920 -144417 -42067 -301480 -205216 -37231 125296 189036 -109423 82092 485355
20554 485355 -83390 -144901 3761 -28090 178589 -364108 -117423 77441 -1094 -182460 -10229
20542 -63845 -201681 -416551 -246596 -125275 -168651 -266403 -123113 182359 -154740 -157951
20532 -157951 -74860 213498 -112328 112449 -189311 -254984 157828 14353 -106785 -29134
20521 -12492 -116300 58059 -269222 -60711 -142385 -336253 171604 -214624 -68170 -384815
20511 -384815 76778 2271 -117109 -135822 139939 -193810 -31528 -356058 -30263 118781 -252140
20499 -82116 231919 233546 -167352 -57942 81002 -64598 -153307 46309 -63012 -240852 136391
20487 197834 -60610 -160970 -238066 21894 -76344 27855 -208271 -147743 -185452 131111 -102472
20475 -245993 -19227 -436933 -345644 1897 -476493 -92320 -9531 -412048 -148166 161893 -361987
20463 -277754 106304 -59538 58514 49092 133830 -163861 43884 193871 106103 61749 143456
20452 143456 161021 -180368 -137339 -24862 -150453 -6715 -95852 -156387 -100900 178851 -218873
20440 93229 -338590 133701 -183940 -232274 -219221 -278022 24261 -131612 21570 -208430 -229974
20429 -229974 -185605 13500 212832 -360966 -153418 -419151 41671 -232036 8436 1222 -58610
20417 58644 -96389 -335887 103139 34545 -181679 248431 19659 269559 -148374 -91323
20407 -91323 -154463 24738 135024 -56310 64219 -112802 -179926 36997 106024 75404 113356
20396 113356 -158892 34808 119703 -80608 -39273 50952 -67963 -104314 164818 -217621 385085
20384 -18443 -210764 -37507 -184978 -101356 119999 -143769 -95409 393967 199522 355601
20374 355601 189951 335089 -240279 -250854 -4753 -414671 128802 -170759 -179655 90296 103350
20363 103350 6595 -127341 -53053 330260 -298125 39364 60949 -118879 -131384 -258673 -257861
20352 -257861 46156 -207935 -278598 -109880 -39628 92506 63165 -351130 -124246 142808
20341 -65136 -44371 12135 -233774 204227 84169 40600 32778 26612 122520 -58322 -229242
20330 -229242 229026 -210747 -37228 -75042 -250440 -178846 -41983 84139 -5213 108517 169337
20319 169337 -285608 -111659 -49724 -136536 132739 -114266 -42651 -3824 -11959 -93321 -213764
20308 -213764 -253136 179777 -72725 280315 -193733 10275 12482 215343 -207427 -204207 -259220
20297 -259220 -87135 -117981 110976 214722 -67405 -235087 26004 1113 251999 29736 -203946
20285 36378 -153562 5408 -228118 142595 346066 231439 373491 -86141 178982 -47896
20274 193666 -338978 -25070 -105656 -66852 152739 51252 -140195 -44482 272858 -106867
20263 -120399 262331 -36695 123988 -23256 -314688 -19664 297957 -76773 -286539 42156
20252 -188127 -25300 -110087 -175824 -32876 -149069 199526 -76902 -216601 -447894 -166155
20241 -22883 -113892 -100464 -263385 -98817 329815 37450 -68192 -121840 -243504 -350313 84723
20229 -218068 -231873 89491 -147465 -164474 18846 -131145 74432 31790 -155340 -347112 143885
20217 123972 -78837 -71460 -95118 -230451 -183368 204894 -37946 -81529 -112364 -76861 31802
20205 -231898 -70228 -100346 -145120 -45848 46169 -304031 -247518 -413173 21997 -56719 -11762
20193 -387718 311879 -254782 -255804 -225922 243036 47331 -244335 -24254 -268740 -257286 354835
20181 -101540 -328592 35821 -41525 314781 -14865 -5294 -168023 -257411 169618 179092 -470769
20169 285763 189348 -121467 -53176 170520 -12874 156738 267679 -290757 15191 -28436
20158 -17724 -78766 -248060 -89567 137169 -8765 -269212 -246296 36294 288187 -171275 5418
20146 -163748 154744 74241 -120736 199641 309429 -190400 -71736 315317 -166274 -156043
20136 -156043 92012 25965 -51390 -219407 -142205 -40081 28353 293915 43222 -97600 -104650
20125 -104650 -112561 -265761 -70436 -175891 -113499 -164721 42131 34488 -267494 -335522 50912
20113 -206201 -129354 -6150 -176433 -135615 -132553 -231564 -206443 187363 54349 -100920 11549
20101 -202502 48797 -113600 228197 -92666 30640 -63216 -167279 52724 -82019 16487 -51847
20089 61578 -139699 -134109 320497 -296343 -138750 -134675 98563 145994 96253 21268 -6845
20077 -178047 -222524 4758 29097 -68092 -129475 -294771 102582 189540 124131 -42138 68645
20065 137481 -14929 -371330 -21247 147881 18994 -32993 69982 5754 -114088 284604 -139390
20053 -237149 -32539 -163664 -486703 -58677 -72870 -184519 -131998 292681 -69386 130351
20042 -207581 116995 -353355 -203368 -68303 -25021 228892 -423059 -67708 -191387 -7649
20031 94692 91303 -51655 205148 51569 46168 -155053 -25196 -87864 -24169 76320 -81528 -216617
20019 -216617 101403 -69048 -275130 -151301 -105122 -203516 98281 -8992 -156045 -50220 121003
20007 -26015 -97114 92524 -127308 169851 -65817 -323688 -29153 16512 -117379 -84537 -204679
19996 -204679 -112159 -66538 57302 -264505 24910 280704 -103349 -453 -500815 -251767 -36944
19984 209124 12547 -225462 116665 -2014 -260071 -152615 -115117 186769 -443298 384166
19973 -84467 4044 55507 163405 -89846 43536 86967 -165617 -261875 -107125 -91783 152905
19961 -131251 -85837 -58937 -167159 -51036 -134847 -155389 236732 -116182 -26622 151143 21590
19949 -205971 -272215 226357 -295761 -83193 -45946 -18006 -132404 159298 44782 -194974
19938 5666 -179989 -193605 11057 428024 -92578 239808 31359 108812 119972 86723 -31770
19926 15963 -253415 -363712 -57920 27969 -166588 -172714 35441 112652 -147675 189137 31637
19914 -119589 18281 119385 213752 -374524 64554 -111676 75153 97445 81181 -303328 -205460
19903 -205460 -274195 166194 259437 -81022 -319308 -153286 257636 224855 -76649 236180
19892 -39843 175680 -119827 -165664 -6755 -326636 -156661 84911 25084 -12581 -389329 -233401
19881 -233401 147684 88642 -41286 -140524 -7707 -204379 115011 66980 -39282 72226 -30972
19869 -451445 -71297 -148159 291607 -25703 110276 86927 -182561 170124 -77489 31573 31848
19858 31848 43476 -336869 -155140 -176810 -90996 18501 -284907 -176033 124847 112506 -273902
19846 -211468 -106148 -95451 51513 -101622 -92022 -172340 137262 195909 -230975 -13363 65839
19834 -488981 94277 98126 379205 115284 -145708 158199 -16406 19363 -79091 238287 -276027
19822 -281991 204655 77520 -67914 111726 91538 -307577 -2390 117923 -246214 93822 101136
19811 101136 53991 13392 -70715 -163715 -288691 -147668 46405 -163132 -79990 -129602 -219400
19800 -219400 37563 173872 -66947 -96177 -61240 -150323 -181309 -150444 -157411 49820 -27613
19788 68154 -250744 -315633 -408771 135854 161416 -172402 233434 -309160 199901 -99822
19777 129749 -95901 -291710 208812 12251 106443 -100534 -380347 -24609 121634 -216663
19766 -149976 -153056 58949 -67519 -218197 82318 120649 131065 281527 7178 81423 -179265
19754 178864 22389 154391 -18918 37177 -5363 -18504 456204 -155878 130027 -111080 -65859
19743 -65859 -291431 265762 269352 -268795 279366 -50427 5926 -32224 327035 -29107 -122811
19732 -122811 -171784 340697 -7885 71724 -136601 -8813 1253 161935 -99748 -119257 113975
19720 -31991 -32001 217039 -102964 63303 -154331 -176575 -221106 61395 148158 58765 -192461
19708 314756 -98083 -253192 -130994 -8943 413 19918 52264 229949 -56365 -47229 -314515
19697 -314515 183417 55438 257437 87011 -123292 74179 236607 -216621 -179259 156671
19686 -70101 -180440 -128986 -116217 -258937 -171149 -84045 -62947 107876 45784 -302188 162420
19674 114819 -98448 2565 -368793 205978 -133255 201316 -22371 -320356 -126002 -77227
19664 -77227 -130292 -149429 77728 -123921 -136704 44841 9009 66343 235076 -61870 51762
19652 -180816 -103217 -154733 109011 59548 100528 -249663 9176 98801 54365 744 42804 103047
19640 103047 -99987 185654 86003 -10016 -87405 -189268 170365 -111743 -97447 -46323 -70671
19629 -70671 109984 259915 -90458 123545 -55525 313458 -301299 -226412 -271725 -336256 -203334
19618 -203334 -50852 -545699 195842 231980 -148650 185493 -123715 -159520 -107381 -255599
19608 -255599 85094 210997 -83819 -189704 -111793 195278 149558 336161 -3213 248269 -104906
19596 -88702 27644 -305120 -153759 93493 -219788 -35269 -49142 63801 -120722 63922 123982
19585 123982 -53377 -159926 -309144 -81717 87857 -9790 -26198 -124985 21066 56006 -91215
19573 -313905 -280394 -106968 -394236 17011 227582 -91222 -67447 -109854 -63865 52342 250813
19562 250813 -376465 -125484 -16117 37504 5554 89825 -24112 168875 123354 38611 407770
19551 407770 -98519 -138878 25731 141180 -169076 -45747 -135824 -312781 16993 122077 -88741
19539 -319299 61326 -190783 -15456 207043 119878 -162978 -74438 137377 -12944 -256301
19529 -256301 -305192 166853 -133611 -88552 158594 -159362 -29257 -57420 28593 -229946
19518 -327262 -69349 96756 -14968 2981 -161751 -199968 -57853 -206224 229682 -157479 -509
19506 -379800 -28308 55528 11415 116887 278795 -358159 -100620 -27038 -68520 -425524
19496 -425524 -207577 -123242 -182202 87623 -190470 -20184 202625 173115 -311476 77335 -130009
19484 1037 -316732 -50493 -302786 -187434 -236167 -93978 38455 -257598 -32785 -451375 220336
19472 -38441 -398668 -274769 -157143 56247 21776 -51706 -6335 -80736 -59739 -159728 182426
19460 -103920 -424396 -351116 -117981 -547 -110891 -289150 -123158 57604 -67658 -171382 -250563
19449 -250563 -10398 105685 6928 -178414 -135537 -362853 -241292 165814 405267 -254162
19438 -191357 -170013 984 171569 -193233 128886 -443955 -214057 197856 47787 -189517
19427 -130641 -229941 -3503 -227834 -41374 -407974 109842 -215391 -156600 110366 -13593 36688
19415 -228978 169153 61425 -259643 -388590 -334566 216520 -133910 182582 13878 168541
19405 168541 92812 420874 -224830 -87861 -214694 130244 -89277 -174346 3625 -81763 35398
19393 33580 235277 -9988 -25287 40654 -242337 -249892 -174311 219047 155937 310803 14306
19381 98933 105479 23803 -70150 -135925 110928 35082 136746 156465 106506 -123295 -66857
19370 -66857 -77909 -439663 -24665 24987 46896 -82673 52920 -177682 -21750 373299 175241
19358 141254 -70161 273921 -52730 184919 -148785 -16180 -384847 -193963 41740 -117122
19347 28080 -252839 80171 144930 209888 -159196 -106477 -20609 322507 1483 21490 -216381
19335 -96252 52838 -10165 83064 73692 22932 -123545 -335916 167085 -134419 -286371 -271338
19324 -271338 -201203 17594 -28298 5246 -106082 -104381 189611 -113443 130533 -129230 135626
19312 -51763 -68735 -95490 51733 -14797 -190689 -191147 33646 -61748 -138118 229237 -367559
19300 17563 -275824 78859 -141125 -113656 -129200 -137281 -160648 -242009 99429 -27757 64711
19288 -272663 -441379 96876 -168884 21940 245098 -60417 -111443 7436 -231386 -321043 232544
19276 -264385 24814 -215867 67160 276688 -131012 -294741 -249544 -249046 -65058 -89208 103128
19264 -20923 -43716 -100604 -261233 154085 -9287 71074 -135478 168848 -81051 -195230 -270955
19253 -270955 -289977 -72410 -106399 3611 -223000 29111 -179707 183440 -199385 89925 1238
19241 157574 145177 198349 -404508 -184943 -225020 -10419 216944 -181302 367104 82591
19230 -128493 175013 -413565 -130359 119937 176673 197035 -190325 -82907 320867 141667
19219 -130178 41702 -210321 15530 -147492 -232739 -204770 85863 28272 -123643 -262992 -13616
19207 109796 -157111 -40745 2095 66671 238989 108074 -25353 9053 237816 -203727 -200144
19196 -200144 -143077 91213 -30584 -172217 161299 -257616 -47633 470271 -53384 -48504 -5014
19184 -116966 -54023 65394 -27558 2696 52865 -408153 -236020 77273 264608 80849 -45412
19172 -122292 -181589 108339 -145246 -319652 -219572 100603 -454603 -240756 177221 -64122
19161 -340069 214405 -102977 34287 -65442 -237718 220074 -185971 -22490 -36843 -54644
19151 -54644 -291457 -283025 -101790 -18582 111602 89087 -106939 -189930 152240 -213916 103644
19139 -71366 12843 -159588 -175167 114037 -5894 -219371 110625 -133150 68049 163080 -92334
19127 189277 99694 208340 2679 77211 -603213 -60028 -219905 230284 197752 -100517 333264
19115 -117567 -83983 -324298 -118116 32850 -290689 204201 -5197 148863 -37202 -45261 100391
19103 -232215 -273673 -342216 150385 -58717 178597 -249508 -244923 309150 -165022 -139643 -130108
19092 -130108 -355935 8818 -235947 -21411 -123936 -42860 -521046 38476 45905 -75067 -113541
19081 -113541 89774 -451353 -95345 -240106 66750 153873 -1203 114015 -224679 -235306 -161317
19070 -161317 -250633 125089 75301 109195 -60815 163336 -121966 -4769 -33659 138117 9393
19058 3070 -12129 5517 67452 305277 -10504 232080 96640 27779 121670 -7731 17711 -80733
19045 -393780 5572 42408 23513 -164803 105429 -222973 -151764 -160302 16540 141378 35849
19033 237497 180919 -231289 -55214 140980 140835 20017 -133983 2156 -189387 -19017 76976
19021 334545 -37513 202397 259631 -841 -222170 -149720 -32380 51454 130981 -126225 -18657
19009 -281478 -158516 83552 20377 -251980 -378358 -36502 6551 129874 -200624 -266677 21848
18997 53995 -221219 84674 -55025 101728 -257188 114921 144015 121146 -5773 260061 -155470
18985 8575 -8525 -24586 -233329 -262826 -137461 23751 -124795 -139973 -150877 -215386 -364890
18974 -364890 -71293 -133269 28995 -54686 174598 119832 81698 -70207 -67744 -246644 322836
18962 91461 -251474 -144905 -357451 -202913 49164 -85204 -338689 -161373 304631 59882
18951 -139308 -205359 -196744 -168805 -114336 -514085 41625 37936 291374 -282321 -93996 112216
18939 94815 52391 -214383 -195456 -274654 -100149 86756 -126388 -433269 203251 34609 -41294
18927 -296708 118166 254070 278488 -214025 -23534 -137110 -112199 -194178 -94375 41652 136898
18916 136898 5231 111445 -39116 -21067 -56782 61312 163424 218134 -184465 175861 -312635
18904 152198 48137 181509 -194466 -332669 128788 161974 122421 -165137 84316 -33541
18893 -46339 -77296 -89253 47291 74154 -161274 -271502 130637 -49862 -68408 -169789 341838
18881 -199456 -43955 75591 228056 153261 -134035 -115506 -167777 -441821 -33861 -188582 -133142
18870 -133142 -72561 75380 100806 169936 -22229 -92518 -228957 -142551 -208171 -73782 -88275
18859 -88275 -91450 -218683 -90946 -215125 -244336 113932 -39607 126400 151846 -48254 -78100
18848 -78100 -52757 69245 4427 -121181 -54687 107783 70035 367722 115480 441471 51712
18836 -22888 -202896 -264143 6952 -37567 -233309 -109025 -83021 -97865 -114012 -153736 405791
18824 59536 -70960 104359 -276152 56854 -93947 124417 -152769 -7263 -301457 6943 -317697
18812 180621 -56518 -14155 216441 17233 18059 228329 133486 -191322 -199467 96125 93331 -275386
18799 -23120 -253189 390544 230245 117377 -56991 134334 -114313 59305 -12298 -46125
18789 -46125 -4304 174151 183557 12452 -413735 -203305 115000 -365334 -114187 86582 -138005
18777 -287484 -67367 71382 -902 -36019 263531 -101415 -123027 -198509 28193 31235 137561
18766 137561 220062 -225867 -7933 -128696 303624 -362821 -107359 -67571 -23372 -480317
18756 -480317 45838 59619 -115618 -126914 -251045 60402 159258 -94666 -206824 -58644 -27161
18744 -81199 -48624 -305406 -93580 -133464 -55376 264190 -178101 -99465 -46491 -21682 -61873
18733 -61873 -224898 -183925 54914 -45425 -202045 159330 -274789 -1240 -66112 89370 -158621
18721 -72976 -12483 -241197 -474531 -42434 -66822 -87168 65055 -13194 130192 -104309 116918
18709 -118555 -295271 104849 -159323 -279756 115781 108853 -433778 98546 190527 -18845
18698 -147738 -142226 -256275 -44372 206952 422043 -81982 174343 -102288 -374957 -119376
18687 -124943 -151679 -130384 -117576 -384906 198501 -210948 208709 -129054 -108303 -261570
18677 -261570 -254095 -210286 61131 -178519 -151279 -308215 1916 -327755 -103588 94500 -487110
18665 193392 -128097 -153338 -131641 154226 45006 130661 78984 -32035 -5506 -138053 -290605
18654 -290605 -228572 -266150 -112293 106182 -7550 -24778 145750 -157305 -247210 -124016 201299
18642 -105221 96301 -295631 -82612 8718 -79540 -504992 -77764 -30970 -73738 163073 -235091
18630 -72141 153695 64476 -115929 -151195 105017 87534 -307472 182068 -166475 -9839 126926
18618 150844 328826 -369191 231922 141435 -149110 48706 -188505 -72832 198659 -284777
18607 27850 -172255 -129605 -76114 105365 23690 -14980 -452815 86405 95255 2754 34967
18596 34967 -165105 -126432 34209 193576 -135252 185945 -115175 -43684 -223950 -48184
18585 -162055 230267 -57483 -43084 -238539 69459 -251562 -166902 -173111 -279224 -70817 96310
18573 154401 -59891 -91624 -105988 156806 104187 226720 67153 90249 -256007 -23514 113826
18561 -188833 22359 -97703 -156272 -139674 -114988 -222008 -138068 -33129 -409022 -42911 25165
18549 -111127 -52227 -44781 -31536 132999 -158212 -30903 -78194 35775 -327549 -177204 133312
18537 -10281 -113171 -260922 22695 -153059 -85567 -213071 -392531 -28006 92322 -175210
18526 45800 -153804 -39697 -16986 -268909 -142300 281702 -168361 -126694 -86416 -12671 -225953
18515 -225953 90389 -224241 -84169 43534 -88319 127771 -268075 137007 -158341 -217024
18505 -217024 173951 -140478 -90750 -295595 -125193 -240558 -251240 -41172 162437 -244601
18494 -64987 -24424 -190268 -108566 167530 68167 106953 98378 -204700 -92291 123530 -221489
18482 69899 -161893 231505 -159100 -61660 18922 -10450 -120157 -273883 -38687 94974 48120
18471 48120 -90286 -182328 -125539 110758 -185646 4395 135102 -73242 122315 -147768 -12931
18459 -3706 -339522 -423153 -138893 7986 -16839 -218625 -196205 182969 76681 218161 47215
18447 -133853 -464486 26393 701 79018 -10441 28120 282740 53734 -27068 49918 -260033
18435 -439894 42818 49592 -239455 -23160 131253 116169 -74507 -53208 142289 -139501 78699
18423 299550 -156910 -130052 134537 -155099 133742 -430801 22773 182753 200596 -165833
18412 77150 73758 -156183 -73044 324435 10343 -110904 298442 226812 -38653 -134963 -102410
18401 -102410 90523 -8615 121595 -111167 118941 123041 143255 -73040 -200879 -208993 -294565
18390 -294565 141876 -15110 -263987 -132448 37632 184078 31616 45821 -162096 -200663
18380 -200663 -306855 -51725 -23933 -207547 -45932 22481 -163294 25710 -67393 77159 -196822
18368 -20255 291322 81602 145329 -20710 58911 199132 79356 -2658 172408 14000 -135332
18356 -181817 52597 -50062 275950 -40694 -201905 -66575 -116265 -69316 -205701 -10807 -1614
18344 -341196 -289762 -448854 166954 38111 1796 42004 77295 -61383 -476639 -202560 -158724
18333 -158724 179620 -112176 -321461 150910 -349103 111989 -220015 -74810 -76152 -29879
18322 144649 -80947 -328527 -44502 -250021 -36127 122823 -52413 -20199 64649 71031 -136097
18310 547780 -178276 -143872 -13125 -132932 18346 20093 -160216 62416 164532 -46092 -7634
18298 78461 100956 -166848 -66725 -397474 171805 127511 -7883 -269104 -5284 -240680 52702
18286 99399 -244294 -11342 39900 102191 -140338 -63218 -94403 11673 -192055 -115269 -127712
18275 -127712 -40999 189095 -185816 172867 314176 -161656 101376 2819 132070 98379
18265 98379 41107 150976 73220 522214 -112936 257979 -31948 43157 152834 -72139 327869
18253 -34488 -92317 -73598 -403762 337775 3009 18306 66079 -144524 -127480 -209831 -140243
18242 -140243 -44389 78274 -5758 -14572 38931 -111058 -30021 58465 98697 -9233 -42396 -95030
18230 -95030 25387 369584 208659 -63595 -95163 3284 315992 -124865 225851 -92069 -160998
18219 -160998 368330 110582 150516 -120569 -60716 -24725 -190730 -117685 -100182 -95770 -71280
18208 -71280 -246683 52905 41198 167391 -51001 222184 -228241 -38247 -18156 -429677 -25538
18196 21471 -290729 50680 54676 16015 -124928 40479 132577 276691 110670 -307952 268976
18184 133874 -40495 -112238 -308007 54954 -287470 -96214 239856 -291857 -272305 394550
18173 -124128 105 -87945 -392409 197828 177039 -20255 180785 2536 -82976 131596 88080
18162 88080 -80864 -353577 23605 47789 -169141 38352 -317555 164871 325657 15449 131255
18151 131255 245293 -171037 -79547 65195 42346 -222856 70570 -34925 -67747 1838 -291086
18139 -202530 -90131 157761 -315599 -182954 -96205 -332 156457 -11392 -354333 92579 -300122
18127 -155078 103427 -9808 -225200 -106267 -200287 -363712 246307 56847 435150 197659
18116 -74312 -116105 -41015 -89465 -293720 -11863 -266100 -292512 -66071 -112909 -104800 4311 335821
18104 335821 -55088 19404 275734 21923 157428 74612 64506 -213088 -327063 303936
18093 -37325 -343487 -340348 52728 67008 -170526 -39400 -221996 -98811 73448 109388 -298084
18081 86150 198924 56626 16042 -62842 -70170 -92610 387733 29141 99759 -165324 211301
18069 -168690 -86922 -18862 -113101 -212503 -28253 -195355 110474 131027 -120886 -217644 273167
18057 -1100 -111605 -182574 -348321 79195 -145036 -16306 217129 -148426 4874 21282 -173965
18045 43820 135431 -64240 -352742 195954 65972 186251 159444 6450 -12929 -40204 -107266
18034 -107266 -169118 -62477 -112842 -164020 -161717 -62287 -221172 292639 116054 149142 49267
18022 -131312 17849 303697 98437 158082 -229207 -39261 182 83209 24006 7666 -216233
18010 -38660 -314942 -186048 -5994 -109861 -299464 -32110 106163 -163782 -211514 66717 8397
17998 79184 4117 -467783 -112011 159835 33012 -365596 -127603 300584 112080 -265204
17987 328016 -146844 55835 -13755 232450 -191311 36688 -43878 284502 15932 27857 62536
17976 62536 -79962 -290029 73068 223698 -139042 -8659 -100488 -168812 -214986 115478 106208
17965 106208 -108948 97092 214358 36698 163594 -27374 -205547 130078 36615 -230007
17954 294148 71969 -238438 28768 -286649 -11578 144529 -40732 -97179 205356 133432 130290
17943 130290 -70959 -95738 140727 220351 8538 114248 -331204 -89378 105266 -269038 317
17931 90828 33096 -108946 109873 -11750 -187946 -58908 -103735 -282448 605241 -52240 101079
17919 -12150 15225 18877 95818 -51617 130843 50752 176745 -142256 -241391 83469 264086
17908 264086 -76832 25259 -141182 -19918 82534 -109645 66082 -283705 77395 -149039 -162472
17897 -162472 86830 61149 129777 -89311 -134866 -61708 -62332 -119113 -58336 -7256 -100740 -51665
17885 -51665 45231 123694 389405 -226587 74996 117785 11343 278785 44877 13384 -76163
17873 -90951 259393 -105081 27837 -319919 -194509 -281407 -75745 -104436 52964 -106780 -187619
17862 -187619 131698 21795 -88298 143289 -70539 -357147 15149 113525 134142 -210656 -311734
17851 -311734 -135687 -80326 280719 -448550 237430 51487 49216 -60165 -178740 125414
17840 -108127 -139522 -318818 -503158 -369959 -267794 -244874 171113 -366289 79167 308129
17830 308129 4612 247182 -167933 62909 64416 -161296 84152 -79830 28606 468805 250754
17819 250754 -43652 -104331 31850 -158828 -87703 -112021 -6998 61665 -6223 -88793 -229637
17808 -229637 68247 -190566 81008 73244 -221893 104684 103893 -172750 73515 28770 -39317
17796 135828 19824 119441 39084 -76701 197015 172682 -371005 105513 -179859 -29084 126554
17784 225647 43135 -268135 -12570 -12115 97320 -161827 -344038 41844 23382 176942 -32331
17772 32016 -44422 255358 -56913 -119092 -84871 -106220 -376618 -180268 -311705 240697 155801
17761 155801 93958 -248360 201653 206484 81256 -16719 28742 -422557 -225945 -340716 2681
17749 236522 -37200 239904 99104 248156 115534 -143728 -120346 195683 31643 97725
17739 97725 -384103 151168 -10249 98921 46299 86907 -106712 -102996 17559 -39354 292625
17727 73092 206055 7106 309696 -40963 176561 92177 78977 -273133 189530 92488 67561
17716 67561 -149319 91508 -125023 -124732 64216 93321 249338 -151787 61423 237054 160396
17705 160396 -90508 -126988 -38935 -6877 104665 -48138 25094 -166868 -34177 -5148 124863
17693 -93698 -193368 108920 45949 -150355 360488 58709 -188695 184549 -122807 -201485
17683 -201485 163077 67356 182299 190707 54125 109048 208222 56432 -14622 151545 -62142
17671 -122458 -154736 194693 473622 -48299 117148 -138988 -276926 -104397 137595 85604
17661 85604 1617 45110 168543 -45026 -153466 -239816 295993 265808 42843 300591 -145116
17649 -139039 -260838 31851 -474047 -59256 -148909 39180 -47981 238027 156884 5059 15677
17638 15677 51319 171854 -91453 151665 109947 -252995 -164084 -176822 212640 278119 252330
17627 252330 -234228 -201007 50930 183973 66306 -175180 -160670 -90840 -3943 87967 -265010
17615 -215869 70930 189902 189672 154387 171246 -99685 315880 87558 -160340 35015 133900
17604 133900 -143764 -172127 326210 -242877 -166523 -7446 -57118 2270 36727 371112 30940
17592 -129817 -53752 -347088 -58542 -203012 330189 202500 196362 134067 139952 174559 -42824
17580 91265 98751 77162 124726 -84582 -320095 -143970 -74479 -256493 159634 -89614 -370026
17569 -370026 249807 197779 85269 -180845 -67342 245368 -175107 359017 -114553 34868
17558 -293360 -188686 280728 181029 181803 95039 62831 -193348 226202 -84014 6757 78639
17547 78639 -195231 13292 206457 -249874 188623 -50143 -149697 -20655 44895 307954 47638
17535 13041 66424 112786 -120819 -148260 -157899 305896 301311 -274357 250684 105272 206585
17524 206585 206719 72054 -211375 186894 62716 163577 -18650 -17113 23063 104817 151765
17513 151765 385157 127242 212504 -94488 293954 -98816 204720 147336 164568 -41212 216336
17501 253057 232194 279826 37505 121576 137620 160876 -69406 -200289 -107852 -266685 -94025
17489 149041 322532 -92961 281806 92567 -29174 -10065 -87921 95509 125810 17073 270203
17478 270203 4529 42136 -20736 90533 244579 234512 300490 -281813 -27643 -6890 192334
17466 231029 173393 187276 7011 -199086 163250 258534 81241 420044 102007 244216 289743
17455 289743 110952 9022 411360 -51452 -15242 -82224 75307 223093 357546 592283 406411
17444 406411 -206845 -71923 167734 132646 278601 -23976 206540 232773 221936 108591
17433 53902 126493 337489 468374 228998 -278672 215083 -27006 392057 46183 -8799 357451
17421 78380 216735 187689 137974 194089 366752 221138 154876 480356 350753 180496
17411 180496 90861 199983 301639 138491 24807 78189 277892 -233733 441113 446293
17401 446293 -80569 42346 251519 301672 -224217 247692 206538 302666 62320 180875 120187
17390 120187 303969 324084 -105767 290815 556 139631 366662 57570 434073 266985
17380 266985 291938 10619 -115654 248630 129991 2600 216779 -77676 384195 -60118 200060
17368 -193 133614 63983 -71900 247214 -72965 67327 312981 5547 93407 159156 119184 -39855
17355 58532 448469 346919 514947 489163 -127178 235988 -86094 135229 188576 20036
17344 -19207 135938 94508 -40008 -19911 204591 306633 269711 267662 -104719 -22004 158632
17332 40220 249933 114254 233191 -289995 177756 -8462 172175 706350 234749 472112
17322 472112 345063 86441 301543 -201831 -90920 56155 30405 138472 115686 17323 2581
17310 -39195 46466 218646 391675 327878 261578 265090 56624 114655 140535 582543 206391
17298 294846 327624 153969 417228 79481 467674 25691 25287 168529 145445 203060 28914
17286 97608 267004 81720 29068 369837 170569 183910 330021 71332 -34785 201545 -172923
17274 240771 224543 84650 48914 191649 297139 287748 440075 284726 251256 83794 82119
17263 82119 220872 158862 98819 63120 118547 261808 206450 308402 148360 153853 300639
17252 300639 299738 -136258 15675 15968 49737 -67690 -1164 102796 161627 505844 107760 67865
17240 67865 267816 123936 213408 40007 210477 133528 239892 -23091 159735 -44790 315741
17228 167095 257458 206855 253335 -12088 -93022 686309 276633 455540 155739 211780 84639
17216 -76847 70426 182899 114851 61200 548752 202729 55318 213411 195133 241971 437625
17205 437625 -15479 317413 218384 342903 147430 112255 451671 326599 474666 233143
17194 76634 396776 249891 107365 397059 285189 193580 135954 436583 66789 177922
17184 177922 226356 186920 151724 176389 384974 151260 355313 395251 -630 27737 199375
17173 199375 -5733 194980 452853 317859 86061 1541 197812 280812 455109 251889 276043
17162 276043 125911 492737 210579 333903 36477 371067 185312 188064 516871 181266
17151 248216 199916 221396 296150 489938 141557 550187 236672 308654 182127 399329
17141 399329 -12145 154476 503048 343139 211244 109999 64511 460248 514709 492558
17131 492558 258431 365356 205556 66513 143315 495117 125595 -46868 415663 316388
17121 316388 273620 154746 321228 393001 415067 493461 458009 353675 163535 376413
17111 376413 457607 426362 -134303 302700 339968 576877 164173 466505 459147 394039 734382
17100 734382 396421 488688 425471 380936 161029 328983 588761 882901 54570 515525
17090 515525 468081 409608 432317 293814 356599 402250 203402 552778 455595 637879 282102
17078 574662 223725 264131 199359 429296 611648 424287 495976 836710 268757 70921
17067 387250 858353 259899 690384 492153 451399 433759 328174 268272 427242 667285
17057 667285 737854 254071 617386 555669 765698 439001 554165 558357 431531 253805
17047 253805 217287 131755 416344 448201 282558 213557 448280 647937 547316 338744
17037 338744 521065 412018 685170 690510 579149 632973 405257 654597 427802 544925
17027 544925 236272 601146 657479 696246 535382 675887 260033 656583 301897 182496
17017 182496 649540 675831 507642 447983 530371 456000 636694 838342 466952 676310
17007 676310 679818 852430 474847 668311 655745 333813 637927 817851 805709 773277
16997 773277 863199 721325 789680 725179 531469 744121 716740 754249 692068 827245 826877
16986 826877 743241 611617 596155 977646 609958 907195 980280 860687 740049 809315
16976 809315 962055 853839 1067606 718999 847910 666046 656765 894853 871220 931030
16966 931030 907598 849476 798726 955367 676378 842479 911136 794462 1318417 1129574
16956 1129574 839811 887502 952970 659816 725662 882290 809476 944510 810663 833422
16946 833422 748860 1183730 1002656 1046107 913333 1155223 1022955 1181995 1402528 871250
16936 871250 1237218 1312809 978483 1046875 885814 989022 1070065 1170316 1040653 1430594
16926 1430594 1429272 1346339 1403233 1159718 980901 1157058 1201318 1214687 1110178 1252117
16916 1252117 1288366 1057979 1384903 1310636 1480994 1235224 1475912 1475748 1244968 1543160
16906 1543160 1086343 1589735 1592116 1642814 1635274 1547419 1552183 1141294 1539528 1732935 1674395
16895 1674395 1507387 1596591 1930122 1514010 1728377 1786590 1844018 2085629 1844280 1774985
16885 1774985 2097179 2136143 1764008 1932456 1930710 2062799 2229976 1819860 2028214 2301648
16875 2301648 2024645 2260891 2057613 2169186 2040380 2325093 2510649 2588798 2418386 2317463
16865 2317463 2382970 2295120 2116958 2676476 2735802 2963359 2579672 2548165 2433968 2524118
16855 2524118 2526045 2691595 2797311 2955880 3134998 2951566 3060908 2677090 3166998 2912016
16845 2912016 3108037 3534127 3455765 3155439 3523371 3580344 3606070 3147175 3691854 3866008
16835 3866008 3855424 3874190 3919763 3678355 4033916 4173136 4322200 4170078 4255853 4529498
16825 4529498 4359012 4721342 4352103 4695178 4819518 4988342 5173912 4884873 5269035
16816 5269035 5056839 5392527 5143190 5360187 5788876 5751348 6195432 6015400 6056770 6428195
16806 6428195 5952231 6584523 6584058 6648959 7029774 7197129 7439480 7180060 7422550 7724621
16796 7724621 7675672 8131277 8382306 8351456 8754964 8817246 9011496 9417584 9649425 10001500
16786 10001500 10009724 10297901 10812098 10704330 11157046 11613045 12208354 12329206 12796036 12961172
16776 12961172 13628533 13731998 14393975 14717690 15310619 15806147 15937533 16444479 17320829
16767 17320829 17829859 18394704 19324258 20241573 20690340 21588620 22280096 23283354 24138414
16758 24138414 24992953 26382710 27074474 28535272 29574578 31119376 32497886 33893383
16750 33893383 35499090 37177480 38878672 40908041 43085826 45122034 47650826 49406980
16742 49406980 52322111 55338943 58754643 61645141 65130903 68836484 72921901 77503914
16734 77503914 81826950 86598520 91406873 96732091 102427510 108444526 114777124 120908168
16726 120908168 127211495 133865668 140318962 146713625 152314236 158457834 162895561 167489251
16718 167489251 170520702 173423066 174567196 174641323 173651355 171689473 169027259 164871703
16710 164871703 160537881 154956888 148974250 142632015 135830154 129048741 122156511 115717848
16702 115717848 109439586 103093188 96911293 91482562 85812212 81030824 76350537 72008479
16694 72008479 67565841 63665408 60119932 56710582 53507686 50832389 47816076 45727044
16686 45727044 43082923 41047068 38687779 36960914 35381164 33426081 32029995 30716879
16678 30716879 29431918 27589589 26503137 25479296 24241573 23363327 22199714 21611922
16670 21611922 20453017 20094144 19054466 18132353 17632822 16994471 16562844 15571173 15137754
16661 15137754 14775032 14358880 13705760 13270771 12829417 12220265 12172205 11773772 11369727
16652 11369727 10795399 10654045 10057087 10246144 9416257 9372774 9386965 9074472 8539818 8580337
16642 8580337 8389681 7974328 7806463 7503609 7370312 7016096 7139875 6476342 6430507 6565759
16632 6565759 6393782 5888842 6112874 6044475 5491135 5500689 5511081 5343201 5043289 5127733
16622 5127733 5007621 4822182 4958496 4520940 4575225 4546091 4725067 4435461 4380222 4064623
16612 4064623 3982986 4074170 3995873 4132549 3839195 3607938 3744890 3677810 3720036 3359087
16602 3359087 3578468 3341454 3425646 3474303 2918682 2981021 2788607 2793776 2541724 2785421
16592 2785421 2596042 2664474 2588788 2330035 2382122 2716276 2434699 2356073 2434573 2454586
16582 2454586 2526411 2339909 2226447 2095380 2461505 2236568 2250072 2196763 1972528 2321956
16572 2321956 1901236 1812428 1759252 1839645 1765595 1789161 2097441 1882654 1798526 1667823
16562 1667823 1880273 1758643 1836187 1669696 1626226 1883306 1771985 1614942 1748784 1554408
16552 1554408 1643456 1904760 1327032 1601091 1689092 1284698 1433572 1510163 1270864 1110952
16542 1110952 1111721 1209009 1003716 1017597 1271619 1318283 1305807 1148313 1404559 1025116 1064762
16531 1064762 988621 1336259 1163797 1023647 718587 1124307 1198690 1159118 1237809 1346369
16521 1346369 898327 1157565 1131152 774155 1180556 1065363 779428 769268 957319 1118078
16511 1118078 1057416 959833 837822 802020 1109152 525308 861411 823911 677535 892510
16501 892510 716445 803702 670736 647052 675867 478162 867537 783525 647266 760684
16491 760684 834260 742908 571254 992266 764185 592944 709791 743183 401472 861115
16481 861115 806938 740085 740792 549793 651016 799468 587330 532701 280728 786542 713880
16470 713880 810919 534831 294490 659524 873698 425590 546400 694462 585444 528403
16460 528403 844005 607150 215341 671590 820352 458084 771132 351715 578493 726716
16450 726716 774890 265591 210520 405385 530825 476345 540668 303225 325537 524332
16440 524332 475521 330067 513209 411773 477784 198180 235069 336433 210359 185777
16430 185777 460528 274138 65695 381796 612492 464546 338580 303427 390921 -55491
16419 498901 167838 38981 216716 179032 317173 98922 55780 359359 350438 464561 345434
16408 345434 229401 60643 188464 371919 257345 546348 234478 191685 289658 213720
16398 213720 523567 284174 497918 379006 370113 245570 315384 189490 479977 767455
16388 767455 272585 384285 503717 98327 75512 408706 42268 343613 397599 98702
16377 65651 -83112 51115 172000 310864 89758 69152 115636 20395 220365 273830 163282
16366 163282 276933 143702 136415 95896 609074 142075 467442 434774 -194528 108908
16355 227686 79369 269883 503297 431194 189686 151409 397934 407224 309985 261886 39277
16343 491147 318057 379867 338918 185408 270375 -73767 147691 350212 4326 -102848 77449
16331 227122 261930 60174 236794 -138266 -236782 16495 372508 35749 120508 199351 27554
16319 -94785 -3726 57547 215414 3503 60434 159368 141791 63185 171619 372525 419925
16308 419925 98183 275202 402123 -54177 52735 277329 342366 120431 153402 466357
16298 466357 38735 468431 261139 401237 223705 83771 214722 315525 536492 -14135
16287 -95724 410802 219409 -127717 76836 309307 367156 -75768 67174 344607 56375 -9345
16275 129956 452558 235403 169614 159623 242321 275437 157764 474403 345976 65276 76664
16264 76664 62369 -34275 103308 -110748 288877 -4382 39013 7463 164505 32891 226059
16253 226059 78587 50695 181584 -21288 97120 169377 252446 313276 -241262 -18346 104680
16241 102013 132730 242932 126732 475941 101930 143073 244409 -22980 62353 3078 274912
16230 274912 -103017 32812 255493 197625 -150812 29728 -190047 247363 -269302 360103
16219 53724 169153 -162633 -23419 136234 -21293 176996 -7602 -41617 473725 243267 -300575
16207 108617 -121455 104133 133113 80268 1576 7766 -192504 -282908 -201889 52324 -1313
16195 113072 -295544 199541 29819 48477 -52163 -74521 17618 145814 -82223 -125001 11130
16183 -57828 4694 -277529 3 43134 -164582 -6335 -112797 8613 153110 200047 -65425 67024
16170 242330 38235 -2049 -165407 -53262 26113 313628 278 -72106 -147026 172776 186395
16159 186395 -9545 320621 178287 -42241 25622 98933 -144327 87054 -207855 -20038 -118398
16148 -118398 223663 366575 -141894 -241233 78855 -210462 -143184 -165739 -45297 166708
16137 -61506 35616 340861 -80905 -1549 -254664 43076 104458 -22879 100393 109389 -37035
16125 79199 65782 42414 -24368 -104773 -159978 93472 -285202 -5512 24465 224506 -63806
16113 42300 35448 -100766 -69476 -154066 4180 -352659 407914 -314807 65219 100840 -49616
16101 -55400 -124489 409362 365221 -182855 -99948 104557 -151028 -140904 -224898 179266 19394
16089 -217371 42628 461034 188993 -114999 -19536 66965 -8458 -192072 101316 -253025
16078 -90433 132025 -56401 111162 57224 97603 -64762 34578 7672 -49355 10531 -357010
16066 246811 -266976 -299111 -343434 -48311 -245471 -163396 -147845 28294 33985 -83289 39447
16054 -96686 -6321 -135748 33222 -116652 95402 -168229 107937 -135328 -332220 95199 -202449
16042 -189805 -277329 39526 -173566 24970 -35313 -263178 281725 55464 80909 -6160 60252
16030 -238840 -49954 -43241 -223998 -287748 170674 206572 97344 86584 182273 84234 -61120
16018 -245247 139024 190387 167397 -84757 119872 188736 -104164 -217237 -83990 86537 -84919
16006 206033 -273448 -53968 -7770 -153380 -62643 264504 -47159 37902 57499 -90281 -63891
15995 -63891 7682 -201294 19931 -60160 -189771 -217575 -320511 177596 -281644 383916 108012
15983 151532 135038 144113 -106088 75315 202219 282222 -309251 173569 -80979 -90582 425534
15971 67703 -150555 266636 -77830 4170 359173 259124 -79373 88740 58152 47008 -237057
15959 130513 77970 -67855 37170 31786 -168891 -348543 67819 -142909 -5121 66419 99715
15948 99715 168046 -81110 46619 -59622 -27568 -21216 -259919 -264895 124835 43650 -541 -201910
15936 -201910 407857 -239090 -515099 -202042 -235619 120023 -224839 9532 -248536 107127
15925 -153465 -502973 111999 -323216 103110 104130 -72566 212068 -247938 -191777 -387816
15915 -387816 -81138 -72556 164889 -304539 11148 -148177 -257270 -45839 -101920 255283 -55324
15903 23221 -12013 33294 -12342 -31491 216356 173106 140664 -36955 69366 -10944 65944
15891 274118 -158913 -204916 260485 2767 -107713 -60984 -87979 -44568 127156 93112 16690
15879 -231947 112407 -4636 34616 -281951 -91489 258738 198951 -191644 -197081 81255 -73583
15867 -18560 126074 216577 -183148 -227651 -200491 315250 -172227 -197964 3306 -229028 -17785
15855 -2084 69868 -409700 -44571 -1631 -149649 -159221 -52946 -53604 87356 184921 29527 102576
15843 102576 -231809 -13212 -182000 -101404 113476 252642 -32087 -292647 -277931 5446 -121649
15831 -381633 -266590 -167438 -9769 -320738 192007 -164757 -135378 218800 -66914 -105070 122025
15819 -235089 93264 66562 -122473 -399137 354781 -10937 256280 -63913 -31468 -56079 -4946
15807 498923 26008 16304 6368 -10061 112555 -92296 -90814 -270751 153121 193595 200937 -388952
15794 -264443 -150580 -181078 -181227 94063 -9551 -172614 229636 -139846 -98636 -32926 209796
15782 15035 -10865 -435344 -225108 123362 -227514 49777 -268801 -9454 32200 95754 -580297
15770 -3707 -148764 245896 -186029 -11387 -344293 -93977 -278751 -60270 -171552 -311778
15760 -311778 -228388 -7952 -81689 -335275 237605 130622 -15186 -9785 129129 112235 134352
15749 134352 76474 -71600 97872 -150587 -156320 14703 -77423 -56537 351786 115380 133293
15738 133293 -160392 -210646 -107188 170699 -78467 -125962 -81447 119537 6494 -2301 -58183
15727 -58183 -257528 66458 309227 -139798 35582 -171819 -159942 41805 7591 8831 -33083
15715 131603 229 46593 -26329 11099 -148026 -259007 -40243 2497 -152444 -227673 -44223
15703 86660 19151 93332 -2706 -174244 67443 217208 -387213 167341 -85076 -79546 -242179
15692 -242179 -201735 176564 126088 237838 53772 17192 181637 -186075 157214 -67601
15681 120391 -182987 -117751 -52820 -171069 -256820 -55505 -20453 42277 1201 482031 -135522
15669 -26654 -33644 41508 -164021 -49564 124012 2261 290071 -79952 -119234 134130 123451
15658 123451 -38262 155830 119646 113281 77940 -424287 -54983 101347 51004 332685 20145
15646 -213952 129532 -85679 -121506 35079 34908 -171059 43334 -288187 -56102 156578 26902
15634 48046 -421722 218506 65738 -336290 -161357 268834 87705 -142543 87136 -82614
15623 124282 -212555 113049 -6416 62512 55874 -162114 -32477 -292329 -64227 -11498 -172303
15612 -172303 -71758 230426 151285 -168314 103092 130459 -18857 105760 -97252 -303374
15602 -303374 -39312 -47043 8928 7519 -126272 -3863 17241 -147787 149544 -50658 149506
15590 78051 -119177 -115208 -75137 -134417 107478 359194 123248 -135800 -191726 102767 44092
15578 -301015 52825 17469 65568 13113 37314 -29562 -83639 -30659 105831 211563 206364
15567 206364 -5207 -454078 -64598 -106142 95528 98170 -149562 -109596 216819 90678 -44823
15555 66409 90843 -260928 -351428 -80684 82695 149989 -369609 95623 184988 4855 90041
15544 90041 43317 -122473 159324 -66689 -91514 -247140 250191 -145554 -12875 68648 -90822
15532 -281374 61031 -88765 47813 -50493 34917 -108470 -79556 -63884 -91050 64155 -24679
15520 -84380 -28049 11100 159646 -82700 -2810 104146 110498 52415 -132779 227382 -153990
15508 -71804 -162611 152847 -86391 -179928 -198531 98163 58469 108351 -152035 118587 -135127
15496 58645 304969 -113387 136523 -115870 295130 171550 -79352 51820 119165 45652
15485 -26493 -258248 -156082 -178532 133416 132134 5624 163687 3367 -274303 -130236 -65373
15474 -65373 7573 -146517 -215371 -114952 -306945 -138364 -350657 361784 -62992 -333382
15464 -333382 -55789 -42272 -150456 -237905 -195790 69636 173868 88301 -386387 -46324 -361433
15453 -361433 -102600 4252 98288 -12548 177064 304687 268079 -57659 -220857 166063 256177
15442 256177 -98037 -9836 57168 -103571 47191 -342924 -196700 104880 55100 -161065 -126658
15431 -126658 39629 48625 -18037 -138540 182922 5022 139073 177943 -290115 -198140 -152811
15420 -152811 -20273 -232951 -39006 995 -47120 -85316 209571 -17734 -112276 -89939 -61493
15409 -61493 164120 71011 96521 -204816 95991 -117110 197415 -178436 125504 112685
15399 112685 -123140 26849 -317088 563225 -25948 10300 -43555 8386 -3263 -295696 248971
15387 -137478 -123891 14653 111043 -2474 -235199 -182401 -126997 243550 -189410 -26824 -55118
15376 -55118 -166370 -81248 16810 97312 134503 115407 -58675 108741 73152 -20432 57289
15364 68339 10919 21838 226268 192021 152806 21614 17937 187140 -42106 31966 125274
15353 125274 -134905 94080 -246049 20915 -271764 -149853 18154 -20513 94165 94749 -221389
15341 52474 156365 -233077 -71684 144708 -99239 -120994 270464 -61527 321351 257753 -126897
15329 85874 242273 113892 99367 -33074 -93002 288171 7306 171224 -285096 -359606 -134416
15317 141346 -60814 127092 104411 161619 65951 -133229 -75298 -347248 30208 -21485 119397
15305 9600 -53285 410061 311107 -17362 -176563 142780 -42250 156763 -38998 -215387 -145441
15294 -145441 243784 -65459 -154395 -124290 248746 97803 -37996 -248414 158333 58121 136884
15283 136884 114983 334764 112355 152617 176565 20235 47091 25127 -3205 -176205 39574
15271 125933 43024 256836 -237551 104752 146536 -30543 -250461 -107515 212617 -18259
15260 221503 516775 33625 -136809 -132560 15193 385760 -40782 17768 284973 -11927 225460
15248 349069 747833 1354561 992630 917237 666465 81952 304379 -96129 22139 77298
15238 77298 -96420 196973 391453 -136708 68292 -6460 185447 268471 -261622 157356 -2044
15226 -166348 -86502 237978 94702 109833 31135 159560 -117144 -52142 201788 12596 340444
15215 340444 -3789 -198209 495706 49527 137828 57391 177812 193035 171402 -79049 25356
15203 149011 -35755 109393 -41065 11113 60181 -53438 -113596 202137 141817 286668 207888
15192 207888 311848 248915 98243 49111 -165997 39084 159927 60768 277424 74331 66541
15181 66541 -172953 -42654 393653 -47743 141409 147314 73332 26897 -228130 -54645 267045
15169 30221 142476 184081 141414 242989 276182 -143974 -10507 255337 319285 -18857 142255
15157 -193007 -215098 38797 151829 65249 -187144 203481 -233982 -77633 292364 -246063
15146 -57896 268484 146160 42968 69562 280135 -94960 196186 15869 283142 -47542 240358
15134 168364 -83326 155541 107391 30483 -89704 437612 277522 332395 -59510 3368 118150
15123 118150 127771 227342 110141 277682 217658 -42803 11574 183688 98661 139278 94471
15112 94471 177839 113403 169912 413852 13827 109642 152230 -48040 239851 103379 134435
15101 134435 10828 -125567 268217 61297 298792 98220 110300 203822 179734 -42795 165747
15089 339755 380259 23268 -27430 157007 215222 -29092 245097 63884 35743 6348 407217
15078 407217 278281 122174 -66817 353202 234155 -81818 21336 175567 477490 316225
15068 316225 381013 164319 362710 -102586 5047 245599 327290 135633 89681 -103278
15057 286967 203385 5133 71222 48728 465100 165725 295973 529157 -260082 181706
15046 16334 104929 434016 -262681 194724 196542 231985 188443 227042 -68064 -186311 71757
15034 271188 323673 61004 -244549 297773 -138130 515890 496963 -86271 365302 349089
15024 349089 168440 122292 486371 255563 100872 330234 97115 401999 157068 172988
15014 172988 239659 -193550 -88141 438663 192418 107921 204349 54860 207958 145536 336262
15003 336262 427286 298962 345840 275925 77245 105762 -22913 68744 309573 -92565 359178
14991 335120 320613 -17117 105233 205020 108532 57018 190371 -31874 212293 322093 123753
14979 131579 347610 337874 313195 29480 141318 458198 115795 163500 573884 -84876 423597
14967 203054 65838 132891 616963 31827 199141 299121 274476 236814 -123075 228192 142717
14956 142717 -29959 809 161188 145533 250432 135888 268019 143526 62843 387873 208132
14945 208132 79723 275414 180467 331488 52129 279847 534138 259943 374721 388945
14935 388945 189318 338048 178362 120341 295054 396244 6689 264870 502858 641951
14925 641951 56612 199100 161383 208299 381251 263419 321450 117255 218491 511016
14915 511016 160934 98418 292169 327849 160219 47994 398481 355061 118928 359352
14905 359352 354662 84304 296200 286927 479863 656810 288975 249905 235170 217425 214503
14894 214503 207440 126364 296046 258677 479979 397871 449331 657002 -7470 303682 287819
14883 287819 538249 -28735 317539 324788 174773 292589 3106 363003 603165 526377 9482
14871 445105 -25672 367637 452083 288224 772460 379496 402429 113215 554788 298481
14861 298481 168454 197357 345795 529569 285538 178835 281720 436549 446613 831482
14851 831482 270419 377374 207714 488180 104890 258143 285097 256483 546623 541887
14841 541887 435097 613225 325139 555605 372305 440679 521444 282626 463161 237378
14831 237378 475198 381796 203618 169957 609331 70117 214809 310473 368776 331288 293966
14820 293966 673417 209115 508777 503553 559423 465801 355434 396047 228344 156126 339968
14809 339968 276533 293305 760856 499475 546574 486478 226706 121612 491166 498966 755415
14798 755415 467582 844733 744750 624429 641486 585120 469157 617774 296327 639804
14788 639804 484308 548029 513319 445262 697502 463493 348848 357354 357609 368123 442077
14777 442077 542 440603 582083 492739 670169 537676 503681 551109 747415 293370 700110
14766 700110 306523 491090 993050 463935 343108 543865 599917 945837 621556 584926
14756 584926 170256 559088 368287 559149 997996 567562 536144 851788 385148 742959
14746 742959 603622 784357 439543 743781 723631 569105 749673 719728 658079 1096408
14736 1096408 587663 480129 732132 387072 520915 707309 623962 769947 787828 766422
14726 766422 520528 851668 784064 752861 800541 537121 566797 852552 550248 602803
14716 602803 736972 401360 792814 944318 659716 710024 834233 769986 664322 1029452
14706 1029452 649688 543756 926552 662108 411574 767971 785281 525515 314149 557744
14696 557744 880225 772232 697566 724728 670222 1079387 969783 620921 836320 941389
14686 941389 865835 1071368 617144 882443 659461 1238986 1109477 785990 433476 839866
14676 839866 1022664 876112 841299 995156 828094 732869 882119 1150462 933741 701345
14666 701345 609647 1146108 889080 1190607 895296 1276642 1087840 1137618 1060254 1345211
14656 1345211 1180786 1157601 1098576 949450 1163294 1509156 1042547 1433794 822325 1116276
14646 1116276 1244292 1021040 1249638 905994 1207489 1159718 623568 1173027 1427955 1159940
14636 1159940 1337639 1360661 1192632 1066731 1278273 956607 1049688 1088158 1509636 1114071
14626 1114071 1426076 1010981 1160268 1329694 1043747 1428208 923057 1202503 1447915
14617 1447915 1517952 1141538 1582999 1376933 1317961 1122121 1789949 1642960 1645385 1468412
14607 1468412 1281678 1755744 1734520 1415039 1669670 1311052 1647373 1550746 1632026 1402160
14597 1402160 1622178 1426784 1525272 1576078 1665343 1316904 1576985 1734547 1750795 1757834
14587 1757834 1400989 1518818 1563336 1586146 1727395 1762287 2241944 1708360 1928453 1699765
14577 1699765 1953384 1786570 2005248 1953571 2294656 2153482 1782085 2046381 2127199 2244791
14567 2244791 2400761 2423346 2207099 2439956 2312258 2296911 2599270 2306743 2404253 2307991
14557 2307991 2790558 3031435 2885275 3252811 3121116 4079189 4523680 5453855 7810315
14548 7810315 11394535 19282233 31165844 36257367 22357332 11933923 5999473 3348241
14540 3348241 2326353 1961359 1641009 1791875 1809851 1910900 1979881 1868948 1898615 1948926
14530 1948926 1868275 1948385 2089706 2205872 2064024 2169932 2048520 1995460 2425328 2252372
14520 2252372 2146379 2414132 1850840 2215216 2318811 2453432 2431265 2923384 2675682 2694312
14510 2694312 2315684 2887802 2643630 2692870 2478865 2603611 2542211 2449218 2695077 2850153
14500 2850153 2840426 3041666 2954772 3139755 3290782 2980336 3086732 2724361 3050908 2939675
14490 2939675 3303856 3041956 3377336 3586549 3305071 3037147 3423212 3433098 3176495 3259165
14480 3259165 3608190 3483947 3382867 3510621 3913427 3380488 3778014 3785827 3586583 4000757
14470 4000757 3914979 3928401 4220114 4044445 4486263 3809511 4123583 4134003 4537516 4538920
14460 4538920 4444050 4678683 4805924 4427615 4632065 4886835 4560057 4772686 4985454 4955025
14450 4955025 4878851 5086704 5096602 5185447 5180979 5079070 5338433 5570973 5597287 5763269 6027012
14439 6027012 5434059 5635303 6225193 5855497 6217711 6261464 5914603 6309090 6664402 6505544
14429 6505544 6223781 6726149 6461520 6682744 7067838 6762609 7205385 6943135 6968886 7335060
14419 7335060 7346087 7627612 7344718 7609386 8021395 8197357 8175972 8487247 8276579 8591829
14409 8591829 8620701 8671064 8853849 8850758 8951864 9197544 9442433 9521000 9650787 9708016
14399 9708016 10037755 10062676 10281215 10270311 10741140 10850245 10949281 11008414 11107971 11448359
14389 11448359 11809902 11837507 12115858 12492318 12655166 12962833 13249990 13090543 13318227
14380 13318227 13934881 14216610 14106514 14493448 14862984 15069423 14979412 15852430 15851458 16379689
14370 16379689 16340771 16821144 17212287 17404155 17903010 18040716 18581711 18786816 19336931
14361 19336931 19841436 20207368 20898320 21112842 21638288 21744374 22410622 23125624 23305510
14352 23305510 24336496 24758569 25340299 26137524 26695841 27454442 27965157 29043907 29705224
14343 29705224 30472418 31141415 31820123 32618603 33795091 34568210 35565479 36326972 37704994
14334 37704994 38931176 39766047 41148035 42552849 43498317 44950635 46159996 48084749
14326 48084749 49648209 50695792 52722377 55014207 56450071 58346278 60366957 62546712
14318 62546712 64443638 66980204 69675073 72150833 75308502 77987181 80700547 83949490
14310 83949490 87359197 91386219 95220089 99103156 103209856 107864805 112753946 117433822
14302 117433822 122694831 128699243 134435609 140665752 146907673 154157492 161490785 169624476
14294 169624476 177726912 186474376 195709819 205156237 215494548 226119098 236973471
14287 236973471 248218761 260054074 272262138 284504358 296842813 309836327 322633791
14280 322633791 335364974 347619299 359629344 370908280 381559992 390727870 398394922
14273 398394922 401986930 402979195 402308488 402230422 402424802 400982745 398520773 396644119 393968761
14264 393968761 387373466 377851162 366425135 353851835 340880557 327068632 313088459
14257 313088459 299752005 286207670 273044565 260566217 248513127 236610830 225285237
14250 225285237 214402114 203760405 193975096 184635696 175849949 167036954 159554501 152194202
14242 152194202 145324199 138270502 132057308 126000175 120820335 115689101 110708343 105787236
14234 105787236 101367910 97258168 93565847 90124165 86432414 82855674 79800053 77163647
14226 77163647 73683468 70944632 68617556 66151870 63777235 61900860 59487054 57581395
14218 57581395 55499540 53773374 52125508 50396406 49251039 47762579 46140532 44576408
14210 44576408 43004469 42112934 40855953 40106057 39082620 37608736 36194614 35787048
14202 35787048 34799053 33613957 33195625 32059909 31208945 30388495 29683752 29010666 28041376
14193 28041376 27519826 26670296 26205589 25578160 25034122 24376307 23668298 22892116 22553217
14184 22553217 22061529 21624324 21392865 20599407 20535747 19945881 19121935 19060933 18499171 18412675
14174 18412675 18117927 17727896 17191057 16661550 16542681 16078672 15955962 15351404 15526184
14165 15526184 15099174 14983635 14518414 14207774 13686520 13657115 13494539 13351354 13041296
14156 13041296 12660920 12638152 12339527 12164669 12081283 11782938 11760979 11327976 11171660 11067229
14146 11067229 11049198 10586209 10674249 10568931 10076383 10204959 9754679 9689298 9519792 9651444
14136 9651444 9236607 9389452 8836585 9051843 9063234 8778063 8809032 8456356 8261034 8216915
14126 8216915 8254786 8202492 7663979 7870309 7746701 7625954 7392504 7389734 7491630 7188147
14116 7188147 7166114 6894183 7109460 6544650 6751638 7084061 6633958 6679988 6603223 6416061
14106 6416061 6369806 6215755 6418134 6260240 6078555 5775799 5937277 5718058 5556009 5574652
14096 5574652 5394468 5616277 5350899 5344299 5249773 5412864 4908310 5382537 5018101 4917961
14086 4917961 5106265 4530337 4774087 4875934 4982025 4653329 4784380 4620582 4202498
14077 4202498 4546434 4511697 4343696 4263370 4344288 4330333 3985286 4296268 3918868 4208727
14067 4208727 4408930 4108704 3942536 4082995 4112538 3814773 4021762 4273304 3919215 3994394
14057 3994394 3827053 3796835 3849277 3415934 3456888 3299153 3550204 3262942 3528977 3648134
14047 3648134 3369107 3243770 3437042 3288000 3069055 3094782 2980292 3126486 3080771 3212947
14037 3212947 3182555 3161277 3197511 3227732 3175342 2972486 3310178 3058971 2766537 2670074
14027 2670074 2584987 2994410 2981410 2484395 2566003 2836450 2912861 2710455 2450406 2620047
14017 2620047 2271174 2185489 2483498 2390996 2731228 2612796 2302033 2538535 2388012 2354903
14007 2354903 2415494 2384186 2506963 2174687 2057773 2096499 2173364 2185890 2400197 2167906
13997 2167906 2107521 2137375 2102481 1832587 1768902 2010198 2403825 2727829 3920745 7115931
13987 7115931 13590532 25906271 36036077 26196304 15381996 9559865 6277545 4672809
13979 4672809 3884550 3297235 3005393 2543902 2540915 2595609 2660818 2627217 2406112 2418730
13969 2418730 2375937 2229599 2371230 2011657 2184180 2446340 2280108 2016238 2008651 2098011
13959 2098011 2148388 2015472 1717516 1812895 2016635 2112119 1823404 1612822 1996876 1876191
13949 1876191 1835595 1914496 1960464 1634425 1881338 1737509 1826774 1830453 1653835 1603252 1870559
13938 1870559 1777565 1615340 1913888 1686995 1759568 1635127 1491750 1551242 2034862 1579517
13928 1579517 1628335 2005478 1649982 1845965 1343772 1660906 1845783 1745426 1387390 1597509
13918 1597509 1578778 1270150 1533567 1163734 1530554 1463322 1456937 1346529 1453210 1550016
13908 1550016 1275131 1122199 1241679 1074194 1125854 1459284 1148928 1409556 1045447 1215734
13898 1215734 1255472 1293841 1116824 1303410 939341 1542412 1233276 1162610 1571032 1389147
13888 1389147 1082115 1010688 1273779 824726 1440791 1099498 1206783 1096322 1312848 1206797
13878 1206797 1301861 1072557 1083726 1374406 976661 1236470 884649 1113666 930394 1207292
13868 1207292 1139842 1043338 1303208 1351091 793243 923552 1299202 1096541 998660 928049
13858 928049 850626 1005702 1026451 741640 905504 998441 1258917 1015495 889938 938374
13848 938374 1254469 683156 628742 1031530 979145 929157 644764 933430 939991 941053 1056652
13837 1056652 1008783 982282 639295 1110334 883881 921292 1028278 741271 954928 1040459
13827 1040459 799107 854354 797861 913328 964277 1022552 824085 498708 1096599 1007586
13817 1007586 937141 861916 1002790 752498 807496 788203 774490 872225 928528 573610 936403
13806 936403 861489 665069 890414 622748 694940 892852 920370 961595 947367 791898
13796 791898 756805 632730 878533 675621 909556 942762 574358 679743 953002 459554
13785 767040 626170 554669 890746 778291 319459 812349 666574 746025 493028 563766
13775 563766 593496 859157 644743 705402 241400 689503 622358 1029406 702951 491695
13765 491695 589645 707548 498569 520446 618397 516401 584394 534547 650037 712021 485968
13754 485968 628622 1129218 346812 573561 848091 693507 753156 508228 575016 447594
13744 447594 456466 735648 791843 943642 430434 299965 961828 485378 341834 330335
13734 330335 382807 824350 718075 458491 730752 455422 403125 490340 556872 506297
13724 506297 618229 951639 585361 878048 741250 447736 517997 515874 548590 654465
13714 654465 478207 785254 476624 277172 371983 180748 499431 447811 397750 500802
13704 500802 219251 217895 658574 757815 651966 495071 537175 692588 396286 719481
13694 719481 725628 590759 128884 287258 964044 577211 502806 381560 278858 467572
13684 467572 389501 582050 433794 717479 545503 104425 595366 721902 554222 545038
13674 545038 689554 863993 470081 270572 698156 323472 567883 235841 633584 555171
13664 555171 500053 571695 666589 298154 385588 535295 604613 642058 699255 887731 361087
13652 493981 427257 598129 887869 364290 575539 546855 577582 220695 367177 68354
13641 233905 486627 531949 401782 476674 266063 503435 507607 528487 344360 302895 551645
13630 551645 397889 69804 501636 321204 378674 495750 487138 537490 565589 148053 297462
13619 297462 78166 722672 184869 -20384 187215 236833 486730 221447 267161 138471
13609 138471 251418 415792 62510 242872 337337 553736 464621 485534 179216 99136
13599 99136 240157 448524 383483 709951 643639 488807 444534 404167 623381 -15049 582915
13587 221918 396154 100024 104155 475583 434733 609956 321284 272873 164932 374712
13577 374712 32987 91083 490201 372871 18074 151901 422998 217363 129927 176700
13567 176700 326763 473987 -6189 220097 433855 509191 546642 238085 227674 516414
13557 516414 307649 378417 175480 324077 161096 448335 264356 574369 224615 197940
13547 197940 590120 135087 432055 230179 305039 472071 326158 126377 304555 293816
13537 293816 303030 94926 260839 330521 412190 148210 82830 296220 291079 155106 336602
13526 336602 344111 75798 521049 348111 14427 377259 -72214 470544 485939 493893 -127233
13514 234310 71954 394304 312294 327170 339992 177230 304623 141466 -223610 484506
13503 229928 495005 249483 226054 438825 237569 372886 232339 358635 136454 319957
13493 319957 432977 130417 324040 484073 348417 149748 348210 160062 240951 231821
13483 231821 420358 303915 146977 211908 287441 399980 307415 -26084 182854 138414
13473 138414 363293 80422 207226 297281 84293 333359 11404 342256 483068 325263
13463 325263 299925 213265 135575 -244058 277201 -223370 199260 245249 120774 245390
13453 245390 314962 386569 92428 -38798 382163 289161 47809 14232 141830 201867 222014
13442 222014 49405 -201251 187285 68118 199675 273731 198903 75444 -54053 302145 100299
13430 210041 219516 221041 584099 54106 -164069 414631 -37837 185315 188837 151029 188205
13419 188205 354653 -22370 -10322 145108 180888 195236 23778 546252 383788 14674 29824
13408 29824 -7618 43050 171066 275913 350432 226567 32907 345262 413293 137060 149395
13397 149395 571256 61022 129686 188528 8964 67499 150092 31904 -205670 110867 111387
13386 111387 -19647 107264 344173 536576 314089 62219 187320 344330 296320 276560
13376 276560 151347 41112 2819 300593 155213 80660 174291 -12816 60749 271126 172496
13365 172496 438033 44430 396472 154424 -48362 261679 168401 417341 -71646 442559
13354 89400 -19728 15179 167961 19458 -122027 283820 154731 179357 404456 308847 415876
13343 415876 289995 457187 84808 -25051 238047 291907 -57250 86019 369308 136028
13332 272425 204332 -112123 83008 145561 312190 -112871 159657 -141342 392340 343818
13322 343818 186616 -75995 78238 81450 65562 171120 501147 -59270 25492 218127 353075
13311 353075 73215 -19950 148036 208685 -28666 248676 128403 389274 129698 97537
13301 97537 46127 292586 268587 276073 55931 160193 233770 221038 108393 241992 447218
13290 447218 232409 142346 -51001 112510 24131 138536 -40421 112153 58386 77147 36575
13278 146383 -182738 193766 115991 330489 126720 226369 -91961 41840 121408 -135929
13267 -31641 421472 3559 292521 112524 130694 27616 241029 101659 109639 59795 178657
13256 178657 406868 179770 359426 5393 131111 -95688 26433 490077 131389 -139900
13245 195484 296389 -17973 -77046 128571 335018 34619 381271 69702 -62753 171717
13234 228858 22873 165164 109435 90345 98042 423575 281992 418717 109302 606911
13224 606911 393521 241283 86906 179470 311637 83633 111044 80801 239743 169443 253
13212 129700 40795 88355 -63246 84788 -75566 214746 182242 51140 215968 52766 167604
13201 167604 50464 18039 -60940 124917 164662 -5763 170127 121427 50834 75866 265003
13190 265003 131879 -55249 -154603 -34596 -162253 15736 53655 210640 131875 156165 290558
13179 290558 -42915 149908 -76171 137206 82549 186586 -172308 347848 -32483 211047
13168 -177619 70617 -32989 356066 63523 -20617 -174076 -104704 167380 -91458 33847 -315261
13156 471206 492979 -40441 -166693 27994 73490 -59792 186982 376201 192743 179421 116528
13145 116528 6156 338084 250825 -39389 90891 105427 274362 326802 -44464 -497235 28492
13133 219191 158152 13808 54270 84381 -32895 187290 199768 -226182 165204 -171417 52084
13121 -202879 -63084 133099 -218372 -164863 -158548 56681 -145496 82673 -36846 232074 -4130
13109 98066 442243 72126 -219215 198877 -180598 59305 72942 301954 289604 53019 69533
13098 69533 140367 -88814 61452 186023 -149951 68955 71397 102158 407895 -8210 68412
13086 363668 118117 349612 92387 146521 -2752 67365 -85833 137884 259348 50889 -72216
13074 254825 -82929 126308 117845 243950 -111378 388595 137813 309826 407141 372435
13064 372435 51779 -55585 285576 149283 -158725 128106 184028 210230 426075 18519
13053 35707 101468 210609 -155386 158742 66376 93966 -72560 80810 -247330 175874 -174040
13041 189733 224111 2870 -23181 -31150 366047 -145914 280785 85102 127210 -51574 143236
13029 -148197 13739 456374 46338 122730 10641 38575 -37380 105735 11812 46193 114736
13018 114736 233167 342098 460739 -5213 -57684 44763 272139 16695 198506 153685 -80128
13006 43772 -22814 111308 376186 -11712 -80438 230823 221835 -25364 -14400 159362 14977
12994 117774 323598 131661 36141 27873 -116723 119058 -163685 -978 -264407 -50755 -53710
12983 -53710 -355908 86430 69863 120904 -151062 -60951 222922 139515 -56757 -18445 -95887
12972 -95887 276953 504762 -17287 366748 -43360 105103 175557 -44458 -35507 -69652 -162309
12961 -162309 71268 229083 138048 107201 84501 -97312 364822 -118507 45181 65724 -396790
12949 -90680 300078 -176675 172831 309166 47387 -395024 33523 -11063 -149138 148529
12938 65732 -24848 64693 -294178 45406 -95959 23348 -222073 259370 175470 116095 97628
12927 97628 -167490 -1238 -14700 370717 28267 229599 136223 -170900 202414 129866 7450
12915 -121969 155922 -12730 292519 372524 232512 -52401 -25910 12902 265077 126669
12904 100237 -24891 -104829 186072 -278621 155668 228104 82115 -44100 258969 34792 274426
12893 274426 432074 -170875 -91705 151307 39001 48186 262717 -3445 27103 308979 111424
12881 175484 -46712 -33685 45368 89158 12302 48921 264761 -88384 -69962 94099 108547
12870 108547 -181818 129114 -80344 188840 223143 249174 38901 34451 8343 5077 83458
12859 83458 -16845 -156305 -70206 122478 328540 -84750 -279182 -97903 408354 391961 30336
12847 28520 175340 -204883 -25842 3883 153165 84476 -179830 262154 38817 259700 -73510
12835 114680 -45986 -92020 216957 33549 -44968 74209 -159279 37832 65741 -146545 -206984
12824 -206984 -43849 -276911 144827 174504 166254 -50921 -98742 438 -149757 121783 -166896
12812 319778 -62998 -200743 -275027 -93280 -163188 15653 31662 -15614 180656 -214450 -63456
12800 -120447 -246362 -81307 -81080 237216 82907 53680 105369 128556 -7653 -121780 -173258
12789 -173258 59802 67741 -93541 -69109 -28979 61992 -144891 -65481 32899 -14225 -124361
12778 -124361 -56154 -32796 -28140 -142889 173582 6583 -101740 19089 -175888 -3332 184829
12766 76760 -120977 62726 -24331 135996 -145464 372509 98458 243638 32664 270841
12756 270841 296989 -151464 -140812 291129 231456 162879 158771 18277 388464 -189214 -209228
12745 -209228 -86647 19484 -67904 115289 174078 380433 -108960 135184 -52378 201809
12734 98259 41856 -344222 -147838 -127996 182712 159652 52669 185242 -141562 98573 89782
12723 89782 195870 -23163 474115 -43357 -279952 -313277 -16760 -148528 58305 -218648 15032
12711 4094 -71186 292047 -57947 338283 110690 194237 81097 156728 312371 -21462 70649
12699 181369 -268609 138121 11586 181809 -81992 210345 15303 429203 127157 142422
12689 142422 -10514 -195360 -257560 339275 -167802 110186 215504 82151 254532 67071
12678 74139 246003 217320 130224 81699 -350937 493230 309204 182878 -99046 305892
12667 267477 235408 10212 -33023 -15614 -38337 166783 411523 168677 186536 -31591 -107355
12656 -107355 354710 133205 190752 35636 29068 336863 70094 377722 160128 314920
12646 314920 26148 9004 250537 177575 -168729 -54788 -111977 261684 -238551 144706 189547
12635 189547 66993 258507 105176 84938 -226527 454024 -194687 -226171 -59805 64991
12624 68251 239413 324893 -170115 322137 318956 438702 286825 350567 -185594 262318
12613 -99250 553040 40943 -83296 175395 -34356 47528 -45330 58740 126851 -55639 113168
12601 -140583 92378 -269240 121006 378486 279530 -27154 -11311 274075 -147517 343861
12590 -57595 113570 -155292 -191204 102867 18884 -46858 -204241 -25987 -179153 91602 201209
12579 201209 99153 -183496 -335487 99052 -22499 107536 262760 -236046 74352 48967
12569 48967 220237 -24627 212446 107359 -124250 -278187 -16784 114716 179505 479429
12559 479429 -46233 -211461 89364 219238 151884 -260865 112409 300094 24493 -121296
12548 51229 140525 -178081 -11245 -310602 -122168 133168 -206867 162486 82430 -31334
12537 -173782 -184169 163203 -102952 63505 104455 252502 -100995 143212 -20429 203208
12526 241784 202837 -38352 45857 69154 161157 -354157 70538 255907 88193 -133641 -132063
12515 -132063 142094 4673 -36438 21191 137382 157837 93332 178448 517329 -174998 -114759
12504 -114759 179803 323600 -145420 247798 194655 110554 65339 279626 121662 147200
12494 147200 105927 142968 -79178 56759 -144117 -429316 137964 -24117 -61045 -27350 342112
12482 -123948 -129753 -83398 212592 -79221 41994 -20350 216525 -35908 -34649 282692 -72289
12470 7374 167308 165337 -102098 322734 181009 -211632 -53720 121014 -202394 183053
12459 -90518 -265576 -163409 -293859 -20728 -86604 -102521 -143237 -191659 -33503 -100037 -43203
12447 -17483 -74004 172779 -203583 -105329 -14807 -34623 -166057 126720 79141 1860 -96656
12435 -330298 81400 238036 -49000 351552 -235722 -471148 -20026 137962 69288 -215129
12424 138692 -222445 -210117 -215973 -53421 403042 266191 -102797 72127 -196018 -21116 -421937
12413 -421937 -146380 114611 136318 -105341 -154468 41539 -126051 -94262 -95057 102638 103821
12402 103821 228623 78732 -219753 -16924 -168110 -89201 27206 -128747 76736 -234925
12391 209200 -76728 -138314 -92417 72279 29483 191591 506658 39741 106807 190190 -181224
12379 -49449 145306 211269 98492 138925 5688 18635 123446 -21845 -28681 51348 564129
12368 564129 303112 -42353 -80572 10777 34970 -50389 260403 142456 13778 86323 285430
12357 285430 93008 -256748 -166295 -135862 -65793 6160 -5790 211942 -13002 113233 14577
12345 -151649 298532 210673 -59117 374297 -157883 175610 -124320 -88555 -127991 -122589 129723
12333 -260619 237175 -274381 101906 186722 63352 -154826 -28489 33505 -354850 -242535
12323 -242535 -43442 58193 112959 131691 -134574 344577 393636 205530 -115411 -130956 -73849
12312 -73849 25751 -95343 130188 422412 -209063 169439 -377168 48228 -360617 -61494
12301 220059 -234301 51209 -101346 145271 -164186 -167062 127772 44625 120843 191314 -36440
12289 198025 -360231 -194955 11738 452735 246236 24655 -128970 28346 15072 268724
12279 268724 333812 115371 -203136 204269 -37481 72316 188292 304980 359791 45091
12268 140622 -154757 -3622 -120227 165539 35883 -62134 -225456 193514 -134739 24371
12257 -201481 -44625 133454 -217920 -309652 -51297 29064 150821 -116034 373443 198385
12247 198385 118498 114329 -95213 -87131 -257688 -76612 189120 -78105 -240441 199888 -9721
12235 171492 54999 74058 -346219 97265 -63899 330451 -70085 34256 73747 -42237 2223
12223 398257 347106 154389 19213 73830 127253 192812 50748 12292 -63220 208956 323699
12212 323699 152806 45207 -21254 143721 66168 198974 76706 -170118 117799 27181
12201 66116 129676 504935 215217 21886 522770 437336 148679 177012 230756 345826 177743
12190 177743 63844 124557 125078 -64273 173898 200877 9974 123794 116560 -13288 143480 30021
12177 82064 129422 58627 323401 -74085 56969 317289 -43311 29621 277541 384207 44223
12165 137677 130690 217723 413753 -143619 -54865 59414 230702 -76364 -31113 -98514 -97647
12154 -97647 59523 60075 -62761 71570 -104964 -48221 244667 190856 43028 111763 -266650
12142 102250 23127 200848 102055 -53840 73659 124088 87039 100782 57277 -56547 -147553
12131 -147553 249104 -83693 107664 212031 144858 -23237 42883 175589 -193792 -4996 172033
12119 -319234 -256093 295045 342637 60722 -373948 228327 -180347 63490 325768 408747
12109 408747 -160945 30259 6292 -80919 227257 -86023 -182359 -156612 49037 36779 -146441
12097 108751 225956 -28821 54104 166987 -5344 62517 215038 -94260 287429 84204 175778
12086 175778 -11437 82087 -182809 -223806 -63063 159840 288055 1059908 1658138 925945
12076 925945 457318 508586 330256 120125 98074 31190 332217 175958 -205507 248066
12065 396249 -19111 11148 332240 -108047 42570 -176564 -191266 -280903 58513 -166723 -387544
12054 -387544 300256 21926 90971 181178 87881 68121 202006 -399360 -426062 120238 -409703
12042 50784 -374263 -112680 107222 145475 205422 26261 292302 -326726 -115726 72672
12031 -333361 313961 219593 2414 -170477 194789 21176 152331 -326948 136289 -325634
12020 -177230 207218 367629 363310 57908 -149817 218175 -108762 -67574 296763 -98167
12009 -32441 -17226 202950 53763 81991 -22580 209075 -9435 -70048 48298 -180734 240064
11997 4196 197996 -173474 -91115 -13460 157930 -111420 -257214 219097 140112 -129568
11986 -34427 276728 242784 120601 -175760 31869 97338 116571 -78474 55569 -172452 32071
11974 -112352 19211 -13684 80916 -246057 260588 -247579 -279930 134687 232722 -65826 -30284
11962 40808 -307642 -129791 93123 -126498 -41595 32486 -75036 76227 -94112 111765 228167
11951 228167 145459 -173144 -244046 -130583 -38962 -56211 266526 -252108 -111170 -175141
11941 -175141 247216 -36752 29155 -177527 51994 -134645 397869 -9254 75909 86648 355955
11930 355955 -219666 -609448 -691 -42732 93016 -40662 160927 190524 -153166 -239346 -361367
11919 -361367 -263186 264903 -68543 -108783 306582 -8382 -114575 172950 -263247 85595 -189180
11907 -236468 -444 118276 -27102 211558 415595 174359 -7396 -429904 -201142 -156793 -49284
11895 -285120 38344 -24460 -40120 223438 21316 -73192 -152786 -267109 84080 58261 290719
11884 290719 -159928 -197117 11075 -37797 11447 32555 109135 120861 381491 30327 215987
11873 215987 -154652 -245062 -513142 294629 -155310 -60859 -38685 -186661 161650 22515
11862 -22513 -249239 -96457 -190619 99814 4148 161635 -86582 -59027 -108711 33159 82816
11851 82816 -88046 -123731 280637 46923 187745 -84519 -117872 -26661 -27616 18400 -184051
11839 -89121 -104373 -50427 182435 93066 -68462 -33600 -260000 259017 -87503 14876 -97119
11827 -157178 24670 92001 -192738 -62658 -104813 52380 -50637 -68004 -91981 -26978 97885
11815 280607 62844 -104207 -28931 -80288 277881 65223 -14439 -108681 377221 111743 -75048
11803 83902 -227388 -278298 -42164 -138427 -154586 -104600 -62307 27757 102778 120221 -124060
11791 105643 -53498 178156 150685 91356 11469 -204314 198285 -42747 61697 38875 -48235
11779 93225 -158495 152684 58249 229840 -193123 153667 -247975 -66147 311931 -227306
11768 180682 72679 58626 26656 50711 144045 113412 -93510 282169 -93861 -264112 -790
11756 92345 224731 -6094 66471 -113486 195709 78400 -39406 -304775 -251558 462098 -140582
11744 37590 189235 -267506 52694 -108083 12463 28855 -12559 -154029 192760 125372 -47982
11732 180046 283118 31367 -183781 -59981 -169657 -158351 -64568 -69675 196863 174727 -31263
11720 125524 -143455 207847 -47032 -59447 128351 209018 154921 124666 167089 847 222205
11709 222205 165705 126235 -93076 97194 -38666 -156532 -103483 304145 -67355 -85848 100673
11697 -88972 157144 -72107 -174498 -19372 -25413 -237276 50192 227680 226812 -333906 -151134
11685 103827 -262544 11202 -62476 210450 -52725 13685 45760 -136193 -204026 191803 -257581
11673 -199580 -9231 -301679 135187 59909 -85858 46293 -215180 151314 -206922 44312 144571
11662 144571 149116 71975 -104316 104453 87079 65701 112950 209634 83918 83663 264999
11651 264999 8387 8178 246109 -187174 -171917 -139887 330042 -115213 262924 279135 51021
11639 141043 -45955 21111 -98904 85560 -27067 63520 -97779 287205 72344 -214307 116508
11627 -83561 158535 -19225 -19805 -208751 75684 100866 -117086 -259679 54619 -168753 137069
11615 -20111 -296512 138750 239552 -69450 116805 -109694 -56296 -142522 213742 -34928
11604 116748 49821 162535 -65817 169769 244651 -21241 140844 192823 36778 59838 -54595
11592 181337 -46843 221200 346864 -8794 -49383 227569 -24089 109679 341809 51658 127015
11581 127015 156290 277093 247988 -69092 -161868 -207136 186656 -210506 -8977 -17977 444854
11569 -221411 54067 315702 219731 98469 60536 88822 228917 167142 168774 161238 146729
11558 146729 51787 88215 33751 -135721 43165 125463 279780 380991 -273522 10373 115722
11547 115722 178907 -48509 167427 -252932 205904 -7115 51355 -268362 -88662 99966 119908
11536 119908 124759 113828 122423 397181 156772 93864 352889 3062 112323 -324860 91374
11524 60083 -13941 57447 -53238 47331 269837 -89690 183901 25196 239822 -282204 271859
11512 94705 -54078 238441 202561 115597 -18024 130684 -27470 135755 266853 442281 -176119
11500 369324 113752 -88031 -52071 244203 294118 -29106 -18454 215708 224420 -2675 -43545
11489 -43545 216675 448756 -23609 99266 376973 136884 -2787 412702 -62414 229404 -144215
11477 241944 504969 -115258 145342 161798 -115572 -178269 192854 68602 276385 284426
11467 284426 43151 138595 -51486 -4716 299332 -33011 -69033 80890 -35080 205987 160810
11456 160810 258674 -346585 36462 -4240 112479 -231039 126488 86283 195472 32937 250055
11445 250055 -110782 206454 -34262 -25779 -178741 -10022 16972 259657 143138 101967 -151070
11433 68628 39531 -219509 53929 -102205 143397 135927 102356 -269931 -99290 181461 85114
11421 132235 136171 -305060 266809 241946 -77448 274500 15321 -128612 -179742 -41697 93239
11409 -294054 194334 14596 -207984 150980 27711 214100 191654 68257 -150922 145138
11398 -149780 43090 222859 -13356 -100599 13801 48144 57145 5538 -65277 6654 275973 -75459
11385 -276636 54188 158927 50149 51628 122378 136905 170231 14478 -37599 174834 -293114
11373 -34671 45046 -285748 126515 202096 -21852 -5896 188800 -67709 -278570 255931 -80172
11361 -56735 -203647 44137 -44258 110560 -32213 -12558 -105740 -6195 -8478 91192 105989 -141825
11348 -74732 119123 126954 -38487 154133 247736 -85592 -157963 -54748 -5034 -178814 252871
11336 324902 -196291 113621 -204596 -188389 83380 177374 159780 -226760 -161423 -465607
11326 -465607 -92998 -125785 28225 158969 -231372 -149967 294450 -155910 19982 113560 -57930
11314 97509 236509 -25427 50218 -77684 -42567 -146808 -291960 -208927 986 -246955 -218419
11303 -218419 -328309 108888 329071 -168066 236321 -112798 -43003 72836 -20237 -63269
11293 -63269 119589 -298105 38265 -181676 -76885 34854 -39715 19096 -148509 5805 -12784
11281 283298 -108463 -59987 -161957 -50483 291893 235920 -161153 74834 -366246 175185
11270 -78166 182410 180960 -71227 -92835 -286603 87084 -12247 82216 92754 224256 -187275
11258 -247661 -54430 92732 -31628 152181 -284665 -91189 247075 61289 57966 30442 109545
11247 109545 31183 -161194 3577 -246911 16199 -188604 210492 -87905 82398 -173616 -84805
11235 -27123 70142 -232845 -24954 -246547 14518 -127533 -97155 187283 -313613 -124872
11224 -19281 -63609 53187 -77291 -119024 41244 -377720 138488 148532 93261 -78095 -309678
11213 -309678 9030 -237476 103705 -220621 -72443 -47464 -112967 -139210 -218199 -203002 24179
11201 -178451 -100010 -267404 37513 82733 -381619 17549 -39415 -106117 5248 47046 3291
11189 187529 -11344 -354318 -110610 185427 43431 -69721 1037 -178029 -261629 -151902 311786
11177 -275683 -80497 60901 -147346 -173416 147493 27053 -230230 -1580 77383 265843 -110996
11165 62007 64700 -93587 -231686 -164427 65210 75874 -11635 83051 18295 34357 -76979 350987
11152 -131773 4117 -245252 -243033 338087 135911 381303 -44876 241566 338650 41245 -77853
11140 240921 -60110 -118948 -92113 30230 -41578 -140446 -14647 -95822 269840 34862 60904
11129 60904 137477 -147905 234196 126133 346023 -205432 265980 146809 52373 139498
11119 139498 -36623 135598 110160 -244070 -367893 -45541 -153035 -12639 -19956 -192568 -5043
11107 -19712 113433 138309 155435 250235 149779 115754 24293 -3261 256516 354427 93803
11095 157050 239349 62486 200908 83868 90378 245760 -61028 197251 93689 227857 364966
11084 364966 -124268 135501 3646 226573 80218 260686 142386 144683 334843 151669
11073 293747 249213 308186 77973 244072 734529 330006 455962 773421 416430 259 557414
11062 557414 403201 504596 390028 645648 356682 612820 546955 490156 614327 744707
11052 744707 768676 559950 641421 436540 566163 992368 580138 593333 428747 632857
11042 632857 523281 942925 634435 449690 314213 744741 542144 496628 384533 536708
11032 536708 642194 572415 568619 749616 497004 768334 742455 737941 775304 572524 607447
11021 607447 814396 391761 965295 687331 811616 407865 370363 696406 380412 640017
11011 640017 672693 611688 759288 245976 554818 350536 646318 850779 576390 637072
11001 637072 523925 605599 683787 525422 475315 1039896 703091 463640 455554 636969
10991 636969 504338 695417 1015285 999812 803958 388188 484917 841321 1020672 1035827
10981 1035827 1069760 1252418 1142048 1409908 1383146 1584203 1887746 2043286 2409631 2328104
10971 2328104 2381937 2139445 2206724 2196799 1849294 1894332 1441240 1383055 1268986 1176535 1283189
10960 1283189 1352556 1301085 1730236 1688402 1529119 1672275 1434362 1466280 1504374 920958
10950 920958 655008 803623 633618 931008 544544 589925 194516 389748 375510 253941
10940 253941 146794 252477 95254 -81892 346410 195633 -17840 -194681 85094 305472
10930 305472 49538 3953 230581 -170825 221179 -41313 -2383 21958 145070 -165897 61112
10918 -137040 37314 -143895 -154917 -112174 -100653 382328 -84255 -155626 -140246 -49228 29978
10906 -109000 12868 42766 -241134 -398834 128602 222906 -53257 42312 -125198 129890
10895 360595 58663 79703 59661 -281473 35225 -68305 -107066 120521 132192 -108382 -28863
10883 -366805 -238583 -258272 66158 56978 -132468 158840 -134896 -75839 -356902 -166705
10872 -460346 -35443 18174 -200816 231322 377990 -23681 -90907 332281 -186690 -68792
10861 -108166 21526 -113239 -352077 -201600 460449 68706 -63544 -214687 20094 159287
10851 159287 384 -245841 -135793 -61474 45375 -215759 -302083 -99071 -186677 -412584 -149087
10839 -114499 -86098 262233 83129 202300 83844 125630 -239631 17814 -80812 -100633 48023
10827 88578 -243230 142424 3281 -1866 -120335 -237278 -136116 103984 -88259 -217032 -161313
10816 -161313 131826 -292003 40260 -212210 50147 -247716 -222481 -248015 -168730 -70089 -235826
10805 -235826 -36703 -141005 26724 -60289 -291771 -317715 148353 354294 -20932 9654 133532
10794 133532 -134523 136603 27046 -99324 -192394 -147137 -42352 -24150 -99 -102188 -370445
10783 -370445 129213 -209045 -135259 42583 -22222 -429186 342067 250997 245913 187388 75404
10771 -41350 30624 148167 -167876 30560 168386 173594 229771 144906 51351 -65362 222528
10759 -115528 -292589 -138620 313357 -23228 -199848 194759 -21069 -287555 -190871 -265432
10749 -265432 -161804 -237254 17992 93359 34760 73401 -222130 207300 -10800 10653 -215337
10737 -123648 60573 -254077 -338971 107299 -9165 -379486 148246 -236274 59750 94321 15694
10725 228572 -2959 56629 -126157 114976 -188841 -49521 -16850 95593 153915 -75142 -104213
10714 -104213 -141038 -92438 140858 211185 -84010 -42910 -128077 136618 -105910 -408188 -118567
10702 161939 5160 -506196 -45721 -113532 -22412 85119 228569 -12528 221704 -357247 234249
10690 173781 -50048 72782 214491 -249385 -46511 -39917 65207 -174155 -249076 245239 20272
10678 -5192 84439 -38978 -41799 -143453 55000 91780 -108424 -37823 -242415 -25889 -171009
10667 -171009 67320 151296 -80292 -147204 3070 -57244 158215 -309362 103707 -231092 -121537
10656 -121537 -181916 1076 -203737 -93875 -354152 138488 429690 -258763 -136851 23748
10645 -158471 -21101 -128841 -109644 -124049 113020 3131 109814 318455 -397967 -217608
10635 -217608 120222 -91709 -131338 -109057 -528228 -22486 -54461 161245 109506 53607 -319283
10623 -344809 -205839 -214216 -306152 -235740 1151 59604 143757 85418 -346286 -188840 -246959
10612 -246959 174788 2780 -219621 -62831 -117007 -183771 -85448 64107 -302954 -86399 -61499
10601 -61499 56806 -234617 42916 -28361 -204132 150617 167861 238721 154748 -62479 249845
10589 -4437 -109692 177262 -231068 21595 9572 -71684 -79565 -88308 -241888 -34474 31605 -64492
10576 -35572 86409 -138207 174963 -93356 -72918 -150619 -362847 -88208 -202263 3535 -7904
10564 -141159 -280819 193584 118713 -223674 -240103 172389 13367 -74400 -11486 -37656 -47315
10553 -47315 -51498 -81253 -242926 38690 287378 -52 109248 314064 -85685 -449348 -257760
10542 -257760 -54088 3092 24205 -208761 -194890 -123449 -9722 -93184 -169696 18722 -262250
10530 -183218 -221663 107563 -203781 41400 -420902 -222810 59743 88356 13600 -181079
10519 -205373 -61004 119288 110788 -85047 -110525 -150739 41536 -309916 -296890 -80518 -143119
10508 -143119 -105556 -226879 -81708 -121419 -128978 284523 138058 -108923 -198529 -313860 69235
10496 -122599 185132 219009 -108858 85658 -126368 241 97197 -151484 212548 -38652 154455
10484 329175 373750 28399 305440 743709 484326 464726 452770 140178 439138 233357
10474 233357 -254672 -143931 -37862 205390 -291747 -96630 -220905 180377 23743 -84454
10463 -39897 251943 91858 153167 -225859 -94494 -6750 -293190 186397 -190306 39337 -150659
10451 126909 26839 -214127 -50689 -92485 -15957 219456 -35489 24716 -82012 136749 -140879
10439 -94638 -119556 -120247 54442 124118 -303720 26704 -135197 -65981 -145415 207791 89313
10427 125100 -105266 94774 -56984 22360 -305084 120070 137988 -280399 -80145 403717
10416 110934 -60613 23072 -48315 -89158 -21302 -89049 -97692 -57150 -113924 -56200 -240396
10405 -240396 -77206 -177208 -73805 -87909 -24340 -58963 269597 -325593 41171 106605 135101
10394 135101 174429 183247 384802 164158 99671 187403 69226 -15346 -258809 266956 257709
10383 257709 179257 -95417 -116607 436653 234550 163411 106821 182725 115486 287875 328041
10372 328041 179567 206693 446247 569730 220990 511537 473451 371881 217195 54071
10361 -224134 179440 -17882 65708 82371 -83812 -189333 66977 20117 70903 345346 484353
10350 484353 507018 505336 358809 428853 106482 -91603 15102 440307 657486 369940 348686
10339 348686 9272 85679 441584 205231 -49478 163049 -79772 -120688 9878 -147196 -93728
10328 -93728 435858 62974 -222955 -555 -270128 125008 151545 24033 315292 394226 -26511
10316 263964 -56524 238630 237422 -104198 -125554 85942 35726 -23403 -346452 60156 -68223
10304 38931 20053 -44411 -334535 221999 -135810 128575 -253279 204904 -78376 156274
10293 -72217 79602 -12887 343665 84136 -100555 111534 -103775 -49889 -62830 57059 -232280
10281 -146474 -113973 -111270 -123990 -344111 34580 151374 -212836 79502 -3386 36348 -49010
10269 -258385 -184095 -151563 -262436 380469 -41579 146129 126234 333799 -116139 57315
10258 60015 -30946 177475 275263 -25351 124587 112311 -65584 -50962 342937 -53704 73388
10246 243263 -24162 -24899 -231166 -253091 -203510 112403 -19624 -142705 13818 -241306 -118615
10234 19176 -223381 -27869 -348703 54920 -52702 -56640 -20711 84504 -158023 -194005 317202
10222 -87563 177586 -249029 213694 -88386 -77573 -190543 -193750 -85941 254120 -192221 87891
10210 -462055 53803 25013 145488 -74332 203349 -262072 157932 72603 -37079 -229771
10200 -229771 -27867 -58106 9307 74525 70987 118172 91843 -107400 -94360 28125 -69809 -20921
10187 159180 -75582 -43083 -79569 123921 -23303 -16281 -137356 -136737 -274018 -134628 208361
10175 -156255 -167053 67613 -151849 -58025 -155606 69338 -368544 -24760 -53583 102115 -180946
10163 107523 587451 327202 37144 -30741 -95538 -4785 -100158 -36289 -107169 -236511 -221994
10152 -221994 -25433 -319268 240312 -69473 211187 -112062 30556 256484 -10243 -139909
10142 -139909 219250 -102428 -39814 17315 -160359 -69977 -265 147597 152389 56442 -9144
10130 -12851 -129982 66566 -21413 135274 -243612 316324 -20999 -280320 -210341 -15318 -122564
10119 -122564 -128778 173894 -125586 -194979 84340 356980 -101783 -84171 -59693 -170652 -65870
10107 81518 -94404 -30148 -220141 133684 -153657 -4934 -162761 -154932 -27726 -183190 -181090
10096 -181090 318837 63378 251688 -193940 10486 -239766 -152025 51944 -42210 30146 -184088
10084 -32960 13672 -125076 -123573 102924 54277 -440366 -393304 -58253 -137293 -36682 20421
10072 -407033 -183631 -113815 -68041 54352 -310595 3233 -97613 -109034 -249847 -87996 -42453
10060 -257451 -175588 -154007 -254645 -41644 141440 -77442 -65402 -265840 -148664 -257281
10050 -257281 -3290 -99425 -190633 35580 -62043 -4576 -3580 -127846 117574 -86140 -198467 -96353
10037 -114353 -142336 -179226 146937 142094 -60945 354375 -210447 20344 -165960 -192872 -56154
10025 81925 340023 135166 -284062 -60274 -69127 -15685 -411870 120578 -218475 -21995 178616
10013 -36852 -192727 -225392 -77083 -131261 -91189 80161 -192838 -261525 179057 -190141 239076
10001 140413 -28081 35140 -406823 101936 -144573 -87657 -108189 -9657 -332094 -69924 296353
9989 109637 -120667 -22833 -98321 -185431 -30315 -35233 62770 -283464 150693 69641 -254458
9977 245779 -186631 -242665 -100106 -340864 -51490 45093 68441 19256 17378 133945 -287946
9965 -156454 86600 -209891 96493 132869 -337781 -101771 -174147 321306 -127702 -238648
9955 -238648 69317 -89288 193951 -393886 -335465 -233324 -157750 -161822 322355 -192962 109696
9943 -364244 -68547 -403074 269172 -80908 70165 -168182 79090 -44145 51255 -63428 -256566
9932 -256566 -118495 -100595 62259 -35995 -184969 82361 -78002 -289845 239929 51716 279145
9921 279145 -213348 98915 -111732 -196961 140145 -176471 -234314 -165823 42345 -87749 -226733
9910 -226733 -91491 95355 -193727 -183112 -380873 57772 -57759 -410771 -268839 40485 -246446
9898 95130 204822 33603 204444 159967 -77223 -40647 -60336 -94130 -19321 -386481 237 296878
9886 296878 -171385 -121036 197218 142212 -296426 2374 191382 -383612 -95759 -32606 -164011
9875 -164011 348192 -158038 85123 270684 178083 46187 -379761 -167877 -38508 105800
9864 -93954 156965 123730 49046 104184 -114093 -65100 159173 -162689 -262117 -258222 -157695
9853 -157695 47521 -169382 119265 -43437 -141323 -285127 110108 -50899 -103416 -165310 -442657
9842 -442657 -79001 -226532 -122267 -48146 -77739 -148797 144339 -52852 -53516 -153916 -20454
9830 -268111 -345680 -45597 -50967 234996 -131704 -184111 -376496 218235 -362559 47203 -116442
9818 -349680 46097 -105847 -64737 7074 48364 -153946 -42069 -336897 -130215 189469 25208
9806 217633 34624 138611 -237368 -267675 -62356 -192504 -137416 -50774 -261331 163471 -40543
9794 45870 -201471 109038 265008 -262747 -16650 -140348 17638 -46440 -152177 155465
9783 -438224 199674 -194942 -175095 -62644 -162347 69693 -273372 -75091 -125848 -67042 -212039
9772 -212039 272313 -1768 -3410 -179470 -300676 793 189387 -213733 -142447 76450 -141581
9760 -82424 -76910 -334674 106128 -8205 -120763 -318944 -114171 -250072 -347897 -32225 -300797
9749 -300797 55140 -99887 -415259 25809 -362082 112186 50759 156747 54213 55664 -75546
9737 60773 -9495 -40242 -138744 -3142 250275 -153012 -103790 -106210 -142631 -458406 -143801 154167
9724 20861 -30918 280373 -186673 116288 -1535 17083 11676 170879 -281260 -164321 -98771
9713 -98771 -307180 -145765 -10786 -113773 -47098 184059 -39121 291133 -77389 205269 -71510
9701 2184 113731 71584 164487 31057 -304925 84638 -16257 -94802 -128945 -79140 -56587 82246
9688 -40827 22795 -19016 -62183 -211451 -152295 160982 247250 94427 -127634 286615 -147123
9676 -143796 115101 114253 -59768 20481 -152743 183822 -135296 -305070 157275 -103577 -381821
9665 -381821 -113281 136160 31229 -43232 -209080 -535 -113726 165451 -329361 -249527 -279820
9654 -279820 34810 75707 -168835 24857 37127 -403553 52679 209405 -142999 129103 -83349
9642 -204026 -35579 89502 51428 -191920 -25375 -33138 88616 -202647 179943 -214082 -134633
9631 -134633 116312 34914 -204276 -177004 -49631 -124745 -80595 -53777 40487 -326078 4766
9619 194207 -56505 -155423 -284389 -20402 -157100 -137160 103273 75641 -49224 195356 132213
9608 132213 -57461 243490 -106268 -224407 95663 -219123 -301202 241 83335 90839 -228389
9596 -240730 110352 89539 474571 -391646 -97603 199503 -168734 -244986 -99404 151549
9585 116695 -398099 -80187 -332787 -147828 -94137 -162168 358329 102757 243001 373403
9575 373403 129427 9818 -118125 19083 -84706 -70323 383182 -41916 51917 70824 100308
9564 100308 -296619 -82113 146568 -26725 76300 -50692 -103750 43663 34233 -70133 -77929 -232592
9552 -232592 20509 28791 224785 -28632 -87603 -151400 146696 -131546 -226439 85185 -114356
9540 -368524 -8286 -27518 170190 -177318 216929 192118 39646 53365 -302795 -121182 -340646
9529 -340646 157667 -231881 -115191 -105606 -238274 -242152 111509 -339814 -365402 -329747 142122
9517 -192220 -405122 -320929 3775 61048 -33709 39484 -224214 187820 -132213 86465 -359624
9505 -261435 66688 -144437 -137237 -326507 153846 80788 59209 -50656 129667 -272828 145685
9493 -243633 48718 40251 -114998 -109056 -91357 -157281 -42736 46478 12777 -271272 -19929 104227
9480 113863 -112792 -215262 -202963 -206002 -52644 -165199 -234478 -233749 -40283 -122841 -160527 -84261
9468 -84261 216668 -21941 -78377 -317209 -26698 96520 -84587 -170064 94503 -86169 -10991
9456 -324236 -269956 -29693 43585 -266466 -184936 104728 -38970 -110356 -236999 61703 -208983
9444 -279351 78566 -22235 -50294 -133 22921 -83785 -239698 -3461 149833 -133070 -69220 -161678
9432 -161678 -243613 -266904 -47823 69786 138667 132536 -96468 -278932 -206600 97999 -60667 -195308
9420 -195308 -13799 181669 -250785 -166700 370885 -176729 -126115 -308926 -485808 61727
9409 -26882 -38474 -90489 165998 -145950 -64503 -270342 -289730 141772 35201 21107 126816
9398 126816 74682 157827 -57343 -182099 114819 -209854 -80277 74882 -49065 173552 -67095
9386 -44674 38609 -129169 -93373 115360 130228 198616 207517 205645 -60465 128134 -166799
9374 114849 -91432 -239057 -145356 -137735 -252521 -265952 -285264 136013 240814 82232 -154754
9362 -17744 -247760 -277206 -56897 -31388 -208239 -290018 -140437 -143698 375870 153834 -67756
9350 11658 -403972 209791 259958 73221 207229 -109029 -179245 80587 -145642 -130214 110278
9338 66150 101758 -272511 40062 328550 14667 -27581 117064 148352 43609 130131 103788
9327 103788 -3935 72548 -254180 -141779 -47670 87009 348091 45079 -282803 86737 254473
9316 254473 -268530 -185294 11595 45241 -286290 165467 -442523 -41541 -22546 -16403 -6549
9304 -36698 -91956 38950 -72555 212594 362258 -434188 -16165 48798 -274351 -84729 784
9292 -158715 -45502 186345 -268408 -40514 -90691 5492 142232 116207 -180803 -279833 100642
9280 -192837 -6032 -57756 307620 -53792 -205012 240683 -472649 -124440 -32982 -153559 223828
9268 176328 -3981 -233222 -219641 -63651 172860 -297912 -143498 -109739 144479 61617 -174733
9256 -340247 -233944 39685 152961 -165508 -379961 -109959 -87828 279033 -114776 -281783
9246 -281783 -103793 -206990 -134607 -7943 -181405 41017 -154788 -85755 -91765 -6362 103541
9234 24593 -225062 -88393 77536 -146762 -279798 -133091 21946 89059 -50533 -211110 170284
9222 -382846 4279 17834 -331613 94146 100723 56456 6794 238340 -95573 -178719 157237 -155764
9209 -108284 -20619 -4515 14587 158469 -336117 155859 139461 -137719 -337305 -1400 97006
9197 -83398 -291296 -153106 288151 -280004 220206 -263368 -203253 -136038 -442226 -23321
9186 -65056 45434 -50620 -119829 -205521 87847 -4111 -83565 -23639 -447208 -49176 -156859 -367066
9174 -367066 -278329 -36610 -569825 -183963 24948 -300798 -192842 63667 138086 67162 -61050
9162 -291121 -171653 89791 -57622 7648 99520 182304 52442 -77905 14176 -95892 172622
9150 -106367 -483714 -43130 151421 154228 -43550 91285 -82263 -76017 -80238 -197608 264771
9138 -364951 -10701 24341 -42537 -29565 -62368 -174703 14999 115235 -210605 83676 -42180
9126 120484 30295 -293209 300723 270355 20475 -107328 -272845 -99246 -193803 -245311 17576
9114 -54665 -187266 -12152 -173125 99424 13695 236457 -193251 -235310 86636 44519 33334
9103 33334 99124 -50676 -414756 101085 -169788 -22216 126260 372302 25518 -87380 145060
9091 -125950 -372312 -11096 -24955 135943 -226424 -58345 -58900 -368199 267074 83072 140818
9080 140818 -206180 3895 92533 -5511 -312682 -322369 -199337 51187 100568 -65149 -3604 62046
9067 67759 45150 -83459 -320757 -329463 -60263 142728 -93979 -59115 -164007 -216863 -239186
9056 -239186 3154 -140284 28523 60979 -63267 -130048 -138911 -123515 219943 -30523 147980
9044 -35334 144519 -243394 -71318 -58687 53537 -28813 16195 -334868 -69468 -157688 -52631
9032 -130905 -21052 180399 -27980 58647 -229776 12671 -88580 87961 216374 104657 -162535
9020 234834 -102541 -36697 -32097 202440 -121537 -110573 -35167 -113255 -76171 -253528 58527
9008 277418 -326908 275398 272144 -219234 205700 -218738 -144389 45715 -21842 -151797 -83176
8997 -83176 -283596 -104196 114679 -29944 118845 23414 -147624 -24619 135919 86589 -155015
8985 65043 160998 -307805 126767 29906 -121211 87353 -199399 -222228 58671 -96850 78540
8973 28386 39567 -215992 27654 -188203 40128 -174238 -82558 89750 -55816 -127547 -167657
8962 -167657 42130 -123632 -238171 -259173 25494 -233310 -16034 -59853 -194825 31458 156053
8951 156053 -103079 -106077 25070 -44524 -56271 -82777 -226667 -236199 44973 185206 88654
8939 -159023 163427 -18980 -196784 393453 343533 584228 95930 480964 282622 166653
8929 166653 -39438 123411 231304 236921 1041072 1797994 4984277 10279950 15604201 7488322
8918 3387821 1584711 1054243 371106 515175 12812 352843 -173737 -205112 100917 117096
8908 117096 364681 301947 -57867 -120639 -71615 242982 144628 -142321 -203620 -145363 42293
8896 28921 -183988 -294528 35763 227184 158443 -74185 -168838 -413478 41128 133346 -197742
8884 -222092 -53392 -524084 -109345 -221510 -192445 -66744 -13185 -195927 -269118 -86710 27863
8872 -4184 -28416 -100328 78152 -92759 2497 -34155 -23353 -89826 19276 226009 -147902 87045
8859 22205 206817 64687 -90433 -287472 91000 137604 140461 -260928 362627 -216764 -2682
8847 80558 16400 113275 -172398 -182559 -32901 -88885 104912 -91105 -113152 197374 -208251
8835 -214134 -51456 -236210 -31684 206131 -13873 -70871 142084 81294 -121445 12332 -282632
8823 -34588 -119618 -239994 -167745 191961 21079 169320 -9368 -219947 -87514 -85604 -54052
8812 -54052 -120328 -174179 -130790 -3379 177196 75480 -379309 -1932 90347 91425 -366834 38115
8799 -72493 229009 74780 -85046 -277151 -7422 -288086 91770 222447 1386 195586 85491
8787 -165645 -191806 -239919 -34829 -256994 34566 36004 45306 -52880 123427 241026 159360
8776 159360 206029 94111 -167226 24694 -139631 -171883 -195882 56613 -57304 -302065 22615
8764 -118493 -159546 5185 -86327 106685 -179507 -275643 57556 3447 208916 -35103 -107266
8753 -107266 -145702 -184315 122013 109420 -141776 -105659 -126750 -61975 -13935 -28198 -135385
8742 -135385 -59567 -157201 74085 -11953 2736 144613 92818 209332 83322 -6768 -255701
8731 -255701 -18437 -194930 -183447 -378719 -107934 -89381 -209618 111289 -358987 -120848
8720 128254 -12677 857 -116513 -177053 -11402 -251899 -273646 -68952 -216707 120716 275699
8709 275699 121200 -300757 -227971 18673 -22783 -70299 127073 13034 122333 121450 293977
8698 293977 121076 -65228 -332587 -282245 -355810 -219285 -93287 -103071 -172142 -49235 -498252
8687 -498252 -207368 -23597 32762 89252 -74315 40557 288579 -81323 35116 -54041 -2536
8675 46850 -288315 -239211 -309856 -46349 -41683 -66615 -100059 7072 -5575 -413547 52803 1666
8662 -304169 91790 -77079 -225562 99650 -212926 31424 222609 223464 -100915 19642 -120514
8650 -81825 -149751 -20682 -121760 -70130 210392 144641 -15006 -122621 -261778 -191772 -162164
8639 -162164 14385 -128866 28973 -48949 -88144 165881 2378 -141724 110465 -150064 177021
8627 33039 -262609 15663 69047 -336420 28636 -118465 31042 67280 68298 282870 -205769
8615 220786 98689 200766 -200344 47340 223245 -87007 209538 190331 29760 -171720 153859
8603 -50112 -487712 35832 -216611 -81894 -301799 -229139 16192 -293790 -240380 144298 -188023
8591 188705 -133056 63453 -210108 49261 37015 -218611 -44522 168341 -38494 84549 -241408
8579 -22917 -25290 30804 -21894 -126153 170346 139713 -40408 -63750 78220 389473 92144
8567 229052 -185648 -339623 64033 -40834 -504675 140744 215243 -265898 -59945 3548 45901
8556 45901 -50996 -50649 31290 66710 220980 -89648 -154745 -263132 -297907 13450 309686 -218196
8543 -30833 -87724 -73341 275533 86097 -335861 -117671 65665 -25495 289591 -34259 155811
8531 -112918 162927 81740 183896 -289385 -111449 -81448 -57239 -202277 116543 -78731
8520 79307 -74511 -109283 168455 -140435 -162092 -532 -288589 -115632 -38766 186681 -353389
8508 55519 -86938 -12249 -333682 3280 -131110 -22198 226308 -28411 56104 -152097 109956
8496 -186402 -95187 -173942 -175719 24004 -93757 179791 -158445 -321926 14401 -285091 480
8484 -231673 -226175 -186834 208359 39346 -129460 36508 -47201 166250 74498 -46734 196457
8472 35801 -145958 86858 -179190 7042 -175408 14268 -287217 -178449 64296 -23134 -168559
8461 -168559 89673 -2902 5970 298803 4044 -103811 -106506 -243875 1203 -44017 356519 -14010
8448 47592 -171201 -13143 -192263 254885 93357 -225518 -14823 -107295 -124083 -67642 -199621
8437 -199621 -366870 -216323 -200488 287363 14362 -14945 -101941 38414 -42759 70433 -263808
8425 212568 -4658 -148548 112141 35989 90325 -471143 220289 49670 214103 300598 -259782
8413 286287 130752 -184185 -254891 -188458 43526 -236790 -164916 -310484 141963 -158968
8402 80357 -93713 -133195 -100432 -250815 -209844 -172061 224612 260928 41067 -346863 -151895
8390 -99469 17868 101591 73904 -489324 -356915 151301 -219368 -161659 -82268 44846 67169
8379 67169 -79458 -99817 128736 7111 -291127 -15458 114626 -139794 -246459 -313436 -110743
8367 -255513 -1302 -236623 -226325 -48048 -8737 170545 208828 -249669 -139555 -68963 152083
8355 -9194 212259 -181772 -51241 -329485 -49254 -304311 -53253 252959 -40073 100079 -40872
8343 -275261 66348 132269 98157 384499 -1371 264719 296087 -204651 -104929 -54558 65241
8331 -4759 73382 -193561 -115377 121702 56670 -276557 -66456 -87003 144050 66240 -76157
8319 -132739 -49901 45729 -118137 -169220 -22862 43554 -4609 216072 -165814 -68900 -126994
8308 -126994 -65212 148973 -129159 -37584 -255619 -107785 -96011 -65022 -47365 -24324 -98763
8297 -98763 -10745 -921 -289292 -243521 -46378 24988 -216739 -11187 136990 -296070 -65007
8285 -186744 269891 136241 69757 -2909 -83282 -742149 216418 -60861 -166407 -91886 260148
8273 -116716 -92755 -124096 -1568 -132898 -300878 -14663 134898 64082 134706 -162124 -21204
8261 -234601 -59621 -14441 -205196 -277716 -98142 -18059 7128 -10988 -180644 -81740 110155
8249 211244 86805 178233 -72394 -60903 -168457 129639 -152550 -140721 134444 -21038 -2773
8237 -217517 -57907 -359841 -115800 -105632 -351932 70454 -114143 116801 -62839 -192034
8227 -192034 213055 -119527 -87799 -89967 19875 -185195 -28273 -169801 114159 -279969 -281706
8216 -281706 241 -265318 -141482 -200332 10767 70846 -58099 174557 -93673 12602 106554
8205 106554 80665 -229045 140775 -317013 73052 -1687 -191977 46525 -117317 -184020 36423
8193 -273594 132135 -246842 -92849 241270 203634 -259355 -43998 96276 -95574 -153123 12133
8181 -166506 -125645 -223005 -215025 251054 143753 244159 -16316 114242 -426931 -39614 -99107
8170 -99107 -72419 115621 -119733 72913 -41443 -54937 -167892 -254137 -81679 -220933 -221625
8159 -221625 -196717 -290459 -407637 -19372 56158 35279 76844 379806 -283592 -113979 -176870
8148 -176870 -71109 -33814 24697 63807 62852 -20350 79471 119676 -175501 82927 -268864 36703
8135 7638 293539 -204154 157426 -274916 -157790 205526 308027 -117656 265 -140906 -80892
8124 -80892 -62479 -124687 -172966 -7784 254106 31525 9622 -222803 -209215 19468 -169975 105530
8111 210315 -170225 19665 130670 384460 -195125 48694 104189 -233167 -31837 -154339
8101 -154339 163290 -101366 -155991 -37656 136978 200452 -36376 282327 36110 -89196 -100976
8090 -100976 164088 226865 -65517 -243315 -69526 -486549 -71015 -146139 117579 -26799 17824
8078 35172 -195971 192219 18747 -81640 -100555 27341 -194993 -74603 28441 -26104 -38100
8067 -38100 212410 160035 -50459 134219 -226802 108064 -410650 252654 17690 89671 156992
8056 156992 101428 -442936 -273243 19153 -72129 82833 -40845 -271633 130034 -12561 259225
8044 -20858 116547 30584 -394154 -277044 26688 59465 -97740 -280547 -157052 14434 -10841
8032 137326 52636 105968 67099 -237439 376542 -8298 152066 -31593 346610 -141269 -434792
8021 -434792 -85827 -256739 -104213 -68460 -57596 22753 -8340 83548 325777 -190247 -208375
8010 -208375 123908 -150920 -99549 -39002 38302 159028 -488499 87321 186720 -258906 60331
7998 -416983 -168939 -289330 -145320 16687 139948 283110 -60630 311894 -220312 -178743
7988 -178743 -208201 -22992 -266595 94955 236482 6213 -215999 -14796 -221155 24414 -79973
7976 151725 -150383 -8697 -113743 -24448 -266179 -86988 -260654 -154252 71310 -146265 -131073
7965 -131073 -3279 237465 -58664 -117134 69522 211165 -136293 112273 22673 170316 86206
7954 86206 -64024 -22978 265485 -403433 -188376 28730 509821 -144900 -48933 -141501 -51796
7942 38403 172159 -340723 -71967 136092 -138763 -398440 -165108 -102362 -287713 88391
7931 -179959 -333388 -238427 -123099 93633 -9345 -289560 -146899 -84025 -276819 -69563 89655
7919 -124945 -19120 -133134 117592 -154402 -303817 -71137 -166701 47343 -732 162087 201459
7908 201459 60077 -62263 -141485 -48445 39319 38917 86044 33405 -174118 -305400 -60022 250239
7895 68901 159043 -116973 176815 97613 -354782 43761 -394310 -95859 -26496 -105951 -93834
7884 -93834 -43828 -36625 -81342 47615 488 -95861 10832 38109 -30739 129862 -267127 -17244
7871 -19052 138164 50154 66928 -52728 541580 -44587 40015 45553 19904 42179 -205106
7859 -181108 -226572 1934 -32521 -349589 103938 -199661 -242303 250280 -82820 214758 257816
7848 257816 -149603 -53953 -137548 -145972 -215149 -22546 -146652 307770 10419 200508 -55956
7836 -228332 -49991 73368 -204617 -80981 -66146 300565 188225 259977 -76532 31709 -160673
7824 -225537 219099 -324594 10145 150741 -158661 66941 163907 -232090 -24218 25805 -320457
7812 78414 270611 124354 42975 9354 54787 357587 164100 -13547 99126 -223994 -114150
7801 -114150 -316969 -240005 -92725 12590 41777 -51614 -46578 216394 -253597 -48669 -272913
7790 -272913 -275229 -189667 182734 -458654 -140894 -23603 -194203 -200997 -210047 -212788 -65060 -131599
7778 -131599 72808 -54059 -40080 -135397 -19827 204147 142837 43868 -282811 -68493 -48841
7767 -48841 -300118 171410 -82647 421649 -190981 346304 -117840 68545 70125 -17261 -158165
7756 -158165 -50792 65853 -342946 -227521 -198610 37736 302739 218144 67289 -90719 240724
7744 -267972 132234 119135 178103 115516 209971 58018 -176048 -20006 -105801 -163604 -135220
7733 -135220 141946 -32227 71802 61687 -68367 -181875 -43803 -116366 -109959 55360 -192230
7721 -1625 10125 -151229 3855 90065 66749 -53406 61196 -41693 -196756 415017 202472
7709 -223553 28699 41974 -275374 144837 -10500 -58693 -167957 27716 52605 -279125 328422
7697 279202 92490 194192 5297 -308093 -170114 99869 -219428 168342 57947 -246141 56566
7685 -95371 115427 -307642 -53575 -90223 -104621 75754 44062 -76688 9605 34518 -186529
7673 -274998 -85839 -43501 -63118 -93168 -35438 -278071 54325 29775 149347 -144314 -173109
7662 -173109 23540 -99998 -23537 62979 -133604 181754 -12160 -109514 -87723 133582 191805
7651 191805 -305980 23858 178045 211907 -81451 69666 -120214 -308763 -195660 -279977 39964
7639 88197 -153106 89362 43574 -54294 -10694 -246308 254796 -49620 -27918 -124324 -48454
7627 6019 -238948 -76638 159840 -253197 -64447 196887 -291583 125854 -68184 -21537 92649
7615 274697 -178220 -99416 -282528 63450 189777 -40004 -291952 -111366 -103795 129545 45475
7603 -26285 -112427 45927 37201 116291 250514 -72170 -215305 88614 -149074 -143489 -175007 -57168
7590 -299292 -104695 -309986 -179574 46423 -154588 -447878 -19280 137200 -73095 -67983 10300
7578 -3344 -105602 -189799 39126 -9411 -57711 28461 626 39231 121060 157367 -126017 -247308
7566 -247308 -413050 -73296 9706 84136 -90462 164499 158664 173867 76582 236119 85485
7554 -1087 -185839 -99252 -213409 113012 7915 141911 135356 174512 73090 138645 -22423 136899
7541 37745 -47125 -307413 -59866 -97105 301637 -192446 -47017 51702 108344 103613 2595 109158
7529 109158 -99933 -201347 177595 -83645 -177211 -252634 -47421 -393258 -167302 -325821 -26646
7517 -35469 -86461 12480 -108024 52905 -207509 88493 190140 -410378 -56873 -163721 -162793
7506 -162793 -34763 -155341 -220470 68856 -90066 -146182 3224 71901 -50139 -194859 -233748
7495 -233748 108305 -360746 -181411 -72203 -43696 -366817 62380 -4674 150102 59569 20399
7483 35656 15421 35312 -29269 157069 119878 53457 -106144 -336937 -31354 -143677 31590
7471 -215006 34560 78618 66929 -78211 -75776 -309570 254723 -230559 -277714 42426 70509
7460 70509 -91391 255465 -82375 163098 -65643 94148 239393 104104 -44506 -40472 -79622
7449 -79622 4118 110933 87975 90611 -235679 -36508 -246498 97988 -18855 55160 -125007
7437 109622 -203320 207741 55546 288888 -470 -179714 -20086 35533 87120 -140699 -112295
7426 -112295 27170 -324101 -42823 -97673 201703 8126 189919 489896 -266508 -265358 -186588
7415 -186588 37939 274019 290761 -51500 -214793 114815 -200535 38599 -178083 272910
7404 -44903 -67066 -74461 -3140 -67106 31403 -257073 -272733 41234 -90581 -119167 39123 396036
7392 396036 -165713 -47243 -269010 100342 82088 26995 -295007 -37887 169448 289769
7382 289769 -240358 152885 33589 -243863 -137548 -166725 83707 82226 179037 316156 45319
7370 -242399 127138 135288 -285859 5243 -246650 -229407 106577 -47623 138544 -98524 -191594
7359 -191594 -191761 -101249 -70770 -234701 197077 -334119 197329 -20276 227996 306949 -96576
7347 -54913 46098 -54484 -72471 -124911 54966 54487 91515 -25499 21007 114541 66601 -12457
7334 116951 104452 -125223 2067 221303 173208 -124378 273606 -237915 -25181 116722 -157544
7322 -38697 103531 -56029 134530 18607 130108 -128168 -78653 -91572 -142409 -84663 -54882
7311 -54882 -163212 71608 152455 -213303 9813 -67155 13141 -356258 230437 31438 -262961
7299 -119863 -577527 196881 -345428 -243314 205977 -219814 176985 -14863 157415 -159689
7288 -155676 168670 -29623 229221 146347 104785 204622 -233224 -124461 -175208 99557 -171940
7276 236660 -112634 -148775 -242474 101500 73684 107530 -339491 79272 -205916 168981 -226893
7264 108632 201783 -89234 50790 -259752 -103089 22057 19024 6832 167228 174322 -107588
7252 -9384 -191643 69640 -196366 32954 -99217 -113161 -156013 -83884 141358 48614 -413150
7240 -357596 -64535 -201254 -154897 -114505 -86453 -365122 -110144 390412 -122818 -122130 36740
7228 -216134 -104250 -28472 -107252 -108085 -7368 52393 -199432 402947 238169 -15724 160084
7216 40164 -117316 -79809 293325 -112515 -190445 170771 -62782 127478 128399 -293311 34238
7204 32181 -234501 194394 45577 45348 -117401 31698 21034 -151084 157307 -155792 76312
7192 -314246 70010 -28578 -151386 262682 103400 -26929 -36693 -169674 257154 92876 37809
7180 34859 -10091 -66998 65033 13620 148788 -204276 39970 272887 8729 -319642 -263947
7169 -263947 -261225 204924 -8316 153944 -147391 208090 -160119 -532151 55346 -4029 -96326
7158 -96326 -18504 239775 -61241 -51382 201727 279821 -79959 71085 -103672 156393 -403478
7146 46012 57048 -361758 -223695 53587 103802 112409 124586 89140 -31218 -117275 -11513 24725
7133 -158996 -318441 15595 -127584 146735 65671 -324105 -45756 42410 99205 -402828 267559
7121 93201 -149973 -84863 -273608 347640 69136 314272 -101672 -71759 -25268 -83238 -110153
7110 -110153 -22578 -18726 40763 -73492 -113641 61317 -183480 254020 2153 -91845 -336745
7099 -336745 -205857 277593 126877 216592 -286620 137912 196280 -50450 -247689 85153
7088 219245 -146929 -57067 19381 46109 -8275 -422272 -90062 171932 35844 -29129 102591
7076 -149438 -14128 385087 366294 -64872 -288852 69465 147052 16686 -214507 -69085 304388
7064 92974 -41134 -206910 225414 -81714 -205229 -40061 119128 243494 176384 -30318 -73191
7053 -73191 133714 -12278 -116529 7067 -159651 -21479 29521 -51820 254361 235533 -29602
7041 -85067 114630 -80514 257803 -91391 -18972 82869 441516 -224148 254408 -156141 -149448
7030 -149448 364990 13451 -192018 -76708 -34081 62188 6404 -215123 -153845 -273637 -189999
7019 -189999 154070 -15409 -105850 -37460 -358194 -325977 -78516 92043 43167 -127187 -67191
7008 -67191 44062 8068 -83637 101229 114104 289054 -96595 46800 -104898 -43891 -65994
6997 -65994 23633 -98926 111318 125661 -17331 -279285 -97985 -98668 115662 -152486 -260982
6986 -260982 30738 21111 -67549 97787 -172728 180534 -155120 -85885 49589 -160428 111268
6974 -226948 -39633 -78953 -215153 -131419 375527 298150 -182365 -179315 -89448 -56060 2886
6962 124008 -55051 86358 201111 33268 39406 165444 -204996 188985 36212 -78991 124471
6950 52187 122909 -183226 41686 -106174 -172498 68069 -103691 -188307 -26620 130346 34860
6938 36328 98 -227464 40632 -289161 -141860 -281748 -203574 -113731 6931 314481 167431
6927 167431 207997 -49550 110658 33882 -123727 58357 173993 -109095 -83417 -297099 -537184
6916 -537184 -297854 270831 -218424 -62340 -116601 369366 -64592 -64740 86844 151300 -147444
6904 53740 74036 10593 -24656 3707 272068 208876 -170284 -265430 -9978 144635 -34335 41560
6891 39861 -29299 -116493 95025 70957 30641 -66579 19711 68032 -108323 92738 74103 -351867
6878 38817 -57904 -131806 -32574 22346 115649 -352275 -85390 -136759 -229209 76698 10534 -95943
6865 -175446 -55264 -143967 -36463 11273 13973 -59357 -72724 53134 246847 49151 25341 48708
6853 48708 -289814 329338 -477410 -256405 252591 -68194 237453 -424982 -53334 -17458
6842 -22458 -453770 5501 -272704 115172 242101 -122458 -34152 189241 225329 148032 -133546
6830 -125900 -100687 301304 191809 -156475 23937 21177 -33311 7976 -390 -102583 -172913 154289
6817 -82833 -1477 98047 11160 -92984 78388 201213 180033 44269 226775 185520 156571 -99174
6804 3003 -18625 -293063 70652 -167293 -144767 16320 3326 -28472 -133594 73341 -34313 394076
6791 -226546 -50999 -11380 278190 -67475 -48531 93041 -190127 -158258 65884 25800 215561
6780 215561 204474 158051 3614 76942 25813 -174592 -125666 -266014 -54742 -186153 -28373
6768 -38553 160194 -96418 86365 -135141 201707 52565 278637 -107847 36780 184239 245710
6757 245710 -24941 -132356 36590 6441 326304 -124100 -57934 210597 360968 295321 -63049
6745 210135 143142 -38582 -219939 38648 -90567 41919 -103259 -4771 310679 142859 -227006
6733 39781 149801 229689 -30864 -235030 -17383 -295036 -271461 -350721 1959 279199 -196681
6721 157251 302611 -87471 -166229 -106603 -99910 -349458 -47650 -95941 -1215 -93894 255730
6709 -90366 32323 65850 -134443 226170 -255419 -20739 34560 -245709 22600 8387 -35441
6697 137306 69425 192359 -14258 96285 5210 309100 103793 -530993 203331 127540 55172
6685 157145 -290543 -312641 6275 85125 -242738 74724 61894 -156848 -177498 -74496 -91103
6674 -91103 -182592 -232009 -67509 -112525 -27558 51098 -84303 204894 -9456 -36999 -275775 -46224
6661 -96562 171457 131632 38617 24807 14649 -157545 197103 -15230 96232 -152432 134204
6649 104714 -70261 -72015 273648 160476 -129253 264985 149580 -92641 176934 -125182
6638 58222 -95294 -4364 293898 -294766 -75701 168491 -108849 -215285 -34150 -106271 71901
6626 -97516 1359 235778 226 54229 -57895 104688 -124582 149267 54463 205881 65080
6614 31297 -139571 -130264 -129444 -36901 -160123 213448 -63545 2495 198469 -33379 -27652 -285319
6602 -285319 -134326 30515 -29256 -115988 109926 -119064 165957 -12629 -33485 -6474 149141
6590 -196059 -136916 209692 93847 -231954 -130170 1143 -77753 305100 35255 33049 -70425
6578 -114258 159852 40946 -215208 -24237 245266 -115047 196233 -117205 130600 -68681
6567 -182217 -143081 -136464 -23498 247380 -99050 213395 -93462 -5657 53163 -19845 -66268 -210569
6555 -210569 -81534 214198 168662 171028 399999 7028 94694 94082 -117730 39962 -76728 46770
6542 -73187 -33835 -25782 77802 280649 -268611 -102055 284653 -26676 296049 -276147 -257159
6531 -257159 251374 -147274 -172202 80507 32147 -112568 216320 193842 393084 104677
6520 352500 21165 -506948 -58909 -227054 -16745 149659 -125911 19459 227436 186810 -361602
6508 59034 12144 232398 -144125 43496 -152237 -3993 -80524 -296787 -4337 -276674 -62986
6496 -107244 113727 18755 -251124 38341 287951 -170774 305500 92815 -84285 125803
6485 12692 -29398 -252198 -79556 87575 89 -113376 293784 134281 153713 126108 288664
6474 288664 313975 -217523 32643 -527535 174146 -118626 -89700 148305 5721 -29919 8491
6462 -118572 -5204 31800 187348 24969 -40934 2633 -101370 126764 13378 -123543 95310
6450 34083 74170 -56373 89441 61496 -161947 46187 -389756 12120 -368141 129682 -93608
6438 -221110 -100091 94172 -171630 -88806 -259687 95518 -58440 -201277 -157616 31119 136693
6427 136693 -259228 178094 -12738 -319398 205195 268204 -162028 154538 -2552 56162 -32717
6415 371659 -348741 1043 -56805 55043 -35360 -212242 -37020 155084 -259348 28820 131239
6404 131239 -4284 -216153 -489799 135657 159056 -204892 314484 -17758 71053 -169096 -327048
6393 -327048 -43743 -116477 -27576 213948 -58636 -5127 -70565 -162948 50021 155766 177941
6382 177941 76623 -104492 -277893 -257555 -175932 -146029 98838 -52297 105899 15862 235320
6371 235320 77155 42377 -3685 -61278 234885 204411 -261520 -48563 76071 -145583 36140
6359 71094 68879 -192135 121613 -202546 -98904 -32567 86892 313 27928 87154 194453 210823
6347 210823 -115182 179239 172946 5196 36787 76683 168224 249443 -125916 -27725 81106
6335 -494974 92984 -62756 54356 -436542 -252323 186763 67928 -184551 -3270 44094 -103108
6323 157364 259396 -70928 170215 -42337 160233 374826 -214090 -157577 -377581 194221
6312 214676 351332 -82655 -265959 206477 -63629 192268 -71545 -153847 -294658 3121 275171
6301 275171 -111436 -261321 -199725 73786 340269 72803 -174836 34820 -154688 -328477
6291 -328477 66123 -80691 28957 -100841 98041 137487 -27568 -42124 -202624 -144868 -83704
6280 -83704 15246 -269407 229908 -28034 17887 -81714 -149122 52327 155608 266252 18065
6268 -37652 4263 -55892 -20683 140313 -61882 -300692 -67919 -8525 -26815 -124918 243427 -253409
6255 108470 -135073 1813 68970 -107421 157448 205834 -163529 44406 78335 -88041 -54204
6244 -54204 50029 292308 -35890 -250620 120989 -103764 135362 -119726 -84300 -148741 -111229
6233 -111229 -405043 23056 -34096 -33953 104076 -110419 268405 86013 224820 289961 44515
6221 -193490 45769 -328253 -134624 53589 -258253 -122964 15925 -74529 217770 -51011 224983
6209 -72778 68461 77298 92381 36480 -239787 177991 -237360 173467 -113391 -153688 -202892
6198 -202892 14985 -15637 -101846 -140109 -48592 66205 118948 261858 86892 -251618 -272955
6187 -272955 229119 -227849 9569 81409 204520 10031 91394 220047 196179 96414 102702
6176 102702 416183 114561 107924 27621 57862 109460 58308 46156 140735 153184 -139502
6164 93463 -112247 -178867 239586 239485 42555 -59286 -84000 -169272 -270703 324147 219755
6153 219755 -154224 56514 17802 34535 -185592 137884 95710 -52440 180593 123724 17532
6141 354624 -77389 -57125 687 -70798 43364 -97241 54108 160020 -181949 -154058 157568
6129 5506 -8465 151117 37715 66877 81798 -96823 112517 114646 41838 12474 -145563 297870
6116 -86394 -203503 -113937 -11781 -141487 195922 210075 -130598 -3201 7239 -212661 -14982
6104 33834 -101391 -204958 168288 163607 -94599 -31501 29649 4165 228446 246187 -237901
6092 -214174 -148838 -170855 24963 -52736 -45536 13729 -22242 70134 203646 160117 -164836
6080 187220 61958 -52324 42574 35273 71769 73258 -106100 109152 351125 42053 -184068
6068 -62978 -168880 176801 253219 226560 -114430 -28722 212606 -290173 -258984 4129 -534045
6056 -40681 19079 -5558 12293 -69461 8086 -37931 243808 126775 141219 115977 -86729 -38
6043 133632 -110632 -274823 -111591 327875 -9419 -185339 58640 -65551 284787 68911 -173215
6031 -26090 72289 264238 107235 -45858 163108 -102026 96133 -66067 29262 -40318 -64493
6020 -64493 -359185 287265 97298 -21467 102119 5295 146670 -78037 -298546 34568 -31042
6008 249705 -87203 23127 -193327 -126371 58021 123780 -159321 -193426 -48083 -135795 71145
5996 -57170 -86392 -295681 -237226 -262598 -44752 207042 -68431 131308 -50855 -276025 105562
5984 -28001 163449 -170887 64297 -99751 11013 226455 -310251 -112168 285229 -146263
5973 318783 -225396 -62027 -261455 -194751 192654 -101872 -54295 85279 230005 66447 -152711
5961 -10901 280710 -27306 -220173 -120584 73204 44753 86960 -226785 -9645 -235326 262758
5949 301830 301986 312911 134847 94312 160053 66862 -29019 -123802 -43917 -29650 118620 117922
5937 117922 -139442 -64179 193571 -202346 -139518 95002 76349 -282825 147866 84466 203877
5926 203877 -35048 230263 -90862 149770 -245595 -88357 -174956 -345295 -225198 51217 -1255
5914 102119 374003 14260 216827 136264 144330 -296717 -61787 73311 98936 86401 -275718
5902 132806 -101946 62098 -101619 -21409 109487 -187482 -543423 -42835 35157 263653
5892 263653 -192574 -50822 -140774 -286384 -174619 195663 -266544 -9095 -21502 12376 158628
5881 158628 5669 -46720 35857 -112881 -411190 -232980 27516 2830 72469 -106599 312844
5869 176374 142465 -60600 93770 -55797 95378 -123759 107174 -3554 -131738 19062 44785
5858 44785 -36831 -142734 65718 -65141 -74286 86794 114285 86660 30352 -33373 -120095 -219468
5846 -219468 -214885 -16726 193131 -3965 -33111 127102 579004 210082 75831 111900 -200870
5834 -122848 237647 -51171 -68681 192219 -67349 23638 114696 -103697 29670 -158663 -188424
5823 -188424 -107344 -74169 -144956 -85972 83143 214349 40201 -188173 -137381 393535 18396
5811 19835 108104 3418 -59453 88837 -64627 96456 -137620 21427 -98240 -168852 16004 88225
5799 88225 152714 80030 60302 355701 -50210 245473 98680 256769 -48811 -99999 -193676
5788 -193676 5645 152583 124515 -45706 -26260 -138428 -183734 -68676 2640 -163440 65483
5776 155350 28464 -104003 181238 -341425 -98400 54005 -74132 -129869 323254 -226168 75691
5764 -71510 -64236 200333 111557 64218 -63334 -91216 -149065 122035 -135505 284079 12761
5752 200675 -129707 -164567 -151926 -172777 -232958 120095 -212503 -207742 -129926 87516 -80414
5740 -290531 323801 272052 -23199 -21062 36353 42294 113787 331051 -314811 -12866 38810
5728 401467 167775 -68692 73273 -149679 189728 105447 22253 17274 -371701 -68844 60208
5716 -136177 133728 -93907 402749 255008 -132875 -140608 -54990 -205068 59072 -100089 -147924
5705 -147924 121764 -169700 -3535 90641 -184702 182994 351481 5591 177689 230391 -108394
5693 -10170 -289789 -36373 12476 65241 45501 431882 -126286 134416 70540 -83738 -236772
5682 -236772 139906 73584 -367496 -37268 44231 130928 -245806 -75151 154675 -86024 245817
5670 -190414 -119265 16992 202463 -168932 236963 305361 239729 66219 -235178 181983 -65830
5658 -92488 173686 166349 68910 100615 -93943 68199 -136267 -144919 -117838 320087 -246100
5646 156422 -150616 -131229 115893 96140 194930 -201677 48841 -52618 -103149 193387 51090
5634 -19211 -222651 -117954 229717 24765 71536 -165967 117881 159964 129348 -221876 6623
5622 193552 188473 43954 -196872 -99515 -114977 -117093 -74610 211804 -160123 15529 -87618
5610 38970 -186117 -310622 -393726 -74328 -125237 25887 -1052 -13649 -159123 106338 -289624
5598 99434 -64760 -31977 -309440 -264406 -254285 198121 108447 -127258 20013 317599 -79771
5586 -319330 68615 93945 274267 133588 247742 214608 110310 -135423 -7138 -40812 52770
5574 -91516 152894 115704 -101730 117991 72481 312461 66280 132641 -17597 -43444 -108589
5563 -108589 154659 169433 273811 -263957 -76259 192601 13604 -30982 206806 11498 -54619
5551 -19367 -175402 -13494 -118221 -72020 -73628 92474 164644 114520 59687 40753 114869 180494
5539 180494 210092 49956 140803 84148 226936 -176428 -240515 200075 280876 -174183 58205
5527 -3620 -390583 -94573 34812 126358 -228484 42513 51952 226746 -42875 146859 37926
5515 -386519 -64093 200648 300030 -41423 7782 -71447 -272202 43451 -3450 28468 -63157 -126449
5503 -126449 -116147 278525 -214256 -139104 37267 17669 307901 370772 -216000 63027 10461
5491 173321 -259040 164817 90945 -239053 -70316 -164333 -104489 -197580 -249862 153149 53058
5479 -122007 -143504 -12331 -25706 237635 -265966 179978 -148228 -212462 26016 167711 -84428
5467 177268 -133399 150302 204556 -49305 -113435 -260209 -191345 60827 -224103 -59306 172255
5455 61097 6664 -165636 17661 133520 -62670 83291 -50567 123278 -127970 -55794 183320
5443 -97488 94279 -257962 -236801 19995 -386413 187758 -119451 13681 146455 -261770 8727
5431 -119685 13303 264677 80970 17690 -119970 99672 -100659 -196394 423084 207002 -23290
5419 -49494 65601 -120487 -65723 -44769 145820 59873 -55126 -108397 132473 40405 -98407
5407 252585 107558 -121954 135557 -94704 20982 37721 94007 -112012 -533 -277468 -212107
5396 -212107 -121733 319605 85607 102789 30782 -190281 51740 -94440 97071 -100106 -284015
5385 -284015 131793 -172575 -230105 -9633 23371 361977 431072 -143390 -65325 -73348 81130
5373 80022 -66922 306091 1932 -86129 -112837 -212458 16230 71399 12469 -52751 -280230 -191417
5361 -191417 -238748 -59131 -141441 -106998 229904 48012 221267 431860 -204299 -54243 -47293
5350 -47293 112758 131816 10764 93292 -25770 -54594 -245923 -25748 -228037 118500 213208
5339 213208 -101891 203529 -173736 -24389 326419 106576 47639 83178 214330 -37915
5328 -16873 58498 147052 -82107 -160062 194149 -225173 92104 81660 -61495 79692 -244613
5316 -299764 -80305 29525 125729 104634 174654 -126206 70987 58950 -276449 -362851 248434
5304 -6201 220385 57329 -22038 186269 -332572 -302822 86641 -71483 -60349 -129798 26673
5292 -104091 -119704 157125 -111244 106758 51580 190244 379611 -109010 85775 -346333
5281 37423 669 -132180 -478328 -90872 71531 34028 133390 -96305 -245780 317936 12545
5269 -260284 -24174 224355 103972 86406 370286 54260 75014 86637 161033 -78238 379427
5257 -159386 11298 246207 -179557 -83374 165702 -97808 -144846 -3205 37884 -223900 -109305
5245 33584 226957 154825 11684 132595 200835 215401 58946 54993 5373 -67373 229170 179700
5233 179700 41791 203353 -226595 -347747 197499 -116220 45207 -84645 46572 19535 -83882
5221 11801 -1305 -27641 -155924 239222 546189 78997 153341 114581 299271 -173130 -46030
5209 -189576 -30040 154059 72435 477935 -117421 17592 10023 -386104 -153605 96932 -207724
5197 52298 15062 181840 -263079 172049 12669 176446 130849 31064 -399303 -239235 14516
5185 -187698 -34270 49138 -41052 28392 207727 4594 -89083 82808 89897 239408 111887
5173 58583 35066 -7429 -28891 229647 57804 26455 -221322 -158386 105005 169337 -226133
5161 -95898 228016 80025 256095 96470 -211083 105726 32916 -109387 81702 -391660 43568
5149 -236103 -62261 95126 21370 -107937 -66845 297231 7860 193823 1335 -184186 347625
5137 -64693 144024 288314 100825 -337845 19810 -357427 -29195 24643 5696 64631 -141367
5125 253735 46771 -33373 103634 143927 -463015 25852 104714 2842 31222 -131674 84588
5113 32097 76499 -176520 -124687 -4965 -296233 284065 -184 50315 138020 174071 116961 -182222
5100 167714 221953 -219629 63699 142304 -44567 -59030 -94345 -152837 -176538 -300379 -248499
5089 -248499 104533 166512 89560 -193822 90058 -66708 54315 -300654 -72106 31359 209986
5078 209986 -261227 195634 38510 -40348 -131292 354697 -182725 65388 66301 -302436 26409
5066 -392697 -199499 -120327 276239 33685 -190356 68807 62712 -92080 37305 -27441 -47841
5055 -47841 22987 228998 50020 -60566 44282 173412 11029 110969 -88003 20278 259561
5044 259561 121630 -265397 119539 -228203 43386 -168299 123757 83160 -329427 260834
5033 209257 229567 -74983 -152043 230354 87710 -69589 -24219 -119286 -221294 35802 -189581
5021 -93114 -221208 195437 -176117 413826 90798 -11602 116068 65702 -42462 168408 -71043
5009 -177310 -161911 -34522 40645 -16750 -256721 159461 211744 -52107 -8418 -71203 -64518 -41541
4997 -41541 10916 140517 27546 320830 27513 -170359 -110132 79973 196795 -82280 -184414
4986 -184414 -203857 21052 42388 236342 394658 -154348 -69980 352240 -332202 236367
4975 -137243 138557 338648 -70655 -35210 -129248 -203732 233481 -140983 30854 157089 34039
4963 202813 230423 256511 -203243 -66842 115711 -247227 -99776 163640 -134811 246816
4952 -256356 -182306 -72542 162794 233639 63886 -255622 -119332 201141 78079 -199952 156203
4940 -298169 -175537 259268 -22019 -141812 104847 14701 102623 -133558 107031 135643
4930 135643 156866 145832 171008 -87966 168573 -108884 -65945 190450 -311783 -166242 222541
4918 35103 -79631 4884 -60767 -203333 -16286 125909 -131421 19442 101440 245570 -147356
4906 -194778 -229124 -218220 -121584 8753 80572 29617 6251 -208944 96732 -191995 -101849 293731
4893 124869 171696 -67535 -166945 -86587 106404 -193602 -204728 -76417 -27921 206098 32003
4881 428575 80837 -312973 -36191 64920 149163 -424083 282525 -81137 44243 -251370 65068
4869 384033 -453987 115284 161596 -64755 1549 -26854 -144167 253707 -79382 162895 -40961
4857 77400 145001 -12086 -62959 80529 -48581 195678 35928 103630 20300 38356 -88100 331195
4844 -367 438894 109679 -31397 253748 -103317 160343 -75676 -234853 53145 19478 -14322
4832 108860 -224840 -32371 22219 29462 48835 7177 225967 72881 171257 -256071 50286
4820 -52286 -18908 -122665 235696 -166498 86983 10195 -184251 78867 223756 248490 -208783
4808 -154372 77877 -220304 66308 45806 39638 -110700 239571 -2776 296780 -25630 228381
4796 -80887 126819 -13515 173340 -12077 -4362 -5220 71277 35222 -136023 202777 -281750
4784 -266320 31408 133494 -303177 73114 -37871 87518 -247667 -55290 326278 -101295 85094
4772 75901 -289223 931 316213 -127413 -234105 -76144 -263372 78285 174185 -109883 -268396
4761 -268396 239251 -63927 13441 -119301 -4102 184567 185522 -147988 -18863 -183684 -156475
4750 -156475 152542 -122861 35626 58149 72831 102930 162618 44127 219655 58867 -126429
4738 -15404 29553 -27780 50541 136738 125529 -204516 146357 34861 317986 148846 -129969
4726 -74974 -224823 183539 -75728 210780 -290750 -112893 -261754 58235 -139294 119792
4715 -50113 90055 15482 91776 -196428 -71336 -15282 -152317 19669 -53909 -237239 -151018
4704 -151018 -160343 73806 56827 285562 253279 158047 -335174 23680 -174459 172476 176654
4693 176654 29368 51430 -377750 -131955 300840 220442 -438802 90235 339109 224730
4683 224730 -66389 40314 -121255 226572 109585 -165062 -9365 135505 98973 -23742 -26999
4672 -26999 14881 115918 223606 55351 -125945 -170359 -137097 181349 -207064 -181107 69847
4660 -36004 58358 142090 -48142 202748 -89374 -181661 153933 -142120 -69709 -192850 -10405
4648 -14564 11454 -58501 123303 419679 -21031 -355806 270351 -180116 -154065 -43026 132526
4636 301735 -244428 229335 17962 177060 -35436 7137 -145281 -217336 13069 -195067 223764
4624 101814 -52523 -186842 -55092 167373 -119392 96819 -45915 73821 103016 -21053 -55315
4613 -55315 237827 14686 -48547 60598 34354 68736 281032 225626 -42193 -257452 -51332
4601 -314721 126623 -125508 -83212 -32420 77391 196221 -251060 -24645 290787 25344 147071
4590 147071 -184542 -337723 142442 224983 -51017 107372 -41822 46933 -211531 132213
4579 6984 76293 25992 340372 65569 47469 -11069 -175208 -114619 -16690 -50418 -102364 354096
4566 -149856 46696 189557 289741 103842 39641 65223 38789 -6289 102507 -17352 532488
4554 -71117 -38615 137139 -424214 127567 217710 13083 290570 -379278 -240830 279156
4543 211535 -56432 98414 -191000 213391 420338 37779 25861 -6612 91065 119809 -13437
4531 -345579 85835 243643 -106362 181318 -41337 16836 -86988 218330 -276530 181373
4520 -107025 -170045 209125 93994 74051 58705 210157 32911 299376 11095 244217 70530
4508 -86747 -68451 200620 32755 -22121 -15274 74442 -102501 -492569 -64453 -316156 -257385
4497 -257385 -61566 -93082 -24314 18885 -23508 206777 51537 -67348 219486 240273 167780
4486 167780 48805 -83993 -34035 304026 -69999 -42138 -255492 41778 -121793 -42926 -80813
$$ [...]
##END NTUPLES=NMR SPECTRUM
##END=
