
##TITLE=AC1332_INDRS10071_6524609_CTcGbNYVTk
##JCAMPDX= 6.0         $$ Bruker NMR JCAMP-DX V2.0
##DATA TYPE= NMR SPECTRUM
##DATA CLASS= NTUPLES
##ORIGIN= BRUKER
##OWNER= Administrator
$$ 1.72 TOPSPIN		Version 2.1
$$ 2012-07-14 21:51:15.843 -0500  Administrator@TOPSPIN
$$ Compression mode = diff/dup
##.OBSERVE FREQUENCY= 400.02188249412
##.OBSERVE NUCLEUS= ^1H
##.ACQUISITION MODE= SIMULTANEOUS (DQD)
##.ACQUISITION SCHEME= undefined
##.AVERAGES= 64
##.DIGITISER RES= 22
##SPECTROMETER/DATA SYSTEM= spect
##.PULSE SEQUENCE= noesygpps1d.comp
##.SOLVENT NAME= COFFEE_meoh
##.SHIFT REFERENCE= INTERNAL, COFFEE_meoh, 1, 14.96097
##AUDIT TRAIL= $$ (NUMBER, WHEN, WHO, WHERE, PROCESS, VERSION, WHAT)
$$ ##TITLE= Audit trail, TOPSPIN		Version 2.1
$$ ##JCAMPDX= 5.01
$$ ##ORIGIN= Bruker BioSpin GmbH
$$ ##OWNER= Administrator
$$ $$ C:\Bruker\TOPSPIN/data/COFFEE/nmr/AC1332_INDRS10071_6524609_CTcGbNYVTk/12/pdata/1/auditp.txt
$$ ##AUDIT TRAIL=  $$ (NUMBER, WHEN, WHO, WHERE, PROCESS, VERSION, WHAT)
(   1,<2012-07-14 21:51:11.140 -0500>,<Administrator>,<TOPSPIN>,<go>,<TOPSPIN 2.1>,
      <created by zg
	started at 2012-07-14 21:39:40.921 -0500,
	POWCHK enabled, PULCHK disabled,
       configuration hash MD5:
       6B 1B 68 BB D9 2E 58 E2 7F 35 AD 54 07 DF 0E 41
       data hash MD5: 64K
       40 3D 35 02 31 1E 6F 32 F7 B5 4A D8 A9 1F 71 0E>)
(   2,<2012-07-14 21:51:13.953 -0500>,<Administrator>,<TOPSPIN>,<proc1d>,<TOPSPIN 2.1>,
      <Start of raw data processing
       efp LB = 0.3 FT_mod = 6 PKNL = 1 PHC0 = 0 PHC1 = 0 SI = 128K 
       data hash MD5: 128K
       AE 9F 81 3E EB 89 18 4F 9E 9F 63 5F 80 2C FF BD>)
(   3,<2012-07-14 21:51:15.015 -0500>,<Administrator>,<TOPSPIN>,<proc1d>,<TOPSPIN 2.1>,
      <pk PHC0 = -0.9887695 PHC1 = 0 
       data hash MD5: 128K
       3F 70 A3 90 03 63 56 47 99 FD 2E CB 5E 1B 47 69>)
(   4,<2012-07-14 21:51:15.250 -0500>,<Administrator>,<TOPSPIN>,<proc1d>,<TOPSPIN 2.1>,
      <abs ABSG = 1 
       data hash MD5: 128K
       61 8A D6 01 9A 6F C2 FF D7 67 92 F5 F7 BF EC 99>)
(   5,<2012-07-14 21:51:15.390 -0500>,<Administrator>,<TOPSPIN>,<proc1d>,<TOPSPIN 2.1>,
      <abs ABSG = 2 
       data hash MD5: 128K
       58 47 EC 77 95 E2 DA DB 21 2E E5 4F BD B7 5D 56>)
(   6,<2012-07-14 21:51:15.546 -0500>,<Administrator>,<TOPSPIN>,<proc1d>,<TOPSPIN 2.1>,
      <abs ABSG = 3 
       data hash MD5: 128K
       4E DE E7 59 BC 10 55 63 53 BA 96 99 7F 15 6C B3>)
(   7,<2012-07-14 21:51:15.609 -0500>,<Administrator>,<TOPSPIN>,<proc1d>,<TOPSPIN 2.1>,
      <abs ABSG = 4 
       data hash MD5: 128K
       20 6F 76 C9 73 68 A3 CD 99 7E 11 7F FC 15 8D 62>)
(   8,<2012-07-14 21:51:15.671 -0500>,<Administrator>,<TOPSPIN>,<proc1d>,<TOPSPIN 2.1>,
      <abs ABSG = 5 
       data hash MD5: 128K
       A5 C5 61 D9 D0 A2 11 7D A7 3D D1 AC FC B2 BD 1D>)
$$ ##END=
$$ 
$$ $$ hash MD5
$$ $$ A8 4B 4C FC 46 94 1E 15 57 10 51 5D A9 94 7B E5
##$RELAX= 
##$RELAX= 
##$RELAX= 
##$RELAX= 
##$RELAX= 
##$RELAX= 
##$RELAX= 
##$RELAX= 
$$ Bruker specific parameters
$$ [...]
##$TP07= 0
##$TPNAME0= <>
##$TPNAME1= <>
##$TPNAME2= <>
##$TPNAME3= <>
##$TPNAME4= <>
##$TPNAME5= <>
##$TPNAME6= <>
##$TPNAME7= <>
##$TPOAL= (0..7)
0.5 0.5 0.5 0.5 0.5 0.5 0.5 0.5
##$TPOFFS= (0..7)
0 0 0 0 0 0 0 0
##$TUNHIN= 0
##$TUNHOUT= 0
##$TUNXOUT= 0
##$USERA1= <user>
##$USERA2= <user>
##$USERA3= <user>
##$USERA4= <user>
##$USERA5= <user>
##$V9= 5
##$VALIST= <valist>
##$VCLIST= <CCCCCCCCCCCCCCC>
##$VD= 0
##$VDLIST= <DDDDDDDDDDDDDDD>
##$VPLIST= <PPPPPPPPPPPPPPP>
##$VTLIST= <TTTTTTTTTTTTTTT>
##$WBST= 2048
##$WBSW= 25
##$XGAIN= (0..3)
0 0 0 0
##$XL= 0
##$YL= 0
##$YMAX_a= 10117754
##$YMIN_a= -7498680
##$ZGOPTNS= <>
##$ZL1= 120
##$ZL2= 120
##$ZL3= 120
##$ZL4= 120
##$ABSF1= 14.96097
##$ABSF2= -5.597212
##$ABSG= 5
##$ABSL= 3
##$ALPHA= 0
##$AQORDER= 0
##$ASSFAC= 0
##$ASSFACI= 0
##$ASSFACX= 0
##$ASSWID= 0
##$AUNMP= <proc_prof1d_extract.lims>
##$AXLEFT= 0
##$AXNAME= <>
##$AXNUC= <1H>
##$AXRIGHT= 0
##$AXTYPE= 0
##$AXUNIT= <>
##$AZFE= 0.1
##$AZFW= 0.1
##$BCFW= 0
##$BC_mod= 0
##$BYTORDP= 0
##$COROFFS= 0
##$CY= 15
##$DATMOD= 1
##$DC= 0
##$DFILT= <>
##$DTYPP= 0
##$F1P= 0
##$F2P= 0
##$FCOR= 0.5
##$FTSIZE= 131072
##$FT_mod= 6
##$GAMMA= 0
##$GB= 0
##$INTBC= 1
##$INTSCL= 1
##$ISEN= 128
##$LB= 0.3
##$LEV0= 0
##$LPBIN= 0
##$MAXI= 10000
##$MC2= 0
##$MEAN= 0
##$ME_mod= 0
##$MI= 0
##$NCOEF= 0
##$NC_proc= -2
##$NLEV= 6
##$NOISF1= 0
##$NOISF2= 0
##$NSP= 0
##$NTH_PI= 0
##$NZP= 0
##$OFFSET= 14.96097
##$PC= 1
##$PHC0= -0.9887695
##$PHC1= 0
##$PH_mod= 1
##$PKNL= yes
##$PPARMOD= 0
##$PPDIAG= 0
##$PPIPTYP= 0
##$PPMPNUM= 2147483647
##$PPRESOL= 1
##$PSCAL= 4
##$PSIGN= 0
##$PYNMP= <proc.py>
##$REVERSE= no
##$SF= 400.020009647518
##$SI= 131072
##$SIGF1= 0
##$SIGF2= 0
##$SINO= 400
##$SIOLD= 131072
##$SPECTYP= <>
##$SREGLST= <1H.CDCl3>
##$SSB= 0
##$STSI= 131072
##$STSR= 0
##$SW_p= 8223.68421052631
##$SYMM= 0
##$S_DEV= 0
##$TDeff= 65536
##$TDoff= 0
##$TI= <>
##$TILT= no
##$TM1= 0
##$TM2= 0
##$TOPLEV= 0
##$USERP1= <user>
##$USERP2= <user>
##$USERP3= <user>
##$USERP4= <user>
##$USERP5= <user>
##$WDW= 1
##$XDIM= 131072
##$YMAX_p= 322539244
##$YMIN_p= -11680
##$CURPLOT= <Network HP LaserJet P1505>
##$CURPRIN= <$Network HP LaserJet P1505>
##$DFORMAT= <normdp>
##$LAYOUT= <+/1D_H.xwp>
##$LFORMAT= <normlp>
##$PFORMAT= <normpl>
##$SURQMSG= 1
$$ End of Bruker specific parameters
$$ ---------------------------------
##NTUPLES= NMR SPECTRUM
##VAR_NAME=  FREQUENCY,     SPECTRUM/REAL,   SPECTRUM/IMAG
##SYMBOL=    X,             R,               I
##VAR_TYPE=  INDEPENDENT,   DEPENDENT,       DEPENDENT
##VAR_FORM=  AFFN,          ASDF,            ASDF
##VAR_DIM=   131072,        131072,          131072
##UNITS=     HZ,            ARBITRARY UNITS, ARBITRARY UNITS
##FACTOR=    0.0627417313425164, 1,          1
##FIRST=     8223.62146879497, 2515,         -45285
##LAST=      0,             2614,            -45205
##MIN=       0,             -11680,          0
##MAX=       8223.62146879497, 322539244,    0
$$ Real data points
##PAGE= N=1
##DATA TABLE= (X++(R..R)), XYDATA
$$ [...]
61709E68107J080K97k89k78K23O04L41l99q15l16P63J488J397R76Q68R35M87o83
61691E74786j925k510k373j919j444j043q81j132j710k285k609k681k642k649
61677E46983k885l374l842l922l551l077k859k908k941k693k094j269n26k20n05
61662E10317j154j733j932j727j246o02J14P51J129J185J090J166J638K501L574
61647E15071M621N398N693N469M998M671M639M714M677M543M374L997L172K014
61633E78051R82L18k94j302k585l455l420k782k368k671l409l899l754l186k693
61618E43533k576k768l040l270l475l638l627l360k992k879l288m167n142n776
61604D93535n848n504n145n101n318n428n148m526l793l078k421j948j755j689
$$ plain form
61709 568107 569187 569484 569195 568917 569140 569744 570085 569686 568871 568555 569318 570806 572203 573179 574047 574982 575469 574786
61691 574786 572861 570351 567978 566059 564615 563572 562691 561559 559849 557564 554955 552274 549632 546983
61677 546983 544098 540724 536882 532960 529409 526332 523473 520565 517624 514931 512837 511568 511042 510822 510317
61662 510317 509163 507430 505498 503771 502525 501923 502037 502788 503917 505102 506192 507358 508996 511497 515071
61647 515071 519692 525090 530783 536252 541250 545921 550560 555274 559951 564494 568868 572865 576037 578051
61633 578051 579033 579351 579057 577755 575170 571715 568295 565513 563145 560474 557065 553166 549412 546226 543533
61618 543533 540957 538189 535149 531879 528404 524766 521139 517779 514787 511908 508620 504453 499311 493535
61604 493535 487687 482183 477038 471937 466619 461191 456043 451517 447724 444646 442225 440277 438522 436833
61590D36833j465j127j016j262j492j368j101j116j389j535j454j447j643j817
61576D17601j908k192k674k846k448k111k607l733m524m489l986l421k732j877
61562C76053j159p44m40k81p49j902k841k765k113j875k025j603l95N65N42K17
61546C58485N60J250J120j4r12m96P82J527J107K59Q6P52J486J660J435J218R92
61529C71297N73K28L06M55o7j130j642j079l19m24j239j923k322k869l458l405
61513C52982k549j553j007q63r13j083j123o46K32Q19O36r4r24j632j985j689
61497C38608q35K3N30Q63J173J201P61J65k21m61p36q82o62j87K44N03N32K62
61479C40881j35k25R3L60K80K27O17J166J265P96J01o07j250j538j164l21M58
$$ plain form
61590 436833 435368 434241 433225 431963 430471 429103 428002 426886 425497 423962 422508 421061 419418 417601
61576 417601 415693 413501 410827 407981 405533 403422 400815 397082 392558 388069 384083 380662 377930 376053
61562 376053 374894 374150 373710 373429 372680 370778 367937 365172 363059 361184 359159 357556 357161 357726 358268 358485
61546 358485 359045 360295 361415 361401 360489 359993 360775 362302 363409 363668 363754 364506 365992 367652 369087 370305 371297
61529 371297 371870 372098 372404 372859 372792 371662 370020 368941 368622 368198 366959 365036 362714 359845 356387 352982
61513 352982 350433 348880 347873 347010 346097 345014 343891 343245 343477 344296 344932 344838 343914 342282 340297 338608
61497 338608 337773 337796 338326 339189 340362 341563 342324 342489 342268 341807 341071 340189 339527 339340 339584 340087 340619 340881
61479 340881 340746 340521 340614 340974 341254 341481 342098 343264 344529 345325 345426 344819 343569 342031 340867 340546 341004
61462C41004Q53Q81N83J7n51q26p50m20K9L06Q0m63o53k57J51J68L05J071J872
61443C43400J741Q04R3P3L56P12J339K093K455K426K590L070L290L013K742K747
61427C72944K580K028J723K182K833K730J813Q83N81R13J557K187K510K396J947
61412D01807J372Q75O30O04M38k29j270k220k895l400l656l429k885k527k466
61397C80749k324j947j636j500j233p86n87q08j002p99m25j88n0J9j58m04m9J119
61379C67991K299K576J936R98J91l59n61m40j26M63J459K404K501J868J653K370
61363C87223K968K343R64Q4RK32O45J451K248K448K443L183M597N584N670N576
61347D27668N983O667P238P858Q790R856J0780J1498J1889J1670J0848R781Q595
$$ plain form
61462 341004 341857 342738 343321 343338 342787 341961 341211 340791 340820 341126 341206 340743 340090 339833 339984 340152 340457 341528 343400
61443 343400 345141 345945 346038 346111 346467 347179 348518 350611 353066 355492 358082 361152 364442 367455 370197 372944
61427 372944 375524 377552 379275 381457 384290 387020 388833 389716 390297 391210 392767 394954 397464 399860 401807
61412 401807 403179 404054 404684 405288 405726 405497 404227 402007 399112 395712 392056 388627 385742 383215 380749
61397 380749 378425 376478 374842 373342 372109 371323 370736 369928 368926 368127 367702 367514 367464 367483 367325 366921 366872 367991
61379 367991 370290 372866 374802 375800 375991 375632 375071 374631 374505 374968 376427 378831 381332 383200 384853 387223
61363 387223 390191 392534 393498 393582 393591 393823 394468 395919 398167 400615 403058 406241 410838 416422 422092 427668
61347 427668 433651 440318 447556 455414 464204 474060 484840 496338 508227 519897 530745 540526 549121
61334E49121O963M734K329L02j106j865k058k051k432l437m739n831o449o544
61320E26937o227n731n151m300l128k119j763j817j627j149r40j148j212p00J87
61305D90112J155K136K885K956K471K327L100M293N044N145M875M320L491K783
61291E37093K693L118L371K789J076j705m976p607q620q025o697n368m010k245
61277E00887j14J771K761K796K490K556L142L858M400M966N944P333Q644R324
61263E60758R255Q861Q787R317J0137J0782J1216J1737J2323J2453J1781J0700
61251F88107R993J0029J0438J0542R951Q787P364N648L123n25m687q127j0128
61238G40515j1072j1723j2279j2395j1879j0909r650q116o458n054m041l055j733
$$ plain form
61334 549121 556084 560818 563147 563449 562343 560478 558420 556369 553937 550500 545761 539930 533481 526937
61320 526937 520710 514979 509828 505528 502400 500281 498518 496701 495074 493925 492985 491837 490625 489925 490112
61305 490112 491267 493403 496288 499244 501715 504042 507142 511435 516479 521624 526499 530819 534310 537093
61291 537093 539786 542904 546275 549064 550140 548435 543459 535852 527232 519207 512510 507142 503132 500887
61277 500887 500773 502544 505305 508101 510591 513147 516289 520147 524547 529513 535457 542790 551434 560758
61263 560758 570013 578874 587661 596978 607115 617897 629113 640850 653173 665626 677407 688107
61251 688107 698100 708129 718567 729109 739060 747847 755211 760859 763982 763457 758770 750643 740515
61238 740515 729443 717720 705441 693046 681167 670258 660608 652492 646034 640980 636939 633884 632151
61225F32151l62L43K09p6J47N70L28o69j361p27R59K383K559J628M15n15j255
61208F36727k148l126l551k936j755j122j503k039j471L62K336L251L000K527
61194F28552K897M385O408Q192R510J0743J2330J4351J6573J8571J9825K0087
61182G72424J9729J9387J9139J8418J6832J4567J2009R489P522O527N937M504
61170I26484K019j26q59j138k660n447p919r151r770j0613j1620j2439j3164j3997
61156H29600j4754j5101j4937j4305j3334j2343j1637j1135j0435r231p376m876
61144F90136k256n62l17p04n37J90M93J8n23n74m84q34j770l173m786n984o121
61127F62212n281m049k507k38K573M981O468P552Q877J0455J2127J3995J5966
$$ plain form
61225 632151 631789 632132 632341 632265 632412 632982 633310 632641 631280 630553 631512 633895 636454 638082 638497 637982 636727
61208 636727 634579 631453 627902 624966 623211 622089 620586 618547 617076 617438 619774 623025 626025 628552
61194 628552 631449 635834 642242 650434 659944 670687 683017 697368 713941 732512 752337 772424
61182 772424 792153 811540 830679 849097 865929 880496 892505 901994 909516 916043 921980 926484
61170 926484 928503 928377 927518 926380 923720 918273 910354 901203 891433 880820 869200 856761 843597 829600
61156 829600 814846 799745 784808 770503 757169 744826 733189 722054 711619 702388 695012 690136
61144 690136 687880 687318 687001 686297 685760 685950 686443 686461 685938 685364 684880 684046 682276 679103 674317 668333 662212
61127 662212 656931 652882 650375 650137 652710 657691 664159 671711 680588 691043 703170 717165 733131
61114G33131J7541J8487J9183K0016K0914K1731K2499K3064K3022K2292K1238
61103I63118K0073J8781J7591J6770J5857J4017J1383R035P326N300K273j007
61091A100517l517n426p632j0486j3694j6945j9961k2390k4143k5426k6120k5765
61079H99012k4521k3353k2686k1703j9610j6862j4465j2705j1333j0336r695q915
61067G02828p575n949m421k803q67R49K105K723L160L271K898K480K504K769K999
61052G07071L650N270P398R046J0021J0919J2040J3101J3970J4914J6143J7543
61040H41086J8908K0136K1284K2611K4299K6057K7450K8639L0170L1952L3335
61029A125927L4342L5782L7758L9283L9935M0755M2700M5318M7750N0027N2501
$$ plain form
61114 733131 750672 769159 788342 808358 829272 851003 873502 896566 919588 941880 963118
61103 963118 983191 1001972 1019563 1036333 1052190 1066207 1077590 1086625 1093951 1099251 1101524 1100517
61091 1100517 1097000 1091574 1083942 1073456 1059762 1042817 1022856 1000466 976323 950897 924777 899012
61079 899012 874491 851138 828452 806749 787139 770277 755812 743107 731774 721438 711743 702828
61067 702828 695253 689304 684883 682080 681213 682162 684267 686990 690150 693421 696319 698799 701303 704072 707071
61052 707071 710721 715991 723389 732435 742456 753375 765415 778516 792486 807400 823543 841086
61040 841086 859994 880130 901414 924025 948324 974381 1001831 1030470 1060640 1092592 1125927
61029 1125927 1160269 1196051 1233809 1273092 1313027 1353782 1396482 1441800 1489550 1539577 1592078
61018A592078N5036N7761O1546O6654P1988P6738Q1701Q7967R5573J04819J17523
61007B469384J35524J59162J88864K26657K73938L29040L89664M57418N38290
60998E167941O39622P67998R27006J111679J304467J480763J621643J722650J793781
60989A6537550J854584J926205K020109K130314K236631K309727K302254K138061
60981C3455435J737961J089931L03956m20871r08760j103503j068687r15716p48826
60972C1420920o66771p70812j121542j671658k259254k693000k860201k766770
60964A6610912k495122k139975j774223j443797j169249r49651p73975o33120
60956E231800n21748m33770l62456l04583k59986k26898k00998j79068j60506
$$ plain form
61018 1592078 1647114 1704875 1766421 1833075 1905063 1981801 2063502 2151469 2247042 2351861 2469384
61007 2469384 2604908 2764070 2952934 3179591 3453529 3782569 4172233 4629651 5167941
60998 5167941 5807563 6575561 7502567 8614246 9918713 11399476 13021119 14743769 16537550
60989 16537550 18392134 20318339 22338448 24468762 26705393 29015120 31317374 33455435
60981 33455435 35193396 36283327 36587283 36166412 35257652 34154149 33085462 32169746 31420920
60972 31420920 30754149 29983337 28861795 27190137 24930883 22237883 19377682 16610912
60964 16610912 14115790 11975815 10201592 8757795 7588546 6638895 5864920 5231800
60956 5231800 4710052 4276282 3913826 3609243 3349257 3122359 2921361 2742293 2581787
60947B581787j44992j31464j19630j09949j01640r2961q3832p6065p0502o5991
60937A584761o1851n9219n8919n9685n9646n8325n6136n3061m8938m4348m0208
60926I84425l6835l3989l1428k8953k6313k3513k0949j8988j7606j6491j5257
60915G14103j3639j1856j0548r979r544q537p092n754m585l447k716k729k873
60902F20804k268j175n82n69k98L52N30n3n67n80q75k115l649m467m547m528m587
60885E90826m445m030l578l299l407m116n223o012o034n703n752o382p211p860
60871E17774q152p972p270o235n254m742m913n535n868n236l744k202j250q24
60857D48577n21j65K12O62J346K276L110L298K614J624J340K153L415M307M753
$$ plain form
60947 2581787 2436795 2305331 2185701 2075752 1974112 1881151 1797319 1721254 1650752 1584761
60937 1584761 1522910 1463691 1404772 1345087 1285441 1227116 1170980 1117919 1068981 1024633 984425
60926 984425 947590 913601 882173 853220 826907 803394 782445 763457 745851 729360 714103
60915 714103 700464 688608 678060 668081 658537 650000 642908 637154 632569 629122 626406 623677 620804
60902 620804 618536 617361 616779 616210 615912 616264 616794 616741 616174 615594 614719 612604 608955 604488 599941 595413 590826
60885 590826 586381 582351 578773 575474 572067 567951 562728 556716 550682 544979 539227 532845 525634 517774
60871 517774 509622 501650 494380 488145 482891 478149 473236 467701 461833 456597 452853 450651 449401 448577
60857 448577 448056 447891 448103 448765 450111 452387 455497 458795 461409 463033 464373 466526 469941 474248 479001
60842D79001N028M928M109L008K563K936L233K751J836J242J137J038M48o55j722
60827E10881k019j416o88o57j149j322q97m09k82m63j026k251l793m633m332l700
60811D81844l657m106m460m708n203n757n841n529n553o289p179p256o057m061
60797D06188k469k325l460m480m147k695j403j028j191j257j167j167j145p60
60783C77494l4N62O65M00J83L04Q01J584K485L213L496L361L200L427M062M773
60767D09976N267N599N990O477O808O722O278N822N599N539N483N425N345M979
60753D91309M136L133K562K506K451K012J386Q38K74m24r26q92n50m58q26j468
60737E05063k292l420m810o174p271q069q608q964r214r250q724p434n685m075
$$ plain form
60842 479001 484029 488957 493066 496074 498637 501573 504806 507557 509393 510635 511772 512810 513258 512603 510881
60827 510881 508862 507446 506758 506101 504952 503630 502733 502324 502042 501579 500553 498302 494509 489876 485544 481844
60811 481844 478187 474081 469621 464913 459710 453953 448112 442583 437030 430741 423562 416306 410249 406188
60797 406188 403719 401394 397934 393454 389307 386612 385209 384181 382990 381733 380566 379399 378254 377494
60783 377494 377460 378022 378687 379087 379270 379574 380375 381959 384444 387657 391153 394514 397714 401141 405203 409976
60767 409976 415243 420842 426832 433309 440117 446839 453117 458939 464538 470077 475560 480985 486330 491309
60753 491309 495445 498578 501140 503646 506097 508109 509495 510333 510607 510183 509257 508365 507815 507357 506531 505063
60737 505063 502771 499351 494541 488367 481096 473027 464419 455455 446241 436991 428267 420833 415148 411073
60723D11073k983k463k410k580k608k289j761j274r05o14k53N07J879L377M087
60708D00783L873L733M501N742O544O812O979O984O542O032O050O289O024N593
60694D82481O060P275P585O091M045L247L831M539M518M035L693L766M208M861
60680E50235N605O566Q028R958J1963J3841J5747J7572J8739J9037J9183J9950
60668G16424K1044K1488K0955K0125J9613J9091J7709J5113J1793Q434N199J747
60656H98735k039n727q893j1711j4563j7256j9153k0088k0528k0775k0594j9845
60644G17563j8924j8171j7326j6001j4374j3019j2251j1974j1963j1925j1463
60633E60172j0375q875p351n983m732l527k255p99O97J810K228K048J520Q01J39
$$ plain form
60723 411073 408090 405627 403217 400637 398029 395740 393979 392705 391800 391186 390933 391440 393319 396696 400783
60708 400783 404656 408389 412890 418632 425176 431988 438967 445951 452493 458525 464575 470864 476888 482481
60694 482481 488541 495816 503401 509492 513537 516784 520615 525154 529672 533707 537400 541166 545374 550235
60680 550235 555840 562406 570434 580392 592355 606196 621943 639515 658254 677291 696474 716424
60668 716424 737468 758956 779911 800036 819649 838740 856449 871562 883355 891789 896988 898735
60656 898735 896696 890969 882076 870365 855802 838546 819393 799305 778777 758002 737408 717563
60644 717563 698639 680468 663142 647141 632767 619748 607497 595523 583560 571635 560172
60633 560172 549797 540922 533571 527588 522856 519329 517074 516275 516972 518782 521010 523058 524578 525379 525518
60618E25518o5K63N16l3j393k813l570l609l386l361l695m263m831n139m947m217
60602D80975l373l080l538m162m286l960l665l437k913k175j828k052k267k003
60588D38236j561j343j138n88pj02r72j893k066j356k50P03J420K365L915N714
60572D41077O907P188P246P966R462J1186J2621J3582J4059J4214J4419J4981
60560E74908J5772J6310J6135J5075J3275J1017Q379N130J187k801n786p340p897
60547F53364p875p032n024k121J123M513Q020J1203J3459J4811J5965J7451J8964
60534G36821J9728J9366J8259J7006J5576J3165R150M041q69m816q069j1030j3282
60521H15046j3977j2847j0575q227o491n333m209k816j553j011j039p62M00K176
$$ plain form
60618 525518 525453 525716 526232 526199 524806 521993 518423 514814 511428 508067 504372 500109 495278 490139 485192 480975
60602 480975 477602 474522 470984 466822 462536 458576 454911 451474 448561 446386 444558 442506 440239 438236
60588 438236 436675 435332 434194 433606 433599 433497 432525 430632 428566 427210 426960 427663 429083 431448 435363 441077
60572 441077 447984 455172 462418 470384 479846 491032 503653 517235 531294 545508 559927 574908
60560 574908 590680 606990 623125 638200 651475 662492 670871 676001 677188 674387 668601 661261 653364
60547 653364 645489 638457 633433 631312 632435 636948 644968 656171 669630 684441 700406 717857 736821
60534 736821 756549 775915 794174 811180 826756 839921 849071 853112 852243 847427 839358 828328 815046
60521 815046 801069 788222 777647 769420 762929 757596 753387 750571 749018 748007 746968 746206 746606 748782
60507G48782M088O127Q517J1288J4397J7914K1768K5632K9367L3252L7585M2336
60495A001053M7477N3071N8715O3370O6166O7177O7007O5932O3723N9804N3333
60484A666828M3572L0763J6231J203j4130k9942m5689o0263p2816q2717q9048
60473A363992r0998q8771q3562p6649o8948o1196n3922m7228m1036l5500l0786
60462F85396k6707k3083k0225j8412j7088j5269j2808j0569r267q650p979o885
60450E08454n522m274l435l049k937k934k990k985k748k449k534k963k997k173
60436D64464j022k32L97J349K206K035Q69k45p72j284k294l388l906l824l498
60421D50855l047k395j588p41j3J96m70j592k029j128M54J505J596J274J140J218
$$ plain form
60507 748782 752870 758997 767514 778802 793199 811113 832881 858513 887880 921132 958717 1001053
60495 1001053 1048530 1101601 1160316 1223686 1289852 1357029 1424036 1489968 1553691 1613495 1666828
60484 1666828 1710400 1741163 1757394 1758597 1744467 1714525 1668836 1608573 1535757 1453040 1363992
60473 1363992 1272994 1184223 1100661 1024012 955064 893868 839946 792718 751682 716182 685396
60462 685396 658689 635606 615381 596969 579881 564612 551804 541235 531968 523318 515339 508454
60450 508454 502932 498658 495223 492174 489237 486303 483313 480328 477580 475131 472597 469634 466637 464464
60436 464464 463442 463210 463607 464956 467162 469197 470066 469821 469049 467765 465471 462083 458177 454353 450855
60421 450855 447808 445413 443825 443084 443071 443267 442797 441205 439176 438048 438502 440007 441603 442877 444017 445235
60405D45235J242J105Q80N60R3l69n00k18N6r5m72m66Q9P54J207J602K014K170
60387D54887K015J988K244K255J727J306J616K134J927J143P11Q84J037Q93Q65
60372D77632J147J415J550J814K186K267K001J734J527J229J198J921K878K931
60358E03430K054J466J716J885J254M31N8l67j279j756q72M87O58l34q46n5J117
60341E09047J681J904K469L310L917M156M248M222L887L132K027Q03j58n55n03
60326E43587m05m51n09n31o43q03o87j81M03Q10J263K112L308M560N843P301Q695
60309E73672R485R632R848J0737J2028J3186J4335J5878J7330J7527J6291J4987
60297G34936J4758J4933J3932J1263P603L295k062q390j4576j9440k2615k4164
$$ plain form
60405 445235 446477 447582 448462 449022 449115 448746 448246 448028 448084 447989 447517 447051 447140 447894 449101 450703 452717 454887
60387 454887 456902 458890 461134 463389 465116 466422 468038 470172 472099 473242 473953 474837 475874 476767 477632
60372 477632 478779 480194 481744 483558 485744 488011 490012 491746 493273 494502 495700 497621 500499 503430
60358 503430 505484 506950 508666 510551 511805 512236 512294 511927 510648 508892 508020 508507 509165 508831 507985 507930 509047
60341 509047 510728 512632 515101 518411 522328 526484 530732 534954 538841 541973 544000 544803 544645 544090 543587
60326 543587 543182 542731 542222 541691 541048 540245 539558 539377 539780 540590 541853 543965 547273 551833 557676 564977 573672
60309 573672 583157 592789 602637 613374 625402 638588 652923 668801 686131 703658 719949 734936
60297 734936 749694 764627 778559 789822 797425 800720 798658 790268 775692 756252 733637 709473
60285G09473k4101k2651k0306j7320j3639r695o541m836m158l807l643l739l870
60272E71167l959m426n386o000n460m282l711m074m500m238l418k437j428n65
60258E17283k34m52o04j91M07L25p79k273l163k998k210j528j184q80m81l27o25
60241E00086r38p56l19k36m42j97P33J604J745J535J772K410K613K027J370J476
60225E14483K231K797K708K289K096K311K774L206L295K846K105J600J535J543
60211E47819J353J297J728K265K255J814J732K323L016L192K912K525K148J779
60197E78158J522J410J330J333J620K061K129J566O88j67r63j552j560j085r10
60182E85580j478k163k250k069k437l275l722l468l058k809k331j409n89m24o28
$$ plain form
60285 709473 685372 662721 642415 625095 611456 601761 595220 590384 586226 582419 578776 575037 571167
60272 571167 567208 562782 557396 551396 545936 541654 537943 533869 529369 525131 521713 519276 517848 517283
60258 517283 517049 516597 515993 515802 516209 516534 515755 513482 510319 507321 505111 503583 502399 501519 501038 500711 500086
60241 500086 499148 498392 498073 497837 497395 497198 497931 499535 501280 502815 504587 506997 509610 511637 513007 514483
60225 514483 516714 519511 522219 524508 526604 528915 531689 534895 538190 541036 543141 544741 546276 547819
60211 547819 549172 550469 552197 554462 556717 558531 560263 562586 565602 568794 571706 574231 576379 578158
60197 578158 579680 581090 582420 583753 585373 587434 589563 591129 591817 591650 590687 589135 587575 586490 585580
60182 585580 584102 581939 579689 577620 575183 571908 568186 564718 561660 558851 556520 555111 554522 554098 553470
60167E53470n44q3K84L64N46J136J779J779J009J95K60J364K735L386K925J754
60151E72359P04M72J163K152K585K148J316Q54J165K056K986L542L819M300N192
60136F06813O042O274N888N223M331L230K555K998M010L992K262n9j560k170k584
60121F47245k916k871k664k727k785k183j027p7M90J235K373L311L582L433L212
60106F47631K775J953J105P40Q84J095R95N26j24o91j018j219j590k281l073l473
60090F44235l100k107j172p99o21J70J536K363J912R53Q01J595K283K127J356
60075F51532L79p80k084l152l725m064m579n358o170o735o888o665o250n669m776
60060E85016l729l191l514m045l876l125k704k931l165k996k906l374m039m246
$$ plain form
60167 553470 552926 552843 553127 553491 554037 555173 556952 558731 559740 559935 560195 561559 564294 567680 570605 572359
60151 572359 573063 573535 574698 576850 579435 581583 582899 583753 584918 586974 589960 593502 597321 601621 606813
60136 606813 612855 619129 625017 630240 634571 637801 640356 643354 647364 651356 653618 653559 651999 649829 647245
60121 647245 644329 641458 638794 636067 633282 631099 630072 629995 630485 631720 634093 637404 640986 644419 647631
60106 647631 650406 652359 653464 654204 655088 656183 657178 657704 657580 656889 655871 654652 653062 650781 647708 644235
60090 644235 641135 639028 637856 637057 636436 636606 638142 640505 642417 643370 644171 645766 648049 650176 651532
60075 651532 651911 651131 649047 645895 642170 638106 633527 628169 621999 615264 608376 601711 595461 589792 585016
60060 585016 581287 578096 574582 570537 566661 563536 560832 557901 554736 551740 548834 545460 541421 537175
60046E37175l894l252k347j085K58J151J405J332J423J953K808L552L820L714
60032E48013L591L471K991J998Q40p9p28j254j692k077k578l298m134m907n458
60017E34699n593n236m715m470m438m102l330k750k922l506l605k784j432k38
60003D85578M27O29O22N81O20R24J605K320K413J824J463K120L207L357K243J009
59987E10942O96J103J509J768K112K454K524K367K163J853J345Q19L82k35j149
59972E30653j823j665r54n45p88j218j294r86n54k05J8K23N89J115J552J742J796
59955E27656J722J245L86j23L78J413J795J102R6m09n25p77j242j593j659j537
59939E27928j308j051j010j415k103k620k748k691k719k755k466j750r43n20n93
$$ plain form
60046 537175 533281 530029 527682 526597 526855 528006 529411 530743 532166 534119 536927 540479 544299 548013
60032 548013 551604 555075 558066 560064 560904 560825 560097 558843 557151 555074 552496 549198 545064 540157 534699
60017 534699 529106 523870 519155 514685 510247 506145 502815 500065 497143 493637 490032 487248 485816 485578
60003 485578 486005 486634 487256 487837 488457 489381 490986 493306 495719 497543 499006 501126 504333 507690 509933 510942
59987 510942 511638 512741 514250 516018 518130 520584 523108 525475 527638 529491 530836 531655 532037 531802 530653
59972 530653 528830 527165 526211 525666 524878 523660 522366 521380 520826 520621 520639 520862 521451 522566 524118 525860 527656
59955 527656 529378 530623 531009 530886 531264 532677 534472 535574 535670 535261 534736 533959 532717 531124 529465 527928
59939 527928 526620 525569 524559 523144 521041 518421 515673 512982 510263 507508 505042 503292 502349 501829 501236
59924E01236p55m61M44J589K448K821K988L376M035M422L891K521J307J268K335
59909E33465L336L206K014O93o3k76k20N1N22R11R21O95O37Q70J157J361J620
59892E50900K002K309K396K427K634L073L708M458N068N227N020M909N075N163
59878F04369M940M733M796M638L634K020P11K37L45M84K00p46k075k979l026k921
59862F19360l614m858n458m963m114l525k883j918j125r66j080r41p19p14m64
59847E82018P67K897N038O484P117P012O361N797O128P553R408J0873J1688J2054
59833F81195J2012J1112Q831N326J582j347l070l659l129j749o98j477m397q308
59819F92224j2044j5371j8145j9504j8775j6655j4578j3119j1711r811p694o054
$$ plain form
59924 501236 500481 500020 500464 502053 504501 507322 510310 513686 517721 522143 526034 528555 529862 531130 533465
59909 533465 536801 540007 542021 542714 542651 542375 542155 542206 542728 543639 544560 545255 545892 546762 547919 549280 550900
59892 550900 552902 555211 557607 560034 562668 565741 569449 573907 578975 584202 589222 594131 599206 604369
59878 604369 609309 614042 618838 623476 627110 629130 629841 630078 630423 630907 631107 630361 628286 625307 622281 619360
59862 619360 615746 610888 605430 600467 596353 592828 589945 588027 586902 585936 584856 583915 583196 582482 582018
59847 582018 582785 585682 590720 597204 604321 611333 617694 623491 629619 637172 646580 657453 669141 681195
59833 681195 693207 704319 713150 718476 720058 718711 715641 711982 708853 707104 706406 704929 700532 692224
59819 692224 680180 664809 646664 627160 608385 591730 577152 564033 552322 542511 534817 528763
59807E28763n280n123m795l641j964q88j022j675j808j411j281j797k506k772
59793D92800k274j139p9q3j308k551k534j507p65q51j149j180j218j464j583j457
59777D71658j536k058k495k311j703j144o77j35L67N95O14N81L93j10p15r59n75
59760D59790L15J346K082K243J951J687J856K517L467M316M594M070L119K399
59746D95752K208K401K872L589M147L922K945K046J786J728J189K57m35o57p79
59731E22971j148j780k501l049l046k344j321n84m02o13r96j370j493j272j024
59716E00028j121j392j271o21O8L63M20N70Q25J101J619K586L646M111L785L225
59700E17942L057L385L918M369M557M376L946L594L409L120K619K332K610L016
$$ plain form
59807 528763 523483 518360 513565 509924 507960 507072 506050 504375 502567 501156 499875 498078 495572 492800
59793 492800 490526 489387 489308 489225 487917 485366 482832 481325 480560 479709 478560 477380 476162 474698 473115 471658
59777 471658 470122 468064 465569 463258 461555 460411 459734 459599 459966 460561 461175 461756 462149 462039 461324 460365 459790
59760 459790 460105 461451 463533 465776 467727 469414 471270 473787 477254 481570 486164 490234 493353 495752
59746 495752 497960 500361 503233 506822 510969 514891 517836 519882 521668 523396 524585 524842 524407 523750 522971
59731 522971 521823 520043 517542 514493 511447 509103 507782 507198 506796 506183 505187 503817 502324 501052 500028
59716 500028 498907 497515 496244 495623 495691 496054 496474 497044 497869 498970 500589 503175 506821 510932 514717 517942
59700 517942 520999 524384 528302 532671 537228 541604 545550 549144 552553 555673 558292 560624 563234 566250
59686E66250K727J598J72j197k574l616l499k114o91m71j139j427r39n46r82j831
59670E49721k251k100j921k128k500k458j730p55l76r57j870k096j224K76J591
59655E29222K097J609N93M3O62K093L319L738L447K630J277k80j318j517j394
59640E46221j570j989k263k418k826l577m283m468l927k810j610r20q92r97o18
59625E11053K31R52J092P48K72j50n16p76q07n38j38j6n73j781k988l308k465
59608E00292j157m16n65r76r65n58j82J52Q00J711K214J846R27J01l66n80o86
59591E01592q17j072j260j015m53k76q31j489j514j153j166j576j740j526j617
59576D84087k437l462l842l335k413j803j932k529k809k369j722j511j503j040
$$ plain form
59686 566250 568977 570575 570747 569550 566976 563360 559861 557747 557056 556585 555446 554019 553080 552534 551552 549721
59670 549721 547470 545370 543449 541321 538821 536363 534633 533878 533502 532545 530675 528579 527355 527631 529222
59655 529222 531319 532928 533521 533564 534226 536319 539638 543376 546823 549453 550730 550450 549132 547615 546221
59640 546221 544651 542662 540399 537981 535155 531578 527295 522827 518900 516090 514480 513560 512668 511671 511053
59625 511053 511284 512236 513328 514076 514348 514198 513682 512906 512099 511561 511423 511407 510834 509053 506065 502757 500292
59608 500292 499135 498719 498154 497178 496213 495655 495473 495625 496425 498136 500350 502196 503123 503224 502858 502278 501592
59591 501592 500775 499703 498443 497428 496975 496699 495868 494379 492865 491712 490546 488970 487230 485704 484087
59576 484087 481650 478188 474346 471011 468598 466795 464863 462334 459525 457156 455434 453923 452420 451380
59562D51380k02L33M69Q13J482J812J478J044J004J126J165J410K009K461K373
59547D70157K077K010K092K337L283N125O964P766P635P428P520P780Q344R415
59533E49933J0527J0940J0765J0719J0680R395O037J463k535m816n374m621k785
59520F00328j52K533M340N017N175N341N052L516J047j010j919k363l219m408
59506F19278n542o879q709j0350j0735r813q543p647p066o505n721m509l079k296
59492E21884k754l720l888k994j908j180m72M75J315J838K329K880L143L138L562
59477E23648M795O237P035O910O007M582L297L074L959M713M164K595J088jj108
59462E80995k199k457j384N07K429M259O330Q592J0490J1723J2673J3751J4631
$$ plain form
59562 451380 451178 451511 451980 452793 454275 456087 457565 458609 459613 460739 461904 463314 465323 467784 470157
59547 470157 472234 474244 476336 478673 481956 487081 494045 501811 509446 516874 524394 532174 540518 549933
59533 549933 560460 571400 582165 592884 603564 612959 618996 620459 617924 613108 607734 603113 600328
59520 600328 600176 602709 607049 612066 617241 622582 627634 631150 632197 631187 629268 626905 623686 619278
59506 619278 613736 606857 598148 587798 577063 567250 558707 551060 543994 537489 531768 527259 524180 521884
59492 521884 519130 515410 511522 508528 506620 505440 504968 505443 506758 508596 510925 513805 516948 520086 523648
59477 523648 528443 534680 541715 548625 554632 559214 562511 565585 569544 574257 578421 581016 582104 582103 580995
59462 580995 578796 576339 574955 575462 577891 582150 588480 597072 607562 619285 631958 645709 660340
59449F60340J4608J3765J3062J2980J2681J1172Q878P067N902M133Q86l285p465
59436G54724j1455j5151j7700j8238j7096j5472j4165j3165j2172j0869q941o424
59424E93876l895j830m8J784L565N259P437J0477J3602J5656J6688J7592J8431
59411F98594J8329J7141J5925J5342J4855J3975J3021J1692Q169J191p561j4528
59399H06145j7607j7405j5556j3123j0742q900p640o930p563j0689j5893k0868
59387F53229k3614k4166k3394k1238j7316j2629r074p276o119m596k983j957j497
59374D97370j243j100r84n37K67P86N23j16l56m5L40M41K43j02j92N62K248M044
59356E02149N047N354N767O540P157P356P699Q806J0519J2145J3272J4098J5100
$$ plain form
59449 660340 674948 688713 701775 714755 727436 738608 747486 754553 760455 764588 765474 762189 754724
59436 754724 743269 728118 710418 692180 675084 659612 645447 632282 620110 609241 600300 593876
59424 593876 589981 588151 588103 589887 593452 598711 606148 616625 630227 645883 662571 680163 698594
59411 698594 716923 734064 749989 765331 780186 794161 807182 818874 827043 828234 820673 806145
59399 806145 788538 771133 755577 742454 731712 722812 715172 708242 700679 689990 674097 653229
59387 653229 629615 605449 582055 560817 543501 530872 521798 514522 508403 503807 500824 498867 497370
59374 497370 496127 495027 494043 493506 493773 494559 495082 494966 494610 494565 494905 495346 495589 495487 495295 495857 498105 502149
59356 502149 507196 512550 518317 524857 532014 539370 547069 555875 566394 578539 591811 605909 621009
59343F21009J6500J7941J8702J8403J7481J6671J6087J5133J3414J1258R226P346
59331G99171N138K315p77l480n528p312r348j1459j2828j3014j2560j2287j2258
59318G05773j1847j0667r000p434o477o352o692o584n447l849k877k763k720k093
59304F20971r92K80J636K838L441L478L597M190M995N865P203R101J0748J1443
59290F88794J1597J2043J2733J2983J2668J2344J2288J2210J1833J0904Q614L960
59278H22971k852r892j4805j6413j4983j1561p397l549m78K010M228O122P472
59265G60873Q308Q846R046Q600P400N837M397L030J162j556m685p409r455j1148
59251G83246j2630j3498j3460j2880j2269j1541j0342q890p862p443o973n762
$$ plain form
59343 621009 637509 655450 674152 692555 710036 726707 742794 757927 771341 782599 791825 799171
59331 799171 804309 806624 805847 802367 796839 789527 780179 768720 755892 742878 730318 718031 705773
59318 705773 693926 683259 674259 666825 660348 653996 647304 640720 635273 631424 628547 625784 623064 620971
59304 620971 619979 620259 621895 624733 628174 631652 635249 639439 644434 650299 657502 666603 677351 688794
59290 688794 700391 712434 725167 738150 750818 763162 775450 787660 799493 810397 819011 822971
59278 822971 820119 810227 795422 779009 764026 752465 745068 741519 741041 743051 747279 753401 760873
59265 760873 769181 778027 787073 795673 803073 808910 813307 816337 817499 815943 811258 803849 794394 783246
59251 783246 770616 757118 743658 730778 718509 706968 696626 687736 679874 672431 665458 659696
59239F59696l891k082r31m53j91K86R48J386J407J292J326J317J003O16N40M53
59223F62722m90k462m506n593n769n949o842q405j0024j0941j0615r161p390o165
59209E68410n627n221m495l648l222l315l350k702j447l13J30J9j54j19J09N01
59193E35556R48J156J057J203K224L838M932M824M035L509L496L561L403L257
59179E76999L565M450N574O340O382N933N606N721O086O427O755P116P328P265
59165F61547P186P478Q151Q848R276R422R440R501R604R378Q244O055L449J369
59151G68948J35p54j992l776n645o917p352p455q000r095j0026j0076r267q097
59137F80631o913n846n072m699m500m195l762l187k128m42J183J785J433J281
$$ plain form
59239 659696 655805 653723 652792 652339 652148 652434 653382 654768 656175 657467 658793 660110 661113 661729 662269 662722
59223 662722 662232 659770 655264 649671 643902 637953 631111 622706 612682 601741 591126 581965 574575 568410
59209 568410 562783 557562 553067 549419 546197 542882 539532 536830 535383 535070 535200 535219 535065 534946 535055 535556
59193 535556 536504 537660 538717 539920 542144 545982 550914 555738 559773 563282 566778 570339 573742 576999
59179 576999 580564 585014 590588 596928 603310 609243 614849 620570 626656 633083 639838 646954 654282 661547
59165 661547 668733 676211 684362 693210 702486 711908 721348 730849 740453 749831 758075 764130 767579 768948
59151 768948 769083 768329 766337 762561 756916 749999 742647 735192 727192 718097 708071 697995 688728 680631
59137 680631 673718 667872 662800 658101 653601 649406 645644 642457 640329 639887 641070 642855 644288 645569
59123F45569K225M015N929P707R358J0614J1169J1304J1656J2413J3066J3115
59111G58140J2683J2296J2172J1965J1239J0144R312R027Q769P888O484N196M272
59098H79587L412K477J701J083K53q20j681k252l121m480n508n598n478o170p343
59083H46062p880p808q316r700j0768j0726j0500j1259j2568j3102j2607j2039
59071G18789j1987j1987j1455j0425r179p836o604n831n491n021m039k874k126
59058F23934j973k148k338k337k042j629j579k190l091l556l246k506j861j498
59044E91940j252r37n37j70J27N13J207K084K630K525K212K484L492M529N005
59029F15852N225N842O848P672Q079Q436Q952R315R272R130R257R487R502R471
$$ plain form
59123 645569 647794 651809 657738 665445 674803 685417 696586 707890 719546 731959 745025 758140
59111 758140 770823 783119 795291 807256 818495 828639 837951 846978 855747 863635 870119 875315 879587
59098 879587 882999 885476 887177 888260 888513 887693 886012 883760 880639 876159 870651 865053 859575 853405 846062
59083 846062 838182 830374 822058 812358 801590 790864 780364 769105 756537 743435 730828 718789
59071 718789 706802 694815 683360 672935 663756 655920 649316 643485 637994 632973 628934 626060 623934
59058 623934 621961 619813 617475 615138 613096 611467 609888 607698 604607 601051 597805 595299 593438 591940
59044 591940 590688 589751 589214 589044 589171 589684 590891 592975 595605 598130 600342 602826 606318 610847 615852
59029 615852 621077 626919 633767 641439 649518 657954 666906 676221 685493 694623 703880 713367 722869 732340
59015G32340R769J0206J0066Q923P026M825K584N17j073k016k359k116j308k97
59001G77087L55N91J085K373M077N324N744N703N599N314M407K705O81p64j080
58986H19201q28j342l399o328q712r821j0073j0197j0361j0194r420q232p055
58973G23239n975m582k538k03J715L146M724O630Q007Q092P443P285P883Q377
58959G73243Q140P446O591N256L152P26j320k841m214n805p761r995j2002j3030
58945G47586j2775j1787j0876j0342r970r442q466o850m940l655l564m125m286
58932F46508l745l085k740k544k339k376k811l277l341l138l157l555m011m137
58918F02252l831l280k720k209j576o38M92J540K492L625M966O082O665P059P759
$$ plain form
59015 732340 742109 752315 762381 771304 778330 783155 785739 786256 785183 783167 780808 778692 777384 777087
59001 777087 777442 778033 779118 781491 785568 790892 796636 802339 807938 813252 817659 820364 821045 820281 819201
58986 819201 818373 817031 813632 807304 798592 788771 778698 768501 758140 747946 738526 730294 723239
58973 723239 717264 712682 710144 709941 711656 714802 719526 726156 734163 742255 749698 756983 764866 773243
58959 773243 781383 788829 795420 800676 803828 804554 803234 800393 796179 790374 782613 772618 760616 747586
58945 747586 734811 723024 712148 701806 691836 682394 673928 667078 662138 658483 654919 650794 646508
58932 646508 642763 639678 636938 634394 632055 629679 626868 623591 620250 617112 613955 610400 606389 602252
58918 602252 598421 595141 592421 590212 588636 587998 588490 590030 592522 596147 601113 607195 613860 620919 628678
58903F28678Q585Q922Q737Q829R844J1462J2898J3839J4570J5361J6184J6900
58891G74809J7420J7669J7730J7870J8235J8579J8671J8858J9707K1094K2108
58880I82750K1905K0339J7635J3965R632N150Q37l382p490j1110j4039j6588j8990
58867A000614k0840k1613k1503k1204k1042k0717j9812j8151j5957j4006j3278
58856G92491j3926j4872j5003j4468j4140j4205j4110j3656j3095j2251j0660
58845F42105q727p641p719p854p098n935n303n176m882m256l735l580l672l811
58831E62716l805l535l163k983k815k191j319j093j685k048j419n07k75l95n3
58816E35430L89n2j075j219J3J467K041J984K031K249K261J968J471P52q0o25
$$ plain form
58903 628678 637263 646185 654922 663751 673595 685057 697955 711794 726364 741725 757909 774809
58891 774809 792229 809898 827628 845498 863733 882312 900983 919841 939548 960642 982750
58880 982750 1004655 1024994 1042629 1056594 1066226 1071376 1072213 1068831 1061341 1050231 1036192 1019604 1000614
58867 1000614 979774 958161 936658 915454 894412 873695 853883 835732 819775 805769 792491
58856 792491 778565 763693 748690 734222 720082 705877 691767 678111 665016 652765 642105
58845 642105 633378 625737 618018 610164 603066 597131 591828 586652 581770 577514 573779 570199 566527 562716
58831 562716 558911 555376 552213 549230 546415 544224 542905 541812 540127 538079 536660 536153 535878 535483 535430
58816 535430 535819 535767 534692 533473 533486 534953 536994 538978 541009 543258 545519 547487 548958 549710 549630 549005
58800E49005o22k87L7K37L24K74J60J71L74P29J261J947K455K453K161K133K562
58783E65374L199L909M708N299N223M539L843L522L500L721M141M216L216J317
58769F19727m02j345k117l448n100o266o483n739m273k787k151k344k244j112
58755E73916K79P13K81J96J053K220K947L339L920M805N572N821N665N675O230
58740F22632P007P425P576Q133R102R475Q660P603P620Q594R285R165Q896R013
58726G40186R224R256R427R882J0087R641R012Q776Q719Q309P740P638P942P886
58712H63725P189O486O243N917M715K746P57j103l519o862j0478j3431j5547j7217
58698H29621j8534j9240j9435j9702k0323k0857k0771k0123j9292j8280j6693
$$ plain form
58800 549005 548383 548096 548133 548370 548694 548968 549128 549299 549673 550402 551663 553610 556065 558518 560679 562812 565374
58783 565374 568573 572482 577190 582489 587712 592251 596094 599616 603116 606837 610978 615194 618410 619727
58769 619727 619325 617980 615863 612415 607315 601049 594566 588827 584554 581767 579616 577272 575028 573916
58755 573916 574195 574908 575189 575385 576438 578658 581605 584944 588864 593669 599241 605062 610727 616402 622632
58740 622632 629639 637064 644640 652773 661875 671350 680010 687613 695233 703827 713112 722277 731173 740186
58726 740186 749410 758666 768093 777975 788062 797703 806715 815491 824210 832519 840259 847897 855839 863725
58712 863725 870914 877400 883643 889560 894275 897021 897778 896675 893156 886294 875816 862385 846838 829621
58698 829621 811087 791847 772412 752710 732387 711530 690759 670636 651344 633064 616371
58687F16371j4392j1822r687q417p945p788p340o260m758l422k686k451k295k004
58673E25104j738j576j209l78O00J214J658K706M511O232P236P957Q946R658R197
58658E80118P819O631N888M750K833Q70m48j316k067k546k765l294m290m878m329
58643E82976l287k933l361l645l286k726k496k540k529k331k063j873j702j167
58629E47037M8J557K426K229J558J127Q73L94k47o71q01p11j69J078K788M533
58613E63049O204P779Q834Q962Q499Q194Q262Q169P272N333K682J56j464k293
58599F39638l156m205m481l469k266k213l024l405k976k316j450J70K202L410
58585F12459L452L403M128N252O206P148Q271R139R413R452R655R832R772R763
$$ plain form
58687 616371 601979 590157 580470 572053 564108 556320 548980 542720 537962 534540 531854 529403 527108 525104
58673 525104 523366 521790 520581 520203 520803 522017 523675 526381 530892 537124 544360 552317 561263 570921 580118
58658 580118 587937 594568 600456 605206 608039 608909 608461 607145 605078 602532 599767 596473 592183 587305 582976
58643 582976 579689 576756 573395 569750 566464 563738 561242 558702 556173 553842 551779 549906 548204 547037
58629 547037 547085 548642 551068 553297 554855 555982 556855 557249 557002 556331 555530 554819 554650 555728 558516 563049
58613 563049 569253 577032 585866 594828 603327 611521 619783 627952 635224 640557 643239 643395 641931 639638
58599 639638 636482 632277 627796 624327 622061 619848 616824 613419 610443 608127 606677 606847 609049 612459
58585 612459 615911 619314 623442 628694 634900 642048 650319 659458 668871 678323 687978 697810 707582 717345
58571G17345R991J0054R706R532J0324J2110J4312J6444J8170J9155J9341J9159
58559H85643J9028J8866J8336J7267J5627J3443J0922Q315N514K278j098l972
58547A010169o349q912j1737j3870j4644j4720j5143j6011j6791j7299j7662j7696
58535H39335j7236j6717j6620j6610j5926j4494j2882j1302r481p496n944n083
58523F89544m379l172j423L86J707K220K009J567J443J692J912J778J396J088
58509F97768J037J165J233J073Q36R22J555K453L009K733J557o8j329j640j250
58494G11054j005j335j793j822j565j516j648j419o26L14J049J782K830L964M684
58479G12948N030N707P075Q389Q533P408O099N566N665N700N286M264K382k72
$$ plain form
58571 717345 727336 737390 747096 756628 766952 779062 793374 809818 827988 847143 866484 885643
58559 885643 904671 923537 941873 959140 974767 988210 999132 1007447 1012961 1015239 1014141 1010169
58547 1010169 1003820 994908 983171 969301 954657 939937 924794 908783 891992 874693 857031 839335
58535 839335 822099 805382 788762 772152 756226 741732 728850 717548 708067 700571 694627 689544
58523 689544 685165 681993 680570 680956 682663 684883 686892 688459 689902 691594 693506 695284 696680 697768
58509 697768 698805 699970 701203 702276 703112 704034 705589 708042 711051 713784 715341 715273 713944 712304 711054
58494 711054 710049 708714 706921 705099 703534 702018 700370 698951 698325 698639 699688 701470 704300 708264 712948
58479 712948 717978 723685 730760 739149 747682 755090 761189 766755 772420 778120 783406 787670 790052 789780
58465G89780k865m559n424n996o322o222o030o043n534l560p44J053J173R13J483
58450G41103K406K701K478K381K339J871J128O10K18n60j739k779l285l274k919
58435G42679k469k102j583l95J473L296M385M717M585M315M537N849P729Q650
58421G85666P909O561N967O140O370O521O734O513N257L310J502m9j738l461m720
58406H38482n427n783n679n109m731n047n343m541k841j500j075r58n62M0O52
58391G90578J226J452J034M03L38P44O42m64j971l015l206k436p80J101K155J998
58375G89799J388J358K252L677N054O013O540O886P273P725Q226Q866R634J0372
58361H75063J1068J1833J2480J2653J2451J2375J2312J1481R706P964P061O594
$$ plain form
58465 789780 786915 782356 776932 770936 764614 758392 752362 746319 740785 737225 736481 737534 738707 739620 741103
58450 741103 743509 746210 748688 751069 753408 755279 756407 757017 757235 756675 754936 752157 748872 745598 742679
58435 742679 740210 738108 736525 736130 737603 740899 745284 750001 754586 758901 763438 769287 777016 785666
58421 785666 793575 800136 806103 812243 818613 825134 831868 838381 843638 846948 848450 848401 846663 843202 838482
58406 838482 833055 827272 821593 816484 811753 806706 801363 796822 793981 792481 791406 790448 789886 789926 790578
58391 790578 791804 793256 794290 794693 795031 795775 796417 795953 793982 790967 787761 785325 784545 785646 787801 789799
58375 789799 791187 792545 794797 798474 803528 809541 816081 822967 830240 837965 846191 855057 864691 875063
58361 875063 886131 897964 910444 923097 935548 947923 960235 971716 981422 989386 996447 1003041
58349A003041N805M692L579K461J571J705L072M681N750O832Q516J0088J0749
58336A072542J1131J2102J2971J2558J1339J0765J0976J0996J0757J1048J1667
58325A198852J1508J0544R874R772R362Q350P490P095O694O320O591P349P689
58312A307490P572P868Q690R219R406J0160J1585J2650J3033J3663J4903J5791
58300A442030J5755J5620J6199J7071J7487J7520J7648J8050J8679J9325J9516
58289A634900J9214J9392K0873K2863K3909K3981K4151K4641K4943K5541K7451
58278A891859L0088L1675L1936L2352L3600L4862L5967L7892M0588M2556M3344
58267B286719M4399M6682M9320N1466N3553N5946N8089N9800O1775O4113O5943
$$ plain form
58349 1003041 1008846 1013538 1017117 1019578 1021149 1022854 1025926 1030607 1036357 1043189 1051705 1061793 1072542
58336 1072542 1083673 1095775 1108746 1121304 1132643 1143408 1154384 1165380 1176137 1187185 1198852
58325 1198852 1210360 1220904 1230778 1240550 1249912 1258262 1265752 1272847 1279541 1285861 1292452 1299801 1307490
58312 1307490 1315062 1322930 1331620 1340839 1350245 1360405 1371990 1384640 1397673 1411336 1426239 1442030
58300 1442030 1457785 1473405 1489604 1506675 1524162 1541682 1559330 1577380 1596059 1615384 1634900
58289 1634900 1654114 1673506 1694379 1717242 1741151 1765132 1789283 1813924 1838867 1864408 1891859
58278 1891859 1921947 1953622 1985558 2017910 2051510 2086372 2122339 2160231 2200819 2243375 2286719
58267 2286719 2331118 2377800 2427120 2478586 2532139 2588085 2646174 2705974 2767749 2831862 2897805
58256B897805O7099O8476P0383P2139P3597P5275P6881P7757P8840Q1888Q6744
58245C726884R1666R6438J02464J09738J16691J23296J31248J40664J49749J58210
58235D947048J67803J79032J90650K02865K17496K34333K51191K68079K87362
58226F945859L09304L31840L55487L83599M16780M52044M88904N31127N81040
58217A0795984O37416P00595P74050Q59230R54957J063952J193820J349810J533861
58208A9863675J753435K024336K362394K779405L287857L899054M614760N435031
58200D6019947O381888P503670Q845015J0413015J2161993J3981803J5691340
58193A20998671J7080758J8008336J8471200J8575654J8441275J8128654J7622732
$$ plain form
58256 2897805 2964904 3033380 3103763 3175902 3249499 3324774 3401655 3479412 3558252 3640140 3726884
58245 3726884 3818550 3914988 4017452 4127190 4243881 4367177 4498425 4639089 4788838 4947048
58235 4947048 5114851 5293883 5484533 5687398 5904894 6139227 6390418 6658497 6945859
58226 6945859 7255163 7587003 7942490 8326089 8742869 9194913 9683817 10214944 10795984
58217 10795984 11433400 12133995 12908045 13767275 14722232 15786184 16980004 18329814 19863675
58208 19863675 21617110 23641446 26003840 28783245 32071102 35970156 40584916 46019947
58200 46019947 52401835 59905505 68750520 79163535 91325528 105307331 120998671
58193 120998671 138079429 156087765 174558965 193134619 211575894 229704548 247327280
58186B47327280J6844130J5662391J3884192J1197807P161708J419363n860171
58179C07636700j3689255k0534492k5065283k6777923k6030635k3625132k0386229
58172A51527751j6963570j3776507j1016626q719183o865545n424381m346969
58165H4414970l616009l318723l587544m397677n448716o303718o656889o467181
58157D4618513n883716n103858m291385l553397k936047k437411k037516j719106
58149A6656077j466578j262504j093902r55260q41645p45334o61550n91030n34120
58140H504154m87273m47049m12743l83630l57750l34404l13944k94613k73404
58131E199344k50406k28653k09458j91513j74599j60312j48754j38140j28380
$$ plain form
58186 247327280 264171410 279833801 293717993 304915800 312077508 313496871 307636700
58179 307636700 293947445 273412953 248347670 221569747 195539112 171913980 151527751
58172 151527751 134564181 120787674 109771048 101051865 94186320 88761939 84414970
58165 84414970 80798961 77480238 73892694 69495017 64046301 57742583 51085694 44618513
58157 44618513 38734797 33630939 29339554 25786157 22850110 20412699 18375183 16656077
58149 16656077 15189499 13926995 12833093 11877833 11036188 10290854 9629304 9038274 8504154
58140 8504154 8016881 7569832 7157089 6773459 6415709 6081305 5767361 5472748 5199344
58131 5199344 4948938 4720285 4510827 4319314 4144715 3984403 3835649 3697509 3569129
58122C569129j21694j18942j18102j17038j15230j12286j07320j00596r3754q7768
58112B476399q2201p6707p1619o7039o2736n8908n5819n3005n0157m8073m7304
58101A802831m6642m4681m2092m0560m0089l9276l7700l6180l4952l3461l1631
58090A375567k9811k7750k5136k2641k1010j9692j7914j6421j6440j7506j8111
58079A143135j8056j8284j8799j8694j8043j7934j8517j8745j8163j7452j7061
58068I43387j6628j5981j5472j5143j4532j3514j2507j1850j1594j1676j1704
58057G92786j1045r757q843q901r278r254r166r389r361q701q236q558q622p377
58043F66298n824n703o780p262o483n453n080n431o400p587p872o650n213n344
$$ plain form
58122 3569129 3447435 3328493 3210391 3093353 2978123 2865837 2758517 2657921 2564167 2476399
58112 2476399 2394198 2317491 2245872 2178833 2116097 2057189 2001370 1948365 1898208 1850135 1802831
58101 1802831 1756189 1711508 1669416 1628856 1588767 1549491 1511791 1475611 1440659 1407198 1375567
58090 1375567 1345756 1318006 1292870 1270229 1249219 1229527 1211613 1195192 1178752 1161246 1143135
58079 1143135 1125079 1106795 1087996 1069302 1051259 1033325 1014808 996063 977900 960448 943387
58068 943387 926759 910778 895306 880163 865631 852117 839610 827760 816166 804490 792786
58057 792786 781741 771984 763141 754240 744962 735708 726542 717153 707792 699091 690855 682297 673675 666298
58043 666298 660474 654771 647991 640729 634246 628793 623713 618282 611882 604295 596423 589773 584560 579216
58029E79216o833p967q126q190q571q645q194p842p767p428o655n876n178m313
58015D77631l527l203k969k385k153l061m095l410j163M81L13o42j105r79m61
58000D49272O35J927K318J601J002J388K106K188J776J626K050K886L789M135
57986D78699L441K217J611J866J985J227Q0o46q43q93j066j543k334k997k972
57971D77832k426k089k309k869l608m417m751m200l470l637m445m558l648k915
57957D28490l144l584l325k645k305k427k800l488m419m971m586l416j931m65
57943C84984O64J196J413J938K815L458L688M018M687N230N435N831O740P561
57929D39658P614P057O460N955N341M604L933L451L183K990K518J551L86o41j838
$$ plain form
58029 579216 572383 564416 556290 548100 539529 530884 522690 514848 507081 499653 492998 487122 481944 477631
58015 477631 474104 470901 467932 465547 463394 460333 456238 452828 451665 452146 452459 451817 450712 449733 449272
58000 449272 449907 451834 454152 455753 456755 458143 460249 462437 464213 465839 467889 470775 474564 478699
57986 478699 482140 484357 485968 487834 489819 491046 491126 490480 489637 488744 487678 486135 483801 480804 477832
57971 477832 475406 473317 471008 468139 464531 460114 455363 451163 447693 444056 439611 435053 431405 428490
57957 428490 425346 421762 418437 415792 413487 411060 408260 404772 400353 395382 390796 387380 385449 384984
57943 384984 385648 386844 388257 390195 393010 396468 400156 404174 408861 414091 419526 425357 432097 439658
57929 439658 447272 454329 460789 466744 472085 476689 480622 484073 487256 490246 492764 494315 494701 494060 492222
57914D92222l691n788p149p619q043q916r782j0184j0275j0261j0063r734r457
57901C81260q936p871p034p645r326j0060q755o643n338m780m090l303k964k722
57887B91793j783l47N63O20N63J091K116L134L743L832L633L520L476L051K143
57872C21148J380J356J827K119J932J393O82j0m54o98j036j405j350p94k55P1
57856C25906O58J660K329K198K029K746L870M191L673L597M701O140O586N771
57842C76055M553L836L759L789L366K374J042m25j811k711k858k717l147m265
57828C80840n249n482n318n313n278m762l932l353l117k808k212j467o69K48J235
57813C33363K148K926L546L855L744L325K749J982J017K6q57j736k759l936n273
$$ plain form
57914 492222 488531 482743 475594 467975 459932 451016 441234 431050 420775 410514 400451 390717 381260
57901 381260 372324 364453 357419 349774 340448 330388 321633 314990 309652 304872 300782 297479 294515 291793
57887 291793 290010 289663 290226 290846 291409 292500 294616 297750 301493 305325 308958 312478 315954 319005 321148
57872 321148 322528 323884 325711 327830 329762 331155 331837 331827 331373 330675 329639 328234 326884 326090 325835 325906
57856 325906 326564 328224 330553 332751 334780 337526 341396 345587 349260 352857 357558 363698 370284 376055
57842 376055 380608 384444 388203 391992 395358 397732 398774 398349 396538 393827 390969 388252 385105 380840
57828 380840 375591 370109 364791 359478 354200 349438 345506 342153 339036 336228 334016 332549 331880 332128 333363
57813 333363 335511 338437 341983 345838 349582 352907 355656 357638 358655 358681 357824 356088 353329 349393 344120
57798C44120o727p894q191p615o924o720o705o226n244m311l824l687l558l162
57784B63332k479j771j348j213j161j202j465j679j277j64J142K295L446M518
57770B60974M927M461L874L977M563M856M670M493M582M596M107L061J723L89
57756C15253q05j891k762l069k731k463l103m386n071m547l585l172l352l646
57742B70670l917m187m176l714l143k763k303j563j038j218j684j644j055n53
57728B37712m37m11k19M5J95J42p0j52K11P88Q87L28j74l4L89N45N78Q25R53M89
57708B42590k54o48p52r45r10n8J203J715J206O77R39J560J669J191Q29J194K129
57691B53335K857K697J805R62N50J05p37j456j341n43L65J516L501O286R291J2482
$$ plain form
57798 344120 337393 329499 321308 313693 306769 300049 293344 287118 281874 277563 273739 270052 266494 263332
57784 263332 260853 259082 257734 256521 255360 254158 252693 251014 249737 249573 250715 253010 256456 260974
57770 260974 265901 270362 274236 278213 282776 287632 292302 296795 301377 305973 310080 313141 314864 315253
57756 315253 314448 312557 309795 306726 303995 301532 298429 294043 288972 284425 280840 277668 274316 270670
57742 270670 266753 262566 258390 254676 251533 248770 246467 244904 243866 242648 240964 239320 238265 237712
57728 237712 237275 236864 236645 236690 236885 237027 236957 236805 237016 237804 238691 239019 238845 238811 239200 239745 240323 241148 242101 242590
57708 242590 242336 241688 240936 239991 239081 239023 240226 241941 243147 243824 244763 246323 247992 249183 250012 251206 253335
57691 253335 256192 258889 260694 261656 262206 262311 261574 260118 258777 258234 258599 260115 263616 269902 279193 291675
57675B91675J6412K1037K5393K8583L0441L1048L0534K9508K8885K8818K8434
57664E90768K7001K4697K1665J6867Q587l872j9177l4392m6193n2225n2048m7160
57652D34518m0041l2889k6849k1991j7871j4220j1201r050p712o866o153n221
57640B34454l908k525j636j313r66k19N39Q03P21O55M83l1n23m60k6K17K44M25
57622B26934N58k6j393k749l338k981j847l78O20O05O6r2J27p4q47j354j110o79
57604B12042o54p73n45q5J49l5n59j213j550j237p39r77k025k845k674j973j561
57587A92746j524j609j939k627l143k867j992j238j001j245j851k419k141p42
57573A66408P47R18k92j582j939j579j154q41n79n19q08j197j294r99m45K54Q63
$$ plain form
57675 291675 308087 329124 354517 383100 413541 444589 475123 504631 533516 562334 590768
57664 590768 617769 642466 664131 680998 689585 685713 666536 632144 585951 533726 481678 434518
57652 434518 394477 361588 334739 312748 294877 280657 269456 260406 252694 245828 239675 234454
57640 234454 230546 228021 226385 225072 224106 223887 224426 225229 225950 226605 227088 227057 226534 226074 226048 226265 226509 226934
57622 226934 227492 227466 226073 223324 219986 217005 215158 214780 215400 216005 216071 215979 216106 216032 215185 213831 212721 212042
57604 212042 211388 210615 210070 209985 210134 210099 209540 208327 206777 205540 204801 203824 201799 198954 196280 194307 192746
57587 192746 191222 189613 187674 185047 181904 179037 177045 175807 174806 173561 171710 169291 167150 166408
57573 166408 167155 168073 167781 166199 164260 162681 161527 160686 160107 159588 158780 157583 156289 155290 154845 155099 155962
57556A55962R76M31k72m01J28O34N88L02M77J232J946K025J524R01M62J92m8l11
57538A66748m94l06M56J466J972J599Q56N06N86M89o0n99o10j57L39O70Q30P59
57520A75050L90o1j84J87P59J093J018P02L78J57N9R5J80J34o7k53l98q09j585
57501A76845k138j798r61q17j788k792k588j315j88Jn49j308j980k421k481k041
57485A51681j061K83J336J295J47j050j296q01m97p21j023j042r24q49q33r91
57469A43654j458j976k034j512p52n7M95P69O79N07O04Q35Q12O56Q69J428J620
57452A45139J009N5m92m19j51k56q74j432j071K40J277Q83m77j235p29J55M35
57435A42057K04M9Q0R0R9J83J99J15K75Q98J591J725J146K73k93j65N62J247J259
$$ plain form
57556 155962 156938 157369 157097 156696 156824 157458 158046 158348 158825 160057 162003 164028 165552 166453 166915 167107 167059 166748
57538 166748 166254 165948 166404 167870 169842 171441 172297 172803 173389 173878 173818 173219 172609 172452 172791 173461 174291 175050
57520 175050 175440 175379 175195 175382 176141 177234 178252 178954 179332 179489 179548 179643 179823 179957 179890 179637 179239 178430 176845
57501 176845 174707 172909 171948 171131 169343 166551 163963 162648 162460 162461 161912 160604 158624 156203 153722 151681
57485 151681 150620 150903 152239 153534 153681 152631 151335 150534 150037 149316 148293 147251 146327 145478 144645 143654
57469 143654 142196 140220 138186 136674 135922 135865 136360 137129 137808 138315 138919 139754 140566 141222 142091 143519 145139
57452 145139 146148 146203 145711 145292 145141 144885 144011 142579 141508 141748 143025 143908 143431 142196 141467 141622 142057
57435 142057 142261 142310 142390 142480 142579 142762 142961 143076 143351 144249 145840 147565 148711 148984 148691 148526 149088 150335 151594
57416A51594O89K18J74J81j12m81o14o30p32p37m24m6Nj64n7M06O91L60k84n73
57396A49464l10Q0K69N98J450K351K345J410P27J087J699J309O0o70p7J243K242
57379A65277K460K026J328Q06O24M52J6l35j64J67q9q02j080o42l13q33j899k721
57361A64278k885k422j523n04L57J045J597J749J354Q82Q85J036N87l42q04l82
57345A64908L94J036J558J844J619J183J151J285O84n54j143n32K73M12L96Q00
57329A75314R97K76p56j081q44p96q72m74K66O45N45L96K45j34m64k35K66K26
57311A73520m29p96k15R04J667J627J066O54Q78J561K015J768R81M7o93q12L1
57294A83774J386K053J377Nr78j161o85L08J407J802J213N51Q43J808K213J434
$$ plain form
57416 151594 152283 152501 152675 152856 152744 152263 151649 151019 150287 149550 149126 149080 149085 148921 148864 149270 149961 150321 150037 149464
57396 149464 149154 149234 149503 150101 151551 153902 156247 157657 158384 159471 161170 162479 162539 161869 161792 163035 165277
57379 165277 167737 169763 171091 171897 172521 172973 172989 172654 172490 172657 172568 171766 170686 170044 169731 168898 166999 164278
57361 164278 161393 158971 157448 156944 157301 158346 159943 161692 163046 163928 164813 165849 166436 166094 165290 164908
57345 164908 165302 166338 167896 169740 171359 172542 173693 174978 175662 175108 173965 173433 173706 174118 174514 175314
57329 175314 176311 176587 175831 174750 173906 173110 172238 171764 172030 172675 173220 173616 173861 173727 173263 173028 173294 173520
57311 173520 173091 172295 172080 172984 174651 176278 177344 177998 178876 180437 182452 184220 185201 185248 184555 183743 183774
57294 183774 185160 187213 188590 188595 187617 186456 185771 186079 187486 189288 190501 191052 191895 193703 195916 197350
57278A97350Qj144j438p40N51J650J983J670J108N16J03K15Q41J400J437J222
57262B06732J191J326J502J875K386K456J806J025P07N39p5r23j306j019l40N15
57246B18397J281J480J063P59J059J399J171R13J504K598K990K321J413R89J006
57231B40343J252J737K472L379M298M712L914K120P96R81J841J895J210J053J775
57216B73778K395K371K391L042L873M207M093L939L866L782L672L548L413L354
57202C21724L429L555L771M271M832M825M291M344N642P168P504O818O343O417
57188C94934O333N928N818O105O203O061O239O634O419N557N032N216N324N042
57174D76845N414P216R449J0417R742Q480P677P554P908Q633R730J0997J1896
$$ plain form
57278 197350 197358 196214 194776 194036 194587 196237 198220 199890 200998 201514 201617 201832 202673 204073 205510 206732
57262 206732 207923 209249 210751 212626 215012 217468 219274 220299 221006 221545 221470 220547 219241 218222 217882 218397
57246 218397 219678 221158 222221 222980 224039 225438 226609 227522 229026 231624 234614 236935 238348 239337 240343
57231 240343 241595 243332 245804 249183 253481 258193 262107 264227 265023 266004 267845 269740 270950 272003 273778
57216 273778 276173 278544 280935 283977 287850 292057 296150 300089 303955 307737 311409 314957 318370 321724
57202 321724 325153 328708 332479 336750 341582 346407 350698 355042 360684 367852 375356 382174 388517 394934
57188 394934 401267 407195 413013 419118 425321 431382 437621 444255 450674 456231 461263 466479 471803 476845
57174 476845 482259 489475 498924 509341 519083 527563 535240 542794 550702 559335 569065 580062 591958
57161E91958J1982J1620J1835J3047J4421J5084J5423J6326J7606J8434J9019
57150G56755K0557K3387K6481K8971L1114L3414L5859L8464M1586M5244M8833
57139A130665N1945N4810N7641O0248O2458O4342O5816O6768O7656O9220P1487
57128A823056P3772P5745P7713P9909Q2290Q5044Q8331R1624R4190R6251R8586
57117B766511J01184J03493J05966J09988J16140J23885J33088J44465J58286
57108C863006J74221J92948K16468K46300K82783L26690L80166M45372N23374
57099F651328O14769P19993Q38418R68554J109583J260994J419713J578716J728959
57090A6891027J861807J970484K052360K110616K150956K176227K188566K198626
$$ plain form
57161 591958 603940 615560 627395 640442 654863 669947 685370 701696 719302 737736 756755
57150 756755 777312 800699 827180 856151 887265 920679 956538 995002 1036588 1081832 1130665
57139 1130665 1182610 1237420 1295061 1355309 1417767 1482109 1547925 1614693 1682349 1751569 1823056
57128 1823056 1896828 1972573 2050286 2130195 2212485 2297529 2385860 2477484 2571674 2667925 2766511
57117 2766511 2867695 2971188 3077154 3187142 3303282 3427167 3560255 3704720 3863006
57108 3863006 4037227 4230175 4446643 4692943 4975726 5302416 5682582 6127954 6651328
57099 6651328 7266097 7986090 8824508 9793062 10902645 12163639 13583352 15162068 16891027
57090 16891027 18752834 20723318 22775678 24886294 27037250 29213477 31402043 33600669
57082C3600669K225897K280476K341369K355038K257280J999822J565613R71722
57074D9597886K63509m98495j254031j951689k548479l008829l309594l446626
57066C3843652l435180l303845l086958k818464k527186k234444j954582j696726
57058A2786267j465709j262665j086492r35437q07537p00300o10836n36350m74343
57049D906598m22588l79176l42449l10819k82817k57332k33549k10885j89302
57040B277681j69446j51813j35954j21084j07308r5433q5584p6807o8200n9749
57030A206303n1839m4617l8054l1930k5564j7934q446K825J5520K9135M2694N4883
57018A132976O4697P1623P5471P6758P7251P9100Q3041Q7616Q9659Q4296O4945
$$ plain form
57082 33600669 35826566 38107042 40448411 42803449 45060729 47060551 48626164 49597886
57074 49597886 49861395 49362900 48108869 46157180 43608701 40599872 37290278 33843652
57066 33843652 30408472 27104627 24017669 21199205 18672019 16437575 14482993 12786267
57058 12786267 11320558 10057893 8971401 8035964 7228427 6528127 5917291 5380941 4906598
57049 4906598 4484010 4104834 3762385 3451566 3168749 2911417 2677868 2466983 2277681
57040 2277681 2108235 1956422 1820468 1699384 1592076 1496643 1411059 1334252 1266052 1206303
57030 1206303 1154464 1109847 1071793 1039863 1014299 996365 987919 990744 1006264 1035399 1078093 1132976
57018 1132976 1197673 1269296 1344767 1421525 1498776 1577876 1660917 1748533 1838192 1922488 1987433
57007A987433K6228l0412r3894j48040j80418j88030j76247j53792j28255j04200
56997H10373q3471o6565n3701m4739l8580l3417k7979k2374j7547j4117j1896
56986C95987j0345r014p616o068m681m043m444n593p096q951j1180j3246j4317
56973B89393j4131j3086j1484r297o735m388k505o95J351L381N132O786Q351R169
56959B61242Q739P601O753O492O426O263N765M222R11l819q611j2365j4819j5908
56945B58892j5334j3115r990o793l751o06K753O023Q651J0265J1063J1761J2820
56932B72639J3820J3942J2997J1566J0086Q208N239P60n220j2240j9077k3936
56920B88784k5537k4152k1291j8351j5747j3347j1274r853q886p600n651l785
$$ plain form
57007 1987433 2013661 1983249 1889355 1741315 1560897 1372867 1196620 1042828 914573 810373
56997 810373 726902 660337 606636 561897 523317 489900 461921 439547 422000 407883 395987
56986 395987 385642 376628 369012 362944 358263 354220 349776 344183 337087 328136 316956 303710 289393
56973 289393 275262 262176 250692 241395 234660 230272 227767 227072 228423 231804 236936 243722 252073 261242
56959 261242 269981 277582 284335 290827 297253 303516 309281 313503 314414 310595 301984 289619 274800 258892
56945 258892 243558 230443 220453 213660 209909 209303 212056 218079 226730 236995 248058 259819 272639
56932 272639 286459 300401 313398 324964 335050 343258 348497 349257 344037 331797 312720 288784
56920 288784 263247 239095 217804 199453 183706 170359 159085 149232 140346 132746 127095 123310
56908A23310k993l184l294k652j640p86O1J274K635L595M100M672N775P341Q840
56893A47054R686R776R790J0605J2191J3462J3553J2795J2041J1457J0570R123
56881B82103P275M974J861k065n937q447q703o821l809p25K202N487R429J3590
56867B90414J7336K0471K3056K5008K6229K6858K7061K6799K6085K5088K3716
56856E58121K1282J6876R967P25r670j8982k4929k6790k5582k2445j7402j0096
56844D51075j026Q549J7504K5183L1353L6178L9878M2140M2545M1735M1102M0878
56832H17094L9623L6278L1290K4714J4538j076k0472l9080n3039o0954o2693n8612
56820F67611n0228l9996k9627j9483r708p74P144J4118J9498K2333K3113K3769
$$ plain form
56908 123310 120317 117133 113839 111187 109547 108761 108822 110096 112731 116326 120426 125098 130873 138214 147054
56893 147054 156740 166516 176306 186911 199102 212564 226117 238912 250953 262410 272980 282103
56881 282103 289378 294352 296213 294148 288211 279764 271061 264240 260431 259706 261908 267395 276824 290414
56867 290414 307750 328221 351277 376285 402514 429372 456433 483232 509317 534405 558121
56856 558121 579403 596279 606246 606971 597301 578319 553390 526600 501018 478573 461171 451075
56844 451075 450049 458598 476102 501285 532638 568816 608694 650834 693379 735114 776216 817094
56832 817094 856717 892995 924285 948999 963537 962461 941989 902909 849870 788916 726223 667611
56820 667611 617383 577387 547760 528277 518569 517795 524939 539057 558555 580888 604001 627770
56808F27770K5277K6395K5530K2830J9403J5204Q757j100j3892k7621l9744m8133
56796F40676n1708n0492m5344l7776k9638k2221j5573r139k968K178N793Q009
56784C91797R150R571R908J0625J1215J0641Q632N718J927l566j0998j9098k6071
56771D09451l0880l3210l3024l0802k7655k4524k1469j8145j4665j1615r465q261
56759A45736p652p084o238n395n037n057m838m135l346k810k384j940j681j677
56745H6462j613j319j123j298j574j479r63l54Jn9m60q92j035q00j86Q52K046
56728G6206K594J963P94K67N75P42J03q52j358j343j120o65J76J125J629J540
56712H2376J285J386J849K049J419K71m15k27J24j27o78q18o39p11q95m91N08
$$ plain form
56808 627770 653047 679442 704972 727802 747205 762409 771166 770066 756174 728553 688809 640676
56796 640676 588968 538476 493132 455356 425718 403497 387924 378785 375817 377995 383788 391797
56784 391797 400947 410518 420426 431051 442266 452907 461539 467257 469184 465618 454620 435522 409451
56771 409451 378571 345361 312337 281535 253880 229356 207887 189742 175077 163462 153997 145736
56759 145736 138084 131000 124762 119367 114330 109273 104435 100300 96954 94144 91760 89820 88139 86462
56745 86462 84849 83530 82407 81109 79535 78056 77093 76739 76740 76681 76221 75329 74294 73494 73308 74160 76206
56728 76206 78800 80763 81557 81824 82399 83141 83244 82392 81034 79691 78571 77906 78082 79207 80836 82376
56712 82376 83661 85047 86896 88945 90364 90635 90220 89993 90117 89990 89312 88494 87855 87144 86249 85758 86266
56695H6266J297J366Q67pj115j878j723j043p30p41k87N38O12l72j247j073l58
56678H0372O8L30R10J622K020K078J835J007l05j217j042k18L67M50K81j0l15
56661H8233k86K03P20Q48P36O85O43M52J51k52q12j196q52j0K97l42r68n86M47
56642H8111R97O51p9o06o63j25R86K314L375L824L458K377J235Q19J205J838K452
56625A12169L182L682L178J750O58P05J193J111O54O52J131J342R57M71M85J065
56609A34385J667J504L19j062j437o76J37J60l33p75j119j390j314r62r79j532
56593A26593j771j008K28R80J094R57O63J92p5K07P96J327J807K215K147J478
56577A37830P98O06O74P88J334K452L356L370L001L080L420L371L184L634M590
$$ plain form
56695 86266 87563 88929 89796 89789 88674 86796 85073 84030 83300 82559 82272 82810 83422 83050 81803 80730 80372
56678 80372 80440 80770 81680 83302 85322 87400 89235 90242 89937 88720 87678 87460 87827 88277 88558 88548 88233
56661 88233 87947 88150 88870 89718 90454 91139 91782 92234 92385 92133 91321 90125 89273 89263 89560 89218 88250 87664 88111
56642 88111 89108 89759 89680 89074 88411 88286 89272 91586 94961 98785 102243 104620 105855 106674 107879 109717 112169
56625 112169 115351 119033 122211 123961 124619 125324 126517 127628 128282 128934 130065 131407 132364 132835 133320 134385
56609 134385 136052 137556 137875 136813 135376 134700 134837 134997 134664 133889 132770 131380 130066 129104 128125 126593
56593 126593 124822 123814 124042 125022 126116 127073 127736 127928 127853 128060 128856 130183 131990 134205 136352 137830
56577 137830 138628 139234 139908 140696 142030 144482 147838 151208 154209 157289 160709 164080 167264 170898 175488
56562A75488N099M929M993N999P408Q051P378N941M771M295L860K611P46o37j014
56547B39918j002j231j445j223q42q21j190j703k259k682k684k431k498k941l146
56532B11820k913k869l321l764l908m127m378l875k557j645j817k158j827j455
56518A71206j710j811r61q7l99j238j133k74p9p62j197r34n77l48J00M85J36n66
56500A59851n02L28P24J72n53q17q59q69n66lL06L08N11R73J128P60K51j94o29
56481A60320p18l6R18J058K67l85j96L20L66p7m27j25R34K126K419J582P36R66
56463A70048J807K013J406Q32N85K22j72R7J022J684J626J366J386J618K062K898
56447A90500L725L644K390O85p15j566j741j159k37L18L56K41L9n31j358j869
$$ plain form
56562 175488 180587 185516 190509 196508 203916 211967 219345 225286 230057 234352 238212 240823 241569 240932 239918
56547 239918 238916 237685 236240 235017 234175 233354 232164 230461 228202 225520 222836 220405 217907 214966 211820
56532 211820 208907 206038 202717 198953 195045 190918 186540 182665 180108 178463 176646 174488 172661 171206
56518 171206 169496 167685 166724 166637 166238 165000 163867 163593 163514 162752 161555 160621 160044 159696 159796 160281 160417 159851
56500 159851 159349 159677 160401 160573 160020 159203 158344 157475 156909 156906 157212 157520 158031 159004 160132 160892 161143 160949 160320
56481 160320 159602 159566 160484 161542 161809 161424 161228 161548 161914 161837 161410 161285 162219 164345 166764 168346 169082 170048
56463 170048 171855 173868 175274 176106 176691 176913 176741 176838 177860 179544 181170 182536 183922 185540 187602 190500
56447 190500 194225 197869 200259 200944 200229 198663 196922 195763 195526 195844 196200 196441 196480 195949 194591 192722
56431A92722j701r20K54J312J474O44j40l7L66J98q6M77J461J645J128J083J584
56414B01464J473N17j13J27L26j05m36l4N72P19N72M02j1o97j108j005p74o04
56396B01285k61K5l62j131j086R2J193J217O44M07O08R26J289J515J133K91L3
56379B07818R42K192K585J969J078N61O18J165J825K125J955J587J259J092J232
56364B30003J472J066k59j447j294k07L15j69p21p24n34l45J69Q31R11M32K11
56347B29710M20L66j9J10R39J506J315J058J239J405J256J261J582J643J374J580
56331B46745K446L002K763K549K912L054K256J218R72J445J983K368K461J824
56317B77998N99j33K86J121J366J007N48J14k74l55k25m26q66n99O88J970K363
$$ plain form
56431 192722 191021 190101 190355 191667 193141 193785 193645 193608 193974 194172 194086 194563 196024 197669 198797 199880 201464
56414 201464 202937 203454 203341 203468 203794 203689 203253 203219 203791 204510 205082 205484 205473 204776 203668 202663 201889 201285
56396 201285 201024 201049 200687 199556 198470 198562 199755 200972 201616 202023 202631 203557 204846 206361 207494 207785 207818
56379 207818 208760 210952 213537 215506 216584 217145 217763 218928 220753 222878 224833 226420 227679 228771 230003
56364 230003 231475 232541 232282 230835 229541 229334 229649 229480 228759 228035 227501 227156 227325 228156 229067 229499 229710
56347 229710 230130 230496 230477 230587 231526 233032 234347 235405 236644 238049 239305 240566 242148 243791 245165 246745
56331 246745 249191 252193 254956 257505 260417 263471 265727 266945 267917 269362 271345 273713 276174 277998
56317 277998 278597 278464 278750 279871 281237 282244 282792 282906 282632 282277 282052 281626 280760 280161 280849 282819 285182
56300B85182K245K250K151J624J161J227J304O92l17r20r05o06l10k10m24o06
56284B93538j87P25J403J618J825K092J924J416J326J728J788J299J047J292J237
56269C14071O29L67R09J510J763K397L681M557M325L780L744L855L797M242N433
56254C59060O204N736N002N281O398P566Q700R664R612Q419P604Q354R781J0488
56240D67869J0694J1306J1995J1885J1230J0736J0023Q369O295M910M175L245
56228E72732K004Q88k19j611k784l158l236l857m810n366n595o051o551o483n826
56213E20077n009m242l766m033m783m782l485k070j798k242k251j717j256r52
56199D77691o32o60j213j519q52L18J110J414J432J060M86M54R62R93L66M08J676
$$ plain form
56300 285182 287427 289677 291828 293452 294613 295840 297144 297836 297519 296599 295694 295088 294778 294568 294144 293538
56284 293538 293351 294076 295479 297097 298922 301014 302938 304354 305680 307408 309196 310495 311542 312834 314071
56269 314071 314700 315067 315976 317486 319249 321646 325327 329884 334209 337989 341733 345588 349385 353627 359060
56254 359060 365264 371000 376002 381283 387681 395247 403947 413611 423223 431642 439246 447600 457381 467869
56240 467869 478563 489869 501864 513749 524979 535715 545738 554107 560402 565312 569487 572732
56228 572732 574736 575624 575405 573794 571010 567852 564616 560759 555949 550583 544988 538937 532386 525903 520077
56213 520077 515068 510826 507060 503027 498244 493462 489977 487907 486109 483867 481616 479899 478643 477691
56199 477691 477059 476399 475186 473667 472815 473133 474243 475657 477089 478149 478635 479089 480051 481044 481410 481818 483494
56182D83494K643K034R80J125K001K172J736J799K421K920L353L974M086L170
56168E17908K230K404L124L326L377M047M649M223L609M247N758O731P172Q080
56154E80885R237R574R257R407J0147J0823J1631J3162J4893J6040J7320J9882
56142G32258K3022K5109K6390K8767L2978L8035M3330M9421N6594O4273P1892
56131A192069P9102Q5426R0960R6821J03615J10109J14724J17395J18402J16488
56121B225111J09994R9047Q4948O8587N1446L6817K7363K1926J6894J0119J515
56110B753767r009k1445l4099m4667n2771n9418o4723o8563p2728p9580q8803
56099B157961r7811j04953j09820j10962j06415r6694q4737p2706o0969n0057
$$ plain form
56182 483494 486137 488171 489151 490276 492277 494449 496185 497984 500405 503325 506678 510652 514738 517908
56168 517908 520138 522542 525666 528992 532369 536416 541065 545288 548897 553144 558902 565633 572805 580885
56154 580885 590122 599696 608953 618360 628507 639330 650961 664123 679016 695056 712376 732258
56142 732258 755280 780389 806779 835546 868524 906559 949889 999310 1055904 1120177 1192069
56131 1192069 1271171 1356597 1447557 1544378 1647993 1758102 1872826 1990221 2108623 2225111
56121 2225111 2335105 2434152 2519100 2587687 2639133 2675950 2703313 2725239 2742133 2752252 2753767
56110 2753767 2744758 2723313 2689214 2644547 2591776 2532358 2467635 2399072 2326344 2246764 2157961
56099 2157961 2060150 1955197 1845377 1734415 1628000 1531306 1446569 1373863 1312894 1262837
56089A262837m1062l3894k7343k1142j6051j2021q196m615k008j82J596K982L346
56076A104247L530M795O636P726Q262R175R956R684R327J0366J1960J2196J1457
56063A219317J1682J3023J4079J4823J6330J8126J8731J8387J8459J8745J8166
56052A399868J7397J7839J8789J8657J8147J9017K0569K0802K0116K0434K1429
56041A613064K1400K0968K2113K4351K5707K6679K9180L2324L3636L3718L5312
56030A918452L8268M0026M0498M1914M4237M5534M6431M9240N2982N4390N3720
56019B425692N4384N7005N9055O0349O3328O7780P0870P2588P5734Q0332Q3743
56008C170860Q6413R1474R8539J04012J07831J13462J20976J26895J31340J38289
$$ plain form
56089 1262837 1221775 1187881 1160538 1139396 1123345 1111324 1103128 1098513 1096505 1096323 1097919 1100901 1104247
56076 1104247 1107777 1112572 1119208 1126934 1135196 1144371 1154327 1164011 1173338 1183704 1195664 1207860 1219317
56063 1219317 1230999 1244022 1258101 1272924 1289254 1307380 1326111 1344498 1362957 1381702 1399868
56052 1399868 1417265 1435104 1453893 1472550 1490697 1509714 1530283 1551085 1571201 1591635 1613064
56041 1613064 1634464 1655432 1677545 1701896 1727603 1754282 1783462 1815786 1849422 1883140 1918452
56030 1918452 1956720 1996746 2037244 2079158 2123395 2168929 2215360 2264600 2317582 2371972 2425692
56019 2425692 2480076 2537081 2596136 2656485 2719813 2787593 2858463 2931051 3006785 3087117 3170860
56008 3170860 3257273 3348747 3447286 3551298 3659129 3772591 3893567 4020462 4151802 4290091
55998D290091J48074J56820J64151J74020J86858J98635K08927K22032K38692
55989E988300K54784K69720K87877L10080L32329L54702L82417M16198M51070
55980I047477M86870N29968N82078O38014O97496P68194Q53699R49978J057740
55971A5611514J186640J343087J526554J743193K011074K347207K761858L268705
55963C1799832L884046M611174N445661O407141P548782Q921695J0536917J2354550
55955I1509798J4271788J6104059J7618706J8641136J9143305J9226847J9033851
55948B15549490J8669535J8157884J7420186J6293179J4561127J1918070P905049
55941C20474520K064724n588069j4152564k2016797k7628800l0242613l0070638
$$ plain form
55998 4290091 4438165 4594985 4759136 4933156 5120014 5318649 5527576 5749608 5988300
55989 5988300 6243084 6512804 6800681 7110761 7443090 7797792 8180209 8596407 9047477
55980 9047477 9534347 10064315 10646393 11284407 11981903 12750097 13603796 14553774 15611514
55971 15611514 16798154 18141241 19667795 21410988 23422062 25769269 28531127 31799832
55963 31799832 35683878 40295052 45740713 52147854 59696636 68618331 79155248 91509798
55955 91509798 105781586 121885645 139504351 158145487 177288792 196515639 215549490
55948 215549490 234219025 252376909 269797095 286090274 300651401 312569471 320474520
55941 320474520 322539244 316951175 302798611 280781814 253153014 222910401 192839763
55934A92839763k7900718k4634452k1026713j7589871j4577524j2046066r963754
55927F5100665q279437o927741n832573m935220m203863l610367l118915k703461
55919B5489088k355648k067334j821542j606618j423100j269646j135840j014706
55911A2794654r09243q20678p41913o68072o02600n47685m98656m52578m12947
55902G140282l81167l52290l23508k98403k78660k59781k39076k20067k04865
55893D582465j89778j72518j56635j44496j32548j17755j02563q9378p5922o0168
55883C340704m4637l1963k0896j0048j009N342J1013J6536J8997J7060J3232Q392
55871C322723j187j8132l9538o1198q2184j02405j19683j32455j41822j48132
$$ plain form
55934 192839763 164939045 140304593 119277880 101688009 87110485 75064419 65100665
55927 65100665 56821228 49893487 44060914 39125694 34921831 31311464 28192549 25489088
55919 25489088 23133440 21066106 19244564 17637946 16214846 14945200 13809360 12794654
55911 12794654 11885411 11064733 10322820 9654748 9052148 8504463 8005807 7553229 7140282
55902 7140282 6759115 6406825 6083317 5784914 5506254 5246473 5007397 4787330 4582465
55893 4582465 4392687 4220169 4063534 3919038 3786490 3668735 3566172 3476794 3400872 3340704
55883 3340704 3296067 3264104 3243208 3233160 3232151 3237493 3248506 3265042 3284039 3301099 3314331 3322723
55871 3322723 3321536 3303404 3263866 3202668 3120484 3018079 2898396 2765941 2624119 2475987
55861B475987j48899j42832j32634j21380j09262r6181q4119p4466o6080n8207
55851A441927n2234m8467m4555l9368l5167l3655l3014l1265k9348k8454k7340
55840A039060k4944k2826k2392k2203k0574j8396j7033j5856j4208j3407j4295
55829H32926j5122j4215j2705j2280j2347j1767j1342j2103j2957j2493j1502
55818F94093j1409j1621j0770r273q479q337p820o798n817m907l963l306k749
55805E98844j281J261L520M543M953N363N283M581M257M685M786M034L402L312
55791F51543K559N98j197j900k739m822p037q004q375r464j0948j1775j1996j2182
55777E64261j2199j2077j2774j4653j6270j6174j4701j2795j0361p219m346k661
$$ plain form
55861 2475987 2327088 2184256 2051622 1930242 1820980 1724799 1640680 1566214 1500134 1441927
55851 1441927 1389693 1341226 1296671 1257303 1222136 1188481 1155467 1124202 1094854 1066400 1039060
55840 1039060 1014116 991290 968898 946695 926121 907725 890692 874836 860628 847221 832926
55829 832926 817804 803589 790884 778604 766257 754490 743148 731045 718088 705595 694093
55818 694093 682684 671063 660293 651020 642541 634204 626384 619586 613769 608862 604899 601593 598844
55805 598844 597563 598824 602344 606887 611840 617203 622486 627067 631324 636009 640795 644829 648231 651543
55791 651543 654102 654700 653503 651603 648864 644042 637005 629001 620626 611162 600214 588439 576443 564261
55777 564261 552062 539985 527211 512558 496288 480114 465413 452618 442257 435038 430692 428031
55765D28031j611l39O52L31j285l408n501p080p547p106o805p018p005o525o436
55750C61348p033p400p155p121p504p270o252n890o641o790n209l348k819k912
55736B78004k286j420j353j559j082n63j122k261k760k745l086l563l427k972
55722B47805l047l538l767l710l608l161k218j414j040l05J219K535K718K335
55708B30804K212K098J683J602K101K071Q04o37j216j709l107m683n320n447n910
55693B15346o208n626m900m854m659l356j873j491j513o17N67O26Q0M41J312J028
55677A84303k83q46k55Q7m77j104j412k075l150l672l257k510j748p54J47L47
55661A63341K30O42J211Q69PK97K149M037M684M496M401M578M784M842M456L393
$$ plain form
55765 428031 426420 426081 426733 427064 425779 422371 416870 409790 402243 395137 388332 381314 374309 367784 361348
55750 361348 354315 346915 339760 332639 325135 317865 311613 305723 299082 292292 287083 283735 280916 278004
55736 278004 275718 274298 272945 271386 270304 269741 268619 266358 263598 260853 257767 254204 250777 247805
55722 247805 244758 241220 237453 233743 230135 226974 224756 223342 222302 221997 223216 225751 228469 230804
55708 230804 233016 235114 236797 238399 240500 242571 243375 242738 241522 239813 236706 232023 226703 221256 215346
55693 215346 209138 203512 198612 193758 189099 185743 183870 182379 180866 180249 180816 181442 181522 181963 183275 184303
55677 184303 184020 183174 182919 183006 182529 181425 180013 177938 174788 171116 167859 165349 163601 162847 162994 163341
55661 163341 163571 164213 165424 166293 166300 166597 168746 172783 177467 181963 186364 190942 195726 200568 205024 208417
55645B08417K009Q77M5n56n33J27K08j341l560m587m305m316n426o700p110o675
55629A66574n739m454l221k525k212j796j396j329j196m72L13K95j97k02J06j82
55613A42367q79r45m73o98j874k830k868k542k260j648o85n2K3M7J44j48o98p74
55595A23207l63k53n46m72P1K06l71q67p61m54j67M81J433K015K152K479K993
55578A30783K926K347K411L534M730N304N775O503O826O376N930O046O082N425
55564B00998M584M100L353J490j240l890n864o907o919o466o646p730q629q374
55550A51860p299o200n213m238l562l276k888k196j832k179k588k426k055j988
55536A03920j832j107l54l86q87q21R6J140J609J341N15m37r34p85m47l51l20
$$ plain form
55645 208417 210426 211303 211348 210792 210259 210386 210594 209253 205693 201106 196801 192485 187059 180359 173249 166574
55629 166574 160835 156381 153160 150635 148423 146627 145231 143902 142706 142234 142547 142842 142645 142443 142549 142367
55613 142367 141488 140543 140070 139372 137498 134668 131800 129258 126998 125350 124665 124613 124636 124683 124827 124679 123981 123207
55595 123207 122844 122591 122045 121573 121644 121850 121479 120612 119851 119397 119230 119711 121144 123159 125311 127790 130783
55578 130783 133709 136056 138467 142001 146731 152035 157810 164313 171139 177515 183445 189491 195573 200998
55564 200998 205582 209682 213035 214525 213285 209395 203531 196624 189705 183239 176593 168863 160234 151860
55550 151860 144561 138361 133148 128910 125348 122072 119184 116988 115156 112977 110389 107963 105908 103920
55536 103920 102088 100981 100627 100241 99354 98533 98629 99769 101378 102719 103234 102797 101863 101078 100631 100280 99960
55519I9960l1M19P73J031J222J240J184J318J446J056L11K4K69Q8q80j582j246
55502A06602p34j115j875j884j342j237j469j138m57o47j762k228j033Q99K098
55487I2678K277J995J513P91M8l95n52n66m35l51q08j824k431j734k66M91k7q38
55469H9566r04m98m74p57m84M84J153P93r2o32p70r27j018o47j6K34J9j42o2o5
55449H4761j63J48R69J650J705J466J408J432J261J038R83Q23J60q03j389j260
55433I4189p65m87o32q55o30J00P63Q19M88M11O56O28L1o24o92j32O37J224J360
55414I6489R66L91J98M88P45N61J51q3j47l13o45r52r84o36q7J99l6m68o37o71
55394I4529r56j236p55M69J391J220L35m94j021j299j221q25n61n68k79O87J655
$$ plain form
55519 99960 99929 100348 101121 102152 103374 104614 105798 107116 108562 109618 109929 109953 110222 110310 109430 107848 106602
55502 106602 105868 104753 102878 100994 99652 98415 96946 95808 95351 94704 92942 90714 89681 90580 92678
55487 92678 94955 96950 98463 99254 99302 98907 98355 97789 97354 97003 96195 94371 91940 90206 89940 90431 90404 89566
55469 89566 88662 88164 87690 86933 86449 86933 88086 88879 88787 88155 87385 86458 85440 84793 84777 85011 85030 84888 84826 84761
55449 84761 84598 84746 85715 87365 89070 90536 91944 93376 94637 95675 96658 97481 97641 96838 95449 94189
55433 94189 93424 92937 92305 91450 90820 90920 91683 92502 92990 93401 94057 94685 94716 94092 93400 93268 93905 95129 96489
55414 96489 97455 97846 98044 98532 99277 99838 99989 99906 99759 99446 98801 97849 96865 96229 96142 96341 96305 95837 95200 94529
55394 94529 93573 92337 91582 92051 93442 94662 94997 94503 93482 92183 90962 90137 89576 89008 88729 89416 91071
55377I1071J627O03n13j096j209j003m34L51Q64P65K08l81p12p26m88o1M86R42
55359I0294J008O72L64M05M87J14n61r46r77j125j331q74M25J608J736J041M20
55342I2760K42K38J14j99o41r36p84l78l06o39p47l46p3m38r04p19r3K19Q1j38
55322H6313l90q18j004l30R49J788J625Q84J88l35q43j354j697j561o80O36J402
55305H4773Q82m52j414j467j093q38o56k44M47J207J731J700J072L08j2J86N02
55288H6632O45O54N78M15L42O00J097J396J224P48L04J12K40O19J058J413J651
55271I9728J667J255M40l84q82j082j061p21j48K67M48Q67J595J709M94j178j753
55254A01261j075m65p24j202j131p18l43K56J204J682R44l34p27J8O50J30j100
$$ plain form
55377 91071 92698 93301 92788 91692 90483 89480 89046 89397 90261 91026 91234 90853 90141 89415 88927 88866 89352 90294
55359 90294 91302 91974 92338 92743 93230 93344 92783 91837 90860 89735 88404 87530 87955 89563 91299 92340 92760
55342 92760 93002 93240 93354 93155 92514 91578 90794 90416 90110 89471 88724 88378 88305 87867 86963 86244 86151 86370 86451 86313
55322 86313 85923 85105 84101 83771 84720 86508 88133 89017 89205 88870 88027 86673 84976 83415 82735 83371 84773
55305 84773 85655 85203 83789 82322 81229 80391 79735 79491 79938 81145 82876 84576 85648 85956 85944 86130 86632
55288 86632 87277 87931 88509 88924 89266 89866 90963 92359 93583 94331 94635 94747 94987 95606 96664 98077 99728
55271 99728 101395 102650 103090 102706 101824 100742 99681 98960 98812 99079 99527 100394 101989 103698 104192 103014 101261
55254 101261 100186 99721 98997 97795 96664 95946 95603 95859 97063 98745 99689 99355 98628 98646 99296 99426 98326
55237I8326j823j484n26K83N21J64n13j055j036m28K72M83J59j70j14J02J06Q3
55219I3350M90J088R24l72j780j981j011r8O7J73J037K199K477J635P05N75R42
55202A00420R57M03k76p45j038j146r42n51l83n36n43J03J267K206K238J323R0
55185A02847p40r87j003j076j028o76l07l11n32n03k12q9k65l84k68j56r2L65
55167I4583J443K588K947K241R48q1j59P05J624J631P68l7k84m06p11o78J13J018
55149A08253J079L91j58k25l19p89j284j362j082p86o74p60r06q39m27J3Nm44
55131I9686p18l24M98J040R53N90N15P55P92L11l44p09q94j296j765j682q89L3
55113I6552O01R70J406J756J714J237M74k81m61L42J550J895Q82n94j436j465
$$ plain form
55237 98326 96503 95019 94493 94776 95297 95461 94948 93893 92857 92429 92701 93184 93343 93173 93059 93161 93267 93350
55219 93350 93840 94928 95852 95480 93700 91719 90708 90610 90677 90850 91887 94086 96563 98198 98903 99478 100420
55202 100420 101377 101780 101504 100759 99721 98575 97633 97082 96699 96163 95620 95723 96990 99196 101434 102757 102847
55185 102847 102107 101120 100117 99041 98013 97337 97030 96719 96187 95684 95472 95383 95118 94734 94466 94310 94218 94583
55167 94583 96026 98614 101561 103802 104750 104669 104510 105215 106839 108470 109238 109201 108917 108511 107800 107122 107235 108253
55149 108253 109332 109723 109565 109340 109021 108232 106948 105586 104504 103718 103044 102284 101378 100539 100112 100125 100130 99686
55131 99686 98968 98644 99142 100182 101135 101725 102240 102995 103787 104098 103754 103045 102151 100855 99090 97408 96519 96552
55113 96552 97153 98123 99529 101285 102999 104236 104710 104429 103968 104310 105860 107755 108637 108043 106607 105142
55097A05142r74o1R87J424R54L58L95O79M50q3k41j33l53p29n83k5J31k62m91
55078A06585k31J0j49m67p73j258j836k010j614j018m00M74J515K126J991J438
55062A04383P99Q7n29n91l6N97Q89R41Q71N90J69j81n96j347k016j749n71N46
55044A02256J116J679K434K524J473L04J28M59J41o57p78o8L28j48o89n70l04
55027A09628o17j104p54N10J669J865J171J27q87j579j521n61O97J284Q60O1l47
55010A10502k96k08k45k20j19k02m99n95j73M90Q47P56O18Q13J188J236P62K05
54992A14860J31N23Q44P87N57L84K04K8Q8K47j60j320k283j967n82O99J206J181
54974A15427R14M21pJ39P77J187J049Q21Q50Q19M55J04J22K21o0n66o98k37L64
$$ plain form
55097 105142 104168 104107 105094 106518 107472 107830 108225 108904 109354 109271 109030 108897 108544 107815 107232 107207 107338 107076 106585
55078 106585 106354 106364 106215 105748 104975 103717 101881 99871 98257 97239 96839 97313 98828 100954 102945 104383
55062 104383 105182 105269 104740 104149 104113 104710 105599 106540 107411 108001 108170 107989 107393 106046 104030 102281 101710 102256
55044 102256 103372 105051 107485 110009 111482 111786 111914 112373 112514 111857 111079 111011 111339 111191 110502 109932 109628
55027 109628 109011 107907 107153 107663 109332 111197 112368 112495 111608 110029 108508 107947 108644 109928 110788 110849 110502
55010 110502 110206 109998 109753 109533 109414 109212 108713 108118 107945 108435 109282 110038 110656 111469 112657 113893 114655 114860
54992 114860 114991 115514 116358 117145 117702 118086 118290 118318 118406 118653 118493 117173 114890 112923 112341 113040 114246 115427
54974 115427 116341 116762 116755 116894 117671 118858 119907 120728 121578 122397 122852 122956 123078 123299 123239 122673 121975 121738 122102
54955A22102M48k26j170j498p82M17J220J460J569J627J226L53l66n70o09p93
54939A24408q18l39L98Q69Q37L63k47l90M18J778K662K640K258J997J677J272
54923A39783J402K411L639M345M671M966M865L992L061L175M179M718L927K223
54909A91357M38j102k431l486m144m430m570m880n461n876n468m275l190k834
54895A39648k734k123j139n46n72p92q96q35l81O72J872K413K138J647J414J437
54879A41223J773K637L823M645M732M435M252M294M444M565M398L674K528J428
54865A92851N58l27j334k252l100m263n733o655o217m749l445l066l206k990k208
54850A43864j575j814k660l046k425j459j149j559j942j922j826j851j630r28
$$ plain form
54955 122102 122550 122324 121154 119656 118874 119291 120511 121971 123540 125167 126393 126746 126380 125810 125201 124408
54939 124408 123590 123251 123649 124518 125355 125718 125471 125081 125499 127277 129939 132579 134837 136834 138511 139783
54923 139783 141185 143596 147235 151580 156251 161217 166082 170074 173135 176310 180489 185207 189134 191357
54909 191357 191795 190693 188262 184776 180632 176202 171632 166752 161291 155415 149947 145672 142482 139648
54895 139648 136914 134791 133652 133106 132534 131742 130846 130011 129630 130302 132174 134587 136725 138372 139786 141223
54879 141223 142996 145633 149456 154101 158833 163268 167520 171814 176258 180823 185221 188895 191423 192851
54865 192851 193409 193082 191748 189496 186396 182133 176400 169745 163528 158779 155334 152268 149062 146072 143864
54850 143864 142289 140475 137815 134769 132344 130885 129736 128177 126235 124313 122487 120636 119006 118078
54836A18078j52K81N51R56J234R82M65L33O01N93K3n31n29k87l81o38m09K68N43
54817A21981j2p39q28l77qJ80N38R81J005O20M68Q19J114Q71M21L16N71Q67J075
54798A29863J066N60l41r20p48m34o48q93j76J276K049J430L10j87o3j0j95k43
54780A31696K8M10P15R10R27P49O15Q42J469K224K844L212L332L365L668M493
54764A61499N577O255O161N666N429N521N295M266K807J636P95l32k013l721m916
54749A99925n708o353o588o027m939m001l404k845k270k062k316k517k188j445
54735A47262o97r6M08P77Q90P71O21O86J100J752K318K561K603K724K942L055
54719A69677L073L299L829M248M015L069J880R29K67m40j428k576l644m589n391
$$ plain form
54836 118078 117926 118207 118758 119714 120948 121930 122395 122728 123329 123922 123945 123414 122885 122598 122217 121579 121170 121438 121981
54817 121981 121969 121230 120402 120025 120017 120197 120735 121716 122721 123341 123809 124628 125742 126613 127034 127350 127921 128788 129863
54798 129863 130929 131489 131148 130228 129480 129046 128398 127505 127329 128605 130654 132084 132394 132207 132144 132134 131939 131696
54780 131696 131724 132134 132849 133759 134686 135435 136050 136892 138361 140585 143429 146641 149973 153338 157006 161499
54764 161499 167076 173331 179492 185158 190587 196108 201403 205669 208476 210112 210907 210575 208562 204841 199925
54749 199925 194217 187864 181276 175249 170310 166309 162905 160060 157790 155728 153412 150895 148707 147262
54735 147262 146565 146469 146877 147654 148544 149315 149936 150622 151722 153474 155792 158353 160956 163680 166622 169677
54719 169677 172750 176049 179878 184126 188141 191210 193090 194019 194286 193846 192418 189842 186198 181609 176218
54704A76218n740n338m548m093l943l219j645l44m57j485k010j688j422j633j600
54689A37053q47n5M4k04j43Nm04j169j399q15r1J98K71N00O59K92l90n78O3P46
54669A33736M07q97j904j634n83kl17q22q72o08m02k28L8J89R7J63Q19J734K047
54650A30961J411M19j49j47l4j69m07l89j47j11m74p23k61O18R40L47l06o4P97
54631A32112J148M90m98r73q59o03m12j46K50O03P91Q88R89J038R63P60M23p3
54613A36891n79p39l84J45K93q5o64j110j258r00J13J351J928J505P85N73O96
54596A38561M72j09m02j87N2O7K51P86J080N39m42r15n21K68R26J335J489J257
54578A44507O81J93K02N41N89L2o99q76l38L22M34j1l95j26Q21J843K140J437
$$ plain form
54704 176218 170478 165140 160592 156499 152556 149337 147692 147348 146891 145406 143396 141708 140286 138653 137053
54689 137053 136206 136151 136195 135991 135848 135853 135449 134280 132881 132066 131975 132173 132444 132944 133603 133895 133505 132927 132990 133736
54669 133736 134143 133246 131342 129708 129125 129123 128806 127984 127112 126504 126102 125874 125912 126101 126198 126361 127180 128914 130961
54650 130961 132372 132791 132642 132495 132461 132292 131885 131496 131349 131238 130764 130041 129780 130398 131338 131685 131379 131315 132112
54631 132112 133260 133750 133252 132279 131420 130817 130405 130259 130509 131112 131903 132791 133780 134818 135781 136541 136964 136891
54613 136891 136312 135573 135189 135334 135627 135542 134878 133768 132510 131610 131723 133074 135002 136507 137292 137865 138561
54596 138561 139033 138924 138522 138335 138387 138454 138705 139491 140571 141110 140668 139753 139232 139500 140426 141761 143250 144507
54578 144507 145188 145381 145583 146124 146713 146745 146046 145170 144832 145154 145588 145577 145182 145056 145877 147720 149860 151297
54560A51297L23k91j69R2nj78P4O12Q88P27M60L60M54P49J145J223O49j76m24
54541A57810J99J188J911K122J821J220Q50J137J741J847J267O97O91R15P75K73
54525A76464j00n6K28L36J4n64r04p97o58q46r44l40O37J039O62K38O5m09j321
54506A72744j776j163k19M2k84m60l52k76j30L75R13Q73K83k94o35q56q01j65
54488A67819P94J437J531J275P48J8l83Q0J006J415J076P85J142J772K005J722
54472A84242J317J227J716K676L492L496K733J924J605J691J876K003J961J680
54458B13639J328J091P42o7j031j287n25N28R62N78k85j292k116k308j656n55
54442B07746L07N36K02l39p12p94q70j272j839k005j509p09j42l2l11p54j003
$$ plain form
54560 151297 151620 151329 151160 151252 151247 151069 151143 151755 152643 153370 153830 154190 154644 155393 156538 157761 158410 158234 157810
54541 157810 158009 159197 161108 163230 165051 166271 167121 168258 169999 171846 173113 173810 174501 175416 176191 176464
54525 176464 176364 176308 176536 176872 176886 176322 175418 174621 173963 173117 172173 171833 172470 173509 174171 174409 174474 174065 172744
54506 172744 170968 169805 169586 169628 169344 168884 168532 168256 168126 168501 169414 170287 170570 170276 169641 168785 167984 167819
54488 167819 168613 170050 171581 172856 173604 173622 173239 173319 174325 175740 176816 177601 178743 180515 182520 184242
54472 184242 185559 186786 188502 191178 194670 198166 200899 202823 204428 206119 207995 209998 211959 213639
54458 213639 214967 216058 216800 216733 215702 214415 213890 214418 215380 215958 215673 214381 212265 209957 208301 207746
54442 207746 208053 208589 208791 208452 207740 206946 206076 204804 202965 200960 199451 198742 198600 198568 198257 197503 196500
54425A96500q50o10q17j383j556r95l15k91q06j119q47k29L81Q23J004Q36M38
54408A90164J39J72L65K16o52j886k432j571L7R05M61l10k19O41J300J336J179
54391A89845J212J277J130Q30N31L01K76N89J040J115N17n27j518k030j856j099
54375A91633k53J53J21J01L36N61M79J99o2l27o05n73j1O56P46K91N6M08P20K32
54355A94861p86j352j116q08j217k135k659k309j557j205j489j907j892j507j288
54340A71634j410j335n81M33Q32N31L29O27P47K2j079j575j364j104j001o20O6
54323A65152L75j3m72l66J14M65O58Q36P19j6j033j625j555j071l54M67R72Q34
54305A64087M63N52J005J012L48j78Q0O74P84L61k9j23j07l5J60J87m62j614k282
$$ plain form
54425 196500 195650 195040 194223 192840 191284 190289 189974 189683 188877 187758 186911 186682 187063 187886 188890 189726 190164
54408 190164 190303 190475 190840 191056 190404 188518 186086 184515 184552 185457 185918 185608 185389 186030 187330 188666 189845
54391 189845 191057 192334 193464 194294 194825 195126 195402 195991 197031 198146 198663 198136 196618 194588 192732 191633
54375 191633 191380 191533 191654 191755 192091 192652 193131 193330 193268 192941 192336 191763 191752 192408 193154 193445 193501 193909 194629 194861
54355 194861 194075 192723 191607 190799 189582 187447 184788 182479 180922 179717 178228 176321 174429 172922 171634
54340 171634 170224 168889 168308 168741 169573 170104 170433 171060 171807 171829 170750 169175 167811 166707 165706 165086 165152
54323 165152 165527 165514 165042 164676 164790 165255 165913 166749 167468 167452 166419 164794 163239 162168 161814 162281 163253 164087
54305 164087 164550 165102 166107 167119 167467 167289 167369 168043 168827 169188 169159 169036 168929 168894 169054 169241 168779 167165 164883
54286A64883j728m61K95O1l85J2J266K323K235J095k57j181j594j589j194n65
54270A63216j3L04M95N22J23o65j232j098n87l76n72p14n80m20m08m57n70q63
54252A56105j086o88L68J350J585J141N04M6N1O08J142O53r09k105j626j17N79
54235A57601j79j133r90o4M08m3o95o73L8O39M18m18r35n66K11N98N03M10M42
54216A55572L18L0r1p3k51m59j04P28J099N73q3j55j24p68j699j785q34R9J29
54197A52122m80q95p25k11L11Q16J448K058K089J204m0o86n52l90o68r19o73k97
54179A53512l31n64n55m78p35j022p18M1N40M99K29q7m39n46j87J79J0k47K51
54160A49352J118R78m53j722j585n54K00N10Q87J245J040L63n1J65O51R57J029
$$ plain form
54286 164883 163155 162694 162989 163050 162665 162677 163943 166266 168501 169596 169339 168158 166564 164975 163781 163216
54270 163216 163203 163507 164002 164524 164647 163982 162750 161652 161065 160689 160117 159403 158823 158403 157995 157538 156968 156105
54252 156105 155019 154331 154699 156049 157634 158775 159279 159325 159376 159984 161126 161779 160870 158765 157139 157022 157601
54235 157601 157422 156289 155299 155235 155643 155600 154905 154232 154270 154909 155327 154909 153974 153408 153619 154217 154720 155130 155572
54216 155572 155890 155920 155829 155756 155505 155046 154942 155670 156769 157342 157259 157104 156980 156212 154513 152728 151894 151993 152122
54197 152122 151642 150747 150022 149811 150122 150938 152386 154444 156533 157737 157697 157011 156459 156069 155401 154482 153809 153512
54179 153512 153181 152617 152062 151584 150849 149827 149109 149150 149690 150189 150418 150331 149892 149346 149159 149338 149348 149101 149352
54160 149352 150470 151448 150995 149273 147688 147134 147334 147844 148731 149976 151016 151379 151328 151493 152144 153101 154130
54143A54130R83Q51O43M17K18P4j0q0j54q3K98P89Q90L91l37p32n36M4M64J68
54123A58428q25j742j841j333r75q51l62N52J008M89k43j67O40J293J320R55N62
54106A56908L18L43N88P30N37J83q3l17o23p98o20k32J15L78N39M38J48J50O20
54087A59322J029Q62L49j3k49n63o08P0J124J668J375O62r3p58j005m66N92J380
54069A64678J472J102N54n3m11j57M66P58N60M89R13J356J232O60J47r0j56j72
54051A73348k33l89m35n0O63J180J274J359J835K472K815K804K682K545K372K263
54035A96505K326K509K825L433M181M446L933L357L696M764N186M061K151J002
54021B44375J196J934K261K104J908J727J233N04J74N29R61O59l25j223j550j533
$$ plain form
54143 154130 155113 155964 156607 157024 157242 157316 157306 157226 157072 156989 157287 158076 158966 159357 159020 158288 157752 157796 158260 158428
54123 158428 157603 155861 154020 152687 151712 150861 150499 151051 152059 152548 152305 152138 152778 154071 155391 156346 156908
54106 156908 157226 157569 158157 158887 159424 159607 159524 159207 158584 157786 157166 156934 157049 157427 157966 158404 158552 158702 159322
54087 159322 160351 161213 161562 161549 161300 160737 160129 160199 161323 162991 164366 165028 164935 164177 163172 162706 163298 164678
54069 164678 166150 167252 167806 167753 167342 167185 167651 168409 168969 169458 170371 171727 172959 173619 173766 173676 173520 173348
54051 173348 173115 172726 172291 172241 172904 174084 175358 176717 178552 181024 183839 186643 189325 191870 194242 196505
54035 196505 198831 201340 204165 207598 211779 216225 220158 223515 227211 231975 237161 241222 243373 244375
54021 244375 245571 247505 249766 251870 253778 255505 256738 257242 257416 257945 258906 259565 259240 258017 256467 254934
54005B54934j574j756j989k292k732l286l886m360m386l692k454j225n06n04j202
53990B19090k261k989k785j828r17n63n73o21p09q72q59n14j51k37p58j262j374
53973A99817j088o05q6M45J018J467J407P01q8j22P79J924K594K707K603K614
53957B16087L042M105N550O758P422P802Q118Q214Q129Q320Q783Q635P291N597
53943C13853M787M645L679J199j798m070n490o573p281p091n880m179k622j499
53929B81680q60p28j118j861k448k258j147L02J325J748J927K090K148K166K472
53914B85438L171L935M470M795M943M794M457M361M695N033M854M169L387K757
53900C45259K308K032J799J298L66p52j766k690l510l849l474k904k918l457l663
$$ plain form
54005 254934 253360 251604 249615 247323 244591 241305 237419 233059 228673 224981 222527 221302 220796 220292 219090
53990 219090 216829 213840 211055 209227 208310 207747 207174 206553 205844 204972 204113 203599 203448 203211 202453 201191 199817
53973 199817 198729 198124 198038 198483 199501 200968 202375 203076 202988 202866 203645 205569 208163 210870 213473 216087
53957 216087 219129 223234 228784 235542 242964 250766 258884 267098 275227 283547 292330 300965 308256 313853
53943 313853 318640 323285 326964 328163 326365 322295 316805 310232 302951 295860 289980 285801 283179 281680
53929 281680 280820 280092 278974 277113 274665 272407 271260 271562 272887 274635 276562 278652 280800 282966 285438
53914 285438 288609 292544 297014 301809 306752 311546 316003 320364 325059 330092 334946 339115 342502 345259
53900 345259 347567 349599 351398 352696 353062 352310 350544 347854 344344 340495 337021 334117 331199 327742 324079
53885C24079l156k680l128m352n364n512n044m523m130l688l202k997l265l673
53871B69365l621k941k030j332r59q67j063j377j420j133j044j546k138k094j639
53856B44161j767k787l803l880l047j912q78k04k28r02j508j480j163j143j227
53841B18232q20j54j36r23j462q94K99R20M29p34j815k279j943j059j84L02M66
53824B08245M58J81m14r45j000o99m56k49K96J112J538J182N39L50O79R89R81
53807B12787R12J111J523J845J914J840J885K248K845L304L382L343L743M671
53793B47353N547N728N179M285L367K614K257K345K466K177J677J566J901K066
53779B90528J747J460J767K420K763K644K407K188J792J147M12k72p49p39k16
$$ plain form
53885 324079 320923 318243 315115 310763 305399 299887 294843 290320 286190 282502 279300 276303 273038 269365
53871 269365 265744 262803 260773 259441 258482 257615 256552 255175 253755 252622 251578 250032 247894 245800 244161
53856 244161 242394 239607 235804 231924 228877 226965 226087 225883 225655 224753 223245 221765 220602 219459 218232
53841 218232 217412 217258 217122 216199 214737 213843 214142 215062 215491 214757 212942 210663 208720 207661 207477 207779 208245
53824 208245 208703 208884 208470 207525 206525 205826 205370 205121 205417 206529 208067 209249 209788 210138 210817 211806 212787
53807 212787 213699 214810 216333 218178 220092 221932 223817 226065 228910 232214 235596 238939 242682 247353
53793 247353 252900 258628 263807 268092 271459 274073 276330 278675 281141 283318 284995 286561 288462 290528
53779 290528 292275 293735 295502 297922 300685 303329 305736 307924 309716 310863 311275 311003 310254 309515 309299
53764C09299J83k97j569k938m222n884p926r402r546q753p835o846n387l734k790
53749B32353k837l095k745j905j266j175j434j742j875j601q03J91P65P04M67
53734B14002N41P27M26l63q42l76O79J437J478J056N34Q6j64j62q2j42k69k38
53716B18328p4J30N55J310J837J437M65J42Q70J567J264O15R92K495L832M083
53700B39848L722L737M356M943M847M087L301L035L110K841K010J292J390K020
53686B84539K176J306k13j639k517k797k711k634k770l001l122l100k930k445
53672B58142j639r18o24n01j27L30L83J26J49N21N39k20j222j739j815j975k309
53655B47101k372j860r88j57M06O54O35N11M87N78M74r8r29j384j132n62k73k31
$$ plain form
53764 309299 309482 309185 307616 304678 300456 294572 286646 277244 267698 258945 251110 244264 238877 235143 232353
53749 232353 229516 226421 223676 221771 220505 219330 217896 216154 214279 212678 211875 212066 212831 213535 214002
53734 214002 214543 215270 215696 215333 214491 214115 214794 216231 217709 218765 219299 219385 219221 219059 218977 218835 218566 218328
53716 218328 218254 218384 218939 220249 222086 223523 223988 224130 225000 226567 227831 228446 229438 231933 235765 239848
53700 239848 243570 247307 251663 256606 261453 265540 268841 271876 274986 277827 279837 281129 282519 284539
53686 284539 286715 288021 287808 286169 283652 280855 278144 275510 272740 269739 266617 263517 260587 258142
53672 258142 256503 255585 254961 254460 254333 254663 255046 255172 255321 255842 256381 256161 254939 253200 251385 249410 247101
53655 247101 244729 242869 241881 241724 242130 242784 243419 243930 244417 244995 245469 245371 244442 243058 241926 241364 241091 240860
53637B40860N9O49R41O52L09M44P87Q33P80J171J857K079J588J011R46J253J445
53620B57664J357J257J482K106K797L087K932K788K899K917K503J946J555J070
53606B88360L67K74J525L198L502K201Q88N88M64m28j371j119J47J133J222Q44
53590C01795L85k12q58j186j122r64q63p77q35j174j514j426j021q34j027j270
53574B87097j444j852k499k744k004n68O63J094Q66M86K76K09J22o8l46o47q21
53557B77820o37%Q83J701K371K935L222K994K420K045K138K410K550K702L175
53542C08729L943M644M962M915M851N221O083O877P013O599O235O226O491P192
53528C89981Q638J0423J1559J1769J1959J2837J3853J4173J4010J4221J4954J5649
$$ plain form
53637 240860 240919 241568 242509 243161 243470 243914 244701 245534 246314 247485 249342 251421 253009 254020 254966 256219 257664
53620 257664 259021 260278 261760 263866 266663 269750 272682 275470 278369 281286 283789 285735 287290 288360
53606 288360 288727 289001 290526 293724 297226 299427 300315 300903 301367 300939 299568 298449 298596 299729 300951 301795
53590 301795 302180 301968 301110 299924 298802 297838 296975 296198 295363 294189 292675 291249 290228 289394 288367 287097
53574 287097 285653 283801 281302 278558 276554 275986 276649 277743 278609 279095 279371 279580 279702 279634 279288 278641 277820
53557 277820 277183 277183 278066 279767 282138 285073 288295 291289 293709 295754 297892 300302 302852 305554 308729
53542 308729 312672 317316 322278 327193 332044 337265 343348 350225 357238 363837 370072 376298 382789 389981
53528 389981 398619 409042 420601 432370 444329 457166 471019 485192 499202 513423 528377 544026
53516E44026J6111J6778J7891J9036J9665J9658J9391J9460K0212K1272K1815
53505G55315K1563K1182K1389K2039K2543K2672K2457K1731K0504J9427J9124
53494I89946J9218J8759J7479J6055J5177J4943J5095J5221J4809J3648J2137
53483A162487J0849R954R437R412R674R336P732N432L549K296R65q69k965n088
53469A232201p120q696r646j0654j2437j4452j5510j5640j6085j7329j8504j9099
53457A067029j9807k1047k1921k1636k0892k0850k1410k1582k0957j9939j8847
53446H38141j7690j6587j5668j4730j3501j2001j0321q430o594n348m622l487
53434G09162j482M78J374J700K797M919P051Q536R781J1239J2717J4016J5436
$$ plain form
53516 544026 560137 576915 594806 613842 633507 653165 672556 692016 712228 733500 755315
53505 755315 776878 798060 819449 841488 864031 886703 909160 930891 951395 970822 989946
53494 989946 1009164 1027923 1045402 1061457 1076634 1091577 1106672 1121893 1136702 1150350 1162487
53483 1162487 1173336 1183290 1192727 1202139 1211813 1221149 1228881 1234313 1237862 1240158 1241123 1240254 1237289 1232201
53469 1232201 1225081 1216385 1206739 1196085 1183648 1169196 1153686 1138046 1121961 1104632 1086128 1067029
53457 1067029 1047222 1026175 1004254 982618 961726 940876 919466 897884 876927 856988 838141
53446 838141 820451 803864 788196 773466 759965 747964 737643 729213 722619 717271 712649 709162
53434 709162 707680 708158 709532 711232 714029 718948 725999 734535 744316 755555 768272 782288 797724
53421G97724J7173J8835K0009K0975K2383K4356K6289K7460K7796K7996K8922
53410A059918L0760L2878L4653L6175L7935M0018M1988M3518M4700M5721M6568
53399A494832M7205M7846M8825N0219N1621N2363N2113N1175N0028M8714M7041
53388B041982M5339M4273M3744M2641M0196L6974L3863L0681K6655K1878J7253
53377B425479J3016Q485L480j030m376p386j1450j6717k2046k6517l0296l4053
53365B296589l8134m2466m6751n0496n3166n4690n5637n6629n7664n8240n8025
53354A724691n7173n5986n4627n3184n1723n0127m8144m5842m3711m2106m0869
53343A181199l9767l8926l8395l7573l5716l2871k9735k6735k3905k1558k0123
$$ plain form
53421 797724 814897 833732 853741 874716 897099 921455 947744 975204 1003000 1030996 1059918
53410 1059918 1090678 1123556 1158209 1194384 1232319 1272337 1314325 1357843 1402543 1448264 1494832
53399 1494832 1542037 1589883 1638708 1688927 1740548 1792911 1845024 1896199 1946227 1994941 2041982
53388 2041982 2087321 2131594 2175338 2217979 2258175 2295149 2329012 2359693 2386348 2408226 2425479
53377 2425479 2438495 2446980 2450460 2449430 2445054 2437668 2426218 2409501 2387455 2360938 2330642 2296589
53365 2296589 2258455 2215989 2169238 2118742 2065576 2010886 1955249 1898620 1840956 1782716 1724691
53354 1724691 1667518 1611532 1556905 1503721 1451998 1401871 1353727 1307885 1264174 1222068 1181199
53343 1181199 1141432 1102506 1064111 1026538 990822 957951 928216 901481 877576 856018 835895
53332H35895j9206j7753j5487j3339j1974j0720q702o297m560l699l041k146j079
53319G17892L12K342M679O356O877O726O700P244Q481J0309J2220J3561J4232
53306H17931J4782J5718J7027J8511K0166K1967K3556K4479K4659K4584K4953
53295A048333K6024K7230K7655K7099K6355K6098K5862K4670K2478K0225J8472
53284A320501J6728J4397J1741R466P674N773L295M69k128m268o323q782j1620
53271A356923j4299j6368j7818j8846j9624k0472k1762k3452k5085k6581k8385
53260A124231l0419l1605l1288l0538l0883l2092l2515l1555l0445l0184l0099
53249G82608k9129k7512k6214k5438k4653k3727k3048k2657k2045k0885j9489
$$ plain form
53332 835895 816689 798936 783449 770110 758136 747416 738714 732417 727857 724158 721117 718971 717892
53319 717892 718204 720546 725225 731581 738458 745184 751884 759128 767609 777918 790138 803699 817931
53306 817931 832713 848431 865458 883969 904135 926102 949658 974137 998796 1023380 1048333
53295 1048333 1074357 1101587 1129242 1156341 1182696 1208794 1234656 1259326 1281804 1302029 1320501
53284 1320501 1337229 1351626 1363367 1372833 1380507 1386280 1389575 1390044 1387916 1383648 1377325 1368543 1356923
53271 1356923 1342624 1326256 1308438 1289592 1269968 1249496 1227734 1204282 1179197 1152616 1124231
53260 1124231 1093812 1062207 1030919 1000381 969498 937406 904891 873336 842891 812707 782608
53249 782608 753479 725967 699753 674315 649662 625935 602887 580230 558185 537300 517811
53238E17811j8418j7908j7698j7291j6439j5331j4219j2918j1125r118p618o847
53226C52881o381n968n829n888n548m680m040m121m317l954l448l547l962l802
53212B87396l077k663k898l216l208l096k989k566j792j262j406j898k119j829
53198B53377j149l33K25J86l28q52j207j583j910j729r40j40J49J36K71M67K81
53181B44921l76j111j513j394q37k81l28j078j775j566n61K90L98J79K86O83Q06
53164B36743N25L53N98P48J73q12j128l53O07O32k75j241j729j889j805j287n18
53147B29342j77m66o66j56O20P93L62J63O28J218J221N74k72r16j164r40l43K69
53129B30090M98K59j44l08q3K98M86L64J57J06J87K09O9j95n31q63j070j106j090
$$ plain form
53238 517811 499393 481485 463787 446496 430057 414726 400507 387589 376464 367346 359728 352881
53226 352881 346500 340532 334703 328815 323267 318587 314547 310426 306109 302155 298707 295160 291198 287396
53212 287396 284319 281656 278758 275542 272334 269238 266249 263683 261891 260629 259223 257325 255206 253377
53198 253377 252228 251895 252120 252306 251978 251126 249919 248336 246426 244697 243757 243617 243766 243902 244173 244640 244921
53181 244921 244545 243434 241921 240527 239690 239409 239081 238003 236228 234662 234101 234391 234789 234968 235254 235937 236743
53164 236743 237268 237621 238219 238967 239140 238328 237200 236847 237454 238086 237811 236570 234841 232952 231147 229860 229342
53147 229342 229165 228699 228033 227877 228497 229290 229652 229815 230443 231661 232882 233456 233184 232268 231104 230164 229821 230090
53129 230090 230588 230847 230703 230395 230312 230610 231096 231460 231617 231723 231910 232119 232188 231993 231462 230599 229529 228423 227333
53110B27333j054p59j7Q33J105M61p64j952k642k673k223j808j822j945j463m17
53094B10193J58m19j359j399o10k80r98j766j503n16J86L88O01Q03L35q42j695
53077B01277j391m10J54j4k87j10L76P02O73M36K67K43J37l55j108j524j224n94
53059A97248k89l48k67J21L34K0m66n44j68K64N10O43P66Q19P29N45M49O29J024
53040B02019J151N38n95j409j428j105j053j179j063q45j001j366j225m32L03
53025A91310N30O84J209J705J558R22M10J39j95n12l83Q3J34o25j601j900j313
53008A92155l64K70K28m11j171j505j248o45O2Q86J791K433K443J885J208Q09
52992A98826O81M57k05j199j978k080j678j331j302j363j292j105p66q5Q10J354
$$ plain form
53110 227333 226279 225520 225503 226336 227441 227902 227138 225186 222544 219871 217648 215840 214018 212073 210610 210193
53094 210193 210351 209932 208573 207174 206564 206284 205286 203520 202017 201501 201687 202075 202676 203479 203814 202972 201277
53077 201277 199886 199476 199630 199616 199329 199219 199595 200297 200970 201406 201673 201916 202053 201698 200590 199066 197842 197248
53059 197248 196959 196611 196344 196465 196799 196819 196353 195809 195641 195905 196415 197058 197824 198643 199372 199917 200366 200995 202019
53040 202019 203170 203708 203113 201704 200276 199171 198118 196939 195876 195031 194030 192664 191439 191007 191310
53025 191310 191840 192524 193733 195438 196996 197918 198328 198467 198272 197760 197377 197460 197594 196969 195368 193468 192155
53008 192155 191791 192061 192289 191878 190707 189202 187954 187309 187371 188257 190048 192481 194924 196809 198017 198826
52992 198826 199507 199964 199759 198560 196582 194502 192824 191493 190191 188828 187536 186431 185665 185580 186390 187744
52976A87744J228Q82R80J519J901J767J356J128J275J574J475N57q35j619j072
52961A99860K14R36N82j86o44q12r56q66k36O13R03L32n53r81p10j75j9n12j325
52942A95465j800j484m85O44J262J017N8j018j609j581j219q45o06o07q92j214
52926A85086j129m67M57J208J540J249K21j178k019j714o90K09P82J356J824J617
52910A88352P30om9R1k60q20q34l39j25n25r19o59R8P09P77L63j63l41k8K60r9
52889A86213r20j315r75n88o47n54M01J804K683K854K749K243R22o24j117m64
52873A92665l7n39q71L3J292J317K23l77K68J174J242O32J74K52O74J079J148
52856B00349P99M34N76J147J493J257P66M07J38j44k53r7l2m66j319k144k582
$$ plain form
52976 187744 188972 189854 190834 192353 194254 196021 197377 198505 199780 201354 202829 203386 202551 200932 199860
52961 199860 200074 201010 201592 201406 200762 199950 198994 198128 197892 198505 199408 199740 199187 198206 197496 197321 197302 196790 195465
52942 195465 193665 192181 191696 192340 193602 194619 194677 193659 192050 190469 189250 188405 187799 187192 186300 185086
52926 185086 183957 183490 183947 185155 186695 187944 188165 186987 184968 183254 182564 182773 183555 184911 186735 188352
52910 188352 189082 189076 189027 189118 188858 188038 187204 186865 186740 186215 185296 184637 184735 185444 186221 186584 186421 186080 186052 186312 186213
52889 186213 185293 183978 183003 182415 181768 181214 181615 183419 186102 188956 191705 193948 194870 194246 193129 192665
52873 192665 192628 192089 191218 191251 192543 193860 194083 193706 193974 195148 196390 197022 197196 197448 198122 199201 200349
52856 200349 201148 201582 202158 203305 204798 206055 206821 207228 207366 207222 206969 206872 206840 206374 205055 202911 200329
52839B00329k499j924j167p36q80j297j491j325j056r59j066j170r93m17L77J079
52823A84805J516J670J517J111O92M40K06j83m54j93M76R75J093J141J255J191
52807A97258R99J214K017K758K796K371K049J795J140Qj253k472l705m753n174
52792A97048m786l859k799j945j523j448j285p84l05l33o88o88j26L93K26n12
52776A76586j065q13J54J078J201N16k39l75J09P71J256J377J032M90M21J094
52760A83593J767J457K84o04m94J07K93j42o83q29m91O4M96P33J022J498J806
52743A89877J455N62k24n13m74l57j33J48K08J9j8M00J048J611K042K250J823
52726A99724O78l89n15PPr66j985j945r44j8J33l15q52j171j105n15M64J287J378
$$ plain form
52839 200329 197830 195906 194739 194003 193123 191826 190335 189010 187954 186995 185929 184759 183766 183349 183726 184805
52823 184805 186321 187991 189508 190619 191311 191751 191957 191774 191320 191127 191603 192578 193671 194812 196067 197258
52807 197258 198257 199471 201488 204246 207042 209413 211462 213257 214397 214405 213152 210680 206975 202222 197048
52792 197048 192262 188403 185604 183659 182136 180688 179403 178619 178314 177981 177293 176605 176479 176872 177098 176586
52776 176586 175521 174708 174862 175940 177141 177657 177418 177043 177152 177923 179179 180556 181588 182078 182499 183593
52760 183593 185360 186817 187101 186497 186003 186110 186403 186261 185578 184749 184258 184322 184818 185551 186573 188071 189877
52743 189877 191332 191894 191670 191157 190683 190326 190193 190341 190549 190568 190550 190950 191998 193609 195651 197901 199724
52726 199724 200402 200013 199498 199505 199512 198546 196561 194616 193672 193654 193787 193472 192620 191449 190344 189829 190293 191580 192958
52707A92958O21o17j810k498k444j798j056o14m24k78k67n64q85o81K1N00L10
52690A80474r9p9K66L09j72p65r78o37J68J079J525J187M67R4L05P24J001J126
52672A85995J093P57J87j77oN11R27J007Q00M65J76N8Q4J33K20N21J071J601J816
52653A97239J734J626J654J652J374R14P10R88J353J230O21Q1j44m66j240k164
52637B07162k715k796k552j964j104m10j68j6M41Q77Q13N81Q79J535J713J292
52621B03568J018J177J097L51n77j205j776k455k653j878o69L8J7l23p03r93q43
52604A93191m7R90J648J780J528Q87ln13j62N65P23J41m67n22j67J81K60rm72
52585A99532o22l7J012J728J642J030M82L60O02Q16O39J86l9J57L25J15j62j41
$$ plain form
52707 192958 193579 192962 191152 188654 186210 184412 183356 182742 182318 182040 181773 181209 180324 179643 179664 180164 180474
52690 180474 180375 180296 180562 180871 180699 179934 178956 178319 178487 179566 181091 182278 182745 182839 183144 183868 184869 185995
52672 185995 187088 187845 188032 187855 187849 188360 189287 190294 191094 191559 191735 191793 191877 192010 192230 192751 193822 195423 197239
52653 197239 198973 200599 202253 203905 205279 206193 206903 207891 209244 210474 211095 211176 211032 210566 209326 207162
52637 207162 204447 201651 199099 197135 196031 195621 195453 195437 195878 196755 197568 198149 199028 200563 202276 203568
52621 203568 204586 205763 206860 207211 206634 205429 203653 201198 198545 196667 195998 196036 196053 195730 195027 194034 193191
52604 193191 193144 194134 195782 197562 199090 199977 199974 199461 199299 199864 200587 200728 200261 199739 199572 199753 200013 200004 199532
52585 199532 198910 198873 199885 201613 203255 204285 204767 205127 205729 206545 207184 207370 207331 207488 207813 207928 207766 207625
52567B07625j39n61r48n01N60J121O82p5m46n85q57j113j099r94r98q63l41K61
52549B00729M60L21K88N04O79N78K75j9j32mK51L97L09O3k87p78j317j578j324
52530A99415o04L32J142J360P76m0n9R70K060K195J620J334J551J498P37o1l0
52513B14196P55J513J798J804J762J592J308J307J895K696K922K277J272N40J37
52498B37774k82q82j509k009k307k299k024j847k063k265j714l98P25Q54K32l30
52482B19656m03K2R33K092K716K114P07k49k2R71J959K628K924K686J928J110
52466B41772P07O46N78M21K99K25K08M96J166J627J159m8r86j162j206j853k840
52449B41209l339l086k572k275k240k293k188j593m64N98P96Q4p92j232j322j341
$$ plain form
52567 207625 207486 206925 205977 205476 206036 207157 207839 207764 207318 206733 205876 204763 203664 202670 201672 200809 200468 200729
52549 200729 201189 201510 201798 202302 202981 203559 203834 203815 203683 203679 203930 204327 204636 204699 204412 203634 202317 200739 199415
52530 199415 198811 199143 200285 201645 202421 202381 202322 203292 205352 207547 209167 210501 212052 213550 214287 214226 214196
52513 214196 214951 216464 218262 220066 221828 223420 224728 226035 227930 230626 233548 235825 237097 237637 237774
52498 237774 237492 236610 235101 233092 230785 228486 226462 224615 222552 220287 218573 218175 218900 219754 219986 219656
52482 219656 219253 219275 220208 222300 225016 227130 227837 227588 227566 228537 230496 233124 236048 238734 240662 241772
52466 241772 242479 243125 243703 244124 244423 244648 244856 245352 246518 248145 249304 249256 248270 247108 245902 244049 241209
52449 241209 237870 234784 232212 229937 227697 225404 223216 221623 221159 221757 222553 222637 221845 220613 219291 217950
52433B17950j250r55o08l78k11j07k22m66m04R4N32N29M13N77O95K77l20l01L49
52414B16194R42J281J842K571K599J628P19R39J961K746L087L523M028L921L135
52399B51116K603K997L803M069L561K679J626K64j364k913m168n101n484m904
52385B48784l383j631l88K31M75L71j55o89n94J06O73P27P92J348J935J826J236
52368B51664J026J397J696J552J335J228P60k85j169j144o10n92j331k087k245
52353B51195j893j323n77K68Q74R71O77L29J82L44O92Q20M12k77n61q7Q13J643
52335B54502K268K796L227L509L675L723L554L310L497M402N482N831N287M648
52321C09711M668N157N403N209N032N087M817L591J680R8m76k47K94J000J840
$$ plain form
52433 217950 216700 215745 215137 214759 214548 214441 214219 213753 213349 213443 213975 214504 214917 215494 216189 216466 216146 215845 216194
52414 216194 217136 218417 220259 222830 225429 227057 227776 228715 230676 233422 236509 240032 244060 247981 251116
52399 251116 253719 256716 260519 264588 268149 270828 272454 272718 271354 268441 264273 259172 253688 248784
52385 248784 245401 243770 243382 243613 244088 244459 244304 243615 243021 243127 243800 244527 245319 246667 248602 250428 251664
52368 251664 252690 254087 255783 257335 258670 259898 260658 260373 259204 258060 257450 256858 255527 253440 251195
52353 251195 249302 247979 247402 247670 248544 249515 250192 250521 250703 251047 251739 252559 252971 252694 252133 252046 252859 254502
52335 254502 256770 259566 262793 266302 269977 273700 277254 280564 284061 288463 293945 299776 305063 309711
52321 309711 314379 319536 324939 330148 335180 340267 345084 348675 350355 350453 349977 349730 350024 351024 352864
52306C52864K461K588K591L103L999M476M176L637L327K903J967R90P78J246J480
52291C92586R68J11n42q60q81o15l87p38j591k088j635o86L6O02J493K502K883
52274C91158K471J988J985K200K154J910J857K151K630L078L288L179K953K936
52260D25938L097L103K948L097L725M249M091L551L367L633L756L428L038K979
52246D74000L062K905K560K360K359K199J617Q89O30J118J898K207J826J262J024
52231E01916J053J090J332K155L321L973L622K759K315K697L532M168M270L976
52217E42179L657L517L532L719M199M846N113M672L983L754L969L977L586L358
52203E98061L672M163M411M613N049N398N144M380L611L040K612K594L323M379
$$ plain form
52306 352864 355325 357913 360504 363607 367606 372082 376258 379895 383222 386125 388092 389082 389860 391106 392586
52291 392586 393554 393665 393123 392263 391382 390767 390380 389642 388051 385963 384328 383642 383678 384280 385773 388275 391158
52274 391158 393629 395617 397602 399802 401956 403866 405723 407874 410504 413582 416870 420049 423002 425938
52260 425938 429035 432138 435086 438183 441908 446157 450248 453799 457166 460799 464555 467983 471021 474000
52246 474000 477062 479967 482527 484887 487246 489445 491062 491951 492581 493699 495597 497804 499630 500892 501916
52231 501916 502969 504059 505391 507546 510867 514840 518462 521221 523536 526233 529765 533933 538203 542179
52217 542179 545836 549353 552885 556604 560803 565649 570762 575434 579417 583171 587140 591117 594703 598061
52203 598061 601733 605896 610307 614920 619969 625367 630511 634891 638502 641542 644154 646748 650071 654450
52189F54450M694L811K500J832K011K372K267J569N88k53o82q11j079j814k846
52174F68609l703m157m407m727n055n060m522l591k631j899j467j319j364j348
52160F23359r67j46R45K122L178L656L089J772Q42J018J567J207q0r45n26M48
52144F40539Q37N82L73M05L41K59O36J386J749J315N22j09n49p84m37O03J715
52127F49383K300K637L441M853O440P853Q951R441R211Q808Q921R385R401Q746
52113G49771P930P098N706L572J435r9j313k533l301l158k698k785l185k874j627
52098G51939k41P43J633K758L816M430M667M691M384L639K652J689Q62K01m06
52083G87457j350k939m806o094o337n718m503k900j427o97n18o0Q65J410J025
$$ plain form
52189 654450 659144 662955 665455 667287 669298 671670 673937 675506 676094 675841 675159 674348 673269 671455 668609
52174 668609 664906 660749 656342 651615 646560 641500 636978 633387 630756 628857 627390 626071 624707 623359
52160 623359 622392 622246 623191 625313 628491 632147 635236 637008 637850 638868 640435 641642 641562 640617 640091 640539
52144 640539 641376 641958 642331 642736 643077 643336 643972 645358 647107 648422 648944 648835 648286 647502 647065 647668 649383
52127 649383 651683 654320 657761 662614 669054 676907 685858 695299 704510 713318 722239 731624 741025 749771
52113 749771 757701 764799 770505 774077 775512 775413 774100 771567 768266 765108 762410 759625 756440 753566 751939
52098 751939 751698 752441 754074 756832 760648 765078 769745 774436 778820 782459 785111 786800 787662 787863 787457
52083 787457 786107 783168 778362 772268 765931 760213 755710 752810 751383 750686 750168 750108 750973 752383 753408
52068G53408L32J13J92Q5L4M98J115J206R37R50J054L88j085k346k759k796l019
52051G48307l228l139l080l363l533k951j849j149j389k244l038l306k941k209
52037G10888j635j501j485r36L95K096L515M305M523M436M306M270M367M632N118
52022G47294N712O056N815N163M748N006N557N594M897M155M053M400M517M254
52008H17221M024L841L026J208r74k636l796n239p417r973j2193j3651j4447j5103
51994G43891j6083j7143j7492j6909j6255j6325j6540j5613j3372j0992r439q524
51982E69204p741p127o842o596o165n904o191o707o824o498o214o254o444o490
51968D77207o139n136l411j310O82K399L911N175O068O636P030P264P288P210
$$ plain form
52068 753408 753740 753853 754045 754130 754164 754662 755777 756983 757920 758870 759924 760312 759227 756881 754122 751326 748307
52051 748307 745079 741940 738860 735497 731964 729013 727164 726015 724626 722382 719344 716038 713097 710888
52037 710888 709253 707752 706267 705331 705726 707822 711337 715642 720165 724601 728907 733177 737544 742176 747294
52022 747294 753006 759062 764877 770040 774788 779794 785351 790945 795842 799997 804050 808450 812967 817221
52008 817221 821245 825086 828112 829320 828346 825710 821914 816675 809258 799285 787092 773441 758994 743891
51994 743891 727808 710665 693173 676264 660009 643684 627144 611531 598159 587167 577728 569204
51982 569204 561463 554336 547494 540898 534733 528829 522638 515931 509107 502609 496395 490141 483697 477207
51968 477207 471068 465932 462521 461211 461893 464292 468203 473378 479446 486082 493112 500376 507664 514874
51954E14874P146O919O185M789K866P18j206k434k833k681k141r57R95L152M817
51939E40209O036P281Q410Q793Q510Q582R536J0416R870P796N306L290J667m9
51925F35653k100m544p475j0750j3791j5932j6955j7134j6849j6281j5438j4287
51913D84117j2838j1179r485p941o576n262l905k640j650q27K49J893L917N743
51899D33616O898P320P298P162P014O662N879M709L400J961P0k439n166p516r248
51884D67620j0298j0264q684n844k811l72J544L265M671N573O310P353Q563R359
51870D75985R554R469R232Q628P595O406N180L692J844p5j835l476m945n897o111
51855E15246n675m552k466L52K861M215M745N361O244O809O739O341N865N125
$$ plain form
51954 514874 522020 528939 535124 539913 542779 543497 542291 539857 537024 534343 532202 531245 532240 535392 540209
51939 540209 546245 553526 561936 570729 579239 587821 597357 607773 617643 625439 630745 634035 635702 635653
51925 635653 633553 629009 621534 610784 596993 581061 564106 546972 530123 513842 498404 484117
51913 484117 471279 460100 450615 442674 436098 430836 426931 424291 422641 421814 422063 423956 427873 433616
51899 433616 440514 447834 455132 462294 469308 475970 481849 486558 489958 491919 491989 489550 484384 476868 467620
51884 467620 457322 447058 438374 432530 429719 429347 430891 434156 438827 444400 450710 458063 466626 475985
51870 475985 485539 495008 504240 512868 520463 526869 532049 535741 537585 537510 535675 532199 527254 521357 515246
51855 515246 509571 505019 502553 502905 505766 509981 514726 520087 526331 533140 539879 546220 552085 557210
51841E57210L806J603j894o719j1788j5447j6984j7061j6417j4928j2458r742
51829D39181p662o055m151j954l68Q0p8n3K83M97K41m54j293j879j928j379l29
51812D12699J022K243K740K344J721J789K652L444L335K394J278M14l50j334k573
51797D33818l764m602n049n224n125m590l664k694j993j558j323j403j832k259
51783C88738k291k015j831j815j603r61j36L80K77l73j117j310o07P40K133L135
51767C81344L678L995M546N674P020P710P450P030P143P223O271M503L069K235
51753D58891R87j266l750n561o802p859q441q213p642p251o552m763k240j43J202
51738C90597K538M239N661O262O533P299Q607R823J0457J0533J0359J0269J0340
$$ plain form
51841 557210 561016 562619 560725 554006 542218 526771 509787 492726 476309 461381 448923 439181
51829 439181 431519 425464 421313 419359 418991 419071 418993 418940 419223 419720 419961 419507 418214 416335 414407 413028 412699
51812 412699 413721 415964 418704 421048 422769 424558 427210 430654 433989 436383 437661 438075 437725 436391 433818
51797 433818 430054 425452 420403 415179 410054 405464 401800 399106 397113 395555 394232 392829 390997 388738
51783 388738 386447 384432 382601 380786 379183 378222 378086 378466 378743 378370 377253 375943 375336 376076 378209 381344
51767 381344 385022 389017 393563 399237 406257 413967 421417 428447 435590 442813 449084 453587 456656 458891
51753 458891 459878 458612 454862 449301 442499 434640 426199 417986 410344 403093 396541 391778 389538 389395 390597
51738 390597 393135 397374 403035 409297 415830 423129 431736 441559 452016 462549 472908 483177 493517
51725D93517J0153Q949O376K998p6j981k449j673j60J256J648M67k069n104p615
51710E04237q868q593o954m501k119q00j104k711m460n148m452l124k072j303
51696D48028q6J722L071K855J370m0o57r86j596k136j895p76P62K217L023K495
51680D57371N18j905l445l693l128k096m68J670L739N357O733Q168R436R999R587
51665D97843Q425P070O096N698N459M789L675K707K204J649K33k245n324q482
51651E29797j1369j3515j4296j3470j1491r054o459l736j235K86L75p21k493m664
51637D37955o955q744r562r735r932j0126r701q556p380o566n703m500l473l081
51623C33941k777j806m85J62q6l97r0N72R64Q35L27k57n45l21K35P57J078J102
$$ plain form
51725 493517 503670 512619 518995 521993 521917 519936 517487 515814 515654 516910 518558 519025 516956 511852 504237
51710 504237 495369 486776 479822 475321 473202 472402 471298 468587 464127 458979 454527 451403 449331 448028
51696 448028 447942 449664 452735 455590 456960 456920 456263 455277 453681 451545 449650 448874 449636 451853 454876 457371
51680 457371 457889 455984 452539 448846 445718 443622 443154 444824 448563 453920 460653 468821 478257 488256 497843
51665 497843 506268 513338 519434 525132 530591 535380 539055 541762 543966 545615 545848 543603 538279 529797
51651 529797 518428 504913 490617 477147 465656 456602 450143 446407 445172 445458 445833 445112 442619 437955
51637 437955 431000 422256 412694 402959 393027 382901 373200 364644 357264 350698 344995 340495 337022 333941
51623 333941 331164 329358 328873 329035 328949 328552 328462 329034 329998 330833 331160 330903 330358 330037 330272 331029 332107 333209
51605C33209N52n90j548j421l53N49N82J81J44P41J804L064M134M652M756N001
51589C55457N593O165O502O927P639Q179P966P022N751M437L339K954L674N302
51575D36907P314R381J1421J3391J5308J7357J9635K1967K4118K5940K7185K7664
51563F57588K7872K8891L1144L3578L4704L4185L2837L1415L0118K9140K8794
51552A000266K8816K8188K6019K2200J6958J0153J456q870j9669k9476l7322m3092
51540I95627m7170m9758n0651m9671m7139m3717l9818l5519l0978k6668k3060
51529E51478k0216j7807j5466j3062j0677q511o791n762n482n540n207m144k933
51516D29880k499l008l713l918l677l324k899k395k133k300k501k280j962k247
$$ plain form
51605 333209 333761 333171 331623 330202 329849 330398 330980 331161 331305 332046 333850 336914 341048 345700 350456 355457
51589 355457 361050 367215 373717 380644 388283 396462 404428 411450 417201 421638 424977 427931 431605 436907
51575 436907 444221 453602 465023 478414 493722 511079 530714 552681 576799 602739 629924 657588
51563 657588 685460 714351 745495 779073 813777 847962 880799 912214 942332 971472 1000266
51552 1000266 1029082 1057270 1083289 1105489 1122447 1132600 1134056 1125186 1105517 1076041 1038719 995627
51540 995627 948457 898699 848048 798377 751238 707521 667703 632184 601206 574538 551478
51529 551478 531262 513455 497989 484927 474250 465739 458948 453186 447704 442164 436957 432813 429880
51516 429880 427381 424373 420660 416742 413065 409741 406842 404447 402314 400014 397513 395233 393271 391024
51502C91024l114l748l677l327l266l403l291k873k466k256k120j949j799j673
51488C52062j330m90P52J820K151J783J303J125J078P95K19m49j111j750k252
51473C55706k553k779k973k826k074r99j60K34L21J39l08p24q04p60r72j204q48
51456C36416L8P28J014J498K431L111L091L118M094N564O287O003N780O542P988
51441C93703R135R412R044Q773R277J0556J1785J1996J0832Q597N811L127J232
51428E03280K47n66j853l164l737m098n750r003j2175j3530j3069j1783r999p564
51414D07236n039l378k524j442K83J848K543K698K844K730J926R17P41J624K686
51399D15693L034K667K184K084K541L529M864O272P538Q536R142R383R715J0895
$$ plain form
51502 391024 387910 384162 380485 377158 373892 370489 367198 364325 361859 359603 357483 355534 353735 352062
51488 352062 350732 350242 350994 352814 354965 356748 358051 359176 360254 361049 361268 360819 359708 357958 355706
51473 355706 353153 350374 347401 344575 342501 341502 341342 341576 341897 342036 341728 341004 340200 339440 338468 337264 336416
51456 336416 336454 337182 338196 339694 342125 345236 348327 351445 355539 361103 367390 373393 379173 385715 393703
51441 393703 402838 412250 421294 430067 439344 449900 461685 473681 484513 493110 498921 502048 503280
51428 503280 503527 502961 501108 497944 494207 490109 484359 475356 463181 449651 436582 424799 414800 407236
51414 407236 402197 398819 396295 394853 395136 396984 399527 402225 405069 407799 409725 410642 411383 413007 415693
51399 415693 418727 421394 423578 425662 428203 431732 436596 442868 450406 458942 468084 477467 487182 498077
51385D98077J3233J6198J9044K1683K4679K8361L2343L6026L9255M2276M5196
51374H16371M7730M9369M9662M8429M5877M2298L7556L0999K2224J1757O14j0640
51362A192246k1901l2695m1950m8833n3380n5993n6805n5926n3811n0890m7106
51351F72956m2373l7292l2759k8873k4868k0333j5968j2904j1508j1086j0628
51340D24364r751q947q825r154q933p659o048n030m471l626k541k020k203k247
51326C42909j672j070j021j222j226j251j568j705j145k17M06O75Q41O88Jn85
51310C32838k63O16R73O78P03J449K059J790J163J090J516J641J151N72N24R71
51294C49471J323J062K84n04j127k011l395m659m919m148l019j899o91L51N75
$$ plain form
51385 498077 511310 527508 546552 568235 592914 621275 653618 689644 728899 771175 816371
51374 816371 864101 913470 963132 1011561 1057438 1099736 1137292 1168291 1190515 1202272 1202886 1192246
51362 1192246 1170345 1137650 1095700 1046867 993487 937494 880689 824763 770952 720062 672956
51351 672956 630583 593291 560532 531659 506791 486458 470490 457586 446078 434992 424364
51340 424364 414613 405666 396841 387687 378754 371095 365047 360017 355546 351920 349379 347359 345156 342909
51326 342909 341237 340167 339146 337924 336698 335447 333879 332174 331029 330812 331218 331893 332734 333422 333423 332838
51310 332838 332575 333191 334164 334842 335545 336994 339053 340843 342006 343096 344612 346253 347404 347976 348500 349471
51294 349471 350794 351856 352140 351636 350509 348498 345103 340444 335525 331377 328358 326459 325768 326119 326694
51279C26694kl99J57J274K004J961J497J126J070J164J052P68R13J850K845K833
51263C46807J993J596K124K577K134J545K011L406M388L981K339K94j321k141
51249C71733k459k803l207l366l471m031m654m182k539j333j692k575k373j259
51235C31789o17q46j219j468j942k310j706k46Q72J030P74O16M61M62J175K358
51219C29183K777J788K98l83O2J050J892K087J624J272J844K928L266K574J955
51204C54217K051K089J451R68J574K646K925K435K198K516K797K827K906K791
51190C86391J761Kj164r51j44K9n78j227j507j700k071k324j938q96J19L11m60
51173C73653j566k346k722k997l259l250k721j665k91R92J642J364M63k90k60
$$ plain form
51279 326694 326692 326293 326450 327724 329728 331689 333186 334312 335382 336546 337598 338366 339279 341129 343974 346807
51263 346807 348800 350396 352520 355097 357231 358776 360787 364193 368581 372562 374901 375195 373874 371733
51249 371733 369274 366471 363264 359898 356427 352396 347742 343560 341021 339688 337996 335421 333048 331789
51235 331789 331172 330326 329107 327639 325697 323387 321681 321435 322307 323337 324111 324727 325188 325650 326825 329183
51219 329183 331960 333748 334046 333663 333725 334775 336667 338754 340378 341650 343494 346422 349688 352262 354217
51204 354217 356268 358357 359808 360776 362350 364996 367921 370356 372554 375070 377867 380694 383600 386391
51190 386391 388152 388154 386990 386039 385895 385924 385346 384119 382612 380912 378841 376517 374579 373683 373802 374113 373653
51173 373653 372087 369741 367019 364022 360763 357513 354792 353127 352836 353828 355470 356834 357297 357007 356747
51158C56747O07J763K495K472J978J461Q96j04j506k621k889k539k176j967j670
51143C52947j223r07r02j053j120j127j357k031k933l369k786j470k93K63N58
51128C33197J121J950K724L230L333K901K170J823K270L154L911M424M653M164
51114C75025K745J265R68J892K728K479J599J224J727K465K698K294J659J204
51100D01972J036J123J520K153K484J865M20q89j412j619k254l146l547l375l331
51085C93000l752m112l851l115k391j861j412r32m51n2J75L01N96J215J918K367
51069C77643K571K752K983L301L931M890N615N584N159N130N564N850N850O070
51055D42893O609O831O429N933N704N276M192K940K370K741L823N438P248Q545
$$ plain form
51158 356747 357354 359117 361612 364084 366062 367523 368419 368315 366809 364188 361299 358760 356584 354617 352947
51143 352947 351724 350817 349915 348862 347742 346615 345258 343227 340294 336925 334139 332669 332376 332639 333197
51128 333197 334318 336268 338992 342222 345555 348456 350626 352449 354719 357873 361784 366208 370861 375025
51114 375025 377770 379035 380003 381895 384623 387102 388701 389925 391652 394117 396815 399109 400768 401972
51100 401972 403008 404131 405651 407804 410288 412153 412573 411684 410272 408653 406399 403253 399706 396331 393000
51085 393000 389248 385136 381285 378170 375779 373918 372506 371574 371123 371071 371246 371547 372143 373358 375276 377643
51069 377643 380214 382966 385949 389250 393181 398071 403686 409270 414429 419559 425123 430973 436823 442893
51055 442893 449502 456333 462762 468695 474399 479675 483867 486807 489177 491918 495741 501179 508427 516972
51041E16972Q905Q737Q587Q302P443O182N063M108K867J272k42j385k294l175
51027E71342m212n711p807j0084j1898j2979j3276j2555j0749q570o944n838m392
51014D56327k349n00M94J038J802K686L138L163L342L947M591M781M465L991L688
50999D94604L661L811L953L891L477K702J878J501J769K335K756L061L608M454
50985E37461N234N718O174P025Q311R598J0326J0348J0109J0152J0365J0024Q848
50972F49693P486O454N122K524j060m273o387p847r081r809r897r820r715q908
50958E94482p091n135l877k860j190R62K878M754P343J0356J2546J3588J4652
50945F41408J6687J9174K1014K1921K2309K2453K2418K2454K2851K3453K3612
$$ plain form
51041 516972 525877 534614 543201 551503 558946 565128 570191 574299 577166 578438 578196 576811 574517 571342
51027 571342 567130 561419 553612 543528 531630 518651 505375 492820 482071 473501 466557 460719 456327
51014 456327 453978 453478 453972 455010 456812 459498 462636 465799 469141 473088 477679 482460 486925 490916 494604
50999 494604 498265 502076 506029 509920 513397 516099 517977 519478 521247 523582 526338 529399 533007 537461
50985 537461 542695 548413 554587 561612 569923 579521 589847 600195 610304 620456 630821 640845 649693
50972 649693 657179 663633 668755 671279 670219 665946 659559 651712 642631 632822 622925 613105 603390 594482
50958 594482 587391 582256 578379 575519 574329 575291 578169 582923 590266 600622 613168 626756 641408
50945 641408 658095 677269 698283 720204 742513 764966 787384 809838 832689 856142 879754
50934H79754K2590K0019J6186J1826P364K541k690p229r713j0276j0526j1482
50922I08364j2610j3311j4155j5773j7396j7737j6844j5968j5812j5924j5791
50911G37043j5469j5024j4226j3083j2010j1226j0430r424q509q020p818p502
50899F04302o843n836m671l777l651m291n015n019m111k856k018j810j712j197
50885E51495o21r70k432l789l709k329r21k41l2N0n7k00J32R46J429R71k4p39
50867E38959q57m97L11J528K824L796M333M501M331L994L871M154M641N109N537
50852E86535N827N818N872O760Q520J0022J0314R878R863J0504J1198J1836J2978
50839G05925J4730J6400J7521J8390J9303J9964K0109K0143K0647K1626K2706
$$ plain form
50934 879754 902344 922363 938549 950375 957739 960280 957590 950361 940648 930372 919846 908364
50922 908364 895754 882443 868288 852515 835119 817382 800538 784570 768758 752834 737043
50911 737043 721574 706550 692324 679241 667231 656005 645575 636151 627642 619622 611804 604302
50899 604302 597459 591623 586952 583175 579524 575233 570218 565199 561088 558232 556214 554404 552692 551495
50885 551495 550874 549904 547472 543683 539974 537645 536724 536483 536451 536501 536444 536244 536376 537322 538751 539722 539698 538959
50867 538959 538102 537605 537916 539444 542268 546064 550397 554898 559229 563223 567094 571248 575889 580998 586535
50852 586535 592362 598180 604052 610812 619332 629354 639668 649546 659409 669913 681111 692947 705925
50839 705925 720655 737055 754576 772966 792269 812233 832342 852485 873132 894758 917464
50828I17464K3856K5371K7258K9095L0615L2072L3807L5624L6893L7335L7359
50817A266749L7312L6669L4543L1032K7303K3949J9977J4152O911J6n566j0484
50805A482563j5571k0550k4666k7752l0018l1206l0787k8915k6523k4298k2014
50794A200263j9085j5478j1737q299n063j833J156L434M938O096P191Q040Q498
50781A178121Q860R369R607Q879P105M858K577K15k355n007p587j0089j2489j4676
50767A177388j6651j8567k0491k2354k4142k5824k7167k7881k7995k7749k7173
50756I11394k6132k4737k3283k1735j9732j7232j4675j2463j0554q739o904n047
50744G20161l320k036j156N2K201M715O318O719O962P864R079J0087J1100J2299
$$ plain form
50828 917464 941320 966691 993949 1023044 1053659 1085731 1119538 1155162 1192055 1229390 1266749
50817 1266749 1304061 1340730 1375273 1406305 1433608 1457557 1477534 1491686 1498597 1498613 1493047 1482563
50805 1482563 1466992 1446442 1421776 1394024 1364006 1332800 1302013 1273098 1246575 1222277 1200263
50794 1200263 1181178 1165700 1153963 1145664 1140601 1138768 1139924 1143358 1148296 1154392 1161583 1169623 1178121
50781 1178121 1186981 1196350 1205957 1214836 1221941 1226799 1229376 1229591 1227236 1222229 1214642 1204553 1192064 1177388
50767 1177388 1160737 1142170 1121679 1099325 1075183 1049359 1022192 994311 966316 938567 911394
50756 911394 885262 860525 837242 815507 795775 778543 763868 751405 740851 732112 725208 720161
50744 720161 716841 714805 713649 713701 715902 720617 726935 733654 740616 748480 757559 767646 778746 791045
50730G91045J3016J2653J1772J1401J1660J1984J2260J2734J3072J2599J1478
50719I25674J0662J0631J0895J0948J0868J0853J0828J0695J0415R755Q605P658
50707A048487P969R632J1563J2935J4122J5844J8004J9915K1182K1889K2216K2310
50695A246068K2283K1936K0797J8760J6419J4402J2671J0873R133Q021P749P853
50683A416965P748P412P458Q513J0471J2418J3535J4016J4717J6013J7509J8971
50671A565746K0830K3489K6672K9950L3313L6655L9219M0254L9954L9082L7876
50660A933040L6047L3642L1167K8862K6600K4536K3180K2616K2302K1833K1323
50649B225148K0850K0189J9451J9353K0330K1858K3231K4644K6824K9735L2402
$$ plain form
50730 791045 804061 816714 828486 839887 851547 863531 875791 888525 901597 914196 925674
50719 925674 936336 946967 957862 968810 979678 990531 1001359 1012054 1022469 1032224 1040829 1048487
50707 1048487 1056456 1066088 1077651 1090586 1104708 1120552 1138556 1158471 1179653 1201542 1223758 1246068
50695 1246068 1268351 1290287 1311084 1329844 1346263 1360665 1373336 1384209 1393342 1401363 1409112 1416965
50683 1416965 1424713 1432125 1439583 1448096 1458567 1470985 1484520 1498536 1513253 1529266 1546775 1565746
50671 1565746 1586576 1610065 1636737 1666687 1700000 1736655 1775874 1816128 1856082 1895164 1933040
50660 1933040 1969087 2002729 2033896 2062758 2089358 2113894 2137074 2159690 2181992 2203825 2225148
50649 2225148 2245998 2266187 2285638 2304991 2325321 2347179 2370410 2395054 2421878 2451613 2484015
50638B484015L4101L5137L6194L7275L7684L6858L4796L1718K7596K2267J5854
50627B833495Q863J873m744j0844j6447k1623k6160k9392l0922l1658l3599l7901
50615B600941m3425m7671m8915m6869m1784l4098k5146j7058j1311p941o586p534
50603B262603j1058j6472k2716k9445l6699m3863m9948n4770n8855o2168o3925
50592A812684o3827o2610o0935n8559n5035n0690m6269m2067l7870l3527k9055
50581A272240k4429j9721j5224j1121p136k945J219M698P166Q915J0477J2216
50569A236355J4165J6001J7155J7266J6608J5818J5237J4664J3806J2727J1851
50558A401653J1650J2436J4290J7069K0524K4519K9061L4092L9241M3883M7537
$$ plain form
50638 2484015 2518116 2553253 2589447 2626722 2664406 2701264 2736060 2767778 2795374 2817641 2833495
50627 2833495 2842358 2844231 2839487 2828643 2812196 2790573 2764413 2735021 2704099 2672441 2638842 2600941
50615 2600941 2557516 2509845 2460930 2414061 2372277 2338179 2313033 2295975 2284664 2276723 2270137 2262603
50603 2262603 2251545 2235073 2212357 2182912 2146213 2102350 2052402 1997632 1938777 1876609 1812684
50592 1812684 1748857 1686247 1625312 1566753 1511718 1461028 1414759 1372692 1334822 1301295 1272240
50581 1272240 1247811 1228090 1212866 1201745 1194609 1191664 1192883 1197581 1204747 1213662 1224139 1236355
50569 1236355 1250520 1266521 1283676 1300942 1317550 1333368 1348605 1363269 1377075 1389802 1401653
50558 1401653 1413303 1425739 1440029 1457098 1477622 1502141 1531202 1565294 1604535 1648418 1695955
50547A695955N0259N2578N4994N7527N9814O1457O2301O2544O2746O3613O5529
50536B349317O8396P2107P6953Q3205R0384R7496J03981J10066J16081J21871
50526C289857J27040J31277J34306J35847J35945J34887J32526J28010J20540
50517D470235J10121R7260Q2211O4879M5280K3772J082k1722m3527o3775q2442
50506D683374r9209j12987j22704j28153j29673j27310j20811j10304r6474q0298
50496C555451o2982m5898l0049j5760l328O358J2331J4361J2631O913l094j6772
50484C430162l2734m9884o7592q4813r9951j11776j19870j24132j24677j22414
50474B492319j18775j14478j09205j02852r6280r0346q4814p8865p2218o5311
$$ plain form
50547 1695955 1746214 1798792 1853786 1911313 1971127 2032584 2094885 2157429 2220175 2283788 2349317
50536 2349317 2417713 2489820 2566773 2649978 2740362 2837858 2941839 3051905 3167986 3289857
50526 3289857 3416897 3548174 3682480 3818327 3954272 4089159 4221685 4349695 4470235
50517 4470235 4580356 4677616 4759827 4824706 4869986 4893758 4894840 4873118 4829591 4765816 4683374
50506 4683374 4584165 4471178 4348474 4220321 4090648 3963338 3842527 3732223 3635749 3555451
50496 3555451 3492469 3446571 3416522 3400762 3397434 3403792 3416123 3430484 3443115 3450028 3446934 3430162
50484 3430162 3397428 3347544 3279952 3195139 3095188 2983412 2863542 2739410 2614733 2492319
50474 2492319 2373544 2259066 2149861 2047009 1950729 1860383 1775569 1696704 1624486 1559175
50464A559175n8802n3243m8863m5247m1666l8008l4854l2388k9877k6787k3644
50453A125796k1106j8769j5859j2673j0315r116q276p136n912m972m047k603n96
50440A004416J550L421M879O045P200Q616J0372J2394J4612J6945J9233K1366
50428A131049K3425K5531K7618K9576L1522L3793L6624L9905M3231M6188M8714
50417A517176N1231N4204N7647O1233O4873O8694P2475P5670P8143Q0359Q2474
50406B264179Q3838Q3755Q2255P9588P5532O9758O2511N4175M4608L3620K1861
50395B955680J0329r25j2752k5509l8463n0679o1699p1069p7935q1591q2065p9784
50383B383538p5048o8186n9932n1197m2510l3917k5448j7606j1263p037m739l724
$$ plain form
50464 1559175 1500373 1447130 1398267 1353020 1311354 1273346 1238492 1206104 1176227 1149440 1125796
50453 1125796 1104690 1085921 1070062 1057389 1047074 1037958 1029682 1022546 1016634 1011662 1007615 1005012 1004416
50440 1004416 1005966 1009387 1014266 1020311 1027511 1036127 1046499 1058893 1073505 1090450 1109683 1131049
50428 1131049 1154474 1180005 1207623 1237199 1268721 1302514 1339138 1379043 1422274 1468462 1517176
50417 1517176 1568407 1622611 1680258 1741491 1806364 1875058 1947533 2023203 2101346 2181705 2264179
50406 2264179 2348017 2431772 2514027 2593615 2669147 2738905 2801416 2855591 2900199 2933819 2955680
50395 2955680 2966009 2965084 2952332 2926823 2888360 2837681 2775982 2704913 2626978 2545387 2463322 2383538
50383 2383538 2308490 2240304 2180372 2129175 2086665 2052748 2027300 2009694 1998431 1991394 1986655 1982931
50371A982931l897o066j0907j7855k5506l2937m0110m7036n3180n7889o0920o2419
50359A564209o2626o1828o0204n7699n4266n0213m6070m2059l8124l4466l1563
50348A025091k9518k7783k5783k3490k1233j9175j7211j5257j3440j1984j0922
50337H09295r922q624p192o295o288o763p153p417p738p997q064q198q454q113
50323G01077o569m506l227k887k445j352j74O78J675L169M709N836O679P245P131
50308G17039O562O725Q186R831J0353J0081J0182J0724J0759J0031R259Q788Q157
50295H36677P191O442O218O001N309M489M252M842N959P120P900Q109P965P852
50281I26326P970Q421R524J1441J3563J4890J5162J5002J4595J2796Q088K94q852
$$ plain form
50371 1982931 1979034 1972968 1962061 1944206 1918700 1885763 1845653 1798617 1745437 1687548 1626628 1564209
50359 1564209 1501583 1439755 1379551 1321852 1267586 1217373 1171303 1129244 1091120 1056654 1025091
50348 1025091 995573 967790 942007 918517 897284 878109 860898 845641 832201 820217 809295
50337 809295 799373 790749 783557 777262 770974 764211 757058 749641 741903 733906 725842 717644 709190 701077
50323 701077 694508 690002 686775 683888 681443 680091 679917 680595 682270 685439 690148 695984 702663 709908 717039
50308 717039 723601 730326 738512 748343 758696 768777 778959 789683 800442 810473 819732 828520 836677
50295 836677 843868 850310 856528 862529 867838 872327 876579 881421 887380 894500 902400 910509 918474 926326
50281 926326 934296 942717 952241 963682 977245 992135 1007297 1022299 1036894 1049690 1057778 1058072 1049220
50268A049220j6719k1330k2367k1089j9187j7535j5979j4180j2309j0820r953
50257H67752r594r411q902p666n784l761k033p50q7k11p35p19K53J387J612R97
50241H22348N21O35P63L66k31m77m86p50j365k021k612l242l759l908l912m387
50225G97483n451o443o748o500o212o089o044n984n722m946l804l174l724m901
50211G21741n479m990m064l356k822k159j297k11J198K757L984M723N455O723
50197G22203Q587J0800J3137J5310J7041J8489K0170K2194K4051K5444K6751K8265
50185I52442K9471K9742K9302K8780K8134K6680K4114K0842J7350J3824J0411
50174A211092P288M488K021P0j429l272o417j0830j5448j9351k2517k5280k7544
$$ plain form
50268 1049220 1032501 1011171 988804 967715 948528 930993 915014 900834 888525 877705 867752
50257 867752 858158 848747 839845 832179 826395 822634 820601 819851 819764 819553 818818 818099 818352 819739 821351 822348
50241 822348 822869 823504 824267 824633 824402 823925 823439 822689 821324 819303 816691 813449 809690 805782 801870 797483
50225 797483 792032 785589 778841 772341 766129 760040 753996 748012 742290 737344 733540 730366 726642 721741
50211 721741 716262 711272 707208 703852 701030 698871 697574 697363 698561 701318 705302 710025 715480 722203
50197 722203 730790 741590 754727 770037 787078 805567 825737 847931 871982 897426 924177 952442
50185 952442 981913 1011655 1040957 1069737 1097871 1124551 1148665 1169507 1186857 1200681 1211092
50174 1211092 1218380 1222868 1224889 1224959 1223530 1220258 1213841 1203011 1187563 1168212 1145695 1120415 1092871
50161A092871k8801k8600k6880k4014k0602j7049j3371r672o550m524l272j992
50149I07544n19M86M88n02k483n615r431j2629j4250j4645j4705j4564j3721j2149
50135G93305j0570r537q801p770o261m556k997j723p61j85m6j58j69L1J01l33
50119G39570j101j661j741j555j372j241j162j109q58j53P70J310J333J450K225
50104G34705L459M577N314N664N568N053M496M274M367M636N184O003O584O488
50090H06372O134O407P494Q711R521J0154J1143J2646J4476J6435J8491K0883
50078I48867K4020K7909L1762L4686L6741L8822M1445M4290M7082N0055N3108
50067A378787N5251N5628N4601N3054N1002M7734M3106L7824L2422K6842K1208
$$ plain form
50161 1092871 1064070 1035470 1008590 984576 963974 946925 933554 923882 917332 912808 909536 907544
50149 907544 907025 907511 907999 907497 905014 899399 889968 877339 863089 848444 833739 819175 805454 793305
50135 793305 782735 773198 764397 756627 750366 745810 742813 741090 740329 740144 740098 739940 739771 739802 739903 739570
50119 739570 738469 736808 735067 733512 732140 730899 729737 728628 727770 727617 728387 729697 731030 732480 734705
50104 734705 738164 742741 748055 753719 759287 764340 768836 773110 777477 782113 787297 793300 799884 806372
50090 806372 812506 818913 826407 835118 844639 854793 865936 878582 893058 909493 927984 948867
50078 948867 972887 1000796 1032558 1067244 1103985 1142807 1184252 1228542 1275624 1325679 1378787
50067 1378787 1434038 1489666 1544267 1597321 1648323 1696057 1739163 1776987 1809409 1836251 1857459
50056A857459J6159J2050Q276L845j852r056j7846k7771l7581m5919n2210n6597
50044A648957n9268o0230n9613n7749n4972n1522m7524m2940l7696l2180k7226
50033A118037k3241j9658j5748j1835r018p768p336o680n450l969k740k197k512
50020I99885l422m457n504o768q121r007r183r138r483j0262j1151j2026j2962
50007H88401j3917j4671j5061j4998j4422j3312j1659r471p069n211m344l798
49995G60468k342J64K418L370L563M191N374O159N874M680K939Q15j419l219m134
49980G88901m105l608l585m852p120r012r537r095q481p526n666l402j923j329
49966G09660m63J307L318M945O616Q871J1322J3366J5309J7962K1488K5255K8591
$$ plain form
50056 1857459 1873618 1885668 1893944 1897789 1895937 1886881 1869035 1841264 1803683 1757764 1705554 1648957
50044 1648957 1589689 1529459 1469846 1412097 1357125 1305603 1258079 1215139 1177443 1145263 1118037
50033 1118037 1094796 1075138 1059390 1047555 1038537 1030769 1023433 1016753 1011303 1007334 1004594 1002397 999885
50020 999885 996463 992006 986502 979734 971613 962606 953423 944285 934802 924540 913389 901363 888401
50007 888401 874484 859813 844752 829754 815332 802020 790361 780890 773821 768610 764266 760468
49995 760468 758126 758290 760708 764078 767641 771832 777206 783365 789239 793919 796858 797673 796254 793035 788901
49980 788901 784796 781188 777603 772751 765631 756619 747082 737987 729506 721980 716314 712912 710989 709660
49966 709660 709197 710504 713822 718767 725383 734254 745576 758942 774251 792213 813701 838956 867547
49953H67547L1266L3434L5567L8094M0844M3133M4659M5825M6816M6917M5259
49942A319361M1788L6952L0936K3850J6412R579L661j654o529j0958j5389k0599
49930A427410k6781l3301l9561m5561n1416n6653o0237o1097n8693n3512m7080
49919H93518m1036l5969l1349k6644k2072j8094j4659j1330p968m958k799j666
49907F74974j197o12P86K962N077O331O775P148Q007R279J0614J1781J2581J2729
49893G67235J2162J1246J0351R188P006L531m97l961o320p908r382j1125j3037
49880G68489j4734j6059j7253j8434j8936j7802j5206j2840j2209j2871j3062
49869E99083j1818r686p479n340l251j602o48qQ14J809K806L950N364O713P632
$$ plain form
49953 867547 898813 932247 967814 1005908 1046752 1089885 1134544 1180369 1227185 1274102 1319361
49942 1319361 1361149 1398101 1429037 1452887 1469299 1478878 1482539 1480885 1474356 1463398 1448009 1427410
49930 1427410 1400629 1367328 1327767 1282206 1230790 1174137 1113900 1052803 994110 940598 893518
49919 893518 852482 816513 785164 758520 736448 718354 703695 692365 684397 679439 676640 674974
49907 674974 673777 673165 673951 676913 681990 688321 695096 702244 710251 719530 730144 741925 754506 767235
49893 767235 779397 790643 800994 810182 817188 820719 820222 816261 809941 802033 792651 781526 768489
49880 768489 753755 737696 720443 702009 683073 665271 650065 637225 625016 612145 599083
49869 599083 587265 577579 570100 564760 561509 559907 559259 559251 560065 561874 564680 568630 573994 580707 588339
49854E88339Q290R093J0038J0843J1475J2081J2626J3001J3268J3351J2749J1009
49842G26163Q308N213K048r78l369m694n204n573o103o732p634r050j0562j1210
49828F70623j0527q989p345o010n100m415l291j129J645L787M700N154O153P663
49814F52919Q884R435R682J0180J1128J2257J2886J2395J0924R342Q209P063N160
49801G80464K599J76j671l215m751o177p433q837j0624j2430j3493j3371j2327
49788F88910j1074j0290j0246j0685j0961j0444q934o809m651k787j225q3L33
49775F01054N8k18J98J146J933K398L052M113N170O050P314R237J0954J1381J0641
$$ plain form
49854 588339 596629 605722 615760 626603 638078 650159 662785 675786 689054 702405 715154 726163
49842 726163 734471 739684 741732 740754 737385 732691 727487 721914 715811 709079 701445 692395 681833 670623
49828 670623 660096 651107 643762 637752 632652 628237 624946 623817 625462 629249 633949 639103 645256 652919
49814 652919 661803 671238 680920 691100 702228 714485 727371 739766 750690 760032 768241 775304 780464
49801 780464 783063 783239 781568 778353 773602 767425 759992 751155 740531 728101 714608 701237 688910
49788 688910 677836 667546 657300 646615 635654 625210 616276 609467 604816 602029 600804 600721 601054
49775 601054 601112 600894 601092 602238 604171 606569 609621 613734 618904 624954 632268 641505 652459 663840 674481
$$ [...]
##END NTUPLES=NMR SPECTRUM
##END=
