
##TITLE=AC1332_INDRS10071_6642420_JtaGGXs3fK
##JCAMPDX= 6.0         $$ Bruker NMR JCAMP-DX V2.0
##DATA TYPE= NMR SPECTRUM
##DATA CLASS= NTUPLES
##ORIGIN= BRUKER
##OWNER= Administrator
$$ 1.72 TOPSPIN		Version 2.1
$$ 2012-08-08 19:20:20.921 -0500  Administrator@TOPSPIN
$$ Compression mode = diff/dup
##.OBSERVE FREQUENCY= 400.02188249412
##.OBSERVE NUCLEUS= ^1H
##.ACQUISITION MODE= SIMULTANEOUS (DQD)
##.ACQUISITION SCHEME= undefined
##.AVERAGES= 8
##.DIGITISER RES= 22
##SPECTROMETER/DATA SYSTEM= spect
##.PULSE SEQUENCE= zg30
##.SOLVENT NAME= COFFEE_meoh
##.SHIFT REFERENCE= INTERNAL, COFFEE_meoh, 1, 14.98509
##AUDIT TRAIL= $$ (NUMBER, WHEN, WHO, WHERE, PROCESS, VERSION, WHAT)
$$ ##TITLE= Audit trail, TOPSPIN		Version 2.1
$$ ##JCAMPDX= 5.01
$$ ##ORIGIN= Bruker BioSpin GmbH
$$ ##OWNER= Administrator
$$ $$ C:\Bruker\TOPSPIN/data/COFFEE/nmr/AC1332_INDRS10071_6642420_JtaGGXs3fK/10/pdata/1/auditp.txt
$$ ##AUDIT TRAIL=  $$ (NUMBER, WHEN, WHO, WHERE, PROCESS, VERSION, WHAT)
(   1,<2012-08-08 19:20:13.687 -0500>,<Administrator>,<TOPSPIN>,<go>,<TOPSPIN 2.1>,
      <created by zg
	started at 2012-08-08 19:19:06.765 -0500,
	POWCHK enabled, PULCHK disabled,
       configuration hash MD5:
       6B 1B 68 BB D9 2E 58 E2 7F 35 AD 54 07 DF 0E 41
       data hash MD5: 64K
       00 6A 4F F4 04 B1 89 3D 64 87 0E AB C3 B0 B2 EC>)
(   2,<2012-08-08 19:20:16.406 -0500>,<Administrator>,<TOPSPIN>,<proc1d>,<TOPSPIN 2.1>,
      <Start of raw data processing
       efp LB = 0 FT_mod = 6 PKNL = 1 PHC0 = 0 PHC1 = 0 SI = 32K 
       data hash MD5: 32K
       CD 4F D9 CF A2 12 E1 2E 52 EA 57 A6 49 06 24 57>)
(   3,<2012-08-08 19:20:16.750 -0500>,<Administrator>,<TOPSPIN>,<proc1d>,<TOPSPIN 2.1>,
      <pk PHC0 = 175.4901 PHC1 = 0 
       data hash MD5: 32K
       23 E2 EF A0 CA 7F 7E 5E E6 C9 69 68 31 DB A5 E4>)
(   4,<2012-08-08 19:20:16.796 -0500>,<Administrator>,<TOPSPIN>,<proc1d>,<TOPSPIN 2.1>,
      <abs ABSG = 1 
       data hash MD5: 32K
       E4 D6 61 FB D9 85 F6 85 22 16 B0 87 9F 31 71 BA>)
(   5,<2012-08-08 19:20:16.828 -0500>,<Administrator>,<TOPSPIN>,<proc1d>,<TOPSPIN 2.1>,
      <abs ABSG = 2 
       data hash MD5: 32K
       87 4A 55 EF 68 2D 1E 53 52 67 FD 01 BB EF E6 B2>)
(   6,<2012-08-08 19:20:16.859 -0500>,<Administrator>,<TOPSPIN>,<proc1d>,<TOPSPIN 2.1>,
      <abs ABSG = 3 
       data hash MD5: 32K
       C2 2A 89 C7 C1 D9 1E D2 08 EE 78 6B 30 F1 E1 A7>)
(   7,<2012-08-08 19:20:16.890 -0500>,<Administrator>,<TOPSPIN>,<proc1d>,<TOPSPIN 2.1>,
      <abs ABSG = 4 
       data hash MD5: 32K
       B2 1D C8 BF 5F C1 BE 98 71 EC 30 94 8D E1 18 EA>)
(   8,<2012-08-08 19:20:16.921 -0500>,<Administrator>,<TOPSPIN>,<proc1d>,<TOPSPIN 2.1>,
      <abs ABSG = 5 
       data hash MD5: 32K
       AD 33 16 C9 79 A0 12 1A E2 90 B2 42 C3 DB AA 39>)
$$ ##END=
$$ 
$$ $$ hash MD5
$$ $$ 62 0C F0 6C F6 FF F5 6C 97 F2 EF 03 A6 75 C1 F0
##$RELAX= 
##$RELAX= 
##$RELAX= 
##$RELAX= 
##$RELAX= 
##$RELAX= 
##$RELAX= 
$$ Bruker specific parameters
$$ --------------------------
$$ [...]
##$TP= (0..7)
150 150 150 150 150 150 150 150
##$TP07= 0
##$TPNAME0= <>
##$TPNAME1= <>
##$TPNAME2= <>
##$TPNAME3= <>
##$TPNAME4= <>
##$TPNAME5= <>
##$TPNAME6= <>
##$TPNAME7= <>
##$TPOAL= (0..7)
0.5 0.5 0.5 0.5 0.5 0.5 0.5 0.5
##$TPOFFS= (0..7)
0 0 0 0 0 0 0 0
##$TUNHIN= 0
##$TUNHOUT= 0
##$TUNXOUT= 0
##$USERA1= <user>
##$USERA2= <user>
##$USERA3= <user>
##$USERA4= <user>
##$USERA5= <user>
##$V9= 5
##$VALIST= <valist>
##$VCLIST= <CCCCCCCCCCCCCCC>
##$VD= 0
##$VDLIST= <DDDDDDDDDDDDDDD>
##$VPLIST= <PPPPPPPPPPPPPPP>
##$VTLIST= <TTTTTTTTTTTTTTT>
##$WBST= 1024
##$WBSW= 4
##$XGAIN= (0..3)
0 0 0 0
##$XL= 0
##$YL= 0
##$YMAX_a= 470060
##$YMIN_a= -607417
##$ZGOPTNS= <>
##$ZL1= 120
##$ZL2= 120
##$ZL3= 120
##$ZL4= 120
##$ABSF1= 14.98509
##$ABSF2= -5.573092
##$ABSG= 5
##$ABSL= 3
##$ALPHA= 0
##$AQORDER= 0
##$ASSFAC= 0
##$ASSFACI= 0
##$ASSFACX= 0
##$ASSWID= 0
##$AUNMP= <proc_prof1d_extract_pilot.lims>
##$AXLEFT= 0
##$AXNAME= <>
##$AXNUC= <1H>
##$AXRIGHT= 0
##$AXTYPE= 0
##$AXUNIT= <>
##$AZFE= 0.1
##$AZFW= 0.1
##$BCFW= 0
##$BC_mod= 0
##$BYTORDP= 0
##$COROFFS= 0
##$CY= 15
##$DATMOD= 1
##$DC= 0
##$DFILT= <>
##$DTYPP= 0
##$F1P= 0
##$F2P= 0
##$FCOR= 0.5
##$FTSIZE= 32768
##$FT_mod= 6
##$GAMMA= 0
##$GB= 0
##$INTBC= 1
##$INTSCL= 1
##$ISEN= 128
##$LB= 0
##$LEV0= 0
##$LPBIN= 0
##$MAXI= 10000
##$MC2= 0
##$MEAN= 0
##$ME_mod= 0
##$MI= 0
##$NCOEF= 0
##$NC_proc= -8
##$NLEV= 6
##$NOISF1= 0
##$NOISF2= 0
##$NSP= 0
##$NTH_PI= 0
##$NZP= 0
##$OFFSET= 14.98509
##$PC= 1
##$PHC0= 175.4901
##$PHC1= 0
##$PH_mod= 1
##$PKNL= yes
##$PPARMOD= 0
##$PPDIAG= 0
##$PPIPTYP= 0
##$PPMPNUM= 2147483647
##$PPRESOL= 1
##$PSCAL= 4
##$PSIGN= 0
##$PYNMP= <proc.py>
##$REVERSE= no
##$SF= 400.02
##$SI= 32768
##$SIGF1= 0
##$SIGF2= 0
##$SINO= 400
##$SIOLD= 32768
##$SPECTYP= <>
##$SREGLST= <1H.CDCl3>
##$SSB= 0
##$STSI= 32768
##$STSR= 0
##$SW_p= 8223.68421052631
##$SYMM= 0
##$S_DEV= 0
##$TDeff= 65536
##$TDoff= 0
##$TI= <>
##$TILT= no
##$TM1= 0
##$TM2= 0
##$TOPLEV= 0
##$USERP1= <user>
##$USERP2= <user>
##$USERP3= <user>
##$USERP4= <user>
##$USERP5= <user>
##$WDW= 1
##$XDIM= 32768
##$YMAX_p= 457629873
##$YMIN_p= -683212
##$CURPLOT= <Network HP LaserJet P1505>
##$CURPRIN= <$Network HP LaserJet P1505>
##$DFORMAT= <normdp>
##$LAYOUT= <+/1D_H.xwp>
##$LFORMAT= <normlp>
##$PFORMAT= <normpl>
##$SURQMSG= 1
$$ End of Bruker specific parameters
$$ ---------------------------------
##NTUPLES= NMR SPECTRUM
##VAR_NAME=  FREQUENCY,     SPECTRUM/REAL,   SPECTRUM/IMAG
##SYMBOL=    X,             R,               I
##VAR_TYPE=  INDEPENDENT,   DEPENDENT,       DEPENDENT
##VAR_FORM=  AFFN,          ASDF,            ASDF
##VAR_DIM=   32768,         32768,           32768
##UNITS=     HZ,            ARBITRARY UNITS, ARBITRARY UNITS
##FACTOR=    0.250966925370066, 1,           1
##FIRST=     8223.43324360094, -295215,      -54104
##LAST=      0,             -107254,         -96001
##MIN=       0,             -683212,         0
##MAX=       8223.43324360094, 457629873,    0
$$ Real data points
##PAGE= N=1
##DATA TABLE= (X++(R..R)), XYDATA
$$ [...]
19504c67613a34970A6031J57306d02713g4165a1535j19710A43617b57448M2168
$$ -367613 -134970 16031 173337 -402713 -74165 -11535 -131245 143617 -257448 -215280
19494b15280E778L7276b11675B12735I1197L24118c20260a37136j27997G332O2040
$$ -215280 5778 43054 -211675 212735 91197 415315 -320260 -137136 -265133 7332 69372
19483F9372a55070C1725b19346B30164f2943k64229C08609c3207O064j40759E8521
$$ 69372 -155070 31725 -219346 230164 -62943 -327172 308609 -33207 -27143 -167902 58521
19471c56756a6234k65806B749a2364n8121J9658n9057e3249H9853d05245a82258
$$ -356756 -16234 -282040 2749 -12364 -70485 -50827 -109884 -53249 89853 -405245 -182258
19459e8905I1154D3027f7858J0934j87865D4776h1239J5875B64880a49652C49239
$$ -58905 91154 43027 -67858 -56924 -244789 44776 -81239 -65364 264880 -149652 349239
19447c08459P6717A24758a16499A09222D8670a43976B95140a90707i4345B33225
$$ -308459 -231742 124758 -116499 109222 48670 -143976 295140 -190707 -94345 233225
19436a21550c1852D7712K2450i4944C19589n2496b90188D5990D178c14929F8637
$$ -121550 -31852 47712 70162 -94944 319589 267093 -290188 45990 4178 -314929 68637
19424I3219b3438A29615a14198a6141m2761j03433I7496a90864A04334A4873b90828
$$ 93219 -23438 129615 -114198 -16141 -58902 -162335 97496 -190864 104334 14873 -290828
19412b77594B60563e8189j14403H3308C0558b21061A91891q8082c7162n9039C1256
$$ -277594 260563 -58189 -172592 83308 30558 -221061 191891 103809 -37162 -96201 31256
19400b44373A1919L4672M4612a42451k55604I677O410a91727n9733J13251r2339
$$ -244373 11919 46591 91203 -142451 -398055 9677 16087 -191727 -251460 -138209 -230548
19389b30548P0602E0019a18319j06812I2650N2196c754q2317E5433b72336g3462
$$ -230548 -159946 50019 -118319 -225131 92650 144846 -3754 -86071 55433 -272336 -73462
19377b40871b0121j39792A29795J98854b28093C4579a39022O2706J5260k38940
$$ -240871 -20121 -159913 129795 328649 -228093 34579 -139022 -76316 -61056 -299996
19367b99996b2248I7839a46198N9775c3162F7232J53796j07834f4284C3353b77046
$$ -299996 -22248 97839 -146198 -86423 -33162 67232 221028 113194 -64284 33353 -277046
19355a01691B9558e5264A07470J26257a17187j4089A35071n5033M5870b23182
$$ -101691 29558 -55264 107470 233727 -117187 -131276 135071 80038 125908 -223182
19344G2148M3427c42479A38414n0286J29768a55758f7214C0894a01122L9735k30063
$$ 72148 115575 -342479 138414 88128 217896 -155758 -67214 30894 -101122 -61387 -291450
19333b91450B2114N6499b8884l2764j01309f1256G3114a18438o1338m75n786H0615
$$ -291450 22114 78613 -28884 -61648 -162957 -61256 73114 -118438 -179776 -180251 -186037 80615
19320a32541A85031b8668j64716j1222l6693g0248j80007A84866i4274k5480j2023
$$ -132541 185031 -28668 -193384 -204606 -241299 -70248 -250255 184866 -94274 -119754 -131777
19309a31777A25557d20547i6628L6863A41038a83906A37392b01612K2434j46224
$$ -131777 125557 -420547 -96628 -59765 141038 -183906 137392 -201612 -179178 -325402
19299c25402b7648n46198a40451E3890a95063J2238B22909c14964f4544j33675
$$ -325402 -27648 -573846 -140451 53890 -195063 -182825 222909 -314964 -64544 -198219
19289a98219G7575a25111D1332a78154c0686A3534O2664c74069J63343H3388B9409
$$ -198219 77575 -125111 41332 -178154 -30686 13534 76198 -374069 -210726 83388 29409
19277C38679c43229k5530F3162a89844M4827O4551G604b7701B470b7101j94490
$$ 338679 -343229 -368759 63162 -189844 -145017 -80466 7604 -27701 2470 -27101 -221591
19266b21591j63641F7234k8903K6364a7748o3194j96797J22715m57D62032b32178
$$ -221591 -385232 67234 38331 64695 -17748 -80942 -277739 -155024 -155481 462032 -232178
19254b59314h3949A10705a51323K9538L6759o9875A41890c51245a55795d3281
$$ -259314 -83949 110705 -151323 -121785 -85026 -154901 141890 -351245 -155795 -43281
19243b86588A20085a103j27224C0595R812c4263o6412q258o047A42332f5881A67688
$$ -286588 120085 -1103 -128327 30595 40407 -34263 -100675 -108933 -114980 142332 -65881 167688
19230B95845A7854L01490c56557A22883a83309g2332J0539h291j16465j9463l1198
$$ 295845 17854 319344 -356557 122883 -183309 -72332 -61793 -8291 -124756 -144219 -175417
19219a75417B22124b05867E2180K46777I3785j4795a26362C4937c56783A14904
$$ -175417 222124 -205867 52180 298957 93785 78990 -126362 34937 -356783 114904
19208h3896A31801a61685m1684b4821j47765q9414J08135p1408C58254H9833N8514
$$ -83896 131801 -161685 -203369 -24821 -172586 -262000 -153865 -225273 358254 89833 148347
19197A48347g6775b334j48461B16518g9013j05537f4095A43568b04862b1852k87888
$$ 148347 -76775 -2334 -150795 216518 -79013 -184550 -64095 143568 -204862 -21852 -309740
19186c09740h3834C0307m278p861J3308b22180H6829P5486l8018G362g9958k28622
$$ -309740 -83834 30307 26029 18168 31476 -222180 86829 162315 124297 7362 -79958 -308580
19174c08580A12647h5259j23539B3703J77003a93407A30940D0276J1335A0540
$$ -308580 112647 -85259 -208798 23703 200706 -193407 130940 40276 51611 10540
19163a68286l8162A76821a10085l59438e6280j25895G7721b310r1932c7644j28397
$$ -168286 -206448 176821 -110085 -469523 -56280 -182175 77721 -2310 -94242 -37644 -166041
19152a66041N7633l4245f2602J8365o3073o9713A36269B8418Q0404d4735B66595
$$ -166041 -108408 -142653 -62602 -44237 -107310 -177023 136269 28418 108822 -44735 266595
19140d31362C8725b56806J15018e2057j43311f8552q6561g5281A41927c38268
$$ -431362 38725 -256806 -141788 -52057 -195368 -68552 -155113 -75281 141927 -338268
19129d5522k76592a3964j83911P2604j91827B2030J16566a46869j3679j24658
$$ -45522 -322114 -13964 -197875 -125271 -317098 22030 138596 -146869 -160548 -285206
19119b85206I1631F511c1719l10505g8321j84869J14918O1215j9408j04674Q0011
$$ -285206 91631 6511 -31719 -342224 -78321 -263190 -148272 -87057 -106465 -211139 -131128
19108a31128L3216A34935g2148p9208b9806k6898p4090f4937A72569I325O737
$$ -131128 -97912 134935 -72148 -151356 -29806 -56704 -130794 -64937 172569 9325 16062
19097A6062a62614p2465g7365j13919d9956j47139B34670f1675l75806a00719
$$ 16062 -162614 -235079 -77365 -191284 -49956 -197095 234670 -61675 -437481 -100719
19086B666h9520I9515H686c374D00372e9725b1533l3378o6959H5285h10q7271
$$ 2666 -89520 99515 8686 -3374 400372 -59725 -21533 -54911 -121870 85285 -810 -88081
19074h8081r927c4836k10570A94947I2242c7868B30962c81426A35433b03444A94089
$$ -88081 -98008 -34836 -245406 194947 92242 -37868 230962 -381426 135433 -203444 194089
19062B6660R1862b24045i6154A26005g9127k71229F589d9892E4979d8852C00501
$$ 26660 118522 -224045 -96154 126005 -79127 -350356 6589 -49892 54979 -48852 300501
19050B32314E3309A3583c00745G704b6967A26735l2518c17695h0457k9707j44778
$$ 232314 53309 13583 -300745 7704 -26967 126735 94217 -317695 -80457 -110164 -254942
19039b54942P006h2956B02377c31391d2999j7556j72334G2969b34925B15811a60714
$$ -254942 -247936 -82956 202377 -331391 -42999 -60555 -232889 72969 -234925 215811 -160714
19027B50323j09036g5321a9505j82762J0602j63200D5339a21906A75459g9570
$$ 250323 141287 -75321 -19505 -202267 -191665 -354865 45339 -121906 175459 -79570
19016E527a154A52647a02236j84083J39079B12684c03193G6670L22302j41546
$$ 5527 -1154 152647 -102236 -286319 -147240 212684 -303193 76670 398972 257426
19006B57426a52959I3010J5792a04343A77426a19375A78228o2814f3698C25472
$$ 257426 -152959 93010 108802 -104343 177426 -119375 178228 115414 -63698 325472
18995A88010I2305L4917a75096j13005g3956B15583a00825k70858c9521A13841
$$ 188010 92305 127222 -175096 -288101 -73956 215583 -100825 -371683 -39521 113841
18984C6589b39017K0001C4165O0460c7317j13191N5858B969H21K51346E9536b28748
$$ 36589 -239017 -219016 34165 94625 -37317 -150508 -94650 2969 821 252167 59536 -228748
18971D9503d48424h6592K4740j63718R100g0234n7530j0611D5370J24750O4343
$$ 49503 -448424 -86592 -61852 -225570 -216470 -70234 -127764 -138375 45370 170120 234463
18960B34463L33449k04077a94582B93481j22831D4582J96430d34083K08045o3532
$$ 234463 567912 363835 -194582 293481 170650 44582 241012 -434083 -226038 -289570
18950b89570a11208a527p5743D8355k1304e9156k29926e4632I9548J18799e8092
$$ -289570 -111208 -1527 -77270 48355 27051 -59156 -289082 -54632 99548 218347 -58092
18938d7574n3786C93844a35404n8748e5814A8108J29534K9068f6011A21455f3315
$$ -47574 -101360 393844 -135404 -194152 -55814 18108 147642 176710 -66011 121455 -63315
18926a80784k14446A48308c94706a43010A94633E478c85957A09519a59103d2369
$$ -180784 -395230 148308 -394706 -143010 194633 5478 -385957 109519 -159103 -42369
18915C9136c4038H4434a46763A27332b85015M6805A37650e9904H9731N9350b02587
$$ 39136 -34038 84434 -146763 127332 -285015 -238210 137650 -59904 89731 149081 -202587
18903a04822j2787B38684f0603B6713g5072B84642J23285L5287j61655j00122
$$ -104822 -117609 238684 -60603 26713 -75072 284642 407927 443214 281559 181437
18893A81437D8391i5426F184J53159i626j09292k22862M4130h4518a1182j71053
$$ 181437 48391 -95426 6184 159343 -9626 -118918 -341780 -297650 -84518 -11182 -182235
18882a82235q7431A04975a45466j84274a2119m2305k34895B99059b02852j2401
$$ -182235 -269666 104975 -145466 -329740 -12119 -54424 -289319 299059 -202852 -215253
18872b15253O4682d5580j6066j31903b6682j1876D10428D2568d21706G1049c95786
$$ -215253 -150571 -45580 -61646 -193549 -26682 -38558 410428 42568 -421706 71049 -395786
18860c23078e6454A37810n3668j590b36477Q9810A23085n408K7821D2661b28652
$$ -323078 -56454 137810 84142 82552 -236477 -146667 123085 117677 145498 42661 -228652
18848C7818J26249f2255l0412o1666A25981d6516E766J25361a63407h595E7589
$$ 37818 164067 -62255 -92667 -154333 125981 -46516 5766 131127 -163407 -8595 57589
18836a97045g9363m4833r5703O8356B137b68966H3497K6M0985k7710a82088B3614
$$ -197045 -79363 -124196 -219899 -151543 2137 -268966 83497 83523 124508 96798 -182088 23614
18823a44889q9235n8834F4134c08271B0568c23160d6425C1855c89746E1259O6838
$$ -144889 -234124 -292958 64134 -308271 20568 -323160 -46425 31855 -389746 51259 118097
18812A18097b95803D4702a79783B07575A3011O2099a65165Q673K7029J0977B723
$$ 118097 -295803 44702 -179783 207575 13011 75110 -165165 -156492 -129463 -118486 2723
18800a06119L8703E6327a6839A14891h0464k87624a28587K0578A39482a81101
$$ -106119 -67416 56327 -16839 114891 -80464 -368088 -128587 -108009 139482 -181101
18789d6378k6752j82454E535J7156g6957k30474h307B33635i414D8631A5080d8690
$$ -46378 -73130 -255584 5535 22691 -76957 -307431 -8307 233635 -9414 48631 15080 -48690
18776d3534A28653f0318k7193l10800e8181j86725N2127a9599o144k3572A51325
$$ -43534 128653 -60318 -87511 -398311 -58181 -244906 -192779 -19599 -25743 -49315 151325
18764a61735A19191g888j40368e8705A92121N9346P2716c3815G422d11989a23926
$$ -161735 119191 -7888 -148256 -58705 192121 251467 324183 -33815 7422 -411989 -123926
18752d4036o4092a8941l06903Q2672A87294c63471A68581p8148a84315c0894A81313
$$ -44036 -108128 -18941 -325844 -243172 187294 -363471 168581 90433 -184315 -30894 181313
18740A14108d94400H3455a20491b137j67615F3825P1286g8980j29611c9095k22951
$$ 114108 -494400 83455 -120491 -2137 -169752 63825 135111 -78980 -208591 -39095 -262046
18729b62046P3722k8066A2256i0506j9305c6349p9894a7255q8658D4462f2876
$$ -262046 -188324 -216390 12256 -90506 -109811 -36349 -116243 -17255 -105913 44462 -62876
18717d5803n7808A01628B7733c26241J31775j97922B440c0135F5656a89697I6517
$$ -45803 -103611 101628 27733 -326241 -194466 -392388 2440 -30135 65656 -189697 96517
18705b43366E635b62240j66924d6436j71724e656D426L1352h6592k04922A68574
$$ -243366 5635 -262240 -429164 -46436 -218160 -5656 4426 35778 -86592 -291514 168574
18693a53604d6773j21019M4221A66911o6713c7055k3438D5606a92879n3990i897
$$ -153604 -46773 -167792 -123571 166911 100198 -37055 -60493 45606 -192879 -246869 -9897
18681F5075G769d5841j20531A31897m4304a37752C17324c4409j29954M7544o6236
$$ 65075 7769 -45841 -166372 131897 87593 -137752 317324 -34409 -164363 -116819 -183055
18670a83055l1364j40237a39794N5216A8926P398a94254B5477a90720o9951l1152
$$ -183055 -214419 -354656 -139794 -84578 18926 26324 -194254 25477 -190720 -260671 -291823
18659b91823C9392a08988j46535J02719N9161r8938i1678m0117k63610c6416G8789
$$ -291823 39392 -108988 -255523 -152804 -93643 -192581 -91678 -131795 -395405 -36416 78789
18647b0009l0831r2877j54503A08888N0717K4807b55669A7834b3864h139G9808
$$ -20009 -50840 -143717 -298220 108888 159605 184412 -255669 17834 -23864 -8139 79808
18635A40613B4623b64260R4803d1665H9296C7799f0906q3890j22047O0089i5696
$$ 140613 24623 -264260 -169457 -41665 89296 37799 -60906 -144796 -266843 -206754 -95696
18623i1271j02659k9489c8226A7550a56482C1068N8643b58699B54946c30123r6340
$$ -91271 -193930 -223419 -38226 17550 -156482 31068 89711 -258699 254946 -330123 -426463
18612d26463J45835c1840B51637a59467M8814k3122d0844A49607G359c16336A94741
$$ -426463 -280628 -31840 251637 -159467 -110653 -133775 -40844 149607 7359 -316336 194741
18600a45010l1587d8638j83400H9829L0600d5888j87773O3183j81650I8285b002
$$ -145010 -176597 -48638 -232038 89829 120429 -45888 -233661 -170478 -352128 98285 -2002
18588F0381a58839I4692a98723g7238C2386f9500C0272N9342J51277A1018K92379
$$ 60381 -158839 94692 -198723 -77238 32386 -69500 30272 89614 240891 11018 303397
18577C03397F4613L4079O6045b22477c3046q4323B45050a17450B78254c8517C9449
$$ 303397 64613 98692 164737 -222477 -33046 -117369 245050 -117450 278254 -38517 39449
18565f2745m1470r6421B4780a50933C20462a54891a1872F9248d4804f780A55526
$$ -62745 -104215 -200636 24780 -150933 320462 -154891 -11872 69248 -44804 -6780 155526
18553b20282d4158H6737L9854a27207B52O5021R8648a07346j93110a32965j9577
$$ -220282 -44158 86737 126591 -127207 252 65273 163921 -107346 -300456 -132965 -152542
18542a52542J254O9591A36755g0436E3043J43182f4B10597H3666c51809a24206
$$ -152542 -151288 -81697 136755 -70436 53043 196225 -64 210597 83666 -351809 -124206
18530a45344o3256C3182a42084c7594D9592k2770J34983C2420d9643B21254b11877
$$ -145344 -208600 33182 -142084 -37594 49592 26822 161805 32420 -49643 221254 -211877
18518i6185Q39j43823j5070A17083b07905C8284a37271C872a01619j15068A32422
$$ -96185 -95346 -239169 -254239 117083 -207905 38284 -137271 3872 -101619 -216687 132422
18506a90357K4112F1828b02253G1884i547B13232b32468a0850p0691b1225p4308
$$ -190357 -166245 61828 -202253 71884 -9547 213232 -232468 -10850 -81541 -21225 -95533
18495i5533n9805F3546a15185l0915B9015J53388F00d86910F6914e6181k58601
$$ -95533 -155338 63546 -115185 -146100 29015 182403 600 -486910 66914 -56181 -314782
18484c14782d5850a7481G9858J04071q7652i6813A1794L3034J09501j4580k5854
$$ -314782 -45850 -17481 79858 183929 96277 -96813 11794 44828 154329 139749 113895
18473A13895A7819b18267J08245C2690K39005a04912n4138e993p5234C1355L860
$$ 113895 17819 -218267 -110022 32690 271695 -104912 -159050 -5993 -81227 31355 35215
18462C5215c2884k30289b7221k53374O2099i7316r9413A88668e9097b6561l26298
$$ 35215 -32884 -263173 -27221 -280595 -218496 -97316 -196729 188668 -59097 -26561 -352859
18451c52859h8765A29060c8645A1695b08493j62397a33178D1965c2139B5352J31391
$$ -352859 -88765 129060 -38645 11695 -208493 -370890 -133178 41965 -32139 25352 156743
18440A56743o7448b53148A2303K83846b40513a11640j02992e6685B64011a27071
$$ 156743 89295 -253148 12303 296149 -240513 -111640 -214632 -56685 264011 -127071
18429A60228k7588j5181k2258J4671Q6906b07650A36081a90461l1507a00943C289
$$ 160228 132640 117459 95201 109872 196778 -207650 136081 -190461 -221968 -100943 3289
18417c12564h1852j86570p4425O3839B76344o1301c4170k64453G793e5742q7188
$$ -312564 -81852 -268422 -342847 -279008 276344 215043 -34170 -298623 7793 -55742 -142930
18406a42930k3024E412J3562c6219F1029f0026k59455A81472a38880o118k50734
$$ -142930 -165954 5412 18974 -36219 61029 -60026 -319481 181472 -138880 -144998 -395732
18395c95732C39865d20784c4821B77070b9550B14809a90355Q9867j45672A43368
$$ -395732 339865 -420784 -34821 277070 -29550 214809 -190355 -100488 -246160 143368
18384a27521I3827b35641B10014J32339j43590a09337e0983A01736b41342a09779
$$ -127521 93827 -235641 210014 342353 198763 -109337 -50983 101736 -241342 -109779
18373c32131C16763b60008c1943E0525a67223b9422k24828c3650B8690J87606
$$ -332131 316763 -260008 -31943 50525 -167223 -29422 -254250 -33650 28690 216296
18363B16296b8902k7027j17431e5156J3865j50834j53891E065c8711k08088A81396
$$ 216296 -28902 -55929 -173360 -55156 -41291 -192125 -346016 5065 -38711 -246799 181396
18351a74320B56582b45759A43083d4030A30224D5085k881b27228b9765m4093j78041
$$ -174320 256582 -245759 143083 -44030 130224 45085 42204 -227228 -29765 -73858 -251899
18340b51899E0458J6676h7681A47845g8207B14501M1187a27882d6259j96742f1961
$$ -251899 50458 67134 -87681 147845 -78207 214501 255688 -127882 -46259 -243001 -61961
18328a91207A58225E6390a0542j23653A36144d3179l9097A16081m0948b23764
$$ -191207 158225 56390 -10542 -134195 136144 -43179 -82276 116081 75133 -223764
18317d0430j31296f6844k03566d0773B01781P6763j14614J25561b96447H1707
$$ -40430 -171726 -66844 -270410 -40773 201781 278544 163930 289491 -296447 81707
18306f5172B80334A3265a04643A18779L9660J94686o472b86672F7967R698b41003
$$ -65172 280334 13265 -104643 118779 158439 353125 346653 -286672 67967 77665 -241003
18294C1073h2549a003l56065J69901q1582a07444H9823J33513B0954h6502B42936
$$ 31073 -82549 -1003 -357068 -187167 -268749 -107444 89823 223336 20954 -86502 242936
18282B73012c6026R572j9756B41297b55895N8473I0389J62210a7361p2080G8277
$$ 273012 -36026 -26454 -46210 241297 -255895 -197422 90389 252599 -17361 -89441 78277
18270A70393a08689j60107R7578j05071R5842f5004m2553L3778C9953a60844j35115
$$ 170393 -108689 -268796 -171218 -276289 -180447 -65004 -107557 -73779 39953 -160844 -295959
18259b95959N6584A39289a4591o9457D5264b88575a02255j35575K5533O2226C9722
$$ -295959 -239375 139289 -14591 -84048 45264 -288575 -102255 -237830 -212297 -150071 39722
18247C28333c7603n6649A26117g8460p0150a9205C7107d8267e297n5109r236H726
$$ 328333 -37603 -94252 126117 -78460 -148610 -19205 37107 -48267 -5297 -60406 -69642 8726
18234a12925C23780G2465a51839B50386H1127n598j3498a6385A12546a60244A35409
$$ -112925 323780 72465 -151839 250386 81127 75529 62031 -16385 112546 -160244 135409
18222a57911n1999D8565D118J86722q0944L12956a00487r3188M4520J8513B57485
$$ -157911 -209910 48565 4118 190840 109896 422852 -100487 -193675 -149155 -130642 257485
18210d14392c0193l6279k58724G1183b02178M0924k8183B42616d94983g5051i830
$$ -414392 -30193 -66472 -325196 71183 -202178 -161254 -189437 242616 -494983 -75051 -9830
18198f7590l50359A61421d4245H4584N4408a09519J9274c3647q473k42388G2748
$$ -67590 -417949 161421 -44245 84584 138992 -109519 -90245 -33647 -42120 -284508 72748
18186G1947j0566J17292i1689A9843J81725a90241b2573k02756h245n2427a4794
$$ 71947 61381 178673 -91689 19843 201568 -190241 -22573 -225329 -8245 -60672 -14794
18174a00608j45700A28419E9364J00662a18376A18379b11854J00105a6518A46040
$$ -100608 -246308 128419 59364 160026 -118376 118379 -211854 -111749 -16518 146040
18163B23491i8497J6447l37433b4277m74206F9152K45540b41268P3338A831J26793
$$ 223491 -98497 -82050 -419483 -24277 -498483 69152 314692 -241268 -167930 1831 128624
18152A28624b46035B9406c6646E8464c42565B77066A08184b2435b301l2048D32511
$$ 128624 -246035 29406 -36646 58464 -342565 277066 108184 -22435 -2301 -34349 432511
18140a06521A98558a63201P4G5724J6500L0170C703d1102k89379I009b05162G6731
$$ -106521 198558 -163201 -163127 75724 92224 122394 3703 -41102 -330481 9009 -205162 76731
18127A59503m361A3434b20748F1332i046j7524o2656B78142a73059E5703B7038
$$ 159503 155142 13434 -220748 61332 -9046 -26570 -89226 278142 -173059 55703 27038
18115F9307J97704b76835B921a1168H4882b92056E0598L9283d622q8968O940j22524
$$ 69307 267011 -276835 2921 -11168 84882 -292056 50598 89881 -4622 -93590 -86650 -209174
18103b09174o2206J35270B22051D354R386a60884f6269r2102E1222i3515j3994
$$ -209174 -271380 -136110 222051 4354 13740 -160884 -66269 -158371 51222 -93515 -107509
18092a07509B62682E9644a48503B31479j04230b91720d9234B33328a19795j25902
$$ -107509 262682 59644 -148503 231479 127249 -291720 -49234 233328 -119795 -245697
18082b45697H7594j1278J7270B5268g8491m6379B65741a79679A01364B7730R9894
$$ -245697 87594 76316 93586 25268 -78491 -124870 265741 -179679 101364 27730 127624
18071A27624J23947d15257A72018l6267g035D6052e7731B7371g8229B98039F0736
$$ 127624 251571 -415257 172018 135751 -7035 46052 -57731 27371 -78229 298039 60736
18059B9044b98648I1753D1680b632A17485a40857b9664l19865F9700l1004M2668
$$ 29044 -298648 91753 41680 -2632 117485 -140857 -29664 -349529 69700 38696 81364
18048H1364K645b0447B75574a65244A45447M4466k798p8951f0578G5800c14803
$$ 81364 84009 -20447 275574 -165244 145447 189913 187115 108164 -60578 75800 -314803
18036c8819A03311j7294I376P2683h0099A43579e07232a21853C47241A0097c1858
$$ -38819 103311 86017 9376 82059 -80099 143579 -507232 -121853 347241 10097 -31858
18024C6490c11960H3732b51838A63559k8770a63900g5594n0281b4345k65221A7961
$$ 36490 -311960 83732 -251838 163559 134789 -163900 -75594 -125875 -24345 -289566 17961
18012A35892B668b87862n0685O8356f5053a4170G1472A0409J4233L3748k7910
$$ 135892 2668 -287862 -338547 -270191 -65053 -14170 71472 10409 24642 58390 30480
18001C0480Q2203A3362M31664B03649d1646k35011A12213b68895J32604m4509
$$ 30480 112683 13362 445026 203649 -41646 -276657 112213 -268895 -136291 -180800
17991a80800B83246j7249M798d6435j06692I7351a01857N0584C02267A5443h792
$$ -180800 283246 265997 270795 -46435 -153127 97351 -101857 -51273 302267 15443 -8792
17979a50974C19933b80559a34870C21538f5890J862b3101A9373N8861J0502f2541
$$ -150974 319933 -280559 -134870 321538 -65890 -64028 -23101 19373 78234 88736 -62541
17967e1992j43460F1884J8535B6835P8292J09525C6493b04720B55826k6249i5131
$$ -51992 -195452 61884 80419 26835 105127 214652 36493 -204720 255826 229577 -95131
17955b1673n874B39244a61643A64571K5543g9316J4286B38857f4480D5199P9498
$$ -21673 -27547 239244 -161643 164571 190114 -79316 -65030 238857 -64480 45199 124697
17944A24697K70183B5273K8233M8449B6361r625b42168O8332N1880K6608L3121
$$ 124697 394880 25273 53506 101955 26361 16736 -242168 -173836 -121956 -95348 -62227
17933f2227d982r9441A30341b28063M8526e8697O129A64595E8986k3684j7350
$$ -62227 -4982 -104423 130341 -228063 -179537 -58697 -52568 164595 58986 35302 17952
17922A7952L0641M3381i5168A19965b44793f4064H5682a87573A92286J8320J02997
$$ 17952 48593 91974 -95168 119965 -244793 -64064 85682 -187573 192286 210606 313603
17911C13603b28246A0426f9709A40730E7870c52846B53341G8954m2b54035J08764
$$ 313603 -228246 10426 -69709 140730 57870 -352846 253341 78954 78912 -254035 -145271
17900a45271B2746N44489B46636l671F7833c8479F8284K9441C829h0169o4232
$$ -145271 22746 567235 246636 242965 67833 -38479 68284 97725 3829 -80169 -144401
17889a44401m7437d6254B20524b5178A77777n8709c2053N551o6788A70707a53416
$$ -144401 -191838 -46254 220524 -25178 177777 119068 -32053 -26502 -93290 170707 -153416
17877b8211A16201Q7067q3150c55122G9828g3586H0537N4637c1910m4175r6863
$$ -28211 116201 203268 120118 -355122 79828 -73586 80537 135174 -31910 -76085 -172948
17866a72948B22667l9463a27195j50783J15587k45031B52694c35756B5219H054
$$ -172948 222667 183204 -127195 -277978 -162391 -407422 252694 -335756 25219 8054
17855a6171j10818A33506a15070A65344d412A65622K63575h7662A5904a58910
$$ -16171 -126989 133506 -115070 165344 -4412 165622 429197 -87662 15904 -158910
17844D1737h3332A25312D9905K80340a8695A71375j0356m1072j2259c05765J48342
$$ 41737 -83332 125312 49905 330245 -18695 171375 161019 119947 107688 -305765 -157423
17833a57423G8916a40201d5291k40324A31233a12565j06997Q0866c5401B83493
$$ -157423 78916 -140201 -45291 -285615 131233 -112565 -219562 -138696 -35401 283493
17822g891B9101g1316E17203d4046G9834C2631l190b56341n3547R1042F4829d2596
$$ -7891 29101 -71316 517203 -44046 79834 32631 29441 -256341 -309888 -218846 64829 -42596
17809A34930J94499l4835A6155J63609d5299N96q5014D0059d01628a32141A2514
$$ 134930 329429 294594 16155 179764 -45299 -44703 -129717 40059 -401628 -132141 12514
17797d0331D6241d7773B39005j12221J61730g8777F5912K07441A33984h1518O555
$$ -40331 46241 -47773 239005 126784 288514 -78777 65912 273353 133984 -81518 -74963
17786g4963a5787m2504B03140a93592a1315A31911Q4728a18619A87257a57560
$$ -74963 -15787 -58291 203140 -193592 -11315 131911 216639 -118619 187257 -157560
17775f0907G2154f1408B14219c0821B92649f3647j60373G4629c06032B24724d875
$$ -60907 72154 -61408 214219 -30821 292649 -63647 -224020 74629 -306032 224724 -4875
17763D7824J00025a334l01082F0134b29526L6666B45704D3259e8408H4994K66055
$$ 47824 147849 -1334 -302416 60134 -229526 -192860 245704 43259 -58408 84994 351049
17752C51049f8021N824B03151H7079e1009A60148F9826c7528G105J9767a97191
$$ 351049 -68021 -62197 203151 87079 -51009 160148 69826 -37528 7105 26872 -197191
17740A99173h5647j52256D960b1915B53791I5734J45091K75793a56363E5776K19814
$$ 199173 -85647 -237903 4960 -21915 253791 95734 240825 516618 -156363 55776 275590
17729B75590f8878H1283L4510J45786m0725e6975G2981b4472j67397A40396f7953
$$ 275590 -68878 81283 115793 261579 220854 -56975 72981 -24472 -191869 140396 -67953
17717A7721L23579O7069G759J88534J14815c03295g9103D120a35281o1438B27682
$$ 17721 341300 408369 7759 196293 311108 -303295 -79103 4120 -135281 -196719 227682
17705f5550H1860a83016e258B62160F8102M59647k46608d0409B21499q0136a11721
$$ -65550 81860 -183016 -5258 262160 68102 527749 281141 -40409 221499 141363 -111721
17693d414B50337b8293j12842A28804d3877B91793D725e4296k0569C142O5192
$$ -4414 250337 -28293 -141135 128804 -43877 291793 4725 -54296 -74865 3142 68334
17682F8334b92884F0086g6329F8224N20071a22600A83689a04565B14606h4929
$$ 68334 -292884 60086 -76329 68224 588295 -122600 183689 -104565 214606 -84929
17671i671j79518A88889d0817E0039J2708K56019m0714M3277a5188A18261R2672
$$ -9671 -189189 188889 -40817 50039 62747 318766 278052 321329 -15188 118261 210933
17660B10933a88174I4591C1883a11998C06327g6565D53130F0185a67448H6054
$$ 210933 -188174 94591 31883 -111998 306327 -76565 453130 60185 -167448 86054
17649c06917B58268A28093e4244B97262j41443E7258K6905g2228j8219A10197
$$ -306917 258268 128093 -54244 297262 155819 57258 84163 -72228 -90447 110197
17638B0955g0859C53741a6040H0646m0117f5399j05362C88623c00055C5500J10404
$$ 20955 -70859 353741 -16040 80646 40529 -65399 -170761 388623 -300055 35500 145904
17627A45904d4624o8368N4663C8434K78718F1595K45087A14356a34305N5196p8071
$$ 145904 -44624 -112992 -58329 38434 317152 61595 306682 114356 -134305 -79109 -157180
17616a57180D5542c4903o2329l6313K1216B05332g7334j21284C19006l4298J47353
$$ -157180 45542 -34903 -97232 -133545 -112329 205332 -77334 -198618 319006 284708 432061
17605D32061E8614f1279A62970P8260m0241q2143b83375A40263J36156A02628
$$ 432061 58614 -61279 162970 241230 200989 118846 -283375 140263 276419 102628
17594A42646l4786c8988k25893A54960a47520c3350k68302a25279M6594j83934
$$ 142646 107860 -38988 -264881 154960 -147520 -33350 -301652 -125279 -78685 -262619
17584b62619A22569J07804p5178m6604N4541d4535A99760K15828b2924B99949
$$ -262619 122569 230373 155195 108591 163132 -44535 199760 415588 -22924 299949
17573I9068m1522o228R705d4456J5280B07741a6130A1896J36232c75345A41984
$$ 99068 57546 51318 61023 -44456 -29176 207741 -16130 11896 148128 -375345 141984
17561A4909a868B96669a13955C62832j66583G1611J65476i2799B37960r0489Q676
$$ 14909 -1868 296669 -113955 362832 196249 71611 237087 -92799 237960 147471 156147
17550A56147a66691D49736B00188O6709J85999A82857b42744C35631F9715J80473
$$ 156147 -166691 449736 200188 266897 452896 182857 -242744 335631 69715 250188
17540B50188o1741j9290l9927K16514f3012B35976A05953Q5212E4808R5195L33602
$$ 250188 188447 169157 129230 345744 -63012 235976 105953 191165 54808 150003 483605
17529D83605j99538A01454j999K91915j7093j65823J51127K90453C20822J69777
$$ 483605 284067 101454 99455 391370 374277 208454 359581 650034 320822 490599
17519D90599k18527R6493J44201j40977A36256K96252q4718D3967L99925l4962
$$ 490599 272072 368565 512766 371789 136256 432508 347790 43967 443892 408930
17509D08930q8789M85994B72912L77015B86156M01375k93870A60067J8085m6237
$$ 408930 320141 806135 272912 649927 286156 687531 393661 160067 178152 131915
17499A31915J48926p0080n890j1061J64386o0813j23614J19476J886q3742J04574
$$ 131915 280841 210761 204871 193810 358196 297383 173769 293245 295131 211389 315963
17488C15963j33843K35604A4959L95172n2808j25447L4789M9893J82336B11735
$$ 315963 182120 417724 14959 410131 357323 231876 266665 316558 498894 211735
17477C98998D3878h5408F6355K65715j1254J67056b06301i884C89717l8072M5512
$$ 398998 43878 -85408 66355 332070 320816 487872 -206301 -9884 389717 351645 397157
17466C97157A24238J34695L7211J10320J4799I4858L2377J29024N1033J18633
$$ 397157 124238 258933 296144 406464 421263 94858 127235 256259 307292 425925
17456D25925k05682G4925K78812o9758J11306j46111H2925J53518r2420l6252
$$ 425925 220243 74925 353737 283979 395285 249174 82925 236443 144023 107771
17446A07771K39899L9722j32783K17705p9574p6773J56112Q519k22837L38416
$$ 107771 347670 387392 254609 472314 392740 315967 472079 480598 257761 596177
17436E96177r1443I6841J98661K3886L30045k85780j69581K95103j71370J37115
$$ 596177 504734 96841 295502 319388 649433 363653 194072 489175 317805 454920
17426D54920f8253F99365j32123A65867K36415A89722p6167D1310M94701k43368
$$ 454920 -68253 699365 567242 165867 402282 189722 113555 41310 536011 292643
17416B92643j01512p5074L35491E134L06345G2485J59243K04295n2625A44429
$$ 292643 191131 116057 451548 5134 311479 72485 231728 436023 383398 144429
17405B65051f8037A58409J8275p6692K13002J92296B09419L4544r6024F4758M0946
$$ 265051 -68037 158409 176684 99992 312994 505290 209419 243963 147939 64758 105704
17394A05704J32729j14373o165L5872R9483M3459L871m3998N2075j03804j0898
$$ 105704 238433 124060 117895 153767 253250 296709 300580 256582 308657 204853 193955
17383A93955G0963K51428j43277j7419M0579M6392J19552m5628M7860A51506A0299
$$ 193955 70963 322391 179114 161695 202274 248666 368218 322590 370450 151506 10299
17371C33621J11640J05483A66409a02463E4380J94390a01217C37363j39668J57319
$$ 333621 445261 550744 166409 -102463 54380 248770 -101217 337363 197695 355014
17361C55014B532N88f8317E46686B48891P3418j12183D3462p942K32827B5467
$$ 355014 2532 3120 -68317 546686 248891 322309 210126 43462 35520 268347 25467
17349C0321K06622O5334q1532F3626J30112K68901A43358n0383L08063j19796
$$ 30321 236943 302277 220745 63626 193738 462639 143358 92975 401038 281242
17339B81242K06240B17805a1316C3979M19044j77128H4810K62208j27884B3260
$$ 281242 487482 217805 -11316 33979 453023 275895 84810 347018 219134 23260
17328C39478f3258a2957A41507J4905J64695J02285J26995J4899A07965K2624
$$ 339478 -63258 -12957 141507 156412 321107 423392 550387 565286 107965 130589
17318A30589b35393C75907O2644A32762J26669B5077K11651q381K3984n4475n8282
$$ 130589 -235393 375907 438551 132762 259431 25077 236728 228347 252331 197856 139574
17307A39574M80370l08126p4451n2182J24172j27440H7378N7567L05508f4341
$$ 139574 619944 311818 237367 185185 309357 181917 87378 144945 450453 -64341
17296F5226K21422m2508A03656D4004M6190L11977j39368A01650J73225O5015
$$ 65226 286648 244140 103656 44004 90194 402171 262803 101650 274875 339890
17286C39890I295J27515J14021J05391j06498N4950A07660J20535K19205h9967
$$ 339890 9295 136810 250831 356222 249724 304674 107660 228195 447400 -89967
17275B52606n0188J67363j25995J7532R8817q0185l1307H7480R1158Q3457p7478
$$ 252606 202418 369781 243786 261318 360135 279950 248643 87480 178638 262095 184617
17264A84617C0618P0021j5924K03390n9343K06446j2215N3090F2032J52332P5764
$$ 184617 30618 100639 84715 288105 228762 435208 422993 476083 62032 214364 290128
17253B90128K32105j03123k3272f1747B32365L0569A6729B313K56249n5174a38583
$$ 290128 522233 419110 395838 -61747 232365 262934 16729 2313 258562 203388 -138583
17241A36227J76471O3602k2273L25184c4590D32749j24007J1395k7163J60848
$$ 136227 312698 376300 354027 679211 -34590 432749 308742 320137 292974 453822
17231D53822j42528O5177P4812J3451L37381B11499J92357A97233m0355K94046
$$ 453822 311294 376471 451283 464734 802115 211499 403856 197233 156878 450924
17221D50924B18362n4795K03701j4341r5017j17176L29768B33563a0850B17938
$$ 450924 218362 163567 367268 352927 257910 140734 470502 233563 -10850 217938
17210E84354C8511L58495j87745R6308J0249A34675J50463j09816R7967m9775
$$ 584354 38511 397006 209261 305569 315818 134675 285138 175322 273289 223514
17200B23514m3843J36942H5028N1473L00962m3345m9246K3437j10410J89087j98608
$$ 223514 179671 316613 85028 136501 437463 394118 344872 368309 257899 446986 248378
17189B48378L27255B32027L17498M9816k8406M9632j24671J43644B79135K06741
$$ 248378 575633 232027 549525 599341 570935 620567 495896 639540 279135 485876
17179D85876A80696J52928J96154j35243P15O4850j99627J93637K38779j43961
$$ 485876 180696 333624 529778 394535 395250 460100 260473 454110 692889 548928
17169E48928M5105j3111B80874K88109L87753l27183e1665C8278M28067j06951
$$ 548928 594033 580922 280874 568983 956736 629553 -51665 38278 466345 359394
17159C59394Q5321p8710J83560K05255B24061J01374J58177k01479J76098j35290
$$ 359394 444715 366005 549565 754820 224061 325435 483612 282133 458231 322941
17149C22941L52597C22489K3334j00363R1579o6779L74241k97177P7419J04516
$$ 322941 675538 322489 345823 245460 337039 270260 644501 347324 424743 529259
17139E29259P1903J27671l25100m253J13944j7715L2566j04289F8430R7339L25863
$$ 529259 601162 728833 403733 399480 513424 495709 528275 423986 68430 165769 491632
17128D91632j17511L79364l68874Q5099K01992j69285J34301B49104M91059k79581
$$ 491632 374121 753485 384611 469710 671702 502417 636718 249104 740163 460582
17118D60582J90223J56136j91712j8550k46441K12211n4032j85574J08438J16741
$$ 460582 650805 806941 615229 596679 350238 562449 508417 322843 431281 548022
17108E48022k41759N52550l62873M75114j62197l58474K58143k9706n95B65204
$$ 548022 306263 858813 495940 971054 808857 450383 708526 678820 678225 265204
17097F61125p8457K81076D15193K53529j39055p2305Q8067K25775J7172l50115
$$ 661125 582668 863744 415193 668722 529667 457362 545429 771204 788376 438261
17087D38261L92302C37838Q040M59071k22035J51156j34655r4170J91679k08450
$$ 438261 830563 337838 345878 804949 582914 734070 599415 505245 696924 488474
17077D88474K83323k957k82788K59189l6586J62609j57456J30838J24646j46198
$$ 488474 771797 768840 486052 745241 708655 871264 713808 844646 969292 823094
17067H23094j64925J59289j75438J64067j45495J5021m9662J36862o9187J57090
$$ 823094 658169 817458 642020 806087 660592 675613 625951 762813 693626 850716
17057H50716k16365J27849j23357Q5212j72885K51152j61705q6578O32578l87024
$$ 850716 634351 762200 638843 724055 551170 802322 640617 554039 1186617 799593
17047G99593L09299k98369L00852m22928k05685K39567o1234L48832j50051R2830
$$ 799593 1108892 810523 1111375 688447 482762 722329 661095 1009927 859876 952706
17037I52706j62950r0568l9529K87077j98434j81532L58266l5122J05666p1313
$$ 952706 789756 699188 659659 946736 748302 566770 925036 889914 995580 924267
17027I24267k3005p1909J0516P4039J27810k82113K37396n7705o1425j2097J24890
$$ 924267 901262 829353 839869 913908 1041718 759605 997001 939296 877871 865774 990664
17016I90664j80325K03031K14165k22020k11269M30683l41466J33240j06267D44540
$$ 990664 810339 1013370 1227535 1005515 794246 1224929 883463 1016703 910436 444540
17005G31556M08738l65278J25188k17077K29536j69081J56540K28005r7015L56469
$$ 731556 1140294 775016 900204 683127 912663 743582 900122 1128127 1031112 1387581
16995A387581l39294J14010j50239M0304j57904L29541J21187k08269r5743R5211
$$ 1387581 1048287 1162297 1012058 1052362 894458 1223999 1345186 1136917 1041174 1136385
16985A136385R0482R1354M1619L7710r3000j71050J5472J44059j67545N4868M12666
$$ 1136385 1226867 1318221 1359840 1397550 1304550 1133500 1148972 1293031 1125486 1180354 1593020
16974A593020m37612J48979l20684M41447m13236L46515J33229l36831M99166
$$ 1593020 1155408 1304387 983703 1425150 1011914 1358429 1491658 1154827 1653993
16965A653993k14893l55497M30177J52624l94237J29828r9021P6116J46118k72863
$$ 1653993 1439100 1083603 1513780 1666404 1272167 1401995 1302974 1379090 1525208 1252345
16955A252345L97693m54827L23574J74551o7525k12826K80849m16532K64593j84656
$$ 1252345 1650038 1195211 1518785 1693336 1625811 1412985 1693834 1277302 1541895 1357239
16945A357239K85329n2622L87200n60157o8281N91849j89622R3436O2191j44641
$$ 1357239 1642568 1589946 1977146 1416989 1348708 1940557 1750935 1844371 1906562 1761921
16935A761921R0027m8161k06146L00492m3549r3783K4233P7474L2541O7675N6139
$$ 1761921 1851948 1803787 1597641 1898133 1854584 1760801 1785034 1862508 1895049 1962724 2018863
16924B018863k17423O5569J13310K76572j65080j17039Q5189J1509k30255J09455
$$ 2018863 1801440 1867009 1980319 2256891 2091811 1974772 2059961 2071470 1841215 1950670
16914A950670P0801L85463l3829j1827k48321M9464L8597J58022j3561j26601
$$ 1950670 2021471 2406934 2373105 2361278 2112957 2162421 2201018 2359040 2345479 2218878
16904B218878N45232K2314k28232K50825j91695j14709O2427P9139j0265M5053
$$ 2218878 2764110 2786424 2558192 2809017 2617322 2502613 2565040 2644179 2633914 2678967
16894B678967Q0663J35333m36882K68960K39952p775k69770L77076l79297O51333
$$ 2678967 2759630 2894963 2458081 2727041 2966993 2959218 2689448 3066524 2687227 3338560
16884C338560n14386K28203K02836k57671J59664p7092L8092J96427l35520M29149
$$ 3338560 2824174 3052377 3255213 2997542 3157206 3080114 3118206 3314633 2979113 3408262
16874C408262J73901M4208l98997K59512L03146k46697L78323k35355L13726L8620
$$ 3408262 3582163 3626371 3227374 3486886 3790032 3543335 3921658 3686303 4000029 4038649
16864D038649m8759k67004K6731N46501j88449k25504K04549L04008j48254J38747
$$ 4038649 3989890 3722886 3749617 4296118 4107669 3882165 4086714 4390722 4242468 4381215
16854D381215K65232j3336k01057K21025N3058Q4833N8255K37809R6912K71765
$$ 4381215 4646447 4633111 4432054 4653079 4706137 4790970 4849225 5087034 5183946 5455711
16844E455711m40654J88771J91132J51542l16189K82862K92544P2764K07796k14881
$$ 5455711 5015057 5203828 5394960 5546502 5230313 5513175 5805719 5878483 6086279 5871398
16834E871398L35481P96K31960J31122K03502J03028k35130K60360P3261L45779
$$ 5871398 6206879 6207675 6439635 6570757 6774259 6877287 6642157 6902517 6975778 7321557
16824G321557Q7923k43470O88751l54604L42567M66278j9901J11116J9520J75587
$$ 7321557 7409480 7166010 7854761 7500157 7842724 8309002 8289101 8400217 8419737 8595324
16814H595324J73547J09835L64207j3313L87697l4157L82590J40228M50109O7085
$$ 8595324 8768871 8878706 9242913 9229600 9617297 9583140 9965730 10105958 10556067 10623152
16804A0623152K92380L06524N43463j41487K39869L25184K51688J25842O24962
$$ 10623152 10915532 11222056 11765519 11624032 11863901 12189085 12440773 12566615 13191577
16795A3191577J80720M04431L97488K05119N08665R0998P58517J06680N03621
$$ 13191577 13372297 13776728 14174216 14379335 14888000 14978998 15737515 15844195 16347816
16786A6347816M785P96544N50609M17129N37162N10482L70204R54147L15925O33958
$$ 16347816 16352601 17149145 17699754 18116883 18654045 19164527 19534731 20488878 20804803 21438761
16776B1438761N74692Q88927M04298Q23839P39800J105754O82465J143457O34181
$$ 21438761 22013453 22902380 23306678 24130517 24870317 25976071 26658536 27801993 28436174
16767B8436174P57183J055268R23389J202347J091957J113631J022062J249538
$$ 28436174 29193357 30248625 31172014 32374361 33466318 34579949 35602011 36851549
16759C6851549J728155J204739J497821J573646J658420J373486J867875K096571
$$ 36851549 38579704 39784443 41282264 42855910 44514330 45887816 47755691 49852262
16751D9852262J876555K457080J688079K336143K383110K206848K571085K699800
$$ 49852262 51728817 54185897 55873976 58210119 60593229 62800077 65371162 68070962
16743F8070962K746260K773647K834473K886395L423685L487256K964577K972145
$$ 68070962 70817222 73590869 76425342 79311737 82735422 86222678 89187255 92159400
16735I2159400L176856L530848L419049L122753L219764L086513K997331K262985
$$ 92159400 95336256 98867104 102286153 105408906 108628670 111715183 114712514 116975499
16727A16975499K762665K592700K195505J516595J289947Q51039O74063N21070
$$ 116975499 119738164 122330864 124526369 126042964 127332911 128183950 128858013 129379083
16719A29379083m90535l46529j140223j379224j478051k057315k881451k078364
$$ 129379083 128888548 128542019 127401796 126022572 124544521 122487206 119605755 117527391
16711A17527391k887628k901172k793307l434935l484860l340727l498967l266638
$$ 117527391 114639763 111738591 108945284 105510349 102025489 98684762 95185795 91919157
16703I1919157l387331l181613l137550l311528k990341k820737k964555k661641
$$ 91919157 88531826 85350213 82212663 78901135 75910794 73090057 70125502 67463861
16695F7463861k187872l084377k686692j787955k793867j880288k051708k009103
$$ 67463861 65275989 62191612 59504920 57716965 54923098 53042810 50991102 48981999
16687D8981999j401472k202918j940908j549732j306593j773615j313436j467294
$$ 48981999 47580527 45377609 43436701 41886969 40580376 38806761 37493325 36026031
16679C6026031j140515j179345r82078j279546j056779j205547o73789r43772
$$ 36026031 34885516 33706171 32724093 31444547 30387768 29182221 28508432 27564660
16671B7564660r77315q02116j230956n34754m18560j085102q16393m95045l45534
$$ 27564660 26587345 25785229 24554273 24019519 23600959 22515857 21699464 21204419 20858885
16662B0858885q44161q99644l62260m02068n29749p12448m38889j72685m66113
$$ 20858885 20014724 19115080 18752820 18350752 17821003 17108555 16669666 16496981 16030868
16653A6030868q94782J70727q57700n9522l10903J21239o35920o91325l20807
$$ 16030868 15136086 15306813 14449113 14389591 14078688 14199927 13564007 12872682 12551875
16644A2551875k48749m47094j22207l20558L9859n17841l11243J35812m50896
$$ 12551875 12303126 11856032 11733825 11413267 11453126 10935285 10624042 10759854 10308958
16635A0308958m90740M0891o2934j54848o56486l62544K18862k08430n2955l03038
$$ 10308958 9818218 9859109 9796175 9641327 8984841 8622297 8841159 8632729 8579774 8276736
16625H276736j46218j10309k89672k26005J43887m05279K922n72849O60905n54910
$$ 8276736 8130518 8020209 7730537 7504532 7648419 7243140 7246062 6673213 7334118 6779208
16615F779208j8122k47167m89539M43478j19342k07900J59180m43701j59688R9973
$$ 6779208 6761086 6513919 6024380 6467858 6348516 6140616 6299796 5856095 5696407 5796380
16605E796380l29668r2242K91012k69859j5876j52484q4113J97637n75074M0985
$$ 5796380 5466712 5374470 5665482 5395623 5379747 5227263 5143150 5340787 4765713 4806698
16595D806698k36993N1941K64771n25965m4670M7575J50875k95862n2246J39994
$$ 4806698 4569705 4621646 4886417 4360452 4315782 4363357 4514232 4218370 4166124 4306118
16585D306118j98905k62222J6483K24452n78572M06603j98297P9826l92149r1583
$$ 4306118 4107213 3844991 3861474 4085926 3507354 3913957 3715660 3795486 3403337 3311754
16575C311754J41143K20216j89553P2528l00599K19015n29004N5842K48705j02644
$$ 3311754 3452897 3673113 3483560 3556088 3255489 3474504 2945500 3001342 3250047 3147403
16565C147403j64291j32691P0111j8567K13479m5779m3086j89779J18060n98064
$$ 3147403 2983112 2850421 2920532 2901965 3115444 3069665 3026579 2836800 2954860 2356796
16555B356796M89026r9593j37648l9954J48949k51620J0782J39691K30076n58884
$$ 2356796 2845822 2746229 2608581 2568627 2717576 2465956 2476738 2616429 2846505 2287621
16545B287621N55747l61477j10652r392n6915j40678M04523m87011N87244o52219
$$ 2287621 2843368 2481891 2371239 2361847 2304932 2164254 2568777 2081766 2669010 2016791
16535B016791K62579k70810j10916M03792m17912K14817j91697P2706O5248k92726
$$ 2016791 2279370 2008560 1897644 2301436 1883524 2098341 1906644 1979350 2044598 1751872
16525A751872N7226p4231L23547J36895l49885K13967j33513k28600K30127M3537
$$ 1751872 1809098 1734867 2058414 2195309 1845424 2059391 1925878 1697278 1927405 1970942
16515A970942k71795j09380L1327l1627L98434m12234N6733j08263J20061k08375
$$ 1970942 1699147 1589767 1621094 1589467 1987901 1575667 1632400 1524137 1644198 1435823
16505A435823J16349j34085J72385j55001K68804k15125J95558j79773J42186
$$ 1435823 1552172 1418087 1590472 1435471 1704275 1489150 1684708 1504935 1647121
16496A647121n5676R7604k11043j71572K27831l45873L19772j65809l35493M40917
$$ 1647121 1591445 1689049 1478006 1306434 1534265 1188392 1508164 1342355 1006862 1447779
16486A447779K7591l99544O29915k80254k68807J25154K23412r4356l9857j54394
$$ 1447779 1475370 1075826 1705741 1425487 1156680 1281834 1505246 1410890 1371033 1216639
16476A216639N30667m23529J29640j40756L4030k15258P3733p4479Q5534j43489
$$ 1216639 1747306 1323777 1453417 1312661 1346691 1131433 1205166 1130687 1216221 1072732
16466A072732J5282J55414k86323K58211p5869l87079K50007J71104j52806J61367
$$ 1072732 1088014 1243428 957105 1215316 1139447 752368 1002375 1173479 1020673 1182040
16456A182040j34496r0543L7676K11601m7524R3547m13158K68401j66835j52586
$$ 1182040 1047544 957001 994677 1206278 1158754 1252301 839143 1107544 940709 788123
16446G88123L17469J7826j33542k86818J69398j39445J44562J10774l2024j39256
$$ 788123 1105592 1123418 989876 703058 872456 733011 877573 988347 956323 817067
16436H17067K79740j81227k80759O74389m97973j05493J92446j11087J41515l15217
$$ 817067 1096807 915580 634821 1309210 811237 705744 898190 787103 928618 613401
16426F13401K82931j02524j88207M35430m91849M84647l11848J1397K29233D69807
$$ 613401 896332 793808 605601 1041031 549182 1033829 721981 733378 962611 469807
16415C67784M7475L88312q7207j15280m7984J05685K70912l65885J34799R8019
$$ 367784 415259 803571 716364 601084 553100 658785 929697 563812 698611 796630
16405G96630K373m384K22582k08338N9438k11034J01589j36313K65785J48328
$$ 796630 799003 794619 1017201 808863 868301 657267 758856 622543 888328 1036656
16395A036656l02530r9212K03608j72069j81703J03283J80785j76857M23473C22419
$$ 1036656 734126 634914 838522 666453 484750 588033 768818 591961 1015434 322419
16384A98835N48702k44179K8027J51063k53663M58746k01735m222k38169K08355
$$ 198835 747537 503358 531385 682448 428785 887531 685796 681574 443405 651760
16374F51760k5328l6147k80295J93957Q4185k04875j73503L16043J07737C08390
$$ 651760 626432 590285 309990 503947 588132 383257 209754 525797 633534 308390
16363E79734j80162J00793J57541L33622l10399p3763K12683l06172B38090K32793
$$ 579734 399572 500365 657906 991528 681129 607366 820049 513877 238090 470883
16353D70883L13581l18071L13275B90571J21900q0264n9632M34830j6984k42164
$$ 470883 784464 466393 779668 290571 412471 332207 272575 707405 690421 448257
16343D48257j729n6697j4723M3907J48753k03053J73346o2007M4636N3211l653
$$ 448257 446528 389831 375108 419015 567768 364715 538061 476054 520690 573901 570248
16332E70248Q3639j85909k14200M89784H7274J42475R6267E9841K76941j13788
$$ 570248 653887 467978 253778 743562 87274 229749 326016 59841 336782 222994
16322B22994J54033N8344K92255j96249F8438K70010o3444J48346J86867j63593
$$ 222994 377027 435371 727626 531377 68438 338448 275004 423350 610217 446624
16312D46624M2767J06563k02676I3761P5999L41393o2528L74218D8843L01209
$$ 446624 489391 595954 393278 93761 169760 511153 448625 822843 48843 350052
16302C50052J56264j88913J93723A95188E4933J54088L6028O8090m2257D6461
$$ 350052 506316 317403 511126 195188 54933 209021 245049 313139 270882 46461
16291C62718n8151K17106P3397B28162O9889K77335p8361G5288J87087J09221
$$ 362718 304567 521673 595070 228162 298051 575386 497025 75288 262375 371596
16281C71596o0014n9248L09997A20589R3187P9J75183P8311A59962J49914O3097
$$ 371596 311582 252334 562331 120589 213776 213855 389038 467349 159962 309876 372973
16270C72973m0730n7577m012Q0858m5455J36400r1695A73352J15698j28961M83305
$$ 372973 332243 274666 270654 351512 306057 442457 350762 173352 289050 160089 643394
16259F43394l19987o1997M5850a81023I7684K92501j0248J74455A13925K05283
$$ 643394 323407 261410 307260 -181023 97684 390185 379937 554392 113925 319208
16249C19208p751l3441A02433K2199b3355j68523F1141b0903C05983J36374A06306
$$ 319208 311457 278016 102433 124632 -23355 -191878 61141 -20903 305983 442357 106306
16237B02666Q5713J5371n2425G3331K60109A09360J69005A20646k4692K2957a07060
$$ 202666 288379 303750 251325 73331 333440 109360 278365 120646 95954 118911 -107060
16225D41139J55453d4920C42361j48757Q0057G0128J43828o7328K11573d31A65985
$$ 441139 596592 -44920 342361 193604 273661 70128 213956 146628 358201 -431 165985
16213B8576J50079J90030I7002J85437j39707a04055C22504r5198I4687L93222
$$ 28576 178655 368685 97002 282439 142732 -104055 322504 227306 94687 487909
16203D87909B6139J17977O223K4603C6268J83099b7551D58961a07886D18482j10490
$$ 487909 26139 144116 150339 174942 36268 219367 -27551 458961 -107886 418482 307992
16192C07992K86753I1870c5380B58121C8873L53192A05585M4683g8690E76312
$$ 307992 594745 91870 -35380 258121 38873 392065 105585 150268 -78690 576312
16181B08760M5117B3683K25299D0088J23073D2642L80741n3932q0273O4000L1486
$$ 208760 253877 23683 248982 40088 163161 42642 423383 369451 289178 353178 384664
16170C84664A17719c1943B41459l9288o6366O5360M9020E1782K67402l6074J78150
$$ 384664 117719 -31943 241459 202171 135805 201165 250185 51782 319184 283110 461260
16159D61260i9229j48563J08011M144H8516k9757B2660h9600A17617C6771J48603
$$ 461260 -99229 -247792 -139781 -135637 88516 58759 22660 -89600 117617 36771 185374
16148A85374J55220l5219H0301f3187C60521j44546I5405Q6339C8748J79446a66651
$$ 185374 340594 305375 80301 -63187 360521 215975 95405 181744 38748 218194 -166651
16136F8444J14531d1086A20938f8965A76949L5928K16206G6757a54910J5812l8549
$$ 68444 182975 -41086 120938 -68965 176949 212877 429083 76757 -154910 -139098 -177647
16125a77647O6329A33577D3467K1922d4843D5615K58204b56947F9719k7035h7455
$$ -177647 -111318 133577 43467 65389 -44843 45615 303819 -256947 69719 42684 -87455
16113B99424n7093Q0442A42545J06805H2068B2181a24629j25533a13191B95866
$$ 299424 242331 322773 142545 249350 82068 22181 -124629 -250162 -113191 295866
16102c1413B14493p7659a0587B26946G6102b20063a00529d2914B40440A2549J56775
$$ -31413 214493 136834 -10587 226946 76102 -220063 -100529 -42914 240440 12549 169324
16091A69324a91653f436j37800A82206n4673a44903N3450A68509J00511A09789
$$ 169324 -191653 -6436 -144236 182206 127533 -144903 -91453 168509 269020 109789
16080B04856D8939g9352B1916i394A17178J25806H2736J21781e3446A12103b364
$$ 204856 48939 -79352 21916 -9394 117178 242984 82736 204517 -53446 112103 -2364
16068D05035A27651m1936B4890e2596A97278b44802D8556R991K04934J21714A8026
$$ 405035 127651 85715 24890 -52596 197278 -244802 48556 58547 263481 385195 18026
16056B68329g7766A96514m0734e2909k9989j16808L7901e5331A85943j1000g133
$$ 268329 -77766 196514 155780 -52909 -82898 -199706 -161805 -55331 185943 174943 -7133
16044a73999A14282K54141E9885N6163a75340m2254f5495d107q3388C58072J59103
$$ -173999 114282 368423 59885 116048 -175340 -217594 -65495 -4107 -87495 358072 517175
16033E17175i605B17792h8917G454K61805j2316b0469j63728B30775p9979c66249
$$ 517175 -9605 217792 -88917 7454 269259 256943 -20469 -184197 230775 150796 -366249
16021B6717L16568a94348G5526B2640f7813A3556J72101K750l6677K87672m9561
$$ 26717 343285 -194348 75526 22640 -67813 13556 185657 188407 151730 439402 389841
16010C89841a19522j8682A87628a99986D6544b4361m5605A66834i8239D2493b62526
$$ 389841 -119522 -138204 187628 -199986 46544 -24361 -69966 166834 -98239 42493 -262526
15998b17859d521G1358a18012d2278G0856a16773H2151j0383L10702f774j30511
$$ -217859 -4521 71358 -118012 -42278 70856 -116773 82151 71768 382470 -6774 -137285
15987a37285D4090J38293b98151B69988I8138K4875K60294p7989J08160L65319
$$ -137285 44090 182383 -298151 269988 98138 123013 383307 305318 413478 778797
15977G78797k67594M75509k35991l24105j20065g4782B88257c50070a25067D2769
$$ 778797 511203 986712 750721 426616 306551 -74782 288257 -350070 -125067 42769
15966C8683a54134a8918B81546G9865c20479c0329A86133O8031q4332G5919a9472
$$ 38683 -154134 -18918 281546 79865 -320479 -30329 186133 254164 169832 75919 -19472
15954A19110e0855K568K3112o1964B42364a14170L3242B622a99450A59438n8608
$$ 119110 -50855 -48287 -25175 -87139 242364 -114170 -80928 2622 -199450 159438 100830
15943A00830a06787n6701j59550i0720j50821E7947f5984L350A40074b24884E16258
$$ 100830 -106787 -163488 -323038 -90720 -241541 57947 -65984 -62634 140074 -224884 516258
15931b00280I9826J4645I013c1633j79520B28249a34166H9169k9870a19404A10931
$$ -200280 99826 114471 9013 -31633 -211153 228249 -134166 89169 59299 -119404 110931
15919a18457B7257i5655J4565l2829H9659L4726e1986A98122n2926J3530F7665
$$ -118457 27257 -95655 -81090 -113919 89659 124385 -51986 198122 145196 158726 67665
15907A82483p3413a00726B38295b30568B9176J24682L5529B3627F961b1134A93111
$$ 182483 109070 -100726 238295 -230568 29176 153858 189387 23627 6961 -21134 193111
15895b9622A51859b81134a38746L2445B02641a4598B70175c05537c5893B26394
$$ -29622 151859 -281134 -138746 -106301 202641 -14598 270175 -305537 -35893 226394
15884d9938A0254h5280E6797c69138a65993B12948E9082J8224A8458b7166j09471
$$ -49938 10254 -85280 56797 -369138 -165993 212948 59082 77306 18458 -27166 -136637
15873a36637e3142p9266B71810E3753c144A31535O8087A5361a6544B6423c16459
$$ -136637 -53142 -132408 271810 53753 -3144 131535 199622 15361 -16544 26423 -316459
15861B8639a16089P613B23518i9795B64362P0740f1631b8315A61447d4571r3174
$$ 28639 -116089 -108476 223518 -99795 264362 335102 -61631 -28315 161447 -44571 -137745
15850a37745A71463E6304a27159J2435L9847p7996A16036K64741C2925J19810
$$ -137745 171463 56304 -127159 -114724 -74877 -152873 116036 380777 32925 152735
15840A52735a08344j00383o1497A03598a06717A44465B3252J36514P2967A14911
$$ 152735 -108344 -208727 -270224 103598 -106717 144465 23252 159766 232733 114911
15829d05025B49721A18674l9632B3618a24184C45336a06006o4333B9474o130b650
$$ -405025 249721 118674 79042 23618 -124184 345336 -106006 -170339 29474 23344 -2650
15817E3169e9741B58284e4874B84173G170M9898a59773B79530q4543c84374a8218
$$ 53169 -59741 258284 -54874 284173 7170 57068 -159773 279530 194987 -384374 -18218
15805b60047a14346e0604p1680e9755B6574h7460j57724k4254j72690A1948a10591
$$ -260047 -114346 -50604 -122284 -59755 26574 -87460 -245184 -269438 -442128 11948 -110591
15793E5250K52658b21275j705N6056K0289j50921o862A96286b2814n7876o4862
$$ 55250 307908 -221275 -222980 -166924 -146635 -297556 -304418 196286 -22814 -80690 -145552
15782a45552B33348a07934A79464g2345B31330A1082C713h6843o0105F0776d9758
$$ -145552 233348 -107934 179464 -72345 231330 11082 3713 -86843 -146948 60776 -49758
15770i7465j58675N999i9094d0996G5186K01059G5622b06585A16630R8632G5924
$$ -97465 -256140 -250141 -99094 -40996 75186 276245 75622 -206585 116630 215262 75924
15758A92793g6267B24035b03144A10194a25008j18572G2549b69157i5017a1190
$$ 192793 -76267 224035 -203144 110194 -125008 -243580 72549 -269157 -95017 -11190
15747e1225r5219A40579j9904J24336p3851c14438A46569G1493c83936a84491
$$ -51225 -146444 140579 120675 245011 171160 -314438 146569 71493 -383936 -184491
15736a40998B68320F5219a03873E6096G579h0895j13461l48088A29400O9690D0897
$$ -140998 268320 65219 -103873 56096 7579 -80895 -194356 -542444 129400 199090 40897
15724a01096j12918B22M43952a33739A63979Q8234g2040C25716j38763R8392b156
$$ -101096 -214014 222 444174 -133739 163979 252213 -72040 325716 186953 285345 -2156
15712a84290d2282A89164a15066B07986b75387C1045J44399b94573o2157B66385
$$ -184290 -42282 189164 -115066 207986 -275387 31045 175444 -294573 -356730 266385
15701i9983A30178c1489A23150g6543k59371H6067J79856G868J23829a22772f0337
$$ -99983 130178 -31489 123150 -76543 -335914 86067 265923 7868 131697 -122772 -60337
15689a28841N5480E9882N6821a88619d4990E8803J42899A00617a93187f9206C1426
$$ -128841 -73361 59882 116703 -188619 -44990 58803 201702 100617 -193187 -69206 31426
15677B85011a0164C6364N1883h843k00173C7159h0983B89679b139G108b77535
$$ 285011 -10164 36364 88247 -8843 -209016 37159 -80983 289679 -2139 7108 -277535
15665d6243o253P948A84331c12266F0127K0693b49619f1875D972P2124c3714h169
$$ -46243 -52496 -44548 184331 -312266 60127 80820 -249619 -61875 4972 77096 -33714 -8169
15652A88965i3490F2321a96101A89942O2326a53547m0917A74936B9808p845L7498
$$ 188965 -93490 62321 -196101 189942 252268 -153547 -194464 174936 29808 21963 59461
15641E9461a30686C20314b70132a6140p8905q2399e6939k09107J18827p7514F1782
$$ 59461 -130686 320314 -270132 -16140 -95045 -177444 -56939 -266046 -147219 -224733 61782
15629A95222D4536g5831J8125C1400m840b82746M0293a00632L3676b8210j39837
$$ 195222 44536 -75831 -57706 31400 26560 -282746 -242453 -100632 -66956 -28210 -168047
15618a68047O9166m6454I4366c74419a75697b1152p1010G5002a12287A04448a30913
$$ -168047 -98881 -145335 94366 -374419 -175697 -21152 -92162 75002 -112287 104448 -130913
15606a22334C02254E4435r111b26337K4514a5122l55115B19432i6517A06162e733
$$ -122334 302254 54435 45324 -226337 -201823 -15122 -370237 219432 -96517 106162 -5733
15594a17256A24283F1067b266r2938n6581m9546A95940b01341D3624O6464a58831
$$ -117256 124283 61067 -2266 -95204 -151785 -201331 195940 -201341 43624 110088 -158831
15582c34739L7493A93118E1319O4515b7537k76148P263R1473e4491k47301a43060
$$ -334739 -297246 193118 51319 115834 -27537 -303685 -296422 -204949 -54491 -301792 -143060
15570B5934g7356E1138a26389d6119J5470m7127j25673h1197D06490A06092J21348
$$ 25934 -77356 51138 -126389 -46119 -30649 -77776 -203449 -81197 406490 106092 227440
15559B27440I9007J13418a63974B56276B8443J94144r8207P981l1110h9812B28624
$$ 227440 99007 212425 -163974 256276 28443 222587 124380 132361 101251 -89812 228624
15547h3054C760J75349M1734K21213C4481b0584G9408g9902b1652D2314H405L24827
$$ -83054 3760 179109 220843 442056 34481 -20584 79408 -79902 -21652 42314 8405 333232
15535C33232A57447J41390j1083b32596A41193D4338a34675D80552l3541A01011
$$ 333232 157447 298837 287754 -232596 141193 44338 -134675 480552 447011 101011
15524B88583h7656c168A47292M330g1023B97527k8364J20845J98726k60432A55312
$$ 288583 -87656 -3168 147292 151622 -71023 297527 269163 390008 588734 328302 155312
15512C4837L39807F9163a96735B0009N1334K86460j32514I9623J01047J29482
$$ 34837 374644 69163 -196735 20009 71343 357803 225289 99623 200670 330152
15502C30152A02491D3425O3924f78k9109C18042a13099p7289d1973C7688m01b48262
$$ 330152 102491 43425 107349 -678 -29787 318042 -113099 -190388 -41973 37688 37287 -248262
15489a53477O7275D9337e5083o1509B28674D762e3824r3602j74890J39699D660
$$ -153477 -86202 49337 -55083 -116592 228674 4762 -53824 -147426 -322316 -182617 4660
15477C8084e5080B48347q1411L45579k05044A25964L1460G1296K06017b96316
$$ 38084 -55080 248347 166936 512515 307471 125964 157424 71296 277313 -296316
15466c00074B93110c64782k7124i0289A54723l5498k9606G54e39911b2431B88382
$$ -300074 293110 -364782 -391906 -90289 154723 119225 89619 754 -539911 -22431 288382
15454A40690k104L7435h7957i393n9568D5963c5464j97917B11726M585p9776E2329
$$ 140690 138586 176021 -87957 -9393 -68961 45963 -35464 -233381 211726 216311 136535 52329
15441b33410D22466j14672J24882A66863G9614J37838g9380j60040G269b20518
$$ -233410 422466 307794 432676 166863 79614 217452 -79380 -239420 7269 -220518
15430C7078c29737A11151d1342B13979l5712b47092I0910j3675K20875a47887
$$ 37078 -329737 111151 -41342 213979 178267 -247092 90910 77235 298110 -147887
15419D7961d2824C3932b0277j17593j06048G4602a09795B8426a62693B32196a56446
$$ 47961 -42824 33932 -20277 -137870 -243918 74602 -109795 28426 -162693 232196 -156446
15407b70614K7108A15528m2362a18318o2624A14444R6566c8050A4582J60112N6830
$$ -270614 -243506 115528 73166 -118318 -180942 114444 211010 -38050 14582 174694 231524
15396B31524j13492J33159b9708A4401J71852B6277a55493A27665d3407j5071
$$ 231524 118032 251191 -29708 14401 186253 26277 -155493 127665 -43407 -58478
15386e8478D2791c28768B56279c07173i1328J3260A53295a20870f0019K8843k4222
$$ -58478 42791 -328768 256279 -307173 -91328 -78068 153295 -120870 -60019 -31176 -55398
15375e5398E5675a048C4858L83821a76095m21580e7331C20754b00152C12894c58252
$$ -55398 55675 -1048 34858 418679 -176095 -597675 -57331 320754 -200152 312894 -358252
15363a8382A89820h0324j29194J4860L8774f7698E01602a25347C35878f9301M099
$$ -18382 189820 -80324 -209518 -194658 -155884 -67698 501602 -125347 335878 -69301 -65202
15352f5202k0138B03393m2476L2762b15844B6503O8222b02303I5949b01897f5910
$$ -65202 -85340 203393 160917 193679 -215844 26503 94725 -202303 95949 -201897 -65910
15340B29722j04561L63099I2482a75959I7542j4553j4022g0535P235j80911C94527
$$ 229722 125161 488260 92482 -175959 97542 82989 68967 -70535 -63300 -244211 394527
15328A28706n8304P3511L25135I4434N9622J78569j24168F0041J64113j1147j2867
$$ 128706 70402 143913 469048 94434 154056 332625 208457 60041 224154 213007 200140
15317B00140p3570b04439C76207A76019M27716A53161b8774D54967H8524e4980
$$ 200140 126570 -204439 376207 176019 603735 153161 -28774 454967 88524 -54980
15306I933h287D0612k396e8030B32773d064k96689h1322n97K3945C4522Q6856
$$ 9933 -8287 40612 38216 -58030 232773 -4064 -300753 -81322 -81919 -57974 34522 121378
15294A21378j3831a8878o3512D07156A72113e3022A68782b7793B84404A42040
$$ 121378 107547 -18878 -82390 407156 172113 -53022 168782 -27793 284404 142040
15283A54990o8731d8061H7852C8749j4711J37456a61404A70137D3502A7566e7893
$$ 154990 86259 -48061 87852 38749 24038 161494 -161404 170137 43502 17566 -57893
15271c2263A2335L5799J20031d1302C33278a41946H1736p469F636Q9661j7539
$$ -32263 12335 48134 168165 -41302 333278 -141946 81736 74267 6636 96297 78758
15260G8758j000b14177c9531A20889a41719j58939c243I9922a1544G3559R8448
$$ 78758 77758 -214177 -39531 120889 -141719 -300658 -3243 99922 -11544 73559 172007
15249A72007g3864B52749a11207k7151L3927B97338b37425C51388M4490A50960
$$ 172007 -73864 252749 -111207 -138358 -104431 297338 -237425 351388 395878 150960
15238C8508N5766K59043n1770Q13188K074057J2911r45670J752471A845011B40057
$$ 38508 94274 353317 301547 1114735 3188792 3201703 2256033 4008504 1845011 240057
15227E31031B04138I2782d4934C17711b73729g2452B8380J90364Q9751A7239M7815
$$ 531031 204138 92782 -44934 317711 -273729 -72452 28380 218744 308495 17239 65054
15216F5054E611c25975i5815a3579F3228K72814a60045B05382k4046B0099K0896
$$ 65054 5611 -325975 -95815 -13579 63228 336042 -160045 205382 181336 20099 40995
15205D0995A3049a58571C35284a61226A03709b16211B74625O2097o6660E0497
$$ 40995 13049 -158571 335284 -161226 103709 -216211 274625 336722 270062 50497
15194A26704R8984A01511J14279L4904P1555A7965J45704c8596H8545i1748A36113
$$ 126704 225688 101511 215790 250694 322249 17965 163669 -38596 88545 -91748 136113
15182g0725k53807A47738C7566j1767R9945l3669a05021B92461l5221c315A38291
$$ -70725 -324532 147738 37566 25799 125744 92075 -105021 292461 257240 -3315 138291
15170a03162o3796A08288J30802j1137j13808d7544o1186B25509b210k90845A07712
$$ -103162 -166958 108288 239090 227953 114145 -47544 -108730 225509 -2210 -293055 107712
15158a15893D7303a34614B09721p0229D1439b61606F3893b30588D5c9846f396
$$ -115893 47303 -134614 209721 139492 41439 -261606 63893 -230588 45 -39846 -6396
15146F8874a09272g810A74868C1959L7227a6437G2321J57730p8776C5809R5130
$$ 68874 -109272 -7810 174868 31959 69186 -16437 72321 230051 151275 35809 130939
15135A30939K29490A53707m8917O9520A5428a58532A92402I0140K14974j2690
$$ 130939 360429 153707 104790 174310 15428 -158532 192402 90140 305114 292424
15125B92424g7851L2231A89814L14482A41300D7504P0617J93024O6413c9705B59820
$$ 292424 -77851 -45620 189814 504296 141300 47504 118121 311145 377558 -39705 259820
15113C12888j22491K5657b3513C59169L25876B79705n3307K28772A33045K6564
$$ 312888 190397 216054 -23513 359169 685045 279705 226398 455170 133045 159609
15103A59609F7346c2456B11445G9966L38973j40411A04471a37820A81007l6517
$$ 159609 67346 -32456 211445 79966 418939 278528 104471 -137820 181007 144490
15093A44490P4351j9863o4068Q0003l6787F9031J33525k7685b618H9097K70829
$$ 144490 218841 198978 134910 214913 178126 69031 202556 174871 -2618 89097 359926
15082C59926A0031J10851R2858O1599G1751A4429a90157C34416I374J74840b206
$$ 359926 10031 120882 213740 275339 71751 14429 -190157 334416 9374 184214 -2206
15070B75108c42938C26689A50501E9133N8468L4574F4781N7071L40510a7787D9334
$$ 275108 -342938 326689 150501 59133 117601 152175 64781 121852 462362 -17787 49334
15058B82133G0548a60281D33588a12640B21851J69170j70611c0757B50445j3488
$$ 282133 70548 -160281 433588 -112640 221851 391021 220410 -30757 250445 236957
15048B36957J44440G2882K95653B9133L96189A3538a38601H0546L08547j61143
$$ 236957 381397 72882 368535 29133 425322 13538 -138601 80546 389093 227950
15038B27950M242C7162K40434R3521A78949Q3465R4930h603A94834J49708K33221
$$ 227950 232192 37162 277596 371117 178949 262414 357344 -8603 194834 344542 577763
15027E77763j45393A96654I881L27382M6559e8401C05384A51244l302J55940J56565
$$ 577763 432370 196654 9881 337263 383822 -58401 305384 151244 147942 303882 460447
15016D60447m2897j25737J71511A84932G3667K20023O5670C6963M07525q2482
$$ 460447 417550 291813 463324 184932 73667 293690 359360 36963 444488 362006
15006C62006F7102R7136N9516P4505m5458G2044M91997H9724J25437L06299j02917
$$ 362006 67102 164238 223754 298259 252801 72044 564041 89724 215161 521460 418543
14995D18543j89970K96480k50271K27880j58677G5101J88873J04323r288c207
$$ 418543 228573 525053 274782 502662 343985 75101 263974 368297 359009 -3207
14984C22057M5218K444A07997K36126P7535M0950j28140N4399P4850Q6459K0068
$$ 322057 367275 369719 107997 344123 421658 462608 334468 388867 463717 550176 570244
14973E70244k68661F8889N9443g7592D97840k33302J09901I9023K79161d1516
$$ 570244 301583 68889 128332 -77592 497840 264538 374439 99023 378184 -41516
14962A34083k3347M40210A48746E339N55252B78822n3250a72436A58076J15364
$$ 134083 110736 550946 148746 5339 560591 278822 225572 -172436 158076 273440
14952B73440A28388b4723E53022m5317k29903K18970o0672j01826K1810J5359
$$ 273440 128388 -24723 553022 507705 277802 496772 436100 334274 356084 371443
14942C71443L9854N1899O317o297A03074K31527f5151E8914N78013B34708M2045
$$ 371443 411297 463196 469513 463216 103074 334601 -65151 58914 636927 234708 276753
14931B76753j01728J18316P4459K02628J30682k14693K25929P5226j2872p6023
$$ 276753 175025 293341 367800 570428 701110 486417 712346 787572 774700 698677
14921F98677n3975J64596j13968n0517K39859L6984J24211l49984O8985j18839
$$ 698677 644702 809298 695330 644813 884672 921656 1045867 695883 764868 646029
14911F46029K00080l51530L42068B67505L50785j95209j57338J32114J32155k32066
$$ 646029 846109 494579 836647 267505 618290 423081 265743 397857 530012 297946
14901B97946K85529j57399k0551j43606j2504K25208B15817L596N9467j36069
$$ 297946 583475 426076 405525 261919 249415 474623 215817 219413 278880 142811
14891A42811K70834O6189r4319K4112K08560J88097k61986j37900P8777M1118
$$ 142811 413645 479834 385515 409627 618187 806284 544298 406398 485175 526293
14881E26293J29448j19585N4314K9230N0604n5847B1819N81688j91939J90665
$$ 526293 655741 536156 590470 619700 670304 614457 21819 603507 411568 602233
14871F02233k79813J01791J33535k731B50746L00792r5911J60216k7063k63304
$$ 602233 322420 424211 557746 555015 250746 551538 455627 615843 588780 325476
14861C25476J76576J88075o0896r3859j83516a0943A41036n7521M86246F6092
$$ 325476 502052 690127 629231 535372 351856 -10943 141036 83515 569761 66092
14850B81938J48632K91428A45869J07014L02202J12678j51358K6320m9314O2107
$$ 281938 430570 721998 145869 252883 555085 667763 516405 542725 493411 555518
14840E55518Q5730J70017p1488p1170Q3524j32164J83397o9956L03604C48209
$$ 555518 641248 811265 739777 668607 752131 619967 803364 733408 1037012 348209
14829F54329j93984L83122D18088R0207Q9431R6611k16638K87878j9759n0781
$$ 654329 460345 843467 418088 508295 597726 694337 477699 765577 745818 695037
14819F95037q6274q8446K8558J49404o8662Q0013k35249o2075L03405k94368K19601
$$ 695037 608763 520317 548875 698279 629617 709630 474381 412306 715711 421343 640944
14808F40944A13333K57781K06470B55031M15996k27957L56856j22837M49866C34793
$$ 640944 113333 371114 577584 255031 671027 443070 799926 677089 1126955 334793
14797F58542J53740k54881j86717L0541P3045K87997j03470j98934j68547K38757
$$ 658542 812282 557401 370684 401225 474270 762267 658797 459863 291316 530073
14787E30073J890m1916K63557J10724C93720N06601k10480k40810K41793q0229
$$ 530073 531963 490047 753604 864328 393720 900321 689841 449031 690824 610595
14777F10595J67407j72145L092J69374m5973R3038j08371m2011j74659L19177
$$ 610595 778002 605857 608949 778323 732350 825388 717017 675006 500347 819524
14767H19524q4988m1839k25304R1577O4680O9047N6670C32997L85859k29342o9800
$$ 819524 734536 692697 467393 558970 623650 692697 749367 332997 718856 489514 419714
14756D19714K97991L9374k17257J21438n6855O6808n2736K13049j52600k33347
$$ 419714 717705 757079 539822 661260 604405 671213 618477 831526 678926 445579
14746D45579J6012K9905R3699M64819D93319N07329k69679j59480K21672j42845
$$ 445579 461591 491496 585195 1050014 493319 1000648 730969 571489 793161 650316
14736F50316k89173Q0651L9677K29598K58455k55881K34323Q1j6857j15533J01596
$$ 650316 361143 441794 481471 711069 969524 713643 947966 948047 931190 815657 917253
14725I17253J73088l6089n2162J94238j76160j13059k55748K34858j20851M7842
$$ 917253 1090341 1054252 1002090 1196328 1020168 907109 651361 886219 765368 813210
14715H13210l22615L44104j54514j59488J70857j48387N35849l60792l3195J03205
$$ 813210 490595 834699 680185 520697 691554 543167 1079016 718224 685029 788234
14705G88234N7216k02988M62697k55828N8267M53197k69555J63551l22419J35914
$$ 788234 845450 642462 1105159 849331 907598 1360795 1091240 1254791 932372 1068286
14695A068286J79169o16900N68793J64929F54484L84937m9229j11870J5425J1657
$$ 1068286 1247455 630555 1199348 1364277 654484 1039421 990192 878322 893747 905404
14685I05404j16470p957j38170J49187J22890J73832o0907J38680l27864L40396
$$ 905404 788934 780977 642807 791994 914884 1088716 1027809 1166489 838625 1179021
14675A179021k10094j08758J0310R3027K38570k36552J75665j58042j26933J46722
$$ 1179021 968927 860169 870479 963506 1202076 965524 1141189 983147 856214 1002936
14665A002936J60461l76571L044J68608M91092l88326J42850J0615j09556K06243
$$ 1002936 1163397 786826 789870 958478 1449570 1061244 1204094 1214709 1105153 1311396
14655A311396j57057k38738j28186K17278J19076L51280m20206R2294K17400n5012
$$ 1311396 1154339 915601 787415 1004693 1123769 1475049 1054843 1147137 1364537 1309525
14645A309525L7097n2171k54905l01502O88921l3306L95067m70772j69290P1081
$$ 1309525 1346622 1294451 1039546 738044 1426965 1393659 1788726 1317954 1148664 1219745
14635A219745o3342K03519q6546J94641k11251o5933M0932R9880k56182L99159
$$ 1219745 1156403 1359922 1273376 1468017 1256766 1190833 1231765 1331645 1075463 1474622
14625A474622q8126j48673L024M73922l81017K08148J44278m04726L65341k07968
$$ 1474622 1386496 1237823 1240847 1714769 1333752 1541900 1686178 1281452 1646793 1438825
14615A438825J3545l26773K86555K69059k33154j78852J16724K66945k84503J28226
$$ 1438825 1452370 1125597 1412152 1681211 1448057 1269205 1385929 1652874 1368371 1496597
14605A496597P9683m5316j58254K37510j8331k38041K29208j49330j2746j0582
$$ 1496597 1576280 1530964 1372710 1610220 1591889 1353848 1583056 1433726 1420980 1410398
14595A410398K02438J71148k65645j02968K37050K43675j36005M4099j01927j3453
$$ 1410398 1612836 1783984 1518339 1415371 1652421 1896096 1760091 1804190 1702263 1688810
14585A688810l4106J33871Q0393r3754o9366J59596L21392j77129M9620Q6553
$$ 1688810 1654704 1788575 1868968 1775214 1705848 1865444 2186836 2009707 2059327 2145880
14575B145880R7672k57888K22212K51378k52441L8931J81791m36389J76481J82818
$$ 2145880 2243552 1985664 2207876 2459254 2206813 2245744 2427535 1991146 2167627 2350445
14565B350445m7029j09591J98445J3702K25312q5526J65802P5408n9501k69817
$$ 2350445 2303416 2193825 2392270 2405972 2631284 2545758 2711560 2786968 2727467 2457650
14555B457650O31219J25782m9368O59225P82033J229297J175493L439558O976577
$$ 2457650 3088869 3214651 3165283 3824508 4606541 5835838 7011331 10450889 17427466
14546A7427466J8789112J1189572B0192076H621754l791584j912412l07607j88280
$$ 17427466 36216578 47406150 20192076 8621754 4830170 2917758 2610151 2421871
14538B421871l29613j29885K57458K56507l55978K73523M50358M14655J536491
$$ 2421871 2092258 1962373 2219831 2476338 2120360 2393883 2844241 3258896 4795387
14529D795387M906623l746748B898609l48473M4778k37970J70223j18323j22707
$$ 4795387 9702010 5955262 2898609 2550136 2594914 2356944 2527167 2408844 2286137
14520B286137K03212j80397o2714L58171k20096O5477J43133J41067m09716J61405
$$ 2286137 2489349 2308952 2246238 2604409 2384313 2449790 2592923 2733990 2324274 2485679
14510B485679n7325Q4796L50273J04157k79567L1044R1522N31136o33064M47573
$$ 2485679 2428354 2513150 2863423 2967580 2688013 2719057 2810579 3341715 2708651 3156224
14500C156224k39333J88809J69569j94066N2965k36839N05171o6555L25458j65845
$$ 3156224 2916891 3105700 3275269 3081203 3134168 2897329 3402500 3335945 3661403 3495558
14490C495558j57848K94450j03905j59793j74209K08852M00311l07113P5379J88815
$$ 3495558 3337710 3632160 3528255 3368462 3194253 3403105 3803416 3496303 3571682 3760497
14480C760497J67510m46741L69809R5717j3357o49q7597r1367L03515j18493N52367
$$ 3760497 3928007 3481266 3851075 3946792 3933435 3932786 3845189 3753822 4057337 3938844 4491211
14469D491211l72575j03201M33181l41613P38746m27445K02979j99055J54687
$$ 4491211 4118636 4015435 4448616 4107003 4845749 4418304 4621283 4422228 4576915
14460D576915l1947N9364K1978k50939Q94263k72478j32132O2809K03029J66963
$$ 4576915 4544968 4604332 4626310 4375371 5269634 4997156 4865024 4927833 5130862 5297825
14450E297825o5562N8244l47793P15602P4759j53114K0879J27402J24093j52317
$$ 5297825 5232263 5290507 4942714 5658316 5733075 5579961 5600840 5728242 5852335 5700018
14440E700018L72465j98990m3809K53249M71765l09087L21842l85354N86206j24412
$$ 5700018 6072483 5873493 5829684 6082933 6554698 6245611 6567453 6182099 6768305 6643893
14430F643893p6596J99381L21809m7772p299L61789J39580o6717J85281K63852
$$ 6643893 6567297 6766678 7088487 7040715 7033416 7395205 7534785 7468068 7653349 7917201
14420G917201P5804j06659J32366K4063J41013L77332K7302J2521K20967j05049
$$ 7917201 7993005 7886346 8018712 8042775 8183788 8561120 8588422 8600943 8821910 8716861
14410H716861L68741j35586J36198L56262J36024R4805M40249j39644J56665L04608
$$ 8716861 9085602 8950016 9086214 9442476 9578500 9673305 10113554 9973910 10130575 10435183
14400A0435183J85056J08500J2615K44858p2206K25749J23464K01740L6369K39581
$$ 10435183 10620239 10728739 10741354 10986212 10914006 11139755 11263219 11464959 11501328 11740909
14390A1740909L41270J79881J62700L92270j6640O47010k11665K21012O12121
$$ 11740909 12082179 12262060 12424760 12817030 12800390 13447400 13235735 13456747 14068868
14381A4068868M5182Q63611k276L6381N51160j46674Q01401K40599J06721K61568
$$ 14068868 14114050 14977661 14975385 15011766 15562926 15416252 16217653 16458252 16564973 16826541
14371A6826541K16006O67698L6806O31593K54887M10310L81137M34553L31379
$$ 16826541 17042547 17710245 17747051 18378644 18633531 19043841 19424978 19859531 20190910
14362B0190910O06250O49213K71224P04576L02027L90961N26159M44643O50903
$$ 20190910 20797160 21446373 21717597 22422173 22724200 23115161 23641320 24085963 24736866
14353B4736866P26856O71548M15167P22284N76141O12739J186980M48945J065535
$$ 24736866 25463722 26135270 26550437 27272721 27848862 28461601 29648581 30097526 31163061
14344C1163061Q30764M11241J218285Q04096Q77877O91583J234226J180513J189536
$$ 31163061 31993825 32405066 33623351 34427447 35305324 35996907 37231133 38411646 39601182
14335C9601182Q49797J443154J362825R50824J355198J695373J369322J624078
$$ 39601182 40450979 41894133 43256958 44207782 45562980 47258353 48627675 50251753
14327E0251753J471453J886026J679372K005969J934522K149493K043920J837659
$$ 50251753 51723206 53609232 55288604 57294573 59229095 61378588 63422508 65260167
14319F5260167K806429K310556L031138K483633K544101L280777L514896L232488
$$ 65260167 68066596 70377152 73408290 75891923 78436024 81716801 85231697 88464185
14311H8464185L411147L753113M368398M164733M543631M514978N301359N480650
$$ 88464185 91875332 95628445 99996843 104161576 108705207 113220185 118521544 124002194
14303A24002194N409857O417223O404178O593552P550729P205048Q535049Q145390
$$ 124002194 129412051 135829274 142233452 148827004 156377733 163582781 172117830 180263220
14295A80263220R331570R703808J0262099J0424984J1421470J2043356J2532845
$$ 180263220 189594790 199298598 209560697 219985681 231407151 243450507 255983352
14288B55983352J2929383J3782652J4301837J4465607J4895152J5224501J5161981
$$ 255983352 268912735 282695387 296997224 311462831 326357983 341582484 356744465
14281C56744465J5348481J5144472J4146867J4042184J2169153J1507928R171920
$$ 356744465 372092946 387237418 401384285 415426469 427595622 439103550 448275470
14274D48275470N985537K153657J077955J37254k72127l003244o166842p261797
$$ 448275470 454261007 456414664 457492619 457629873 457357746 454354502 448187660 440925863
14266D40925863q611430r865216j1735896j2656931j3678544j4027143j5433955
$$ 440925863 432314433 422449217 410713321 398056390 384377846 370350703 354916748
14259C54916748j5301294j5567256j5154354j5089786j4852176j3866011j3445373
$$ 354916748 339615454 324048198 308893844 293804058 278951882 265085871 251640498
14252B51640498j2774167j1901797j1515434j0657844j0550458r876369r210266
$$ 251640498 238866331 226964534 215449100 204791256 194240798 184364429 175154163
14245A75154163q619400p576468q148776p362813n771614k584450p274506o245670
$$ 175154163 166534763 158958295 150809519 143446706 137675092 135090642 127816136 121570466
14237A21570466n209521n226810m958469m695584l928065l930603l648590l452243
$$ 121570466 116360945 111134135 106175666 101480082 97552017 93621414 89972824 86520581
14229H6520581l774266l183623l209612k894391k289483k855217k414914k344245
$$ 86520581 82746315 79562692 76353080 73458689 71169206 68313989 65899075 63554830
14221F3554830k036275k033455k241184j643021k097581j664036j749996j339645
$$ 63554830 61518555 59485100 57243916 55600895 53503314 51839278 50089282 48749637
14213D8749637j014802j661549j300318j322650j690875j038008k72111j027265
$$ 48749637 47734835 46073286 44772968 43450318 41759443 40721435 40449324 39422059
14205C9422059j672451j265176j183065o42675p02263m80101j024962j125842
$$ 39422059 37749608 36484432 35301367 34658692 33956429 33476328 32451366 31325524
14197C1325524r66161n96341r94930n30101n25852q65304k82428o66954j133271
$$ 31325524 30359363 29763022 28768092 28237991 27712139 26846835 26564407 25897453 24764182
14188B4764182l73463q24821m05239k36748p86153l37934n23912k95038k23602
$$ 24764182 24390719 23565898 23160659 22923911 22137758 21799824 21275912 20980874 20757272
14179B0757272r01588j97555n51571k95702l09226l31875l80160n31699j98900
$$ 20757272 19855684 19658129 19106558 18810856 18501630 18169755 17789595 17257896 17058996
14170A7058996k94636j93790o32042l1668l52129l76553j31805n50380l91329
$$ 17058996 16764360 16570570 15938528 15906860 15554731 15178178 15046373 14495993 14104664
14161A4104664M90107n91046l30246l02050m730n74355J14131k61872l36930K4011
$$ 14104664 14594771 14003725 13673479 13371429 13366699 12792344 12906475 12644603 12307673 12331684
14151A2331684l72476k14658l13904O2590k31195k49147k80093L0373j82536k50093
$$ 12331684 11959208 11744550 11430646 11493236 11262041 11012894 10732801 10763174 10580638 10330545
14141A0330545j87264k4695j32603l34635m52144J70239J50596l70380k9714p4550
$$ 10330545 10143281 10118586 9985983 9651348 9199204 9369443 9520039 9149659 9119945 9045395
14131I045395m42823L17456l71025Q4141j48438m02381K17534l87000J41799o48890
$$ 9045395 8602572 8920028 8549003 8633144 8484706 8082325 8299859 7912859 8054658 7405768
14121G405768L50175j44058k91996J10575L1820m06397K41350l16061O5372k37218
$$ 7405768 7755943 7611885 7319889 7430464 7462284 7055887 7297237 6981176 7046548 6809330
14111F809330J94772n13097J26158O5294l21520N1162j41944K88831m94039j80555
$$ 6809330 7004102 6491005 6617163 6682457 6360937 6412099 6270155 6558986 6064947 5884392
14101E884392R2903k93562K919m0358n0329m3239J33192r7963J89743m07263j38212
$$ 5884392 5977295 5683733 5686652 5646294 5595965 5552726 5685918 5587955 5777698 5370435 5232223
14090E232223j81830J21048j50056O6330p911l20365J35522J549J06097k84909
$$ 5232223 5050393 5171441 5021385 5087715 5079804 4759439 4894961 4896510 5002607 4717698
14080D717698M1275m3248j48268J18584r3802k47415j94488Q485L38685K6429
$$ 4717698 4758973 4715725 4567457 4686041 4592239 4344824 4150336 4158821 4497506 4523935
14070D523935k12301p1108r8897j58061M8104k97758j49319N73109l15082M04143
$$ 4523935 4311634 4240526 4141629 3983568 4031672 3733914 3584595 4157704 3842622 4246765
14060D246765n33776K55783k64287J02099j25539j58928L0467p079J85439J07920
$$ 4246765 3712989 3968772 3704485 3806584 3681045 3522117 3552584 3545505 3730944 3838864
14050C838864o59761K51998j35405M2281j2959k25986M1416L31383j29368K12041
$$ 3838864 3179103 3431101 3295696 3337977 3325018 3099032 3140448 3471831 3342463 3554504
14040C554504k66258j14015L8991l60153O76037p55838K29582J23233j71951J11512
$$ 3554504 3288246 3174231 3213222 2853069 3529106 2773268 3002850 3126083 2954132 3065644
14030C065644k64348R683K243k55831L70145j11321K69970r4650m34186N07083
$$ 3065644 2801296 2810979 2813222 2557391 2927536 2816215 3086185 2991535 2557349 3064432
14020C064432j67753n80355J78839l08057K97454p521r3530J93803o56938L19005
$$ 3064432 2896679 2316324 2495163 2187106 2484560 2477039 2383509 2577312 1920374 2239379
14010B239379R9257K70013k97571L26662l65576q1294j55952l72407O49835j60316
$$ 2239379 2338636 2608649 2311078 2637740 2272164 2190870 2034918 1662511 2312346 2152030
14000B152030j63981K87154j78881j19606k2634p4422p711J17853M99349l10590
$$ 2152030 1988049 2275203 2096322 1976716 1954082 1879660 1871949 1989802 2489151 2178561
13990B178561M13240M51488K516432M932211J6095327K3530801k2524134A3711049
$$ 2178561 2591801 3043289 5559721 10491932 26587259 50118060 27593926 13711049
13981H567812k543981j063224j098044l35369Q3097o49650p2046j81754K58115
$$ 8567812 6023831 4960607 3862563 3527194 3610291 2960641 2888595 2706841 2964956
13972B964956n99449J82672J21493k89524J52237j18763o2427R4774n9266j51396
$$ 2964956 2365507 2548179 2669672 2380148 2532385 2413622 2351195 2445969 2386703 2235307
13962B235307j01027j59809R7551J59758m00941l5026K71185m03306J83585J63019
$$ 2235307 2134280 1974471 2072022 2231780 1830839 1795813 2066998 1663692 1847277 2010296
13952B010296N5970j96494p2470j93083O15708l92778M4408K8087j42909K09673
$$ 2010296 2066266 1869772 1797302 1604219 2219927 1827149 1871557 1899644 1756735 1966408
13942A966408m03981K52408l75858L92331k52794p0269p799J04296k88574L96875
$$ 1966408 1562427 1814835 1438977 1831308 1578514 1508245 1500446 1604742 1316168 1713043
13932A713043K8444j20230Q2919p9116J2241O063J0043k58782K54841r7658o465
$$ 1713043 1741487 1621257 1704176 1625060 1637301 1643364 1653407 1394625 1649466 1551808 1545343
13921A545343j2118K01179l60618o0962K57887k43515Q5801O1597J90161l46269
$$ 1545343 1533225 1734404 1373786 1312824 1570711 1327196 1412997 1474594 1664755 1318486
13911A318486L03188n0889l10495K30608j14169j09713K84785m30232L31743L9125
$$ 1318486 1621674 1570785 1260290 1490898 1376729 1267016 1551801 1121569 1453312 1492437
13901A492437O4356k29616K61493j38052k18619K13836k52395K21038j62263J79801
$$ 1492437 1556793 1327177 1588670 1450618 1231999 1445835 1193440 1414478 1252215 1432016
13891A432016k05214J95580o7974J08974j92783j52456j73171M06822m94629L91860
$$ 1432016 1226802 1422382 1354408 1463382 1270599 1118143 944972 1351794 857165 1249025
13881A249025j15923q9875J72430k57703M48392j92513m4743j27688K49861k50858
$$ 1249025 1133102 1043227 1215657 957954 1406346 1213833 1169090 1041402 1291263 1040405
13871A040405o0586L95344l78354P4119J8785m7288K07023l41233K06207j1632
$$ 1040405 979819 1375163 996809 1070928 1089713 1042425 1249448 908215 1114422 1102790
13861A102790k91046K69023K15785j20148k49586K63988k34295j29625L45254
$$ 1102790 811744 1080767 1296552 1176404 926818 1190806 956511 826886 1172140
13852A172140j37288O6700K1906j30956J08022k14182L69760l48664k03496o4767
$$ 1172140 1034852 1101552 1123458 992502 1100524 886342 1256102 907438 703942 639175
13842F39175O3136K98100K73019N4499l77940J717l28594J80356L79563l60301
$$ 639175 702311 1000411 1273430 1327929 949989 951706 623112 803468 1183031 822730
13832H22730J67681K39454k44556R8637j785q0621j98859j00026J42164J86776
$$ 822730 990411 1229865 985309 1083946 1082161 1001540 802681 702655 844819 1031595
13822A031595k0363D96057L02546j38713M25480J83398E63792K02967o8784J47615
$$ 1031595 1011232 496057 798603 659890 1085370 1268768 563792 766759 697975 845590
13812H45590j79532J74988k74218K22017J83610l00025K55919k45058p3045Q8566
$$ 845590 666058 841046 566828 788845 972455 672430 928349 683291 610246 698812
13802F98812m30J63037m9328j63842k7704K80570j76053N9053j00294K91228r6119
$$ 698812 698382 861419 812091 648249 620545 901115 725062 784115 683821 975049 878930
13791H78930j83686J37516n9389k17956P5393M62698k71235j12876j2587l4200
$$ 878930 695244 832760 773371 555415 630808 1093506 822271 709395 696808 662608
13781F62608J17691J1624k3620Q3056L8772k54127L45672m11451N7454L94635
$$ 662608 780299 791923 768303 851359 890131 636004 981676 570225 627679 1022314
13771A022314j57877C24746M10608j51654L05125k80801j02681L44135l97443
$$ 1022314 864437 324746 735354 583700 888825 608024 505343 849478 452035
13762D52035L06365k18791Q1425K17198Q82p4510l00270J37529n1192K42635k44195
$$ 452035 758400 539609 621034 838232 839114 764604 464334 601863 550671 793306 549111
13751E49111J21320j57606M66310l32556l044K4131J68936m02247K32086C23165
$$ 549111 670431 512825 979135 646579 643535 667666 836602 434355 666441 323165
13740E65926N6354o3027J13172B11181M57924j06689o9325R7935j62171K69047
$$ 565926 622280 559253 672425 211181 669105 562416 493091 591026 428855 697902
13730F97902j09858k41322M42689k92626m4517N3118j7130K15337k56165r8708
$$ 697902 588044 346722 789411 496785 452268 505386 488256 703593 447428 348720
13720C48720M6417R5767p3230J84874k86122K22816J77668k25143J91265r9371
$$ 348720 395137 490904 417674 602548 316426 539242 716910 491767 683032 583661
13710E83661j77791M33004m00884L5145j91564K02386j46383L87624l38442J29963
$$ 583661 405870 838874 437990 473135 281571 483957 337574 725198 386756 516719
13700E16719j44467K15993N0833p016j27589J21189J3723A86474L36201J23234
$$ 516719 372252 588245 639078 632062 504473 625662 639385 186474 522675 645909
13690F45909l14025M3394M48646l69531N24685D41624K7028j84400L95694j42404
$$ 645909 331884 375278 823924 454393 979078 441624 468652 284252 679946 537542
13680E37542B57056L86306j04109k41446K00142K9615k52641M2098r0849L92176
$$ 537542 257056 643362 539253 297807 497949 527564 274923 317021 226172 618348
13670F18348k20142N2385k22919q832K98611J62180j88991P1055K72830l00197
$$ 618348 398206 450591 227672 218840 517451 679631 490640 561695 834525 534328
13660E34328j46073j14388L10123k29306l5381J40778J2760j17846J47453Q5592
$$ 534328 388255 273867 583990 354684 319303 460081 472841 354995 502448 588040
13650E88040B91043J59633j22478j41046L82282k63749J29191O9967Q1764j47294
$$ 588040 291043 450676 328198 187152 569434 305685 434876 504843 586607 439313
13640D39313A09401J93055n0326L36407j27084J3295J48046j00948j36002K52232
$$ 439313 109401 302456 252130 588537 461453 474748 622794 521846 385844 638076
13630F38076j09903j44790K12907k90020l9353L12690L3425J3571G0348L90842
$$ 638076 528173 383383 596290 306270 266917 579607 613032 626603 70348 461190
13620D61190j53911Q7690j86876l9947J41640L18179B63030L84274j23716k22832
$$ 461190 307279 394969 208093 168146 309786 627965 263030 647304 523588 300756
13610C00756K89355J39593B71999k6769J41317J86157J3510B24124n3606K76131
$$ 300756 590111 729704 271999 245230 386547 572704 586214 224124 170518 446649
13600D46649J07392k03097A16548L63212D2244R1263K71403k3831j09829L2075
$$ 446649 554041 350944 116548 479760 42244 133507 404910 381079 271250 303325
13590C03325A04799d3937A09831K95932j59958J34949H8789K04272r1911J82511
$$ 303325 104799 -43937 109831 405763 245805 380754 88789 293061 201150 383661
13580C83661J38172A60902n6038K54345J03567j39037J16326R3028j57113j2119
$$ 383661 521833 160902 104864 359209 462776 323739 440065 533093 375980 363861
13570C63861j36522N9696R9916a15917C71746A41268K24878A74407N1664J37373
$$ 363861 227339 287035 386951 -115917 371746 141268 366146 174407 226071 363444
13560C63444J79508j16001m4495j59495Q2424J195H171P7579c7837C27989K55632
$$ 363444 542952 426951 382456 222961 305385 306580 8171 85750 -37837 327989 583621
13549E83621k51630K22766J46537l08679A5661M40952j12637K12711B48079K1027
$$ 583621 331991 554757 701294 392615 15661 456613 343976 556687 248079 269106
13539B69106k8909I1913C3705K86206K20083j79741m8158J80492j58409A40742
$$ 269106 240197 91913 33705 319911 539994 360253 312095 492587 334178 140742
13528a30739F8814L76923l0505r7424K643p138k6972r8716L8246k4265J64057
$$ -130739 68814 445737 415232 317808 320451 313313 286341 187625 225871 201606 365663
13517C65663j12645J2094J58548j48394p9845J8816L9592K37873A55710j7215
$$ 365663 253018 265112 423660 275266 195421 214237 253829 491702 155710 138495
13507A38495A259M30807j34959J87510J0694j90445P495O5221I9556L23120A22650
$$ 138495 1259 432066 297107 484617 495311 304866 312361 377582 99556 422676 122650
13495B17549L3492L9563p0621P6011p8600j1504m0343E4681K57566j9213J0843
$$ 217549 251041 290604 219983 295994 217394 205890 165547 54681 312247 293034 303877
13484C03877A34227J02100R8775A5633K95159J12330J62350B14432L12318A61989
$$ 303877 134227 236327 335102 15633 310792 423122 585472 214432 526750 161989
13473B74786R9118q0158j01195J4777K18273f0685A63919k3380A5712K47793O6625
$$ 274786 373904 293746 192551 207328 425601 -60685 163919 140539 15712 263505 330130
13462C30130j08765L72338A24805M669O4355P8269h2094C49795A70973o3397K01195
$$ 330130 221365 593703 124805 129474 193829 272098 -82094 349795 170973 107576 308771
13451C08771A44184J21996p8636g2599C09388q5673J98704p4946m3442g7932A39396
$$ 308771 144184 266180 187544 -72599 309388 223715 422419 347473 304031 -77932 139396
13439B93607A226J41488K98068R6300a95247B07533K00296j86517J83213j21739
$$ 293607 1226 142714 440782 537082 -195247 207533 407829 221312 404525 282786
13429B82786P5180c6560B87119L09040A50110F6323K2546J19365K52828B17129
$$ 282786 357966 -36560 287119 596159 150110 66323 88869 208234 461062 217129
13418D25048A92513m5511R1266A5058O898K60308a0939F7860J66713j1892J52972
$$ 425048 192513 147002 238268 15058 21956 282264 -10939 67860 234573 222681 375653
13407C75653r9984j01057J57203k858j1627k5454o9809H8968O2211b07569D172
$$ 375653 275669 174612 331815 328957 317330 291876 222067 88968 151179 -207569 4172
13395A53642J87877c54438B42503K41132B12429k4946n1992K32761F7215P2764
$$ 153642 341519 -354438 242503 483635 212429 187483 135491 368252 67215 139979
13385A39979J31596L4029I0558L39303k06492c93762E35303A81042k0876h8887
$$ 139979 271575 305604 90558 429861 223369 -393762 535303 181042 160166 -88887
13374C84146L7092A59142J8377H439L66611K3847I726h4249A35055K12038A08825
$$ 384146 421238 159142 177519 8439 375050 398897 9726 -84249 135055 347093 108825
13362B25790q1798P9392J39307j09407a49422B6320R9621b39306B58347g4118
$$ 225790 143992 223384 362691 253284 -149422 26320 125941 -239306 258347 -74118
13351c15759E5363A0907K21140n1121b36045C80220N6142A26747l7114K17474
$$ -315759 55363 10907 232047 180926 -236045 380220 436362 126747 89633 307107
13341C07107L4465j39020J2346H2037K45946G5432K51559p3392E2312J43433K0204
$$ 307107 341572 202552 214898 82037 327983 75432 326991 253599 52312 195745 215949
13330B15949a8163C2434J74271c6811C11981l0018L02330k59351E3258L7751j2797
$$ 215949 -18163 32434 206705 -36811 311981 281963 584293 324942 53258 91009 78212
13319G8212J25679J8952a19172F0010f3749B42276r2705N5721j6595K23430j44497
$$ 78212 203891 222843 -119172 60010 -63749 242276 149571 205292 188697 412127 267630
13308B67630A09155J6766J41024j17156L3819n4697a10402E14256G3307M6069
$$ 267630 109155 125921 266945 149789 183608 128911 -110402 514256 73307 119376
13298A19376K25719C4157e1949A0877J39039K89110j65431A27221J3890b00770
$$ 119376 345095 34157 -51949 10877 149916 439026 273595 127221 141111 -200770
13287B20825i1936A90194b4916A8407o607M25326a63552B44288F3403K49688D6516
$$ 220825 -91936 190194 -24916 18407 11800 437126 -163552 244288 63403 313091 46516
13275B38121j15384d8971k57639C53497I9555a31197F7438K63256a43097H2818
$$ 238121 122737 -48971 -306610 353497 99555 -131197 67438 330694 -143097 82818
13264F076O5154L01713A34441D6633M4085J0153d5062B01316n2407A9771b02096
$$ 6076 71230 372943 134441 46633 90718 100871 -45062 201316 148909 19771 -202096
13252d7745K0798A1383K30973J31669j82812R927K4817J19773a09700A57901p5987
$$ -47745 -26947 11383 242356 374025 191213 201140 225957 345730 -109700 157901 81914
13241H1914m0122K49841D0321R760n098j1748a04721B19186q6514h0279a1521
$$ 81914 41792 291633 40321 50081 44983 33235 -104721 219186 132672 -80279 -11521
13229A33937b74355H1654K15809j08753h2762C78828E6114M08060A58242K88085
$$ 133937 -274355 81654 297463 188710 -82762 378828 56114 464174 158242 446327
13219D46327A62939E6433J06086o817M9613L9308J01416b10326B5886A2767a2671
$$ 446327 162939 56433 162519 155702 205315 244623 346039 -210326 25886 12767 -12671
13207A02715O0913J39033H1910j2210K0686K10583k1563F1455J13916J0574M9490
$$ 102715 163628 302661 81910 69700 90386 300969 279406 61455 175371 185945 235435
13196B35435e0630B35481b09467C65927j78058d7963C11832a1500j164j35863
$$ 235435 -50630 235481 -209467 365927 187869 -47963 311832 -11500 -12664 -148527
13186a48527B64799j14883K03705N8591r6031a06587L0307B77443f6154A34951
$$ -148527 264799 149916 353621 412212 316181 -106587 -76280 277443 -66154 134951
13175A06172D6424M6365L1521B5126h2669B57056b36721F7734N1361b7483A06975
$$ 106172 46424 92789 124310 25126 -82669 257056 -236721 67734 119095 -27483 106975
13163C05064G9322L3792D5090K3716R0803J90889a4861G2294R2440B9791J46537
$$ 305064 79322 113114 45090 68806 159609 350498 -14861 72294 164734 29791 176328
13152A76328o9677J54084j12340i7689o1299o5404B07511n7239a45944f4218A60917
$$ 176328 106651 260735 148395 -97689 -158988 -224392 207511 150272 -145944 -64218 160917
13140a29121b3972D4275a4895C33056a57225c340k03311R3424F8443a90648F1590
$$ -129121 -23972 44275 -14895 333056 -157225 -3340 -206651 -113227 68443 -190648 61590
13128h8754B47326H3474Q0320L07500A52120a77593I9055a2512B7487K96098a59242
$$ -88754 247326 83474 163794 471294 152120 -177593 99055 -12512 27487 323585 -159242
13116a6124k5629l8152j37060A39814c7537B71219C1237a1271r1170A8426N6886
$$ -16124 -41753 -79905 -216965 139814 -37537 271219 31237 -11271 -102441 18426 75312
13105G5312J58874b39771A22191a46826B40348a06462A5304L80016a58252C05215
$$ 75312 234186 -239771 122191 -146826 240348 -106462 15304 395320 -158252 305215
13094a3254B45936e6007B54309A1748d9667B39290I694c9804r396q0850A22334
$$ -13254 245936 -56007 254309 11748 -49667 239290 9694 -39804 -49200 -130050 122334
13082g6638b4744j5627j12370A48602K67097H6420h000E1367K46928E9025N1851
$$ -76638 -24744 -40371 -152741 148602 415699 86420 -8000 51367 298295 59025 110876
13071A10876K0189a83345B25143h0143A28149C9907N0682G029b67595F2047L53901
$$ 110876 131065 -183345 225143 -80143 128149 39907 90589 7029 -267595 62047 415948
13060D15948A43126f7394D052N859c24175J12298G147a09166A16584l3831g281
$$ 415948 143126 -67394 4052 9911 -324175 -211877 7147 -109166 116584 82753 -7281
13048a9161j16930A3943d0923Q221l99164e2510B48514j00526l1145a28890d8864
$$ -19161 -136091 13943 -40923 -32702 -431866 -52510 248514 147988 116843 -128890 -48864
13036A36599a5288I6203N8601A089Q789a05593B67570r3400m9855g0112A33792
$$ 136599 -15288 96203 154804 1089 9878 -105593 267570 174170 124315 -70112 133792
13024A13776k6067N7920C1430a31633A72184n9342d1180m3127D2569K40700a61815
$$ 113776 87709 145629 31430 -131633 172184 112842 -41180 -84307 42569 283269 -161815
13012b25505F783J48532j3024J60022K2788c2002n0064a6501B65745a46141D93980
$$ -225505 6783 155315 142291 302313 325101 -32002 -82066 -16501 265745 -146141 493980
13000b2484A57608K50274l8610j26273c6061B19280n6013b5812B5194a45820O2589
$$ -22484 157608 407882 369272 242999 -36061 219280 163267 -25812 25194 -145820 -83231
12989h3231k21771J17832a9902B56264C5537J32234n1734J3469J49979a22958
$$ -83231 -305002 -187170 -19902 256264 35537 167771 116037 129506 279485 -122958
12978D76404A23154e9616I1962f0463q1721A84996m3390m3050e9277A17428c794
$$ 476404 123154 -59616 91962 -60463 -142184 184996 141606 98556 -59277 117428 -3794
12966a01350j27015B1987J2372K56820b040A42383j9824a39728A63848K8615g7611
$$ -101350 -228365 21987 34359 291179 -2040 142383 122559 -139728 163848 192463 -77611
12954A59899a93935N1003l7130e9102B3668P0883h7823C7140G173R0822J49038
$$ 159899 -193935 -142932 -180062 -59102 23668 94551 -87823 37140 7173 97995 247033
12943B47033n4623D6250b29379A15814C3656Q3345N0790c9201k105l57878J87781
$$ 247033 192410 46250 -229379 115814 33656 117001 167791 -39201 -41306 -399184 -211403
12932b11403A15154d9717I1521e7102A15743a72635E370K32714d0334p6640I8244
$$ -211403 115154 -49717 91521 -57102 115743 -172635 5370 238084 -40334 -116974 98244
12920A21386D1882J42059f3743L1260A44085m2265b06954A48133f3981B89208
$$ 121386 41882 183941 -63743 -32483 144085 101820 -206954 148133 -63981 289208
12909B95103d7267A89233B5225a72951f6510A5127J85094R52I9783N7611a00030
$$ 295103 -47267 189233 25225 -172951 -66510 15127 200221 201173 99783 157394 -100030
12897h4532A34547a28183A7843Q8073a42586e82k21240B60452F8522e4207B01166
$$ -84532 134547 -128183 17843 105916 -142586 -582 -221822 260452 68522 -54207 201166
12885a4086K768F4686f5575A25752a05476C30723f3628j73256C89685g3556m0269
$$ -14086 -11318 64686 -65575 125752 -105476 330723 -63628 -236884 389685 -73556 -113825
12874a13825B21804C3358J49408D8547J32783b4408A21214A8097c37810A36216
$$ -113825 221804 33358 182766 48547 181330 -24408 121214 18097 -337810 136216
12863a51936A21069A7275a80731a049j0963C15619j07481B3633d6600A21929b163
$$ -151936 121069 17275 -180731 -1049 -12012 315619 208138 23633 -46600 121929 -2163
12851C70263a9896j43814a13j37782b8740A3938b82154A91066c55071J54271N8098
$$ 370263 -19896 -163710 -113 -137895 -28740 13938 -282154 191066 -355071 -200800 -142702
12840a42702j41101N9241l4552A76922m5401j0203a99946i1038C67613a14343
$$ -142702 -283803 -224562 -259114 176922 131521 121318 -199946 -91038 367613 -114343
12829A38363O3844a03926H5021k2238J45390f5948m9830c1148A51235E5176d6682
$$ 138363 202207 -103926 85021 62783 208173 -65948 -115778 -31148 151235 55176 -46682
12817c21845a10725m7520f644k13774j83638A95376K71336f2804p7077A22947
$$ -321845 -110725 -158245 -6644 -220418 -404056 195376 466712 -62804 -139881 122947
12806C1083b25968r5331a18601p9247E0311a3549C00588d3493r3103f8024m8736
$$ 31083 -225968 -321299 -118601 -197848 50311 -13549 300588 -43493 -136596 -68024 -116760
12795a16760J293m183a708k99872A54992o6441f3101E1527a59268E7625a1416
$$ -116760 -115467 -119650 -1708 -301580 154992 88551 -63101 51527 -159268 57625 -11416
12783A92077b28395C3904J83668J4368f1709F1065a51329I9114C1252K7066J22667
$$ 192077 -228395 33904 217572 231940 -61709 61065 -151329 99114 31252 58318 180985
12772A80985J41672A34461d09394B80638I5709b45824k48319a20027n3934B36788
$$ 180985 322657 134461 -409394 280638 95709 -245824 -494143 -120027 -173961 236788
12761A26319E5120c18824a37089c7194J7567k76006D0712d94312a07783k90651
$$ 126319 55120 -318824 -137089 -37194 -19627 -295633 40712 -494312 -107783 -398434
12751c98434D9889L2000a69367B73514I4274b08034A67688G8736c9474j57260
$$ -398434 49889 81889 -169367 273514 94274 -208034 167688 78736 -39474 -196734
12741a96734D3048b88767B10349D2073O959h4269A13758b2612A22147c4376j54846
$$ -196734 43048 -288767 210349 42073 49032 -84269 113758 -22612 122147 -34376 -189222
12730a89222j16861h5366M810k11527C03586i6221M7275B74397h3401C99123D7947
$$ -189222 -306083 -85366 -80556 -292083 303586 -96221 -48946 274397 -83401 399123 47947
12718B12998A8843K93054D8226a80940k83d9721j57911b5410Q108r7832B1900
$$ 212998 18843 311897 48226 -180940 -181223 -49721 -207632 -25410 -17302 -115134 21900
12706A69096b6375E9233h7034N912B83412A22894b15161h1663A25071J41651A2436
$$ 169096 -26375 59233 -87034 -81122 283412 122894 -215161 -81663 125071 266722 12436
12694B56814F8384C1066a42459F5733J01323C1370J80730a43101G2863K6119C1740
$$ 256814 68384 31066 -142459 65733 167056 31370 212100 -143101 72863 98982 31740
12682C07646j09877a25429E6408K276c4044A37437h7037k25526L7433B62827B3437
$$ 307646 197769 -125429 56408 58684 -34044 137437 -87037 -312563 -275130 262827 23437
12670g0390b6497B07267c2465j26197c5012G5101L03084A18652J36065r0551e53
$$ -70390 -26497 207267 -32465 -158662 -35012 75101 378185 118652 254717 164166 -553
12658B94858A22571J21448N2010k2362K24960c0606A01854B8330P9539a77404
$$ 294858 122571 244019 296029 273667 498627 -30606 101854 28330 107869 -177404
12647C24322A54172A2160J41412F24b44267A33452l9611J23505c9198f359D9869
$$ 324322 154172 12160 153572 624 -244267 133452 93841 217346 -39198 -6359 49869
12635A20596B9916h9233c3390B20011Q708o5529O9428o227o2990a02087B45520
$$ 120596 29916 -89233 -33390 220011 228719 163190 232618 226391 163401 -102087 245520
12623B12310J65872a0300q7450E3730N07438e3948j6757A6465L62619a49908D5578
$$ 212310 378182 -10300 -97750 53730 561168 -53948 -70705 16465 379084 -149908 45578
12611d0804A54686a12090a7686A38260a7902A14414M3919e644I2189J76829k0301
$$ -40804 154686 -112090 -17686 138260 -17902 114414 158333 -5644 92189 269018 248717
12600B48717a50984B64077l4653J27802a372A85467L01769a11101H5372a69147
$$ 248717 -150984 264077 229424 357226 -1372 185467 487236 -111101 85372 -169147
12589e58602B42972A0388a23157A83064b32565i9141k6794k4366G2036A8782K8754
$$ -558602 242972 10388 -123157 183064 -232565 -99141 -125935 -150301 72036 18782 47536
12578D7536J11543e8318j23391B40132E5361J08943A3177a06807H0853f0324A41065
$$ 47536 159079 -58318 -181709 240132 55361 164304 13177 -106807 80853 -60324 141065
12566c24517c8735j61400B08225h7835H2126A1737a61291M2192B84195D8206b1828
$$ -324517 -38735 -200135 208225 -87835 82126 11737 -161291 -119099 284195 48206 -21828
12554b42388O4798C55035j33282D2652a98039O3834A07062c6959j64242j19539
$$ -242388 -177590 355035 221753 42652 -198039 -134205 107062 -36959 -201201 -320740
12544c20740I5551a12604j86675b8878l24484J40069A66527m6665P5732b5756
$$ -320740 95551 -112604 -299279 -28878 -353362 -213293 166527 119862 195594 -25756
12533c01638C70610k1841N8030A87311G0113J06375O1326a57218M3907j6845c8245
$$ -301638 370610 348769 406799 187311 70113 176488 237814 -157218 -113311 -130156 -38245
12521a28654A13647J76701a38188m4449f1369F8318a76864L2272A29846b07021
$$ -128654 113647 290348 -138188 -182637 -61369 68318 -176864 -144592 129846 -207021
12510E2465B0659b4877l32654a15683b8909j36176C44959j44751J79925J09439
$$ 52465 20659 -24877 -357531 -115683 -28909 -165085 344959 200208 380133 489572
12500D89572A10890J61920r6806D2218f0810n8801A5087J2340J08668i8178J4694
$$ 489572 110890 272810 176004 42218 -60810 -119611 15087 27427 136095 -98178 -83484
12489h3484B42727p3941C9845f6467k01582b7786A9478N1836K69669a81651n4809
$$ -83484 242727 168786 39845 -66467 -268049 -27786 19478 71314 340983 -181651 -236460
12478b36460E681b82844K5944C61112G4528J49395g5775C98669j92914j5679B0956
$$ -236460 5681 -282844 -256900 361112 74528 223923 -75775 398669 205755 190076 20956
12466C47833A34558a13625A590K7988e0841A90257K432a20393b0626C6544M1959
$$ 347833 134558 -113625 1590 29578 -50841 190257 192689 -120393 -20626 36544 78503
12455G8503f9287A40405c73719a01072B20806J44289G1223a62890b2478j01759
$$ 78503 -69287 140405 -373719 -101072 220806 365095 71223 -162890 -22478 -124237
12445a24237D46320D905K72199r8271b72404A15400i5476D6629a51875j24874
$$ -124237 446320 4905 277104 178833 -272404 115400 -95476 46629 -151875 -276749
12435b76749n6521F4338M5490B0956J32340M8089h8072A87813k8699B4822K2180
$$ -276749 -333270 64338 109828 20956 153296 201385 -88072 187813 159114 24822 47002
12424D7002a38751l4836B94528a52571b0026A07988c24383d1397q5685E0405e9938
$$ 47002 -138751 -173587 294528 -152571 -20026 107988 -324383 -41397 -127082 50405 -59938
12412B34756j3673b4097A02171h8301a1583G3738J77805H594a91504A43050a87081
$$ 234756 221083 -24097 102171 -88301 -11583 73738 251543 8594 -191504 143050 -187081
12400B29551c05534L7637C1742c3534D2390b47752C82938a15161C18148e9600
$$ 229551 -305534 -267897 31742 -33534 42390 -247752 382938 -115161 318148 -59600
12389D7149N8828d7103k0242A46048B4407J40255F4442Q5598a87128a1852k48290
$$ 47149 105977 -47103 -67345 146048 24407 164662 64442 150040 -187128 -11852 -260142
12378b60142o312B67753N7240A62000a23228j05374B40567m8210C3771R60a50788
$$ -260142 -266454 267753 324993 162000 -123228 -228602 240567 192357 33771 34731 -150788
12366C10436j22379G7776J33787M5096a35960k10989I7176j9361a45843p7521
$$ 310436 188057 77776 211563 256659 -135960 -346949 97176 77815 -145843 -223364
12356b23364P0345A74369N5537a86628B31834I034e3563H7971g502E5348J52239
$$ -223364 -153019 174369 229906 -186628 231834 9034 -53563 87971 -7502 55348 207587
12345B07587P0928l9961f6547D34285a2105A2352Q5843b3214m7703B77165a40865
$$ 207587 278515 238554 -66547 434285 -12105 12352 98195 -23214 -70917 277165 -140865
12333A32360A9637Q5194M37912k15417r615a80358A14500f2141D35979j21593
$$ 132360 19637 104831 542743 327326 317711 -180358 114500 -62141 435979 314386
12323C14386q0894K4580D6204R5841I597Q3239K47146A64365l234J01469a83252
$$ 314386 233492 258072 46204 142045 9597 92836 339982 164365 161131 262600 -183252
12311B3687J53991F6158E020P0224a21657A32319K43907e0217H5164J19263a11465
$$ 23687 177678 66158 5020 75244 -121657 132319 376226 -50217 85164 204427 -111465
12299E8970E972J00332a44969j7731A44107A7797L4726J00163a92613C3426Q7335
$$ 58970 5972 106304 -144969 -162700 144107 17797 52523 152686 -192613 33426 120761
12288A20761j1673a26335l8311B98276A48544a386A93973b52543F584J84783r4097
$$ 120761 109088 -126335 -164646 298276 148544 -1386 193973 -252543 6584 191367 97270
12277I7270R704M36R5718c6393b697j16420p066e1039E929J48936n5691a53113
$$ 97270 106974 107410 203128 -36393 -2697 -119117 -126183 -51039 5929 154865 99174 -153113
12264b69141B65399J85451c6783a1518E0159b99100B1613c7253a7747o9387K0828
$$ -269141 265399 450850 -36783 -11518 50159 -299100 21613 -37253 -17747 -87134 -66306
12253f6306n5397A91710f512B49795n5282a13970D22269f9291A62810J65678b5146
$$ -66306 -121703 191710 -6512 249795 194513 -113970 422269 -69291 162810 328488 -25146
12241A65468a9535A22153d5074o5995c8627B11321o3491o4679L28438B2472R2726
$$ 165468 -19535 122153 -45074 -111069 -38627 211321 147830 83151 411589 22472 115198
12230A15198J04830E2265L4429M30573j20137A45413M4485O8394j6523F1551K82818
$$ 115198 220028 52265 86694 517267 397130 145413 189898 258292 241769 61551 344369
12219C44369k9290Q6225j95420J07164A55049L11344B27918F4045N5722K015L0156
$$ 344369 315079 401304 205884 313048 155049 466393 227918 64045 119767 121782 151938
12208A51938N8486e4583E5411N9224K29520j62840a9394A70530M5713E0301D262
$$ 151938 210424 -54583 55411 114635 344155 181315 -19394 170530 216243 50301 4262
12196C31037r275L5991C1017L32126j19182M01008k63725l2907K3846A83977H8535
$$ 331037 321762 357753 31017 363143 243961 644969 381244 348337 372183 183977 88535
12184F10084a32595D30088r3250j33103H2918d679A60375O4440e84A98816b2936
$$ 610084 -132595 430088 336838 203735 82918 -4679 160375 224815 -584 198816 -22936
12172E62453B67294c7160A08081M90934B00396A5618K84375j07158K1599N0458
$$ 562453 267294 -37160 108081 599015 200396 15618 299993 192835 214434 264892
12162B64892E6510E056M83294A14971J16370O8877o7987j09862L21057A22539
$$ 264892 56510 5056 488350 114971 231341 300218 232231 122369 443426 122539
12151B00856d3881D0213c42740B48285H0317J45778K50287B16770L738k0081b001
$$ 200856 -43881 40213 -342740 248285 80317 226095 476382 216770 220508 200427 -2001
12139C50635A14572P5064b9031C1762a05335A46941F5659J96167K89787H0408
$$ 350635 114572 189636 -29031 31762 -105335 146941 65659 261826 551613 80408
12128A40047M07183k60429p4310e3729C72676F8277J05932J54916j50859b2309
$$ 140047 547230 286801 212491 -53729 372676 68277 174209 329125 178266 -22309
12117D5037h9547A47957o6612k0610K67306A16001K5793E1103J15946N1048a19282
$$ 45037 -89547 147957 81345 60735 328041 116001 141794 51103 167049 218097 -119282
12105B7160a05197o321B15942f8104G7856J39574b08597I24a87903A17658R334
$$ 27160 -105197 -111518 215942 -68104 77856 217430 -208597 924 -187903 117658 126992
12094A26992R4749A01303f4838B02357O5910L4454a02001j9671A29276Q3489f9424
$$ 126992 221741 101303 -64838 202357 268267 302721 -102001 -121672 129276 212765 -69424
12082g4983K2504m04562g0272j59339i6250D9940a95841j82047f6974G384R096
$$ -74983 -52479 -457041 -70272 -229611 -96250 49940 -195841 -377888 -66974 7384 16480
12071A6480J1068L9284J27428I21b28142F616M69125e1696a8684I5740l0350j8036
$$ 16480 27548 66832 194260 921 -228142 6616 475741 -51696 -18684 95740 65390 47354
12059D7354K27571l2979c5260l2221Q647c807j664C3798d42326f4414I493N9823
$$ 47354 274925 241946 -35260 -67481 -58834 -3807 -5471 33798 -442326 -64414 9493 69316
12047F9316d5601A8000f3973B31462N0126l1798a66871N206b451k30304B7775
$$ 69316 -45601 18000 -63973 231462 281588 249790 -166871 -161665 -2451 -232755 27775
12035g1561J9163l3959B02744A9690K24620a48920A3385M0445L6306a50136e0447
$$ -71561 -52398 -86357 202744 19690 244310 -148920 13385 53830 90136 -150136 -50447
12023B06096J22796d6961o4588c2501A02019a33988j5503j17958B7242b12004
$$ 206096 328892 -46961 -111549 -32501 102019 -133988 -149491 -267449 27242 -212004
12012a21932A27116R35J10116m2993D2299a59813A03049e96738f7123H5215b25653
$$ -121932 127116 128051 238167 195174 42299 -159813 103049 -596738 -67123 85215 -225653
12000h8191j45675P0698d4523A70370B712a82436l43070A5880b37668N2272i221
$$ -88191 -233866 -163168 -44523 170370 2712 -182436 -525506 15880 -237668 -185396 -9221
11988c9558A83934k4134M855b6566m8968n2474D78316B24644D5857J28848b62045
$$ -39558 183934 159800 164655 -26566 -75534 -128008 478316 224644 45857 174705 -262045
11976a25950j53190B07188a62430A53620G4983f9815a2825I0605D503a02962K9021
$$ -125950 -279140 207188 -162430 153620 74983 -69815 -12825 90605 4503 -102962 -73941
11965g3941j5239J7041C12576d9745G6321g778j14309B05530f3208A51176d8087
$$ -73941 -89180 -72139 312576 -49745 76321 -7778 -122087 205530 -63208 151176 -48087
11953A78167i908k47369a04209C72824b17686D9925c01540E9419a34570M9735
$$ 178167 -9908 -257277 -104209 372824 -217686 49925 -301540 59419 -134570 -84835
11943h4835C18783f1907A13769c9929A1768L5000K59783a85727A12215P5644E2128
$$ -84835 318783 -61907 113769 -39929 11768 46768 306551 -185727 112215 187859 52128
11931c17843J28655Q7108j98888J38835A62021b08596i1221C1812c3917k62347
$$ -317843 -189188 -102080 -300968 -162133 162021 -208596 -91221 31812 -33917 -296264
11921b96264G3888a17589K9298I794b15827F5806b0093l4015J3735j55963N7941
$$ -296264 73888 -117589 -88291 9794 -215827 65806 -20093 -54108 -40373 -196336 -138395
11910a38395l8327p6662D9442M17125A12110a89685A38260c7021D5644a74517
$$ -138395 -176722 -253384 49442 466567 112110 -189685 138260 -37021 45644 -174517
11899A65582b7120m0035r782o5054b8089j20966N3327E7468a79739B8267a23292
$$ 165582 -27120 -67155 -76937 -141991 -28089 -149055 -95728 57468 -179739 28267 -123292
11887D7451N755b82749E3658J17408C9567a05809k52401a63399e8356p820A23766
$$ 47451 53206 -282749 53658 171066 39567 -105809 -358210 -163399 -58356 -66176 123766
11875B06060r0472b57874f7417j08753K0195j27806A06877O656b19784i8422k25682
$$ 206060 115588 -257874 -67417 -176170 -155975 -283781 106877 113533 -219784 -98422 -324104
11864c24104g8056C6203b41565a7786B92989j44685n9757K42150j33520b40242
$$ -324104 -78056 36203 -241565 -17786 292989 148304 88547 330697 197177 -240242
11853A68520d37137O0772a56631d9275E7034K0759d3710j03693F3196d06600O0546
$$ 168520 -437137 -376365 -156631 -49275 57034 77793 -43710 -147403 63196 -406600 -346054
11842c46054a21532G3734R8798b4994A42431b33383b1304k19941I8067J3219B5054
$$ -346054 -121532 73734 172532 -24994 142431 -233383 -21304 -241245 98067 111286 25054
11830b10678R8470j01721e7541q1098A54463b03277A48756k1357b7847j67981
$$ -210678 -112208 -213929 -57541 -138639 154463 -203277 148756 127399 -27847 -195828
11820a95828L4057k60483b10630P9595C0331J23449a32677O0876j21736g6262
$$ -195828 -161771 -422254 -210630 -131035 30331 153780 -132677 -71801 -193537 -76262
11809b6607B59577a9109j47230A85110b20095A92523d5617k50178A14969h9800
$$ -26607 259577 -19109 -166339 185110 -220095 192523 -45617 -295795 114969 -89800
11798a80282b6414l11718j35207a15317L4792B4019d0468o3097n9954A20377d90985
$$ -180282 -26414 -338132 -473339 -115317 -80525 24019 -40468 -103565 -163519 120377 -490985
11786b38760j43972a64528N4758j5874G4236N1345l0555c61482J72991n3854I1091
$$ -238760 -382732 -164528 -109770 -125644 74236 125581 95026 -361482 -188491 -242345 91091
11774a05123p1734A90012b92237a15403D890K4241a45020B26693c60682B07745
$$ -105123 -176857 190012 -292237 -115403 4890 29131 -145020 226693 -360682 207745
11763b44241I7331C9795a2636k83864H0179L8590a05754M3851j92170a02809B99942
$$ -244241 97331 39795 -12636 -296500 80179 118769 -105754 -61903 -254073 -102809 299942
11751B21677a71747A14295I871f1442l01862I3688l1387h2735F0305a34103q3644
$$ 221677 -171747 114295 9871 -61442 -363304 93688 62301 -82735 60305 -134103 -217747
11740b17747k5108D2347a97709j15575A12844c09380A08365a93917B48400F6555
$$ -217747 -242855 42347 -197709 -313284 112844 -309380 108365 -193917 248400 66555
11729b10938j54939J35156f0389o9186d007A51729a8979C12713F8937b18616j0013
$$ -210938 -365877 -230721 -60389 -129575 -4007 151729 -18979 312713 68937 -218616 -228629
11718b28629h2217A60700j4687D239b78052a11210B85644I0057K21573e8404J5150
$$ -228629 -82217 160700 146013 4239 -278052 -111210 285644 90057 311630 -58404 -43254
11707d3254j97810H9294m2400a11978c5481A70931b74963j8272R6945g9556j34309
$$ -43254 -241064 89294 46894 -111978 -35481 170931 -274963 -293235 -196290 -79556 -213865
11696b13865C0635J38383K56017F5151a3515B35621a13778C33577A56041c49178
$$ -213865 30635 169018 425035 65151 -13515 235621 -113778 333577 156041 -349178
11685b19883E5127d9183E2477c57663c2796A55326a80485d8203o6828b9295I3022
$$ -219883 55127 -49183 52477 -357663 -32796 155326 -180485 -48203 -115031 -29295 93022
11673b51269N7137M0406G625P4960i5994G1619a49451B8961f2426k59842a17655
$$ -251269 -194132 -153726 7625 82585 -95994 71619 -149451 28961 -62426 -322268 -117655
11661c9364A43879D6317a27158r2384a06990A78333c97409a95432A15758R4255
$$ -39364 143879 46317 -127158 -219542 -106990 178333 -397409 -195432 115758 210013
11651B10013o1511a50034H0688a58080j80543A05969a70064J0297D9393K37563
$$ 210013 148502 -150034 80688 -158080 -338623 105969 -170064 -159767 49393 286956
11641B86956f7762b8024n743B82027c62823G6614B3918h032B8212R8002d30171
$$ 286956 -67762 -28024 -33767 282027 -362823 76614 23918 -8032 28212 126214 -430171
11629a70113M2684J4223m1019L3e3250G0181i6897k13222n8922C25340c44752
$$ -170113 -127429 -113206 -154225 -154192 -53250 70181 -96897 -310119 -369041 325340 -344752
11617I0225h555A16610a19088I5067c30655A8209a5820E8369d4134F5279a35686
$$ 90225 -8555 116610 -119088 95067 -330655 18209 -15820 58369 -44134 65279 -135686
11605F2489e6287B14580b69281P3202k57703J26175A82503g1220J0688j21304
$$ 62489 -56287 214580 -269281 -196079 -453782 -327607 182503 -71220 -60532 -181836
11595a81836C39094a64255C3438h5440L7174l7455F813g6908o5472l9093I3202
$$ -181836 339094 -164255 33438 -85440 -48266 -85721 6813 -76908 -142380 -181473 93202
11583b05434i8842k72972h7095j09960f4183k04892a13271D7934a13087L2836
$$ -205434 -98842 -371814 -87095 -197055 -64183 -269075 -113271 47934 -113087 -80251
11573h0251l25930B7744K45062f4240j85194H993h3642l0338k32162d1081B95616
$$ -80251 -406181 27744 272806 -64240 -249434 8993 -83642 -113980 -346142 -41081 295616
11561B87160D1390d6645B18447c8954C47912b76806A69819N878n3721n0177K30180
$$ 287160 41390 -46645 218447 -38954 347912 -276806 169819 175697 121976 71799 301979
11550C01979H9111J0305B0486h6398l9173C0477L0101g0969I0760p195a27844
$$ 301979 89111 99416 20486 -86398 -125571 30477 60578 -70969 90760 83565 -127844
11538b8388G5424J75065a39455B10660H1746a22586B57292B9091h0300b9460j40401
$$ -28388 75424 250489 -139455 210660 81746 -122586 257292 29091 -80300 -29460 -169861
11527a69861O4I1000P0359B8047J48272a68561h0333D15307A12254C0579M14724
$$ -169861 -169797 91000 161359 28047 176319 -168561 -80333 415307 112254 30579 445303
11516D45303j53118A09685P0843j0053F7987J57952I6694Q3702e4829B67870R6527
$$ 445303 292185 109685 180528 170475 67987 225939 96694 180396 -54829 267870 364397
11505C64397A5945Q8886k3433b54457B57017K3105m0857c3242j78082C18040j01312
$$ 364397 15945 104831 81398 -254457 257017 280122 239265 -33242 -211324 318040 216728
11494B16728m2088a73270G0849R8635n2433J07100K12750p7916j64767P9918a9537
$$ 216728 174640 -173270 70849 169484 117051 224151 436901 358985 194218 274136 -19537
11482a2293E6212M1854j7083C0451K69296H7974J09305J41744j41611J68498c45901
$$ -12293 56212 98066 80983 30451 299747 87974 197279 339023 197412 365910 -345901
11470a57882L8027I059R6688M8968C9587J0765a00198c4582A42514F1973J72946
$$ -157882 -119855 9059 105747 154715 39587 50352 -100198 -34582 142514 61973 234919
11459B34919I6759P1540J75595A71326J7914e7205b2995C05849g0657q2645A32186
$$ 234919 96759 168299 343894 171326 189240 -57205 -22995 305849 -70657 -153302 132186
11447C91838h2921n0781B75696J13453p4269q0128B3627a75558j11350L0252F4218
$$ 391838 -82921 -133702 275696 389149 314880 234752 23627 -175558 -286908 -256656 64218
11435A62535b75317C38583j22027k044J44011j3202b5954k96408C7457a40224
$$ 162535 -275317 338583 216556 214512 358523 345321 -25954 -322362 37457 -140224
11424a26195A8854J92559b01374d2391o7639B17241n4199a32174k6044A4459O2149
$$ -126195 18854 211413 -201374 -42391 -110030 217241 163042 -132174 -158218 14459 76608
11413G6608b202A23004h082A65883a71568O0151A92116d4036l39836A69576b27970
$$ 76608 -2202 123004 -8082 165883 -171568 -111417 192116 -44036 -383872 169576 -227970
11401a57974d0981H3520a7125j45448L010B36801r9312a71476A58010d819k180
$$ -157974 -40981 83520 -17125 -162573 -159563 236801 137489 -171476 158010 -4819 -6999
11390f999j48807C43064a00766j23919m960C1955a78793A83688J73762a71744
$$ -6999 -155806 343064 -100766 -224685 -229645 31955 -178793 183688 357450 -171744
11379A66870a12532j53612f935A10505n4241b69402Q5577h2129B96640a8356A40380
$$ 166870 -112532 -266144 -6935 110505 56264 -269402 -183825 -82129 296640 -18356 140380
11367f5480J2590k27123a3468k02159I128J14498D3674a9941p031A60461a05214
$$ -65480 -52890 -280013 -13468 -215627 9128 123626 43674 -19941 -26972 160461 -105214
11355i1529B62863d5957j07320J8648b7326j07229k0686M067M8841o9652m075
$$ -91529 262863 -45957 -153277 -134629 -27326 -134555 -155241 -151174 -102333 -171985 -176060
11344a76060G3624A0635f33406c5008k24399A76541b49920a18968B24230a49026
$$ -176060 73624 10635 -633406 -35008 -259407 176541 -249920 -118968 224230 -149026
11333c64050J04318e3482k6396B15778O3804g7033r0748j26838D0637b67615C80
$$ -364050 -259732 -53482 -79878 215778 279582 -77033 -167781 -294619 40637 -267615 380
11321D7778J55457R7352a53189P709A09821b0930k94391E8354f6190E2093e0610
$$ 47778 203235 300587 -153189 -145480 109821 -20930 -315321 58354 -66190 52093 -50610
11309g4355m4618l48610a37454F4620a48997P2607A69722c14323J36993j70958
$$ -74355 -118973 -467583 -137454 64620 -148997 -76390 169722 -314323 -177330 -348288
11299c48288A27447P3139a89400F9902J06805p0769K38113j12773E8892j44l846
$$ -348288 127447 200586 -189400 69902 176707 105938 344051 231278 58892 58748 54902
11288E4902a67230b7331B27810f0239A85156I0498M373A0241B676f555j63067
$$ 54902 -167230 -27331 227810 -60239 185156 90498 94871 10241 2676 -6555 -169622
11277a69622G1841L06611A21469j77B4428a56026j5394B08370a85988O9372A79065
$$ -169622 71841 378452 121469 121292 24428 -156026 -171420 208370 -185988 -116616 179065
11265F103a17315H3416b07592q4589J20763e2158p3386d2471n1260j2414j37095
$$ 6103 -117315 83416 -207592 -292181 -171418 -52158 -125544 -42471 -93731 -106145 -243240
11254b43240k4P0577F6583c8753A58226b04954D00710b68609J19141F4321j8508
$$ -243240 -243264 -172687 66583 -38753 158226 -204954 400710 -268609 -149468 64321 45813
11243D5813b50986H0014a04894l745k01538F9477a579C8829i2519j81712J03237
$$ 45813 -250986 80014 -104894 -108639 -310177 69477 -1579 38829 -92519 -274231 -170994
11232a70994f0842E9758J8281A2614P0427a51864f5051A4162P0105i477C6718
$$ -170994 -60842 59758 78039 12614 83041 -151864 -65051 14162 84267 -9477 36718
11220A60222b68197A76536k409a00998k4420d9904G622g1700k73908a02619B03587
$$ 160222 -268197 176536 174127 -100998 -125418 -49904 7622 -71700 -345608 -102619 203587
11208b07515B53034a67183j12438F1470f7442A11073c9661n8510o9851A07966
$$ -207515 253034 -167183 -279621 61470 -67442 111073 -39661 -98171 -168022 107966
11197b74385a34673C7527e5135j072l16219a67832n3850l1599a23866j3271A12057
$$ -274385 -134673 37527 -55135 -56207 -372426 -167832 -221682 -253281 -123866 -137137 112057
11185D4562i8264a8792k3325j458k30542n5102a47615O887F5468c46716D9737
$$ 44562 -98264 -18792 -42117 -43575 -274117 -329219 -147615 -140728 65468 -346716 49737
11173b03597A23837a51005C47480a70219A91206a81061h3811d1571k8095D3791
$$ -203597 123837 -151005 347480 -170219 191206 -181061 -83811 -41571 -69666 43791
11162b35282C35779h4007j06179B01802j0057C1173e7445L785j06718m8636h3150
$$ -235282 335779 -84007 -190186 201802 191745 31173 -57445 -53660 -160378 -209014 -83150
11150b64238a9149r7026b7879g519A93945a41191E6806b60385B91901A13286K57265
$$ -264238 -19149 -116175 -27879 -7519 193945 -141191 56806 -260385 291901 113286 370551
11139C70551G3334N0244c3101j8910l16541B22896e9680C36781d1997k02745A87746
$$ 370551 73334 123578 -33101 -52011 -368552 222896 -59680 336781 -41997 -244742 187746
11127B7120K63062a26470R590d3181C76321j70406a18888l4583C00769j11513
$$ 27120 290182 -126470 -116880 -43181 376321 205915 -118888 -153471 300769 189256
11117A89256J23733p1499a04398A15372K63297A49474J67670g2087o288B70155
$$ 189256 312989 241490 -104398 115372 378669 149474 317144 -72087 -78375 270155
11106C26819j23186m6957f2995o3723A48419p2727K55615A48232K5537i19B74661
$$ 326819 203633 156676 -62995 -126718 148419 75692 331307 148232 173769 -919 274661
11094a07692A77690J05606M7894j57205r217J09514a5043D99151B46489L40734
$$ -107692 177690 283296 331190 173985 164768 274282 -15043 499151 246489 587223
11084E87223B30155b3181A08062L23372i5798M340A05598B4705g9504B2749J37932
$$ 587223 230155 -23181 108062 431434 -95798 -91458 105598 24705 -79504 22749 160681
11073A60681m4582B3002K9938L67848j61927J1868K36906j56817n6858M6235l2489
$$ 160681 116099 23002 52940 420788 258861 270729 507635 350818 293960 340195 307706
11062C07706J35655k9092j82159K12572J99413j43282J87203n4884L44579D41068
$$ 307706 443361 414269 232110 444682 644095 500813 688016 633132 977711 441068
11051F89004k7748k0515K47773l6408k24195K1846N21184k72333r4393Q3333K50558
$$ 689004 661256 640741 888514 852106 627911 649757 1170941 898608 804215 887548 1138106
11040A138106m42075k12416L59389n2667J56214J82354l64431j28436K29787n3920
$$ 1138106 696031 483615 843004 790337 946551 1128905 764474 636038 865825 811905
11030H11905Q7293l71506J66770J08308N5055C92611M02074l88437L90715q8205
$$ 811905 899198 527692 694462 802770 857825 392611 794685 406248 796963 708758
11020G08758j63748J96246p6297R4220j16062L3731k43404K36954Q2690l3068
$$ 708758 545010 741256 664959 759179 643117 676848 433444 670398 753088 720020
11010G20020q0223J7654J41026l73201J64979m818j41106K41290J03011O0314
$$ 720020 639797 657451 798477 425276 590255 585437 444331 685621 788632 848946
11000H48946A59378N11870O488L07337m18782K11060j15467r5456O1739B69742
$$ 848946 159378 671248 677736 985073 566291 777351 661884 566428 628167 269742
10989H30170l88209J78143j24236K85606R6074n7609M3249K9221K49344r8692
$$ 830170 441961 620104 495868 781474 877548 819939 863188 892409 1141753 1043061
10979A043061j85446J1637L42330j3004K77420j1221L01252M09868J28917P6367
$$ 1043061 857615 869252 1211582 1198578 1475998 1464777 1766029 2175897 2304814 2381181
10969B381181K81374L47574J23261l78497N69128l67367m94196K1709l96665k73577
$$ 2381181 2662555 3010129 3133390 2754893 3324021 2956654 2462458 2484167 2087502 1813925
10959A813925m50517k58484J09889k54595j43358l95264M32959l27093L06468
$$ 1813925 1363408 1104924 1214813 960218 816860 421596 854555 527462 833930
10950H33930M905l85781A56008L07179m9754l3225A08780J67574E7763L25798
$$ 833930 838835 453054 156008 463187 413433 380208 108780 276354 57763 383561
10940C83561A76040a02824B35322l8177C9900h4152A69370b05008B10308a77361
$$ 383561 176040 -102824 235322 197145 39900 -84152 169370 -205008 210308 -177361
10929I1408a03857A85793o9324Q406b53936f5474D6517J67423L1913a41284B7401
$$ 91408 -103857 185793 116469 124875 -253936 -65474 46517 213940 245853 -141284 27401
10917C51576a17979B86879E3549e1173B91100b46305J6832A44598d9554D1763
$$ 351576 -117979 286879 53549 -51173 291100 -246305 -229473 144598 -49554 41763
10906D0630N4626a387A02930j0568K600a93606A30042K36585f4759F7962c43789
$$ 40630 95256 -1387 102930 92362 94962 -193606 130042 366627 -64759 67962 -343789
10894C7356O8819C7952b90830b9562l52776b0402G6761a67775f4906k17378A88753
$$ 37356 106175 37952 -290830 -29562 -382338 -20402 76761 -167775 -64906 -282284 188753
10882d6617D8733d8381k5143A7396b076k07785e6514m3950c7098n2696A63012
$$ -46617 48733 -48381 -73524 17396 -2076 -209861 -56514 -100464 -37098 -89794 163012
10870H8022J45049d23982a7026B98765f6501E9265J44475O1957b37199g4206B77724
$$ 88022 233071 -423982 -17026 298765 -66501 59265 203740 265697 -237199 -74206 277724
10858h0398k01338d8189E8005A0452J14567C2698J49220G7836O8320d36339c5547
$$ -80398 -281736 -48189 58005 10452 125019 32698 181918 77836 146156 -436339 -35547
10846A91983a10290A30624c5455A40503e3652k27495A09800b90761b6018f180
$$ 191983 -110290 130624 -35455 140503 -53652 -281147 109800 -290761 -26018 -6180
10835d25989b3161C95993b35140l3474A16263b4292B51334a86704N7132D6275
$$ -425989 -23161 395993 -235140 -268614 116263 -24292 251334 -186704 -129572 46275
10824d3386k24671f6386c444j00925a4160B04535i3603n5843F0620J7773a47321
$$ -43386 -268057 -66386 -3444 -104369 -14160 204535 -93603 -149446 60620 78393 -147321
10812b00094D7750b58295p3049f6425j46403c220k79597a7004B32573a7908o4814
$$ -200094 47750 -258295 -331344 -66425 -212828 -3220 -282817 -17004 232573 -17908 -82722
10801h2722F2989a0513B3410r718b39596P2124k40566F9735d7276j1493b3240
$$ -82722 62989 -10513 23410 13692 -239596 -167472 -408038 69735 -47276 -58769 -23240
10789C17761a33262j51866J28334b4285k25352F7312g154k11927e0532n0956c4632
$$ 317761 -133262 -285128 -156794 -24285 -249637 67312 -7154 -219081 -50532 -101488 -34632
10777B91698i8973A06453m3692a51711C52513D377a02487C05282g93A23598d5210
$$ 291698 -98973 106453 62761 -151711 352513 4377 -102487 305282 -793 123598 -45210
10765c6962j44054c3704A47459f2757c552k18084B07635c7404j47154M5473K5059
$$ -36962 -181016 -33704 147459 -62757 -3552 -221636 207635 -37404 -184558 -139085 -114026
10754a14026j2301k31B44376a89051A31821L8940b8357l39103J5949A88007G2315
$$ -114026 -126327 -126558 244376 -189051 131821 170761 -28357 -367460 -351511 188007 72315
10742B42339d5232B13179J76149a19113A99856a85174H0471a2444n5558j00818
$$ 242339 -45232 213179 389328 -119113 199856 -185174 80471 -12444 -68002 -168820
10732a68820c5260q9300C7971j211e9260A2443e9975K3909F6826j6696K48730
$$ -168820 -35260 -124560 37971 36760 -59260 12443 -59975 -36066 66826 50130 298860
10721B98860a67709E2069b3605p8407p674D2882J28063p5492Q3249B527c58483
$$ 298860 -167709 52069 -23605 -102012 -109686 42882 170945 95453 178702 2527 -358483
10709A36553d7405d954j4013k7776d744j99240I6757A0953J50237d13953J85613
$$ 136553 -47405 -4954 -18967 -46743 -4744 -203984 96757 10953 161190 -413953 -228340
10698b28340d3053a8601k56222A09334a21749d39D0075J73145b93873J43018A86245
$$ -228340 -43053 -18601 -274823 109334 -121749 -439 40075 213220 -293873 -150855 186245
10686h3754A80659a13658j02238A57670C3666c74343c0909k80780A16395R3916
$$ -83754 180659 -113658 -215896 157670 33666 -374343 -30909 -311689 116395 210311
10676B10311l5092a14608j94644a1767q2676a6404k04542p968f4270K6008a3016
$$ 210311 175219 -114608 -309252 -11767 -94443 -16404 -220946 -228914 -64270 -38262 -13016
10664E5225d7303E6517a9496A00797I515K62189a45102k19509a56740j86573L1260
$$ 55225 -47303 56517 -19496 100797 9515 271704 -145102 -364611 -156740 -343313 -312053
10653c12053A80311f6043m969j03780G2648e1420j85354A92867b66366a21127
$$ -312053 180311 -66043 -71012 -174792 72648 -51420 -236774 192867 -266366 -121127
10642a07992C31715b40971B80696P5324d3275j7828k09182Q2416h8908A69333
$$ -107992 331715 -240971 280696 356020 -43275 -61103 -270285 -187869 -88908 169333
10631B27466L697H8063f2289A46681R514n152H397h8542m06910J67679M7780J38606
$$ 227466 231163 88063 -62289 146681 156195 151043 8397 -88542 -495452 -327773 -279993 -141387
10619a41387L4113j08306q9018J01554N2110k853D3682c7245B951g7288m8295
$$ -141387 -107274 -215580 -304598 -203044 -150934 -153787 43682 -37245 2951 -77288 -125583
10608a25583j13279E6633M3756b33841J9845I1208a24117m7775C3668R2266a01177
$$ -125583 -238862 56633 100389 -233841 -213996 91208 -124117 -171892 33668 125934 -101177
10596A16917D2234J68852d3692B20002I2405J04512l6454c9144A91282a65725
$$ 116917 42234 211086 -43692 220002 92405 196917 160463 -39144 191282 -165725
10585B25536E5869a46457j66975a21670j30639B16471f3712K2255H6022a33522
$$ 225536 55869 -146457 -313432 -121670 -252309 216471 -63712 -41457 86022 -133522
10574g1140B1346b42458N0216C9388b29139P397G7300M9756k0773J35129k1201
$$ -71140 21346 -242458 -192242 39388 -229139 -221742 77300 127056 106283 241412 220211
10563B20211a18148l8124b9743C8061R2241B2079a31387o7943M2194g304j11076
$$ 220211 -118148 -156272 -29743 38061 130302 22079 -131387 -199330 -157136 -7304 -118380
10552a18380d8108q3865G2515e7084j17290B07485d0965j49222f2304o1549B8224
$$ -118380 -48108 -131973 72515 -57084 -174374 207485 -40965 -190187 -62304 -123853 28224
10540i4514J0375A03712d7982A29367g4902E8520J06049a78702A06158c34296
$$ -94514 -84139 103712 -47982 129367 -74902 58520 164569 -178702 106158 -334296
10529f8214l29752I2560J49775F9792B4421J2048b72516o2507J15722e3904o6031
$$ -68214 -397966 92560 242335 69792 24421 36469 -272516 -335023 -219301 -53904 -119935
10518a19935M1115C1329a00208O295j76054f3527G8302a0577A92799e2759k87195
$$ -119935 -78820 31329 -100208 -93913 -269967 -63527 78302 -10577 192799 -52759 -339954
10507c39954i3980D7341g9916C7222L57147b41134f7131J4046k37581C9144j1760
$$ -339954 -93980 47341 -79916 37222 394369 -241134 -67131 -53085 -290666 39144 27384
10496B7384p926a42215r8252Q9687j7377D7281M2034a73169D6465J70046j03392
$$ 27384 19458 -142215 -240467 -150780 -168157 47281 89315 -173169 46465 216511 113119
10485A13119b82393A46628a3588l47025G2498k309a68233f4113j81515e8548A29124
$$ 113119 -282393 146628 -13588 -360613 72498 70189 -168233 -64113 -245628 -58548 129124
10473b17474g4135n2917B51562c10954J45401J6752M1771p039d8884F6152e36751
$$ -217474 -74135 -127052 251562 -310954 -165553 -148801 -107030 -114069 -48884 66152 -536751
10461b81977A19432a79046B8486b4377j32303L1409k5570r2418C5395a46999A11845
$$ -281977 119432 -179046 28486 -24377 -156680 -125271 -150841 -243259 35395 -146999 111845
10449F9848J55155b49881A69211e2510A43813G350J30673a25353K314a5384j19830
$$ 69848 225003 -249881 169211 -52510 143813 7350 138023 -125353 -123039 -15384 -135214
10438a35214A0820b1154J0364j03574m9047k4656A08232d28018H6377b76606K8288
$$ -135214 10820 -21154 -10790 -114364 -163411 -188067 108232 -428018 86377 -276606 -248318
10427b48318a11959Q260B11897b27799G5983d60433A06654L61842A61369k9486
$$ -248318 -111959 -103699 211897 -227799 75983 -460433 106654 468496 161369 131883
10417A31883c62664a56546C38278C990a82462q8060A81665i1932B8228J28940
$$ 131883 -362664 -156546 338278 3990 -182462 -270522 181665 -91932 28228 157168
10407A57168b53954g396j66834e5482A08013a6549j70376O7692A09471c3235H2945
$$ 157168 -253954 -7396 -174230 -55482 108013 -16549 -186925 -119233 109471 -33235 82945
10395A85441B3865K17510e6889J1094B4949b41873c0881D938a7206m10716C76004
$$ 185441 23865 241375 -56889 -45795 24949 -241873 -30881 4938 -17206 -427922 376004
10383a48973D161f1158F058i9646I5391Q591l4612N730J22894r8026e8119A82739
$$ -148973 4161 -61158 6058 -99646 95391 103982 69370 75100 197994 99968 -58119 182739
10370A70559n5611D4962J99509F619M70378N2602J44803Q2776o9279Q8021A55064
$$ 170559 114948 44962 244471 6619 476997 529599 674402 757178 687899 775920 155064
10358E92501A92503J55164j26470O4188G29Q2075J18926K4427K58378K19823l22090
$$ 592501 192503 347667 221197 285385 729 82804 201730 226157 484535 704358 382268
10347C82268J87601Q1803E5317c8120n2978F4156J4118a45438C89758p9987j36424
$$ 382268 569869 651672 55317 -38120 -91098 64156 78274 -145438 389758 309771 173347
10336A73347O881N332K39990J5359A65291c5061q0736B69811a66215a5186q8223
$$ 173347 180228 185560 425550 440909 165291 -35061 -115797 269811 -166215 -15186 -103409
10325a03409G9017C1963K57052b46568C52248j43944J64224G0999K99435A45525
$$ -103409 79017 31963 289015 -246568 352248 208304 372528 70999 370434 145525
10314B57057r2114i9242A73987J00643b11767E8033b63159A7362c66283B73943
$$ 257057 164943 -99242 173987 274630 -211767 58033 -263159 17362 -366283 273943
10303a88537A6516L5894h5419c8355l33628i5537J2845O004E992P9237f9364a6830
$$ -188537 16516 52410 -85419 -38355 -371983 -95537 -82692 -76688 5992 85229 -69364 -16830
10290c479o5875C3829K67345G8789L1467N3042a49453i596B44887Q2828A8030
$$ -3479 -69354 33829 301174 78789 110256 163298 -149453 -9596 244887 327715 18030
10278E43575B10079M8308f9994m01006e1669j4752k0359g858B90064j40514b76659
$$ 543575 210079 258387 -69994 -471000 -51669 -66421 -86780 -7858 290064 149550 -276659
10266g8860j02479l2185e0807A05227a0804l8516B76433A5898b48581q90Q0347
$$ -78860 -181339 -213524 -50807 105227 -10804 -49320 276433 15898 -248581 -249471 -169124
10255a69124L9942B2585a1046l14332I8033c2389l9491J6124G2047J72901a96109
$$ -169124 -129182 22585 -11046 -325378 98033 -32389 -71880 -55756 72047 244948 -196109
10243B59666b70803E7235a4106D7794L34882A0844J54404a50318B25703M061g9895
$$ 259666 -270803 57235 -14106 47794 382676 10844 165248 -150318 225703 229764 -79895
10231A43479b36350R7958f8105A31716a24841B96909a09179K4234D6913b66785
$$ 143479 -236350 -138392 -68105 131716 -124841 296909 -109179 -84945 46913 -266785
10220a41709N2057l5619A65365b1235I7561P440h3852C46975c37063B00468l6836
$$ -141709 -89652 -125271 165365 -21235 97561 105001 -83852 346975 -337063 200468 163632
10209A63632J92490a01554c2618j33743B7917e9713j53249C95563c17560B0922
$$ 163632 356122 -101554 -32618 -166361 27917 -59713 -212962 395563 -317560 20922
10198a37006B07703a69968j82584B1068a25320j59872h6246n7398A78352d4965
$$ -137006 207703 -169968 -352552 21068 -125320 -285192 -86246 -143644 178352 -44965
10187B4352b8022B8233e33736B24213b43381B35998M6254B4318f9844C3361J2913
$$ 24352 -28022 28233 -533736 224213 -243381 235998 282252 24318 -69844 33361 46274
10176D6274a69915C7777L9393L49066c7063n248j38551r1226i6224L5005m94154
$$ 46274 -169915 37777 77170 426236 -37063 -42311 -180862 -272088 -96224 -61219 -555373
10165e55373A25664c60190j90526a0160j82331R6084p295m3288l0093I3413a10585
$$ -555373 125664 -360190 -550716 -10160 -192491 -96407 -103702 -146990 -177083 93413 -110585
10153b42256a1099A24781c5989o8847B9210N1642g7574j24159E8196E918O6823
$$ -242256 -11099 124781 -35989 -104836 29210 80852 -77574 -201733 58196 5918 72741
10142G2741M2100a98683r5974C777b76320a17136j59610a08210o618c5917A17666
$$ 72741 114841 -198683 -294657 3777 -276320 -117136 -276746 -108210 -114828 -35917 117666
10130a42526j79172h281A00995k1674k0673k0279a69899B65698b18866G1488a43209
$$ -142526 -321698 -8281 100995 79321 58648 38369 -169899 265698 -218866 71488 -143209
10118b19926B5550P68J6920k1397c2804j65465A5194O4083b71722Q7663k6097
$$ -219926 25550 26318 43238 21841 -32804 -198269 15194 79277 -271722 -184059 -210156
10107b10156M237A48360a12821k710E0368j2291a10878I7718e7019k27451a33609
$$ -210156 -205919 148360 -112821 -115531 50368 38077 -110878 97718 -57019 -284470 -133609
10095a77217c5110D638J21718b33780F1665J63297b16436J07263m4342e950A75729
$$ -177217 -35110 4638 126356 -233780 61665 224962 -216436 -109173 -153515 -5950 175729
10083g452E8852d9163A19817L7506a73987J6830j8116H5465b7030j69906d3149
$$ -7452 58852 -49163 119817 157323 -173987 -157157 -175273 85465 -27030 -196936 -43149
10071F7987e7735F3867a647A40327K2368J87701j33392c17099A08363a51063P754
$$ 67987 -57735 63867 -1647 140327 162695 350396 217004 -317099 108363 -151063 -143309
10060a43309d0777l77426m355f2286k1227a6055j08932A47571A3731L523a57562
$$ -143309 -40777 -418203 -422558 -62286 -83513 -16055 -124987 147571 13731 17254 -157562
10048b81566k6778A41935l2521C6410h8421k15871f4349b7311j52534C4J19009
$$ -281566 -308344 141935 109414 36410 -88421 -304292 -64349 -27311 -179845 34 119043
10037A19043i0804j53605a10853q5201h8569j32518g2740D4568P7360e3097n8203
$$ 119043 -90804 -244409 -110853 -196054 -88569 -221087 -72740 44568 121928 -53097 -111300
10026a11300A10843g7187L7876k85865J54278A14380a9225k75788H9263a82714
$$ -111300 110843 -77187 -39311 -325176 -170898 114380 -19225 -295013 89263 -182714
10015C31265j45878J35316b29160A9285g07A38066Q3882a17957C29820c7126k73209
$$ 331265 185387 320703 -229160 19285 -707 138066 221948 -117957 329820 -37126 -310335
10004c10335c0175k00787G9541C8383f8583A6799a76931A7652a48663j27453M7982
$$ -310335 -30175 -230962 79541 38383 -68583 16799 -176931 17652 -148663 -276116 -228134
9993b28134j37595a35302K0878a2491n0854j5561k42049J39898N0339K1529B26107
$$ -228134 -365729 -135302 -114424 -12491 -63345 -78906 -320955 -181057 -130718 -109189 226107
9981a31054d8401j92081a13172A96980a32919A14868e89273C1182d8186H5693
$$ -131054 -48401 -240482 -113172 196980 -132919 114868 -589273 31182 -48186 85693
9970b63480J7312j26975d0920A37242E899a50326M3045K8154A84579c37281J62179
$$ -263480 -246168 -373143 -40920 137242 5899 -150326 -107281 -79127 184579 -337281 -175102
9959a75102E9783M325b91462D365a94869j04285K1839M6746A66342b18920I569
$$ -175102 59783 64108 -291462 4365 -194869 -299154 -277315 -230569 166342 -218920 9569
9947c8938q6687C07152A37822a52479b7115m0532o6462B17882K7729a84885I476
$$ -38938 -125625 307152 137822 -152479 -27115 -67647 -134109 217882 245611 -184885 9476
9935a1127B03692H3813C3622b24558R7318H4469d65578J85067C33394c3751j69820
$$ -11127 203692 83813 33622 -224558 -127240 84469 -465578 -280511 333394 -33751 -203571
9924b03571g9193E1831J11285i0111I0456a47729N7063l5628G4438b26070B86905
$$ -203571 -79193 51831 163116 -90111 90456 -147729 -90666 -126294 74438 -226070 286905
9912I4081I828J42660M9850a10482E4929B247N4285a21716o54F1415f0024j1272
$$ 94081 9828 152488 202338 -110482 54929 2247 56532 -121716 -122370 61415 -60024 -71296
9900g1296B08942f3901I6475c0033q2003A600J4248P7438a97477A25272c0634
$$ -71296 208942 -63901 96475 -30033 -112036 1600 15848 93286 -197477 125272 -30634
9888f9126o5894r3230l248A10502e8816C10588d6020B01355b05364i8062j22871
$$ -69126 -135020 -228250 -231498 110502 -58816 310588 -46020 201355 -205364 -98062 -220933
9877b20933K5516k8245h6230P160B79109b61756n8662a49534D9667c2683j48612
$$ -220933 -195417 -223662 -86230 -79070 279109 -261756 -320418 -149534 49667 -32683 -181295
9866a81295m32B46341i240j95017j37442i843C4268a95567E7958N0603h3727F5412
$$ -181295 -181727 246341 -9240 -204257 -341699 -9843 34268 -195567 57958 108561 -83727 65412
9853A42437D2777a89168F3916g1809P887K7928B20940g8547k85668a63661o6986
$$ 142437 42777 -189168 63916 -71809 -63922 -35994 220940 -78547 -364215 -163661 -230647
9842b30647E4291c64284B8220d9881m2932L3754r7576A26404a08882M8664j10142
$$ -230647 54291 -364284 28220 -49881 -92813 -59059 -156635 126404 -108882 -60218 -170360
9831a70360K7285j47378B55857l0802c70111h7401B00328a78193l2919c9673J4475
$$ -170360 -143075 -290453 255857 225055 -370111 -87401 200328 -178193 -211112 -39673 -25198
9820b5198F8252b9012k9303k05081P3227A55898a83358A5611b31065e756A09923
$$ -25198 68252 -29012 -58315 -263396 -190169 155898 -183358 15611 -231065 -5756 109923
9808b29267M1533r5788Q9648q9231a23136A5002h4361M1208E7308c96726a81552
$$ -229267 -187734 -283522 -193874 -283105 -123136 15002 -84361 -43153 57308 -396726 -181552
9796b94952J41523q9864j92668B61105a62255q1603i9161I7213a07526A20259
$$ -294952 -153429 -243293 -435961 261105 -162255 -243858 -99161 97213 -107526 120259
9785G875g8224H741a19262c5981l55199I8178O4668c4923L992L26l54963A44664
$$ 7875 -78224 8741 -119262 -35981 -391180 98178 162846 -34923 -30931 -30605 -385568 144664
9772B38642b74638A03051B9755M8928B5248a51204p7541D8543a31782c7840m9626
$$ 238642 -274638 103051 29755 78683 25248 -151204 -228745 48543 -131782 -37840 -87466
9761h7466c387H1703d1131J1791P133l5081a5259l15601a42030A88625n8725J06276
$$ -87466 -3387 81703 -41131 -29340 -22207 -57288 -15259 -330860 -142030 188625 129900 236176
9749B36176n9184a22620D6558Q1636j5673a67117j26366B21210b48213e2958n3544
$$ 236176 176992 -122620 46558 128194 112521 -167117 -293483 221210 -248213 -52958 -106502
9738a06502P947L6307H3762e6426j50658d5530k31210g7639j09137k74199a65259
$$ -106502 -98555 -62248 83762 -56426 -207084 -45530 -276740 -77639 -186776 -460975 -165259
9726I0138A5965L63106J8945e0032n1638p5469a220j39863D31495E8865a58155
$$ 90138 15965 379071 398016 -50032 -101670 -177139 -1220 -141083 431495 58865 -158155
9714B20718i7668k6514d3955j9959l22741A19183b74054B6072K9993K3309I915
$$ 220718 -97668 -124182 -43955 -63914 -386655 119183 -274054 26072 56065 79374 9915
9702a33060L6700I1250a40921J4916A65434D0915a39062l45142K29588a24362
$$ -133060 -96360 91250 -140921 -126005 165434 40915 -139062 -484204 -254616 -124362
9691h2225b8337n7763p7169F7633b1050j96492g6837A66388c0398I22K1619a4202
$$ -82225 -28337 -86100 -163269 67633 -21050 -217542 -76837 166388 -30398 922 22541 -14202
9678A03960D9588a48275K3617D3461i6691M090a7276m6946c0730A45126a16419
$$ 103960 49588 -148275 -124658 43461 -96691 -92601 -17276 -64222 -30730 145126 -116419
9666G5756a26571k25752a2498k0957A36140A5633K65330e1852j12216j3466j20770
$$ 75756 -126571 -352323 -12498 -33455 136140 15633 280963 -51852 -164068 -177534 -298304
9655b98304g4755A3009a68317F7295J12400d4601H0742b0523A93602a36209a9210
$$ -298304 -74755 13009 -168317 67295 179695 -44601 80742 -20523 193602 -136209 -19210
9643a17986K8028D22043b4722j14067C3312J30927C3275j3337c74007O4329a43708
$$ -117986 -89958 422043 -24722 -138789 33312 164239 33275 19938 -374007 -309678 -143708
9631f0462m07931A33862b01686k22794J49297G0567j8026a32249B6779a58231
$$ -60462 -468393 133862 -201686 -424480 -275183 70567 52541 -132249 26779 -158231
9620a80577h1490a7346m6531k24877B29124b008j33669j59375B31333a94044A04204
$$ -180577 -81490 -17346 -63877 -288754 229124 -2008 -135677 -295052 231333 -194044 104204
9608b06007q5489I0220a12382B31772d95951C7141a7018r7773k76051O7701E9267
$$ -206007 -291496 90220 -112382 231772 -495951 37141 -17018 -114791 -390842 -323141 59267
9596B57466j27851b79664o1661f5536m0602r7061a01558B17815D9545k4648b81519
$$ 257466 129615 -279664 -341325 -65536 -106138 -203199 -101558 217815 49545 24897 -281519
9584G4376c0749D2301b30818k38798C78175c03793h5921k27320b4447k0967j25268
$$ 74376 -30749 42301 -230818 -469616 378175 -303793 -85921 -313241 -24447 -45414 -170682
9573a70682o5518B3585a43713M7082A2498b57989b8365F3789P7690c28459a0999
$$ -170682 -236200 23585 -143713 -96631 12498 -257989 -28365 63789 141479 -328459 -10999
9561a83412D861K45405E7606J62620b02039K9652A15309b8582A43201N7402H2189
$$ -183412 4861 250266 57606 220226 -202039 -172387 115309 -28582 143201 200603 82189
9549D951K6860b48198b9429C9638J43637f8631j1096K1380K2679j66889n9064
$$ 4951 31811 -248198 -29429 39638 183275 -68631 -79727 -58347 -35668 -202557 -261621
9538b61621A3099a02451j04521A42731e5682B1678D81e1467j54604a6378A23906
$$ -261621 13099 -102451 -206972 142731 -55682 21678 481 -51467 -206071 -16378 123906
9526b6612E1305c59176a77699D14659q0362a36418f122A20990c59381g7706j47186
$$ -26612 51305 -359176 -177699 414659 334297 -136418 -6122 120990 -359381 -77706 -224892
9515b24892a11022j57426F9731K28439A27131J2929e4780A9651e7618C6913J41919
$$ -224892 -111022 -268448 69731 298170 127131 140060 -54780 19651 -57618 36913 178832
9504A78832a52130q4563g5428B6551a72235A56967E5067d2149j14303o3449G7829
$$ 178832 -152130 -236693 -75428 26551 -172235 156967 55067 -42149 -156452 -219901 77829
9492C4715J6797a50384C5224g6828a7975I1765a89716g3097B65570A16780a06746
$$ 34715 51512 -150384 35224 -76828 -17975 91765 -189716 -73097 265570 116780 -106746
9480b67602j29361a4902l09474A64079a11950e163A30879D1946c07556d7559C03125
$$ -267602 -396963 -14902 -324376 164079 -111950 -5163 130879 41946 -307556 -47559 303125
9468c1231A6151b49673L6685F246e5127C6983b90010E0196g9050A67738e5307
$$ -31231 16151 -249673 -212988 6246 -55127 36983 -290010 50196 -79050 167738 -55307
9456B00642k4689a47836M739L9069H6670g5063A85724a54846N1897C27860a1916
$$ 200642 175953 -147836 -143097 -104028 86670 -75063 185724 -154846 -102949 327860 -11916
9444a66418F9228P6004c4763j04465k0922D4509e1851j50495F5380b75928C13098
$$ -166418 69228 145232 -34763 -139228 -160150 44509 -51851 -202346 65380 -275928 313098
9432b25284C8912J22414g7875m5037n2365D04J55921c5573p2384A89238a15229
$$ -225284 38912 161326 -77875 -122912 -175277 404 156325 -35573 -107957 189238 -115229
9420C27806b31562J08491A34981b77604H719P4835J24980d30612b07401L5235
$$ 327806 -231562 -123071 134981 -277604 8719 83554 208534 -430612 -207401 -172166
9410a72166I475a63460E4044a78877f7149A38446b52098d5581H0524f0390k38051
$$ -172166 9475 -163460 54044 -178877 -67149 138446 -252098 -45581 80524 -60390 -298441
9399b98441R004A09283m2523O5132d49437i4164k22583a33201N7082A90234a14745
$$ -298441 -289437 109283 66760 131892 -449437 -94164 -316747 -133201 -76119 190234 -114745
9387a19354l5058j13069j21088a29082q7842B7888f2897p2484k63236l2601A5213
$$ -119354 -154412 -267481 -388569 -129082 -216924 27888 -62897 -135381 -398617 -431218 15213
9375B12227k8526c09966E7304a29376l87201A0759a16472A64178G6230J84445
$$ 212227 183701 -309966 57304 -129376 -516577 10759 -116472 164178 76230 260675
9365B60675a06583C7535b09654J1393B41291i9554j80421C7453b10107A4468b16200
$$ 260675 -106583 37535 -209654 -198261 241291 -99554 -279975 37453 -210107 14468 -216200
9353G7554f878j47056k74780A3797J69948d1626p5679B01835a4437n8291A06744
$$ 77554 -6878 -153934 -428714 13797 183745 -41626 -117305 201835 -14437 -72728 106744
9341a11930a0673p3338A54916n0415b18494F0367K03987c90370d1661D69802b09363
$$ -111930 -10673 -84011 154916 104501 -218494 60367 264354 -390370 -41661 469802 -209363
9329a56569a4547k8763A34782R1687b76291A02843C2283J67479M21a03764A82770
$$ -156569 -14547 -43310 134782 226469 -276291 102843 32283 199762 200183 -103764 182770
9317b26277K8043j1650b2043k473p7843m05775D56960a26952F3537e6103j36951
$$ -226277 -198234 -209884 -22043 -24516 -102359 -508134 456960 -126952 63537 -56103 -193054
9306a93054B8676b91224B76140j17543b54891O279p5070J55175m8997G6519a96998
$$ -193054 28676 -291224 276140 158597 -254891 -248612 -323682 -168507 -217504 76519 -196998
9294F198K38011c82656A05803l1777b22103i7280J8850A970a50846O2350C77289
$$ 6198 244209 -382656 105803 74026 -222103 -97280 -78430 1970 -150846 -88496 377289
9282b60205H7278d3698D429c17274a01141l0848k2405C31671b20576A27163d15935
$$ -260205 87278 -43698 4429 -317274 -101141 -131989 -154394 331671 -220576 127163 -415935
9270a78344k72147G0863B5987a89233A77291b29968E0469a68745L2645l3303j71447
$$ -178344 -450491 70863 25987 -189233 177291 -229968 50469 -168745 -136100 -169403 -340850
9259c40850a886j47194B54215a61525o5563g9113k0092H9880a97728C344f8992
$$ -340850 -1886 -149080 254215 -161525 -227088 -79113 -99205 89880 -197728 3344 -68992
9247e936j62079I0461a64424d0007O890J3722j46156L793D2932b37427j0908L4098
$$ -5936 -168015 90461 -164424 -40007 -33117 -19395 -165551 -161758 42932 -237427 -248335 -214237
9235b14237l4879f7381J0180m4853c9659r3848A45512c5668j82798j59384a0823
$$ -214237 -249116 -67381 -57201 -102054 -39659 -133507 145512 -35668 -218466 -377850 -10823
9223b74601C2599J32677I900d9723k61391H4656f8857F7987B1654J6283J09815
$$ -274601 32599 165276 9900 -49723 -311114 84656 -68857 67987 21654 37937 147752
9212A47752a9k66494D1020c7929G467K5853L07453G002K5521c17075a20691j44610
$$ 147752 -19 -266513 41020 -37929 7467 33320 340773 7002 32523 -317075 -120691 -265301
9200b65301J14869K6719E9503N3168g5935B30194o5646n818c7437k30638C75884
$$ -265301 -150432 -123713 59503 112671 -75935 230194 164548 158730 -37437 -268075 375884
9188f5891j63975M7878m7433A03838N3472a78364A73063b50837d7531E8734b22911
$$ -65891 -229866 -181988 -229421 103838 157310 -178364 173063 -250837 -47531 58734 -222911
9176f0178l7134l7809j29406B3693b89745M1314I6577b31261Q3963e1409j85154
$$ -60178 -97312 -135121 -264527 23693 -289745 -248431 96577 -231261 -147298 -51409 -236563
9165b36563D2461c53918F0244a39882A39466a91078a2088q3307j71374a0948B75494
$$ -236563 42461 -353918 60244 -139882 139466 -191078 -12088 -95395 -266769 -10948 275494
9153a93317h8590A1691E140J83080h6599A82484a28248j24599a22601J6010m8786
$$ -193317 -88590 11691 5140 188220 -86599 182484 -128248 -252847 -122601 -106591 -155377
9142a55377D6163e3361p6033k70222a05304J1630j53484c766k4052q3157A18940
$$ -155377 46163 -53361 -129394 -399616 -105304 -93674 -247158 -3766 -27818 -110975 118940
9130c27449C8901f2120J2865A73017D7825d73027b7280q7433R119F1816E158N0060
$$ -327449 38901 -62120 -49255 173017 47825 -473027 -27280 -114713 -105594 61816 5158 55218
9118E5218a23721N9190C2620o188b77199c8937r2181P751C22806C7130K07930
$$ 55218 -123721 -64531 32620 26432 -277199 -38937 -131118 -123367 322806 37130 245060
9107B45060o1533H312R6135k8796a20396J1460J7015b8107Q95j17966j21676J4512
$$ 245060 183527 8312 104447 75651 -120396 -108936 -91921 -28107 -27212 -145178 -266854 -252342
9095b52342C27911a94336C4271a61248d3597a1369r6663A72665g7628l2860r327
$$ -252342 327911 -194336 34271 -161248 -43597 -11369 -108032 172665 -77628 -110488 -119815
9084a19815J7988B8608a2158j13602j27789a24249q3846A89085D0704a41177n7103
$$ -119815 -101827 28608 -12158 -125760 -253549 -124249 -208095 189085 40704 -141177 -198280
9073a98280c5490B92154l6443c40481g3940j63623K9008J6613J3972o6267k4133
$$ -198280 -35490 292154 255711 -340481 -73940 -237563 -208555 -191942 -177970 -244237 -268370
9062b68370A04278b01385H1253a52149B33129a2561B42841k9997a7427F7041J33453
$$ -268370 104278 -201385 81253 -152149 233129 -12561 242841 212844 -17427 67041 200494
9051B00494c32463B2855b68262A0817c59678g6359b8320B84082F9654R7780p9087
$$ 200494 -332463 22855 -268262 10817 -359678 -76359 -28320 284082 69654 167434 88347
9040H8347c623n07603a03386A48835b2520H2986a98346o9982d7587J1980A90411
$$ 88347 -3623 -511226 -103386 148835 -22520 82986 -198346 -268328 -47587 -35607 190411
9028A01625a36625I0830f4143b344k85268A34655r402a37897m3142k2440A3603
$$ 101625 -136625 90830 -64143 -2344 -287612 134655 125253 -137897 -181039 -203479 13603
9016A97938e1616j25184O6526B6236a10458j05984d7801K509n2847C41691a2452
$$ 197938 -51616 -176800 -110274 26236 -110458 -216442 -47801 -45292 -98139 341691 -12452
9004a7754k35508e1612F462N059K38648a12179j14574L0317B54810I0184L84877
$$ -17754 -253262 -51612 6462 11521 250169 -112179 -226753 -196436 254810 90184 475061
8993D75061b0542j43675d6317G4424a24067A8708c1787k60451h6287o0086p1138
$$ 475061 -20542 -164217 -46317 74424 -124067 18708 -31787 -292238 -86287 -146373 -217511
8982b17511d4971j4120j77728E9474a58045P8674A6298a95026A54862b78057H2312
$$ -217511 -44971 -59091 -236819 59474 -158045 -79371 16298 -195026 154862 -278057 82312
8970b69948a10835L1224k33853A2191N3744R4945d53777r5535B6444K48753c9006
$$ -269948 -110835 -79611 -313464 12191 65935 160880 -453777 -549312 26444 275197 -39006
8958f2004C36032r7048h5123H5215b59445M8751F6744h1916A4324a79771F5674
$$ -62004 336032 238984 -85123 85215 -259445 -210694 66744 -81916 14324 -179771 65674
8946d1671r2358B44497i233B06543C3665a11383P675p1431E0148h0073B7803i3336
$$ -41671 -134029 244497 -9233 206543 33665 -111383 -103708 -175139 50148 -80073 27803 -93336
8933a76869p4122A45526L1896p7633J23884a01354k31250h2630B1774O9677R4745
$$ -176869 -250991 145526 177422 99789 223673 -101354 -332604 -82630 21774 91451 186196
8922A86196J8836P31909J470421L309646A652033q16825B23981n8905j0755m5253
$$ 186196 205032 936941 2407362 5717008 1652033 835208 223981 165076 154321 109068
8912A09068O2887k6200m0288b90421J5773B76435E9468j4270g7335j01397f4064
$$ 109068 171955 145755 105467 -290421 -274648 276435 59468 45198 -77335 -178732 -64064
8900a01266j51036A34528a90779q741I9122a35990i535q3054j47001a7683o4491
$$ -101266 -252302 134528 -190779 -199520 99122 -135990 -9535 -92589 -239590 -17683 -82174
8889h2174B4472Q0849b14650F9226k1804j6043O1858i050l86566g9553L6536o7343
$$ -82174 24472 105321 -214650 69226 47422 31379 93237 -9050 -395616 -79553 -43017 -110360
8877a10360N0689B20733a15627m9168A61041F9546N6696a34699L304B3310a99934
$$ -110360 -59671 220733 -115627 -164795 161041 69546 126242 -134699 -131395 23310 -199934
$$ [...]
##END NTUPLES=NMR SPECTRUM
##END=
