
##TITLE=AC1332_INDRS10071_6642420_JtaGGXs3fK
##JCAMPDX= 6.0         $$ Bruker NMR JCAMP-DX V2.0
##DATA TYPE= NMR SPECTRUM
##DATA CLASS= NTUPLES
##ORIGIN= BRUKER
##OWNER= Administrator
$$ 1.72 TOPSPIN		Version 2.1
$$ 2012-08-08 19:33:26.843 -0500  Administrator@TOPSPIN
$$ Compression mode = diff/dup
##.OBSERVE FREQUENCY= 400.02188249412
##.OBSERVE NUCLEUS= ^1H
##.ACQUISITION MODE= SIMULTANEOUS (DQD)
##.ACQUISITION SCHEME= undefined
##.AVERAGES= 64
##.DIGITISER RES= 22
##SPECTROMETER/DATA SYSTEM= spect
##.PULSE SEQUENCE= noesygpps1d.comp
##.SOLVENT NAME= COFFEE_meoh
##.SHIFT REFERENCE= INTERNAL, COFFEE_meoh, 1, 14.96228
##AUDIT TRAIL= $$ (NUMBER, WHEN, WHO, WHERE, PROCESS, VERSION, WHAT)
$$ ##TITLE= Audit trail, TOPSPIN		Version 2.1
$$ ##JCAMPDX= 5.01
$$ ##ORIGIN= Bruker BioSpin GmbH
$$ ##OWNER= Administrator
$$ $$ C:\Bruker\TOPSPIN/data/COFFEE/nmr/AC1332_INDRS10071_6642420_JtaGGXs3fK/12/pdata/1/auditp.txt
$$ ##AUDIT TRAIL=  $$ (NUMBER, WHEN, WHO, WHERE, PROCESS, VERSION, WHAT)
(   1,<2012-08-08 19:33:21.796 -0500>,<Administrator>,<TOPSPIN>,<go>,<TOPSPIN 2.1>,
      <created by zg
	started at 2012-08-08 19:21:51.562 -0500,
	POWCHK enabled, PULCHK disabled,
       configuration hash MD5:
       6B 1B 68 BB D9 2E 58 E2 7F 35 AD 54 07 DF 0E 41
       data hash MD5: 64K
       0C B1 3E 27 75 B9 F0 86 68 A6 C5 F7 75 6B FD AD>)
(   2,<2012-08-08 19:33:24.703 -0500>,<Administrator>,<TOPSPIN>,<proc1d>,<TOPSPIN 2.1>,
      <Start of raw data processing
       efp LB = 0.3 FT_mod = 6 PKNL = 1 PHC0 = 0 PHC1 = 0 SI = 128K 
       data hash MD5: 128K
       38 EB 3D AC 66 AD 22 F0 3E 1E C7 D4 C2 6D 30 FB>)
(   3,<2012-08-08 19:33:25.843 -0500>,<Administrator>,<TOPSPIN>,<proc1d>,<TOPSPIN 2.1>,
      <pk PHC0 = -2.070923 PHC1 = 0 
       data hash MD5: 128K
       CF 23 AE 8E 3D 96 B0 EB 94 2B 8F 5A BE 02 6A FE>)
(   4,<2012-08-08 19:33:26.484 -0500>,<Administrator>,<TOPSPIN>,<proc1d>,<TOPSPIN 2.1>,
      <abs ABSG = 1 
       data hash MD5: 128K
       1D 3E 0B A8 90 94 F2 66 33 0B DB F4 B7 18 94 18>)
(   5,<2012-08-08 19:33:26.562 -0500>,<Administrator>,<TOPSPIN>,<proc1d>,<TOPSPIN 2.1>,
      <abs ABSG = 2 
       data hash MD5: 128K
       2B FC 41 47 D3 14 4D 6C F5 74 4A 0B 9C 52 8F F3>)
(   6,<2012-08-08 19:33:26.625 -0500>,<Administrator>,<TOPSPIN>,<proc1d>,<TOPSPIN 2.1>,
      <abs ABSG = 3 
       data hash MD5: 128K
       D3 A0 D6 72 B3 7B 81 51 19 77 E6 D2 36 94 A9 38>)
(   7,<2012-08-08 19:33:26.703 -0500>,<Administrator>,<TOPSPIN>,<proc1d>,<TOPSPIN 2.1>,
      <abs ABSG = 4 
       data hash MD5: 128K
       CE D3 46 A6 FE 9A 12 F9 DC ED A7 97 EF 0F 2A 10>)
(   8,<2012-08-08 19:33:26.750 -0500>,<Administrator>,<TOPSPIN>,<proc1d>,<TOPSPIN 2.1>,
      <abs ABSG = 5 
       data hash MD5: 128K
       6A 95 85 90 21 11 11 85 96 5D D8 04 17 D2 08 33>)
$$ ##END=
$$ 
$$ $$ hash MD5
$$ $$ 88 98 FB 1E 66 C9 3C DB A4 2B 97 8F 19 8F 61 31
##$RELAX= 
##$RELAX= 
##$RELAX= 
##$RELAX= 
##$RELAX= 
##$RELAX= 
##$RELAX= 
##$RELAX= 
$$ Bruker specific parameters
$$ [...]
##$TP07= 0
##$TPNAME0= <>
##$TPNAME1= <>
##$TPNAME2= <>
##$TPNAME3= <>
##$TPNAME4= <>
##$TPNAME5= <>
##$TPNAME6= <>
##$TPNAME7= <>
##$TPOAL= (0..7)
0.5 0.5 0.5 0.5 0.5 0.5 0.5 0.5
##$TPOFFS= (0..7)
0 0 0 0 0 0 0 0
##$TUNHIN= 0
##$TUNHOUT= 0
##$TUNXOUT= 0
##$USERA1= <user>
##$USERA2= <user>
##$USERA3= <user>
##$USERA4= <user>
##$USERA5= <user>
##$V9= 5
##$VALIST= <valist>
##$VCLIST= <CCCCCCCCCCCCCCC>
##$VD= 0
##$VDLIST= <DDDDDDDDDDDDDDD>
##$VPLIST= <PPPPPPPPPPPPPPP>
##$VTLIST= <TTTTTTTTTTTTTTT>
##$WBST= 1024
##$WBSW= 4
##$XGAIN= (0..3)
0 0 0 0
##$XL= 0
##$YL= 0
##$YMAX_a= 13222086
##$YMIN_a= -7807245
##$ZGOPTNS= <>
##$ZL1= 120
##$ZL2= 120
##$ZL3= 120
##$ZL4= 120
##$ABSF1= 14.96228
##$ABSF2= -5.595901
##$ABSG= 5
##$ABSL= 3
##$ALPHA= 0
##$AQORDER= 0
##$ASSFAC= 0
##$ASSFACI= 0
##$ASSFACX= 0
##$ASSWID= 0
##$AUNMP= <proc_prof1d_extract.lims>
##$AXLEFT= 0
##$AXNAME= <>
##$AXNUC= <1H>
##$AXRIGHT= 0
##$AXTYPE= 0
##$AXUNIT= <>
##$AZFE= 0.1
##$AZFW= 0.1
##$BCFW= 0
##$BC_mod= 0
##$BYTORDP= 0
##$COROFFS= 0
##$CY= 15
##$DATMOD= 1
##$DC= 0
##$DFILT= <>
##$DTYPP= 0
##$F1P= 0
##$F2P= 0
##$FCOR= 0.5
##$FTSIZE= 131072
##$FT_mod= 6
##$GAMMA= 0
##$GB= 0
##$INTBC= 1
##$INTSCL= 1
##$ISEN= 128
##$LB= 0.3
##$LEV0= 0
##$LPBIN= 0
##$MAXI= 10000
##$MC2= 0
##$MEAN= 0
##$ME_mod= 0
##$MI= 0
##$NCOEF= 0
##$NC_proc= -2
##$NLEV= 6
##$NOISF1= 0
##$NOISF2= 0
##$NSP= 0
##$NTH_PI= 0
##$NZP= 0
##$OFFSET= 14.96228
##$PC= 1
##$PHC0= -2.070923
##$PHC1= 0
##$PH_mod= 1
##$PKNL= yes
##$PPARMOD= 0
##$PPDIAG= 0
##$PPIPTYP= 0
##$PPMPNUM= 2147483647
##$PPRESOL= 1
##$PSCAL= 4
##$PSIGN= 0
##$PYNMP= <proc.py>
##$REVERSE= no
##$SF= 400.020009123526
##$SI= 131072
##$SIGF1= 0
##$SIGF2= 0
##$SINO= 400
##$SIOLD= 131072
##$SPECTYP= <>
##$SREGLST= <1H.CDCl3>
##$SSB= 0
##$STSI= 131072
##$STSR= 0
##$SW_p= 8223.68421052631
##$SYMM= 0
##$S_DEV= 0
##$TDeff= 65536
##$TDoff= 0
##$TI= <>
##$TILT= no
##$TM1= 0
##$TM2= 0
##$TOPLEV= 0
##$USERP1= <user>
##$USERP2= <user>
##$USERP3= <user>
##$USERP4= <user>
##$USERP5= <user>
##$WDW= 1
##$XDIM= 131072
##$YMAX_p= 415122433
##$YMIN_p= -10306
##$CURPLOT= <Network HP LaserJet P1505>
##$CURPRIN= <$Network HP LaserJet P1505>
##$DFORMAT= <normdp>
##$LAYOUT= <+/1D_H.xwp>
##$LFORMAT= <normlp>
##$PFORMAT= <normpl>
##$SURQMSG= 1
$$ End of Bruker specific parameters
$$ ---------------------------------
##NTUPLES= NMR SPECTRUM
##VAR_NAME=  FREQUENCY,     SPECTRUM/REAL,   SPECTRUM/IMAG
##SYMBOL=    X,             R,               I
##VAR_TYPE=  INDEPENDENT,   DEPENDENT,       DEPENDENT
##VAR_FORM=  AFFN,          ASDF,            ASDF
##VAR_DIM=   131072,        131072,          131072
##UNITS=     HZ,            ARBITRARY UNITS, ARBITRARY UNITS
##FACTOR=    0.0627417313425164, 1,          1
##FIRST=     8223.62146879497, 2421,         -48943
##LAST=      0,             3585,            -48967
##MIN=       0,             -10306,          0
##MAX=       8223.62146879497, 415122433,    0
$$ Real data points
##PAGE= N=1
##DATA TABLE= (X++(R..R)), XYDATA
$$ [...]
63515E64167k4766k3042k1044j9222j7384j5261j3128j1288r588p924o593n629
63503C89298m574l347k547k417k303j788j466j871k404k166j305o27l43RO74J534
63487C64357K512L549M382M926N598O768Q254R762J1414J3235J4592J4798J3980
63474D78127J2737J1240R194O437L003j005n104q350j0258j1452j2801j4154j4601
63461D43013j3759j2140j0474r151q212p305n947m237l035k810k798k037q27l20
63447C59961q14j440j451q86O4J429K918L820L868L682L985M805N702O430P093
63432C99166P982R395J1375J3503J5242J6543J7855J9533K1530K3711K6017K8270
63420F10122L0166L1662L3021L4324L5204L5179L3962L1299K6873K0717J3550
$$ plain form
63515 564167 539401 516359 495315 476093 458709 443448 430320 419032 409444 401520 394927 389298
63503 389298 384724 381377 378830 376413 374110 372322 370856 368985 366581 364415 363110 362483 362140 362149 362823 364357
63487 364357 366869 370418 374800 379726 385324 392092 400346 410108 421522 434757 449349 464147 478127
63474 478127 490864 502104 511298 517735 520738 519733 514629 506279 496021 484569 471768 457614 443013
63461 443013 429254 417114 406640 397489 389277 381972 376025 371788 368753 365943 363145 361108 360281 359961
63447 359961 359147 357707 356256 355370 355434 356863 359781 363601 367469 371151 375136 379941 385643 392073 399166
63432 399166 407148 416543 427918 441421 456663 473206 491061 510594 532124 555835 581852 610122
63420 610122 640288 671950 704971 739295 774499 809678 843640 874939 901812 922529 936079
63409I36079O462L07m509p813r540r868r274q346p605p538q564j0730j3403j5654
63395H30004j7073j7979j8716j9058j8699j7820j6716j5113j2587r567p101n557
63383F54018m308k876j574o99J24J301K665L986N486P204Q534R077R479J0603
63369G03020J2233J3373J3672J3774J4448J5923J7947J9899K1077K1460K2017
63358H88843K3594K5786K7496K8310K8435K7477K4468J9272J3017O788P45n037
63346A109194r729j2513j3614j3927j3876j3337j2512j2199j3015j4801j6913
63335I62758j8902k0656k2118k3074k3306k2784k1678k0297j9038j8179j7487
63324G35239j6204j3880j1168r373r020r272q999q032p056o544o241n646m625
$$ plain form
63409 936079 942541 942848 938339 930526 920986 911118 901844 893498 885893 878355 869791 859061 845658 830004
63395 830004 812931 794952 776236 757178 738479 720659 703943 688830 676243 666676 659575 654018
63383 654018 649710 646834 645260 644561 644685 645986 648651 652637 658123 665327 673861 682938 692417 703020
63369 703020 715253 728626 742298 756072 770520 786443 804390 824289 845366 866826 888843
63358 888843 912437 938223 965719 994029 1022464 1049941 1074409 1093681 1106698 1113486 1114231 1109194
63346 1109194 1099465 1086952 1073338 1059411 1045535 1032198 1019686 1007487 994472 979671 962758
63335 962758 943856 923200 901082 878008 854702 831918 810240 789943 770905 752726 735239
63324 735239 719035 705155 693987 684614 675594 666322 657323 649291 642235 635691 629450 623804 619179
63311F19179l575l075l356m070m794n587o693p699p827p156o799p314p756p118
63297E36360o038n995p132q052p797o955o498o419o111n501n107n226n542n563
63283D48424n171m687m501m646m786m636m286l991l859l868m049m332m397l965
63269C87250l206k619k499k781l248l714m024m096l906l423k734k254k497l384
63255C42865m122l931k742j051M96J254Q56k82j191j404j367j534j664j446j144
63240C23593j024p06J51R88J078O35L95L97J71j71o1M14O17M90N69Q51P19J68
63222C29274L5O43J183R42K90q2j35r2K53J109K062K542K642K841L094K796J693
63205C51090L29m88n07j76o5j89l2P05J587J986J904J888K199K477K333J810J253
$$ plain form
63311 619179 615604 612529 609173 605103 600309 594722 588029 580330 572503 565347 558548 551234 543478 536360
63297 536360 530322 524327 517195 509143 501346 494391 487893 481474 475363 469862 464755 459529 453987 448424
63283 448424 443253 438566 434065 429419 424633 419997 415711 411720 407861 403993 399944 395612 391215 387250
63269 387250 384044 381425 378926 376145 372897 369183 365159 361063 357157 353734 351000 348746 346249 342865
63255 342865 338743 334812 332070 331019 331515 332769 333625 333343 332152 330748 329381 327847 326183 324737 323593
63240 323593 322569 321863 322014 323002 324080 324715 325110 325507 325678 325507 325446 325860 326477 326967 327536 328387 329106 329274
63222 329274 329309 329952 331135 332077 332367 332285 332150 332058 332311 333420 335482 338024 340666 343507 346601 349397 351090
63205 351090 351419 350931 350424 350248 350183 349994 349962 350667 352254 354240 356144 358032 360231 362708 365041 366851 368104
63188C68104R24R27J193J614K240L284M634N728O190O350O650O917O820O720P298
63173D35593Q355Q856Q270P158O375O268O792P706Q437Q364P511O528N847N315
63159E37375M674L868K864J689O74N3n92j800l198l966m300n282p041q192p767
63144E09059o644o275o757p069o641n850n253n056n115m930l987k538j600j647
63130D39697j805j040L25J043O59LK4Q22J805K319K084J437J099J336J576J234
63114D52618O81P50J436J779J184K69N2P32J600J966J806J529J332J063O36L25
63098D69758L73N28K97l33q29q16n07l16m04p46j243j565j300m85K99O42P59R99
63080D65111J271J308J237J463K180L298M641N903O619O548N997N551N538N873
$$ plain form
63188 368104 369028 369955 371148 372762 375002 378286 382920 388648 394838 401188 407838 414755 421575 428295 435593
63173 435593 443948 452804 461074 468232 474607 480875 487667 495373 503810 512174 519685 526213 532060 537375
63159 537375 542049 545917 548781 550470 551144 551197 550605 548805 545607 541641 537341 532059 525018 516826 509059
63144 509059 502415 496140 489383 482314 475673 469823 464570 459514 454399 449469 445482 442944 441344 439697
63130 439697 437892 436852 437177 438220 438879 438882 438906 439728 441533 443852 445936 447373 448472 449808 451384 452618
63114 452618 453299 454049 455485 457264 458448 458717 458769 459501 461101 463067 464873 466402 467734 468797 469433 469758
63098 469758 470131 470659 470956 470623 469794 468978 468471 468155 467751 467005 465762 464197 462897 462412 462711 463353 464112 465111
63080 465111 466382 467690 468927 470390 472570 475868 480509 486412 493031 499579 505576 511127 516665 522538
63066E22538O213O158N528M606L845L183K087M30j112j921k278k840l623m121
63052E38693m245m472n042n564n653n539n692o059n971m979l566k804l158l939
63038D72010m166l738l301l128k830k287k068k556l176l075k192j181n03j69j48
63023D37492m91j037j473j663j679j567j380j327j554j771j532q38k04l1j80k78
63007D20487k39k59m23m87j60N29J274J960K777L809M735N290N704O306O817O662
62991D64782N918N368N494N904N982N667N302N121N065M827M030K739J786J978
62977E29963K881L052J774j86j852l305n116p203r003j0371j1621j2921j4263
62964D61829j5678j6957j7428j6727j5459j4483j3793j2867j1810j1248j1088
$$ plain form
63066 522538 528751 534909 540437 545043 548888 552071 554158 554588 553476 551555 549277 546437 542814 538693
63052 538693 534448 529976 524934 519370 513717 508178 502486 496427 490456 485477 481911 479107 475949 472010
63038 472010 467844 464106 460805 457677 454847 452560 450492 447936 444760 441685 439493 438312 437809 437640 437492
63023 437492 437001 435964 434491 432828 431149 429582 428202 426875 425321 423550 422018 421180 420976 420945 420765 420487
63007 420487 420248 419989 419566 419079 418919 419448 420722 422682 425459 429268 434003 439293 444997 451303 458120 464782
62991 464782 470700 476068 481562 487466 493448 499115 504417 509538 514603 519430 523460 526199 527985 529963
62977 529963 532844 535896 537670 537484 535632 532327 527211 520008 511005 500634 489013 476092 461829
62964 461829 446151 429194 411766 395039 379580 365097 351304 338437 326627 315379 304291
62953C04291j0412q857p281o574o430n882m644l367k652k342j877j066k54J28
62939B42781L2k54m63n23m52l59m85j000j679k051j981j854k064k568l040l221
62923B20819l002k451j910j767j955j997j601r09n9R84J913K014J064j46o70n21
62907B09806m03o04p59n62k12p4k38n24o74n80l78k51j09L18R46J320J213R71
62889B09206R48J008Q55N08J61j18k34N2P51J434J754J869K129K632L336M193
62873B30484M889M990M723N031O293P496P336N801M038K992K779L119L591L523
62859B97085K372L07j882l426l879l163j818r14j107j929k452k419k220k102j984
62844B70469j795j406m80R34J951J757P88K45M84P22L67j93l05J02O55J012J004
$$ plain form
62953 304291 293879 285022 277741 271167 264737 258855 254211 250844 248192 245850 243973 242907 242653 242781
62939 242781 242813 242559 242096 241573 241121 240762 240277 239277 237598 235547 233566 231712 229648 227080 224040 220819
62923 220819 217817 215366 213456 211689 209734 207737 206136 205227 205168 206152 208065 210079 211143 210997 210327 209806
62907 209806 209403 208799 208040 207478 207266 207192 206954 206430 205756 205176 204798 204547 204438 204756 205702 207022 208235 209206
62889 209206 210154 211162 212017 212525 212686 212568 212334 212386 213137 214571 216325 218194 220323 222955 226291 230484
62873 230484 235373 240363 245086 250117 256410 263906 271242 277043 281081 284073 286852 289971 293562 297085
62859 297085 299457 299764 297882 294456 290577 287414 285596 284682 283575 281646 279194 276775 274555 272453 270469
62844 270469 268674 267268 266788 267722 269673 271430 272218 272463 272947 273669 274036 273843 273538 273640 274295 275307 276311
62827B76311O96M23M30M88K05l58p45o67j54O62J422J488O31m76j025j214j839
62810B76278k983l843l926l607l453l654m219m983n411n026m145l525l246k723
62796B21534j918j560j939k319k042j442j160j175j073q36p66r43j201j390j428
62781B00342j284j166j346j650j569j027n87n90o50l19J95M16L26J96K4l38o98
62764A90275o67k51J41K85M21Q54J515K090K417K642K880K948K640K246K377L106
62748B15919L677L465K875K760L227L597L423K909K315J639J019Q26J131J500
62734B50282J507J139N45j88r64j717k543l415l881l575l002l010l501l466k597
62719B21614j971k590l873m344l386j731m11J46R3k19m75n07l53j02K17O03J083
$$ plain form
62827 276311 277007 277430 277860 278348 278553 278195 277450 276783 276629 277291 278713 280201 280832 280356 279331 278117 276278
62810 276278 273295 269452 265526 261919 258466 254812 250593 245610 240199 235173 231028 227503 224257 221534
62796 221534 219616 218056 216117 213798 211756 210314 209154 207979 206906 206070 205304 204361 203160 201770 200342
62781 200342 199058 197892 196546 194896 193327 192300 191713 191123 190473 190154 190349 190765 191091 191287 191311 190973 190275
62764 190275 189608 189357 189498 189783 190204 191058 192573 194663 197080 199722 202602 205550 208190 210436 212813 215919
62748 215919 219596 223061 225936 228696 231923 235520 238943 241852 244167 245806 246825 247651 248782 250282
62734 250282 251789 252928 253473 253285 252321 250604 248061 244646 240765 237190 234188 231178 227677 224211 221614
62719 221614 219643 217053 213180 208836 205450 203719 203308 203454 203547 203328 202853 202346 201993 201891 202108 202711 203794
62702B03794J723K463L022L203L285L746M576N253N465N488N785O543P746R271
62688B71363J0832J2140J3226J4311J5290J5761J5685J5532J5554J5327J4303
62677D29324J2532J0591Q944P512N721L018n37m165p130r400j1316j2870j3855
62664D18369j4480j5120j5563j5247j4250j3214j2267j0903r158p913p601p524
62652B75129o945o097n461m809l826k985k935l345l285k542j778j460j372j239
62638B27050j132j193j398j732k165k437k231j608r76n90l96l45n34r03j136r74
62622B07300n56k43k46m01l68K4M95N78R6o12j044j019p79o44o03l48K72Q80R00
62603B03682K57m58o55k20P21K083L475M127L735L070L098L736M130M040M068
$$ plain form
62702 203794 205517 207980 211002 214205 217490 221236 225812 231065 236530 242018 247803 254346 262092 271363
62688 271363 282195 294335 307561 321872 337162 352923 368608 384140 399694 415021 429324
62677 429324 441856 452447 461391 468903 474624 477642 477105 472940 465810 456410 445094 432224 418369
62664 418369 403889 388769 373206 357959 343709 330495 318228 307325 298167 290254 282653 275129
62652 275129 268184 262087 256626 251817 247991 245006 242071 238726 235441 232899 231121 229661 228289 227050
62638 227050 225918 224725 223327 221595 219430 216993 214762 213154 212178 211588 211192 210847 210313 209410 208274 207300
62622 207300 206744 206501 206255 205854 205486 205510 206005 206583 206679 206067 205023 204004 203225 202581 201978 201630 201902 202782 203682
62603 203682 203939 203481 202826 202606 203327 205410 208885 213012 216747 219817 222915 226651 230781 234821 238889
62588B38889M550N014M964M540M097L706L311K966K686K392K073J726J179M59
62574B82552N8K80N23K9q16q97k00pj021k305k686k261j880j881k078k359k612
62557B62439k575k331k487l192l501k469n52P58N95n55j635k031j926j953k420
62542B36165k786k222p88L99M17n15j542k142k251j994j734j906k474k797k437
62527B11393j669r46l34K53P01R39J095J185J088R82J275J873K169K024J985K285
62511B26298K444K254K310L026L915M415M715N183N763O494P791R504J0584J0459
62497C05155R932R877R865R127P999P324O949O073M578K865Q77j542l692m713
62483C70674n000n679o762p114o252n075m554m662m810m625m081l541l576m221
$$ plain form
62588 238889 243439 248453 253417 257957 262054 265760 269071 272037 274723 277115 279188 280914 282093 282552
62574 282552 282610 282890 283413 283442 282626 281729 281529 281522 280501 278196 275510 273249 271369 269488 267410 265051 262439
62557 262439 259864 257533 255046 251854 248353 245884 245332 246090 246685 246130 244495 242464 240538 238585 236165
62542 236165 233379 231157 230369 230768 231185 230670 229128 226986 224735 222741 221007 219101 216627 213830 211393
62527 211393 209724 208778 208444 208697 209398 210337 211432 212617 213705 214687 215962 217835 220004 222028 224013 226298
62511 226298 228742 230996 233306 236332 240247 244662 249377 254560 260323 266817 274608 284112 294696 305155
62497 305155 315087 324964 334829 343956 351955 359279 366228 372301 376879 379744 380621 379079 375387 370674
62483 370674 365674 359995 353233 346119 339867 334792 330238 325576 320766 316141 312060 308519 304943 300722
62469C00722m565l869k756k448l010l349k864k063j508j164r33q99q81n49j48
62454B69716k78q18q87j12Q55J275J130Q20O69R10J515J890J368J42q68j074o11
62437B75642K45J229J663Q45q80k253k544k204j813j252k51R19J788K220K248
62422B75602J903J510J632K337K969L031K877L165L913M550M717M640M770N227
62408C22843N739O045O325O859P376P221O448O150P106Q637R463R368R205R529
62394D28314J0104J0703J1380J1900J1674J0589R258Q289P716P237O534N363L838
62381E42899K592K180K428K785L109L591M202M863N865P407R028J0323J1860J4402
62367F27534J7525K0102K2013K4209K7153L0344L3471L6839M0564M4372M8318
$$ plain form
62469 300722 296157 292288 289532 287084 284074 280725 277861 275798 274290 273126 272193 271294 270413 269864 269716
62454 269716 269438 268620 267733 267621 268476 269751 270881 271701 272370 273280 274795 276685 278053 278195 277327 276253 275642
62437 275642 275887 277116 278779 279624 278744 276491 273947 271743 269930 268678 268427 269346 271134 273354 275602
62422 275602 277505 279015 280647 282984 285953 288984 291861 295026 298939 303489 308206 312846 317616 322843
62408 322843 328582 334627 340952 347811 355187 362408 368856 375006 382112 390749 400212 409580 418785 428314
62394 428314 438418 449121 460501 472401 484075 494664 503922 512211 519927 527164 533698 539061 542899
62381 542899 545491 547671 550099 552884 555993 559584 563786 568649 574514 581921 590949 601272 613132 627534
62367 627534 645059 665161 687174 711383 738536 768880 802351 839190 879754 924126 972444
62356I72444N2598N6528N8917N9539N9015N7093N2504M4940L5785K6353J6776
62345A492492P248j191q060j4411k1322k8370l4541l9708m4160m7557m9458n0167
62333A160795n0051m8723m5854m2152l8591l5280l2079k9547k8113k6895k4593
62322G58917k1268j8082j5569j3295j1033r087p492n895m329l206k427j323L41
62309F46252K016L167L810M228M645N250O037O568O444N960N807O073O104N394
62295G17755M179L070K502K601L169L745L972L952M024M269M576N108O200P720
62281G76842Q950R383R411R904J1135J2365J2750J2497J2679J3847J5371J6579
62269I21713J7851J9849K2139K3803K5158K7541L1101L4299L6211L8061M1448
$$ plain form
62356 972444 1025042 1081570 1140487 1200026 1259041 1316134 1368638 1413578 1449363 1475716 1492492
62345 1492492 1499740 1498549 1490489 1476078 1454756 1426386 1391845 1352137 1307977 1260420 1210962 1160795
62333 1160795 1110744 1062021 1016167 974015 935424 900144 868065 838518 810405 783510 758917
62322 758917 737649 719567 703998 690703 679670 670583 663091 657196 652867 649661 647234 645911 646252
62309 646252 648268 651435 655245 659473 664118 669368 675405 681973 688417 694377 700184 706257 712361 717755
62295 717755 721934 725004 727506 730107 733276 737021 740993 744945 748969 753238 757814 762922 769122 776842
62281 776842 785792 795175 804586 814490 825625 837990 850740 863237 875916 889763 905134 921713
62269 921713 939564 959413 981552 1005355 1030513 1058054 1089155 1123454 1159665 1197726 1239174
62258A239174M6077N0450N4089N7727O1532O4409O5120O3302N9181N3003M4897
62247A858961L5043K3970J2816K856n517j2919j9732k5359k9213l1751l3771l5291
62235A740093l5901l5672l4752l2695k9279k5569k2832k0690j7712j3841j0745
62224A460405r404q715p138m705k541j104K17K082M432O631Q037Q543Q758R472
62210A474970J0914J2766J4784J6926J8905K0270K1093K1966K3122K4128K4704
62199A684548K5269K6319K7771K9437L1591L4450L7370L9325M0294M1521M4080
62188B061975M7535N0405N1851N2447N3071N3454N2346M9158M4715M0101L5366
62177B592424L0018K4472K0156J8080J7969J8973K0716K3341K6951L1388L6354
$$ plain form
62258 1239174 1285251 1335701 1389790 1447517 1509049 1573458 1638578 1701880 1761061 1814064 1858961
62247 1858961 1894004 1917974 1930790 1933646 1928129 1915210 1895478 1870119 1840906 1809155 1775384 1740093
62235 1740093 1704192 1668520 1633768 1601073 1571794 1546225 1523393 1502703 1484991 1471150 1460405
62224 1460405 1451001 1442286 1435148 1430443 1427902 1426798 1427015 1429097 1433529 1440160 1448197 1456740 1465498 1474970
62210 1474970 1485884 1498650 1513434 1530360 1549265 1569535 1590628 1612594 1635716 1659844 1684548
62199 1684548 1709817 1736136 1763907 1793344 1824935 1859385 1896755 1936080 1976374 2017895 2061975
62188 2061975 2109510 2159915 2211766 2264213 2317284 2370738 2423084 2472242 2516957 2557058 2592424
62177 2592424 2622442 2646914 2667070 2685150 2703119 2722092 2742808 2766149 2793100 2824488 2860842
62166B860842M1417M6072M9979N3062N5200N5915N4558N0839M5104L8187L0908
62155C382083K3691J6599R780L725j139n010q590j2294j5845j8708k0777k2358
62143C331157k3549k3888k2885k0819j8687j7114j5582j3208j0169p769o923p114
62131C143450p254p003o734o520n998n231m955n642o682o917n930m450l471l107
62117C063556k590j453l25j85r97j709j669j456j912k999m085m951n793o446o412
62102C020574n727n119n055n144m809m211m067m599n087m627l239j934j600k023
62088B963333k256j762p85K57J258K189L028M075N848Q214J0182J0996J0992J0805
62074C026374J0175Q273N094J709q61k450l408l963m069l458j776J026M404P616
$$ plain form
62166 2860842 2902259 2948331 2998310 3051372 3106572 3162487 3217045 3267884 3312988 3351175 3382083
62155 3382083 3405774 3422373 3432153 3435878 3434739 3429729 3421139 3408845 3393000 3374292 3353515 3331157
62143 3331157 3307608 3283720 3260835 3240016 3221329 3204215 3188633 3175425 3165256 3157487 3150564 3143450
62131 3143450 3136196 3129193 3122459 3115939 3109941 3104710 3099755 3094113 3087431 3080514 3074584 3070134 3066663 3063556
62117 3063556 3060966 3059513 3059188 3059003 3058006 3056297 3054628 3053172 3051260 3048261 3044176 3039225 3033432 3026986 3020574
62102 3020574 3014847 3009728 3004673 2999529 2994720 2990509 2986442 2981843 2976756 2972129 2968890 2966956 2965356 2963333
62088 2963333 2961077 2959315 2958530 2958787 2960045 2962234 2965262 2969337 2975185 2983399 2993581 3004577 3015569 3026374
62074 3026374 3036549 3044822 3049916 3051625 3050764 3048314 3044906 3040943 3036874 3033416 3031640 3032666 3037070 3044686
62060C044686J0226J1671J0461M700o026j9560l2361m1781m7124m9071m8740m7444
62048B789637m6875m8758n3890o1446o9391p5675p9110p9414p6960p2575o7223
62037B058320o1523n5747n0261m5648m2086l8998l5711l2311k9503k7799k7075
62026A611658k6861k6762k6604k6435k6388k6492k6600k6514k6076k5281k4447
62015A323198k4080k4105k3471k1272j8179j5906j4991j4031j1550p761l872m90
62003A143490K440M859O739Q549J0491J1648J0938Q716O286L917M86m693j0804
61990A203062j6703k2161k7327l1653l4195l4740l4021l2869l1512k9681k7234
61979H80966k4557k2280k0633j9198j7464j5415j3352j1407r567q022p033o535
$$ plain form
62060 3044686 3054912 3066583 3077044 3081744 3075718 3056158 3023797 2982016 2934892 2885821 2837081 2789637
62048 2789637 2742762 2694004 2640114 2578668 2509277 2433602 2354492 2275078 2198118 2125543 2058320
62037 2058320 1996797 1941050 1890789 1845141 1803055 1764057 1728346 1696035 1666532 1638733 1611658
62026 1611658 1584797 1558035 1531431 1504996 1478608 1452116 1425516 1399002 1372926 1347645 1323198
62015 1323198 1299118 1275013 1251542 1230270 1212091 1196185 1181194 1167163 1155613 1147852 1143980 1143490
62003 1143490 1145930 1150789 1157528 1166077 1176568 1188216 1199154 1207870 1214156 1218073 1218559 1213866 1203062
61990 1203062 1186359 1164198 1136871 1105218 1071023 1036283 1002262 969393 937881 908200 880966
61979 880966 856409 834129 813496 794298 776834 761419 748067 736660 727093 719071 712038 705503
61967G05503o176n669m887l862k967k765l155l018j413J022K652K841K664L502
61953F84272N530P920R911J1351J2485J3694J5298J7299J9406K1419K3574K6330
61941H68489K9752L3162L5569L6578L6688L6551L6156L5247L4229L3889L4091
61930A250401L3591L1587K8639K5620K2551J9102J5588J2598J0198Q355P666Q790
61918A474686J1480J5116J9910K6580L5014M4212N3510O2962P2568Q2019R1267
61907A989324J00575J09864J18739J27222J35897J45357J56124J68867J83830
61898C235799K00051K15821K29636K39798K43157K35499K13599J76451J24969
61889E114780O1983p158p5379j36437j86761k24999k50907k65140k69322k65492
$$ plain form
61967 705503 699327 693658 688771 684909 681942 679177 676022 673004 671591 672613 675265 678106 680770 684272
61953 684272 689802 697722 707633 718984 731469 745163 760461 777760 797166 818585 842159 868489
61941 868489 898241 931403 966972 1003550 1040238 1076789 1112945 1148192 1182421 1216310 1250401
61930 1250401 1283992 1315579 1344218 1369838 1392389 1411491 1427079 1439677 1449875 1458230 1465896 1474686
61918 1474686 1486166 1501282 1521192 1547772 1582786 1626998 1680508 1743470 1816038 1898057 1989324
61907 1989324 2089899 2199763 2318502 2445724 2581621 2726978 2883102 3051969 3235799
61898 3235799 3435850 3651671 3881307 4121105 4364262 4599761 4813360 4989811 5114780
61889 5114780 5176763 5169605 5094226 4957789 4771028 4546029 4295122 4029982 3760660 3495168
61879C495168k55609k41537k24822k06300j86487j66552j48172j32202j18110
61870A815377j05004r2556q0841o9941o0075n1474m3867l6620k9590k3202j7491
61859A204716j1717n248J768Q792J5425K1367K6516L1237L5947M0264M3285M4789
61847A457141M5414M5385M3990M0587L5416K8977K1383J2775L806m699j2090j7699
61835A700386k0922k1687k0315j6857j1299m470K173P862J2712J6470J8219J7580
61823A679852J5092J0964M625l817j2888k1264k8971l6207m2084m5578m6976m7257
61811A425491m6640m4819m2075l9029l5692l1676k7196k2956j9173j5440j1392
61800A089403o985k330K219O094R113J1772J4617J7771K1322K5481K9949L3884
$$ plain form
61879 3495168 3239559 2998022 2773200 2566900 2380413 2213861 2065689 1933487 1815377
61870 1815377 1710373 1617817 1536976 1467035 1406960 1355486 1311619 1274999 1245409 1222207 1204716
61859 1204716 1192999 1187751 1189519 1198311 1213736 1235103 1261619 1292856 1328803 1369067 1412352 1457141
61847 1457141 1502555 1547940 1591930 1632517 1667933 1696910 1718293 1731068 1734874 1730175 1718085 1700386
61835 1700386 1679464 1657777 1637462 1620605 1609306 1604836 1607009 1614871 1627583 1644053 1662272 1679852
61823 1679852 1694944 1705908 1710533 1706716 1693828 1672564 1643593 1607386 1565302 1519724 1472748 1425491
61811 1425491 1378851 1334032 1291957 1252928 1217236 1185560 1158364 1135408 1116235 1100795 1089403
61800 1089403 1082418 1080088 1082307 1088401 1097514 1109286 1123903 1141674 1162996 1188477 1218426 1252310
61788A252310L7163M0899M6001N2006N8139O4762P2762Q2155R2387J03623J16605
61777B018812J31490J47856J65718J85632K07935K32686K60141K90493L23237
61768C964000L57433L92232M26052M55292M74572M78191M60875M17998L46891
61759G773536K49015J30724K028j25333k39961l33277m01386m44654m65619m67594
61749E677479m54617m31279m01779l69296l36114l03794k73190k44747k18873
61740B643790j95720j74924j56047j39088j24127j10792r8724q8184p9419p1663
61730A405102o3732n5582m8347m2732l8137l3563k8750k4204k0657j8713j8529
61719A012156j9671k1496k3626k5768k7390k8164k8544k9087k9371k8369k5980
$$ plain form
61788 1252310 1289473 1330372 1376373 1428379 1486518 1551280 1624042 1706197 1798584 1902207 2018812
61777 2018812 2150302 2298158 2463876 2649508 2857443 3090129 3350270 3640763 3964000
61768 3964000 4321433 4713665 5139717 5595009 6069581 6547772 7008647 7426645 7773536
61759 7773536 8022551 8153275 8155303 8029970 7790009 7456732 7055346 6610692 6145073 5677479
61749 5677479 5222862 4791583 4389804 4020508 3684394 3380600 3107410 2862663 2643790
61740 2643790 2448070 2273146 2117099 1978011 1853884 1743092 1644368 1556184 1476765 1405102
61730 1405102 1341370 1285788 1237441 1194709 1156572 1123009 1094259 1070055 1049398 1030685 1012156
61719 1012156 992485 970989 947363 921595 894205 866041 837497 808410 779039 750670 724690
61708G24690k3359k1521k0357j9267j8057j6784j5308j3537j1842j0736j0253
61697E43669r978r602r250r216r518r759r498q684p654o757o250o403p257q196
61683D25647q339p557o610o049n633n102m809m959n004m447l732l494l454k941
61669C53517k083j555j421j151o03n3M92J159J518J054J86r1L80R15J338K271
61653C55873L830N157N618N655O008O774P679Q610R353R409Q558P273O207N457
61639D51461M622L369J771K51p91j393j956k500k341r77J071K881M302N811P405
61624D72986Q531Q979Q969Q301O368L134o14m193p455j0245j2302j3875j5510
61611D53074j6842j6641j4523j1879j0376j0128j0006r210p897o531n404m675
$$ plain form
61708 724690 701331 679810 659453 640186 622129 605345 590037 576500 564658 553922 543669
61697 543669 533691 524089 514839 505623 496105 486346 476848 468164 460510 453753 447503 441100 433843 425647
61683 425647 417308 409751 403141 397092 391459 386357 381548 376589 371585 367138 363406 359912 356458 353517
61669 353517 351434 349879 348458 347307 346704 346651 347143 348302 349820 350874 351060 350969 351349 352264 353602 355873
61653 355873 359703 364860 370478 376133 382141 388915 396594 405204 414557 423966 432524 439797 446004 451461
61639 451461 456083 459452 461223 461474 460683 459290 457334 454834 452493 451516 452587 455468 459770 465581 472986
61624 472986 481517 490496 499465 507766 514134 517268 516654 512461 505006 494761 482459 468584 453074
61611 453074 436232 419591 405068 393189 382813 372685 362679 353469 345572 339041 333637 328962
61599C28962m386m309m010l150j728j82Q25J035R39J229J935K522K725K781K894
61584C28082L101L677M955O605P730P997Q040Q443Q938R025Q818Q825R239R935
61570D33410J0809J1741J2434J2693J2680J2631J2474J1963J1113J0259R715R463
61558E71385R082Q129O774N865O003O697O935O468N968N896N900N520M843M113
61544F59578L233K114J126P08P13N12l53j822l539n217o677p717q064p714p252
61529F19629p324p685p187n147k219N24K841M988O795Q072R537J2117J5340J7753
61515F68034J9120K0961K4436K8832L2877L6567M0755M5638N0709N5849O1563
61504A085341O8074P4929Q1606Q7988R4020R9077J01803J00699R4922Q4607P0413
$$ plain form
61599 328962 324576 320267 316257 313107 311379 311197 312022 313057 313996 315225 317160 319682 322407 325188 328082
61584 328082 331183 334860 339815 346420 354150 362147 370187 378630 387568 396593 405411 414236 423475 433410
61570 433410 444219 455960 468394 481087 493767 506398 518872 530835 541948 552207 561922 571385
61558 571385 580467 588596 595370 601235 607238 613935 620870 627338 633306 639202 645102 650622 655465 659578
61544 659578 662811 664925 666051 666759 667472 667984 667631 665809 662270 657053 650376 642659 634595 626881 619629
61529 619629 612305 604620 597433 592286 590067 590591 593432 598420 605215 613287 622824 634941 650281 668034
61515 668034 687154 708115 732551 761383 794260 830827 871582 917220 967929 1023778 1085341
61504 1085341 1153415 1228344 1309950 1397938 1491958 1591035 1692838 1793537 1888459 1973066 2043479
61493B043479N3030L3304J2593p549k5923m1649n3861o2156o7252p0396p1936
61482A741684p1137o7553o1981n5730m9569m3673l8048l2658k7426k2478j8100
61471A253331j4285j0709p260m250j877J40K178M343O585Q886J1179J3310J5173
61458A276744J6656J7555J7857J7994J8397J8950J9297J9497J9860K0358K0827
61447A483992K1630K3334K5736K7946K9419L0226L0260K9035K6361K2577J8027
61436A768543J2979Q144M391J782m31k708m782o350p452q137q482q992j0118j1338
61422A727049j1682j1213j1058j1834j3060j4245j5410j6222j5890j4441j3017
61411A578977j2298j1582j0082q245p163p392q813j0919j2775j3544j3440j3386
$$ plain form
61493 2043479 2096509 2129813 2142406 2134857 2108934 2067285 2013424 1951268 1884016 1813620 1741684
61482 1741684 1670547 1602994 1541013 1485283 1435714 1392041 1353993 1321335 1293909 1271431 1253331
61471 1253331 1239046 1228337 1221077 1216827 1214950 1215090 1217268 1221611 1228196 1237082 1248261 1261571 1276744
61458 1276744 1293400 1310955 1328812 1346806 1365203 1384153 1403450 1422947 1442807 1463165 1483992
61447 1483992 1505622 1528956 1554692 1582638 1612057 1642283 1672543 1701578 1727939 1750516 1768543
61436 1768543 1781522 1789666 1794057 1795839 1795408 1792700 1787918 1781568 1774116 1765979 1757497 1748505 1738387 1727049
61422 1727049 1715367 1704154 1693096 1681262 1668202 1653957 1638547 1622325 1606435 1591994 1578977
61411 1578977 1566679 1555097 1545015 1536770 1529607 1522215 1513402 1502483 1489708 1476164 1462724 1449338
61399A449338j3495j2838j1070r015p061m340k57M357Q651J3203J9026K5987L3274
61386A495760M0665M8283N5779O2882P0170P8220Q6479R3864R9985J04828J07714
61375B344629J07536J03626R5678Q3293O6593M6914K6093N425j4094l1171m4877
61364B789645n5655o4796p3060q0263q5870q9366r0520q9814q8129q5599q1511
61353A905062p5803o9759o4393n9064n2717m5727l9362l4039k9268k4921k1353
61342A388656j8487j5776j2997j0316p710m930j802J877O239J0554J3259J3520
61330A362087J2273J0954R944Q950Q195Q116Q409Q373P838P012N911M643L703
61317A466408L173K338Q54m93j009j232j884k603k801k820l053k910k034j581
$$ plain form
61399 1449338 1435843 1423005 1411935 1402920 1395859 1391519 1391262 1395619 1404270 1417473 1436499 1462486 1495760
61386 1495760 1536425 1584708 1640487 1703369 1773539 1851759 1938238 2032102 2132087 2236915 2344629
61375 2344629 2452165 2555791 2651469 2734762 2801355 2848269 2874362 2879787 2865693 2834522 2789645
61364 2789645 2733990 2669194 2596134 2515871 2430001 2340635 2250115 2160301 2072172 1986573 1905062
61353 1905062 1829259 1759500 1695107 1636043 1583326 1537599 1498237 1464198 1434930 1410009 1388656
61342 1388656 1370169 1354393 1341396 1331080 1323370 1318440 1316638 1318515 1324754 1335308 1348567 1362087
61330 1362087 1374360 1385314 1395258 1404208 1412403 1420519 1428928 1437301 1445139 1452151 1458062 1462705 1466408
61317 1466408 1469581 1471919 1472773 1472280 1471271 1470039 1468155 1465552 1462751 1459931 1456878 1453968 1451934 1450353
61303A450353k707m530n310n013n016n744o421o810p397p983p730o552m974k880
61289A371286NK579L014R52k394o187j0388j4380j7016j8166j8639j8464j6909
61276A255293j4335j2282j1336j0518r178p909p029n671l038N66M471Q377J2098
61263A199509J5620J9552K4407K9377L3033L5198L6812L8053L8263L7667L7386
61252A544877L7517L7135L6623L8043M2382M7968N2353N4240N2929M7592L8074
61241B029733K5128R176r689k9807m7787o1266p0592p6856p9865p9118p5400p0036
61229A463621o3576n6293m8915m1798l4482k7062k0963j7282j5381j4187j3800
61218A109882j4555j5539j5409j4057j2257j0286q021n836m323l588l600m606
$$ plain form
61303 1450353 1447646 1443116 1437806 1432793 1427777 1422033 1415612 1408802 1401405 1393422 1385692 1379140 1374166 1371286
61289 1371286 1371291 1373870 1376884 1377836 1375442 1369255 1358867 1344487 1327471 1309305 1290666 1272202 1255293
61276 1255293 1240958 1228676 1217340 1206822 1197644 1189735 1182706 1177035 1173997 1174563 1179034 1187411 1199509
61263 1199509 1215129 1234681 1259088 1288465 1321498 1356696 1393508 1431561 1469824 1507491 1544877
61252 1544877 1582394 1619529 1656152 1694195 1736577 1784545 1836898 1891138 1944067 1991659 2029733
61241 2029733 2054861 2064037 2054348 2024541 1976754 1915488 1844896 1768040 1688175 1609057 1533657 1463621
61229 1463621 1400045 1343752 1294837 1253039 1218557 1191495 1170532 1153250 1137869 1123682 1109882
61218 1109882 1095327 1079788 1064379 1050322 1038065 1027779 1019758 1013922 1009599 1006011 1002411 997805
61206I97805o443q111q867r037r019q359o672m625k972j513PQ72L79q85j978l065
61190I27517m632n919n618l832j907n13Q89K730M747O915R821J3751J7972K1125
61176I83046K2004J9917J4927P927L24o415j1158j3617j4661j5534j6572j7221
61164I52967j7404j7912j9139k0416k1109k1530k2036k2145k1361k0090j8908
61153G30917j7502j5279j2484r867p641n447l148r94P46J923K628L369M694O466
61139F78381Q143R802J1987J4415J6026J6674J7451J8622J8437J4977Q376M61
61127H33752o970j2814j6553j8509j9600k0201j9844j8402j6598j4922j3119j1262
61115F44958j0075r591q877p771p422q184q618p709o569o508o888o436n409m798
$$ plain form
61206 997805 991362 983251 974384 965347 956328 947969 941297 936672 933700 932187 932194 933066 933445 932560 930582 927517
61190 927517 922885 916966 911348 907516 905609 905096 905985 908715 913462 920377 930198 943949 961921 983046
61176 983046 1005050 1024967 1039894 1047821 1048145 1041730 1030572 1016955 1002294 986760 970188 952967
61164 952967 935563 917651 898512 878096 856987 835457 813421 791276 769915 749825 730917
61153 730917 713415 698136 685652 675785 668144 662697 659549 658555 659301 661224 663852 667221 671915 678381
61139 678381 686524 696326 708313 722728 738754 755428 772879 791501 809938 824915 833291 833752
61127 833752 826782 813968 797415 778906 759306 739105 719261 700859 684261 669339 656220 644958
61115 644958 634883 625292 616415 608644 601222 593038 584420 576711 570142 563634 556746 550310 544901 540103
61101E40103m413l515k387j674r49M63K059L081L982N453O909P636Q490J0514
61087E75752J2515J2084Q699M114j25l810o966r267j0609j1062j0373q558o467
61074E45927m757k932o09J194J431Q81J068K004K650K861L205L410K703J278l5
61059E60279j021j646j221M60J988K034J301J117J192P23N93K057M117M685L856
61044E80514L494M114M542M351M202M067L471L164M183N639N834N183N418O338
61030F44514O210N143N043O178O795O441O666P924Q662Q154P620P817P976P756
61016G42899P849Q175P742O705O198N981M762K973K383K846K497J510K299N351
61002H10170Q095Q949R293J0433J1664J2547J4119J6614J8652J9813K1301K3223
$$ plain form
61101 540103 535690 532175 529788 528114 527165 527628 529687 532768 536750 542203 549112 556748 565238 575752
61087 575752 588267 600351 609050 613164 613039 609229 602263 592996 582387 571325 560952 552394 545927
61074 545927 541170 538238 537629 538823 540254 541135 542203 544207 546857 549718 552923 556333 559036 560314 560279
61059 560279 559258 557612 556391 556851 558839 560873 562174 563291 564483 565206 565799 567856 571973 576658 580514
61044 580514 584008 588122 592664 597015 601217 605284 608755 611919 616102 621741 627575 632758 638176 644514
61030 644514 650724 655867 660910 667088 673883 680324 686990 694914 703576 711730 719350 727167 735143 742899
61016 742899 750748 758923 766665 773370 779568 785549 790311 793284 795667 798513 801010 802520 804819 810170
61002 810170 818265 827214 836507 846940 858604 871151 885270 901884 920536 940349 961650 984873
60990I84873K4106K3983K4895K7495L0224L2596L5968M0224M3400M5481M8852
60979A362097N3962N8564O2315O7698P5088Q1586Q6383R2437J00775J08077J12106
60968B261088J14535J16283J15591J13560J15824J25435J39710J57196J81152
60959C440374K12205K44534K74307L05295L41491L82134M29677M93379N77479
60950F700875O75639P86233R22405J096119J305993J557067J878026K297328K820724
60941B0040409L464040M272627N209247N981714O080158N136750L305900J236445
60933E4727290l79664j221734j334216q52495R9412J227650J962383J733692M21828
60924E6384146j508696l350979m619635n218511n285442m992132m481745l883384
$$ plain form
60990 984873 1008979 1032962 1057857 1085352 1115576 1148172 1184140 1224364 1267764 1313245 1362097
60979 1362097 1416059 1474623 1536938 1604636 1679724 1761310 1847693 1940130 2040905 2148982 2261088
60968 2261088 2375623 2491906 2607497 2721057 2836881 2962316 3102026 3259222 3440374
60959 3440374 3652579 3897113 4171420 4476715 4818206 5200340 5630017 6123396 6700875
60950 6700875 7376514 8162747 9085152 10181271 11487264 13044331 14922357 17219685 20040409
60941 20040409 23504449 27777076 32986323 38968037 45048195 50184945 53490845 54727290
60933 54727290 54347626 53125892 51791676 50939181 51038593 52266243 54228626 55962318 56384146
60924 56384146 54875450 51524471 46904836 41686325 36400883 31408751 26927006 23043622
60916B3043622l298379k772962k312562j917936j592219j326539j103610r15737
60908G803678p65416o50344n60623m89256m34108l90302l50888l14805k85366
60899C562570k61074k36035k08999j84048j62472j41728j22726j10408j05858
60890B029222j04345j02329j00367r8238r3350q5541p7968p1808o5058n7587n2191
60879A120440m9286m5728m0434l6243l4449l2328k8195k4443k3146k2616k0830
60868G62742j8715j7647j6858j5531j4586j4388j3471j1370r922r991r679p721
60856F02863n817n706o485o773o999p545p085m920k853k617l331l395l050l104
60842E33183k938j761l75J22Nj82r37k511l833m129m200m756n044m407l635l411
$$ plain form
60916 23043622 19745243 16972281 14659719 12741783 11149564 9823025 8719415 7803678
60908 7803678 7038262 6387918 5827295 5338039 4903931 4513629 4162741 3847936 3562570
60899 3562570 3301496 3065461 2856462 2672414 2509942 2368214 2245488 2135080 2029222
60890 2029222 1924877 1822548 1722181 1623943 1530593 1445052 1367084 1295276 1230218 1172631 1120440
60879 1120440 1071154 1025426 984992 948749 914300 881972 853777 829334 806188 783572 762742
60868 762742 744027 726380 709522 693991 679405 665017 651546 640176 630254 620263 610584 602863
60856 602863 597046 591340 584855 578082 571083 563538 556453 551533 548680 546063 542732 539337 536287 533183
60842 533183 530245 528484 528109 528231 528236 528054 527117 524606 520773 516644 512444 507688 502644 498237 494602 491191
60826D91191l074k182j628j844j609j36J375J832K111L222M312M430M535N814
60812E08349P391P844P715Q418R638R948R264Q628Q234P453O271N134L809J854
60798F09950k96k021l554n121n955n611n258o122p464p778p263p288q049q500
60784E29670q251p848p364o282m728l494k863k547k512k861l135k761j946j288
60770D71790q87o13o22q10m60O21J462J432J445K465L774M124L852M268N531O638
60754E04010P050O960O404N482N060N807O865O811N626M475L899L489K915J980
60740E76833J33k861o030q261r691j0901j1472j0894j0162j0659j1879j2117j1134
60727D60905j0293j0177r951r216q623q370p760o616n673n233m781m195m002m186
$$ plain form
60826 491191 488117 485935 484307 482463 480854 480718 482093 483925 486036 489258 493570 498000 502535 508349
60812 508349 515740 523584 531299 539717 549355 559303 568567 577195 585429 592882 599153 604287 608096 609950
60798 609950 609654 607633 604079 598958 593003 587392 582134 576012 568548 560770 553507 546219 538170 529670
60784 529670 521419 513571 506207 499925 495197 491703 488840 486293 483781 480920 477785 475024 473078 471790
60770 471790 470903 470290 469668 468858 468398 469019 470481 471913 473358 475823 479597 483721 487573 491841 497372 504010
60754 504010 511060 518020 524424 529906 534966 540773 547638 554449 560075 564550 568449 571938 574853 576833
60740 576833 576966 574105 568075 559814 550123 539222 527750 516856 506694 496035 484156 472039 460905
60727 460905 450612 440435 430484 421268 412645 404275 396515 389899 384226 378993 374212 370017 366015 361829
60713C61829m085l712l796m259m051k907j955k053k706l085l074k844k401j967
60699C18934j946k198k136j712j455j458j305r75q13n82K92J512K095J913J779
60684C11945J978J911J485J477K241L200L965M768N487N450M618L923M014M624
60670C61086N341O020O310N984N768O620Q090Q795Q635Q923J0047J0784J0418
60657D62821R923J0234J0927J1369J1719J1951J1334R815Q526Q004P310N881M689
60644E84503M349L597J114k235m660o015p460r310j0762j1363j1370j0879r818
60631E09691q570p671p083o486n841n039l607j653l49n52j574k247k423k379j614
60616D52603L50K525L375K826K092J748J396J148J880L786N869P264Q119Q913
$$ plain form
60713 361829 357744 354032 350236 345977 341926 339019 337064 335011 332305 329220 326146 323302 320901 318934
60699 318934 316988 314790 312654 310942 309487 308029 306724 305749 304936 304354 304646 306158 308253 310166 311945
60684 311945 313923 315834 317319 318796 321037 324237 328202 332970 338457 343907 348525 352448 356462 361086
60670 361086 366427 372447 378757 384741 390509 397129 405219 414014 422649 431572 441619 452403 462821
60657 462821 472744 482978 493905 505274 516993 528944 540278 550093 558619 566623 573933 579814 584503
60644 584503 588852 592449 593563 591328 586668 580653 573193 563883 553121 541758 530388 519509 509691
60631 509691 501121 493450 486367 479881 474040 469001 465394 463741 463392 462840 461266 459019 456596 454217 452603
60616 452603 452953 455478 458853 461679 463771 465519 466915 468063 469943 473729 479598 486862 494981 503894
60602E03894R740J0626J1728J2921J3739J4058J4313J4867J5580J6137J6355J6047
60590F70005J4946J3043J0752Q579O635M397R86l964r529j4018j6481j7377j7607
60577F50367j7461j6917j6254j5768j5178j3988j2160j0005p741n627m220l896
60565E11152m362n023n539n709n272m308l424l042k840k353j696j223r01n60l25
60550D64575l15k83j0L54Q13J761L191M202M006K938J908J370J446K383M071N609
60534D98019O253O404O945Q049R434J1216J3567J5959J7730J9146K0979K3367
60522F57068K6045K9348L3915L9574M5556N1719N8639O6647P5650Q5595R5952
60511A265708J04730J09200J07891J01146Q9895P4906N7374L9137K1766O002p792
$$ plain form
60602 503894 513634 524260 535988 548909 562648 576706 591019 605886 621466 637603 653958 670005
60590 670005 684951 697994 708746 717325 723960 728357 729343 725379 715850 701832 685351 667974 650367
60577 650367 632906 615989 599735 583967 568789 554801 542641 532636 524895 519268 515048 511152
60565 511152 506790 501767 496228 490519 485247 480939 477515 474473 471633 469280 467584 466361 465460 464900 464575
60550 464575 464260 463977 463967 464321 465134 466895 470086 474288 478294 481232 483140 484510 485956 488339 492410 498019
60534 498019 504272 510676 517621 525670 535104 546320 559887 575846 593576 612722 633701 657068
60522 657068 683113 712461 746376 785950 831506 883225 941864 1008511 1084161 1169756 1265708
60511 1265708 1370438 1479638 1587529 1688675 1778570 1853476 1910850 1949987 1971753 1977755 1969963
60500A969963j9394k9068l7519m5202n2088n8057o2892o5848o5938o2916n7570
60489A413471n0977m3829l6240k7806j8016p157L538J3269K2754L3220M4584N5480
60477A402291O4623P1033P3270O9874O0837M7659L1907J4819j645j4743k2617
60466A797308k5274k3614j8440j0689j636P941J8314L0219M4205O0660P9681J00696
60454B059371J23029J47132J74457K05839K40877K79298L21977L69836M22283
60445D344099M76839N28963N71069N92543N82571N34051M45519L20784J68251
60436H564689O03j66418l16846m37869n22282n69123n82520n69533n38078m95492
60426D367131m47658l98729l51500l07891k68945k34721k04770j78747j56325
$$ plain form
60500 1969963 1950569 1921501 1883982 1838780 1786692 1728635 1665743 1599895 1533957 1471041 1413471
60489 1413471 1362494 1318665 1282425 1254619 1236603 1229446 1232984 1246253 1269007 1302227 1346811 1402291
60477 1402291 1466914 1537947 1611217 1681091 1741928 1789587 1821494 1836313 1834668 1819925 1797308
60466 1797308 1772034 1748420 1729980 1719291 1717655 1725596 1743910 1774129 1818334 1878994 1958675 2059371
60454 2059371 2182400 2329532 2503989 2709828 2950705 3230003 3551980 3921816 4344099
60445 4344099 4820938 5349901 5920970 6513513 7096084 7630135 8075654 8396438 8564689
60436 8564689 8565292 8398874 8082028 7644159 7121877 6552754 5970234 5400701 4862623 4367131
60426 4367131 3919473 3520744 3169244 2861353 2592408 2357687 2152917 1974170 1817845
60417A817845j36841j19612j04557r1889q1234p1706o2838n4849m7972m2118l7297
60406I66932l3602l0699k7920k5157k2990k1793k1202k0684k0026j9104j7791
60395G05964j6294j5064j4098j2888j1241r670q665q165p919p890p958p770p136
60382E71206o305n665n487n937o819p436p263o759o783p178o880n582m280l769
60368D85063l507k617j267k63J63M28P53R28Q00M92K11O8J5j90p38j443j947k229
60350D74720k507k687k482k079k047k387k415j834j229j196j531j754j800j794
60336D46978j588r70L5J288K710M076N074N675O043O124N773N274N011M711L926
60321E00140L226L785N517O888P037O915P624Q807R549R829R905R181O992M015
$$ plain form
60417 1817845 1681004 1561392 1456835 1364946 1283712 1212006 1149168 1094319 1046347 1004229 966932
60406 966932 933330 902631 874711 849554 826564 804771 783569 762885 742859 723755 705964
60395 705964 689670 674606 660508 647620 636379 626709 618044 609879 601960 594070 586112 578342 571206
60382 571206 564901 559236 553749 547812 540993 533557 526294 519535 512752 505574 498694 493112 488832 485063
60368 485063 481556 478939 477672 477409 477572 478000 478753 479681 480481 480973 481184 481252 481267 481077 480339 478896 476949 474720
60350 474720 472213 469526 467044 464965 462918 460531 458116 456282 455053 453857 452326 450572 448772 446978
60336 446978 445390 444420 444455 445743 448453 452529 457603 463278 469321 475445 481218 486492 491503 496214 500140
60321 500140 503366 507151 512668 519556 526593 533508 541132 549939 559488 569317 579222 588403 595395 599410
60307E99410J569k00k238m858p198q460q706q291p370o117m794l385j708j8J040
60292E38676J191Q63N66L24k09j312k891m442n374n564n450n458n509n302m765
60277D95344l903k559p26J070K158K444K406K485K752L032L109K890K544K424
60263E15470K663L000L120L013K870K886L218L911M791N674O672P967R340J0453
60249E85048J1621J3615J6519J9412K1538K3207K5138K7440K9790L2151L4794
60238H40273L7778M0785M3392M5386M6935M8354M9339M8698M5534M0615L5693
60227A322782L1410K6877K1524J6097J1290O599J414l673p730j0942j4078j7073
60215A384497j9075j9584j8601j6065j2154p867m232j048K679P121J1461J5287
$$ plain form
60307 599410 600979 600779 598541 593683 586485 578025 569319 561028 553658 547541 542747 539362 537654 537636 538676
60292 538676 539867 540730 541296 541620 541411 540099 537208 532766 527392 521828 516378 510920 505411 500109 495344
60277 495344 491441 488882 488156 489226 491384 493828 496234 498719 501471 504503 507612 510502 513046 515470
60263 515470 518133 521133 524253 527266 530136 533022 536240 540151 544942 550616 557288 565255 574595 585048
60249 585048 596669 610284 626803 646215 667753 690960 716098 743538 773328 805479 840273
60238 840273 878051 918836 962228 1007614 1054549 1102903 1152242 1200940 1246474 1287089 1322782
60227 1322782 1354192 1381069 1402593 1418690 1429980 1436579 1437993 1434320 1426590 1415648 1401570 1384497
60215 1384497 1365422 1345838 1327237 1311172 1299018 1291151 1286919 1285871 1288550 1295671 1307132 1322419
60203A322419J9169K3589K8145L2300L6280M0618M5095M8564M9992M9381M7661
60192A743213M5558M2816L8583L2468K4903J6658Q411O39o628j3886k1432k8521
60180A882782l4005l7662m0028m0956l9575l6016l1817k7935k3441j7130r417
60169A544800j705N387J2121J8688K5204L2096L9467M6492N2290N6950O0881O3778
60157A956449O5184O5508O5475O4970O3367O0448N5948M8846L8317K5084J0686
60146B520282m115j8907l2133m1604m6589m8065m6821m2679l5768k7218j8073
60135B158310q500J554J1828K2247L3112M4510N6185O8171Q0778R3655J05687
60124B667537J16131J25182J33108J39454J43389J44369J42205J36996J29179
$$ plain form
60203 1322419 1341588 1365177 1393322 1425622 1461902 1502520 1547615 1596179 1646171 1695552 1743213
60192 1743213 1788771 1831587 1870170 1902638 1927541 1944199 1952610 1953249 1946621 1932735 1911303 1882782
60180 1882782 1848777 1811115 1771087 1730131 1690556 1654540 1622723 1594788 1571347 1554217 1544800
60169 1544800 1543095 1548482 1560603 1579291 1604495 1636591 1676058 1722550 1774840 1831790 1892671 1956449
60157 1956449 2021633 2087141 2152616 2217586 2280953 2341401 2397349 2446195 2484512 2509596 2520282
60146 2520282 2516167 2497260 2465127 2423523 2376934 2328869 2282048 2239369 2203601 2176383 2158310
60135 2158310 2149810 2151364 2163192 2185439 2218551 2263061 2319246 2387417 2468195 2561850 2667537
60124 2667537 2783668 2908850 3041958 3181412 3324801 3469170 3611375 3748371 3877550
60115C877550J19214J07028R2248P5072N6623L8145K0051J709j7917l9110o0648
60104D269965q0545r7783j12762j25643j35127j39675j39384j35647j29400j20666
60094C053333j09594r6858q3137o8967n4901m1098k7059j2581J488J4156K5485
60083B600267L5789M4359N0182N3385N4493N2848M7418L8994K9701K0426J0513
60072C038375J42r047j6237k2471k8593l3830l7322l9565m1193m1671m0314l7574
60060B690700l4147k9642k3318j5485p124J336R979J8671K7115L5121M2054M6556
60048B761816M7643M5783M2288L8062L3489K8984K4919K1366J8402J6271J4701
60037C093724J2618R067M016k209r663j8287k7263l5779m4137n3220o2925p1813
$$ plain form
60115 3877550 3996764 4103792 4196040 4271112 4327735 4365880 4385931 4387640 4369723 4330613 4269965
60104 4269965 4189420 4091637 3978875 3853232 3718105 3578430 3439046 3303399 3173999 3053333
60094 3053333 2943739 2846881 2763744 2694777 2639876 2598778 2571719 2559138 2560626 2574782 2600267
60083 2600267 2636056 2680415 2730597 2783982 2838475 2891323 2938741 2977735 3007436 3027862 3038375
60072 3038375 3038517 3029470 3013233 2990762 2962169 2928339 2891017 2851452 2810259 2768588 2728274 2690700
60060 2690700 2656553 2626911 2603593 2588108 2580984 2582320 2592299 2610970 2638085 2673206 2715260 2761816
60048 2761816 2809459 2855242 2897530 2935592 2969081 2998065 3022984 3044350 3062752 3079023 3093724
60037 3093724 3106342 3115409 3119425 3117216 3107553 3089266 3062003 3026224 2982087 2928867 2865942 2794129
60025B794129p8426q2526q4897q6272q6484q4637q0079p3161o4968n6464m8156
60014A968059m0316l2872k5269j7035q595q12O277J3531K1434K9580L7516M5220
60002A996718N2459N8602O3555O8071P2474P5729P6251P3270O7025N8347M8432
59991B710933L8386K8343J7493N318p623k0485l2969m4905n5624o4292p0457p3852
59979B430266p4245p1916o7722o2199n5084m6216l6356k6608j7398q562L7Q406
59967A972403J6571K4354L1313L7184M2102M6175M9322N1621N3217N3663N2094
59956B430019M8346M3249L7523L1156K4218J7394J1155N130j045o915j1805j5502
59944B612923j7788j7951j5566j1131n324J919J0929K1499L3218M6099O0247P5326
$$ plain form
60025 2794129 2715703 2633177 2548280 2462008 2375524 2290887 2210808 2137647 2072679 2016215 1968059
60014 1968059 1927743 1894871 1869602 1852567 1843972 1843160 1849437 1862968 1884402 1913982 1951498 1996718
60002 1996718 2049177 2107779 2171334 2239405 2311879 2387608 2463859 2537129 2604154 2662501 2710933
59991 2710933 2749319 2777662 2795155 2800473 2792850 2772365 2739396 2694491 2638867 2574575 2504118 2430266
59979 2430266 2356021 2284105 2216383 2154184 2099100 2052884 2016528 1989920 1972522 1963960 1963997 1972403
59967 1972403 1988974 2013328 2044641 2081825 2123927 2170102 2219424 2271045 2324262 2377925 2430019
59956 2430019 2478365 2521614 2559137 2590293 2614511 2631905 2643060 2648190 2647145 2640230 2628425 2612923
59944 2612923 2595135 2577184 2561618 2550487 2545163 2547082 2558011 2579510 2612728 2658827 2719074 2794400
59932B794400R0901J06796J22603J37472J50962J63267J73871J80626J81067J74141
59922D276106J59895J38201J09016P3583L4419n897m5132q1088j11896j36600
59912D410607j54821j66069j70142j68050j61743j52839j42067j29684j15889
59903C049303j01051q5955p1571n8055m4578l0653j7115m956O207J7530K9127
59892B688233L9953M9343N7623O5076P1177P5045P5954P3243O6326N4999L9458
59881C356430K0214j637k4298m5973o5636q2686r6317j05906j11786j14957j16055
59870B611393j15222j12770j09177j04554r8780r2155q5256p8159p0424o1939
59860A682957n3209m4854l7245l0589k4796j9367j4000r270o114m676m228m211
$$ plain form
59932 2794400 2885301 2992097 3114700 3252172 3403134 3566401 3740272 3920898 4101965 4276106
59922 4276106 4436001 4574202 4683218 4756801 4791220 4785323 4740191 4659103 4547207 4410607
59912 4410607 4255786 4089717 3919575 3751525 3589782 3436943 3294876 3165192 3049303
59903 3049303 2948252 2862297 2790726 2732671 2688093 2657440 2640325 2635369 2641576 2659106 2688233
59892 2688233 2728186 2777529 2835152 2900228 2971405 3046450 3122404 3195647 3261973 3316972 3356430
59881 3356430 3376644 3375007 3350709 3304736 3239100 3156414 3060097 2954191 2842405 2727448 2611393
59870 2611393 2496171 2383401 2274224 2169670 2070890 1978735 1893479 1815320 1744896 1682957
59860 1682957 1629748 1584894 1547649 1517060 1492264 1472897 1458897 1449627 1443513 1438837 1434609 1430398
59848A430398m699n735o761o960n848l486l60K956O258R640J2823J4834J4853
59835A457913J3011R884N613J67n773j1137j5604j9633k3280k5817k6716k6402
59823A332226k5710k5089k4640k4379k4159k3515k2036j9717j6858j3726j0387
59812A102010o775k832J324N408R285J3118J7082K0922K4048K6038K6926K7048
59800A263602K6732K6078K4933K3161K0891J8449J6195J4625J4452J6178J9552
59789A484848K3628K7136K8567K6626K1629J6270J3921J5986K1705L0191M1106
59778A751613N3062O3173O9470P2905P6188Q1511R0049J02347J17775J34013J47975
59767B760081J56452J55346J39880J07768O2152J0266m0489q4523j17709j37815
$$ plain form
59848 1430398 1425699 1419964 1413203 1406243 1400395 1396909 1396549 1399505 1405763 1415403 1428226 1443060 1457913
59835 1457913 1470924 1480808 1486421 1486588 1480815 1469678 1454074 1434441 1411161 1385344 1358628 1332226
59823 1332226 1306516 1281427 1256787 1232408 1208249 1184734 1162698 1142981 1126123 1112397 1102010
59812 1102010 1095235 1092403 1093727 1099135 1108420 1121538 1138620 1159542 1183590 1209628 1236554 1263602
59800 1263602 1290334 1316412 1341345 1364506 1385397 1403846 1420041 1434666 1449118 1465296 1484848
59789 1484848 1508476 1535612 1564179 1590805 1612434 1628704 1642625 1658611 1680316 1710507 1751613
59778 1751613 1804675 1867848 1937318 2010223 2086411 2167922 2257971 2360318 2478093 2612106 2760081
59767 2760081 2916533 3071879 3211759 3319527 3381679 3391945 3351456 3266933 3149224 3011409
59757C011409j45812j45092j38742j28292j14994j00765q7239p4786o3068n1963
59747A960656m1604l2077k3415j5553q253j374M928J0675J6482K2893K9604L6012
59735A958974M2226M8751N5547O2255O9232P7340Q6690R6458J06093J16067J27334
59724B846967J40534J55596J71665J87629K03250K19345K36198K52299K65468
59715D678951K74677K79685K79424K72392K58674K40491K20579K01122J84152
59706F890147J71647J64725J63530J67971J77550J90286K02904K12587K17859
59697H559206K17670K10721J96079J73760J44387J09052O9760K9276r846m5624
59687I654441p6143r9596j15090j22792j23096j16319j03150q4563o1182l3499
$$ plain form
59757 3011409 2865597 2720505 2581763 2453471 2338477 2237712 2150473 2075687 2012619 1960656
59747 1960656 1919052 1886975 1863560 1848007 1839754 1838380 1843308 1853983 1870465 1893358 1922962 1958974
59735 1958974 2001200 2049951 2105498 2167753 2236985 2314325 2401015 2497473 2603566 2719633 2846967
59724 2846967 2987501 3143097 3314762 3502391 3705641 3924986 4161184 4413483 4678951
59715 4678951 4953628 5233313 5512737 5785129 6043803 6284294 6504873 6705995 6890147
59706 6890147 7061794 7226519 7390049 7558020 7735570 7925856 8128760 8341347 8559206
59697 8559206 8776876 8987597 9183676 9357436 9501823 9610875 9680635 9709911 9700065 9654441
59687 9654441 9578298 9478702 9363612 9240820 9117724 9001405 8898255 8813692 8752510 8719011
59677H719011k671K9837O3610R9358J37436J77120K17437K57745K97130L34016
59667A0330029L66569L92605M08737M10544L94061L56842K97878K17844J20077
59658A3295186J0648j02927k12754l11003l91120m49606m86113n01679m97879
59649A0352753m77739m45935m07002l64057l19965k78927k46114k26091k21740
59640G365183k33366k57666k87991l16769l38170l49022l48514l37981l20310
59631D575394k98463k74418k49496k24978k01840j80393j60746j43171j27585
59622B714304j13294r9856q7760p7638o9157o1349n3699m6402l9746l3804k8620
59611B002979k4214k0380j6851j3671j1281j0234j0798j2738j5530j8937k3089
$$ plain form
59677 8719011 8716340 8746177 8809787 8909145 9046581 9223701 9441138 9698883 9996013 10330029
59667 10330029 10696598 11089203 11497940 11908484 12302545 12659387 12957265 13175109 13295186
59658 13295186 13305834 13202907 12990153 12679150 12288030 11838424 11352311 10850632 10352753
59649 10352753 9875014 9429079 9022077 8658020 8338055 8059128 7813014 7586923 7365183
59640 7365183 7131817 6874151 6586160 6269391 5931221 5582199 5233685 4895704 4575394
59631 4575394 4276931 4002513 3753017 3528039 3326199 3145806 2985060 2841889 2714304
59622 2714304 2601010 2501154 2413394 2335756 2266599 2205250 2151551 2105149 2065403 2031599 2002979
59611 2002979 1978765 1958385 1941534 1927863 1916582 1906348 1895550 1882812 1867282 1848345 1825256
59600A825256k7799l2146l5284l7310l8711l9330l8755l7420l6233l5105l2999
59589A434164k9605k5913k2804k0180j7851j6148j5021j3510j0939p865n169k873
59577A246286n54J709L606N305P063Q574R434R984J0913J2215J3208J3514J3487
59564A354744J3691J4420J5702J7429J9414K1475K3525K5580K7776L0394L3681
59553A597831L7617M1981M6609N1466N6654O2561O9592P7445Q4998R1508R7471
59542B315733J03677J09643J13958J15917J15990J14656J11713J06921J00703
59533C308911R4072Q7990Q2330P4850O2131M2952K0586L53j4915k5894l3753l8298
59521C661315l9453l8441l6267l2266k5258j5265l060J1097K7274M4889O2698
$$ plain form
59600 1825256 1797457 1765311 1730027 1692717 1654006 1614676 1575921 1538501 1502268 1467163 1434164
59589 1434164 1404559 1378646 1355842 1335662 1317811 1301663 1286642 1273132 1262193 1254328 1249159 1246286
59577 1246286 1245732 1247441 1251047 1256352 1263415 1271989 1281423 1291407 1302320 1314535 1327743 1341257 1354744
59564 1354744 1368435 1382855 1398557 1415986 1435400 1456875 1480400 1505980 1533756 1564150 1597831
59553 1597831 1635448 1677429 1724038 1775504 1832158 1894719 1964311 2041756 2126754 2218262 2315733
59542 2315733 2419410 2529053 2643011 2758928 2874918 2989574 3101287 3208208 3308911
59533 3308911 3402983 3490973 3573303 3648153 3710284 3753236 3773822 3774175 3759260 3733366 3699613 3661315
59521 3661315 3621862 3583421 3547154 3514888 3489630 3474365 3471305 3482402 3509676 3554565 3617263
59510C617263P9322R3237J02718J06344J03343R3413P6699N4063K6708m472l8424
59499D310214p2907j04975j32636j55164j71889j81937j85372j83264j76372j65089
59489B780609j50865j36152j22280j08789r5370q2928p2048o1968n2021m2711
59479A855477l4314k5907j6925q384j212N457J2947K1018K8621L5765M3203N0960
59467A966706N8594O6261P4281Q2155Q9227R5629J01329J04849J04434J00089
59457B843554R3011Q3321O9769N1789L0534P747j5363l7849n8551p6336r0520
59446B901106j01016j08256j12864j15042j14612j11704j07010j01188r4620q7925
59436A846869q1793p6029o9723o2845n6600n1599m6795m1054l4826k9309k4808
$$ plain form
59510 3617263 3696585 3789822 3892540 3998884 4102227 4195640 4272339 4326402 4353110 4348638 4310214
59499 4310214 4237307 4132332 3999696 3844532 3672643 3490706 3305334 3122070 2945698 2780609
59489 2780609 2629744 2493592 2371312 2262523 2167153 2084225 2012177 1950209 1898188 1855477
59479 1855477 1821163 1795256 1778331 1769947 1768735 1774192 1787139 1808157 1836778 1872543 1915746 1966706
59467 1966706 2025300 2091561 2165842 2247997 2337224 2432853 2534182 2639031 2743465 2843554
59457 2843554 2936565 3019886 3089655 3141444 3171978 3179725 3164362 3126513 3067962 2991626 2901106
59446 2901106 2800090 2691834 2578970 2463928 2349316 2237612 2130602 2029414 1934794 1846869
59436 1846869 1765076 1689047 1619324 1556479 1499879 1448280 1401485 1360431 1325605 1296296 1271488
59425A271488k0964j7741j5090j2304q848n410l063j673o5K497N714Q856J1333
59412A214730J2967J4185J5844J8730K3346K9450L4848L5425K8605J7049O927
59401A452106J994J201K401N637J1543J9335K8286L8700M8957N3937M9840L9537
59389A753474L0178K6121K6685K9927L5342M2721N1275O0612P0825Q1298R1059
59378B299517J00434J10651J21851J33151J44613J57452J72226J88487K06098
59369C634480K25247K44978K63290K78712K90372K96809K96503K89702K78118
59360F098211K62903K44497K24404K05159J88200J73283J60081J48718J38535
59351G843991J27983J16018J02173Q5214O3429L6506N596k8570o5831j04715j42330
$$ plain form
59425 1271488 1250524 1232783 1217693 1205389 1196541 1191131 1188068 1186395 1186330 1188827 1194541 1203397 1214730
59412 1214730 1227697 1241882 1257726 1276456 1299802 1329252 1364100 1399525 1428130 1445179 1452106
59401 1452106 1454100 1455301 1457702 1463339 1474882 1494217 1522503 1561203 1610160 1664097 1713937 1753474
59389 1753474 1783652 1809773 1836458 1866385 1901727 1944448 1995723 2056335 2127160 2208458 2299517
59378 2299517 2399951 2510602 2632453 2765604 2910217 3067669 3239895 3428382 3634480
59369 3634480 3859727 4104705 4367995 4646707 4937079 5233888 5530391 5820093 6098211
59360 6098211 6361114 6605611 6830015 7035174 7223374 7396657 7556738 7705456 7843991
59351 7843991 7971974 8087992 8190165 8275379 8338808 8375314 8380910 8352340 8286509 8181794 8039464
59340H039464j76625k07172k33301k53351k66517k73948k77151k76642k72624
59331E802133k65581k55568k42266k26423k09998j94260j78941j63703j49074
59322C916319j35425j22388j09968r8884q9193p9813p0132o0806n2381m4429l6770
59311C016130l0080k4457j8667j1892n100L95M685Q550J1887J4074J5261J6148
59299B996934J6778J6414J4414J0666N436p40p237j3670j9795k5202k9649l3545
59287B930804l7322m0400m1714m1296m0226l8988l6948l3675k9571k4883j9292
59276B546489j2868o329L4O617J3292J9044K3309K6517K8743K8993K6457K1470
59264B721768J4630N964m330j5330k6285l7254m8104n7788o5248p0309p3083p3295
$$ plain form
59340 8039464 7862839 7655667 7422366 7169015 6902498 6628550 6351399 6074757 5802133
59331 5802133 5536552 5280984 5038718 4812295 4602297 4408037 4229096 4065393 3916319
59322 3916319 3780894 3658506 3548538 3449654 3360461 3280648 3210516 3149710 3097329 3052900 3016130
59311 3016130 2986050 2961593 2942926 2931034 2925934 2926329 2931014 2939564 2951451 2965525 2980786 2996934
59299 2996934 3013712 3030126 3044540 3055206 3060642 3059902 3052665 3038995 3019200 2993998 2964349 2930804
59287 2930804 2893482 2853082 2811368 2770072 2729846 2690858 2653910 2620235 2590664 2565781 2546489
59276 2546489 2533621 2527292 2527326 2533943 2547235 2566279 2589588 2616105 2644848 2673841 2700298 2721768
59264 2721768 2736398 2742362 2738032 2722702 2696417 2659163 2611059 2553271 2488023 2417714 2344631 2271336
59252B271336p0943o6951o2390n7562n2282m6503m0203l3318k6141j9163j2231
59241A783649m593L917J2829K2414L3771M6316N6090N7962M9884L4761J8466O274
59229B121740N45R29O166J5361K7517M0867N3788O6165P8896R2306J06041J20191
59217B730512J35194J50672J65758J80529J95637K10217K21620K27659K27793
59208D445591K21805K08909J88902J62814J31643R5617N5577J4089k5742o1766
59198E437439r2635j17124j34434j44547j47890j45301j38584j30081j21287j12663
59188D152893j04901r9127r5554r3245r1683r1299r1965r2321r1359q9485q7315
59177C124639q4578q0939p6849p2740o8362o3485n8427n3305m7787m2086l7061
$$ plain form
59252 2271336 2200393 2133442 2071052 2013490 1961208 1914705 1874502 1841184 1815043 1795880 1783649
59241 1783649 1779056 1782973 1795802 1818216 1851987 1898303 1954393 2012355 2062239 2097000 2115466 2121740
59229 2121740 2122285 2123214 2129380 2144741 2172258 2213125 2266913 2333078 2411974 2504280 2610321 2730512
59217 2730512 2865706 3016378 3182136 3362665 3558302 3768519 3990139 4217798 4445591
59208 4445591 4667396 4876305 5065207 5228021 5359664 5455281 5510858 5524947 5499205 5437439
59198 5437439 5344804 5227680 5093246 4948699 4800809 4655508 4516924 4386843 4265556 4152893
59188 4152893 4047992 3948865 3853311 3760066 3668383 3577084 3485119 3392798 3301439 3211954 3124639
59177 3124639 3040061 2959122 2882273 2809533 2741171 2677686 2619259 2565954 2518167 2476081 2439020
59166B439020l2862k8604k3918j9633j6353j3660j1217r317p655n025j110K821
59154B272487N881Q877J2691J6743K0137K3052K5769K7560K7800K7255K7007K6860
59142B522119K5840K3467J9688J4476Q333K307l307r297j5897k2115k7443l2830
59130B505341l8806m3964m6717m7375m7147m6039m3296l9134l4591l0176k5773
59119B062323k1389j7094j2716q333m335n15L877Q626J2422J4965J7698K1428
59107B076957K4747K6056K5684K4668K2971K0553J8934J9771K2824K6910L1929
59096B342004L8275M5131N1013N5206N7133N5145M7781L5553J9934J283k0464
59085B727994m3708o5550q3984r8311j08009j12847j13778j12231j08777j03583
$$ plain form
59166 2439020 2406158 2377554 2353636 2334003 2317650 2303990 2292773 2283456 2275801 2270776 2269666 2272487
59154 2272487 2278368 2287245 2299936 2316679 2336816 2359868 2385637 2413197 2440997 2468252 2495259 2522119
59142 2522119 2547959 2571426 2591114 2605590 2613923 2616230 2612923 2603626 2587729 2565614 2538171 2505341
59130 2505341 2466535 2422571 2375854 2328479 2281332 2235293 2191997 2152863 2118272 2088096 2062323
59119 2062323 2040934 2023840 2011124 2002791 1998456 1997941 2001818 2010444 2022866 2037831 2055529 2076957
59107 2076957 2101704 2127760 2153444 2178112 2201083 2221636 2240570 2260341 2283165 2310075 2342004
59096 2342004 2380279 2425410 2476423 2531629 2588762 2643907 2691688 2727241 2747175 2748458 2727994
59085 2727994 2684286 2618736 2534752 2436441 2328432 2215585 2101807 1989576 1880799 1777216
59075A777216r7448r1032q3845p5525o7386o1067n6263n1466m6383m1828l7791
59064A067182l3504k9253k6211k4478k2873k0709j8296j5825j3110j0486q572
59053H43865p186n644m029k979k532k339k739m153n653n565l549q67J438L476
59039H01544N705Q209J0904J3702J6582J9865K3835K7520K8851K6962K3412K0135
59027A027226J7282J4300J1805J0623R914Q247N871M116L026J487o67k407l127
59014A107696k908j641N62K547L380L960N610P656Q365P817P619P917O895L529
59000A169004j195o096j1059j6078k0638k4438k7452k9212k9325k8657k8515k8710
58988I17629k7908k5804k3362k0933j7852j4064j0489p630n189l224k211j790
$$ plain form
59075 1777216 1679768 1588736 1504891 1429366 1361980 1300913 1244650 1193184 1146801 1104973 1067182
59064 1067182 1033678 1004425 978214 953736 930863 910154 891858 876033 862923 852437 843865
59053 843865 836679 831035 827006 824027 821495 819156 816417 812264 806611 801046 797497 796630 798068 801544
59039 801544 807249 815458 826362 840064 856646 876511 900346 927866 956717 983679 1007091 1027226
59027 1027226 1044508 1058808 1070613 1081236 1091150 1099397 1105268 1109384 1112410 1113897 1113230 1110823 1107696
59014 1107696 1104788 1103147 1103709 1106256 1109636 1113596 1119206 1126862 1135227 1143044 1150663 1158580 1165475 1169004
59000 1169004 1167809 1161713 1150654 1134576 1113938 1089500 1062048 1032836 1003511 974854 946339 917629
58988 917629 889721 863917 840555 819622 801770 787706 777217 769587 764398 761174 758963 757173
58976G57173q66Q82K871M894P192R446J1131J2777J5270J8040J9614J9837J9828
58963H98089J9770J8551J5859J2819J0256P898N627M024L222K665K221K434L463
58950A006898N090P529J0924J4146J5713J5825J5931J6424J6461J5990J6045J6889
58938A173865J7650J8055J8930K0654K2635K4465K6208K7612K8517K9843L2577
58927A441011L6063L9002M1761M5668N0403N4476N8021O2634O8452P4061P9435
58916B050987Q6222R4705J03341J12011J22760J36252J50254J63066J75973J90738
58906C386309K06928K23333K39886K56423K71251K82792K91169K96495K96888
58897E751474K89619K73162K47033K11081J66291J15054N9388K09o0543j18453
$$ plain form
58976 757173 756307 757189 760060 764954 772146 781592 792723 805500 820770 838810 858424 878261 898089
58963 898089 917859 936410 952269 965088 975344 983242 988869 992893 996115 998780 1001001 1003435 1006898
58950 1006898 1011988 1019517 1030441 1044587 1060300 1076125 1092056 1108480 1124941 1140931 1156976 1173865
58938 1173865 1191515 1209570 1228500 1249154 1271789 1296254 1322462 1350074 1378591 1408434 1441011
58927 1441011 1477074 1516076 1557837 1603505 1653908 1708384 1766405 1829039 1897491 1971552 2050987
58916 2050987 2137209 2231914 2335255 2447266 2570026 2706278 2856532 3019598 3195571 3386309
58906 3386309 3593237 3816570 4056456 4312879 4584130 4866922 5158091 5454586 5751474
58897 5751474 6041093 6314255 6561288 6772369 6938660 7053714 7113102 7113311 7052768 6934315
58887F934315j68876k09703k40850k62382k74582k78899k77268k70942k60869
58878D689944k48486k35214k21726k08390j95659j83522j71512j59800j49261
58869B916374j39972j30767j20869j10852j01426r2398q3544p5339o8298o2549
58859A930360n8428n6220n5012n3099n0043m6970m4475m1762l8273l4596l1141
58848A420341k7461k3489j9906j6698j3041r187o617n632m564k335Q6J678L088
58835A296263N154P437R449J1877J5294J9012K2379K5934L0213L4640L8623M2574
58823A558849M6919N1318N5654O0540O6131P1740P7244Q3388R0204R6759J03075
58812B361821J10488J19451J28904J38545J49627J62672J76564J90821K06400
$$ plain form
58887 6934315 6765439 6555736 6314886 6052504 5777922 5499023 5221755 4950813 4689944
58878 4689944 4441458 4206244 3984518 3776128 3580469 3396947 3225435 3065635 2916374
58869 2916374 2776402 2645635 2524766 2413914 2312488 2220090 2136546 2061207 1992909 1930360
58859 1930360 1871932 1815712 1760700 1707601 1657558 1610588 1566113 1524351 1486078 1451482 1420341
58848 1420341 1392880 1369391 1349485 1332787 1319746 1310559 1303942 1298310 1293746 1291411 1291497 1293175 1296263
58835 1296263 1301417 1308854 1318303 1330180 1345474 1364486 1386865 1412799 1443012 1477652 1516275 1558849
58823 1558849 1605768 1657086 1712740 1773280 1839411 1911151 1988395 2071783 2161987 2258746 2361821
58812 2361821 2472309 2591760 2720664 2859209 3008836 3171508 3348072 3538893 3745293
58803C745293K23060K38527K51667K63912K75620K83470K83704K75849K60931
58794F102033K38044K05449J63653J14914O0835K888n5690j10928j60459k03136
58784F357603k37340k61749k77021k84832k86021k81192k72153k60752k47106
58775C949437k30774k13012j96086j81012j67472j55258j44280j33853j23541
58766B404149j13951j05463r7074q7900p8822p1206o4932n9212n4287n0664m7582
58755A573056m3797l9249l4510k9618k4702k0742j8114j5466j1512o939k956Q68
58743A326319N583J0720J5018J8571K2369K6252K8744K8456K4584J6958O912k826
58731A527660j0423j6200k0693k2997k2555k1039k0654k1637k3171k5446k8983
$$ plain form
58803 3745293 3968353 4206880 4458547 4722459 4998079 5281549 5565253 5841102 6102033
58794 6102033 6340077 6545526 6709179 6824093 6884928 6887816 6832126 6721198 6560739 6357603
58784 6357603 6120263 5858514 5581493 5296661 5010640 4729448 4457295 4196543 3949437
58775 3949437 3718663 3505651 3309565 3128553 2961081 2805823 2661543 2527690 2404149
58766 2404149 2290198 2184735 2087661 1999761 1920939 1849733 1784801 1725589 1671302 1620638 1573056
58755 1573056 1529259 1490010 1455500 1425882 1401180 1380438 1362324 1346858 1335346 1328407 1325451 1326319
58743 1326319 1331902 1342622 1357640 1376211 1398580 1424832 1453576 1482032 1506616 1523574 1530486 1527660
58731 1527660 1517237 1501037 1480344 1457347 1434792 1413753 1393099 1371462 1348291 1322845 1293862
58720A293862l2940l6100l8694m1517m4062m5186m4824m3545m1362l8367l5454
58709H51811l3015l0143k6484k3399k1683j9894j6803j3780j2486j1815r686o591
58697F26032m717m405m089l150k546k960m241o135p993q541p501o424o342o018
58683E50970m256k206j268l45K272N721P960R067J0475J2040J2701J3040J4326
58670F30497J5795J5622J3974J2395J0888Q261M789J838n38l028m831m754l938
58657F96970m702p084r250j0866j3174j5996j7464j6884j5418j3973j2502j1193
58645E48464j0234q821o433m420m141m408l124n97J336K446L677M626M302L640
58631E26313M222N343N297M774N721P672Q622Q870J0414J3001J4567J5388J7844
$$ plain form
58720 1293862 1260922 1224822 1186128 1144611 1100549 1055363 1010539 966994 925632 887265 851811
58709 851811 818796 788653 762169 738770 717087 697193 680390 666610 654124 642309 632623 626032
58697 626032 621315 616910 612821 609671 607125 604165 599924 593789 585796 577255 569754 563330 556988 550970
58683 550970 546714 544508 543240 542895 545167 550888 558848 567915 578390 590430 603131 616171 630497
58670 630497 646292 661914 675888 688283 699171 707432 712221 714059 713521 710493 705662 700908 696970
58657 696970 692268 685184 675934 665068 651894 635898 618434 601550 586132 572159 559657 548464
58645 548464 538230 529409 522976 518556 514415 510007 506883 506286 507622 510068 513745 518371 522673 526313
58631 526313 530535 535878 541175 545949 551670 559342 567964 576834 587248 600249 614816 630204 648048
58618F48048K1971K5097K6366K8027L1565L5926M0234M5025N0129N4295N7747
58607A064430O2219O7963P3421P8133Q3116Q7994R0758R0639Q8283Q2913P2591
58596A942460N7657M0670K2634K663j8142l6120m9367n9331o7223p2041p3206
58585A690654p2019o9233o4075n6747m9123m1908l3898k5045j7506j2603r318
58574A239179o729n303m912m164k625j248l8K316O055J0212J5053K1688K8962
58561A298446L3906L5443L4428K9857J9039K332j6107l3235m8961o2297p0027
58550A222824p1107o8572o5183o0559n4379m8639m4488m0151l4393k9091k6027
58539F80235k3928k1011j7920j5895j4321j2231j0168q760p371n704m634m248
$$ plain form
58618 648048 670019 695116 721482 749509 781074 817000 857234 902259 952388 1006683 1064430
58607 1064430 1126649 1194612 1268033 1346166 1429282 1517276 1608034 1698673 1786956 1869869 1942460
58596 1942460 2000117 2040787 2063421 2066084 2047942 2011822 1962455 1903124 1835901 1763860 1690654
58585 1690654 1618635 1549402 1485327 1428580 1379457 1337549 1303651 1278606 1261100 1248497 1239179
58574 1239179 1232450 1227147 1222235 1218071 1215446 1214198 1214160 1216476 1222531 1232743 1247796 1269484 1298446
58561 1298446 1332352 1367795 1402223 1432080 1451119 1453451 1437344 1404109 1355148 1292851 1222824
58550 1222824 1151717 1083145 1017962 957403 903024 854385 809897 769746 735353 706262 680235
58539 680235 656307 635296 617376 601481 587160 574929 564761 556001 548630 542926 538292 534044
58527E34044l291j682j073j835k191j462j305k478l326k878k489k962k994j943
58513E02135j176j147k41J941L341L078L141M666N792N149M252M347M058K427
58499E41763J315K425M670O649Q995J2186J4807J6203J8202K2019K6025K8504
58487G03763K9990L0884K9700K5745K0844J6455J1751O361J909j200n358j1958
58475H58886j8961k4224k8184l1217l1793k9545k6844k5014k2340j8109j4927
58464E87728j4258j3449j0252o845n993o456n670l963k742j311J045K521J728
58451E22083O79J585L242L628L492M203M708L891L358M619O100O085O042P692
58437E81407R495R492R097J0503J2680J3398J3000J2688J1361P595K775r99m222
$$ plain form
58527 534044 530753 529071 527998 526163 523972 522510 521205 518727 515401 512523 510034 507072 504078 502135
58513 502135 500959 499812 499571 501512 504853 507931 511072 515738 521530 526679 530931 535278 539336 541763
58499 541763 543078 545503 550173 556822 565817 578003 592810 609013 627215 649234 675259 703763
58487 703763 733753 764637 794337 820082 840926 857381 869132 875493 877402 876202 870844 858886
58475 858886 839925 815701 787517 756300 724507 694962 668118 643104 620764 602655 587728
58464 587728 573470 560021 549769 542924 536931 530475 524805 520842 518100 516789 517834 520355 522083
58451 522083 522762 524347 527589 531217 534709 538912 543620 547511 550869 555488 561588 567673 573715 581407
58437 581407 590902 600394 609491 619994 632674 646072 659072 671760 683121 690716 693491 692492 688270
58424F88270q031j1171j1929j1161j0520r710q086o700o101m645j491J331K339
58411F02395L142N053O455O264O606R013J1452J2248J3315J6114J8073J6582J3116
58398G39828R818N703p6m979p013q251j0565j1811j0346r055j0392j1497r236
58385F62128o043n532o153m644k271j897k082J76L632N225N589O907Q104P329
58371F70468O344P253P976O085L911M475N725M427K418L136N203N471N210P163
58357G45265R631R622Q897J0638J3217J3484J3069J5011J7445J7229J6468J8483
58345I08459K0634J8325J3103R481O884K245k453l200j814k829n021l969o26O31
58331I59850L42K311N730O813O329P701R839R554Q756J1254J4892J4992J3066
$$ plain form
58424 688270 680239 669068 657139 645978 635458 625748 617662 610962 604861 600216 598725 600056 602395
58411 602395 605537 610590 617045 623309 629915 638928 650380 662628 675943 692057 710130 726712 739828
58398 739828 749646 755349 755273 750294 743281 735030 724465 712654 702308 693253 682861 671364 662128
58385 662128 656085 650553 644400 639756 637485 635588 633506 633682 637314 642539 648128 655035 663139 670468
58371 670468 676812 684065 692041 698126 702037 706512 712237 716664 719082 722218 727421 732892 738102 745265
58357 745265 754896 764518 773415 784053 797270 810754 823823 838834 856279 873508 889976 908459
58345 908459 929093 947418 960521 970002 976886 979131 976678 973478 971664 968835 963814 959845 959219 959850
58331 959850 960192 962503 968233 975046 981375 989076 998915 1008469 1017225 1028479 1043371 1058363 1071429
58318A071429J3830J6288J6424J5935J9168K4019K5203K4072K5649K8393K6806
58307A307216K1932J9233J8163J4118Q681P396R131Q305N889P412J1616J2216
58295A451308R622R860J3077J4170J3569J6184K0858K2177K1356K3948K8365K8552
58283A673046K6318K8680L4575L6997L6766M0859M8494N2571N3825N9460O8622
58272B160213P3526P4287P7941Q3322Q1935P3572O5937N9166M6466K9807J8876
58261B845048J4324Q349J765L461J2663J9193K1869K9052M0480M6962M8712N5228
58249C147106O6193P1720P2267P8234Q9107R3706R2144R6103J06237J11567J12294
58238D136678J19912J33536J40498J41757J51238J68467J78711J82060J94018
$$ plain form
58318 1071429 1085259 1101547 1117971 1133906 1153074 1177093 1202296 1226368 1252017 1280410 1307216
58307 1307216 1329148 1348381 1366544 1380662 1389343 1396739 1405870 1414175 1420064 1427476 1439092 1451308
58295 1451308 1460930 1470790 1483867 1498037 1511606 1527790 1548648 1570825 1592181 1616129 1644494 1673046
58283 1673046 1699364 1728044 1762619 1799616 1836382 1877241 1925735 1978306 2032131 2091591 2160213
58272 2160213 2233739 2308026 2385967 2469289 2551224 2624796 2690733 2749899 2796365 2826172 2845048
58261 2845048 2859372 2867721 2869486 2872947 2885610 2904803 2926672 2955724 2996204 3043166 3091878 3147106
58249 3147106 3213299 3285019 3357286 3435520 3524627 3618333 3710477 3806580 3912817 4024384 4136678
58238 4136678 4256590 4390126 4530624 4672381 4823619 4992086 5170797 5352857 5546875
58229E546875K14946K28781K34955K50438K76660K96980L10816L35906L72445
58220H068802M01151M21790M55518N03886N46090N82480O37311P12125P83030
58211A3112183Q51322R46720J072693J203078J341945J527644J767681K034559
58203B3857825K337573K726124L207104L737645M315868M992421N779316O653859
58195E7607735P676011Q985433J0662080J2732539J5335882J8701200K2936485
58188A54637365K8068322L4211241M1020517M6481832M6811084L8752516K2579683
58181D12562560K559873j5835223k9144921l6741948l9557434l8831885l5808212
58174B19202810l1680590k7320245k3150165j9368014j6125825j3459441j1257859
$$ plain form
58229 5546875 5761821 5990602 6225557 6475995 6752655 7049635 7360451 7696357 8068802
58220 8068802 8469953 8891743 9347261 9851147 10397237 10979717 11617028 12329153 13112183
58211 13112183 13963505 14910225 15982918 17185996 18527941 20055585 21823266 23857825
58203 23857825 26195398 28921522 32128626 35866271 40182139 45174560 50953876 57607735
58195 57607735 65283746 74269179 84931259 97663798 112999680 131700880 154637365
58188 154637365 182705687 216916928 257937445 304419277 351230361 389982877 412562560
58181 412562560 415122433 399287210 370142289 333400341 293842907 255011022 219202810
58174 219202810 187522220 160201975 137051810 117683796 101557971 88098530 76840671
58167G6840671r417668p923949o742572n766476m923507m227655l677982l208533
58159C0952329k779256k419546k140468j892719j649270j444335j293194j154001
58151A6179540j004391q77883p89506p00783n92573m98866m34556l62425k65974
58142A0652583j83499j36021r1980l5822K002J7612O1202J55339K60335L56646
58132A1058397M82362O51447Q21420R86114J210131J524714J890498K316769K902526
58123B3844378L699525M681276N920866P546576R248567R986568Q624186N030257
58115G8582199L76495l763936o498121p823173q113284p703076o867304n875643
58107C2314157m918776m059617l307975k685838k199701j815421j497716j239960
$$ plain form
58167 76840671 67423003 59499054 52756482 46990006 42066499 37838844 34160862 30952329
58159 30952329 28173073 25753527 23613059 21720340 20071070 18626735 17333541 16179540
58151 16179540 15175149 14297266 13507760 12806977 12214404 11715538 11280982 10918557 10652583
58142 10652583 10469084 10333063 10241083 10205261 10207263 10224875 10286077 10441416 10701751 11058397
58132 11058397 11540759 12192206 13013626 13999740 15209871 16734585 18625083 20941852 23844378
58123 23844378 27543903 32225179 38146045 45692621 54941188 64927756 73551942 78582199
58115 78582199 78958694 75194758 68696637 60873464 52760180 45057104 38189800 32314157
58107 32314157 27395381 23335764 20027789 17341951 15142250 13326829 11829113 10589153
58099A0589153j037667q68470p16979n91631n00796m33726l77275l32686l04774
58090E425149k89424k80361k75843k72194k61705k42291k19927j98147j74068
58081C211189j47539j25477j13743j11393j14806j21188j26565j26556j21129
58072B102793j14031j06836r7812q6799p6546o8680o2145n6056n0860m6576m2548
58061A293904l8879l5931l3104k9954k7425k6225k5378k4155k3639k4571k5368
58050I79275k4362k2355k0977k0082j8617j6666j5022j3884j3267j3395j3731
58039G86917j3024j1188r626r104q896q545q605r202r614r728j0130j0638j0533
58026F58084j0147j0246j0084q406o088n254n923o243n761n686n950n123l354
$$ plain form
58099 10589153 9551486 8683016 7966037 7374406 6873610 6439884 6062609 5729923 5425149
58090 5425149 5135725 4855364 4579521 4307327 4045622 3803331 3583404 3385257 3211189
58081 3211189 3063650 2938173 2824430 2713037 2598231 2477043 2350478 2223922 2102793
58072 2102793 1988762 1881926 1784114 1697315 1620769 1552089 1489944 1433888 1383028 1336452 1293904
58061 1293904 1255025 1219094 1185990 1156036 1128611 1102386 1077008 1052853 1029214 1004643 979275
58050 979275 954913 932558 911581 891499 872882 856216 841194 827310 814043 800648 786917
58039 786917 773893 762705 753079 743975 735079 726534 717929 708727 699113 689385 679255 668617 658084
58026 658084 647937 637691 627607 619201 613113 607859 601936 595693 589932 584246 578296 573173 569819
58013E69819k376k362j648P9J313J731K766M712O203P001Q522J1012J2973J3953
57999F33698J5283J7426J9117J9588J9295J8064J5025J0601O136J441m736j1717
57987G59221j7095k0111k2102k3554k3594k2566k2105k2184k1031j8429j6208
57976E30242j5005j3403j0951r037q064o598m252k619k357j950l59J477K793M273
57962D64190O220P625Q050Q345Q726Q044N759K729m90m153p722r801j0284j0533
57948D76705j1014j0739r478q366p831p041n839n156m960l951j818J60J303K394
57934D04369L881N201O284P826R619J0454J0033R094P606M916J870M64J000J739
57920D84356J795K174L502M928N932P070Q288Q449P231N696M433K869P24j502
$$ plain form
58013 569819 567443 565081 563433 563512 564825 566556 569322 574034 580237 587238 595760 606772 619745 633698
57999 633698 648981 666407 685524 705112 724407 742471 757496 768097 774233 775674 770938 759221
57987 759221 742126 722015 699913 676359 652765 630199 608094 585910 564879 546450 530242
57976 530242 515237 501834 490883 481846 473782 467184 462932 460313 457956 456006 455647 457124 459917 464190
57962 464190 470410 478035 486085 494430 503156 511200 516959 519688 519198 515045 507323 497522 487238 476705
57948 476705 465691 454952 445474 437108 429277 422236 416397 411241 406281 402330 400512 400672 401975 404369
57934 404369 408250 413451 419735 427561 437180 447634 457667 466761 474367 479283 481153 481617 482617 484356
57920 484356 486151 488325 491827 496755 502687 509757 518045 526494 533725 539421 543854 546723 547447 545945
57906E45945l781o506r119j0644j1641j3531j6016j7245j6725j5788j5100j4012
57894C95837j2610j1922j1741j0642q543o996o416n443l566j967j190k76J111
57881C15636K022K255K854L928M249L710L838N142O231O303O268O579O247M940
57867C80202L924L841L591K359R02j13j181k630l932n021o457p809p818o659n969
57852C47230o074n451l479j519m51N54K086L509M735O720R369J1091J1335J1419
57838C91074J2052J2277J1689J1354J1594J1116R358P417N806L638R27r31j956
57825D85415m168q060j1148j1625j0925j0961j1311j0934j0416j0392r864q031
57813C67580o010m837l612j476L82O77L37R04K083K711K748K567J676j20j664
$$ plain form
57906 545945 542164 535658 526539 515895 504254 490723 474707 457462 440737 424949 409849 395837
57894 395837 383227 371305 359564 348922 340379 333383 326967 321524 317958 315991 314801 314525 315636
57881 315636 317658 319913 322767 326695 330944 334654 338492 343634 349865 356168 362436 369015 375262 380202
57867 380202 384126 387967 391558 393917 394819 394706 393525 390895 386963 381942 375485 367676 359858 353199 347230
57852 347230 341156 335705 332226 330707 330256 330810 332896 336405 341140 347860 357229 368320 379655 391074
57838 391074 403126 415403 427092 438446 450040 461156 470514 477931 483737 487375 488302 487371 485415
57825 485415 481247 473187 462039 450414 439489 428528 417217 406283 395867 385475 375611 367580
57813 367580 361570 356733 353121 351645 352027 352704 353041 353945 356028 358739 361487 364054 365730 365610 363946
57798C63946k167k691m299o142o866o623o076m970l218j981j924j782l47J476
57784C16336K306K649L744N159N422M232K410M16j579k866k861k005j041j12P86
57769C32996J454K222L768N612O418O332P129R243J0809J0777J0659J1679J2529
57756D31627J1754J0293R523Q636O157K566o92l423n965p661q047q170q908r270
57742D28420q288p012o743o784o127n699o640p714p046n255m331m418m148l362
57728C44853k897k461j136N30J340J798L281N272N850M709L591L665M529N630
57714C78554O856P696P514O715O247O163N913N645N906O526P159Q219J0039J1872
57700D81024J3110J4693J7710K1583K5217K8917L3308L7184L8365L6047L0669
$$ plain form
57798 363946 361779 359088 354789 348647 341781 335158 329082 324112 320894 318913 316989 315207 314860 316336
57784 316336 318642 321291 325035 330194 335616 339848 342258 342674 341095 338229 335368 333363 332322 332210 332996
57769 332996 334450 336672 340440 346052 352470 358802 365931 375174 385983 396760 407419 419098 431627
57756 431627 443381 453674 463197 471833 477990 480556 479864 476441 470476 462815 454768 446598 437690 428420
57742 428420 420132 413120 406377 399593 393466 387767 381127 373413 366367 361112 356781 352363 348215 344853
57728 344853 341956 339495 338359 338889 340229 342027 345308 350580 356430 361139 364730 368395 372924 378554
57714 378554 385410 393106 400620 407335 413582 419745 425658 431303 437209 443735 450894 459113 469152 481024
57700 481024 494134 508827 526537 548120 573337 602254 635562 672746 711111 747158 777827
57689G77827K2510J2394K896l390o322p149n932k080L377Q596J3609J9931K7803
57676H64070L6009M4106N2741O1981P1398Q1523R3147J05439J16741J26919J36781
57665A790855J45757J52518J57294J60231J56767J37759R6513L5412l4323r8323
57655B700460j45489j72094j81561j79865j70909j56528j39232j22289j07209
57646A325284r3397q0613o9828o1362n4112m7094m0306l3808k7538k2162j8549
57635G76515j6213j3670j0479p440m876k265L74K396L965O027Q724J1313J3602
57622G67973J6010J8230J9522K0402K2384K5940L0179L4527L9149M3834M8110
57611A086260N2496N7967O4143O9544P3552P6361P7185P4291O6902N5370L9817
$$ plain form
57689 777827 800337 812731 815627 812237 805915 798766 792834 790754 794131 802727 816336 836267 864070
57676 864070 900079 944185 996926 1058907 1130305 1211828 1304975 1410414 1527155 1654074 1790855
57665 1790855 1936612 2089130 2246424 2406655 2563422 2701181 2797694 2833106 2798783 2700460
57655 2700460 2554971 2382877 2201316 2021451 1850542 1694014 1554782 1432493 1325284
57646 1325284 1231887 1151274 1081446 1020084 965972 918878 878572 844764 817226 795064 776515
57635 776515 760302 746632 736153 728713 723837 721572 721946 724342 728307 734334 743058 754371 767973
57622 767973 783983 802213 821735 842137 864521 890461 920640 955167 994316 1038150 1086260
57611 1086260 1138756 1196723 1260866 1330410 1403962 1480323 1557508 1631799 1698701 1754071 1793888
57600A793888K0579j04j9147l5496n0010o2505p1322p6090p8450p9368p8018p4035
57588A189922o8791o3523n8124n2596m7807m3974m0103l5843l2146k9405k6681
57577F90929k3605k1231k0082j9051j7244j5295j3853j2335j0280q510p831p761
57565E13851p486o977o360n374m241l795m084m055l249k447k032j192M37J854
57551D64850K334K578L287L927L991M221N407O934P751P898Q133Q666R129R283
57537E48389R135Q865Q953R738J0735J1233J1518J2416J3738J4543J4992J6380
57525F90635J9013K1736K3941K6462K9917L3771L7601M1709M5979M9661N2862
57514A073287N6588O0629O3119O2888O0428N5824M7650L5228K0219M753j0494
$$ plain form
57600 1793888 1814467 1814363 1795216 1759720 1709710 1647205 1575883 1499793 1421343 1341975 1263957 1189922
57588 1189922 1121131 1057608 999484 946888 899081 855107 815004 779161 747015 717610 690929
57577 690929 667324 646093 626011 606960 589716 574421 560568 548233 537953 529443 521612 513851
57565 513851 506365 499388 493028 487654 483413 479618 475534 471479 468230 465783 463751 462559 462996 464850
57551 464850 467184 469762 473049 476976 480967 485188 490595 497529 505280 513178 521311 529977 539106 548389
57537 548389 557524 566389 575342 585080 595815 607048 618566 630982 644720 659263 674255 690635
57525 690635 709648 731384 755325 781787 811704 845475 883076 924785 970764 1020425 1073287
57514 1073287 1129875 1190504 1253623 1316511 1376939 1432763 1480413 1515641 1535860 1540613 1530119
57503A530119k5091l7475m6436n2727n7573o0628o0858n8595n5189n1342m7035
57492I77170m2512l8203l4153l0365k7143k4448k1653j8557j5774j3533j1112
57481F99717q159n489l801k628j324q3P63J496K366L132L838M949O288P074P580
57466G15719R286J2693J6346J8907K0805K2973K5461K8261L2042L6895M1671M5710
57454A026769M9865N4663N8738O0428N9666N7035N2094M4030L3065J9968N170
57443A521491j0508k5181l7226m6503n3345n7422n8573n7682n5644n2472m8294
57432A018641m4047m0154l5900l1174k7367k5225k3310k0157j6605j4359j3306
57421G27037j2056j0215q442p020n895n354n277m542k622q58o82j427j426m05
$$ plain form
57503 1530119 1505028 1467553 1421117 1368390 1310817 1250189 1189331 1130736 1075547 1024205 977170
57492 977170 934658 896455 862302 831937 804794 780346 758693 740136 724362 710829 699717
57481 699717 691558 686069 682268 679640 678316 678233 678996 680492 682858 685990 689828 694777 701065 708139 715719
57466 715719 725005 737698 754044 772951 793756 816729 842190 870451 902493 939388 981059 1026769
57454 1026769 1076634 1131297 1190035 1250463 1310129 1367164 1419258 1463288 1496353 1516321 1521491
57443 1521491 1510983 1485802 1448576 1402073 1348728 1291306 1232733 1175051 1119407 1066935 1018641
57432 1018641 974594 934440 898540 867366 839999 814774 791464 771307 754702 740343 727037
57421 727037 714981 704766 696324 689304 683409 678055 672778 668236 665614 664756 664074 662647 661221 660816
57407F60816P49J763K849L469K969K046K032L109M408N434O183O413O007N564
57393G13811N632N961O345P209Q473Q997Q348P805Q314Q773P946O705O579P187
57379H18085P122O449O231O387O062N460N339N218M167K815K614L444L945L902
57365H87240M247M941M829L684K542J934J445J106J590K787L669L702L369L214
57351I30299L466M345N671O477O163N570N813O567O815O642O845P347P499P489
57337A017008P991Q797R249R525J0139J0725J0776J0874J1743J2716J2799J2441
57325A144783J2576J2754J2139J1524J2136J3147J2723J1237J0925J2467J4224
57314A280635J4934J4994J4841J4233J3419J3279J3908J4636J5363J6304J6721
$$ plain form
57407 660816 661565 663328 666177 669646 672615 674661 676693 679802 684210 689644 695827 702240 708247 713811
57393 713811 719443 725404 731749 738958 747431 756428 764776 772581 780895 789668 797614 804319 810898 818085
57379 818085 825207 831656 837887 844274 850336 855796 861135 866353 870520 873335 875949 879393 883338 887240
57365 887240 891487 896428 901257 904941 907483 909417 910862 911968 913558 916345 920014 923716 927085 930299
57351 930299 933765 938110 943781 950258 956421 961991 967804 974371 981186 987828 994673 1002020 1009519 1017008
57337 1017008 1024999 1033796 1043045 1052570 1062709 1073434 1084210 1095084 1106827 1119543 1132342 1144783
57325 1144783 1157359 1170113 1182252 1193776 1205912 1219059 1231782 1243019 1253944 1266411 1280635
57314 1280635 1295569 1310563 1325404 1339637 1353056 1366335 1380243 1394879 1410242 1426546 1443267
57303A443267J5804J4501J4380J4960J4538J3436J3771J5849J7466J7428J7129
57292A612529J7789J8500J8206J7550J7485J7711J7655J7604J7853J8037J8016
57281A808935J8300J9024J9686K0211K0908K1223K0169J8235J7061J6878J6122
57270B016752J4127J2136J0949R476O684L285M84j441k394j858q8J478K030K423
57256B074043L573N040O069O761P460Q127R031J0806J3087J4398J4146J3497J3510
57243B199548J3773J3648J3551J4044J4767J5189J5406J5492J5112J4474J4468
57232B359472J5231J5675J5188J4547J4543J4827J4913J5075J5491J5632J5288
57221B525882J5088J5297J5211J4448J3746J3657J3585J2910J2012J1415J0909
$$ plain form
57303 1443267 1459071 1473572 1487952 1502912 1517450 1530886 1544657 1560506 1577972 1595400 1612529
57292 1612529 1630318 1648818 1667024 1684574 1702059 1719770 1737425 1755029 1772882 1790919 1808935
57281 1808935 1827235 1846259 1865945 1886156 1907064 1928287 1948456 1966691 1983752 2000630 2016752
57270 2016752 2030879 2043015 2053964 2063440 2070124 2073409 2073893 2072452 2070058 2068200 2068112 2069590 2071620 2074043
57256 2074043 2077616 2082656 2088725 2095486 2102946 2111073 2120104 2130910 2143997 2158395 2172541 2186038 2199548
57243 2199548 2213321 2226969 2240520 2254564 2269331 2284520 2299926 2315418 2330530 2345004 2359472
57232 2359472 2374703 2390378 2405566 2420113 2434656 2449483 2464396 2479471 2494962 2510594 2525882
57221 2525882 2540970 2556267 2571478 2585926 2599672 2613329 2626914 2639824 2651836 2663251 2674160
57210B674160J0247R709R387Q870Q213Q156Q865R551R833J0239J0936J1286J1166
57197B800618J1332J1909J2029J1583J1696J2687J3216J2495J1635J1728J2095
57186B933023J1749J1110J0895J0580R426P928O921O180N191M335M027L666K739
57173C027770K020K347L069K981K095J244O20q1p38j109j471j983k112j656j520
57158C031476k503m026n107n758o460p052p233p435q125q877r043q726q323p900
57144B934908p761q653j0507j1953j2008j1219j0241q614o108l910k977k270k36
57131B838451K855N621P768R885J1753J2578J2466J2182J1783J0932J0096R946
57119B956316J0067R778R841J1876J6242K1931K8230L5200M2815N1037O0472P1655
$$ plain form
57210 2674160 2684407 2694116 2703503 2712373 2720586 2728742 2737607 2747158 2756991 2767230 2778166 2789452 2800618
57197 2800618 2811950 2823859 2835888 2847471 2859167 2871854 2885070 2897565 2909200 2920928 2933023
57186 2933023 2944772 2955882 2966777 2977357 2986783 2994711 3001632 3007812 3013003 3017338 3021365 3025031 3027770
57173 3027770 3029790 3032137 3035206 3038187 3040282 3041526 3042146 3042065 3041327 3040218 3038747 3036764 3034652 3032996 3031476
57158 3031476 3028973 3024947 3019840 3014082 3007622 3000570 2993337 2985902 2977777 2968900 2959857 2951131 2942808 2934908
57144 2934908 2927147 2918494 2907987 2896034 2884026 2872807 2862566 2853952 2847844 2843934 2840957 2838687 2838451
57131 2838451 2841306 2846927 2854695 2864580 2876333 2888911 2901377 2913559 2925342 2936274 2946370 2956316
57119 2956316 2966383 2976161 2986002 2997878 3014120 3036051 3064281 3099481 3142296 3193333 3253805 3325460
57107C325460Q4034R7122J12214J31423J55564J84788K20906K66763L23166L88561
57097E290001M62060N44541O36346P36520Q45929R68831J109138J265769J432449
57088A3291584J600060J757489J892275J992924K049069K047966J977035J840114
57080B8448516J671694J521053J407019J286860J079501P27327K38464l24407
57072C6056027q85497j385207j785595k068354k234694k300674k286221k208001
57064B0901784k081239j922567j747570j567587j390807j224141j072001r35320
57056H960552q13977p08995o20844n47367m85329m32912l89143l52191l20086
57047D289708k92137k68111k46905k27458k10030j95163j82167j70028j58900
$$ plain form
57107 3325460 3409494 3506616 3618830 3750253 3905817 4090605 4311511 4578274 4901440 5290001
57097 5290001 5752061 6296602 6932948 7669468 8515397 9484228 10593366 11859135 13291584
57088 13291584 14891644 16649133 18541408 20534332 22583401 24631367 26608402 28448516
57080 28448516 30120210 31641263 33048282 34335142 35414643 36141970 36380434 36056027
57072 36056027 35170530 33785323 31999728 29931374 27696680 25396006 23109785 20901784
57064 20901784 18820545 16897978 15150408 13582821 12192014 10967873 9895872 8960552
57056 8960552 8146575 7437580 6816736 6269369 5784040 5351128 4961985 4609794 4289708
57047 4289708 3997571 3729460 3482555 3255097 3045067 2849904 2667737 2497709 2338809
57038B338809j49403j41187j33482j26223j19538j12965j06277j00135r4775q9137
57028A165687q2553p6079p0837o6108o0686n4941m9904m5319m0362l5526l1877
57017E51495k9217k6698k4580k3453k2394j9960j6642j4295j3333j2403j0873
57006C37647r645r272r079q482p653o492m479j931o7O72J168K182L515M975O943
56991C00002R516J2175J4838J8268K2821K7668L1867L5484L9146M3166M7455N1671
56979F54077N5119N7637O1070O8663Q2084J00453J23746J55425J99250K55412
56969A812936L24223M11277N17636O16892O50099N61578L49532P7140j71717l46346
56959D803250m42108m75567m62585m18033l60046l04276k57264k19375j90337
$$ plain form
57038 2338809 2189406 2048219 1914737 1788514 1668976 1556011 1449734 1349599 1254824 1165687
57028 1165687 1083134 1007055 936218 870110 809424 754483 704579 659260 618898 583372 551495
57017 551495 522278 495580 471000 447547 425153 405193 388551 374256 360923 348520 337647
57006 337647 328002 318730 309651 301169 293516 287024 282545 280614 280547 281219 282387 284569 288084 293059 300002
56991 300002 309518 321693 336531 354799 377620 405288 437155 472639 511785 554951 602406 654077
56979 654077 709196 766833 827903 896566 978650 1079103 1202849 1358274 1557524 1812936
56969 1812936 2137159 2548436 3066072 3682964 4333063 4894641 5244173 5321313 5149596 4803250
56959 4803250 4361142 3885575 3422990 3004957 2644911 2340635 2083371 1863996 1673659
56950A673659j68857j50961j33289j16251j01398q8029p4929o3000n3481m5714
56940F77750l9044l4636l2842l0944k6331j9996j4284q935k068O471J5071K2005
56928E12217K4866K0501Q481o789j9989k9457l5802l8544l7257l4095l1550k8998
56916C03584k4757k0068j7481j6489j4472j1200q749p524n996m065l173l132k155
56903A64323j61J074J168J561K619L208L354M407O296P415P498Q049R590J1072
56889B31473J2307J4459J7735K0900K3322K5115K5093K1091J2875K669p359j6111
56877C83569k2276k4625k3864k1956j9387j5281j0071n458j631K902Q422J3484
56865B63828J7717K2593K8916L5925M3556N3212O5074P6022Q0850P4801N6038
$$ plain form
56950 1673659 1504802 1353841 1220552 1104301 1002903 914874 839945 776945 723464 677750
56940 677750 638706 604070 571228 540284 513953 493957 479673 470738 468670 475141 490212 512217
56928 512217 537083 557584 566065 559276 539287 509830 474028 435484 398227 364132 332582 303584
56916 303584 278827 258759 241278 224789 210317 199117 190368 182844 176848 172783 169610 166478 164323
56903 164323 164162 165236 166404 167965 170584 173792 177146 181553 187849 195264 202762 210811 220401 231473
56889 231473 243780 258239 275974 296874 320196 345311 370404 391495 404370 407039 399680 383569
56877 383569 361293 336668 312804 290848 271461 256180 246109 240651 239020 241922 250344 263828
56865 263828 281545 304138 333054 368979 412535 465747 530821 606843 687693 762494 818532
56854H18532K7884j629k4942l9963m8692n2332n0627m4908l7995l0826k2420j3238
56842D78844n260J611R796K0025L0402M0166N1300O5475Q2317J00940J19234J30354
56830A125204J24218R5849N0738O30m3980p6904r5915j02647j01169r4603q3931
56819G97490p0516n7200m5630l4816k3875j3966n870K198J2389K4534L7377N1015
56807F73130O6104Q1166R1620R1144P4691M2640K744l4057o0912p7308q5022q5055
56795G80885p9101p0438o1353n1734m1495l2243k5069j8927j2592o283j11O958
56783C88497J5265K3617L1465L9519M6665M8508M1126K5012M213j6735l4000m4941
56771E68211m9537n0092m8469m4858l9717l4627l0211k5512k0565j7199j6000
$$ plain form
56854 818532 846416 844787 819845 779882 731190 678858 628231 583323 545328 514502 492082 478844
56842 478844 473584 475195 484991 505016 535418 575584 626884 692359 774676 875616 994850 1125204
56830 1125204 1249422 1345271 1396009 1396639 1352659 1275755 1179840 1077193 976024 881421 797490
56819 797490 726974 669774 624144 589328 565453 551487 545617 547815 560204 584738 622115 673130
56807 673130 739234 820400 912020 1003164 1077855 1120495 1123239 1089182 1028270 950962 865940 780885
56795 780885 701784 631346 569993 518259 476764 444521 419452 400525 387933 381650 381539 388497
56783 388497 403762 427379 458844 498363 545028 593536 634662 659674 663887 647152 613152 568211
56771 568211 518674 468582 420113 375255 335538 300911 270700 245188 224623 207424 191424
56760A91424j4892j2367r725q453p683o199m798m590m817m350l751l849l893k962
56746I9095j784j411j496j378j458j963j936r71l72j160k331k545k023j514r30
56731G5823k66j88o16l84O34R98K89J4Q08J167L29j44O68J111j11j513j457q79
56713G6283j211j664r40K82O84M38Q2q84k395k877j761q46j263j485l76L85o61
56696F1791j823j162Q3p9p36l9J157R78K08Q27K230K211P46k64k75j52J40J182
56678F7023K123J682L77m04p09j204j308l92M55J70j22Q09J670P51q15q49J40
56661F9397R5q70j071n50p03j372j371j134j828k577j668J21N13m51p29MJ09o83
56643E5232q19O2N61J73j15k5l30q69o08K48M37RK41J147J361O10J14L71N52L33
$$ plain form
56760 191424 176532 164165 154440 145987 138304 132105 127307 122717 117900 113550 109799 105950 102057 99095
56746 99095 97311 95900 94404 93026 91568 89605 87669 86698 86326 85166 82835 80290 78267 76753 75823
56731 75823 75557 75369 74753 74369 75003 76001 76290 76304 77112 78279 78608 78464 79132 80243 80132 78619 77162 76283
56713 76283 75072 73408 72468 72750 73434 73872 73954 73070 70675 67798 66037 65191 63928 62443 62067 62452 61791
56696 61791 59968 58806 58889 58810 58074 58035 59192 60170 60378 61205 63435 65646 66392 66128 65853 65701 65841 67023
56678 67023 69146 70828 71205 70801 70092 68888 67580 67188 67643 67813 67691 68500 70170 70921 70106 69257 69397
56661 69397 69492 68622 67551 67001 66298 64926 63555 62421 60593 58016 56348 56469 56982 56531 55802 55806 55915 55232
56643 55232 54413 54475 55036 55209 55094 55069 54739 53870 53262 53510 53947 53956 54197 55344 56705 57315 57429 57800 58352 58685
56623E8685M28J091J730K053K233K118J615J440K130K858K668K069J938J838J087
56608H5981M60R21J730J694J295J527J832J295P71J458K442K099R57O89J181J070
56592A07402M00K23L11k04o20L12J872K298J666J441J841K023K115K683K975K142
56576A28880J317J970L145K932J818J766K781L272L080L320L801L426K590K526
56562A66624K849K422J922K814M525N396N647O548P537P224O421P040Q689R493
56548B45151R507J0042J0453R166P209P032Q212Q040O118M635M228L261J381J32
56534C34567k17j131k765l711l941m795o027o080n345n745p013o872n079l876
56520B71970m122m352m039m382n517o165o363p371q665q345o717o062o637o371
$$ plain form
56623 58685 59113 60204 61934 63987 66220 68338 69953 71393 73523 76381 79049 81118 83056 84894 85981
56608 85981 86441 87362 89092 90786 92081 93608 95440 96735 97506 98964 101406 103505 104462 105151 106332 107402
56592 107402 107802 108025 108336 108132 107512 107824 109696 111994 113660 115101 116942 118965 121080 123763 126738 128880
56576 128880 130197 132167 135312 138244 140062 141828 144609 147881 150961 154281 158082 161508 164098 166624
56562 166624 169473 171895 173817 176631 181156 186552 192199 198747 206284 213508 219929 226969 235658 245151
56548 245151 254658 264700 275153 284319 291528 298560 306772 314812 320930 325565 329793 333054 334435 334567
56534 334567 334350 333219 330454 326743 322802 318007 311980 305900 300555 294810 287797 280925 275846 271970
56520 271970 267848 263496 259457 255075 249558 243393 237030 229659 220994 212649 205932 199870 193233 186862
56506A86862m834l900m047l626k265j470j373m28J119J143l89j044j56K17o56
56491A65153r33J20Q43N60O90J488J234l25j149n91m56j401j721p86k11n52k62
56474A61701R52J259K88R7J403K290J810J440J732J165m62r96K56J191P32N30
56458A75388J484K096J739K073L649M611M213M223N313N639M576M182N257N661
56444B30104M391L679M949O292O123N858O671O954N482M000M198M888M504L683
56430C01776L259K414Q50J16Q19J135o2j350j715k439m234n455n112m793n668
56415B79541o353n710m907m932m725l573k652k593k311j629k046l487l661k088
56401B28874j372k724l900l352k786l557m178l565l193l842l755k251j531k600
$$ plain form
56506 186862 182028 178128 174081 170455 168190 166720 165347 164919 166038 167181 166792 165748 165592 165809 165153
56491 165153 164220 164340 165183 165743 166433 167921 169155 168830 167681 167090 166634 165233 163512 162726 162515 161963 161701
56474 161701 162653 163912 164200 164297 165700 167990 169800 171240 172972 174137 173675 172679 172935 174126 174858 175388
56458 175388 176872 178968 180707 182780 186429 191040 195253 199476 204789 210428 215004 219186 224443 230104
56444 230104 234495 238174 243123 249415 255538 261396 268067 275021 280503 284503 288701 293589 298093 301776
56430 301776 305035 307449 308299 308415 309234 310369 310307 308957 307242 304803 300569 295114 290002 285209 279541
56415 279541 273188 267478 262571 257639 252914 249341 246689 244096 241785 240156 238110 234623 230962 228874
56401 228874 227502 224778 220878 217526 214740 211183 207005 203440 200247 196405 192650 190399 188868 186268
56387A86268l094j627n00j453k439j476j39k36n81L6P7j477k395r13J067J472
56371A72590J520K593L037J392k92K20J560J572J038J389J603N85j06Q94J875
56356A91470J096n5Q6L97k66l37J283K464J552P07K102L847L445K249K661L755
56340B16456L579L143M133N163M243K749L011M150M003L087K986K943J654L95
56326B61695Q49J794J394O82J417K674K833K855M166N535N395N033O119P369O968
56311C16778O029O311O766N799M649N102O002N367L885L177K825K044J873K781
56297C79388K743O45j306j507j907l971n243l703j896k677m255l811k653l274
56283C46573m361l514k086k580l802l263j931k029k569j558k55p48j714r39M10
$$ plain form
56387 186268 183174 181547 181047 179594 177155 175679 175540 175304 174723 174759 174836 173359 170964 170051 171118 172590
56371 172590 174110 176703 179740 181132 180840 181060 182620 184192 185230 186619 188222 188807 188701 189595 191470
56356 191470 192566 192511 192597 192994 192728 192391 193674 196138 197690 198397 200499 204346 207791 210040 212701 216456
56340 216456 220035 223178 227311 232474 236717 239466 242477 246627 250630 253717 256703 259646 261300 261695
56326 261695 262544 264338 265732 266414 267831 270505 273338 276193 280359 285894 291289 296322 302441 309810 316778
56311 316778 322807 329118 335884 341683 346332 351434 357436 362803 366688 369865 372690 374734 376607 379388
56297 379388 382131 382776 381470 379963 378056 374085 368842 365139 363243 360566 356311 352500 349847 346573
56283 346573 342212 338698 336612 334032 330230 326967 325036 323007 320438 318880 318625 317877 316163 315224 315634
56268C15634K91j36P92J291m50j938k27K661L067J760J697K473K141J860L527
56253C34443N264M484L068M274O957Q016Q080R394J0614R317P269P648R208Q785
56239D36821P351P939R743R896R013R371R804Q035N833O209P730P395O614Q331
56225E50085J0770J0334Q421Q883J0841J0644Q925R005J0128R013O481N776N912
56212F65218L483m34k001j825l577o750p646o428o457p691p375o093o541p526
56198E98357n956l396l791o035n816l555l293m975n100l953m744o616n957l807
56184E31363m370o941o918m154k713l031j944N1n18k625j863J266K040K93N07
56169E00443L231M361L194L336N225N439L801L673M962M305K245K647M970M862
$$ plain form
56268 315634 315925 315789 316581 317872 317422 315484 315257 317918 320985 322745 324442 326915 329056 330916 334443
56253 334443 339707 344191 347259 351533 358490 366506 374586 383980 394594 403911 411180 418828 428036 436821
56239 436821 444172 452111 461854 471750 480763 490134 499938 507973 513806 520015 527745 535140 541754 550085
56225 550085 560855 571189 579610 588493 599334 609978 618903 627908 638036 647049 653530 659306 665218
56212 665218 668701 668267 666266 664441 660864 654114 646468 640040 633583 625892 618517 612424 605883 598357
56198 598357 592401 589005 585214 579179 573363 569808 566515 561540 556440 552487 547743 541127 535170 531363
56184 531363 526993 520052 513134 508980 506267 503236 501292 501343 500825 498200 496337 497603 499643 499936 500443
56169 500443 503674 508035 511229 514565 519790 525229 529030 532703 537665 541970 544215 546862 551832 556694
56155E56694K465K293M741N662M456M717O598O503M533M398N893N366L524M577
56141F22420P831Q519O797P279R959J0486R389J1649J7002J9946J9804K1311K4998
56128G97390K6613K6580L0088L7018M1730M3821M9065N8677O7860P6190Q9075
56117A344107J07460J26496J46009J71651K03447K33310K55665K70410K73956
56108C132511K59131K27254J90140J57190J29864J10030J01909J02252R9350Q5832
56098D595463O3843L6289L891k7069m5946n0802n0911n4204o2400p9299j10866
56087D217989j53426j93432k22583k42584k53328k49384k31731k10222j89966
56078B271333j66965j40698j18413j02749q7557p0433n7231m9879m2144l1883
$$ plain form
56155 556694 559159 561452 566193 571855 576311 581028 587626 594129 598662 603060 608953 614319 617843 622420
56141 622420 630251 638770 645567 652846 662805 673291 682680 694329 711331 731277 751081 772392 797390
56128 797390 824003 850583 880671 917689 959419 1003240 1052305 1110982 1178842 1255032 1344107
56117 1344107 1451567 1578063 1724072 1895723 2099170 2332480 2588145 2858555 3132511
56108 3132511 3391642 3618896 3809036 3966226 4096090 4206120 4308029 4410281 4509631 4595463
56098 4595463 4659306 4695595 4699486 4672417 4626471 4575669 4524758 4470554 4408154 4328855 4217989
56087 4217989 4064563 3871131 3648548 3405964 3152636 2903252 2671521 2461299 2271333
56078 2271333 2104368 1963670 1845257 1742508 1654951 1584518 1527287 1477408 1435264 1403381
56068A403381k5087k3479k0649j4667j1646j2625j0331l366J98k020k021L244
56056A280932O321M206M228R356J2323J0326J0735J6137J8648J5398J4442J8885
56044A421937K0591J6376J4662J9132K1743J9073J9147K4778K6958K2553K1339
56033A648289K7365L0866K7237K6056L2223L6437L3808L3590M0455M4782M1756
56022B022864M1198M8022N2268M9220M9500N7961O3111N9218N7987O5946P1796
56011B639091O9095O9362P9025Q5936Q3143Q2988R2695R9570R6122R5684J06526
56000C599237J15293J13408J14584J27955J39785J40829J45159J61973J76247
55991D834470J78219J83805K03813K22133K27446K36509K61821K87244L00966
$$ plain form
56068 1403381 1378294 1354815 1334166 1319499 1307853 1295228 1284897 1281531 1281729 1279709 1277688 1280932
56056 1280932 1287253 1291459 1295687 1305043 1317366 1327692 1338427 1354564 1373212 1388610 1403052 1421937
56044 1421937 1442528 1458904 1473566 1492698 1514441 1533514 1552661 1577439 1604397 1626950 1648289
56033 1648289 1675654 1706520 1733757 1759813 1792036 1828473 1862281 1895871 1936326 1981108 2022864
56022 2022864 2064062 2112084 2164352 2213572 2263072 2321033 2384144 2443362 2501349 2567295 2639091
56011 2639091 2708186 2777548 2856573 2942509 3025652 3108640 3201335 3300905 3397027 3492711 3599237
56000 3599237 3714530 3827938 3942522 4070477 4210262 4351091 4496250 4658223 4834470
55991 4834470 5012689 5196494 5400307 5622440 5849886 6086395 6348216 6635460 6936426
55982F936426L20252L57033L92615M14379M42270M89750N36022N68011O10087
55973A1066845O78905P51094Q11528Q88664J003349J131010J256896J417167J639158
55964B0644616J896784K175907K522995K971714L485986M038019M671969N424499
55956D7832489O268799P220130Q405408R939159J1843058J4194261J7212932K1074220
55948A43990456K5817750L1554904L8258911M4649391M7441991M2805278K9470556
55941D03989237J0385762r056150k4444739l4166323l8713284l9260265l7038752
55934B31695486l3272103k8974794k4730664k0800953j7353621j4477342j2111583
55927G9974426j0138513q510590p209304o155975n260358m504093l896776l398737
$$ plain form
55982 6936426 7256678 7613711 8006326 8420705 8862975 9352725 9888747 10456758 11066845
55973 11066845 11745750 12496844 13308372 14197036 15200385 16331395 17588291 19005458 20644616
55964 20644616 22541400 24717307 27240302 30212016 33698002 37736021 42407990 47832489
55956 47832489 54101288 61321418 69726826 79665985 91509043 105703304 122916236 143990456
55948 143990456 169808206 201363110 239622021 284271412 331713403 374518681 403989237
55941 403989237 414374999 405318849 380874110 346707787 307994503 268734238 231695486
55934 231695486 198423383 169448589 144717925 123916972 106563351 92086009 79974426
55927 79974426 69835913 61325323 54116019 47960044 42699686 38195593 34298817 30900080
55919C0900080k957546k574467k268628k015295j778500j567068j402995j268294
55911A5067287j133829j008877r14470q37135p53738o74342o18153n72960n18385
55902H035398m64880m31369m07226l72858l36399l15009l00218k75313k48079
55893D884047k34127k25611k07128j85578j75057j68619j53181j36409j31428
55884C266909j30169j18593j03591r8802r7970q7918p4365o9920o9123n9837m7262
55873B309359m2948m1363l0665j5859q725m933O865K2822L1785L5794M2078M4044
55861B348254L0891P908j2263l0155n2489p3502q2886q4634q9170r3988r0319
55850A777647q1710p7742p6051o8387n8146n4333n4134m8693m0433l7804l8294
$$ plain form
55919 30900080 27942534 25368067 23099439 21084144 19305644 17738576 16335581 15067287
55911 15067287 13933458 12924581 12010111 11172976 10419238 9744896 9126743 8553783 8035398
55902 8035398 7570518 7139149 6731923 6359065 6022666 5707657 5407439 5132126 4884047
55893 4884047 4649920 4424309 4217181 4031603 3856546 3687927 3534746 3398337 3266909
55884 3266909 3136740 3018147 2914556 2815754 2717784 2629866 2555501 2485581 2416458 2356621 2309359
55873 2309359 2266411 2225048 2194383 2178524 2169799 2164866 2171731 2194553 2226338 2262132 2304210 2348254
55861 2348254 2379145 2387053 2374790 2344635 2292146 2218644 2135758 2051124 1961954 1867966 1777647
55850 1777647 1695937 1618195 1542144 1473757 1415611 1361278 1307144 1258451 1218018 1180214 1141920
55839A141920l3201k4338j9915j8611j3278n815l106k660K851J1196J5110J6565
55827A066718K2496L1029L5961L9657M6820N0294L8536J3892j0779l0210m7503
55816A256911o0891o4717o1477n8993n7363n1200m2313l7408l5611l0809k4010
55805G32119k1051k0466j5984q921n834n901k655L610O922P339R908J3716J3439
55792G06241J0183R565J0532P250O37l062l813o925j1861j2856r737p684p006
55779F81464l456K254N318O296R676J3947J2923O276o33o388j3554k0411k2447
55766F71265k1120k1717k3574k1764j7093j4661j3918j0282n537o109j1414j4250
55754D89826j2838j2334j4225j4208j1383r903j0501r397o572o310q675r026o866
$$ plain form
55839 1141920 1108719 1084381 1064466 1045855 1032577 1026762 1023656 1020996 1023847 1035043 1050153 1066718
55827 1066718 1089214 1120243 1156204 1195861 1242681 1292975 1331511 1345403 1334624 1304414 1256911
55816 1256911 1196020 1131303 1069826 1010833 953470 902270 859957 822549 786938 756129 732119
55805 732119 711068 690602 674618 665697 659863 653962 651307 654917 661839 669178 679086 692802 706241
55792 706241 716424 725989 736521 743771 744408 741346 737533 730608 718747 705891 696154 688470 681464
55779 681464 678008 680262 685580 691876 701552 715499 728422 734698 734065 727677 714123 693712 671265
55766 671265 650145 628428 604854 583090 565997 551336 537418 527136 521599 515490 504076 489826
55754 489826 476988 464654 450429 436221 424838 414935 404434 395037 388465 382155 373480 364454 357588
55741C57588o753r525j0905r693r271j0236r373o694n676n981l720N73K078L22
55727B72734l07Q92j33l902o054n301n113o489o529n117n578p634p137l793j929
55712B08610k637k375k64N16m00L73L047L951K776L291N828O254L692J968K083
55697B36713M50l763o656o649o668p670o776l627j932k800k898r13M41M48J979
55682A89679N430P386P012P566R945J0901R223P488O156K394l666p837q844j0052
55668B32781j2619j3369j1385j0129j0835j0208o988m535m468l947j733q07k283
55655A39475k740m73J388Q60N99K492M145L782L387M107L539N41k103k521k650
55640A53828l837m338l542l817n675o093m028k667l645m090k145l72p54j135K25
$$ plain form
55741 357588 350835 341310 330405 320712 311441 301205 291832 285138 279462 273481 269761 270334 272412 272734
55727 272734 272427 273319 273186 269284 263230 257929 252816 246327 239798 234681 229103 221469 214332 210539 208610
55712 208610 205973 203598 203334 203850 203450 203823 206870 210821 213597 216888 222716 228970 232662 234630 236713
55697 236713 237163 233400 226744 220095 213427 205757 198981 195354 193422 190622 187724 186811 187252 187700 189679
55682 189679 195109 202495 209507 217073 227018 237919 247142 254630 260786 263180 259514 251677 242833 232781
55668 232781 220162 206793 195408 185279 174444 164236 157248 152713 148245 144298 142565 141758 139475
55655 139475 136735 136262 137650 138510 139109 141601 145746 149528 152915 157022 160561 161102 158999 156478 153828
55640 153828 149991 145653 142111 138294 132619 126526 122498 119831 116186 112096 109951 109579 108825 107690 107915
55625A07915J237J58j138j017j017k078k136l37N39j212l059k644j442j358j475
55610I0936q40o68j240m36K144L474J969K26M42J068N07J41J057J544N24j75N18
55593A01191P13o16j323q0J111P96O37J749K370J638J739L710N070M377M061N938
55577A33081P837P795P705R593J1925J2951J4259J7681K1837K5032K8552L3949
55565C32197L9794M4056M6911M8429M6385L9178K8379J6060K400j1893k4112l2866
55553E74918l9726m5312m7290m4743m0750l7777l4181k8355k2657j9730j8206
55542A96191j5613j2652j1112j0288q807p487p215o568m561l139l879m932m257
55529I5681l137l378l752k582j289j817k917k408j061q86j504j363p97q80j009
$$ plain form
55625 107915 109152 109310 108172 107155 106138 104060 101924 101587 102126 100914 97855 95211 93769 92411 90936
55610 90936 90096 89428 88188 87752 89896 93370 95339 95565 96007 97075 97582 97723 98780 100324 100848 100673 101191
55593 101191 101904 101288 99965 99885 100996 101792 102429 104178 106548 108186 109925 113635 118705 123082 127143 133081
55577 133081 140918 148713 156418 166011 177936 190887 205146 222827 244664 269696 298248 332197
55565 332197 371991 416047 462958 511387 557772 596950 625329 641389 643789 631896 607784 574918
55553 574918 535192 489880 442590 397847 357097 319320 285139 256784 234127 214397 196191
55542 196191 180578 167926 156814 146526 137719 130232 123017 116449 111888 108749 104870 99938 95681
55529 95681 92544 89166 85414 82832 81543 79726 76809 74401 73340 72454 70950 69587 68790 67910 66901
55514F6901l13L26J35K79J475K047Q34l63K17J280J157R00J897K894K333J310
55498H3309J262J065n65k218k343k346l947n708n443l973l236k778j429l81j224
55483E0045k661k533j437j124j019L07J829J546qq51r26j432k014j557n94k67
55467C7304r5P18J215M10m72j3P70L31n28l08L28M4n29k96r2q72j338j51J305
55448C7731J176L84O80J303P43l9O43J842J639O75P23J253O70l41j65M28l66j784
55430D7195j737o29m61j019l94J283J994J309O53M39j52q69o74j3k41j093j143
55413D4448l10L92J013K277L581L666K740J967J566J286J709L074L951L203J986
55398G6549J765J759N83j090j924k352l152l203j526M8p78l077m279m043l688
$$ plain form
55514 66901 66588 66914 67049 67328 68803 70850 71684 71321 71538 72818 73975 74875 76772 79666 81999 83309
55498 83309 84571 85636 85071 82853 80510 78164 74217 68509 63066 59093 55857 53079 51650 51269 50045
55483 50045 47384 44851 43414 42290 41271 41578 43407 44953 44945 44094 43168 41736 39722 38165 37571 37304
55467 37304 37209 37927 39142 39552 39080 39067 39837 40168 39640 39332 39660 39704 39175 38879 38787 37915 36577 36426 37731
55448 37731 38907 39291 39971 41274 42017 41978 42621 44463 46102 46777 47500 48753 49423 49082 48917 49345 48979 47195
55430 47195 45458 44829 44368 43349 42955 44238 46232 47541 48194 48633 48481 47612 46938 46925 46684 45591 44448
55413 44448 44138 44530 45543 47820 51401 55067 57807 59774 61340 62626 64335 67409 71360 74563 76549
55398 76549 78314 80073 80656 79566 77642 75290 72138 68935 67409 67457 66679 63602 59323 55280 51592
55383E1592l129j681n76j373k816k555j138r83k263l089l095l439l873l068j478
55368A7036p66o94L71K252L216L048L003L065K218J051J138K105K126J071M08
55353D0648L43j58r20r10o15j294k255j708M6J109J245J699K197J231p74j649
55337C8235r23k86m97n54j6L19K13J73j2p49j169l68M97r5j136o17Q75J141K30
55318C5261N8P26N65l62l27O22O28m23o78J20J69q64j103J26J099P38R1P0J71
55299C6687P4K12L27l67j369j356m62R5K89Q35J020j90j454o36J344J622J19m76
55281C6314M85P29m99j014L14J705J832J750K123J678q7j450j329r85j491j859
55265C8216j174l03j03L5O33J007P23M70N63L75j39j77K15J16k90Q3Q20K74j373
$$ plain form
55383 51592 48463 46782 46206 44833 42017 39462 38324 37341 35078 31989 28894 25455 21582 18514 17036
55368 17036 16270 15576 15947 18199 21415 24463 27466 30531 32749 33800 34938 37043 39169 40240 40648
55353 40648 40991 40833 39913 39003 38388 37094 34839 33131 33177 34286 35531 37230 39427 40658 39884 38235
55337 38235 37312 37026 36529 35975 35959 36278 36491 36664 36652 35903 34734 34366 34863 34768 33632 33015 33890 35031 35261
55318 35261 35319 36045 36610 36248 35921 36543 37171 36748 36070 36190 36359 35495 34392 34518 35617 36355 36446 36516 36687
55299 36687 36761 36973 37300 36933 35564 34208 33746 33841 34130 34965 35985 35795 34341 33705 35049 36671 36790 36314
55281 36314 36799 37528 37029 36015 36329 38034 39866 41616 43739 45417 45330 43880 42551 41566 40075 38216
55265 38216 37042 36739 36636 36671 37304 38311 39034 39504 40067 40442 40303 40126 40341 40457 40167 40250 41070 41344 39971
55246C9971j979r51j83p24j213o13R5Q6J40P52J010M86J74M48K19r23j726j471
55228C3598j125j395j553j098p03o57k97L83M44j00o4O85Q65J71j80K40M73L50
55210C0037Q56J800J680M89N2Q64J261N18J3M33O08J52L85J460J489r1j179n97
55192D0230k11j566l093k744j139K6O54J338J621J052M32L60J46n49p42q9J62
55175C5888n38q30MN10l81j387j204p51j174j618r22K34P56J131K046K589J743
55158C6096L34k86k40l18m97o29j134j750j220M23J155l5j361j057l6J29j24K72
55140B9722P11K85r6P25J791J503L32j48P2j52q38j026o26k95n3M16P75P37R53
55121C4788J824K302J364k22r46o03J9N88J122J349J342J904L223M203M116L703
$$ plain form
55246 39971 37992 37041 36858 36134 34921 34308 34403 34489 34629 35381 36391 36877 37051 37499 37718 36795 35069 33598
55228 33598 32473 31078 29525 28427 27724 27067 26770 27153 27597 27497 27433 28118 28983 29154 28974 29214 29687 30037
55210 30037 30893 32693 34373 34862 34914 35778 37039 37557 37570 38003 38611 38763 39148 40608 42097 42006 40827 40230
55192 40230 40019 38453 35360 32616 31477 31503 32157 33495 35116 36168 36600 36960 37106 36557 35815 35726 35888
55175 35888 35350 34520 34524 35034 34653 33266 32062 31311 30137 28519 27597 27831 28587 29718 31764 34353 36096
55158 36096 36430 36144 35904 35586 35089 34460 33326 31576 30356 30779 31934 31899 30538 29481 29445 29574 29450 29722
55140 29722 30433 30718 30622 31347 33138 34641 34973 34825 34897 34745 33907 32881 32255 31960 31907 32323 33098 33835 34788
55121 34788 36612 38914 40278 40056 39110 38507 38526 39114 40236 41585 42927 44831 48054 52257 56373 60076
55105F0076L544K823R66q88j508j385j527j715j449j309j823k210j702r63q21
55090E0109q17m36m08j263j971j594r41j008j126l82N23N91L51N51M17p63j719
55073D0114j002M34P11P9J22Q30P81k04r22r74j054j201o91M40J338J642J558
55056D2001J012K1n86j91M79N44M86J079J699J324M98M63J009R46K41n3K83M58
55038E1713J63j81m21o66n91K9N97N73M85R38J421J312J230J939K819K901K610
55021F6871K825L033K191Q16L45Q68J170P43J71k18n53n36K09J152J509J526J898
55004H4020K393K319J840J459Q15o60k337l119l120l236l498l201k280j279l53
54989F9763M76O13l32j579k157k267k496k547j982j478j847k492k303j370n22
$$ plain form
55105 60076 63620 66443 67409 66521 65013 63628 62101 60386 58937 57628 55805 53595 51893 50930 50109
55090 50109 49292 48856 48448 47185 45214 43620 42679 41671 40545 40163 40686 41277 41628 42179 42596 41833 40114
55073 40114 39112 39546 40257 40336 40458 41288 42069 41865 40943 39969 38915 37714 37023 37463 38801 40443 42001
55056 42001 43013 43034 42448 42257 42736 43280 43766 44845 46544 47868 48366 48829 49838 50784 51025 50972 51255 51713
55038 51713 51876 51695 51274 50608 50017 50046 50643 51216 51701 52639 54060 55372 56602 58541 61360 64261 66871
55021 66871 69696 72729 74920 75736 76081 76949 78119 78862 79033 78815 78262 77726 77935 79087 80596 82122 84020
55004 84020 86413 88732 90572 92031 92846 92186 89849 86730 83610 80374 76876 73675 71395 70116 69763
54989 69763 70239 70852 70520 68941 66784 64517 62021 59474 57492 56014 54167 51675 49372 48002 47480
54974D7480J73J031J693J784J828K148J898P00J9J117K717K825J798J371J502
54959G0084P24q50j462n55O41J358J972K387J881P92N10J452K665L589M542N467
54943I5197N830N869O419P460Q285Q966J0095J1256J1435J0793J0356R940Q244
54930B10145M992J311k126n571q753j0678j1189j1169j0968j0133q869q162q171
54917A20659p917o893n684m776m009l361l042k721j859q32m67n92l56K20L90K38
54901G8998N49J298J793K234L445N141O120O316O960Q505R968J0616J0631R925
54887A62499P859M605J306j520m419p491r823j0830j0927j0519r487p984o626
54874I6643n544m265k723j425n69M6L61K99M33J166J686J042n9j53O34R12M96
$$ plain form
54974 47480 47653 48684 50377 52161 53989 56137 58035 58735 58754 59871 62588 65413 67211 68582 70084
54959 70084 70808 69958 68496 67941 68582 69940 71912 74299 76180 76972 77482 78934 81599 85188 89730 95197
54943 95197 101027 106896 113315 120775 129060 138026 148121 159377 170812 181605 191961 201901 210145
54930 210145 215137 216448 214322 208751 199998 189320 178131 166962 155994 145861 136992 128830 120659
54917 120659 112742 105849 100165 95389 91380 88019 84977 82256 80397 79565 79098 78506 78150 78370 78760 78998
54901 78998 79547 80845 82638 84872 88317 93458 99578 105894 112854 121359 131327 141943 152574 162499
54887 162499 170358 174963 176269 174749 170330 162839 153016 142186 131259 120740 111253 103269 96643
54874 96643 91099 86834 84111 82686 82117 82163 82524 82823 83256 84422 86108 87150 87091 86938 87572 88484 88980
54857H8980O14J507J886J189O01J037J706J506N85k16n22m39k16k69q80j752k512
54840I2805l367m463n129m841m356m516m578l400j716j264j973k090j085k77m04
54825D9346o33m14l64p35p82k63M4j87l32j62j84k93L22J525K150J875J583J542
54807E4038R47k67r14m58K20M81P87J383J669J472J391J484J146O74J202K615
54791F7870L368K944K683L456M462N072O035P826R532J0448J1233J2426J3239
54778A60594J2858J1591R869P462M492J768o07l420o345p580o473m863m521m884
54764A69941m590l684k857j838j80J497K479L311M810O573P731Q389R132R824
54750B10538R938R341P898N186J518j633l265m076n064n893n547l903j589R03
$$ plain form
54857 88980 89594 91101 92987 94176 94777 95814 97520 99026 99611 99395 98873 98434 98218 97949 97069 95317 92805
54840 92805 89438 84975 79846 75005 70649 66133 61555 58155 56439 55175 53202 51112 50027 49750 49346
54825 49346 48713 48299 47935 47200 46418 46155 46199 46012 45680 45518 45334 45041 45363 46888 49038 50913 52496 54038
54807 54038 54985 54718 53804 53346 53566 54047 54834 56217 57886 59358 60749 62233 63379 64053 65255 67870
54791 67870 71238 74182 76865 80321 84783 89855 95890 103716 113248 123696 134929 147355 160594
54778 160594 173452 185043 194912 202374 206866 208634 208027 204607 198262 190682 184209 179346 174825 169941
54764 169941 165351 161667 158810 156972 156792 158289 160768 164079 168889 175462 183193 191582 200714 210538
54750 210538 220476 229817 237715 242901 244419 242786 239521 235445 230381 224488 218941 215038 213449 214352
54736B14352L098M245M076L196J971j88l685p696j1033j3271j4359j4077j2670
54723A53959j1162j0205r306p908o394n354m749m383m322m282l660k721k540l107
54709G3866k877j174L42q6j732k425j400K21J211J289P44O2k36j26j49n01o35
54692F6394j56N40R95J305J619J757J783K081K513K455J955J820K200K294J922
54677I1477K030L009L903L999L907M247M514M163L609L253K655J558O46M52N23
54662A33945M37N16Q61R48Q26J385K699L545L397L421M447N657O308P222R251
54647A84865J1743J3864J6004J8533K0655K1863K3061K4646K5011K2607J8172
54636D01024J3064O915j022r323j5514j9046k1105k2144k1672j9975j8155j6582
$$ plain form
54736 214352 217450 221695 225771 228967 230938 230750 227065 219369 208336 195065 180706 166629 153959
54723 153959 142797 132592 123286 115378 108984 103630 98881 94498 90176 85894 82234 79513 76973 73866
54709 73866 70989 69815 70157 70071 68339 65914 64514 64735 65946 67235 67979 68041 67805 67679 67530 67029 66394
54692 66394 66238 66778 67773 69078 70697 72454 74237 76318 78831 81286 83241 85061 87261 89555 91477
54677 91477 93507 96516 100419 104418 108325 112572 117086 121249 124858 128111 130766 132324 132970 133422 133945
54662 133945 134382 134898 135759 136707 137533 138918 141617 145162 148559 151980 156427 162084 168392 175614 184865
54647 184865 196608 210472 226476 245009 265664 287527 310588 335234 360245 382852 401024
54636 401024 414088 421003 419981 410658 395144 376098 354993 332849 311177 291202 273047 256465
54624B56465j4800j2760j0822q968p253o375o504o402n081l473k999l427l721
54611A63880l970m690n154m536l830m494n736n471l684k443k667l079k615j813
54597A09698j384j214j187j533j995j935j478j344j484j193n05j45j26K33Q92
54582I5300J126R38J025J370J256P21N32O71L55l68n34l1J31m35q36m83J12M47
54564A01297P29R85P53J24j3O42J256J221J001J101J175Q55O13J047J875K304
54548A16965K099J740J783K342L103L680M035M501N209N846O150O314O594O994
54534A77355P663Q973J0656J1607J1213J0231R526Q656O670L611K61l009o089
54521B57324q408r567j0212j1051j1588j0990r783r216r307q921p657o261n244
$$ plain form
54624 256465 241665 228905 218083 209115 201862 195487 188983 182581 177500 174027 171028 167601 163880
54611 163880 159910 155220 150066 145530 141700 137206 131470 125999 122315 119872 117205 114126 111511 109698
54597 109698 108314 107100 105913 104380 102385 100450 98972 97628 96144 94951 94446 94301 94175 94408 95300
54582 95300 96426 97364 98389 99759 101015 101736 102268 102939 103294 102926 102392 102361 102492 102057 101221 100738 100850 101297
54564 101297 102026 103011 103764 103888 103875 104517 105773 106994 107995 109096 110271 111126 111739 112786 114661 116965
54548 116965 119064 120804 122587 124929 128032 131712 135747 140248 145457 151303 157453 163767 170361 177355
54534 177355 185018 193991 204647 216254 227467 237698 247224 255880 262550 266161 266422 263413 257324
54521 257324 248916 239349 229137 218086 206498 195508 185725 176509 167202 158281 150624 144363 139119
54508A39119m385l520k703j679l17O42M21m11o69l99n90j232j240k99P19J328
54492A24785J966K629K477J339L51N00J397K024J882J089R2m51j14P78J572K165
54476A44481K787L191K923K247J870J849J691J365J292J457J510J494J573J318
54462A71048L47o42o36J50O90P69R21J049N99p0n5M48L75k84m44K7j37j540l112
54443A69503l693l355k751k319k472l388m255l868k349j101p67n89p2J32m31j077
54427A37148j117p95n07j03M59P24O36Q20J464J880J638J268J281J376J173R01
54411A48246Q21P00L90K24M96J117K003L056L676L251K279K033K829L619L535
54396A78275K774J640n2k156l774m288l994l368k522j724j487j742j831j618j641
$$ plain form
54508 139119 134734 131214 128511 126832 126515 127157 127578 127167 126498 126099 125509 124277 123037 122738 123457 124785
54492 124785 126751 129380 131857 133196 133547 134047 135444 137468 139350 140439 140531 140080 139966 140744 142316 144481
54476 144481 147268 150459 153382 155629 157499 159348 161039 162404 163696 165153 166663 168157 169730 171048
54462 171048 171395 170753 170117 170267 170957 171726 172647 173696 174295 174225 174170 174618 174993 174709 174265 174292 174155 172615 169503
54443 169503 165810 162455 159704 157385 154913 151525 147270 143402 141053 139952 139185 138596 138524 138656 138225 137148
54427 137148 136031 135236 134729 134626 135085 135809 136445 137265 138729 140609 142247 143515 144796 146172 147345 148246
54411 148246 149067 149767 150157 150381 150877 151994 153997 157053 160729 163980 166259 168292 171121 174740 178275
54396 178275 181049 182689 182637 180481 176707 172419 168425 165057 162535 160811 159324 157582 155751 154133 152492
54381A52492j924j780j171j059j773k225j538m15pk84m34k08K2J15K57N12P40
54364A41320Q31P14M21K84N66R67J009Q47J062J660K073K136K200K324K263K217
54348A62894K574K929K485J426P08L92m48j896k746k371j680j658k112k491k847
54333A55159l260l400l243l300l570l281k256j481j675k258k382k114j925j894
54319A19120j994k343k646k277j376j009j665k548k827k658k439k063j486j126
54305I0663j128j069q33q79j223j277j000j095j601j583p84k21n11r10q17p90
54289G4942j198j216l58L16k25j271j564j206j041r89m38L02L16m24j056j077
54273F3813p64n31n87r14j131q02k03l3j29M92J851K515J686N14L23P21N99K3
$$ plain form
54381 152492 150568 148788 147617 146558 144785 142560 141022 140607 140600 140316 139882 139674 139696 139811 140068 140580 141320
54364 141320 142151 142865 143286 143570 144136 145103 146112 146959 148021 149681 151754 153890 156090 158414 160677 162894
54348 162894 165468 168397 170882 172308 173016 173408 172960 171064 168318 165947 164267 162609 160497 158006 155159
54333 155159 151899 148499 145256 141956 138386 135105 132849 131368 129693 127435 125053 122939 121014 119120
54319 119120 117126 114783 112137 109860 108484 107475 105810 103262 100435 97777 95338 93275 91789 90663
54305 90663 89535 88466 87633 86754 85531 84254 83254 82159 80558 78975 78191 77970 77459 76549 75732 74942
54289 74942 73744 72528 72170 72486 72261 70990 69426 68220 67179 66190 65752 66054 66370 65946 64890 63813
54273 63813 63049 62518 61931 61017 59886 59084 58881 58848 58719 59211 61062 63577 65263 65777 66100 66821 67420 67443
54255F7443k26j80l56n13k2Q95J453J503J490J531J387R80L32n36j114o03P78
54238G4242J615J180M50M31N70j9q20q51m07m56r14j001p49p67r41p72n49r26
54220F9316j601j723j313j018q48l60J67M6n61r31j063j504k111k224j911j796
54204E0565j782j179o3P12Q48P91N86k25j366j711p70M91P83k15j783k824k565
54187D0293j185J97O27L03N3J97M76P46R73Q24Q5p37r69p04m63l13nK93K31K7
54167D0949J40M40M33P7l25o72q29k66J142K433K553J723R41M98Ln27p18o73p32
54148D6590o36J2O95M85m92j184j068m83L08J268J902J626Q40N84J011J232P77
54131E3467K00J36N31J008J156M92r64k171k027q71j10l09o85n18l5L57P13J109
$$ plain form
54255 67443 67217 67037 66681 66168 66146 67041 68494 69997 71487 73018 74405 75385 75717 75181 74067 73464 74242
54238 74242 75857 77037 77487 77918 78488 78469 77649 76798 76391 75935 75021 74020 73271 72504 71563 70791 70242 69316
54220 69316 67715 65992 64679 63661 62813 62453 62620 62666 62105 61174 60111 58607 56496 54272 52361 50565
54204 50565 48783 47604 47541 48253 49101 49892 50478 50253 48887 47176 46406 46897 47680 47465 45682 42858 40293
54187 40293 39108 39305 39932 40235 40288 40485 40961 41707 42680 43504 43589 42852 41883 41179 40716 40403 40398 40691 40922 40949
54167 40949 41089 41529 41962 42039 41714 41042 40213 39947 41089 43522 46075 47798 48739 49237 49240 48713 47995 47322 46590
54148 46590 45954 45966 46661 47146 46654 45470 44402 43919 44227 45495 47397 49023 49863 50447 51458 52690 53467
54131 53467 53667 53803 54334 55342 56498 56990 56026 53855 51828 50957 50847 50538 49853 49335 49300 49657 50370 51479
54113E1479J336J344J367J418J309J147J127Q97l7j223j533p22J69K00m27r96
54097E6855j184j060p24k69K50Q94J526J628R11n5m89m29l66k31L00P64K91r09
54079E7703j606j256o16l97l84k39j83m04n50m28m28p43p57J38J545K407K151
54062E5953J195N21Q52K003K904K588J221r8n02q0N16P66N81K90K57M25M52M66
54044G0310J035K041K329J247j39l60M43R38O84M94Q19J147J125J132J392J603
54028H6240J780K469L663M469M296L709L501L640L616L358L254L599M362N214
54014A37170N589N036L700K198J029L78L68R60J619J620Q52j15p54j065j347j908
53998A55330k855l810m065l406k516k106j969j537r84r22j295j432j160r84j201
$$ plain form
54113 51479 52815 54159 55526 56944 58253 59400 60527 61424 61387 60164 58631 57909 58078 58278 57851 56855
54097 56855 55671 54611 53887 53618 53868 54762 56288 57916 58827 58772 58283 57854 57488 57257 57557 58321 58612 57703
54079 57703 56097 54841 54225 53828 53444 53205 53022 52618 52068 51640 51212 50469 49712 49850 51395 53802 55953
54062 55953 57148 57669 58521 60524 63428 66016 67237 67139 66637 66557 67073 67839 68420 68710 68967 69392 69844 70310
54044 70310 71345 73386 75715 76962 76823 76463 76906 77844 78528 79022 79841 80988 82113 83245 84637 86240
54028 86240 88020 90489 94152 98621 102917 106626 110127 113767 117383 120741 123995 127594 131956 137170
54014 137170 142759 147795 151495 153693 154722 155100 155468 156428 158047 159667 160519 160404 159650 158585 157238 155330
53998 155330 152475 148665 144600 141194 138678 136572 134603 133066 132082 131160 129865 128433 127273 126289 125088
53983A25088j569j873k160k294k028j510j141j000r04r75j445k081k391k276j932
53968I9509j379o64j96k29l39r3K39K97L99P73P18k69j154n59J078K015J660R95
53950A02801P21N55M10P21J342J582J575K184L257L543K750K188K712L432L282
53935A33055K669K611L178L648L540K819J735Q95R40J752K591L125L570L753L105
53920A72986J766O72K18j56p72j194j146q34j02J520L484M325L644K846L167M152
53904A94576M735M725M488M208M228N044O253O511N385M145L907M003L246J783
53890B57237N42l37j278k100k278j963j736j691j656j892k692l586l851l493l104
53875B26122k922k819k861l265l910m461m792m900m669m120l595l350l234l077
$$ plain form
53983 125088 123519 121646 119486 117192 115164 113654 112513 111513 110609 109634 108189 106108 103717 101441 99509
53968 99509 98130 97466 97270 97041 96702 96609 96848 97145 97544 98317 99035 98766 97612 97053 98131 100146 101806 102801
53950 102801 103522 104077 104487 105208 106550 108132 109707 111891 115148 118691 121441 123629 126341 129773 133055
53935 133055 135724 138335 141513 145161 148701 151520 153255 154150 155090 156842 159433 162558 166128 169881 172986
53920 172986 174752 175424 175642 175486 174714 173520 172374 171540 171438 172958 176442 180767 184411 187257 190424 194576
53904 194576 199311 204036 208524 212732 216960 222004 228257 234768 240153 244298 248205 252208 255454 257237
53890 257237 257779 257442 256164 254064 251786 249823 248087 246396 244740 242848 240156 236570 232719 229226 226122
53875 226122 223200 220381 217520 214255 210345 205884 201092 196192 191523 187403 183808 180458 177224 174147
53861A74147l006l172l527m052m701n011m448l270k355k025j834j638j919k694
53847A30495l123k742k127j872j770j495j236j023m62L50N86M1k98J93O94L23
53831A16534l77m28p4k03p58r66o89n17o91r54j181j368j180m03L62K36p68j674
53813A04901j618o12O01J153P71R6m1K97L62M1Q3Q07J578J920K219K746L098L146
53795A21548L559M593N413N408N159N216M968L864K787K875L707L946L303K559
53781A78905K060J450O83K15K40O11J245J913K004J273L46j57n59j344k123k272
53765A84490k067k154k404k269j866j661j543j165q36j028j413j359j021r53j035
53750A61716q49o99j144j783j714j003o13r67j599k102k508k781k851k959l262
$$ plain form
53861 174147 171141 167969 164442 160390 155689 150678 146230 142960 140605 138580 136746 135108 133189 130495
53847 130495 127372 124630 122503 120631 118861 117366 116130 115107 114645 114995 115581 115622 115324 115517 116211 116534
53831 116534 116157 115729 115655 115452 114694 113728 113039 112522 111831 110877 109696 108328 107148 106745 107107 107343 106575 104901
53813 104901 103283 102671 103272 104425 105196 105292 105251 105548 105910 105951 106034 106841 108419 110339 112558 115304 118402 121548
53795 121548 125107 129700 135113 140521 145680 150896 155864 159728 162515 165390 169097 173043 176346 178905
53781 178905 180965 182415 183098 183313 183553 184164 185409 187322 189326 190599 190945 190788 190229 188885 186762 184490
53765 184490 182423 180269 177865 175596 173730 172069 170526 169361 168525 167497 166084 164725 163704 162751 161716
53750 161716 160867 160168 159024 157241 155527 154524 153911 152944 151345 149243 146735 143954 141103 138144 134882
53735A34882l237k328q98K26P32O69p9j264j850j319p52j322k294k067p49L4k79
53718A18105n84k31L4l16o37m33k63o45j139j221j106j048o35M23J500J751J139
53701A14694K74l43n34k14N79J617K589L161L053K431J972K071K246J867J183
53686A36646Q52P94M20q2K12J511K853L334L010K385J701J093P60O74O64Q20J303
53669A58950J744J503O75J67M85J083J213Q73O40Q10J038P00l40j352j353l29
53653A66507O27O87K33j7j14l62l71L45J236J333O71R3j77n84j113j295j274j662
53635A64763k226j967p45K98L77L7Q2M19M97J82l10p93j081r45l40O12J801K835
53617A63496K933J828N07J76O94R85Q25R76J651K178K372K905L892M359L739K806
$$ plain form
53735 134882 131645 129317 128419 128645 129377 130046 129967 128703 126853 125534 124782 123460 121166 119099 118350 118384 118105
53718 118105 117521 117290 117324 117008 116371 115938 115675 115030 113891 112670 111564 110516 109881 110304 111804 113555 114694
53701 114694 114968 114625 114091 113877 114456 116073 118662 121823 124876 127307 129279 131350 133596 135463 136646
53686 136646 137498 138292 138712 138630 138842 140353 143206 146540 149550 151935 153636 154729 155489 156163 156827 157647 158950
53669 158950 160694 162197 162872 163039 163524 164607 165820 166693 167333 168143 169181 169881 169541 168189 166836 166507
53653 166507 167134 167821 168054 168037 167923 167561 167190 167535 168771 170104 170775 170868 170691 170107 168994 167699 166425 164763
53635 164763 162537 160570 159825 160123 160500 160537 160619 161038 161535 161717 161407 160614 159533 158588 158248 158860 160661 163496
53617 163496 166429 168257 168764 168940 169634 170619 171444 172420 174071 176249 178621 181526 185418 189777 193516 196322
53601A96322K475K600K657K772L261L796L775L144K337J761J628J912K229K216
53587B32885K185K669L322L119J920R05R58J543J720J487J341J222P45N0l24k59
53571B55488r3%J45L96O11O53M86J30l20p80j256j675j767j403r34p70p52m81
53553B47678j38k82q79j229r97o02m03j92K00M41K32j36j25M32J201J702J709
53536B48612J555J837K627L240L209L029L310L686L436K851K944L918M971N586
53522B94811O025O528P049P760Q835R699R587Q949R106J0361J1607J2097J2404
53509D14818J3161J4042J4593J5029J5622J6172J6650J7565J9110K0774K2187
53498E99723K3568K4881K5556K5534K5616K6174K6482K5902K4941K4360K4094
$$ plain form
53601 196322 198797 201397 204054 206826 210087 213883 217658 220802 223139 224900 226528 228440 230669 232885
53587 232885 235070 237739 241061 244180 246100 247005 247963 249506 251226 252713 254054 255276 256021 256071 255747 255488
53571 255488 255395 255395 255540 255936 256547 257200 257686 257816 257496 256716 255460 253785 252018 250615 249681 248911 248159 247678
53553 247678 247540 247258 246379 245150 244153 243551 243148 242956 243156 243597 243829 243693 243568 244000 245201 246903 248612
53536 248612 250167 252004 254631 257871 261080 264109 267419 271105 274541 277392 280336 284254 289225 294811
53522 294811 300836 307364 314413 322173 331008 340707 350294 359243 368349 378710 390317 402414 414818
53509 414818 427979 442021 456614 471643 487265 503437 520087 537652 556762 577536 599723
53498 599723 623291 648172 673728 699262 724878 751052 777534 803436 828377 852737 876831
53487H76831K3806K3694K4030K4539K4998K5810K7242K8733K9655L0205L0786
53476A170329L1097L0499K8924K6789K4493K2385K0733J9255J7341J5125J3553
53465A420523J2881J2035J0277Q577Q329R355J0219J0083R174P753N672K946p6
53452A527748l094n896q086r423j0392j1901j4450j7743k1001k3393k4540k4889
53440A352940k5352k6330k7387k8089k8610k9251k9816k9840k9103k7745k6213
53429A045204k5128k4770k4633k4099k3418k3159k2812k1128j8101j5273j3557
53418H09126j2010r459o256l483j338O87K802N044P709J0821J3735J6009J7987
53405H51374J9926K1354K2176K3462K6059K9135L1201L2016L2456L3091L4036
$$ plain form
53487 876831 900637 924331 948361 972900 997898 1023708 1050950 1079683 1109338 1139543 1170329
53476 1170329 1201426 1231925 1260849 1287638 1312131 1334516 1355249 1374504 1391845 1406970 1420523
53465 1420523 1433404 1445439 1455716 1464293 1472622 1481977 1492196 1502279 1511453 1519206 1524878 1527824 1527748
53452 1527748 1524654 1518758 1510672 1501249 1490857 1478956 1464506 1446763 1425762 1402369 1377829 1352940
53440 1352940 1327588 1301258 1273871 1245782 1217172 1187921 1158105 1128265 1099162 1071417 1045204
53429 1045204 1020076 995306 970673 946574 923156 899997 877185 856057 837956 822683 809126
53418 809126 797116 787657 781401 777918 776580 777267 780069 785113 792822 803643 817378 833387 851374
53405 851374 871300 892654 914830 938292 964351 993486 1024687 1056703 1089159 1122250 1156286
53394A156286L5603L7983M0545M2518M4136M6159M8664N1226N3845N6689N9292
53383A672946O1051O2247O3569O4930O5780O6256O6899O7487O7269O6250O5228
53372B389912O4591O3966O2945O1219N8221N3682M8451M3739L9601L5184L0456
53361B951967K6497K3868K1794J9334J6520J3853J1305Q317M473k23n522j1395
53349C080788j8483k7662l8779n0126n9749o7065p2593p6563p8693p9193p8980
53338B432902p8738p8420p7755p6706p5367p3905p2611p1558p0378o8847o7405
53327A621212o6553o5943o4739o2733o0374n7866n4894n1242m7117m2895l8959
53316A007897l5596l2599k9261k5262k1209j7751j4685j1576q766o736m957k439
$$ plain form
53394 1156286 1191889 1229872 1270417 1312935 1357071 1403230 1451894 1503120 1556965 1613654 1672946
53383 1672946 1733997 1796244 1859813 1924743 1990523 2056779 2123678 2191165 2258434 2324684 2389912
53372 2389912 2454503 2518469 2581414 2642633 2700854 2754536 2802987 2846726 2886327 2921511 2951967
53361 2951967 2978464 3002332 3024126 3043460 3059980 3073833 3085138 3093455 3097928 3097705 3092183 3080788
53349 3080788 3062305 3034643 2995864 2945738 2885989 2818924 2746331 2669768 2591075 2511882 2432902
53338 2432902 2354164 2275744 2197989 2121283 2045916 1972011 1899400 1827842 1757464 1688617 1621212
53327 1621212 1554659 1488716 1423977 1361244 1300870 1243004 1188110 1136868 1089751 1046856 1007897
53316 1007897 972301 939702 910441 885179 863970 846219 831534 819958 811192 804456 799499 797060
53304G97060O51L067M162M584N187O131P135P944Q412Q754R676J1572J3713J4965
53290I03013J5326J5952J7690K0227K2802K4987K6702K8040K9274L0591L1823
53279A166427L2728L3272L3345L2668L1537L0965L1320L1448L0164K8039K6492
53268A508405K5552K3948K1235J8411J6340J4942J4080J3920J4039J3393J1594
53257A695859R264O783L744K5l672o866j0063j3947j8531k3435k8288l2607l5989
53244A542277l8711m1428m4106m6108m7396m8574m9475m8911m6404m3124m0453
53233A047587l8442l6472l4611l3476l3171l3156l2923l2404l1974l2233l3394
53222F75331l4651l4770l3484l1658k9934k7975k5398k2541j9925j7676j5934
$$ plain form
53304 797060 797711 800778 804940 809524 814711 820842 827977 835921 844333 853087 862763 874335 888048 903013
53290 903013 918339 934291 951981 972208 995010 1019997 1046699 1074739 1104013 1134604 1166427
53279 1166427 1199155 1232427 1265772 1298440 1329977 1360942 1392262 1423710 1453874 1481913 1508405
53268 1508405 1533957 1557905 1579140 1597551 1613891 1628833 1642913 1656833 1670872 1684265 1695859
53257 1695859 1705123 1711906 1715650 1715675 1712003 1705137 1695074 1681127 1662596 1639161 1610873 1578266 1542277
53244 1542277 1503566 1462138 1418032 1371924 1324528 1275954 1226479 1177568 1131164 1088040 1047587
53233 1047587 1009145 972673 938062 904586 871415 838259 805336 772932 740958 708725 675331
53222 675331 640680 605910 572426 540768 510834 482859 457461 434920 414995 397319 381385
53211C81385j5003j4550j3480j1326r091p925p576o971n835m861m526m569m614
53198B71058m608m609m599m606m700m848m950m931m746m422m110l891l665l473
53184B08900l717m524n129m649l410k653k819l036k609k056k164k839l512l996
53170A61787m304m179l467k572j976j600j136o15k75j20k2K1Pm7l57j120j894
53153A38131j854r96l25m54p70n92l43p51j498j629j031n44o49q82o71j31Q5m58
53135A24638j524k359k370j692r29l51K03O81P31M47M72R85J290R40N54Q25J328
53118A23869J187M70J4R7K04M9NL60P63O33k04j387k225k115j118QN64O11N58
53099A22343M02j55r81j496j395r41n43l79m15l86J61J380K632K969K219J236
$$ plain form
53211 381385 366382 351832 338352 327026 317935 310010 302434 295463 289628 284767 280241 275672 271058
53198 271058 266450 261841 257242 252636 247936 243088 238138 233207 228461 224039 219929 216038 212373 208900
53184 208900 205183 200659 195530 190881 187471 184818 181999 178963 176354 174298 172134 169295 165783 161787
53170 161787 157483 153304 149837 147265 145289 143689 142553 141938 141663 141543 141521 141542 141549 141502 141145 140025 138131
53153 138131 136277 135281 134956 134502 133732 133140 132797 132046 130548 128919 127888 127344 126695 125813 125142 125011 125096 124638
53135 124638 123114 120755 118385 116693 115764 115413 115616 116297 117028 117475 117947 118932 120222 121162 121716 122541 123869
53118 123869 125056 125526 125540 125637 125841 125890 125895 126255 127018 127651 127447 126060 123835 121720 120602 120610 121174 121785 122343
53099 122343 122745 122590 121609 120113 118718 117777 117234 116855 116440 116054 116215 117595 120227 123196 125415 126651
53083A26651R64J499K283K823K978K743K142J442J141J499K070J969P52j062k473
53068A47421k940k678k243k042k202k576k823k722k403k137j969j814j762j946
53054A15164k194k199k003j924k018k061j999j964j799j191l28N3m68j499k333
53039I1237k592k241j483p63m84o22q54j127j601k102k168j748j269r25n47k21
53023G0490l44q39j006n01J54L42N7m21r21j190r19k76R9o9m34p58j131j326q81
53004F0126j48k33j297j940j081M38J118Q32N36N98N80L30J61R4j26l52k00K30
52986E9666N44P68J115J278Q07O6j03L26N14M8n62q17q50q91p56k98K22N01N80
52967F2158N97N16L10J49J76K70J50l10q87j076n69K57O18K59j78LO83J266J492
$$ plain form
53083 126651 127615 129114 131397 134220 137198 139941 142083 143525 144666 146165 148235 150204 150956 149894 147421
53068 147421 144481 141803 139560 137518 135316 132740 129917 127195 124792 122655 120686 118872 117110 115164
53054 115164 112970 110771 108768 106844 104826 102765 100766 98802 97003 95812 95484 95537 95069 93570 91237
53039 91237 88645 86404 84921 84158 83674 83052 82198 81071 79470 77368 75200 73452 72183 71258 70711 70490
53023 70490 70146 69307 68301 67800 67954 68296 68353 67932 67011 65821 64902 64626 64725 64656 64222 63464 62333 61007 60126
53004 60126 59978 59745 58448 56508 55427 55865 56983 57815 58351 58949 59529 59859 60020 60114 59988 59636 59436 59666
52986 59666 60210 60978 62093 63371 64178 64244 64141 64467 64981 65029 64467 63650 62800 61909 61153 60855 61077 61578 62158
52967 62158 62755 63271 63581 63730 63906 64176 64326 64016 63129 62053 61484 61741 62359 62618 62440 62443 63126 64392 65884
52948F5884J437J093N09J12K35N29M56K48P12K020L381L994L847L402L052L038
52932I3949L460M044M202L625K679J976J669J339N56n62j515k047k402k766k790
52917A05417k176j446j494k305k907k754k378k410k730l044l422l667l016j382
52903G0286q2k87j293j558j017j021k075l104l123k434j723j074m01N1K07M32
52887E1784P48N17m63j190o55O36J171L32r33j396q41Q1P14P89K97n53j271j340
52869D8427p24N5M78N45N45N00J70m09p96o45n5N96R01N22m55j219q77L78J354
52850D9291J412J220J496J783J263K94K4O59J156P98J86K88J122J856J848J218
52834F5914N54L65P71J564K431L035L003K130P95k18m82l24k13j26J35L83L02
$$ plain form
52948 65884 67321 68414 68923 69035 69270 69799 70255 70503 71215 73235 76616 80610 84457 87859 90911 93949
52932 93949 97409 101453 105655 109280 111959 113935 115604 116943 117499 116937 115422 113375 110973 108207 105417
52917 105417 103241 101795 100301 97996 95089 92335 89957 87547 84817 81773 78351 74684 71668 70286
52903 70286 70204 69917 68624 67066 66049 65028 62953 59849 56726 54292 52569 51495 51094 51145 51352 51784
52887 51784 52532 53049 52586 51396 50741 51377 52548 52880 51947 50551 49710 49791 50505 51294 51591 51038 49767 48427
52869 48427 47703 47758 48236 48781 49326 49826 49996 49587 48791 48146 48091 48687 49588 50110 49655 48436 47559 47937 49291
52850 49291 50703 51923 53419 55202 56465 56759 56783 57442 58598 59396 59582 59870 60992 62848 64696 65914
52834 65914 66468 66833 67604 69168 71599 74634 77637 79767 80562 80344 79862 79538 79325 79199 79334 79717 80019
52817H0019L3O0N63J290J940K330K332K080K031K411K789K583J847J169Q96Q30
52801A05203N48k56j565k878l487l265k896k979l270l152k497j620q07l97q20
52786G5862j919k686k389j599j280j324r29j01L56K29J60M25N41L44L80Q40J041
52769F7951M90k92o53q18j322j879j655n47M49L69n85j309j056k02L72L78K12
52752E9903K4n63j600k343k235j731j478j241m61N56R97Q35P13P42M35j30k22
52735E2201K95O74N08L05M68O45M39P0j83m92r97j388j354r60l11M79Q63K45r28
52716E0579j267k31R97J107L62o8J42L85M14O61J265J631J264M46j18q2L57P99
52698E8643R75Q58N48J50k37m84n49n51o13p09q25j117j553j623q81L10J032R26
$$ plain form
52817 80019 80052 80112 80675 81965 83905 86235 88567 90647 92678 95089 97878 100461 102308 103477 104373 105203
52801 105203 105751 105495 103930 101052 97565 94300 91404 88425 85155 82003 79506 77886 77079 76682 75862
52786 75862 73943 71257 68868 67269 65989 64665 63736 63635 63991 64220 64380 64805 65346 65690 66070 66910 67951
52769 67951 68441 68149 67496 66678 65356 63477 61822 61275 61724 62093 61508 60199 59143 58941 59313 59691 59903
52752 59903 59927 59364 57764 55421 53186 51455 49977 48736 48275 48831 49828 50663 51376 52118 52553 52423 52201
52735 52201 52496 53170 53678 53983 54451 55096 55535 55605 55422 54930 53933 52545 51191 50231 49920 50399 51262 51507 50579
52716 50579 49312 49081 50078 51185 51547 51479 51621 52006 52420 53081 54346 55977 57241 57687 57569 57487 57844 58643
52698 58643 59618 60476 61024 61174 60937 60453 59904 59353 58740 58031 57206 56089 54536 52913 52032 52342 53374 54300
52680E4300N32M23N22M72K69J92M19Q90J381J628J600J645K096K767L180L186
52664G5502L020K795K441K109K049K075J694R13L41K92L04j59r58j550j641j359
52648H7868r89p64p32p38o90p73j167j733k212k579k809k638k050j660j903k161
52632F2270j534l18K70j97q48q47k79M47J164J649J640J399J420J384M26j324
52616F6722k517k408j833j813k157k162j818j416q25J8N06J81l57k48L71P02M96
52599E1442J36j65m85p20p10o08n66l58J71O08N72M35P62J341J458R73L82l5m62
52580E4171j013j470j597j268m42O28J345J313Q16M23L66O14J158J807K026J519
52564F0396O86J39J4J31M15O86M98k38q97r20n99m36k48L31R29Q79M05L43Q27
$$ plain form
52680 54300 54832 55255 55777 56249 56518 56710 57129 58019 59400 61028 62628 64273 66369 69136 72316 75502
52664 75502 78522 81317 83758 85867 87916 89991 91685 92598 92939 93231 93535 93376 92418 90868 89227 87868
52648 87868 86879 86115 85383 84645 83955 83182 82015 80282 78070 75491 72682 70044 67994 66334 64431 62270
52632 62270 60736 60418 60688 60491 59643 58796 58517 58964 60128 61777 63417 64816 66236 67620 68046 66722
52616 66722 64205 61797 59964 58151 55994 53832 52014 50598 49773 49791 50297 50478 50121 49873 50244 50946 51442
52599 51442 51578 51413 50928 50208 49498 48890 48324 47966 48137 48745 49317 49752 50514 51855 53313 54286 54668 54633 54171
52580 54171 53158 51688 50091 48823 48381 49009 50354 51667 52483 52906 53272 53886 55044 56851 58877 60396
52564 60396 61082 61221 61235 61366 61781 62467 62965 62727 61830 60910 60311 59875 59627 59958 60887 61766 62171 62514 63341
52545F3341J111P61J80j92m34o92p68m63R8P09J232J496J371J005O71L94P8j32
52527F9766oL43O84J064J519J589Q92L5J10J100J654Q26o13j159l66Q18J302Q87
52509H0445J60k66k80k19m33r04j291j299r44n59n37r02j116n70N52J242P96l30
52491G3545j107j161r19p74o31k88K17P30J110J165P66Q3n34r61j323j609j637
52474F6672j353r12l80K91R43J163Q12L33L11P78J166R94M50J70M33P79N64j86
52456G3028p09l54O81J515J354J52j263j748q72N43J173N72m95j071r73o16l41
52439G0576j76m5J40L84N21M09K55M19Q30J042Q95O80N00O8o89j333j495j268
52421G1713p68O0R41J201O75N7j36l34j042j783j655n80O41J384J575J406J079
$$ plain form
52545 63341 64452 65213 65393 65201 64767 64075 63307 62844 62942 63651 64883 66379 67750 68755 69426 69820 69898 69766
52527 69766 69760 70103 70787 71851 73370 74959 75851 75886 75996 77096 78750 79576 78963 77804 77438 78256 79558 80445
52509 80445 80605 80339 80059 79840 79407 78503 77212 75913 74969 74410 73873 72971 71855 71285 71837 73079 73875 73545
52491 73545 72438 71277 70358 69584 68953 68665 68882 69612 70722 71887 72653 72736 72202 71241 69918 68309 66672
52474 66672 65319 64407 64027 64318 65261 66424 67236 67569 67880 68658 69824 70818 71268 71438 71871 72650 73214 73028
52456 73028 72319 71965 72646 74161 75515 75667 74404 72656 71784 72327 73500 74072 73577 72506 71533 70917 70576
52439 70576 70400 70355 70495 70879 71400 71809 72064 72483 73313 74355 75250 75930 76430 76498 75809 74476 72981 71713
52421 71713 70945 71005 71946 73147 73822 73879 73743 73409 72367 70584 68929 68349 68990 70374 71949 73355 74434
52404G4434P56L16n18j462j620o86L61M64j03k94J54O05O92O62O90O41N17M68
52386G6077L96J77P1K62K67l50r24l81J012J700R11k64l70O72J815K311K203J728
52368H7313R64P1n43n54q5M38P83J062J251Q86k72j445j470l50O32O63M32Q16
52350I0592J438J361O59K47N19J010J215J030N26J5l1L08J57q89j882j725p96
52333I3754k62k84j62J25j09p65q95k65K54J31j63j83j09m8K22N21K91l84q07
52314I0862q74j171j571j157Q0P91K67l73J32J407K288K502K436K139J584J338
52298A00680J766K187J754Q43M78Q02J118J198J467J961K117J736J290J120J067
52283A21584J049J332J913K211J761Q40J48R4N99J339J924J982J372M62o2J28
$$ plain form
52404 74434 75190 75506 74988 73526 71906 71220 71581 72045 71942 71648 71802 72407 73099 73761 74451 75092 75609 76077
52386 76077 76473 76650 76721 76983 77250 76900 75976 75595 76607 78307 79218 78954 78584 79256 81071 83382 85585 87313
52368 87313 88277 88348 87805 87251 87166 87604 88387 89449 90700 91586 91314 89869 88399 88049 88681 89344 89776 90592
52350 90592 92030 93391 94050 94297 94816 95826 97041 98071 98597 98612 98581 98889 99046 98157 96275 94550 93754
52333 93754 93492 93208 93046 93171 93062 92297 91402 91137 91391 91522 91359 91176 91067 91019 91241 91762 92053 91669 90862
52314 90862 89988 88817 87246 86089 86169 86960 87227 86854 86986 88393 90681 93183 95619 97758 99342 100680
52298 100680 102446 104633 106387 107230 107708 108510 109628 110826 112293 114254 116371 118107 119397 120517 121584
52283 121584 122633 123965 125878 128089 129850 130690 130838 130932 131531 132870 134794 136776 138148 138610 138548 138676
52267A38676N05K58n90r98k27J041J449P12j27j03O24J309J552J365Q67L51K57
52250A46921P22J360J755J902K010K145K256K266K029J454Q00N47Q48J397J811
52235A70223J869J507R64Q08J241J611J273P18R45J781K018J391J104J889K776
52220A92118K632J868J550J610J220M38J77O91J221J189Q42O00N41P19J283K019
52204B10718K311J899J292J178J648K204K386K248K221K536K879K779K302K001
52190B40602K103K194J858J286R21Q92J038J211J241R58N62N97J209J784J724
52175B60180J300J180J433J506J070L87m2P9P24J413J439N33p78j773k236k277
52159B64138j822q19K23O11L07p5j51j12j44j25o8l63j153j843j764j117p35q88
$$ plain form
52267 138676 139181 139439 138849 137851 137624 138665 140114 140826 140699 140596 141220 142529 144081 145446 146313 146664 146921
52250 146921 147643 149003 150758 152660 154670 156815 159071 161337 163366 164820 165620 166167 167015 168412 170223
52235 170223 172092 173599 174563 175371 176612 178223 179496 180214 181159 182940 184958 186349 187453 189342 192118
52220 192118 194750 196618 198168 199778 200998 201436 201613 202304 203525 204714 205556 206156 206697 207416 208699 210718
52204 210718 213029 214928 216220 217398 219046 221250 223636 225884 228105 230641 233520 236299 238601 240602
52190 240602 242705 244899 246757 248043 248964 249856 250894 252105 253346 254304 254866 255463 256672 258456 260180
52175 260180 261480 262660 264093 265599 266669 267056 267014 267093 267817 269230 270669 271202 270424 268651 266415 264138
52159 264138 262316 261497 261720 262331 262638 262563 262412 262300 262156 262031 261963 261600 260447 258604 256840 255723 254988 254100
52141B54100r07k65M29J36j097k111k185j871j912k012j447m26R7j96o59p92q39
52124B38043j101j400j463j282q75k58J41k74j372k219k183j572r80o09n40r24
52108B21132j501j565q97j52Ol26p65j148j227o61K14M26j71l23Q22K250K429
52091B18543J492Q07Q46Q95O92Q49J473J669J038N24J059K112K390J651R57J270
52075B38267K321L009K679J785J294J562J955J694Q16N8m8L41P83J068J255J372
$$ plain form
52141 254100 253193 252928 253357 253493 252396 250285 248100 246229 244317 242305 240858 240432 240529 240333 239674 238882 238043
52124 238043 236942 235542 234079 232797 231922 231664 231805 231531 230159 227940 225757 224185 223205 222596 222056 221132
52108 221132 219631 218066 217169 217017 217023 216697 215932 214784 213557 212896 213110 213536 213365 213042 213864 216114 218543
52091 218543 220035 220842 221688 222583 223275 224124 225597 227266 228304 228828 229887 231999 234389 236040 236997 238267
52075 238267 240588 243597 246276 248061 249355 250917 252872 254566 255382 255440 255392 255733 256516 257584 258839 260211
$$ [...]
##END NTUPLES=NMR SPECTRUM
##END=
