
##TITLE=AC1333_TANAH10083_6524706_ucDJNJxZ3x
##JCAMPDX= 6.0         $$ Bruker NMR JCAMP-DX V2.0
##DATA TYPE= NMR SPECTRUM
##DATA CLASS= NTUPLES
##ORIGIN= BRUKER
##OWNER= Administrator
$$ 1.72 TOPSPIN		Version 2.1
$$ 2012-07-14 22:14:24.484 -0500  Administrator@TOPSPIN
$$ Compression mode = diff/dup
##.OBSERVE FREQUENCY= 400.02188249412
##.OBSERVE NUCLEUS= ^1H
##.ACQUISITION MODE= SIMULTANEOUS (DQD)
##.ACQUISITION SCHEME= undefined
##.AVERAGES= 8
##.DIGITISER RES= 22
##SPECTROMETER/DATA SYSTEM= spect
##.PULSE SEQUENCE= zg30
##.SOLVENT NAME= COFFEE_meoh
##.SHIFT REFERENCE= INTERNAL, COFFEE_meoh, 1, 14.98509
##AUDIT TRAIL= $$ (NUMBER, WHEN, WHO, WHERE, PROCESS, VERSION, WHAT)
$$ ##TITLE= Audit trail, TOPSPIN		Version 2.1
$$ ##JCAMPDX= 5.01
$$ ##ORIGIN= Bruker BioSpin GmbH
$$ ##OWNER= Administrator
$$ $$ C:\Bruker\TOPSPIN/data/COFFEE/nmr/AC1333_TANAH10083_6524706_ucDJNJxZ3x/10/pdata/1/auditp.txt
$$ ##AUDIT TRAIL=  $$ (NUMBER, WHEN, WHO, WHERE, PROCESS, VERSION, WHAT)
(   1,<2012-07-14 22:14:17.781 -0500>,<Administrator>,<TOPSPIN>,<go>,<TOPSPIN 2.1>,
      <created by zg
	started at 2012-07-14 22:13:10.890 -0500,
	POWCHK enabled, PULCHK disabled,
       configuration hash MD5:
       6B 1B 68 BB D9 2E 58 E2 7F 35 AD 54 07 DF 0E 41
       data hash MD5: 64K
       20 A7 D3 D2 E6 C1 B2 DC B9 92 CD 9E DC DD A1 42>)
(   2,<2012-07-14 22:14:20.406 -0500>,<Administrator>,<TOPSPIN>,<proc1d>,<TOPSPIN 2.1>,
      <Start of raw data processing
       efp LB = 0 FT_mod = 6 PKNL = 1 PHC0 = 0 PHC1 = 0 SI = 32K 
       data hash MD5: 32K
       92 F0 A2 0E E8 E1 5E 59 F4 CA 6F 7A 37 DF CC C6>)
(   3,<2012-07-14 22:14:20.781 -0500>,<Administrator>,<TOPSPIN>,<proc1d>,<TOPSPIN 2.1>,
      <pk PHC0 = 175.1276 PHC1 = 0 
       data hash MD5: 32K
       6A BF C3 BC 75 C1 8E A2 7A 6B AA C7 9E BF AF DF>)
(   4,<2012-07-14 22:14:20.875 -0500>,<Administrator>,<TOPSPIN>,<proc1d>,<TOPSPIN 2.1>,
      <abs ABSG = 1 
       data hash MD5: 32K
       3F 62 05 A2 60 B3 9D E6 A4 35 97 BE 8D 4B 22 E6>)
(   5,<2012-07-14 22:14:20.937 -0500>,<Administrator>,<TOPSPIN>,<proc1d>,<TOPSPIN 2.1>,
      <abs ABSG = 2 
       data hash MD5: 32K
       14 5D 43 5B 99 0E 92 D8 C1 3A 8D 9B 12 5D F6 94>)
(   6,<2012-07-14 22:14:20.968 -0500>,<Administrator>,<TOPSPIN>,<proc1d>,<TOPSPIN 2.1>,
      <abs ABSG = 3 
       data hash MD5: 32K
       E6 8A 59 8D D8 50 17 33 1F 92 86 2A 38 A1 E8 0C>)
(   7,<2012-07-14 22:14:21.000 -0500>,<Administrator>,<TOPSPIN>,<proc1d>,<TOPSPIN 2.1>,
      <abs ABSG = 4 
       data hash MD5: 32K
       2E 17 3A 80 4C 1D 9E 74 4C C8 C7 43 49 03 D3 56>)
(   8,<2012-07-14 22:14:21.031 -0500>,<Administrator>,<TOPSPIN>,<proc1d>,<TOPSPIN 2.1>,
      <abs ABSG = 5 
       data hash MD5: 32K
       56 35 33 B5 8A 46 77 B7 D6 E6 6E 01 D4 EC 17 A7>)
$$ ##END=
$$ 
$$ $$ hash MD5
$$ $$ 59 D2 0A 3B DC 60 4A 42 00 9F 28 02 FE 5F 4C 8B
##$RELAX= 
##$RELAX= 
##$RELAX= 
##$RELAX= 
##$RELAX= 
##$RELAX= 
##$RELAX= 
$$ Bruker specific parameters
$$ --------------------------
$$ [...]
150 150 150 150 150 150 150 150
##$TP07= 0
##$TPNAME0= <>
##$TPNAME1= <>
##$TPNAME2= <>
##$TPNAME3= <>
##$TPNAME4= <>
##$TPNAME5= <>
##$TPNAME6= <>
##$TPNAME7= <>
##$TPOAL= (0..7)
0.5 0.5 0.5 0.5 0.5 0.5 0.5 0.5
##$TPOFFS= (0..7)
0 0 0 0 0 0 0 0
##$TUNHIN= 0
##$TUNHOUT= 0
##$TUNXOUT= 0
##$USERA1= <user>
##$USERA2= <user>
##$USERA3= <user>
##$USERA4= <user>
##$USERA5= <user>
##$V9= 5
##$VALIST= <valist>
##$VCLIST= <CCCCCCCCCCCCCCC>
##$VD= 0
##$VDLIST= <DDDDDDDDDDDDDDD>
##$VPLIST= <PPPPPPPPPPPPPPP>
##$VTLIST= <TTTTTTTTTTTTTTT>
##$WBST= 2048
##$WBSW= 25
##$XGAIN= (0..3)
0 0 0 0
##$XL= 0
##$YL= 0
##$YMAX_a= 478399
##$YMIN_a= -593044
##$ZGOPTNS= <>
##$ZL1= 120
##$ZL2= 120
##$ZL3= 120
##$ZL4= 120
##$ABSF1= 14.98509
##$ABSF2= -5.573092
##$ABSG= 5
##$ABSL= 3
##$ALPHA= 0
##$AQORDER= 0
##$ASSFAC= 0
##$ASSFACI= 0
##$ASSFACX= 0
##$ASSWID= 0
##$AUNMP= <proc_prof1d_extract_pilot.lims>
##$AXLEFT= 0
##$AXNAME= <>
##$AXNUC= <1H>
##$AXRIGHT= 0
##$AXTYPE= 0
##$AXUNIT= <>
##$AZFE= 0.1
##$AZFW= 0.1
##$BCFW= 0
##$BC_mod= 0
##$BYTORDP= 0
##$COROFFS= 0
##$CY= 15
##$DATMOD= 1
##$DC= 0
##$DFILT= <>
##$DTYPP= 0
##$F1P= 0
##$F2P= 0
##$FCOR= 0.5
##$FTSIZE= 32768
##$FT_mod= 6
##$GAMMA= 0
##$GB= 0
##$INTBC= 1
##$INTSCL= 1
##$ISEN= 128
##$LB= 0
##$LEV0= 0
##$LPBIN= 0
##$MAXI= 10000
##$MC2= 0
##$MEAN= 0
##$ME_mod= 0
##$MI= 0
##$NCOEF= 0
##$NC_proc= -8
##$NLEV= 6
##$NOISF1= 0
##$NOISF2= 0
##$NSP= 0
##$NTH_PI= 0
##$NZP= 0
##$OFFSET= 14.98509
##$PC= 1
##$PHC0= 175.1276
##$PHC1= 0
##$PH_mod= 1
##$PKNL= yes
##$PPARMOD= 0
##$PPDIAG= 0
##$PPIPTYP= 0
##$PPMPNUM= 2147483647
##$PPRESOL= 1
##$PSCAL= 4
##$PSIGN= 0
##$PYNMP= <proc.py>
##$REVERSE= no
##$SF= 400.02
##$SI= 32768
##$SIGF1= 0
##$SIGF2= 0
##$SINO= 400
##$SIOLD= 32768
##$SPECTYP= <>
##$SREGLST= <1H.CDCl3>
##$SSB= 0
##$STSI= 32768
##$STSR= 0
##$SW_p= 8223.68421052631
##$SYMM= 0
##$S_DEV= 0
##$TDeff= 65536
##$TDoff= 0
##$TI= <>
##$TILT= no
##$TM1= 0
##$TM2= 0
##$TOPLEV= 0
##$USERP1= <user>
##$USERP2= <user>
##$USERP3= <user>
##$USERP4= <user>
##$USERP5= <user>
##$WDW= 1
##$XDIM= 32768
##$YMAX_p= 480192395
##$YMIN_p= -681612
##$CURPLOT= <Network HP LaserJet P1505>
##$CURPRIN= <$Network HP LaserJet P1505>
##$DFORMAT= <normdp>
##$LAYOUT= <+/1D_H.xwp>
##$LFORMAT= <normlp>
##$PFORMAT= <normpl>
##$SURQMSG= 1
$$ End of Bruker specific parameters
$$ ---------------------------------
##NTUPLES= NMR SPECTRUM
##VAR_NAME=  FREQUENCY,     SPECTRUM/REAL,   SPECTRUM/IMAG
##SYMBOL=    X,             R,               I
##VAR_TYPE=  INDEPENDENT,   DEPENDENT,       DEPENDENT
##VAR_FORM=  AFFN,          ASDF,            ASDF
##VAR_DIM=   32768,         32768,           32768
##UNITS=     HZ,            ARBITRARY UNITS, ARBITRARY UNITS
##FACTOR=    0.250966925370066, 1,           1
##FIRST=     8223.43324360094, 16746,        -20179
##LAST=      0,             -133683,         140249
##MIN=       0,             -681612,         0
##MAX=       8223.43324360094, 480192395,    0
$$ Real data points
##PAGE= N=1
##DATA TABLE= (X++(R..R)), XYDATA
$$ [...]
19576g8723r9637a5400m04183B32069m2974a39192k91730B6785i9031r2301D9119
19564h0267j21866p0200J28256a6122j19129A12463k0070M6524e8255A82653D6929
19552d6893A06625a91197M3574C6858R6655j6312d35997i0515j72027f0947H901
19540A045K87198a03602J5867C947J89750g0313A3200a34718m32066a83605M8870
19529a34735E2178c77360h9943A28798a2432k356k26982A58450q202L0367b99545
19517a34360C0514Q1469a82516h3963k22961h41F8077b02228h0648k6311n1036
19506a57995L6101o2600H2835c15102F8886a84813P6913I0089c40375G8812l0206
19495D8606J18788C4953J90196f5993q123J3313k34691j69709l724d7437A43483
$$ plain form
19576 -78723 -178360 -15400 -419583 232069 189095 -139192 -430922 26785 -99031 -191332 49119
19564 -80267 -202133 -272333 -144077 -16122 -135251 112463 92393 138917 -58255 182653 46929
19552 -46893 106625 -191197 -147623 36858 133513 117201 -435997 -90515 -262542 -60947 8901
19540 1045 288243 -103602 -87735 3947 193697 -70313 13200 -134718 -566784 -183605 -134735
19529 -134735 52178 -377360 -89943 128798 -12432 -14788 -241770 158450 150248 180615 -299545
19517 -134360 30514 111983 -182516 -83963 -306924 -841 68077 -202228 -80648 -106959 -157995
19506 -157995 -121894 -184494 82835 -315102 68886 -184813 -107900 90089 -340375 78812 48606
19495 48606 167394 34953 225149 -65993 -74116 -60803 -295494 -465203 -468927 -47437 143483
19483a07175A37939h2846E26182c7201H5194F480L77546A51171i5488D9903L02471
19472C52374c73995f7569D9692D493b38472B49297b62297k4330B31693a38560
19461c86445a31789k5666j03353A08792a41993H4991a31151L9724k70709D59776
19450a46839r784B64294J67140b55778M2619j14113a56605J1201q3035j33550
19440c61989a23092A01096J8647i162A3933K6829a26371B86968B9617a98219M9283
19429a48936L9737j2781j04009B15748b52527P1903B05570p6701g460j34414A4067
19417G2102L4888b0399A1957N9894b10355k6555E0073c53802A05216J73838B2241
19405A17187j4827a13271A99526d4757m3074k71795A43331B725b17936M6519E8569
$$ plain form
19483 -107175 137939 -82846 526182 -37201 85194 6480 384026 151171 -95488 49903 352374
19472 352374 -373995 -67569 49692 4493 -238472 249297 -262297 -286627 231693 -138560
19461 -386445 -131789 -157455 -260808 108792 -141993 84991 -131151 -91427 -362136 459776
19450 -146839 -156623 264294 431434 -255778 -213159 -327272 -156605 -145404 -228439 -361989
19440 -361989 -123092 101096 119743 -9162 13933 40762 -126371 286968 29617 -198219 -148936
19429 -148936 -109199 -121980 -225989 215748 -252527 -180624 205570 128869 -7460 -141874 14067
19417 72102 106990 -20399 11957 71851 -210355 -236910 50073 -353802 105216 279054 22241
19405 117187 102360 -113271 199526 -44757 -87831 -359626 143331 2725 -217936 -171417 58569
19393a15292m032m1720A06538b24342J3999A30042a01341B38637b07857P0998
19383a36859A92442G8961J5443l3444b80890J38985F4795c22359B1839b98141
19372a19346j97187G2419G020N0552b678A09669c4329B11438g1443A32425L98
19361A32823e979m72528h1426j37739A61199H579a44593C4613b83246A98939J4584
19350B13523b80964f6932D1152b7241D66909g6216D5133L0682b60096e9464j19605
19339a79069D9927a24962n0223K157d4173C0255k379a99764A71664b47170k2339
19328b69509A0180b53824a19395j96893B7110b24718D0596b72661b9170j09564
19318a38734J4758I8324b15503a00527k01902m8729A02802b46633d8400A84886
$$ plain form
19393 -115292 -119324 -161044 106538 -224342 -210343 130042 -101341 238637 -207857 -136859
19383 -136859 192442 78961 94404 60960 -280890 -141905 64795 -322359 21839 -298141
19372 -119346 -316533 72419 7020 57572 -2678 109669 -34329 211438 -71443 132425 132823
19361 132823 -5979 -478507 -81426 -219165 161199 8579 -144593 34613 -283246 198939 213523
19350 213523 -280964 -66932 41152 -27241 466909 -76216 45133 75815 -260096 -59464 -179069
19339 -179069 49927 -124962 -175185 -173028 -44173 30255 27876 -199764 171664 -247170 -269509
19328 -269509 10180 -253824 -119395 -316288 27110 -224718 40596 -272661 -29170 -138734
19318 -138734 -123976 98324 -215503 -100527 -302429 -351158 102802 -246633 -48400 184886
19307A43157b77812b9690k352o7478A081b23852N5473A2229a21017B82535J5528
19296B98063G0078d00624k39277D0936f848C13606m7892I0179c5642k39719A18527
19284A61126J95872D1480d71707b23294A20916O1960D8897B0234J32147a45128
19273a37051O1626B43499a12719B8064N8707b06129l7942A64041E3638h0284p8024
19262a58308B01354a02012p2889D0982J78774D3615P2723J027c61770a51362B67792
19250b48161M8017O984b2075q441j88870d5277A58433h9885G0519P552d06519
19238A82905L7883B7619b69733a2999k28798A32543B2251b68356R0180D1379J59915
19227B01294a94561B53778C3414K598g3671C30661a21345I4426d3328B84611c1019
$$ plain form
19307 143157 -277812 -29690 -32042 -99520 1081 -223852 -168379 12229 -121017 282535 298063
19296 298063 70078 -400624 -639901 40936 -6848 313606 265714 90179 -35642 -275361 118527
19284 161126 356998 41480 -471707 -223294 120916 182876 48897 20234 152381 -145128
19273 -137051 -75425 243499 -112719 28064 86771 -206129 -244071 164041 53638 -80284 -158308
19262 -158308 201354 -102012 -174901 40982 219756 43615 116338 117365 -361770 -151362 267792
19250 -248161 -200144 -193160 -22075 -30516 -219386 -45277 158433 -89885 70519 78071 -406519
19238 182905 220788 27619 -269733 -12999 -241797 132543 22251 -268356 -178176 41379 201294
19227 201294 -194561 253778 33414 36012 -73671 330661 -121345 94426 -43328 284611 -31019
19215b36028i9599F6365O2579J61225b56390K8097O5583A85699c01308J42732
19205a58576G6121a14594r3546N1794m9865D5246c7140l0932n8173j72313h7432
19193D9652b64046J18930M8363b0091A92601p2707Q0991G3565a82272o176l06810
19182d95258E41537a26809j66233A61146b03842H026a27013n6783A60382o172
19172A54210c2404q9195l7906M6525A53444e2843b5378j22682A81535B1308a61342
19160c18239H9115a09406G3963l5170J15759a13175p681A31804b15116J00241
19150a14875q4960A36655a5763C89655a55653a091A77802b51992O7313c0619m48624
19139d79243J47318J33458C7382a50137k5718j2788A09110c62666J69087A31600
$$ plain form
19215 -236028 -99599 66365 128944 290169 -256390 -228293 -162710 185699 -301308 -158576
19205 -158576 76121 -114594 -208140 -156346 -206211 45246 -37140 -68072 -126245 -298558 -87432
19193 49652 -264046 -145116 -96753 -20091 192601 119894 200885 73565 -182272 -188448 -495258
19182 -495258 541537 -126809 -293042 161146 -203842 8026 -127013 -183796 160382 154210
19172 154210 -32404 -121599 -159505 -112980 153444 -52843 -25378 -148060 181535 21308 -161342
19160 -318239 89115 -109406 73963 38793 154552 -113175 -120856 131804 -215116 -114875
19150 -114875 -199835 136655 -15763 389655 -155653 -1091 177802 -251992 -184679 -30619 -479243
19139 -479243 -331925 -198467 37382 -150137 -175855 -188643 109110 -362666 -193579 131600
19128d65635E3296e8884A49772a71351M854B8987J97674b02778d8185J5321J0286
19117b2578n4953k17218I428M1698a41488G255a643m8552j10237C1922I191a19811
19104b9415k02949A13463a45178k7206D5684d48463J94036H6093b56720a04489
19093b52651c1490k6656E4657K3271Q9767J87702B3235M5418A4295a6157C4262
19081c73928A38662c59990g2790H4633Q4861a68616C29178a97751J6181k7184
19071b08754r675p9453A02000b4166n40048a71799Q0647A67280c51319I2694Q9971
19060A82665D831K9879c00266A6429d918A23143E2521b8262B0712i6255k02314
19049b98569E1680K76743c03324d4817k4726j60917J06773B58967C2310b51483
$$ plain form
19128 -465635 53296 -58884 149772 -171351 -166497 28987 226661 -202778 -48185 -32864 -22578
19117 -22578 -77531 -294749 9428 51126 -141488 7255 -1643 -50195 -160432 31922 9191 -119811
19104 -29415 -232364 113463 -145178 -172384 45684 -448463 -254427 86093 -256720 -104489
19093 -252651 -31490 -58146 54657 77928 167695 355397 23235 68653 14295 -16157 34262
19081 -373928 138662 -359990 -72790 84633 169494 -168616 329178 -197751 -181570 -208754
19071 -208754 -218429 -297882 102000 -24166 -564214 -171799 -91152 167280 -351319 92694 182665
19060 182665 4831 34710 -300266 16429 -4918 123143 52521 -28262 20712 -96255 -298569
19049 -298569 51680 328423 -303324 -44817 -69543 -230460 -123687 258967 32310 -251483
19038i5589k3062A28422k8090J2654R5193o6496J3493F4642e0838q3393A99578
19026B75423g0488c4200k91219B93476C1194M7690k7364b90049A33384J3950a88314
19014a19569B4068l767a21281e7106p0374b201r7105j15766H3725a94762K7982
19003a66780j06903H3286L767c5201A99106F5859b73537R9637G182a14504A42704
18991A34486k4260e3587I8449B8636d75734A90581i4784m4196B5462i0417K8623
18980f1794C98039a09429D8657c7806C1665a34108l14965C89731a07636c7882
18969h4723A00355J14315a34890E2797i375j23721b4903A15827J02185d27926
18958a05440j05048l43561I2856a96071c3759A17578b84187a16397k60829H6225
$$ plain form
19038 -95589 -118651 128422 100332 112986 208179 141683 155176 64642 -50838 -134231 199578
19026 275423 -70488 -34200 -325419 293476 31194 78884 51520 -290049 133384 147334 -188314
19014 -119569 24068 20301 -121281 -57106 -127480 -2201 -99306 -215072 83725 -194762 -166780
19003 -166780 -273683 83286 87053 -35201 199106 65859 -273537 -173900 7182 -114504 142704
18991 134486 110226 -53587 98449 28636 -475734 190581 -94784 -138980 25462 -90417 -61794
18980 -61794 398039 -109429 48657 -37806 31665 -134108 -449073 389731 -107636 -37882
18969 -84723 100355 214670 -134890 52797 -9375 -133096 -24903 115827 218012 -427926
18958 -105440 -210488 -554049 92856 -196071 -33759 117578 -284187 -116397 -377226 86225
18947I0600b8744j0845j29046L8279k6942A69253N7958i6351B08653g1153c0072
18935b11912D15358b88695a42417G8762b1608k39370J24118l9221O8651B03331
18924H0072J05717N8153r6646b24445g3738A04673a77650P4986c5743j94547g1861
18912E3618a3756j87022A17895N1555E6685P9214n3263b06819o3377g2995A21652
18900h3046j36374a8619D5260J82092H4403d5710j07619E7282i6682M6870n9822
18889a09634b2485k15019A07322a78135r1991A34631c82236a4746k32419A18766
18878b3193A29703g3109j56438i4968k22893d8120j79586i3779G8674b08562i3744
18866a03795j03038A31726C7860b78663J17254K1496B8219a20920L5149A12716
$$ plain form
18947 90600 -28744 -39589 -168635 -130356 -157298 169253 227211 -96351 208653 -71153 -30072
18935 -211912 415358 -288695 -142417 78762 -21608 -260978 -136860 -176081 -107430 203331
18924 80072 185789 243942 147296 -224445 -73738 104673 -177650 -102664 -35743 -230290 -71861
18912 53618 -13756 -200778 117895 169450 56685 135899 82636 -206819 -270196 -72995 121652
18900 -83046 -219420 -18619 45260 227352 84403 -45710 -153329 57282 -96682 -49812 -109634
18889 -109634 -22485 -237504 107322 -178135 -270126 134631 -382236 -14746 -247165 118766
18878 -23193 129703 -73109 -229547 -94968 -317861 -48120 -227706 -93779 78674 -208562 -93744
18866 -103795 -206833 131726 37860 -278663 -161409 -139913 28219 -120920 -85771 112716
18855e5850n9813B28649p225f4665m66725A02556L33579C5448a79902A5598J06080
18844A21678h5464p4494H8763B9979A3313J82663a414C9094R3840Q5482a16205
18832h5926n1575o1499A17850b34534P8119A65205c0753k21548E9562L91055b23888
18820a46308B43577f3336C34516a97936B58391i0772E2314c4046F3739A2612J9635
18809C2247Q4339c7410A53044c40143a70067M4243q9926A42012D2687N5350b11760
18797D2028O2673b55032k2857K3156b4798H2312a94616J6898B0551c54081J43806
18786b10275c9546l5442A91388H8815O449d26055A49794m0007a78786P3033j06289
18775b12042L7883B5302J29945D1855h0341A23225d7639k74703q9024A3930b18652
$$ plain form
18855 -55850 -115663 228649 221424 -64665 -531390 102556 436135 35448 -179902 15598 121678
18844 121678 -85464 -159958 88763 29979 13313 195976 -1414 39094 132934 218416 -116205
18832 -85926 -137501 -199000 117850 -234534 -156415 165205 -30753 -252301 59562 450617 -223888
18820 -146308 243577 -63336 334516 -197936 258391 -90772 52314 -34046 63739 12612 32247
18809 32247 116586 -37410 153044 -340143 -170067 -125824 -215750 142012 42687 98037 -211760
18797 42028 104701 -255032 -277889 -254733 -24798 82312 -194616 -177718 20551 -354081 -210275
18786 -210275 -39546 -74988 191388 88815 95264 -426055 149794 109787 -178786 -105753 -212042
18775 -212042 -174159 25302 155247 41855 -80341 123225 -47639 -322342 -411366 13930 -218652
18763f6837B79352a86786e8109j97023B84040a89116K9136C2580b32018Q965c9159
18751A45083J12799h9477A49348a84692K5598m7486H4727b2890j23167J2278D9467
18739i9881C9359f800H609M5783a1066j83573A34171b83271P3724A82660P7235
18728B59895a20773k37633G9076c74013A77514l9364a0541k41356j55507G7103
18717b70221A6137a26036d1238m8290a305p9573G2495O8373L31809d31306h5996
18705E4819A7836a25921j69302a25559O0576B59145h4630J2617l5211B77035Q122
18694B85157D7308b11892K4737m5229i2210A16066k3052a98438m0273P7931B55627
18682a22849k11919H593P157a32480f1198B64694a77154d2930A48635a13885l72
$$ plain form
18763 -66837 279352 -186786 -58109 -255132 284040 -189116 -159980 32580 -232018 -223053 -39159
18751 145083 257882 -89477 149348 -184692 -159094 -206580 84727 -22890 -146057 -133779 49467
18739 -99881 39359 -6800 8609 54392 -11066 -194639 134171 -283271 -209547 182660 259895
18728 259895 -120773 -358406 79076 -374013 177514 138150 -10541 -251897 -407404 77103
18717 -270221 16137 -126036 -41238 -89528 -1305 -80878 72495 140868 472677 -431306 -85996
18705 54819 17836 -125921 -295223 -125559 -64983 259145 -84630 -72013 -107224 277035 285157
18694 285157 47308 -211892 -187155 -232384 -92210 116066 93014 -198438 -238711 -160780 255627
18682 -122849 -334768 8593 15750 -132480 -61198 264694 -177154 -42930 148635 -113885 -114257
18671a14257k27362h4501l94829J53087A18185a02989j58753k3743A33481a83149
18660B3647J8939b00803B08178e6682B12511r5803n3381c92731A3098a45215B814
18648H1771C0254b3463k04937C7908j0002a15808M4823l17147A13612N652b14827
18636d4492j48441b9123B12008J929h3673A55538b08859B2198g0188H982N2250
18625F1232B1954h8919G749a68988e9533L659B01610K6518F0384a2529E9189b9092
18612b96538l32504c297n0225K0802E7744b29667A6160L5278J99096i9152k9652
18601a28804L3663L4282j15235g0144j31904A5497g5984D2431h7337q411o0078
18590a55826k9198C11505p9045a23776e5063G7042c70357A80154H6083b84070
$$ plain form
18671 -114257 -341619 -84501 -479330 -326243 118185 -102989 -261742 -285485 133481 -183149
18660 23647 42586 -200803 208178 -56682 212511 116708 63327 -392731 13098 -145215 2814
18648 81771 30254 -23463 -228400 37908 27906 -115808 -70985 -388132 113612 119264 -214827
18636 -44492 -192933 -29123 212008 213937 -83673 155538 -208859 22198 -70188 8982 61232
18625 61232 21954 -88919 7749 -168988 -59533 -55874 201610 228128 60384 -12529 59189 -29092
18612 -296538 -629042 -3297 -53522 -32720 57744 -229667 16160 51438 250534 -99152 -128804
18601 -128804 -95141 -60859 -176094 -70144 -202048 15497 -75984 42431 -87337 -95748 -155826
18590 -155826 -185024 311505 232460 -123776 -55063 77042 -370357 180154 86083 -284070
18579e2544j14957b4875D85762i3872r1366l2209A77347a77510p088k69082c9514
18567g9480B61970J13379a33568d5512j65130L4982o4354A72051h7768k06056
18557b93824A97669i5225p4567l5124A47787J78420B6327a77672m4876G4088k2389
18546E1699N304e3315j2117A6421J29634b1080j79479M1262A32756a50933K0603
18535a30330j43429Q5378c5627p9474C86a89028N1623d4391j46546N6771m9565
18524a83731A941a74317e1766k20900P8915b7251B17856G8443R0690B1145a50776
18512C18089a91152k179i2746B11229D6455a6375o1084k059r5133g7274n6967
18501a34241q754B16050G4699J59337L6428A06880b42892l5200B659b00821j73340
$$ plain form
18579 -52544 -167501 -24875 485762 -93872 -185238 -217447 177347 -177510 -184598 -453680 -39514
18567 -79480 261970 375349 -133568 -45512 -210642 -175660 -240014 172051 -87768 -293824
18557 -293824 197669 -95225 -169792 -204916 147787 326207 26327 -177672 -222548 74088 51699
18546 51699 57003 -53315 -65432 16421 146055 -21080 -200559 -159297 132756 -150933 -130330
18535 -130330 -273759 -188381 -35627 -115101 386 -189028 -137405 -44391 -190937 -134166 -183731
18524 -183731 1941 -174317 -51766 -272666 -193751 -27251 217856 78443 169133 21145 -150776
18512 318089 -191152 -193331 -92746 211229 46455 -16375 -77459 -79518 -174651 -77274 -134241
18501 -134241 -142995 216050 74699 234036 270464 106880 -242892 -278092 2659 -200821 -374161
18490c74161O3824e4172N171J5140k0783A42814a58861A46284N5278a71443n9209
18479b30652b8421p2428n2187R199e8961a8800p6550o3055k8365A0014J09017
18468A19031E1503d1927C04819c6416A19194b30001h5338B81429a05717p4616
18458a80333d8768B479K43279c4761c28m28545I3226a04515A36593l4358a66581
18446B805f1379b5762B16610J2917d07370i3358A82940K70938A6961a96974A86587
18434a32382j15665O4644A14422a8074A32879d1319A24219c58906A26145c28406
18423e93322C61527d4594D3818b37373P4881g3541J1031E4939e7013H5437a91625
18411a10460a0033j05368A7181Q0900C486O9727P2371J03068f8990k43160A66961
$$ plain form
18490 -374161 -310337 -54172 -49001 -33861 -54644 142814 -158861 146284 201562 -171443 -230652
18479 -230652 -28421 -100849 -153036 -143837 -58961 -18800 -95350 -158405 -186770 10014 119031
18468 119031 51503 -41927 304819 -36416 119194 -230001 -85338 281429 -105717 -180333
18458 -180333 -48768 2479 245758 -34761 -328 -428873 93226 -104515 136593 102235 -166581
18446 2805 -61379 -25762 216610 229527 -407370 -93358 182940 453878 16961 -196974 186587
18434 -132382 -248047 -183403 114422 -18074 132879 -41319 124219 -358906 126145 -328406
18423 -593322 361527 -44594 43818 -237373 -162492 -73541 -62510 54939 -57013 85437 -191625
18411 -110460 -10033 -115401 17181 98081 3486 73213 145584 248652 -68990 -312150 166961
18399b14953m9863a18727j09482K5535j27702l5017A85490d1701a4377j86044
18389b00421l3600e0387E5721J01562D3205a17031o8675B5328c24310i4150a5134
18377a41567b1486C4031A3488L1223L24000a25627l10451b2079I9281K3071F0447
18365B54673C2537c72869A43685a30225B13879m9271C8681J03681P3915i8106
18354b58421J2690A20882g2336C7677f8335p9531c0953e385j57604r1564C8857
18342a18983A25700C6565R1936C8806J42350C7413J03903b03063L4596B20993
18331d1839j94822L5438N9912A63565a86797J5629G0680K7784f5763P933E3398
18319H8704b12823R6602m9871j68655A57849b36537c926j32172A23709B324a68322
$$ plain form
18399 -214953 -264816 -118727 -228209 -202674 -330376 -365393 185490 -41701 -14377 -200421
18389 -200421 -234021 -50387 55721 157283 43205 -117031 -185706 25328 -324310 -94150 -15134
18377 -141567 -21486 34031 13488 44711 368711 -125627 -436078 -22079 99281 122352 60447
18365 254673 32537 -372869 143685 -130225 213879 164608 38681 142362 216277 -98106
18354 -258421 -245731 120882 -72336 37677 -68335 -147866 -30953 -5385 -162989 -254553 38857
18342 -118983 125700 36565 128501 38806 181156 37413 141316 -203063 -168467 220993
18331 -41839 -236661 -201223 -141311 163565 -186797 -171168 70680 98464 -65763 -57830 53398
18319 88704 -212823 -116221 -166092 -334747 157849 -236537 -3926 -136098 123709 2324 -168322
18307D000b14384j21094B14257j01103j5464D4400d0691m06401A16932a8964k74317
18296b93281k09350A65524G1221N5207d1121j33642K8220j8379J0796c2363J4130
18285a8233D3649J23141b59165B26125c69355a23934L7532j00984l78466b12731
18274e8034K2308G3417B7877D910b34892R7362E3970J58864G1834d1018j50911
18263a91929g5624k11992h0932H7030B1702a71543D3314J2171J45316G8291J10729
18252A89020b9325I4968c16115M6360q6922G6558c3773j01030e8230J7995h809
18240c655l10792a1255o5540n5698A2916a1044D03734j55271i3104p8003A6707
18228F5369J50281b43105b1877j19178B7634g1244B3368L61432c0668j4013j57225
$$ plain form
18307 4000 -214384 -335478 214257 113154 97690 44400 -40691 -447092 116932 -18964 -293281
18296 -293281 -502631 165524 71221 126428 -41121 -174763 -146543 -164922 -154126 -32363 -18233
18285 -18233 43649 166790 -259165 226125 -369355 -123934 -86402 -187386 -565852 -212731
18274 -58034 -35726 73417 27877 4910 -234892 -137530 53970 212834 71834 -41018 -191929
18263 -191929 -75624 -287616 -80932 87030 21702 -171543 43314 55485 200801 78291 189020
18252 189020 -29325 94968 -316115 -269755 -356677 76558 -33773 -134803 -58230 -40235 -8809
18240 -3655 -314447 -11255 -76795 -132493 12916 -11044 403734 248463 -93104 -171107 16707
18228 65369 215650 -243105 -21877 -141055 27634 -71244 23368 384800 -30668 -44681 -201906
18217b01906a6083A42133a24512N1656F3635a67948H7121j7379d2264m0302n2492
18206a35058B6042K6723b76371h651C5288g3262k76752C12489b71821l713C64520
18194b61538Q5752A25696a20282A48427f2860J8653j6743a5547k25702k05292
18184d46541b05884c6608A61294B720K31152F3277b44843C20603b48929H6258
18173c6260B04413f5658o1605C31666F4048a72853m9649M6265j88347a03665H4288
18161F4108K68885b54650l9428J26450K713M8427b8932j05130A0005a65836d8761
18149e3520q1830B12272a8548j2235l63272A77206h8980k42454A81760a66550
18138c24579d0903D9206N400M9436b86812B77713c1209o200k83202J53496F0407
$$ plain form
18217 -201906 -16083 142133 -124512 -72856 63635 -167948 87121 69742 -42264 -82566 -135058
18206 -135058 26042 52765 -276371 -8651 35288 -73262 -350014 312489 -271821 -275534 364520
18194 -261538 -175786 125696 -120282 148427 -62860 -44207 -60950 -15547 -241249 -446541
18184 -446541 -205884 -36608 161294 2720 233872 63277 -244843 320603 -248929 86258
18173 -36260 204413 -65658 -127263 331666 64048 -172853 -222502 -176237 -364584 -103665 84288
18161 64108 332993 -254650 -294078 -167628 -164915 -116488 -28932 -134062 10005 -165836 -48761
18149 -53520 -135350 212272 -18548 -30783 -394055 177206 -88980 -331434 181760 -166550
18138 -324579 -40903 49206 54606 104042 -286812 277713 -31209 -37409 -320611 -167115 60407
18126b44659D4580J67623K26109A5149L3715a20526p4939B50808i8728l00231
18116c98959C188b85942A05146J13290E3813a54100B4560a00949r2936F9691J56370
18105B26061b16200f6834B5598g0729c580j8768l4823o8474k66070A1399c763
18093e52283c0157j233C47380b08636f607C27405e2500A54805J62202h6458I1360
18081F4306a99789k8108P896j16844a3729C4265N5129I729f2293a1561j49229
18070a60790b9591A08951e6514D0762g7496K3348k57509A6406a86508B45150a96810
18058h0501A7518a70521E9885b50530a22799c3251A73882h3154L8610l6068B03942
18046B38582g657m1134A05241Q0107i8549B37278d09985R6509J1717D6136j1582
$$ plain form
18126 -244659 44580 212203 438312 15149 48864 -120526 -195465 250808 -98728 -398959
18116 -398959 3188 -285942 105146 218436 53813 -154100 24560 -100949 -193885 69691 226061
18105 226061 -216200 -66834 25598 -70729 -3580 -22348 -57171 -125645 -391715 11399 -3763
18093 -552283 -30157 -31390 347380 -208636 -6607 327405 -52500 154805 317007 -86458 91360
18081 64306 -199789 -227897 -220001 -336845 -13729 34265 89394 9729 -62293 -11561 -160790
18070 -160790 -29591 108951 -56514 40762 -77496 -54148 -311657 16406 -186508 245150 -196810
18058 -80501 17518 -170521 59885 -250530 -122799 -33251 173882 -83154 -44544 -80612 203942
18046 238582 -7657 -48791 105241 185348 -98549 237278 -409985 -313476 -301759 46136 34554
18035C4554b13143j4467A21435Q1566E5248b5353l2492j80087G5444R9621G8115
18023A85932c64630A46652b51118j1848h0996l4334A3100K02920H6969G315P6580
18012H3895Q2664C6889E208J09965n3320a43799A27387d5036A46302p0946f558
18000B09892b6704k01262g3688k17394f6849K8453k25526e6470k1697m2423A79413
17988b86391a954k51634d0749j35173k05215e2824l9795B29377A0598O9479K6798
17977A06875A226J6379c07876a01303l7065N5868I9827l3068c510p2561o3673
17966a39744l2877N7626l77209J46171A5733f9927A51209a58270l60650B09913
17955A12992k6722b45182I3534a36853P163C4305J07121b82820Q4332q7071I2163
$$ plain form
18035 34554 -213143 -227610 121435 203001 55248 -25353 -57845 -237932 75444 175065 78115
18023 185932 -364630 146652 -251118 -262966 -80996 -115330 13100 216020 86969 7315 83895
18012 83895 166559 36889 5208 115173 61853 -143799 127387 -45036 146302 75356 -6558
18000 209892 -26704 -227966 -73688 -291082 -66849 -38396 -263922 -56470 -78167 -120590 179413
17988 -286391 -1954 -253588 -40749 -175922 -381137 -52824 -92619 229377 10598 80077 106875
17977 106875 1226 17605 -307876 -101303 -138368 -82500 99827 66759 -3510 -76071 -139744
17966 -139744 -172621 -114995 -492204 -346033 15733 -69927 151209 -158270 -518920 209913
17955 112992 86270 -245182 93534 -136853 -129690 34305 141426 -282820 -198488 -285559 92163
17943c3626A39125b02891A92543a57126F575J38118m8007m116a73240B2241b34006
17931G9417H177b46990g2538B85900b77139a37875c7708E109b00885A67438G5008
17919A84439a59971C73280D5297a02727j7573A37324a66025f5237l6127J1195
17909i0169r8440p029R3385l7125m633F4063c15983c0244h701G0344a74238j04189
17897b78427J20679A3947b81414P447c3120C832b5452j92893D96682A39029C3747
17885a04346j34005R8766f6840b3891A23609J31919C5177R3720J59933j8643E4270
17873e1400F7251G855R5916m0203L6212a32295A27020B0541R4961a040j45497
17862a46537j43362D12910c2301j37729G1319J17426k6264a83780B5149a41298
$$ plain form
17943 -33626 139125 -202891 192543 -157126 6575 144693 96686 92570 -173240 22241 -234006
17931 79417 8177 -246990 -72538 285900 -277139 -137875 -37708 5109 -200885 167438 75008
17919 184439 -159971 373280 45297 -102727 -120300 137324 -166025 -65237 -101364 -90169
17909 -90169 -188609 -195638 -102253 -139378 -144011 64063 -315983 -30244 -8701 70344 -174238 -278427
17897 -278427 -157748 13947 -281414 -273967 -33120 3832 -25452 -218345 496682 139029 33747
17885 -104346 -238351 -139585 -66840 -23891 123609 255528 35177 128897 288830 270187 54270
17873 -51400 67251 7855 103771 63568 99780 -132295 127020 20541 115502 -1040 -146537
17862 -146537 -289899 412910 -32301 -170030 71319 188745 162481 -183780 25149 -141298
17851a17900c9280F5151a7089D7591e3946B07294q8438d8982A03981l2851i84
17839d430k6697e004B12960H0039b08935A31054Q7603a76557M2497a269C58151
17827A12053J20994c88059A23002a32276L9306k17673O2336f9318j67849a02309
17816A70225a50559C00813c5634C83913g5311A49411C7689M1052d05926e0972
17805G4678I548R9225c2213o085c979q0750H2463c3937j67161B16296k3064G6927
17792a10195A45039a40178A1658Q8383B4765i4810d6384A6703J4567J12310g3630
17780a28398F7636C2498c31740d1349j62728D7858g7430a5957G6866l0361A1395
17768a96485R4156E5612J34854h4180B30036n5318b31527C31110a6266F6477a78106
$$ plain form
17851 -117900 -39280 65151 -17089 47591 -53946 207294 118856 -48982 103981 71130 -984
17839 -4430 -31127 -5004 212960 80039 -208935 131054 218657 -176557 -134060 -1269 358151
17827 112053 233047 -388059 123002 -132276 -92970 -310643 -248307 -69318 -237167 -102309
17816 170225 -150559 300813 -35634 383913 -75311 149411 37689 78741 -405926 -50972
17805 74678 9548 108773 -32213 -38298 -3979 -84729 82463 -33937 -201098 216296 193232 76927
17792 -110195 145039 -140178 11658 100041 24765 -94810 -46384 16703 31270 143580 -73630
17780 -128398 67636 32498 -331740 -41349 -204077 47858 -77430 -15957 76866 46505 11395
17768 -196485 -102329 55612 190466 -84180 230036 174718 -231527 331110 -16266 66477 -178106
17756c17408A02126b7923A41348b21936M8275d0825A39878c05325B0198R5272
17746A15470c0727A64062c9289A23690b07878c5278j44200A31111a79054A12189
17735A03181R8993J16512J559A11O1049A0955b58541H0268e2768r0882A15668
17723I6478b09689d8869l1686L0734E0785N5680c6940A44108f0901o7998I395
17711B63886a93030d5839o1343q546I8837g1338A04732K3626e7405j10334d5087
17699C504J54012a76957a6600A99879a19067C48833a66300K2983b2907l07777
17689c30684b2751A11472m5763a53172A77241a23878e9832B49435B3740c08928
17678a4707j86411L3290F7419K2721c59183a25242A21215H226b03915a0130A609
$$ plain form
17756 -317408 102126 -27923 141348 -221936 -173661 -40825 139878 -305325 20198 115470
17746 115470 -30727 164062 -39289 123690 -207878 -35278 -179478 131111 -179054 112189
17735 103181 202174 318686 320245 111 61160 10955 -258541 80268 -52768 -143650 115668
17723 96478 -209689 -48869 -80555 -49821 50785 106465 -36940 144108 -60901 -128899 9395
17711 263886 -193030 -45839 -107182 -115728 98837 -71338 104732 128358 -57405 -167739 -45087
17699 3504 157516 -176957 -16600 199879 -119067 348833 -166300 -143317 -22907 -330684
17689 -330684 -22751 111472 65709 -153172 177241 -123878 -59832 249435 23740 -308928
17678 -14707 -201118 -167828 67419 90140 -359183 -125242 121215 8226 -203915 -10130 1609
17666D46670i5138A1596i5730p267A11232C0744g4655j70179i2777j70650A00829
17654b26406D09121j84329k3351b58694B810L22315J4441m1592Q4677a35216C04632
17642c5071j39745A30082O9616m6005f1743l9160A1466K16592I5737K5971d23452
17630a38929H3506K7058Q6014A0917J20649a48476B03399D3582N9263C3267c00235
17618C71952A13533J41449c12698J23548L5983r6475b6691A18495N1603a89163
17607A79960J37622a30806I1380A3284J45803a73587K7532A59860d71999C4552
17596a83771P5111B25571j1893Q6880j20282l9336c58402J1606a53286K5653k45149
17585c72782A21958E9151j1680h5548A73900f6964I8246b1886B00262J6883d5581
$$ plain form
17666 446670 -95138 11596 -95730 -102997 111232 30744 -74655 -244834 -92777 -263427 100829
17654 -226406 409121 224792 201441 -258694 2810 325125 339566 297974 382651 -135216 304632
17642 -35071 -174816 130082 199698 153693 -61743 -100903 11466 228058 95737 121708 -423452
17630 -138929 83506 110564 196578 10917 131566 -148476 203399 43582 102845 33267 -300235
17618 371952 113533 254982 -312698 -189150 -153167 -249642 -26691 118495 170098 -189163
17607 179960 317582 -130806 91380 13284 159087 -173587 -146055 159860 -471999 34552
17596 -183771 -108660 225571 213678 300558 180276 140940 -358402 -346796 -153286 -127633 -372782
17585 -372782 121958 59151 47471 -85548 173900 -66964 98246 -21886 200262 217145 -45581
17573B8742J98624D7505F606a81183A6249P2127b4338E2265a20994P112B4929
17561i8856M3320G8284N4081a31035C6831L29632H4354a81813B6855J77246e11689
17549B39936F9888J45870b4517A40484h3233L7287H3995A4873R7059b85354b5932
17537a67449F8199L4525a83158B38901j16240J12899e4110B02536q6944b47175
17526A04074d1612B96449h9706L6143H1966a57450A5384K42983A15194a83166
17515A98064a65252B60014A09568n6J19405j1305a3416D9796d6940a7334k07776
17504b25110A31964J179L3017a29584B86219J14520p9286i6124F3611R2184e1011
17492A16343C5273c43636C27889A42985g250p5409A6716h735B97882j2037f5386
$$ plain form
17573 28742 227366 47505 6606 -181183 16249 88376 -24338 52265 -120994 -113882 24929
17561 -98856 -55536 78284 132365 -131035 36831 366463 84354 -181813 26855 204101 -511689
17549 239936 69888 215758 -24517 140484 -83233 -45946 83995 14873 111932 -285354 -25932
17537 -167449 68199 102724 -183158 238901 122661 235560 -54110 202536 115592 -247175
17526 104074 -41612 296449 -89706 -53563 81966 -157450 15384 258367 115194 -183166
17515 198064 -165252 260014 109568 109512 228917 217612 -13416 49796 -46940 -17334 -225110
17504 -225110 131964 133143 166160 -129584 286219 400739 321453 -96124 63611 155795 -51011
17492 116343 35273 -343636 327889 142985 -7250 -82659 16716 -8735 297882 285845 -65386
17480d00479b2001k8184m842B63318p9286K78669e202k08585C13825E7943N8949
17469A16892a29233A37962i8026B00531a1113o8691B99739q5661a72767G4101
17458B63910M92713l22405E7094A0914c589C56971j40514R8189a3541A383M7318
17447D8701K91736J90137E4226L86862K130A52122L3392B9045K05980a64323C18464
17435c6289B25262L0530d6190A13043q404a73204B67230J66149k16200i5144C07129
17423D1733O6392b77248B40825p7361J49486K9186n5813J36617m4837j7656j3100
17412C47347K39402a84683B78131F742L47647K2067G4303k7800L47323a44206
17401B93689A23986b52025A60930c2609j3534l6551F6356K75484E6958N42559
$$ plain form
17480 -400479 -22001 -50185 -55027 263318 184032 462701 -5202 -213787 313825 57943 116892
17469 116892 -129233 137962 -98026 200531 -11113 -79804 299739 214078 -172767 74101
17458 263910 756623 434218 57094 10914 -3589 356971 216457 314646 -13541 1383 48701
17447 48701 340437 530574 54226 441088 443218 152122 185514 29045 235025 -164323 318464
17435 -36289 225262 255792 -46190 113043 104639 -173204 267230 433379 217179 -95144 307129
17423 41733 108125 -277248 240825 163464 312950 342136 286323 422940 378103 360447 347347
17412 347347 586749 -184683 278131 6742 354389 376456 74303 46503 393826 -144206
17401 293689 123986 -252025 160930 -32609 -46143 -82694 66356 341840 56958 599517
17391E99517G6927N1503l4180K09399G5556b5451k0273A16777K08365n4297l9402
17380B31443I6062M8232J57759c3356q6697D43465L6858A50531l6177g0002F0629
17368C50869A48211k1037E2558J04151c38543A13695P1878R4501b73030f6253
17357B57280A10942R6236E9078J68100C2450a31922B90738A22198i1302j04374
17347a95676A67369J57669A14088b43688H0154g9285l77611G4497i4169B51992
17336A54995h2182A79803K62340r9026b02293F6042a99602b5920A59176E4494
17325A24995A2162K36636m8067E4557J04251K89158r1388A64720l1051E4405R733
17314F4138M64677j81295L06743I5481L1475m2885K06993q5558G9769e9818m7582
$$ plain form
17391 599517 76927 128430 94250 303649 75556 -25451 -45724 116777 325142 270845 231443
17380 231443 96062 144294 302053 -33356 -120053 443465 480323 150531 114354 -70002 60629
17368 350869 148211 127174 52558 156709 -338543 113695 185573 280074 -273030 -66253
17357 257280 110942 207178 59078 227178 32450 -131922 290738 122198 -91302 -195676
17347 -195676 167369 325038 114088 -243688 80154 -79285 -456896 74497 -94169 251992
17336 154995 -82182 179803 442143 343117 -202293 66042 -199602 -25920 159176 54494
17325 124995 12162 248798 200731 54557 158808 447966 356578 164720 133669 54405 64138
17314 64138 528815 347520 654263 95481 126956 84071 291064 205506 79769 -59818 -107400
17303a07400C88591A33908d262A55522m4766L08858j44131D7956a27461B18861
17292B05135n0150j0509a00979B77891F7972J49719p6882A0105b97875A90197
17281B40589p8803P5297J03040J9010l7614j53531g8829A28781o2390J72401r9908
17270A38884L5791m33L4148N9812A20009J33505h6747A15118r827L18945B02363
17258A21873K27601A05231L1975L5292F9378L85218A3052M9075P9640b6226C16034
17246A65116J36451j01044q33i7970c2757B12407C4105h6383B81522N6653c02118
17234D38107B5736K45365c3038M440B86938m7837j236g6327A57732P5176L4201
17223B67109I3153a16144B95382b33066j29208C00567i378C50642C3787Q3585
$$ plain form
17303 -107400 388591 133908 -4262 155522 110756 419614 275483 47956 -127461 218861
17292 205135 154985 144476 -100979 277891 67972 217691 140809 10105 -297875 190197
17281 240589 161786 237083 340123 359133 321519 167988 -78829 128781 66391 238792 138884
17270 138884 174675 174242 208390 268202 120009 253514 -86747 115118 105291 424236 202363
17258 121873 349474 105231 137206 172498 69378 454596 13052 62127 141767 -26226 316034
17246 165116 301567 200523 199690 -97970 -32757 212407 34105 -86383 281522 338175 -302118
17234 438107 25736 271101 -33038 -28598 286938 239101 237865 -76327 157732 232908 267109
17223 267109 93153 -116144 295382 -233066 -362274 300567 -9378 350642 33787 117372
17213A17372n1770N233c51112A14990l5992J48679d0810F999a16537D68881o7495
17202D01386o2859A61061c92209C39801B8119J53417E4727M7355D2078J57820
17192A99898D0419J84109O3841H2146A6847K86301j07731H8872R0643K74859A63399
17180C61751K606a3668C33802j14860L3739c20612A23887L82190k51946M6525
17170C00656J535a90820c7371B09620A1172M26467c3442C81679a75864H3701L2995
17159A16696L54049B27290L75850G6890N05086B00954J82369j64303b4539f338
17148C23480j49113M7239k7674N3091j11365L0231E6879b4950B57500k8180J29632
17137C58952K55156d191p0824C57747n8014J86985B40642a42690A43928L89572
$$ plain form
17213 117372 65602 70835 -351112 114990 78998 227677 -40810 6999 -116537 468881 401386
17202 401386 338527 161061 -392209 339801 28119 181536 54727 102082 42078 199898
17192 199898 40419 224528 288369 82146 16847 303148 195417 88872 179515 454374 163399
17180 361751 364357 -13668 333802 218942 252681 -320612 123887 506077 254131 300656
17170 300656 302191 -190820 -37371 209620 11172 437639 -33442 381679 -175864 83701 116696
17159 116696 470745 227290 603140 76890 581976 200954 383323 219020 -24539 -6338
17148 323480 174367 221606 193932 247023 135658 165889 56879 -24950 257500 229320 358952
17137 358952 614108 -4191 -75015 357747 299733 486718 240642 -142690 143928 533500
17127E33500k30449J43457A08424M29993k13648r0441K8121R5497m5717b15158
17116C84431G2579N3382K7042F8507J43994p9377J86408l6713j09398M75107C03424
17104I0091L07479j87828n0904m5927E2863a8441A39081K68798H4981J69377N3576
17093C07934l2666k4374M5992B4518N69887j74375K26585B15602P7778C1686M47727
17082D79413p6247P6605k09344J26398J2838P9260n9206J05565j45890A34727
17071B67663K9042O6687N8379J35601j98023K03021B11284J49278K26642A78453
17060F10215j7488k22528J41635J47748j60303k49092L49637j49354m1454j52580
17050B56436m5513J738J15123j14929K20906J73996k29776J03449j19713k1545
$$ plain form
17127 533500 303051 446508 108424 538417 324769 234328 262449 357946 312229 -215158
17116 384431 72579 125961 153003 68507 212501 133124 319532 282819 173421 648528 303424
17104 90091 397570 209742 158838 112911 52863 -18441 139081 407879 84981 254358 307934
17093 307934 275268 250894 296886 24518 594405 420030 646615 215602 293380 31686 479413
17082 479413 403166 479771 270427 396825 409663 488923 429717 535282 389392 134727
17071 267663 296705 363392 421771 557372 359349 562370 211284 360562 587204 178453
17060 610215 592727 370199 511834 659582 499279 250187 599824 450470 409016 256436
17050 256436 210923 212661 327784 212855 433761 607757 377981 481430 361717 340172
17040C40172j5J05586n8116J54069j2900B14754N12957C30767J94831j37867R5220
17029D82951j93181K15365j79944M11191l22419j31591K11465B26351N9950A03496
17018C89961r1054L54561K32700D15347J94430j83719L47060O538l45738K9071
17008D62989M26271r6593q8935B77755K73387q7711J83714j568J21897o7437J77728
16997H77765k20625l8354K00122C08522L41485J64141k07208O7700j20567p6855
16987D77218J6248K60074l56102K61577J98825C41963K19882N612j94243L17271
16977F90485k442K21532D39654K58342j23305M7287k15643M08256j13155K80132
16967I81568j92884k26o9818K1039J48374J0599r7602j97844K06120K96329k00337
$$ plain form
17040 340172 340157 445743 387627 541696 528796 214754 727711 330767 525598 387731 482951
17029 482951 289770 505135 325191 736382 413963 282372 493837 226351 286301 103496
17018 389961 298907 653468 886168 415347 609777 426058 773118 779656 433918 462989
17008 462989 889260 792667 703732 277755 551142 463431 647145 645577 767474 700037 877765
16997 877765 657140 618786 818908 308522 650007 814148 606940 674640 554073 477218
16987 477218 493466 753540 397438 659015 857840 341963 561845 567457 373214 690485
16977 690485 688043 909575 439654 697996 574691 621978 406335 814591 701436 981568
16967 981568 788684 788458 718640 739679 888053 898652 801050 603206 809326 1105655 905318
16956I05318k07247Q3275K69602l92505N5431J03482p8650Q3858k5805k25134
16946E71625J55882r8138L85535n7217j42967L2443j70353M83004o5454k34348
16936H60012k10308K89489J88189K22644o07197K71897j87099K13059k33799J88755
16926I95642j85505j25623M54323K69744q6224j89197j2929J03777l31492L45344
16916A237860j9267k71707n8149L28722K56810n94969M78035j63446l48154O26640
16906A472375k64911q7791L50307j56632M1188m53805N18917l0250l46603N25317
16896A568112M0197j06167j13477j22395J25249L51699j83667j81035K92614j97844
16886A473286M49740M2576k32945k15595K33397M9290k14835J95393j1872O0948
$$ plain form
16956 905318 698071 781346 1050948 658443 713874 817356 738706 822564 796759 571625
16946 571625 727507 629369 1014904 957687 814720 847163 676810 1159814 1094360 860012
16936 860012 649704 939193 1127382 1350026 742829 1014726 827627 1040686 806887 995642
16926 995642 810137 684514 1138837 1408581 1322357 1133160 1120231 1224008 892516 1237860
16916 1237860 1218593 946886 888737 1217459 1474269 879300 1357335 1193889 845735 1472375
16906 1472375 1207464 1119673 1469980 1313348 1354536 900731 1419648 1389398 1042795 1568112
16896 1568112 1608309 1502142 1388665 1266270 1391519 1743218 1559551 1378516 1671130 1473286
16886 1473286 1923026 1965602 1732657 1517062 1750459 1799749 1584914 1780307 1768435 1829383
16876A829383K42483j50758L26937n04796M0638O1048M7816p3658M05128k11257
16866B012964L37930J28932j81265L5931k1290M26252n75821o9694J12807M668
16856B211414J26706j04499l761J48793L8033N5265N8147J45117j86172K57580
16846B746623q9009K81136m6903k96662L08182J1719j44276J35564k81515N66265
16836C191124N6676l19026K17397K58982j67801J48406r0752K76981L60059m65655
16826C466391L24753j60615L29680l1937K58825j66214j93463N72868Q1386J51881
16816D633555j70495j91796N60413n5740L07158Q3508j39621L61001k10344O8971
16806E246610L0959j00252N59760m7739L56855J81828j7795J30410K26341o0614
$$ plain form
16876 1829383 2071866 1921108 2248045 1743249 1783887 1844935 1892751 1819093 2224221 2012964
16866 2012964 2350894 2479826 2298561 2334492 2313202 2739454 2163633 2093939 2206746 2211414
16856 2211414 2338120 2233621 2229860 2378653 2416686 2471951 2530098 2675215 2489043 2746623
16846 2746623 2657614 2938750 2891847 2595185 2903367 2915086 2770810 2906374 2624859 3191124
16836 3191124 3247800 2928774 3146171 3405153 3237352 3385758 3295006 3571987 3932046 3466391
16826 3466391 3791144 3630529 3960209 3928272 4187097 4020883 3827420 4400288 4481674 4633555
16816 4633555 4463060 4271264 4831677 4775937 5083095 5166603 5026982 5387983 5177639 5246610
16806 5246610 5277569 5177317 5737077 5689338 6046193 6228021 6210226 6340636 6566977 6506363
16796F506363K17164K16698K15788L57243j6564Q8305K92565o1849O64323L45482
16786H825518j33878M40140N8211L87062L41539K62641K80067K84647J62890K65692
16776A1174529Q06127J57651K67586L70928L17174R47917O187O71168L47930O15190
16766A5682387N29631N30695P11966N60929N12696J249649N62562R44274N15334
16757B1800123J005678J453154N94455J183279R29364J695065J240165J745435
16749C1646718J288426J597833J861789J701637K527387J778913K445279K904164
16741D7752146K816009K770476L241182L739537M064781M046504M227251N282098
16733G7939984M856454O249237O043914O919613P181614P901673Q574676Q680365
$$ plain form
16796 6506363 6723527 6940225 7156013 7513256 7496692 7584997 7877562 7815713 8480036 8825518
16786 8825518 8691640 9131780 9189991 9577053 9918592 10181233 10461300 10745947 10908837 11174529
16776 11174529 11980656 12138307 12405893 12776821 13093995 14041912 14048099 14719267 15067197 15682387
16766 15682387 16212018 16742713 17454679 18015608 18528304 19777953 20340515 21284789 21800123
16757 21800123 22805801 24258955 24853410 26036689 26966053 28661118 29901283 31646718
16749 31646718 32935144 34532977 36394766 38096403 40623790 42402703 44847982 47752146
16741 47752146 50568155 53338631 56579813 60319350 64384131 68430635 72657886 77939984
16733 77939984 82796438 89045675 95089589 102009202 109190816 117092489 125667165 134347530
16725A34347530R526358R434291J0069137R987380R414976R144948Q512157P366649
16717B07803426N577150M111142K293456j52857k351123l692214n539293p310570
16709B00739117q522374q827713r805819r963309j0005202j0011135r617437q852408
16701A25133720q704703q081598p252979p149302o290726o078269n455118n069411
16693G1051614m715267m211526l656469l564964l319326l079159k916919k563291
16685D3024693k094092k247598k431746j942350j851906j649662j427108j371059
16677B8009172j282929j103220j426306j161427r21576q27478r53557j191827
16669A9140852o80912m32422p47924o39957n24948m55119r23960k83583o46331
$$ plain form
16725 134347530 143873888 153308179 163377316 173364696 182779672 191924620 200436777 207803426
16717 207803426 213380576 217491718 219785174 219632317 217281194 213588980 208049687 200739117
16709 200739117 192216743 183389030 173583211 163619902 153614700 143603565 133986128 125133720
16701 125133720 116429017 108347419 101094440 93945138 87654412 81576143 76121025 71051614
16693 71051614 66336347 62124821 58468352 54903388 51584062 48504903 45587984 43024693
16685 43024693 40930601 38683003 36251257 34308907 32457001 30807339 29380231 28009172
16677 28009172 26726243 25623023 24196717 23035290 22113714 21286236 20332679 19140852
16669 19140852 18459940 18027518 17279594 16639637 16114689 15659570 14735610 14452027 13805696
16660A3805696o23901o29448j69977o39015K29008r95346l39089K9412o11586
16651A0055754k01928m45061k82221m50830l05719J89789n84318N1567l57809
16642G669224k73387j80243J42667k10195o49778L4369j65487k44829j60190o8162
16632E893989P7358j37679j30771j65165j27575j4957q76495M12078j50270k42911
16622D537602q1898k02560J84206k16341N68m10124j14998L27486l02556q1503
16612C639882K47541l36665n6239k00831K98034n66083P9380J57877N2116l69953
16602B945059L80937k58268k35904l02691R9264K9499k21475J63282J7421K6245
16592B643369m2290k22783M6989L0799j42576M37912o62796L59262j47806j55150
$$ plain form
16660 13805696 13181795 12552347 12382370 11743355 11972363 10977017 10637928 10667340 10055754
16651 10055754 9853826 9408765 9126544 8675714 8369995 8559784 7975466 8027033 7669224
16642 7669224 7395837 7215594 7358261 7148066 6498288 6532657 6367170 6122341 5962151 5893989
16632 5893989 5971347 5833668 5702897 5537732 5410157 5395200 4518705 4930783 4780513 4537602
16622 4537602 4455704 4253144 4437350 4221009 4221577 3811453 3696455 4023941 3721385 3639882
16612 3639882 3887423 3550758 3494519 3293688 3591722 3025639 3105019 3262896 3315012 2945059
16602 2945059 3325996 3067728 2831824 2529133 2628397 2657896 2436421 2599703 2617124 2643369
16592 2643369 2601079 2378296 2425285 2456084 2313508 2751420 2088624 2447886 2300080 2144930
16582B144930j76865K18185j75552l60053p4412K72184K56649k09487O3348m05355
16572A553572M90734p3113l35314j16289j32461L17928J1386K3838m15720K6596
16562A351157K94601m29518J76064K75047k88992k28269J69797k31732L29824
16553A417979k2128J52309m01662L08461o2806m49767K26202m5699K47663l57656
16543A012896L67168k56133L21169r9427m56857L87596j9900p6961j6968l40875
16533H21708M07564k33031n3429J81031n44722M33788l7695K08054l88766M3236
16523H37738J1391R2687k84870N34595J25176l99777J0261J11350j19413m2575
16513H76563k27675J32533J4080j54458k03245L08387m3427k95253K49610A74380
$$ plain form
16582 2144930 1968065 2186250 2010698 1650645 1576233 1848417 2105066 1895579 1958927 1553572
16572 1553572 2044306 1971193 1635879 1519590 1387129 1705057 1716443 1740281 1324561 1351157
16562 1351157 1645758 1216240 1392304 1667351 1378359 1150090 1319887 1088155 1417979
16553 1417979 1395851 1548160 1146498 1454959 1392153 942386 1168588 1122889 1370552 1012896
16543 1012896 1380064 1123931 1445100 1345673 888816 1276412 1256512 1179551 1162583 821708
16533 821708 1229272 996241 942812 1123843 579121 1012909 975214 1183268 794502 837738
16523 837738 849129 941816 656946 1191541 1316717 916940 927201 1038551 919138 876563
16513 876563 648888 781421 795501 641043 437798 746185 702758 407505 657115 174380
16502E87655J31582p6711Q3287k35840K08467k87881J48774K20169K1128l28201
16492D72429J51776K9895N1354j2826k26842K72011B51762J70078K83697j17040
16482E88497B41425N70548C76938N2697J33588A89745M40625k34836M0590J6486
16472D52610m2410p5889K59404B78268N45913j16720j93418q5528l4117J84115
16462E78513q9673j087j43979K21795N0292B08514M27172j33301k0637Q1921O3434
16451F27103B36079l669K16688A44722K10178A56597L53415j25351p2573m7842
16441B64246k8540J41133J98078j53842A84318G1208M46794m0163Q1744p1332
16431D88251k33506N74910k97480H7559J19081M6791K67255j17505C8019K24203
$$ plain form
16502 587655 719237 642526 725813 489973 698440 410559 559333 779502 800630 472429
16492 472429 624205 654100 705454 692628 465786 737797 251762 421840 705537 588497
16482 588497 241425 811973 376938 429635 563223 189745 630370 395534 436124 452610
16472 452610 410200 334311 593715 278268 824181 707461 514043 428515 394398 578513
16462 578513 488840 487753 343774 565569 615861 208514 635686 502385 481748 563669 627103
16451 627103 236079 232410 449098 144722 354900 156597 510012 384661 312088 264246
16441 264246 235706 376839 574917 421075 184318 71208 518002 477839 559583 488251
16431 488251 254745 829655 532175 87559 206640 253431 520686 403181 38019 262222
16421B62222c3941A10160J15643Q0240N8020J02336f5364B12425J32826A22747
16410A78545O488J38988r7906m6958J30793J28927O2464A69160L30854j13759
16400C86255j84460O3551J38845k3703j69104L67039A640K35231J00496l5133
16390C02234J25640e3858C97625A38021K89669A80972p7407K46287d4573F5540
16379D23524D8899Q1484Q5810J28777i2248F46259i5899D6893M33663A80520D6088
16367A64402j097q0967M50701l6714a68475I5848c612A51548J15840o8099b68730
16355C10450E4086L76216j57236L41387a34322B24984H9211C8761M9236f083I3288
16343B02763L5302Q4820h8848A27636j8276a30443C09806b16019b3963j3051C47910
$$ plain form
16421 262222 -33941 110160 225803 306043 364063 466399 -65364 212425 345251 122747
16410 178545 185033 324021 226115 179157 309950 438877 501341 169160 500014 386255
16400 386255 201795 265346 404191 380488 211384 578423 1640 236871 337367 302234
16390 302234 427874 -53858 397625 138021 427690 180972 103565 349852 -44573 65540
16379 423524 48899 130383 216193 344970 -92248 646259 -95899 46893 480556 180520 46088
16367 164402 163305 82338 533039 496325 -168475 95848 -3612 151548 267388 199289 -268730
16355 310450 54086 430302 273066 614453 -134322 224984 89211 38761 87997 -6083 93288
16343 202763 238065 322885 -88848 127636 109360 -130443 309806 -216019 -23963 -37014 347910
16331a2960C95316e4871B21891m1435E4015h5720B39892J41789E7976A9971a7431
16319b70447A97232r2093l7065Q2677k5891f853C66070A34067a65693n1537i1804
16307e3223A65476q2655J52834a27616B96713F3606R3384P8130c220k58445N2885
16296b08780E8533g7411A05319J4381B433L7580C755a36149A01163A0653i9981
16284A55940J26592m3847j7318O2167A11264c62504B55397H4178M3472b8290D9126
16272B32626g7792D7028J14999a97642B1468L6000a95101P0453B31008e6063j46856
16261b02919R3643H3881R6676o7038M3611J85202F6185c1316o7638B31688a36734
16249C4661L7354B8168K52778m5336a10808j79500A70477K3795b67986A00742
$$ plain form
16331 -12960 395316 -54871 221891 180456 54015 -85720 239892 381681 57976 19971 -17431
16319 -270447 197232 105139 68074 150751 124860 -6853 366070 134067 -165693 -217230 -91804
16307 -53223 165476 82821 235655 -127616 296713 63606 156990 235120 -3220 -261665 -208780
16296 -208780 58533 -77411 105319 119700 2433 40013 3755 -136149 101163 10653 -99981
16284 155940 282532 238685 221367 283534 111264 -362504 255397 84178 127650 -28290 49126
16272 232626 -77792 47028 162027 -197642 21468 57468 -195101 -124648 231008 -56063 -202919
16261 -202919 -109276 83881 180557 113519 157130 342332 66185 -31316 -98954 231688 -136734
16249 34661 72015 28168 280946 235610 -110808 -290308 170477 194272 -267986 100742
16238a52726H2480j1779h5336b0349q5638B02762G0744B6944c9684j93095i4386
16226A1959Q4993K77002A86837f0652J773D8138A1313c69894B87063b56100J5558
16215b40542D40204c11094E0858J78797a17128I5829O8703C4422c4268A80381
16204A28953a41647f855B7433J5273h3835A0850h8072A78506g9801H5267b1106
16192B57165g3434m185B2067b3789B92838E8792M1502J38050f2113A18620J50726
16181B69346j13110a4830l3124k37532A66151D8752N6314c4375n0946j04475A42397
16169A90608H3184L0551L11011D6016g9138G197a20533l44969K31767A34781g1658
16157A28760P5416b06670l6861C99815b30601F3720b96732G0380G7c18013A82266
$$ plain form
16238 -152726 82480 70701 -85336 -20349 -105987 202762 70744 26944 -39684 -232779 -94386
16226 11959 96952 373954 186837 -60652 -58879 48138 11313 -369894 287063 -256100 -240542
16215 -240542 440204 -311094 50858 229655 -117128 95829 164532 34422 -34268 180381
16204 128953 -141647 -6855 27433 42706 -83835 10850 -88072 178506 -79801 85267 -21106
16192 257165 -73434 -77619 22067 -23789 292838 58792 100294 238344 -62113 118620 269346
16181 269346 156236 -14830 -47954 -285486 166151 48752 105066 -34375 -85321 -189796 142397
16169 190608 83184 113735 424746 46016 -79138 7197 -120533 -465502 -233735 134781 -71658
16157 128760 204176 -206670 -243531 399815 -230601 63720 -296732 70380 77 -318013 182266
16145b90683B22851M3350F3551h8511k39651i9737k8468G3368a57230r3294j54448
16134d04972b8808B42167f16825A50887E3310R5399M1352c26678d10A10318A6240
16122A9722g9504A00293d91075K27992R9011i658E8661N4485L4715K08895A58520
16110D416K52925a58512H4113b08807g686k9072D28123j63451M5518I5400J35622
16099B31022r1490a46047B68602B9937f633I7421B1252J64802e0196F1312M1187
16088A02499a25373a7815o9455k61050A05941b12917h1032A1528a75452q6959
16078b62411j31409A90265p2340c26100A31434a17342j76778A0434a05381j77814
16068b83195C0743e6469a7345j7360A61082d4071B21390d9085j1278A19778d11165
$$ plain form
16145 -290683 222851 266201 63551 -88511 -328162 -99737 -128205 73368 -157230 -250524 -404972
16134 -404972 -28808 242167 -616825 150887 53310 148709 190061 -326678 -410 110318 16240
16122 19722 -79504 100293 -491075 -263083 -164072 -9658 58661 113146 147861 356756 158520
16110 4416 257341 -158512 84113 -208807 -7686 -36758 428123 264672 310190 95400 231022
16099 231022 139532 -146047 268602 29937 -6633 97421 21252 186054 -50196 61312 102499
16088 102499 -125373 -17815 -87270 -348320 105941 -212917 -81032 11528 -175452 -262411
16078 -262411 -393820 190265 117925 -326100 131434 -117342 -294120 10434 -105381 -283195
16068 -283195 30743 -56469 -17345 -34705 161082 -44071 221390 -49085 -60363 119778 -411165
16056G2550b06905O2568A12031a0027j76801n98l0759b3909j05421A66765b27448
16044B89664b36144g4790o4034j98588a16331A38142a08863j17701b0508D1914
16033d2577k66616B02564d130B2348a74715j57778M5052d6420F4360O81a5379
16021f8285j142A34222a20439J4973k005l11876a74496I362J57133b7453F0575
16009e0705j82298a5969j09942A8513a43082C13411D341J5930J6859b38934D2437
15997b17007p0736E0930b4712F5159J89672F3026h8014j4238A33726K49411a64686
15985b58521B47292m8858r6024P3621f5288D11804m2604G3757b45302N5115D2637
15973A55088e668B34076p895C6811f8579I4622J49858b6301E4345b43488C2752
$$ plain form
16056 72550 -206905 -144337 112031 -10027 -186828 -187426 -218185 -23909 -129330 166765 -227448
16044 289664 -236144 -74790 -138824 -337412 -116331 138142 -108863 -226564 -20508 41914
16033 -42577 -309193 202564 -4130 22348 -174715 -332493 -287441 -46420 64360 65041 -15379
16021 -68285 -69427 134222 -120439 -105466 -107471 -419347 -174496 9362 166495 -27453 60575
16009 -50705 -233003 -15969 -125911 18513 -143082 313411 4341 20271 37130 -238934 42437
15997 -217007 -287743 50930 -24712 65159 254831 63026 -88014 -102252 133726 383137 -164686
15985 -258521 247292 198434 102410 176031 -65288 411804 369200 73757 -245302 -190187 42637
15973 155088 -5668 234076 226181 36811 -68579 94622 244480 -26301 54345 -243488 32752
15961A59348n4372K5409j4234b32194k19331b5587m4489I9139a05837P229l363
15950a01971K7119A00800b62661B1763d36998O2962e920I4550m6142g2300l42158
15939d14458a61580j07049R5208K2827M7079k06966r4217B58725p5615e5246I3560
15927D5992g3648o8636I1733a60391n003B21639a30103o3874C6167a88533A28085
15915b00934Q6133k3635D0796b72974B5634a09207A02172l3347l4269b4929p5906
15904a00835B7347A2363b36470E9143b98872A78760a12303J9283a9715B21927
15893B32797j9631a22686N0941C4678f0555b8359k36182M1682D4270a73284D8607
15881c50685D0743a01185A07149f5971A8395a27920j11287L9588f3690H8679c25208
$$ plain form
15961 159348 104976 130385 116151 -232194 -451525 -25587 -70076 99139 -105837 -98608 -101971
15950 -101971 -74852 100800 -262661 21763 -436998 -374036 -5920 94550 48408 -72300 -414458
15939 -414458 -161580 -268629 -173421 -150594 -103515 -310481 -404698 258725 183110 -55246 93560
15927 45992 -73648 -142284 91733 -160391 -165394 221639 -130103 -193977 36167 -188533 128085
15915 -200934 -114801 -138436 40796 -272974 25634 -109207 102172 68825 34556 -24929 -100835
15904 -100835 27347 12363 -236470 59143 -298872 178760 -112303 -93020 -19715 221927
15893 232797 213166 -122686 -71745 34678 -60555 -28359 -264541 -222859 44270 -173284 48607
15881 -350685 40743 -101185 107149 -65971 18395 -127920 -239207 -199619 -63690 88679 -325208
15869b45926r747I6345k706h7163B72306i8120D0833e1232G7185J18531K9318
15858B25034a1085I1405a68996k8460j47079A58672l9020h1892M35B84954G5338
15846B43481d6157k23412B67724A2399a7896l2087A44853b92329F4363R6462E9637
15834h8493l5449n7732A7272a60666n0530P8502J2557a026m48885c9334j23289
15823a62623g0272J1637A22462K28021f9071j29746J4348I0832l6162a64570N5986
15812a08584N2464A50004a61993G3693b0793l25431R3528i6244p9348b5810D5357
15800C3548b06912B10533a54161j6309e9817A29613a87674j01182A4968a33505
15789a20305E4028e1028p0866m1085g9495a29p4308p9109j96320A05663a67010
$$ plain form
15869 -245926 -255673 96345 93639 -87163 272306 -98120 40833 -51232 77185 195716 225034
15858 225034 -11085 91405 -168996 -197456 -344535 158672 119652 -81892 -81457 284954 75338
15846 243481 -46157 -269569 267724 12399 -17896 -49983 144853 -292329 64363 160825 59637
15834 -88493 -123942 -181674 17272 -160666 -211196 -132694 -120137 -1026 -449911 -39334 -162623
15823 -162623 -70272 -58635 122462 350483 -69071 -198817 -184469 90832 54670 -164570 -108584
15812 -108584 -56120 150004 -161993 73693 -20793 -346224 -252696 -96244 -175592 -25810 45357
15800 33548 -206912 210533 -154161 -170470 -59817 129613 -187674 -288856 14968 -133505
15789 -120305 54028 -51028 -121894 -162979 -79495 -129 -74437 -153546 -349866 105663 -167010
15777A09334a9410A40301j3144a40784A06036a34667A58218a50717B66577h8514
15766B39502p3761b7412D4824a62777h455l35439e0004j3194A41050l5971d2295
15754a50208f4564r5418B51092r8048b88451B64792f5643l0949a1263B11154F0290
15742d5859C15698j40776M0698b48000i4609j55067d6303A77143b5193q0388C74602
15730a83027j0381H8987m0911b7129k24768K9223c1503B07531m2973b38995H9380
15718a6558j36845C13403A01376D3171d4939l57007h1787A65578J0356e6532C19633
15706a59783g3437p0041M6991B609K37761f0653I6175a67852a7291j55027k07839
15695c80157G0759J62560o2690c4893p9001A7790a5632j53210j07338L588O8685
$$ plain form
15777 109334 -19410 140301 127157 -140784 106036 -134667 158218 -150717 266577 -88514
15766 239502 165741 -27412 44824 -162777 -8455 -343894 -50004 -63198 141050 105079 -42295
15754 -150208 -64564 -159982 251092 153044 -288451 264792 -65643 -96592 -11263 211154 60290
15742 -45859 315698 174922 215620 -248000 -94609 -249676 -46303 177143 -25193 -105581 374602
15730 -183027 -193408 88987 48076 -27129 -251897 -222674 -31503 207531 164558 -238995 89380
15718 -16558 -153403 313403 101376 43171 -44939 -401946 -81787 165578 175934 -56532 319633
15706 -159783 -73437 -143478 -96487 2609 240370 -60653 96175 -167852 -17291 -172318 -380157
15695 -380157 70759 233319 170629 -34893 -113894 17790 -15632 -168842 -276180 -272592 -203907
15684b03907K961B093J49041a73659e3270B842c72845f7312K4103C3285h9654
15672G2443A5802J49038N6813a2735B53605G2432b21445P9316e6830k85456D0533
15660b15283G4519K18711I3599b8286A22017c4890j15233A83430f1284a9566c724
15648B4081b75985f3093E3464a31481C38378a92421D63512b1059H147h1415j1443
15637i2858k54026A03430q450L2848n4448J6077b73219I197a55517N4607A65287
15625A07314R4842J5233F5934Q5662e1754B20708p5489Q3441b80891A67677H1741
15613a56021N3857A8254a68014e6455C27847a16956N4102G1770a88354b7036k0557
15602d7593C8337r028g5338A31274n9130h4430j14916e6754B32113b66151A36276
$$ plain form
15684 -203907 -200946 2093 151134 -173659 -53270 2842 -372845 -67312 -43209 33285 -89654
15672 72443 15802 164840 221653 -12735 253605 72432 -221445 -142129 -56830 -342286 40533
15660 -215283 74519 293230 93599 -28286 122017 -34890 -150123 183430 -61284 -19566 -3724
15648 24081 -275985 -63093 53464 -131481 338378 -192421 463512 -21059 8147 -81415 -92858
15637 -92858 -346884 103430 94980 127828 73380 89457 -273219 9197 -155517 -100910 165287
15625 107314 202156 217389 65934 151596 -51754 220708 145219 228660 -280891 167677 81741
15613 -156021 -102164 18254 -168014 -56455 327847 -116956 -62854 71770 -188354 -27036 -47593
15602 -47593 38337 29309 -75338 131274 72144 -84430 -199346 -56754 232113 -266151 136276
15590f5619A4479d7046F3011a39892m9934c7879Q623l0587k6832j9840C05471
15578A16735L68961B22222H173a13098j07279A15430b31799j7797a24785A80391
15567a87213B15317A02200f2020D8827P6240P3494E6588j0514J19910I736a55635
15555I3414a087C00865e2679k60734d8681j47600A26347L7464a47152k0514B8117
15543B4565p467m281a57580E4209e8371A12228M9611k066b250p9084c4182k81320
15531c15502A17766c9361B06772b5720C06131M4825A14556C5836b10115H395K78493
15520B86888a95960B11191b3234j46623O750E6542a46392e7388J2356A61517F4711
15508B62438i503k72141h2089b8359A82545a4447k67348J35029f197A78257a81335
$$ plain form
15590 -65619 14479 -47046 63011 -139892 -189826 -37879 -29256 -59843 -86675 -106515 305471
15578 116735 485696 222222 8173 -113098 -220377 115430 -231799 -249596 -124785 180391
15567 -187213 215317 102200 -62020 48827 125067 198561 56588 46074 165984 9736 -155635
15555 93414 -1087 300865 -52679 -313413 -48681 -196281 126347 163811 -147152 -167666 28117
15543 24565 17098 12817 -157580 54209 -58371 112228 161839 159773 -2250 -81334 -34182 -315502
15531 -315502 117766 -39361 206772 -25720 306131 350956 114556 35836 -210115 8395 286888
15520 286888 -195960 211191 -23234 -169857 -163107 56542 -146392 -57388 -45032 161517 64711
15508 262438 -9503 -281644 -82089 -28359 182545 -14447 -281795 -146766 -6197 178257 -181335
15496b53054a6206d069j92210j43756A39469a95292j52421b7535j68485L8658
15486a57362k2284L6099j50609B25019E4987N7944a30860A32089R7048d0228E9823
15474a48021A47463b45516a526j53362M170B19391b29931n1205B39514d0257B2938
15462G9105k79M8444P04C7112j1319Q3979A7533M39L7218L9652a38096r8049L507
15449b32638e0361k23254J25871A28634e2313A03547Q3401c36633D4959a7481
15438f4671d77k16919A58075a31991k7781M0574a7078B2671J44912b7161l8800
15427f5961k13204A85877p1092h5855B49460k2337C9575b30047n3230B3415a526
15415b96547J30748A22644c65457h5222j23374C8135K7898R8896b49063R3909
$$ plain form
15496 -253054 -16206 -4069 -196279 -340035 139469 -195292 -347713 -27535 -196020 -157362
15486 -157362 -179646 -143547 -294156 225019 54987 112931 -130860 132089 229137 -40228 59823
15474 -148021 147463 -245516 -1526 -154888 -150718 219391 -229931 -281136 239514 -40257 22938
15462 79105 78826 127270 127974 37112 25793 109772 17533 17972 55190 94842 -138096 -236145 -232638
15449 -232638 -50361 -273615 -147744 128634 -52313 103547 186948 -336633 44959 -17481
15438 -64671 -477 -217396 158075 -131991 -159772 -119198 -17078 22671 167583 -27161 -65961
15427 -65961 -279165 185877 114785 -85855 249460 227123 39575 -230047 -283277 23415 -1526
15415 -296547 -165799 122644 -365457 -85222 -208596 38135 66033 164929 -249063 -155154
15405a55154c9171n5005C35647a22877E3293J06131e1656B86256b76814A20711
15394B60181e2726n09218G260a89966B99944A08969K50712G0883c1846D5361a54199
15382A53409h4181m1919C67643f0636A65303a77047n0930J07421l073E8664J42957
15371B01621E4104a7784E5456c48541E1504J71961D8169b78476R9394K872h0134
15359A46713J67254a14745k5154A55484c2907E3291L01477A5766J85875k803d3145
15347F4238G183L0389c99776B39898a12511k7438A06335A908c07304j3020E8594
15335E7444p981a12900k73751A53324b07958f6836B2231Q3364j9454b00905B1214
15323I4239a53094B26697b3594j86546j64557A22048J1479k1925a1419A26501
$$ plain form
15405 -155154 -39171 -94176 335647 -122877 53293 159424 -51656 286256 -276814 120711
15394 260181 -52726 -561944 7260 -189966 299944 108969 359681 70883 -31846 45361 -154199
15382 153409 -84181 -126100 367643 -60636 165303 -177047 -227977 -120556 -123629 58664 201621
15371 201621 54104 -17784 55456 -348541 51504 223465 48169 -278476 -179082 -176210 -80134
15359 146713 313967 -114745 -139899 155484 -32907 53291 354768 15766 201641 198838 -43145
15347 64238 7183 37572 -399776 239898 -112511 -139949 106335 1908 -307304 -320324 58594
15335 57444 49463 -112900 -386651 153324 -207958 -66836 22231 105595 86141 -200905 21214
15323 94239 -153094 226697 -23594 -210140 -374697 122048 133527 111602 -11419 126501
15312e5945D8662e2995o6054f991A29630A7551a0198j4629A32982l1161c9511
15300b5035A60556o1240J00282J06049g4256j0569m0162j5676E5714J41890J53507
15289C51111g1086C66983A72736l503R51H4308J63251K3829A9401c15866R8571
15278b17295A23026a72264A26385J77219m4155H8758N5961C0026K52993a27466
15267H8122J72280a19041e8467k80689A25146D6122L18406A32828a02990q5088
15257a88078A32661J49194r1914L9762m0258J71551J7564H3518J26250J504593
15247A714361p56005J94305P25863G68197C59298q1856j26677B9L57248A08497
15236B6084a49286J3631g113k97506A88447d42548G0067g2408E6592L430P6498
$$ plain form
15312 -55945 48662 -52995 -119049 -6991 129630 17551 -10198 -24827 132982 101821 -39511
15300 -25035 160556 99316 199598 305647 -74256 -84825 -124987 -140663 55714 197604 351111
15289 351111 -71086 366983 172736 169233 170184 84308 247559 271388 19401 -315866 -217295
15278 -217295 123026 -172264 126385 303604 259449 88758 144719 30026 283019 -127466
15267 88122 260402 -119041 -58467 -339156 125146 46122 364528 132828 -102990 -188078
15257 -188078 132661 281855 189941 229703 189445 360996 378560 83518 209768 1714361
15247 1714361 958356 1152661 1878524 768197 359298 277442 150765 29 357277 108497
15236 26084 -149286 -135655 -7113 -304619 188447 -442548 70067 -72408 56592 60022 136520
15225A36520J08591G284Q6712L16423d1723j68793j7330a0930q4965d4490j11254
15214a55744f8647j07440B94250H9559K7066b82894C43211c3510p6557A31545
15203a91710B62627b6122A75348a86242C23624D4790e5521A27062J03431f862
15192F8483a85985L4241B5651b3268A13610a09104B09557C4405c4856i927r3231
15181a03158J5087M0645m53019A05869a0232j50349r7408e9812m9992b4376C30868
15169f7016K3521E7832O4045m1695L8549F36K29077J62428C9787L32952A24971
15157H6978K41288j30886i3746C8253K77007B2837b32722H1250J46611B707a51824
15145g3469A49669J04694g1237r0189A63996E1429N555J08557C9253A8359M07531
$$ plain form
15225 136520 245111 7284 93996 410419 -41723 -210516 -227846 -10930 -95895 -44490 -155744
15214 -155744 -68647 -176087 294250 89559 116625 -282894 343211 -33510 -110067 131545
15203 -191710 262627 -26122 175348 -186242 323624 44790 -55521 127062 230493 -6862
15192 68483 -185985 -151744 25651 -23268 113610 -109104 209557 34405 -34856 -9927 -103158
15181 -103158 -88071 -47426 -500445 105869 -10232 -160581 -257989 -59812 -109804 -24376 330868
15169 -67016 -43495 57832 121877 80182 118731 636 229713 392141 39787 372739 124971
15157 86978 328266 197380 -93746 38253 315260 22837 -232722 81250 227861 2707 -151824
15145 -73469 149669 254363 -71237 -161426 163996 51429 56984 165541 39253 18359 425890
15134D25890a3539A38047c79B49504o5632n6419F3231J00456m3849d19598I884
15122B40685B163a2511A36608M50589B85886D2712e1154D5383R0949O6085b73189
15110a12496m4218l4875A31069a09240B06864E6101a89184e9881B87003B4005
15099C15039j30165b7520A44113a76037d5642C53534e3012F8261b38193A61969
15088b3339B77164g9156A72119a83270h2426A88791J4478E19e9010j06311B54464
15076D7808a42913C86106B9901L23507F678N518c1970A42402J18660A17932m3982
15065G3950r842i6732E2143g1050G9516N3830J33417j22261r473a5983B59251
15053B40353a42133C4542a33439A07508J1568g1637A84300J25386b31579B78937
$$ plain form
15134 425890 -13539 138047 -379 249504 183872 127453 63231 163687 119838 -419598 9884
15122 240685 2163 -12511 136608 587197 285886 42712 -51154 45383 136332 202417 -273189
15110 -112496 -156714 -191589 131069 -109240 206864 56101 -189184 -59881 287003 24005
15099 315039 184874 -27520 144113 -176037 -45642 353534 -53012 68261 -238193 161969
15088 -23339 277164 -79156 172119 -183270 -82426 188791 203269 519 -59010 -165321 254464
15076 47808 -142913 386106 29901 353408 6678 12196 -31970 142402 261062 117932 73950
15065 73950 64108 -96732 52143 -71050 79516 133346 266763 144502 135029 -15983 259251
15053 240353 -142133 34542 -133439 107508 119076 -71637 184300 309686 -231579 278937
15042B58087B2725d2594B33865j08670B1469K68727d2178D20431F6534O6420o0056
15031G2898L12989A79219m3843M7627c9568D3339J80465o3601G9082J7936K80312
15020C77330A33014K7208a18474H6426J80354P9398j64667K97892B30633j1749
15010B18884K35372k17614J20859b0931B66096A8021J98474J2709j1456J42686
15000C60434r7745A28947Q1100r6883B8852K10241r1764O5276q4895K50271j62970
14989B15011R4017D1521J07072R4552F6952Q0940J27500D3446M0207J39880m1903
14978A81630K53238j77804j1712L8303A1101K79069h2832a7411E9180L76053R9251
14967E34484B50899n4494O2681F0555N15716A07079I899N39720j78124J8924h7344
$$ plain form
15042 258087 22725 -42594 233865 125195 21469 290196 -42178 420431 66534 132954 72898
15031 72898 385887 179219 135376 183003 -39568 43339 223804 160203 79082 97018 377330
15020 377330 133014 160222 -118474 86426 266780 346178 181511 479403 230633 218884
15010 218884 454256 236642 357501 -20931 266096 18021 216495 229204 217748 360434
15000 360434 262689 128947 210047 113164 28852 239093 147329 212605 127710 377981 215011
14989 215011 309028 41521 148593 243145 66952 147892 275392 43446 83653 223533 181630
14978 181630 434868 257064 245352 283655 11101 290170 -82832 -17411 59180 435233 534484
14967 534484 250899 196405 259086 60555 576271 107079 9899 549619 371495 390419 -87344
14955A0260M1570L28132F4884K39153n3444J42075A15251C7658L05684R8811n4428
14944C87725A83274K9015J11882K4203i0162f01A40447J31109j02870a34436O6908
14933f7528A19310L15272j49502K6412A09147J83152D0671L33001k1566A23469
14922B88766h8228B84655K54716A70347e4535A63378L86536k03406H2807L43144
14912D25951b2689D56840E2670K07307M2691q3972K2159a00657D04846H2105J12808
14901A94913J97833G760K75078O3887p1055J28648l9155G609L24311G5489J72562
14890B48051O6593E8903K54971j47281J08128q5034D2331L27375j30965M8268
14880B87009j23394H632L49716p5398K77502k27008P8743j85257R8019J46016
$$ plain form
14955 10260 51830 379962 64884 304037 250593 392668 115251 37658 343342 442153 387725
14944 387725 183274 212289 324171 348374 -90162 -601 140447 271556 168686 -134436 -67528
14933 -67528 119310 434582 285080 311492 109147 292299 40671 373672 352106 123469
14922 288766 -88228 284655 539371 170347 -54535 163378 549914 346508 82807 425951
14912 425951 -22689 456840 52670 259977 302668 218696 240855 -100657 404846 82105 194913
14901 194913 392746 7760 282838 346725 275670 404318 365163 7609 331920 75489 248051
14890 248051 314644 58903 313874 166593 274721 189687 42331 369706 238741 287009
14880 287009 163615 8632 358348 282950 560452 333444 412187 226930 324949 470965
14870D70965f1067C51531j7328j8578J41422q5279G8853K84789N5696j16230r277
14859B93831p3634K18979q9419j4563d9004B01137K77540B25777K1165J43945
14849C90887q4775N3429J42131B06535N10964B22890r8324O8089J3940J10140
14839C16735A41762K11057j3686L03887B04070J96374A32919O57558A88391L98131
14829E86522k54174K32671o4891J09587k15700A30576L52610k26311K91811A96638
14818B06511K72696L2608l5838k8159r5058J75454H2920N52862A08850O89586
14808G98436l79006J4186M0646k7212M9765m6160j17107K02901r6284J62262j58161
14797D44266A83337K73372A81447M95379l06726J56277O9306O5904q0542j84358
$$ plain form
14870 470965 -61067 351531 334203 315625 457047 371768 78853 363642 419338 303108 293831
14859 293831 220197 439176 349757 335194 -49004 201137 478677 225777 246942 390887
14849 390887 306112 359541 501672 206535 717499 222890 124566 192655 206595 316735
14839 316735 141762 352819 339133 643020 204070 400444 132919 790477 188391 586522
14829 586522 332348 565019 500128 609715 394015 130576 483186 256875 548686 196638
14818 206511 479207 511815 475977 447818 352760 528214 82920 635782 108850 798436
14808 798436 419430 433616 474262 447050 496815 450655 333548 536449 440165 602427 444266
14797 444266 183337 456709 181447 676826 370100 526377 595683 661587 581045 396687
14787C96687A40310J66535M29250A77768M51800J08419j25753J7913j34399j47809
14777C47939J83161j14102J109k3744r6643J39912J92308j24039R1127j93857
14767D03171p7848N11088j18460K4096j97812B67651J29129K55520B79325P05421
14757I84746C22036K38422K79548l35576P8604K9366k59863J63111R4670B96930
14746G54226r8994k50582k9931L34900k71267j46348M73689k16744J2680m4549
14736E17080K63883k36239j02085M20640J20039m53797k27570J19751J13679L62368
14726H97749k45684j06078M09333l88110J48505M9919k28710K42588j77976P3469
14716F75005P9171J73830k1526k47405K867L0645J29739l14288L41834l14199
$$ plain form
14787 396687 140310 306845 736095 177768 629568 737987 612234 630147 495748 347939
14777 347939 531100 416998 418107 394363 297720 437632 629940 505901 597028 403171
14767 403171 325323 836411 717951 742047 544235 267651 396780 652300 279325 984746
14757 984746 322036 560458 840006 504430 583034 612400 352537 515648 610318 296930
14746 754226 655232 404650 374719 709619 438352 292004 765693 548949 561629 517080
14736 517080 780963 544724 442639 863279 983318 529521 301951 421702 535381 897749
14726 897749 652065 545987 955320 567210 715715 765634 536924 779512 601536 675005
14716 675005 754176 928006 906480 659075 661942 692587 822326 508038 849872 535673
14706E35673q197L97534k03944P4386C74249M38372J10694k76964K26078K26848
14696A099277j60922k13014J78482K38298m21942j39280p1803k2682L86227C45247
14685A221481k89205m1060l06965J10658L09259K71349E84641K39159J70846j28265
14675H66381n959K41580m63081L40577j40908k14587L36544l158j02172J27350
14665I82567k77888K59947l89503L03305M0670j57229J98491J57131m65479O11196
14655A263208l00780Q1533N2044j17138n1430j07328M87127j83364j0110j0512
14645A103250j43847R2713J39342r4414J66421j77961o4994j3870K4601k72050
14635G59191K75718M7546J33197j1380M7756O1773j23735j95262K11227k918r5486
$$ plain form
14706 535673 527476 925010 721066 795452 374249 812621 923315 646351 872429 1099277
14696 1099277 938355 725341 903823 1142121 720179 580899 509096 486414 872641 345247
14685 1221481 932276 891216 584251 694909 1004168 1275517 584641 823800 994646 866381
14675 866381 860422 1102002 638921 979498 838590 624003 960547 957389 855217 982567
14665 982567 704679 964626 575123 878428 919098 761869 960360 1117491 652012 1263208
14655 1263208 962428 1043961 1096005 978867 927437 820109 1307236 1123872 1113762 1103250
14645 1103250 959403 1052116 1191458 1097044 1263465 1085504 1020510 1006640 1031241 759191
14635 759191 1034909 1082455 1215652 1204272 1252028 1313801 1190066 994804 1206031 1203113 1107627
14624A107627n4649K26891j31186K69648m40519K42910P7397n5723j52540J09775
14614A199631k33274L35469n3811L75993n0802n2355J10053l68699j54764K32919
14604A340360P6943J95950l98833J80062j13460p8304Q7346K1738J560J65430
14594A478792k9483L21535r5020k3355L5876j20797K1715L60205n89504M68884
14584A828848l33442M79768l1290n94393K93103M8595k25856K06899M9466q5490
14574A636208L07426j74473r6699J56342N938J89996j52642J99819m4213L88830
14564B416532p1146j18318k4096L36200j56344J46447n42057P73114L70820n89341
14554B541811L16882J63486L46195N13543O31293J746742L537719Q679495K0098006
$$ plain form
14624 1107627 1052978 1279869 1148683 1418331 977812 1220722 1298119 1242396 1089856 1199631
14614 1199631 966357 1301826 1248015 1624008 1573206 1520851 1630904 1262205 1107441 1340360
14604 1340360 1417303 1613253 1214420 1394482 1281022 1202718 1290064 1311802 1313362 1478792
14594 1478792 1449309 1770844 1675824 1652469 1688345 1567548 1589263 1949468 1359964 1828848
14584 1828848 1495406 1975174 1943884 1349491 1642594 1691189 1465333 1672232 1721698 1636208
14574 1636208 1943634 1769161 1672462 1828804 1834742 2024738 1872096 2071915 2027702 2416532
14564 2416532 2345386 2227068 2202972 2539172 2382828 2529275 1987218 2760332 3131152 2541811
14554 2541811 2858693 3022179 3368374 3881917 4513210 6259952 9797671 18477166 38575172
14545C8575172J2722787B3066434H406972C925545j388852n83758j70212M0227
14537A822950j28263R5010k0946J16770l27475L58406l3656J05815o6173J55522
14527B077960J63272L4438J21679k71074J58808k91997q9747N45271l01403L62026
14517B509233o8132j16635j01758J95516K29982l07470o076K25273J20163p5367
14507B604729O7401q5845k58013K41135K23916J884j05927J91304J97694o06069
14497B472209L78706l13416N76143k60408J15740J01206O9773n44792Q19256k72894
14487C141523J7786J87583J22213j95347m1295O8673K2379K32585j07888L0552
14477C478764M46208l32718K00436M4382k60970k564J09890j15061M88638N6775
$$ plain form
14545 38575172 51297959 23066434 8406972 3925545 2536693 1952935 1782723 1822950
14537 1822950 1694687 1789697 1768751 1885521 1558046 1916452 1882796 1988611 1922438 2077960
14527 2077960 2241232 2275670 2397349 2126275 2285083 1993086 1903339 2448610 2147207 2509233
14517 2509233 2441101 2324466 2222708 2418224 2648206 2340736 2334660 2559933 2680096 2604729
14507 2604729 2672130 2586285 2328272 2569407 2793323 2795207 2689280 2880584 3078278 2472209
14497 2472209 2850915 2537499 3113642 2853234 2968974 3070180 3139953 2595161 3414417 3141523
14487 3141523 3159309 3346892 3469105 3273758 3232463 3301136 3323515 3556100 3448212 3478764
14477 3478764 3924972 3592254 3792690 3837072 3576102 3573538 3683428 3568367 4057005 4113780
14467D113780j01276M18704l51057p3299J8288j92547N09399L3006J05928m059
14457D476867j21868K67358k21833K07339j9934r9008K31816m1602J61727m07363
14447D433499L42284J96267J51856l1834J01019k19674M31356j3755k26273M32737
14437E597482R5262M3713K4132J30266J53691k85916N07849r0315K65495j85128
14427F256531K33204l00687L08787Q9243L28175k09964N72918k46995L02535K55315
14417G589062j10048K52586j31498K2265J45563M60808j26484J44645j22024K49837
14407H374712R1818M2705M89547j75238N70146k61866J53398J98533O59637l13662
14397I829730J68567K99050J925O0881K25290K4215N00790M0176O69208l68389
$$ plain form
14467 4113780 4012504 4431208 4080151 4006852 4025140 3832593 4341992 4374998 4480926 4476867
14457 4476867 4354999 4622357 4400524 4607863 4587929 4488921 4720737 4679135 4840862 4433499
14447 4433499 4775783 4972050 5123906 5092072 5193091 4973417 5404773 5391018 5164745 5597482
14437 5597482 5692744 5736457 5760589 5890855 6044546 5758630 6266479 6176164 6441659 6256531
14427 6256531 6489735 6189048 6497835 6587078 6915253 6705289 7278207 7031212 7333747 7589062
14417 7589062 7479014 7731600 7600102 7622367 7767930 8228738 8102254 8246899 8124875 8374712
14407 8374712 8466530 8509235 8998782 8823544 9393690 9131824 9285222 9483755 10143392 9829730
14397 9829730 9998297 10297347 10299272 10360153 10585443 10609658 11110448 11150624 11819832 11451443
14387A1451443N42838L2703L00435j32868N65812L4821M33107o3534M05120K61736
14377A3831613L58403J99030L57449M23316M10747N32239k16548L38594O62271
14368A6897114k4588M13589M07461J47679N57558L00031N10764M49984J31736
14359A9791328R33651M56206J45640L02683J046764K88565M45668R26659L30822
14350B4667986O91886N83413O64736N91215N25118J028377Q51796K68159J070899
14341C0943585Q91004N89060J136835J103709J004826Q26194J144977J335779
14333C8975969J124245J068065J170756J456439J268790J432019J676898J723238
14325D9896419J546804J760756K194137J895732J908187J996740K305872K503990
$$ plain form
14387 11451443 11994281 12026984 12327419 12194551 12760363 12795184 13228291 13164757 13569877 13831613
14377 13831613 14190016 14389046 14746495 15169811 15580558 16112797 15896249 16234843 16897114
14368 16897114 16872526 17286115 17693576 17841255 18398813 18698844 19209608 19659592 19791328
14359 19791328 20724979 21181185 21326825 21629508 22676272 22964837 23410505 24337164 24667986
14350 24667986 25359872 25943285 26608021 27199236 27724354 28752731 29604527 29872686 30943585
14341 30943585 31834589 32423649 33560484 34664193 35669019 36495213 37640190 38975969
14333 38975969 40100214 41168279 42339035 43795474 45064264 46496283 48173181 49896419
14325 49896419 51443223 53203979 55398116 57293848 59202035 61198775 63504647 66008637
14317F6008637K348959L098429K393941L192879L282904L414688L557208L316653
14309I0614298M307060M143173M092143M915894N037004N338279N574925N802994
14301A29825770O705005O861098P151402P828178Q450542R101237R205348R547024
14293A94675604J1078509J1427690J1890697J2848426J2878641J3961913J4772073
14286B83533553J5610762J5601863J5863877J6599976J6958206J6944714J6118091
14279C97231042J5999875J5241055J3764108J2672202J0528570Q825332N501076
14272D79763260M29135k277338l285243k319350n864987o120433j0125854j2364901
14264D37834289j3357796j4751732j5925807j6620510j7312147j7249305j6784174
$$ plain form
14317 66008637 68357596 71456025 73849966 77042845 80325749 83740437 87297645 90614298
14309 90614298 94921358 99064531 103156674 108072568 113109572 118447851 124022776 129825770
14301 129825770 136530775 143391873 150543275 158371453 166821995 175923232 185128580 194675604
14293 194675604 205754113 217181803 229072500 241920926 254799567 268761480 283533553
14286 283533553 299144315 314746178 330610055 347210031 364168237 381112951 397231042
14279 397231042 413230917 428471972 442236080 454908282 465436852 474262184 479763260
14272 479763260 480192395 477915057 474629814 472310464 466445477 460325044 450199190 437834289
14264 437834289 424476493 409724761 393798954 377178444 359866297 342616992 325832818
14257C25832818j6455747j5922520j4538673j4193364j4209530j3192491j2317627
14250B25002866j2009257j1226397j0592922r894876r130224q144673p850986
14243A56153531p662549p430009o637616o221612n893273n266308n132701n288820
14235A06620643m499177m394278m182669l803140l386783l466421l475331k904953
14227G6507891l263880k506241k762045k256650k613964k143794j985087j614659
14219E7361571k358134k027729j542355k121892j051416j570944p46442k004441
14211D3938218j463515j244997j320202p96934m60679j077854j479642j152284
14203C4942111r76251j136348l89878p42498r69502r97756o94046j026409k48303
$$ plain form
14257 325832818 309377071 293454551 278915878 264722514 250512984 237320493 225002866
14250 225002866 212993609 201767212 191174290 181279414 172149190 164004517 156153531
14243 156153531 148490982 141060973 134423357 128201745 122308472 117042164 111909463 106620643
14235 106620643 102121466 97727188 93544519 89741379 86354596 82888175 79412844 76507891
14227 76507891 73244011 70737770 67975725 65719075 63105111 60961317 58976230 57361571
14219 57361571 55003437 52975708 51433353 49311461 48260045 46689101 45942659 43938218
14211 43938218 42474703 41229706 39909504 39112570 38651891 37574037 36094395 34942111
14203 34942111 33965860 32829512 32439634 31697136 30727634 29729878 29035832 28009423 27761120
14194B7761120r29617n03684p37297n33277p68239n39658m99705l68500j062643
14185B1818500k42962k80349p26179k67359n27099o27272L5579m66714p03819
14176A8012326P8376q24972o2521l07266n06724j49444l69652k37975j83288l61330
14166A5087530k79680k45291l08015k22873r1249l52310p0029n16800j01936l76507
14156A2522840k71066p7112l38880R2229j8084m53466k31927J34722o85174J67459
14146A0841541k21124l10790k56533J03907L0647n12372k0605j43278k09098j11165
14136I191130l9929l72829P201q9259k22299j10386K9558l7345m48718J2264j35384
14125G784004j72630J37238n36931J42880r5947k37584K55678k20976n3784j32337
$$ plain form
14194 27761120 26831503 26327819 25590522 25057245 24289006 23749348 23249643 22881143 21818500
14185 21818500 21575538 21295189 20569010 20301651 19774552 19147280 19182859 18716145 18012326
14176 18012326 18090702 17265730 17203209 16895943 16389219 16239775 15870123 15632148 15448860 15087530
14166 15087530 14807850 14562559 14254544 14031671 13940422 13588112 13518083 13001283 12899347 12522840
14156 12522840 12251774 12174662 11835782 11928011 11909927 11456461 11224534 11359256 10674082 10841541
14146 10841541 10620417 10309627 10053094 10157001 10187648 9675276 9654671 9511393 9302295 9191130
14136 9191130 9151201 8778372 8785573 8696314 8474015 8363629 8393187 8355842 7907124 7919388 7784004
14125 7784004 7611374 7748612 7211681 7354561 7258614 7021030 7276708 7055732 7001948 6869611
14115F869611l05456k38583L77244M4760l88755J89790l32543k13190p806J47612
14105F142684l18626J94431j11321k55780K62403o15258M20535k49938j71151
14096E297979P2313n15211M37477L2698k95235P1047J36462K3498j97838r4804
14086D968386p6921J2437j2919j62894j16353j73463K57519J4130p6656m28077
14076D205189M83839l06816J3844j16308j25064n5597j84056k189O6414O6043
14066D045299m51339L79146j62266j45980J81200k6518m8016l1708L8605m04104
14056C374319M33769k21937J96381k45465l27828J75551L17754k93215Q229l19277
14046C098281m4008J55616J88483l57964K57126r3143o6782l21858r0960j16864
$$ plain form
14115 6869611 6564155 6325572 6702816 6747576 6358821 6548611 6216068 6002878 5995072 6142684
14105 6142684 5824058 6018489 5907168 5651388 5913791 5298533 5719068 5469130 5297979
14096 5297979 5370292 4855081 5292558 5325256 5030021 5101068 5237530 5261028 5063190 4968386
14086 4968386 4891465 4903902 4890983 4728089 4611736 4438273 4695792 4709922 4633266 4205189
14076 4205189 4689028 4382212 4396056 4279748 4154684 4099087 3915031 3912842 3979256 4045299
14066 4045299 3593960 3973106 3810840 3664860 3846060 3819542 3771526 3739818 3778423 3374319
14056 3374319 3808088 3586151 3782532 3537067 3209239 3384790 3702544 3409329 3417558 3098281
14046 3098281 3054273 3209889 3398372 3040408 3297534 3204391 3137609 2815751 2724791 2607927
14036B607927M95984j24714j4763Q3707Q2062k34782J29595j47383k15634J38753
14026B800752j70426j97013O1345J18767k69088K64058p657Q5113k02219j7469
14016B466163m12755K12351j25905M54808l11872m371j69931l4142P2124Q6222
14006B232692o2343k98557K4689J46434j45065M9035J7244J18283J402k14956
13996A868858n2740n5562L58564j43571r9561j64974M50511K58321K802248O278565
13986A1500659J9518429K0948406k5568837A2386591n161629j610653j172747
13979D441562p83106j84763o15382R9501m56301R768K8354k31271J4146K29553
13969B552061o1142r1109k74633J85273n05655M85891l48943L40700k32226L09699
$$ plain form
14036 2607927 3103911 2979197 2964434 3048141 3130203 2895421 3025016 2877633 2661999 2800752
14026 2800752 2630326 2433313 2494658 2613425 2344337 2608395 2600738 2685851 2483632 2466163
14016 2466163 2053408 2265759 2139854 2594662 2282790 2278419 2108488 2074346 2146470 2232692
14006 2232692 2170349 1871792 1896481 2042915 1897850 1946885 1964129 2082412 2083814 1868858
13996 1868858 1816118 1760556 2119120 1975549 1875988 1711014 2161525 2419846 5222094 11500659
13986 11500659 31019088 51967494 26398657 12386591 7224962 5614309 4441562
13979 4441562 3658456 3473693 2858311 2957812 2501511 2511279 2539633 2308362 2322508 2552061
13969 2552061 2490919 2399810 2125177 2310450 1804795 2290686 1941743 2282443 2050217 2359916
13959B359916r2571k57545L2803J29054k87373Q0530J2429j78454Q3495j68965
13949A713319J7783J98717O6288j92109j30539J84260p9806j92551Q7677j3208
13939A659831O62k20254Q6014j78510K36987m28874M74927k68903M31990P4512
13929A868382m87626P6368j05298N4745l00530L89368p7969l2189L37894J34252
13919A857397k83068j88099K9269P4495o0427j83695j6455M02828k38331n1731
13909A342183N3624K7502m2798q4328j5361O1565j66582J47272R5415l82532L89176
13898A425136m70783J36369L6562P13635p25485J89934m7770J8314P2445R6244
13888A444601l27346L30694k59754N21920o18138j9224K05428m0193o3987P1647
$$ plain form
13959 2359916 2267345 2009800 2042603 2171657 1884284 1964814 1977243 1798789 1882284 1713319
13949 1713319 1731102 1929819 1996107 1803998 1673459 1857719 1777913 1585362 1673039 1659831
13939 1659831 1660493 1440239 1526253 1347743 1584730 1155856 1630783 1361880 1793870 1868382
13929 1868382 1380756 1457124 1351826 1406571 1106041 1495409 1417440 1385251 1723145 1857397
13919 1857397 1574329 1386230 1415499 1489994 1429567 1245872 1229417 1632245 1393914 1342183
13909 1342183 1395807 1423309 1380511 1296183 1280822 1342387 1175805 1323077 1418492 1035960 1425136
13898 1425136 954353 1090722 1127284 1840919 1115434 1305368 1257598 1275912 1348357 1444601
13888 1444601 1117255 1447949 1188195 1710115 1091977 1072753 1278181 1237988 1174001 1245648
13878A245648q4367l3571r0577j38498k7637M63875Q6404k47689N20952l49539
13868A345001n53859J17210K35281k07741j00926M12508l46830K21465j45023
13859I77086j42611M13744l42218j4435J36693j32748N58327k32067j26352j40997
13849I54422K8898j88244J1227J92558M4622J89453m24760K95723m85626L17385
13839I35658k28107K64357K30077k65834K67556k80006r536Q252L00074p0245
13829A152246l80686j79151L55391k91670J34359j90100K51166j80203J89618
13820H60970R347D30928M38616j10712o251k8738K51401r7942n4511J32243k81106
13809F73928N7659l8675K76793K8352l57200L06305m15048M34117l20844J8824
$$ plain form
13878 1245648 1161281 1127710 1037133 898635 870998 1334873 1421277 1173588 1694540 1345001
13868 1345001 791142 908352 1143633 935892 834966 1247474 900644 1122109 977086
13859 977086 834475 1248219 906001 891566 1028259 895511 1453838 1221771 1095419 954422
13849 954422 983320 795076 806303 998861 1043483 1232936 808176 1103899 618273 935658
13839 935658 707551 971908 1201985 936151 1203707 923701 914165 922417 1222491 1152246
13829 1152246 771560 592409 947800 656130 790489 600389 851555 671352 860970
13820 860970 870317 430928 869544 758832 752581 723843 975244 877302 822791 955034 673928
13809 673928 731587 692912 969705 998057 640857 947162 532114 966231 645387 664211
13799F64211L2637K30450k94029k05286K88376n2829j51821N34516m33182L14145
13789I27188k51495K72105n8420j13775o6829q337l28770J51413k1496K15273
13779G16857j87150L15029k51412j10431L74133r8884N1602m5444k04799m861
13769E54640K41949k54564J17243j50108J68871J16574n277l71351J87477o6551
13759E38903J84740l39990J58974J73842J46255j43008Q5302j93851L68493m17900
13749E61760k06860L96986B89578K95626k09213K88244k91020M17092J20799C51514
13738F58107j51008J54890J41919r7816A79998M26949k77817P5116K72593j79083
13728D97756j52265M67383j10064k73791o891N96291m58144J78968j79033K08800
$$ plain form
13799 664211 696848 927298 633269 427983 716359 663530 511709 1046225 613043 927188
13789 927188 675693 947798 889378 775603 708774 700437 371667 523080 501584 716857
13779 716857 529707 844736 593324 482893 857026 758142 809744 764300 559501 554640
13769 554640 796589 542025 659268 509160 678031 794605 789328 417977 605454 538903
13759 538903 723643 383653 542627 716469 862724 719716 805018 611167 979660 561760
13749 561760 354900 751886 289578 585204 375991 664235 373215 790307 911106 351514
13738 658107 507099 661989 803908 706092 179998 606947 329130 404246 676839 497756
13728 497756 345491 812874 702810 429019 422128 1018419 560275 739243 560210 769010
13718G69010k21643K56446j22417k33019m8439K20324O3150j8288k87378K58960
13708F36706l4100K0843o6158L8750j62273M30277l12012J19306K00933D13716
13697F78406k51815J34242j21149J35988j02399P2724A35966R3793O85J70498
13687D00942J48931K5131J63606j23720l7964J8877k26471L1957J85111m0902
13677E45498j39387L1586m7212K46776k63720j08299K93353J98556l37609j94201
13667B25341M90181j69108k32035L66652k45756J66322j75469r2439R6663A83180
13656B36937K99367r9744A82193K50851N0295J53450B11484J75391j03794K43918
13646E26999P5436j99423L67407k57379o9414O2710j35230K73285l04535K7299
$$ plain form
13718 769010 547367 803813 681396 448377 399938 620262 683412 665124 377746 636706
13708 636706 602606 623449 557291 596041 433768 864045 552033 671339 872272 413716
13697 678406 426591 560833 439684 575672 473273 545997 135966 229759 230444 400942
13687 400942 549873 575004 738610 614890 576926 595803 369332 401289 586400 545498
13677 545498 406111 437697 390485 637261 373541 265242 558595 757151 419542 225341
13667 225341 715522 546414 314379 681031 435275 601597 426128 333689 430352 183180
13656 236937 536304 436560 182193 433044 483339 636789 211484 386875 283081 526999
13646 526999 602435 403012 770419 513040 443626 506336 371106 644391 339856 367155
13636C67155j54192H9263K14846J84845j18542j28104j3124L27157k06020K2487
13626C72808Q8554k11916R8008J10569m6960M16669B68458o1437K93757j45448
13616C55330K25535k56408J18424O2826k00271J78969A05388M42154N5742N1349
13606F54633k64434j59104E1353M51833K4250J79446j30980k43995K48596j68810
13596D11693j47826p0396o8328L29137J5738k12813J36819j58998K97372j30020
13586D02378R3094P6361k37793j45453K10364O2495l1781p8977J16534q8473n6173
13575C22576M4303J49178R3474D2666L69606Q3924I1481J8262L72638j10078N4339
13564D26642J55160I3888L05633J22318k19788A17496N2657J29295J78700j46136
$$ plain form
13636 367155 212963 89263 304109 488954 370412 242308 229184 556341 350321 372808
13626 372808 461362 249446 347454 458023 411063 827732 268458 207021 500778 355330
13616 355330 580865 324457 442881 505707 305436 484405 105388 547542 603284 654633
13606 654633 390199 231095 51353 503186 527436 706882 575902 331907 580503 411693
13596 411693 263867 193471 125143 454280 470018 257205 394024 235026 532398 402378
13586 402378 495472 571833 334040 188587 398951 461446 429665 350688 467222 378749 322576
13575 322576 366879 516057 609531 42666 412272 496196 91481 109743 482381 372303 426642
13564 426642 581802 93888 399521 521839 302051 117496 170153 299448 478148 332012
13554C32012j53982J25297q4950K55948k2932j89189L68628j92296A79139N68
13544A79707K62160j90389b8387E82147A54665D0057Q5227J34915J46060J12635
13534E18894g2053B06522o3221J02996j3203G5945M2116N6728j9844j9725P224
13523A42444O45283B69273l5506J79211A83150A7188M52683D0958M43504L0571
13513E15033A56062G3625c454B18198J14669J47144B02504J49000j38900c0598
13502e8790C93295H0488M8308N6503K64277k09542i3520G4776c3969A44268m329
13491A39939K91907A39861l5037b9719B65263J63928q8971i3035A6577K96869
13481C13446A54451M75700B17387h60q338C26051J21984K53980C37773o1243J3160
$$ plain form
13554 332012 178030 303327 218377 474325 451393 262204 630832 438536 179139 179707
13544 179707 441867 251478 -28387 582147 154665 40057 125284 260199 406259 518894
13534 518894 -72053 206522 143301 246297 233094 75945 118061 174789 154945 135220 142444
13523 142444 787727 269273 233767 412978 183150 17188 469871 40958 484462 515033
13513 515033 156062 73625 -3454 218198 332867 480011 202504 351504 212604 -30598
13502 -58790 393295 80488 128796 185299 449576 240034 -93520 74776 -33969 144268 139939
13491 139939 431846 139861 104824 -29719 265263 429191 340220 -93035 16577 313446
13481 313446 154451 630151 217387 -860 -9198 326051 448035 702015 337773 276530 289690
13470B89690p4236L91406A45252J52768A30385g8473H2569K99418j25491R9619
13460C56115j64795J1790J02673A18702R4535Q3527J7998A31382J6474R3543p466
13449B33933J3050I5891M40K69322j29263E7539Q6777K09269r5594J02419b3857
13437A61965a08960A91392R1588E5714J83467O1741B2159J32881K49717A89843
13426A47785J60604g1200A81671K20814o0181N9009I8194P0012G7150l340K02640
13415B76450J08094E0313K96342O2858G5758K16615o1183r0189L02665k12161
13405B31505R2546A21766K67824A09581K94656A27589j3367J22318O8490K7950
13395C32980I6653i4344F9850K47962F1715O9856L1210K62002I4825J96205L0373
$$ plain form
13470 289690 215454 606860 145252 298020 130385 -78473 82569 381987 256496 356115
13460 356115 191320 203110 305783 118702 213237 296764 314762 131382 147856 241399 233933
13449 233933 246983 95891 96331 365653 236390 57539 144316 353585 257991 360410 -23857
13437 161965 -108960 191392 282980 55714 239181 300922 22159 155040 404757 189843
13426 147785 308389 -71200 181671 402485 342304 401313 98194 168206 77150 73810 276450
13415 276450 384544 50313 346655 409513 75758 292373 231190 141001 443666 231505
13405 231505 324051 121766 389590 109581 404237 127589 114222 236540 305030 332980
13395 332980 96653 -94344 69850 317812 61715 131571 162781 424783 94825 291030 321403
13384C21403j03576L8065f3660j3500C6052K33778p0846q5552J92415A50766K06923
13373C57689J68392j65184I3698L3264K84192j3812A88500F1482K29938O9946
13363C61366j43925r8314B415L4067N33180B32022b2256A75604L20958A26589
13352D6688a39888C43996a19694B53953Q2021a5600C85770A26968M18456O3623
13342F09047k36403N2623K4892k5147j9444j88749b1687D16739J39533H0883K16180
13331B97063A14072J52062K24466F2458J17815k9715K95669I9314C2342J50860
13321A83202K21816j45857J43016r9067j2498G7493k864L38899E8992e215B51249
13309C54718j7191j56583J8391p3506c7537E17445j31893h103H1649J82780A22413
$$ plain form
13384 321403 217827 255892 -63660 -77160 36052 269830 198984 113432 305847 150766 357689
13373 357689 526081 360897 93698 126962 411154 397342 188500 61482 291420 361366
13363 361366 217441 119127 2415 36482 569662 232022 -22256 175604 496562 126589
13352 46688 -139888 343996 -119694 253953 335974 -15600 385770 126968 545424 609047
13342 609047 372644 425267 450159 425012 405568 216819 -21687 416739 556272 80883 297063
13331 297063 114072 266134 490600 62458 180273 150558 446227 99314 32342 183202
13321 183202 405018 259161 402177 303110 290612 77493 74629 413528 58992 -5215 251249
13309 354718 337527 180944 199335 125829 -37537 517445 385552 -8103 81649 264429 122413
13297A42905J42815M9927f0840F20499A04924K40581F185K0178J54396C4931L4499
13286F9430d7729e686l8557A99470J12715a98006H9742J3876d6267B01001k664
13275A98337K8433g946B08302o6434E3472K1206b33223B62334d9643I2786c63540
13263g3597A26929b67503B08055n2861j1980m1042b27057P9719B74643r5734f8910
13251D11365A87342a90699C93686J25945B11985c15798A55590f1626B66709N5693
13241C22402f6470A21596k5851J74116B0410J07608a8052A04995P98K06342J99162
13230E11297A97779A0299K71756M0156J8135A30626i5138b0086q4954E3721M13348
13219D67069I5137M28577h9118D85101A86989q4290K0344L04312B12667H2607
$$ plain form
13297 142905 285720 335647 -60840 620499 104924 345505 6185 26363 180759 34931 69430
13286 69430 -47729 -5686 -44243 199470 312185 -198006 89742 103618 -46267 201001 198337
13275 198337 226770 -7946 208302 141868 53472 74678 -233223 262334 -49643 92786 -363540
13263 -73597 126929 -267503 208055 155194 143214 102172 -227057 -147338 274643 178909 -68910
13251 411365 187342 -190699 393686 519631 211985 -315798 155590 -61626 266709 322402
13241 322402 -66470 121596 95745 269861 20410 128018 -18052 104995 105793 312135 511297
13230 511297 197779 10299 282055 322211 340346 130626 -95138 -20086 -105040 53721 467069
13219 467069 95137 523714 -89118 485101 186989 102699 123043 427355 212667 82607
13208A0722a23838B58684a52531B21093J25492H6658L55998F9283f7553q6034
13198a53587D17822A59727b43413A42427J64306G6150J98113J16031k0966a71370
13187B05682J40136D877K64353k6643c31854A52701K1321c26272C69874a13935
13176C29747E3468K342f1800B09771J9921A9480M54724j89491A27068g0549A82911
13164a13715A51260c19413D8007L6056L52740H2851a8467I6822b8311C10490Q1408
13153C91898A94175a90400I0231J34110r959I5840c59652A97619p2325d2889A86817
13141a8773g223p6068A91242c83B74310l5633p8372p0772p394K81873A6492a17213
13128B05444J00185j03283f1070J8299j6428D05599f3124A72197c23919A48024
$$ plain form
13208 10722 -123838 258684 -152531 221093 346585 86658 442656 69283 -67553 -153587
13198 -153587 417822 159727 -243413 142427 306733 76150 274263 390294 369328 -171370
13187 205682 345818 4877 269230 242587 -331854 152701 174022 -326272 369874 -113935
13176 329747 53468 55810 -61800 209771 229692 19480 474204 284713 127068 -70549 182911
13164 -113715 151260 -319413 48007 84063 436803 82851 -18467 96822 -28311 310490 391898
13153 391898 194175 -190400 90231 224341 214382 95840 -359652 197619 125294 -42889 186817
13141 -18773 -7223 -83291 191242 -383 274310 238677 160305 89533 82139 364012 16492 -117213
13128 205444 305629 202346 -61070 -42771 -59199 405599 -63124 172197 -323919 148024
13117D08995H859J51674k9383Q7992G1011a42416D4130J67153I5533f4848J1106
13106e3742B10441k684I3237J17448j03222h6124H479K18567K0842K55595i5548
13094f4009A74846e578D3259b110k60640A53333J01459a6592D5547J60529m0382
13083A65694c9697A46939h3618E798M52460c837A86220L787m6108c3684B51616
13071H9067a9605j77406I6991d2819C74937a5598j36096B82202K83061G0912O8877
13060A39789l6169N4541i3479A95579h0012b4029C02837A08140m5310J1720J1171
13049H5721d13299D26990j57997C1363K42192c5670j93783C6773K87223r5054
13039B28942a82308P8449B1222a51139K9264B62731A10381j4867O7554K39299
$$ plain form
13117 408995 8859 160533 131150 219142 71011 -142416 44130 211283 95533 -64848 -53742
13106 -53742 210441 207757 93237 210685 107463 -86124 8479 227046 247888 503483 -95548
13094 -64009 174846 -5578 43259 -2110 -262750 153333 254792 -16592 45547 206076 165694
13083 165694 -39697 146939 -83618 5798 458258 -3837 186220 190007 143899 -33684 251616
13071 89067 -19605 -197011 96991 -42819 374937 -15598 -151694 282202 565263 70912 139789
13060 139789 103620 158161 -93479 195579 -80012 -24029 302837 108140 62830 74550 85721
13049 85721 -413299 426990 268993 31363 273555 -35670 -229453 36773 323996 228942
13039 228942 -182308 -103859 21222 -151139 -121875 262731 110381 95514 163068 402367
13029D02367A0764M65889B35966R6725b89721e750B50197A17767f6418A34413
13018d3760B05004R8809c23983B39178H5715K69353h1425B14201M7765P0450m7169
13007B85247D2845a00659H3467C2691R0479J65976B8033k475K66621b96956A88604
12995B68794A17408J70447c19794h4487A45968J3615G5473J52366q4344J29207
12985B72702F7389a19517A61934m238q270e5432C04283k2816A27153b42014D1471
12973D5224J2484K63205o4151g772B30566Q5098K6092G0527J27321g7584A563
12961C32087g7476K5400B01593o6270C840e697F3414M9271a21180A49593l4388
12950A15205D6816Q0741b62455a10273G7643j765J11568R545p2728l6612J3370
$$ plain form
13029 402367 10764 476653 235966 332691 -289721 -5750 250197 117767 -66418 134413
13018 -43760 205004 303813 -323983 239178 85715 355068 -81425 214201 261966 332416 285247
13007 285247 42845 -100659 83467 32691 123170 289146 28033 25558 292179 -296956 188604
12995 268794 117408 287855 -319794 -84487 145968 159583 75473 227839 143495 272702
12985 272702 67389 -119517 161934 157696 149426 -55432 304283 281467 127153 -242014 41471
12973 45224 57708 320913 256762 -7772 230566 315664 341756 70527 197848 -77584 1563
12961 332087 -77476 -52076 201593 135323 3840 -5697 63414 112685 -121180 149593 115205
12950 115205 46816 127557 -262455 -110273 77643 75878 187446 196991 124263 87651 101021
12939A01021a00524B46595b03094b820E1004K6017a60665A47348R7942a08908
12928a01923a4690j29618A13805i9037a2535A08006M6607a73019A74288b80088
12917A30964a96065P829A60205a51566O7331L1359A82883D642c99032a32419G6250
12905E10973A56490b1012F0423J08959d9176C7959J66040e5484k0254F023a14221
12893B7168a75633H8373b26429A14699O7436a60310A35716a4449E8330K12165
12883B70495a30185A09625a94759B10754i7545H3409d1293E7431a13628A35249
12872b1403G9719J670c8156m5658G7129l3068L06128b35192K6190g4788C40515
12860b00965f0817n0500A219J01035a05354B4541M13863h6205A33206f2126B12615
$$ plain form
12939 101021 -100524 246595 -203094 -2820 51004 77021 -160665 147348 245290 -108908
12928 -101923 -14690 -144308 113805 -99037 -12535 108006 154613 -173019 174288 -280088
12917 130964 -196065 -188236 160205 -151566 -84235 -52876 182883 4642 -399032 -132419 76250
12905 510973 156490 -21012 60423 169382 -49176 37959 203999 -55484 -75738 6023 -114221
12893 27168 -175633 88373 -226429 114699 182135 -160310 135716 -14449 58330 270495
12883 270495 -130185 109625 -194759 210754 -97545 83409 -41293 57431 -113628 135249
12872 -21403 79719 81389 -38156 -83814 77129 44061 350189 -235192 -209002 -74788 340515
12860 -200965 -60817 -111317 1219 102254 -105354 24541 438404 -86205 133206 -62126 212615
12848H2273J76414A05015B5767O2500B8345J43881k8648M3263a20922A26544D3555
12836B64399a03746D05718C5963b39240B48482h3289o1264A05940C6721a44629
12825a36744B14529p3128c07208A56563K50778A36231A6163b63663F2532J58822
12815B21354D1488c282l7605A21589K05952m8732a41382D8311K7271P1057p2892
12804G3747l529e1020H72h2863B78404n8931h1451H856P7820k7567p784A4961
12791A08040J86767b947j66541I5638J84609a09444b5383C13409A31070m668a34506
12779A18419j0611f1A06214J00897f4526j47074P6238A64472a7422m309B00271
12767B9707a25326c7993B08045B5741J16328f9949A23577n9193f1162n8181A40870
$$ plain form
12848 82273 258687 105015 25767 88267 28345 172226 143578 186841 -120922 126544 43555
12836 264399 -103746 405718 35963 -239240 248482 -83289 -144553 105940 36721 -144629
12825 -136744 214529 141401 -307208 156563 407341 136231 16163 -263663 62532 221354
12815 221354 41488 -3282 -40887 121589 327541 278809 -141382 48311 75582 146639 73747
12804 73747 70218 -51020 872 -82863 278404 219473 -81451 8856 86676 59109 51325 14961
12791 108040 294807 -2947 -169488 95638 280247 -109444 -25383 313409 131070 126402 -134506
12779 118419 107808 -61 106214 207111 -64526 -211600 -135362 164472 -17422 -21731 200271
12767 29707 -125326 -37993 208045 25741 142069 -69949 123577 64384 -61162 -119343 140870
12755B57401J00018A1304b4216I0046m3806b60474e7856I8935f7005l00789A16899
12743B91981a84159G1940j0719i2470j16779A81511h3449m8972C28197M039E8312
12731I8125J95643E9666J81348b2749k9773j9433j39493G5747c7038j97169P1111
12720a63096B72036a29212j45972a20832A2298b51637c8678B81768q0391M7647
12710B49024I3194a65000B5973K61302A5881R047L67815j84487n2312C3268d9362
12698A46614a1051j36694k0269A6050e8778r6374A03788f3282A971c83396D0663
12686a17843J2419p696A37965R9542A1992J9718K74554j36389E7425O6051a1171
12674B25805P5606G745J9641J59742i6778B65813b88595A33642a21811B07798
$$ plain form
12755 257401 357419 11304 -24216 90046 46240 -260474 -57856 98935 -67005 -367794 116899
12743 291981 -184159 71940 61221 -92470 -209249 181511 -83449 -132421 328197 332236 58312
12731 98125 293768 59666 241014 -22749 -52522 -71955 -211448 75747 -37038 -234207 -163096
12720 -163096 272036 -129212 -275184 -120832 12298 -251637 -38678 281768 201377 249024
12710 249024 93194 -165000 25973 287275 15881 24928 392743 208256 155944 33268 -49362
12698 146614 -11051 -147745 -168014 16050 -58778 -155152 103788 -63282 1971 -383396 40663
12686 -117843 -105424 -113120 137965 237507 11992 31710 306264 169875 57425 123476 -11171
12674 225805 301411 7745 27386 187128 -96778 265813 -288595 133642 -121811 207798
12663d4818A79758p7379J67954a58783B83089a59064K0580B84369q9087F6934
12652B1431b0287B47794h655E5940J61897k3536H6440O7125O561G4267d7192B53036
12639b6788a2447n1180e718F9740K01762a68597B74453q1415L46364G0776L48240
12628D19016r1954j16833J10839B0849K64182C4285J4500J91441H4945J15899
12618B00844j7205a38536A34800M4378Q1499r9841h2631J2668D0662J77393k1045
12607A97010k5765L1874k8206b30468F5715a9281B05542J1503R4908j52480o8915
12596I0558a33079g257E8467N074J1165i1647M4211H7673i5651D55947h4324k26165
12584c10489B634a2692k72931h4637k4561C0955a52110K9379A55075L1516B7363
$$ plain form
12663 -44818 179758 102379 270333 -158783 283089 -159064 -138484 284369 195282 66934
12652 21431 -20287 247794 -8655 55940 217837 194301 86440 153565 160126 74267 -47192 253036
12639 -26788 -12447 -63627 -5718 69740 271502 -168597 274453 193038 539402 70776 419016
12628 419016 327062 210229 321068 20849 285031 34285 48785 240226 84945 200844
12618 200844 183639 -138536 134800 179178 260677 160836 -82631 -69963 40662 218055 197010
12607 197010 171245 203119 174913 -230468 65715 -19281 205542 217045 311953 159473 90558
12596 90558 -133079 -7257 58467 63541 74706 -91647 -47436 87673 -95651 455947 -84324 -310489
12584 -310489 2634 -12692 -285623 -84637 -109198 30955 -152110 -122731 155075 186591 27363
12572i2200J1446A81053p4726a20744B37003e2352A25077K70067b4905n9247I5526
12560a79153B1598K32356b5154C7961Q2276B6365K91421A53932O2202a05039C2397
12548C37953A54595L3120l7309c01900B2603i9747L4618A85111m6638b75240a06340
12536B47399r4889J15591F6597K32791j25935L4105C9362J70665J35452j46272
12526A99207o1197J03601M076a66233F2101a1975j11487M6008C91181A91434J00735
12515B92169F1929b96456e2759o5540c1982a2969A1617N3230J75041b63299B45631
12503e17911H0425M5094i0106B81609F7043O3401N2989p357G4580B4840K45660
12492B70500D4636M9653a31490A42973d2423k87348J30044C04154B6322M5528
$$ plain form
12572 -92200 -80754 181053 106327 -120744 237003 -52352 125077 395144 -24905 -84152 95526
12560 -179153 21598 253954 -25154 37961 120237 26365 317786 153932 216134 -105039 32397
12548 337953 154595 187715 150406 -301900 22603 -99747 -65129 185111 138473 -275240 -106340
12536 247399 152510 268101 66597 299388 173453 207558 39362 210027 345479 199207
12526 199207 138010 241611 245687 -166233 62101 -11975 -123462 -77454 391181 191434 292169
12515 292169 61929 -296456 -52759 -118299 -31982 -12969 11617 64847 239888 -263299 245631
12503 -517911 80425 125519 -90106 281609 67043 130444 183433 176076 74580 24840 270500
12492 270500 44636 94289 -131490 142973 -42423 -329771 -199727 304154 26322 71850
12482G1850N02111A32157D2164K11497a06324G8179A3016J87095f3375G7413a13118
12470B89748g3191A09843e3144l4073B25963n7022a13970r3426G4283l0005b4627
12458a05476J7771c6603j22948k3468L4233m2436N7870j24881J04900N6610A11502
12446b90346c0086G7369K63321q6529h4433R476B63884b5827j94159a2065A22767
12434A78412J77660G8537c08895A49754j4879O0962b27254A96016L2272q0897
12424A47391a26502A40234b19399I9315L93268a17159A25717d0180B8838N158
12414C3996L00793b01458E9978a43782N7213b8069A22386a57102c4007j85347
12404b19354g1051A24832c41828l8357C87682A14706d1371l72482a09963f697
$$ plain form
12482 71850 573961 132157 42164 253661 -106324 78179 13016 200111 -63375 77413 -113118
12470 289748 -73191 109843 -53144 -87217 225963 168941 -113970 -207396 74283 44278 -24627
12458 -105476 -87705 -36603 -159551 -183019 -148786 -191222 -133352 -258233 -153333 -96723 111502
12446 -290346 -30086 77369 340690 254161 -84433 -74957 263884 -25827 -219986 -12065 122767
12434 178412 356072 78537 -308895 149754 134875 195837 -227254 196016 228288 147391
12424 147391 -126502 140234 -219399 99315 492583 -117159 125717 -40180 28838 33996
12414 33996 334789 -201458 59978 -143782 -86569 -28069 122386 -157102 -34007 -219354
12404 -219354 -71051 124832 -341828 -380185 387682 114706 -41371 -413853 -109963 -6697
12393c8848a4952F4032i2450E0436L8125a50675j61944g7302n7420C31315a48427
12381A36961J39859c9309A47118E2644K21980a49053C94110A13311l2159J47060
12371B28212H9513e4983b5392j4472j92434D5867c6441C30570a83143b7898l3523
12360f1421p19A46780a12052B9551c27208E7274a90692D57064D6010a0825G65
12348c98139B98472A12068c2206E4982J7242Q1069a85501A180M8904R3217A5698
12336D0958J98205c1232R483r6998j342n8162M7189H7667J8256J76495F1848a1466
12323G3446k3513A556N6851i6215A73273c1884A47601d190j49221B75285A38L21067
12311C21205j52385i740A94071R136b14339I4992a84623N1321A24064a21144B00515
$$ plain form
12393 -38848 -14952 64032 -92450 50436 88561 -150675 -312619 -77302 -134722 331315 -148427
12381 136961 276820 -39309 147118 52644 274624 -149053 394110 113311 81152 228212
12371 228212 89513 -54983 -25392 -39864 -232298 45867 -36441 330570 -183143 -27898 -61421
12360 -61421 -62140 146780 -112052 29551 -327208 57274 -190692 457064 46010 -10825 765
12348 -398139 298472 112068 -32206 54982 72224 153293 -185501 1180 50084 143301 15698
12336 40958 239163 -31232 -21749 -118747 -120089 -178251 -131062 87667 105923 282418 61848 -11466
12323 73446 49933 1556 58407 -96215 173273 -31884 147601 -4190 -153411 275285 138 321205
12311 321205 168820 -9740 194071 203207 -214339 94992 -184623 -133302 124064 -121144 200515
12299g5100b0496o0926j64682o7307F4690b68488A19420l9184K2409a19457C08820
12287D7780P2275a07316F6213J0756d5843B59095A6426h4491G8705A9505K1167
12276D0672j3149M3810K58505C570L55042H6344b26999C1832L60524A9934L56509
12265C76443a15495A30635b25848a06020L2807A34061m3240e418C98707e9619
12254C20048a25368A89363k3144F7264K25980o4672L4089E4589j2237A0828K18702
12243B29530i8426A06161J14499K04768m7522A33518J13833i7978A28075K89927
12233D18002A099Q0773k7436b09925a7762A70598p6077O1509K76977A37384K23800
12222C61184e3935D18391I0980K02095k4737L23004k87563I8388K11218l4982
$$ plain form
12299 -75100 -20496 -81422 -246104 -313411 64690 -268488 119420 80236 102645 -119457 308820
12287 47780 120055 -107316 66213 76969 -45843 259095 16426 -84491 78705 19505 40672
12276 40672 27523 71333 329838 3570 358612 86344 -226999 31832 392356 19934 376443
12265 376443 -115495 130635 -225848 -106020 -73213 134061 90821 -5418 398707 -59619
12254 320048 -125368 189363 166219 67264 293244 228572 262661 54589 42352 10828 229530
12243 229530 -98426 106161 220660 425428 377906 133518 247351 -97978 128075 418002
12233 418002 1099 81872 54436 -209925 -17762 170598 94521 156030 433007 137384 361184
12222 361184 -53935 418391 90980 293075 268338 591342 303779 98388 309606 274624
12212B74624c24483G2865J30669E4545j7282J62717L96019G4368K24154J75219
12202D73741K454d2915B99860A42758k187K33926l2469p4574J21316J66881E8155
12190C9460J39166B6969J0155K12282J91938E6085B4871J39040l2736C4451d4822
12178A87246D6738f3197A95941Q3368I9242M0007O7809n9288e5258F19454F4354
12166b5458C04913J11833B8398A514K79256n2568E2748B5835J83097a16685D34737
12154h1944k30869C45178A59919h5676d0036J6728B38023C0154L30966d79404
12143B97782i8885c1155B13141E0014a19520C30692d73442A30246K67865I046
12132a65961N4330A75047A2980K32835f2107e659l13207e0408k07028G2352C2121
$$ plain form
12212 274624 -324483 72865 203534 54545 37263 199980 595999 74368 298522 473741
12202 473741 476195 -42915 299860 142758 140571 374497 342028 267454 388770 555651 58155
12190 39460 178626 26969 37124 249406 441344 56085 24871 163911 131175 34451 -44822
12178 187246 46738 -63197 195941 279309 99242 139249 207058 147770 -55258 619454 64354
12166 -25458 304913 416746 28398 1514 280770 228202 52748 25835 208932 -116685 434737
12154 -81944 -312813 345178 159919 -85676 -40036 -23308 238023 30154 361120 -479404
12143 297782 -98885 -31155 213141 50014 -119520 330692 -473442 130246 398111 9046
12132 -165961 -111631 175047 12980 245815 -62107 -5659 -318866 -50408 -257436 72352 32121
12120B54023E0942b7748j26339A7760h1191l2318j777B15218K07769A74256R9262
12109B73518j29381a71621I1085O9063N1293a49282e6461E4092R8145a13206c7553
12097B19255a85932J0474P6486d0806o2368c6684l1585A53227a78291C32256d4034
12085a44715A35947b74608c1479c241n7562n6874L7307A55242a7993A24779b20023
12073D38859J265909N19439C34166k7958A35706g3355A92525a33222o8486A46879
12062c9329k1658C5914J34645c32339A04814J57697d8151p2079D5325B1921J0714
12051C2635b26427B01529D0417a18131F723K3840a48921c1689A61733p2107g2622
12039A44169a15554j428G0296a36387B40859a33217j76619J46238g9225D7074
$$ plain form
12120 254023 50942 -27748 -154087 17760 -81191 -113509 -115286 215218 422987 174256 273518
12109 273518 144137 -171621 91085 160148 211441 -149282 -56461 54092 152237 -113206 -37553
12097 219255 -185932 -175458 -98972 -40806 -103174 -36684 -68269 153227 -178291 332256 -44034
12085 -144715 135947 -274608 -31479 -3241 -60803 -117677 -80370 155242 -17993 124779 -220023
12073 438859 1704768 2224207 334166 306208 135706 -73355 192525 -133222 -201708 146879
12062 -39329 -60987 35914 170559 -332339 104814 262511 -48151 -120230 45325 21921 32635
12051 32635 -226427 201529 40417 -118131 6723 30563 -148921 -31689 161733 89626 -72622
12039 144169 -115554 -116982 70296 -136387 240859 -133217 -309836 -163598 -79225 47074
12028a37539A07706E1476i9504M7260j79249f3636n1062A25451k5054f0581B39539
12016D7814f6469B42621A6966J45268J05178M9230A29875J29972h2568k15188
12006b97756n4465A56088n2248c06059B45637g7121B69315k6772a98994E464P3367
11995G8831b68267h579l57873A3268b5639r5074c7537p356F5951b05465A20668
11983E4205J43130I0401a71998B05367b43060A42200P5055O0776d63244c9032
11972B12415f3263E4381i0099B65494a80002B32990F4991b79988B3531G186L9213
11961D6399M0470O4377b18354o261A58330h1854C36660H7156e1094H5623A9820
11949A30666J08270E1471J06433b0765A2674a47685L1161A12545b41358J13082
$$ plain form
12028 -137539 107706 51476 -99504 -52244 -231493 -63636 -114698 125451 100397 -60581 239539
12016 47814 -66469 242621 16966 162234 267412 316642 129875 259847 -82568 -297756
12006 -297756 -352221 156088 103840 -306059 245637 -77121 269315 242543 -198994 5464 78831
11995 78831 -268267 -8579 -366452 13268 -25639 -120713 -37537 -44893 65951 -205465 120668
11983 54205 197335 90401 -171998 205367 -243060 142200 217255 278031 -463244 -39032
11972 212415 -63263 54381 -90099 265494 -180002 232990 64991 -279988 23531 7186 46399
11961 46399 86869 151246 -218354 -224615 158330 -81854 336660 87156 -51094 85623 19820
11949 130666 238936 51471 157904 -20765 12674 -147685 -116524 112545 -241358 -128276
11939a28276M6748n5946m8049h870B15576Q5660i7928l16191A03976b6609j68674
11928a95283E5610B3552a31469B5402K04045a17148I041M5480j2223a62890j60739
11917c23629B22656a35416H2837i7418A16706D9636A1694J68110a53568l7042
11907a90610j7878m9340b0950H0295d39967b18797f6140n2135M1265c1509I7732
11895F1021k388k5254b53220B5778b28444K0235i9558D8888Q0625j1190a93587
11883a60414A74932a23781H1125h3745B55328f3164D6285J7233M7954J2181a4032
11871D7118a9184l37177k00570a75433A31151J95700c5618j0149j7679A3201K03335
11860B16536h3348E41900c8139A18094j4355K8268b07306B19073A8130h326A03253
$$ plain form
11939 -128276 -81528 -137474 -185523 -8870 215576 301236 -97928 -414119 103976 -26609 -195283
11928 -195283 55610 23552 -131469 25402 229447 -117148 9041 54521 42298 -162890 -323629
11917 -323629 222656 -135416 82837 -97418 116706 49636 11694 179804 -153568 -190610
11907 -190610 -208488 -257828 -20950 80295 -439967 -218797 -66140 -118275 -77010 -31509 97732
11895 61021 58633 33379 -253220 25778 -228444 -208209 -99558 48888 129513 118323 -193587
11883 -160414 174932 -123781 81125 -83745 255328 -63164 46285 63518 111472 123653 -14032
11871 47118 -19184 -356361 -556931 -175433 131151 326851 -35618 -45767 -63446 13201 216536
11860 216536 -83348 541900 -38139 118094 103739 132007 -207306 219073 18130 -8326 103253
11848a34933C07339N1018A6407a60753k9827a1158A92504C8926M8055d96184B64253
11836b66818A2729c47878B51416j5139b9771B2528K99739G621a45206e409j01878
11825a07287I2844b97459a06395q9046M2661B46989a75970E3274L15983m3527
11815C25730E9848Q3554H500J24979a99400o7339C22239a8208k22861H0020l1801
11804D8219a6453G9854j0205B2066Q8180d901j34562k92623I291J91838a20983
11792b20507D3602a6592n0292c28j24939M4567c8877l4840L5755D4303a2410F786
11779B42967d8801j62767B48567d3108k9139B03512e66225H9866b73649E5542
11768b15813a06685C13267c13000f7351p331A60021b25830A9933b8002q6076c1151
$$ plain form
11848 -134933 307339 358357 16407 -160753 -190580 -11158 192504 38926 86981 -496184 264253
11836 -266818 12729 -347878 251416 236277 -29771 22528 322267 7621 -145206 -5409 -107287
11825 -107287 92844 -297459 -106395 -195441 -152780 246989 -175970 53274 369257 325730
11815 325730 59848 143402 8500 133479 -199400 -266739 322239 -18208 -241069 80020 48219
11804 48219 -16453 79854 69649 22066 110246 -4901 -139463 -432086 9291 201129 -120983
11792 -220507 43602 -16592 -66884 -328 -125267 -80700 -38877 -73717 -37962 44303 -12410 6786
11779 242967 -48801 -211568 248567 -43108 -72247 203512 -566225 89866 -273649 55542
11768 -215813 -106685 313267 -313000 -67351 -74682 160021 -225830 19933 -28002 -114078 -31151
11756b02638D0630a80345A00192D3726b28944A02113e6404F7587f7520G9008e3640
11744b39277j3671J14936B14759G2433J15179k8798l8126q896G901c08469b3941
11732a23000A31939a75704q6008I8141c94317a46658j57566Q7958b5561l21230
11722c46791d2916D773J89228c5662H7450a82054k8116R5528j7818B42010b02468
11710D8094b4445k19008B5722N4598B2232O8110Q1813B9496M8218P4976l5562
11699A17128C3250a72723g3113n6750A06494J49332b60107Q9678A04362a02142
11688c19555e1030B3616J22642O2783k7570d707p9413C80772j13767J53084k07331
11677B12758r4486k6636a10237j22991a03526H0070K578k9132b35690D2180a75009
$$ plain form
11756 -202638 40630 -180345 100192 43726 -228944 102113 -56404 67587 -67520 79008 -53640
11744 -239277 -252948 -138012 214759 72433 187612 158814 120688 111792 7901 -308469 -23941
11732 -123000 131939 -175704 -261712 98141 -394317 -146658 -304224 -216266 -25561 -346791
11722 -346791 -42916 4773 194001 -35662 87450 -182054 -210170 -114642 -132460 242010 -202468
11710 48094 -24445 -243453 25722 80320 22232 90342 172155 29496 77714 152690 117128
11699 117128 33250 -172723 -73113 -129863 106494 255826 -260107 -170429 104362 -102142
11688 -319555 -51030 23616 146258 209041 181471 -4707 -84120 380772 267005 420089 212758
11677 212758 118272 91636 -110237 -233228 -103526 80070 82648 53516 -235690 42180 -175009
11665B62439b52443J23543j07209A11313Q4311c23491B41466p7142j7846L9765
11655A86243q5683C3362M3006M5323a7764j7524f785C51058A9779g1256A61420
11643B19191B9566A3593K6905L5765a01605c7948o4150B15932a61890c533k13505
11632b17038D98559D2226g1600B38610c51578C21935b77613A6912K62374a07925
11621A1189i8256M2000E9937c9911A46084a01589B1427K9562J91791k9824F3420
11609A29359L3624f3526m5394D39282a67251P9703I8218a53352B5822J9784a05686
11597C61642H7647K61209b34647H9800a08251B25579b79824b2323I04K65087B1474
11585B5150b36297A85129K12324C1314j3135B044J00914A3166K19802K9791i3252
$$ plain form
11665 262439 -252443 -128900 -236109 111313 195624 -323491 241466 164324 146478 186243
11655 186243 100560 33362 76368 121691 -17764 -35288 -6785 351058 19779 -71256 161420
11643 219191 29566 13593 40498 76263 -101605 -37948 -102098 215932 -161890 -3533 -217038
11632 -217038 498559 42226 -71600 238610 -351578 321935 -277613 16912 279286 -107925
11621 11189 -98256 -56256 59937 -39911 146084 -101589 21427 50989 242780 212956 63420
11609 129359 162983 -63526 -108920 439282 -167251 -87548 98218 -153352 25822 45606 -105686
11597 361642 87647 348856 -234647 89800 -108251 225579 -279824 -22323 904 265991 21474
11585 25150 -236297 185129 397453 31314 18179 2044 102958 13166 232968 262759 -93252
11573D04037A20584d6898E4888J63253r2485D4681b9295A39859a47523d4662p2513
11562a17175G4179d506B83595r4366D4162f1395G6331c4655k76835O8403B29905
11550B07181a33669A97541e4269i169j58165L8353B3860i3398K7760D42381A89065
11538B9254M6549J3613K24822K25773k3536j98404a82523A27607D758J90857D2342
11526B22683l5185J18848e9068J7523I9744M6106K84249h864C19869j52350K93997
11515D61516A92745e1044B30559e5069A666b09541C08283j36173B3697J93857
11505B17554N4241b62139D54215A99593L56366h2254B67258p2529J61452o6746
11495B89435f0262A62717O9362D4384f3913D31861A2547J62435H954R5082M1587
$$ plain form
11573 404037 120584 -46898 54888 218141 125656 44681 -29295 139859 -147523 -44662 -117175
11562 -117175 74179 -4506 283595 189229 44162 -61395 76331 -34655 -311490 -243087 229905
11550 207181 -133669 197541 -54269 -9169 -167334 -128981 23860 -93398 -65638 442381 189065
11538 29254 75803 89416 314238 540011 516475 318071 -182523 127607 4758 195615 42342
11526 222683 187498 306346 -59068 -41545 99744 145850 430099 -8864 319869 167519 461516
11515 461516 192745 -51044 230559 -55069 1666 -209541 308283 172110 23697 217554
11505 217554 271795 -262139 454215 199593 555959 -82254 267258 194729 356181 289435
11495 289435 -60262 162717 232079 44384 -63913 431861 12547 174982 8954 104036 145623
11484A45623g1614E34607A79000L13011B11946H1996J15946p4677J56243j13199
11474A66309J92730A4477J21213J38613g069B14925A5769M24654j20918F1193
11463a01162C31613b12623g9769l29011C83M6562f8730N258A29627J75597A5199
11451c7040D19511A25635b1290B9120N4684O356a4601A87734D1910J05831B5022
11439C50301b06635P3895B42558D4572O5835L44609c73591E0304a07027m8053
11429a55080O7918A11386A4885a18879l5884b1725A31199a63842B4769J19795
11419A44564A6435O7120M7808a80569P8315j6415A01860i1346l5813j8880B052
11407b81952A0787P2554p384J51143a57164j9522F0422b25170a8610A09682D0319
$$ plain form
11484 145623 -71614 534607 179000 492011 211946 81996 197942 123265 279508 166309
11474 166309 359039 14477 135690 274303 -7069 214925 15769 440423 319505 61193
11463 -101162 331613 -212623 -79769 -408780 383 46945 -68730 -63472 129627 305224 15199
11451 -37040 419511 125635 -21290 29120 83804 90160 -14601 187734 41910 147741 25022
11439 350301 -206635 -132740 242558 44572 110407 455016 -373591 50304 -107027 -155080
11429 -155080 -87162 111386 14885 -118879 -154763 -21725 131199 -163842 24769 144564
11419 144564 16435 83555 131363 -180569 -102254 -118669 101860 -91346 -127159 -146039 2052
11407 -281952 10787 83341 75957 227100 -157164 -176686 60422 -225170 -18610 109682 40319
11395A80692I612J00231a87851N0960A48528a48658F0940d11790b01702A50707
11384A50851j9858k8058A5265a8290A15265p315a78024o2662k5936B99675e4995
11372A13845Q4522g0246j2987j43473B75037c27774B11593E1594j3378i338A51448
11360I8696J9251a02428B66552c22181O7196B7244K67689g4598j2100k7973j53698
11349b68369H4715l5432h4118q3697b7588k97299F3636a11489G7334e0047C8392
11337b23804P1771A80043B7715h5481A65298F131J37205a64964B23189A02506
11326a78381E2236j5574J3819A223a24977a052G18J32003K04647A44183A4634
11314a83575c9047B77944H1737J3017D1095K2721d2186H0202J14275c647C03914
$$ plain form
11395 180692 9612 109843 -187851 -136891 148528 -148658 60940 -411790 -201702 150707
11384 150851 130993 102935 15265 -18290 115265 107950 -178024 -240686 -266622 299675 -54995
11372 113845 198367 -70246 -83233 -226706 275037 -327774 211593 51594 38216 -9338 151448
11360 98696 117947 -102428 266552 -322181 -254985 27244 294933 -74598 -86698 -114671 -268369
11349 -268369 84715 49283 -84118 -167815 -27588 -324887 63636 -111489 77334 -50047 38392
11337 -223804 -152033 180043 27715 -85481 165298 6131 143336 -164964 223189 102506
11326 -178381 52236 36662 50481 1223 -124977 -1052 718 132721 337368 144183 14634
11314 -183575 -39047 277944 81737 94754 41095 63816 -42186 80202 194477 -3647 303914
11302B5116a1785A21994b48945J08195C40714A64456F1938a5467A9801b4800k94881
11291c19681C21116a93223R3068A42555h9097n0560j98760J32404j35804a70375
11280b40217d7596E9036A0178P1671J09736q8064c3659l4425A65786N6480d76
11268b0991A08708c2068d197j41223c1605j001k09164B25758a99430j35598A15528
11256c30916A02904m8366a13297o8768B9113a19612A61738D3869J48746j2625
11246A79990R1331f9535j5723r5335K7836B63314J9412i2389q5267C48324f1825
11234h5155j22707O8312m0893B04601b29514H4641A1692f5864j56975c8956a5212
11222c21243l3157a45831b9807o5767b5644k05670i0049n1844A32268b68989B22672
$$ plain form
11302 25116 -11785 121994 -248945 -140750 340714 164456 61938 -15467 19801 -24800 -319681
11291 -319681 321116 -193223 -100155 142555 -89097 -139657 -338417 -206013 -341817 -170375
11280 -240217 -47596 59036 10178 81849 191585 103521 -33659 -68084 165786 222266 -476
11268 -20991 108708 -32068 -4197 -145420 -31605 -32606 -241770 225758 -199430 -335028 115528
11256 -330916 102904 54538 -113297 -182065 29113 -119612 161738 43869 192615 179990
11246 179990 271321 -69535 -85258 -180593 -152757 263314 282726 -92389 -177656 348324 -61825
11234 -85155 -207862 -139550 -180443 204601 -229514 84641 11692 -65864 -222839 -38956 -15212
11222 -321243 -354400 -145831 -29807 -95574 -25644 -231314 -90049 -141893 132268 -268989 222672
11210a03524B51638b99835E0308c19495A68433p5976J73488J02455c4673D49872
11199A50586c51073a10460j19883a3718l34946C81491a37507j55310j71381a98327
11188a54967A32805D2179h1046D5236a91541A74184a24566m0695B5699F31a18057
11176a2725G2031Q1234b09115b8213A03781D4455j8026K83608c13262a07554j25585
11165b33139J05753b8324j4201h822D33938a30638A11997k0402b00797B41555
11154b16548l16514a9833B7381b20101J0579A00225b9467o2253A2509J13442M2159
11143A68110J01408a2465A24101F1522R8514H313d3969A63604c712A43044J00986
11132B44030b39680f3776b5272B67466d4111I8339c3499G2258K29737F477M40189
$$ plain form
11210 -103524 251638 -299835 50308 -319495 168433 92457 265945 368400 -34673 449872
11199 150586 -351073 -110460 -230343 -13718 -348664 381491 -137507 -292817 -464198 -198327
11188 -154967 132805 42179 -81046 45236 -191541 174184 -124566 -165261 25699 631 -118057
11176 -12725 72031 153265 -209115 -28213 103781 44455 26429 310037 -313262 -107554 -233139
11165 -233139 -127386 -28324 -42525 -8822 433938 -130638 111997 91595 -200797 241555
11154 -216548 -533062 -19833 27381 -220101 -209522 100225 -29467 -91720 12509 125951 168110
11143 168110 269518 -12465 124101 61522 160036 8313 -43969 163604 -3712 143044 244030
11132 244030 -239680 -63776 -25272 267466 -44111 98339 -33499 72258 301995 6477 446666
11121D46666b26266j15725f7071G9433O8589G2763P0829F165O6133B7250K97237
11110C24487j10323H887f0695A35622K00276D8390a67658H4617k2364K0144N3793
11099A36190M01777m5263j83665g8542D00087k9208O2165A27145K01911l8023
11089B91033L5676a68146N1347C88268j89690E5362J78944A08067K02839b21342
11078C87640C5016J606K96435D1462M08109j66075o5515J87202K63461A25741
11067E13355A97651p9595N76135j73706k18351N14671C73672J56455L80724D31225
11056H93056j45376Q3539j12995J63802J02374q245l8592D51696J65355J09270
11046G26321L37084l88485O058L8857O1729k22046J88958Q610K60297j36819l13730
$$ plain form
11121 446666 -226266 -341991 -67071 79433 148022 72763 143592 6165 72298 27250 324487
11110 324487 214164 8887 -60695 135622 335898 48390 -167658 84617 62253 82397 136190
11099 136190 537967 492704 309039 -78542 400087 370879 433044 127145 329056 291033
11089 291033 326709 -168146 -116799 388268 198578 55362 234306 108067 310906 -221342
11078 387640 35016 36622 333057 41462 449571 283496 217981 405183 668644 125741
11067 513355 197651 118056 694191 520485 302134 816805 373672 530127 910851 431225
11056 893056 747680 831219 718224 882026 984400 976155 937563 451696 617051 726321
11046 726321 1063405 674920 680978 719835 781564 559518 748476 757086 1017383 880564 566834
11035E66834L70501P4409j94219K7580r8657R4193j00848K92097k55239j9989
11025G56662J79938k83506J41646J8235k54671J36054L04501k94761l811K79928
11015I80215j96656j93367J08680J36499C81092K90059K33759J97435j93960k94227
11005F14158k2250M4701J05547j21031J89808j37344L33115l01669j03730K17627
10995H18932k7464r2172R6853m9994Q7088O6224J03251O1279m39143J71830J58889
10984I55573M38197k32565N287K3623J19956N78025J14969K7721M49640L27721
10974B808147N16872J66493P9906k5719n8124L49049o74967k72616m73991m23736
10964A991314k11594j73215l43186N35286l71050K49819K07279j63316L6574n91615
$$ plain form
11035 566834 937335 1011744 817525 845105 746448 840641 739793 1031890 776651 756662
11025 756662 936600 653094 794740 812975 558304 694358 998859 704098 700287 980215
11015 980215 783559 590192 698872 835371 381092 671151 904910 1102345 908385 614158
11005 614158 591908 636609 742156 621125 810933 673589 1006704 705035 601305 818932
10995 818932 791468 699296 796149 746155 833243 899467 1002718 1063997 624854 796684 955573
10984 955573 1393770 1161205 1166492 1190115 1310071 1888096 2003065 2030786 2480426 2808147
10974 2808147 3325019 3491512 3571418 3545699 3487575 3836624 3161657 2889041 2415050 1991314
10964 1991314 1779720 1606505 1263319 1798605 1427555 1677374 1884653 1721337 1757911 1166296
10954A166296Q8935P664m26352C78112J45618r2234L17021B88487o5402k2686
10944B00399J11709p5514a45288D24964A4731K81230i8000C66169A67173J7932
10934A85105i2258F6072a79296H3417j1383a07658A49200K22656G7260a5202B67031
10922C48308i8973C13528r3087b52770B11068h8681D7898B0381Q0085b712B37425
10910A85012E4119K86940a2952B64567m5802a2042B5677a81481K5614A05271c04602
10898B44550C2799I768J57942J82097b7259A84137d5881k42757d1615j93243o6264
10887c01122a1505A300J27897J995f2396A17177j8326a11250E2524a86319A13807
10875h9478A30669b07906O6594F4850J15658f113A06569K47217a1413j92852H8779
$$ plain form
10954 1166296 1255231 1262895 836543 378112 523730 431496 748517 288487 223085 200399
10944 200399 312108 236594 -145288 424964 14731 295961 -98000 366169 167173 185105
10934 185105 -92258 66072 -179296 83417 72034 -107658 149200 371856 77260 -15202 267031
10922 348308 -98973 313528 220441 -252770 211068 -88681 47898 20381 100466 -2712 237425
10910 185012 54119 341059 -12952 264567 218765 -12042 25677 -181481 -155867 105271 -304602
10898 244550 32799 9768 167710 349807 -27259 184137 -45881 -288638 -41615 -234858 -301122
10887 -301122 -11505 1300 129197 131192 -62396 117177 98851 -111250 52524 -186319 113807
10875 -89478 130669 -207906 -141312 64850 180508 -6113 106569 353786 -11413 -204265 88779
10863a41313d1275A37643f0057j78888a05084c2427m136C17743A07403J39940
10853B47343A3777J8679K9775J20612K9214L4824D177e6287C55653d7732B25025
10841b27975Q6577C07658b19435A14237K34166c38060g224A47561m5287J1020
10831A13294O523C7259O5665b58845c4835l4301j2883B00403a29779j22639f1422
10819i2645j3912A13387R2787O9629A10166a55824e6582b0228j19774A28183i942
10807c27151b1489A89762e375k26401a3621a87l01438a27796j59388H375K96523
10796C04898D3864b11026G3212b03175l0140A22703g8464J5055C5003b82773a1855
10784A3195K6815c55882a39834C38637d0023j46458K9773O5743k9474A14271L34425
$$ plain form
10863 -141313 -41275 137643 -60057 -238945 -105084 -32427 -36563 317743 107403 247343
10853 247343 13777 32456 62231 182843 212057 246881 4177 -56287 355653 -47732 225025
10841 -227975 -141398 307658 -219435 114237 348403 -338060 -7224 147561 102274 113294
10831 113294 119817 37259 102924 -258845 -34835 -69136 -82019 200403 -129779 -252418 -61422
10819 -92645 -106557 113387 206174 275803 110166 -155824 -56582 -20228 -140002 128183 -9942
10807 -327151 -21489 189762 -5375 -231776 -13621 -187 -301625 -127796 -287184 8375 304898
10796 304898 43864 -211026 73212 -203175 -233315 122703 -78464 -63409 35003 -282773 -11855
10784 13195 40010 -355882 -139834 338637 -40023 -186481 -156708 -90965 -120439 114271 448696
10773D48696D1994b9608A21822b36907J692B25831a8290A15371c45588g7663l38187
10762d15850A0041b04209e7351B55299n9745F1543J65482g3064B22668J72590
10752C95258G7834J19949a36322O520J0130j24179g8528C17015a05847k89700
10742c95547a07252j8226H3193J0515N4173o9589b76805a36308C40204h4381D6725
10730e7858j51303j01133a2146G443J30160l8440c6996j35194A08459J21686c34476
10718G4280a19907j29015N5163K4589B0283P2160a52567d7095n4123B55430h1277
10706a58020A04773a24254F1353O1369B8572k852J5298e2140j21280L1385c6615
10694b79059C1993a68121C5039b4618l89151K03925M6858K6535j12576g6264q0160
$$ plain form
10773 448696 41994 -29608 121822 -236907 -235215 225831 -18290 115371 -345588 -77663 -415850
10762 -415850 10041 -204209 -57351 255299 195554 61543 227025 -73064 222668 395258
10752 395258 77834 197783 -136322 -129802 -119672 -243851 -78528 317015 -105847 -395547
10742 -395547 -107252 -125478 83193 93708 147881 78292 -276805 -136308 340204 -84381 46725
10730 -57858 -209161 -310294 -12146 7443 137603 99163 -36996 -172190 108459 230145 -334476
10718 74280 -119907 -248922 -193759 -169170 20283 92443 -152567 -47095 -101218 255430 -81277
10706 -158020 104773 -124254 61353 122722 28572 25720 41018 -52140 -173420 -142035 -36615
10694 -279059 31993 -168121 35039 -24618 -413769 -209844 -162986 -136451 -249027 -76264 -156424
10683a56424b1078D9668Q866o518a92832B24540A08849i1772A19655a7782d939
10671F1458c96045A15639c13808C7293a03102l31797f8389l0367p9140J4285M3578
10660a20033d2662k1558q4343d7280a5612k3040k79157a50200B41129d10200i9939
10648c78044Q9501Q8354h852k52791K601E5992J4434k0201q845a49463g177p6346
10636h3523j17617h0187n5028l9747P7207L3332l592A3630c000k55132C9369d0497
10623a61103e7557E7251P6207K6555j638j9425a15009c2958A202a29386d8832
10611c6576k40114b8270A40287b4565p925C55381b7640D0801b5352A26630A4185
10599F0285a62515N2397A00961J35852p8974B2920b88242h234B05111l5428F3038
$$ plain form
10683 -156424 -21078 49668 58534 52016 -192832 224540 108849 -91772 119655 -17782 -4939
10671 61458 -396045 115639 -313808 37293 -103102 -434899 -68389 -98756 -177896 -163611 -120033
10660 -120033 -42662 -64220 -148563 -47280 -15612 -38652 -317809 -150200 241129 -410200 -99939
10648 -378044 -288543 -200189 -8852 -261643 -259042 55992 70426 50225 41380 -149463 -7177 -83523
10636 -83523 -201140 -80187 -135215 -174962 -97755 -64423 -68015 13630 -3000 -258132 39369 -40497
10623 -161103 -57557 57251 133458 160013 158375 138950 -115009 -32958 1202 -129386 -48832
10611 -36576 -276690 -28270 140287 -24565 -32490 355381 -27640 40801 -25352 126630 14185
10599 60285 -162515 -110118 100961 236813 157839 22920 -288242 -8234 205111 169683 63038
10587d04174d46D78914c85106C28392e0481d417B6159O3099a94833B44329i9779
10575e1350E3910J04395d32902H5849c6484k77668F4083h0251o9399g909l2906
10564d0815l02475I5345d7623k12499G0710R3778m7509f9231B26583A7199P9590
10553I6789D2030J32315a36375B74430a69347H0145k2194a09776C9248K73593
10543C12841b4049j0783l502m18567c1911k6147k32611C14063A18161M8794a96889
10531a30520B6179J6318b16362b2026D4882h0088a8106E3829c51123B75978a29889
10519b88570r3621a70572o7051H268R2043K99211c5802C3229e0962C31420m7937
10508B83483f7726j13911B985b86027a09760A63362a91363A05641J10435h954
$$ plain form
10587 -404174 -446 478914 -385106 328392 -50481 -4417 26159 89258 -194833 244329 -99779
10575 -51350 53910 158305 -432902 85849 -36484 -314152 64083 -80251 -149650 -7909 -40815
10564 -40815 -343290 95345 -47623 -260122 70710 164488 116979 -69231 226583 17199 96789
10553 96789 42030 174345 -136375 274430 -169347 80145 57951 -109776 39248 312841
10543 312841 -24049 -34832 -38334 -456901 -31911 -58058 -290669 314063 118161 166955 -196889
10531 -130520 26179 42497 -216362 -22026 44882 -80088 -18106 53829 -351123 275978 -129889
10519 -288570 -382191 -170572 -237623 8268 100311 399522 -35802 33229 -50962 331420 283483
10508 283483 -67726 -181637 2985 -286027 -109760 163362 -191363 105641 216076 -8954
10497a18232o6700D9725m394i8070A60773i3652R552j45616C2063M7413a91646
10485A24809a11418I1171r709K10388M5946E9893L5768b08934B90496j25200F5440
10473B6701J9478J4019b92496i7723B4393j7M8585b48847C95828O4670p4373a32751
10460f725A32983N7b40734O6635d7552l51755a83725A74254k6886A6526b35273
10448c29832D7839e8641k84104B24914A00015L2262a37914k4141l01814B09945
10437B83302b65362A66621Q9981I2741Q196c7206C7674N1471k177a51565b4982
10425C8536a45162A25945a03502C26914a11511n7368P9393j23713d1559B9057
10414B4806b07731A77601a39747A6931c2435B31488J65881b66493c4107A18029
$$ plain form
10497 -118232 -184932 49725 45331 -98070 160773 -93652 -84100 -229716 32063 79476 -191646
10485 124809 -111418 91171 81462 291850 337796 59893 95661 -208934 290496 165296 65440
10473 26701 46179 60198 -292496 -97723 24393 24376 72961 -248847 395828 460498 386125 -132751
10460 -6725 132983 133040 -240734 -174099 -47552 -399307 -183725 174254 147368 16526 -235273
10448 -329832 47839 -58641 -342745 224914 100015 132277 -137914 -162055 -463869 209945
10437 283302 -265362 166621 256602 92741 100937 -37206 37674 89145 86968 -151565 -24982
10425 38536 -145162 125945 -103502 326914 -111511 -168879 -89486 -213199 -41559 29057
10414 24806 -207731 177601 -139747 16931 -32435 231488 397369 -266493 -34107 118029
10403C04962A36736C9368J21940o2807a14731m9193D6159L07091I9044J24057
10393B23101A5769J79908J07683A29340n1350L23548D5496O5621g6029C2479J48611
10382A81090K79019j31018D6245J08629J54969J07682K69046B84964m1748b3465
10371A26622k4853O1365K8959P1308J06343J97572J95884l22175j92048o8635
10361A80342a08801A57171K33413j79088F9662b6281I6245a2647E48541J17108
10351F65649k08507J37817j44190M3696I9193j0543J12073L70730j57657B6422
10340A08886J89759M8410l1793A44932J51448G645g3719C67041e3534o3731j0377
10329a27642B11876a14471d1663C6410K4904J77862E3498K30726J48557j31018
$$ plain form
10403 304962 136736 39368 161308 98501 -114731 -163924 46159 353250 99044 223101
10393 223101 15769 195677 303360 129340 77990 401538 45496 111117 -76029 32479 181090
10382 181090 460109 329091 46245 154874 309843 417525 686571 284964 243216 -23465
10371 126622 101769 163134 192093 263401 369744 567316 763200 441025 248977 180342
10361 180342 -108801 157171 390584 211496 69662 -26281 96245 -12647 548541 665649
10351 665649 457142 594959 450769 494465 99193 88650 200723 571453 413796 26422
10340 108886 298645 347055 315262 144932 296380 7645 -73719 367041 -53534 -117265 -127642
10329 -127642 211876 -114471 -41663 36410 61314 239176 53498 284224 432781 301763
10319C01763K07451f7907C01271j31386o7863K93007A43369F1655c3517H0701
10308a29124A93819f6836q4965A17307B6244K03306c6832q4942D22203a3839m0988
10297e4827B32626a02480A47130a27029j73473G5223a43073a2497A0753Q5722
10287I6475A5195M2296B8714b060C01440r2303A1516J01579P4128b48245C9135
10275a50615J3516D1452O3588a82838A44882j6702N3900d216C6994J08897J09672
10264B55563c5789l187A10143e0293C78266K6844N1024J44277B16623j0744a57371
10252f6470G6461c3292C7633c12722b5049B40084a87277F0418a98115I2087D4972
10240C6723j0534a56323B75093c31640G7819a84295p4688d5686n9472B2368L30345
$$ plain form
10319 301763 509214 -67907 301271 169885 102022 395029 143369 61655 -33517 80701
10308 -129124 193819 -66836 -151801 117307 26244 229550 -36832 -121774 422203 -13839 -54827
10297 -54827 232626 -102480 147130 -127029 -300502 75223 -143073 -12497 10753 96475
10287 96475 15195 57491 28714 -2060 301440 209137 11516 113095 187223 -248245 39135
10275 -150615 -137099 41452 105040 -182838 144882 128180 182080 -4216 36994 145891 255563
10264 255563 -35789 -38976 110143 -50293 378266 405110 456134 600411 216623 205879 -157371
10252 -66470 76461 -33292 37633 -312722 -25049 240084 -187277 60418 -198115 92087 44972
10240 36723 26189 -156323 275093 -331640 77819 -184295 -258983 -45686 -105158 22368 352713
10229C52713A18714K22903a2325k56536i3522r0210K9881A692h6228A45250F4994
10217g9720p058K2940A06057b6758B10884p8353Q3771k8355d5974F1178a95548
10205b20147p0884B66271F9759b50915R7331o6944j4344b7155E03903g4211p6332
10194a50543j0261B19739e1800c907j38347j58408E8439Q1829a09535r7896A45839
10182D8669a38343l21849b26228J04654Q752A15399b45714l2730P7691k21493
10172d22246H6843k8765a5157j86567i827o5292A9972d6828j53284A89897e5083
10160A14535c0234j21677e8941m00651h7756r7816o5101F9063k4398k0188M2158
10149F6635b80903B30158R5667b64673R6448K1643N075C43055a50424J5930M8148
$$ plain form
10229 352713 118714 341617 -12325 -268861 -93522 -183732 -153851 1692 -86228 145250 64994
10217 -79720 -86778 -63838 106057 -26758 210884 132531 216302 187947 -45974 61178 -195548
10205 -220147 -291031 266271 69759 -250915 -153584 -220528 -234872 -27155 503903 -74211 -150543
10194 -150543 -160804 219739 -51800 -3907 -142254 -300662 58439 140268 -109535 -207431 145839
10182 48669 -138343 -460192 -226228 -121574 -112822 115399 -245714 -278444 -200753 -422246
10172 -422246 86843 58078 -15157 -201724 -9827 -75119 19972 -46828 -200112 189897 -55083
10160 114535 -30234 -151911 -58941 -459592 -87756 -185572 -250673 69063 44665 24477 66635
10149 66635 -280903 230158 325825 -264673 -168225 -146582 -141507 343055 -150424 -134494 -86346
10138h6346G8325J91446D2473J8012a53769j63464A24756J3930d38406C9275b05497
10126b26546A1180O1970b14653k63914A0640c7813m2411F4495a07157A65621b85234
10114i2857j52945I312J58710b12971q2338m1040i7348l66896b15007R1225N3784
10103f9998j40480G9407q544g3359H9683k1712b6882l6919r6408d2233F6548a20169
10090e3757N994q914m51783h8030j4172r9887M7131A9084i9561L2981b2689k33202
10078b55891A85120d6741r0710l509K9611j59054a32505k20452c0385k3925I5585
10066b10906f8609p9977D66430D8911K01954g671j8082B7221b26880P2811A17327
10054b55308j711g5069r7188B48736a54908F3770b30810B40954c4555k95867C0832
$$ plain form
10138 -86346 78325 269771 42473 60485 -153769 -317233 124756 138686 -438406 39275 -205497
10126 -226546 11180 73150 -214653 -478567 10640 -37813 -80224 64495 -107157 165621 -285234
10114 -92857 -245802 9312 168022 -212971 -295309 -336349 -97348 -464244 -215007 -123782 -69998
10103 -69998 -210478 79407 70863 -73359 89683 67971 -26882 -63801 -160209 -42233 66548 -120169
10090 -53757 -47763 -56677 -508460 -88030 -102202 -202089 -154958 19084 -99561 -66580 -22689 -255891
10078 -255891 185120 -46741 -137451 -140960 -111349 -270403 -132505 -352957 -30385 -54310 95585
10066 -210906 -68609 -148586 466430 48911 250865 -7671 -25753 27221 -226880 -154069 117327
10054 -255308 -257019 -75069 -172257 248736 -154908 63770 -230810 240954 -34555 -330422 30832
10042b2873B90947b19184B41560h6406d1195a8714H9687B5499a61460q5284B10775
10030A39914L3102i6685I7081J8638a51823D799J27067a26561A18263b70417j2999
10019b83416r2251C9717M4128d26141b10352L3315A24490a51775L8475A8761e2665
10007A17099b263I8354R7629a17057B12057d69476B73096d22247I7516a060A16
9995f7749k0564A03342h6697o3706A03586b30457N4098M8293C6202a41050M4520
9984i6530R13A32580b64617J02845K851I9950a5587j00893j78211a12390M8681
9973f3709b387r6611n7144j39707K6268j9007D2606L9123K5267j3320d0776J3181
9961b7595C4486b34640C074c1246H2760a74092e335B0934c56114A4766Q0096m409
$$ plain form
10042 -22873 290947 -219184 241560 -86406 -41195 -18714 89687 25499 -161460 -246744 210775
10030 139914 173016 -96685 97081 115719 -151823 4799 131866 -126561 118263 -270417 -283416
10019 -283416 -375667 39717 83845 -426141 -210352 -177037 124490 -151775 -113300 18761 -52665
10007 117099 -2263 98354 195983 -117057 212057 -469476 273096 -422247 97516 -1060 116
9995 -67749 -88313 103342 -86697 -150403 103586 -230457 -176359 -128066 36202 -141050 -96530
9984 -96530 -95617 132580 -264617 -161772 -158921 99950 -15587 -116480 -294691 -112390 -63709
9973 -63709 -2387 -98998 -156142 -295849 -269581 -288588 42606 81729 106996 93676 -40776 -27595
9961 -27595 34486 -234640 3074 -31246 82760 -174092 -5335 20934 -356114 14766 94862 90453
9949I0453c3001k49977N8539A48534F3313K53442a65581F1756a63586F546b94822
9937i2982p3535e7007K6004j92514f7924L620j05131B9334c49605P5732A1176
9925b93014B2830P8170A6924d072r1964J6486B2518b7776C6824b19525J09240
9914a10285m4721C3198P5996l7955b77363N7108j5086i8053a8553l37014B86298
9902I7537F31K06912b6171A3860g6433j59670l3171O9758F145f9081J2768k85602
9890c41915A607c53909P2504O863A86992a30958B12837H4612L4788b8071l87825
9879d15896j04622a8316m4477k74972L6868f1555l8577L0525r8496A316b9424
9867a32749A53189a90512D5222a83779a5962j32976j21762f9498M542j62815E154
$$ plain form
9949 90453 -33001 -282978 -224439 148534 63313 316755 -165581 61756 -163586 6546 -294822
9937 -92982 -166517 -57007 -31003 -223517 -67924 -64304 -169435 29334 -349605 -273873 11176
9925 -293014 22830 101000 16924 -4072 -96036 -79550 22518 -27776 36824 -219525 -110285
9914 -110285 -155006 33198 109194 71239 -277363 -220255 -235341 -98053 -18553 -355567 286298
9902 97537 631 207543 -26171 13860 -76433 -236103 -269274 -199516 6145 -69081 -56313 -341915
9890 -341915 1607 -353909 -281405 -274542 186992 -130958 212837 84612 119400 -28071 -415896
9879 -415896 -520518 -18316 -62793 -337765 -300897 -61555 -100132 -69607 -168103 1316 -29424
9867 -132749 153189 -190512 45222 -183779 -15962 -148938 -270700 -69498 -64956 -227771 5154
9855d82685a80004A90417a01493D2838f6610j11525A04893m7696J28961B3860
9844e7466k46741m1517A53531n3429j332C4323I922b24151C08578a24973j3755
9833a38728A3920h5827B15871d9960j58181J3911A03049L7554l8956c06193b7330
9821d9186m62865I7526b02026B33511a71472k06031g561A59282a38144j06451
9811b44595o5127A37431b3041o8237A83233a58631B63216g4919D2870A1918J05344
9800A17262a92505A00057b7976D23b07501A24887a65416A7249b50171A81441H9279
9788A53892g609m7280H6768C0084K2582d5156I3260b79535B41005h3865j02034
9777a85899O6215B71672a65474B22226L561i9517j55472m9499I7849d6140j59333
$$ plain form
9855 -482685 -180004 190417 -101493 42838 -66610 -178135 104893 57197 186158 23860
9844 -57466 -304207 -345724 153531 100102 98770 34323 9922 -224151 308578 -124973 -138728
9833 -138728 13920 -85827 215871 -49960 -208141 -194230 103049 140603 101647 -306193 -27330
9821 -49186 -512051 97526 -202026 233511 -171472 -377503 -7561 159282 -138144 -244595
9811 -244595 -309722 137431 -23041 -91278 183233 -158631 263216 -74919 42870 11918 117262
9800 117262 -192505 100057 -27976 423 -207501 124887 -165416 17249 -250171 181441 89279
9788 153892 -7609 -54889 86768 30084 52666 -45156 93260 -279535 241005 -83865 -185899
9777 -185899 -119684 271672 -165474 222226 225787 -99517 -254989 -304488 97849 -46140 -205473
9766b05473d0908l2020B519d35325G1729f3066A96833d86451a38375r8928B73243
9754A2369Q4026c64950A81954q7774b50315a13633K646k1498B70291a79847g0902
9742g7617F0934a36106l44313L2903a70782A81929h3092j29420C72214H6372b47133
9730E9453b47931K5115h6612E4309e1866I501a21130A12311c05859B36736a14056
9718b7599j34208b3531O110m9510E9284K3148k7588B6209J50845b15847j6979
9707b32826d7358A06519d029l44691C70321f6780A7181d8623j24711a9180j97888
9696b17068P9712L0494j3172k01469A2820R9535e0224k89454n3174b7614A32895
9684D24340a75400p031H4361b04313n2148K1809D5689F151b32119B13334M0919
$$ plain form
9766 -205473 -40908 -72928 2519 -435325 71729 -63066 196833 -486451 -138375 -237303 273243
9754 12369 96395 -364950 181954 94180 -250315 -113633 -110987 -132485 270291 -179847 -70902
9742 -77617 60934 -136106 -480419 -447516 -170782 181929 -83092 -212512 372214 86372 -247133
9730 59453 -247931 -222816 -86612 54309 -51866 9501 -121130 112311 -305859 236736 -114056
9718 -27599 -161807 -23531 -17421 -66931 59284 82432 54844 26209 177054 -215847 -232826
9707 -232826 -47358 106519 -4029 -348720 370321 -66780 17181 -48623 -173334 -19180 -217068
9696 -217068 -137356 -106862 -120034 -321503 12820 112355 -50224 -339678 -392852 -27614 132895
9684 424340 -175400 -182431 84361 -204313 -256461 -234652 45689 6151 -232119 213334 254253
9673B54253M7235b36480g2732E3782b17296A65275a1377A13762e5403k1528r8807
9662a75738L6588j81412e9905A08332n1425c15222A01691j7650l1772J4171J34694
9651B01134G3360A4813J9266a6668n4498m7792I1962J5393P5601h591k51769f0385
9638b8237m56106a59831j19512A18667c305E5626Q1098L3479a01142a1704m9844
9627f1548p7166k18070A40003K5268a29768O457I5423b58336C079k39a04054a0727
9614A15445L1537G0021G045K1144c62784e2730j91709P1554o6942h0489j32803
9603b13292M4498L16A17503b51657G1100O7350C2380K3748M692a46957B66194
9591b10651p519c1972A18672a14063K4412j57323B17576a64083j0814A14457e5206
$$ plain form
9673 254253 301488 -236480 -72732 53782 -217296 165275 -11377 113762 -55403 -76931 -175738
9662 -175738 -139150 -320562 -59905 108332 56907 -315222 101691 84041 52269 66440 201134
9651 201134 73360 14813 34079 -16668 -71166 -118958 91962 107355 182956 -8591 -260360 -60385
9638 -28237 -484343 -159831 -279343 118667 -3305 55626 136724 170203 -101142 -11704 -61548
9627 -61548 -138714 -356784 140003 165271 -129768 -123311 95423 -258336 3079 2840 -104054 -10727
9614 115445 146982 70021 7045 28189 -362784 -52730 -244439 -172885 -239827 -80489 -213292
9603 -213292 -168794 -168478 117503 -251657 71100 138450 32380 56128 60820 -146957 266194
9591 -210651 -218170 -31972 118672 -114063 -89651 -246974 217576 -164083 -174897 114457 -55206
9579h8152k09199a38331C7154J609d41540a18926J0983c4812G4629k8782a3721
9567b95747A04617c4919k17390a20713C39974D5535b5171n4935o4369L1288A6738
9555c4291A96193a19491C2599Q4398E2207i1840J9907a8989l05461H6555b06535
9543A82468g082A1145L7554b75541B61009a7473l3953a5604g317A54903b77407
9531A82140a0117A74285a43431r3047Q2629B23276J30657e13261e3258C31006
9520B7359b95661e6953G5122l397J15091b69708a3190A44992b62861h8967r4086
9509a83053m7698b9194k25235R098o9160g7607B0290O5011c641j86269j3837I9787
9496C3579a0002G6540b04878n1076H714b2173p7853l344c026D46826B19636D8359
$$ plain form
9579 -88152 -297351 -138331 37154 38763 -441540 -118926 -107943 -34812 74629 45847 -13721
9567 -295747 104617 -34919 -252309 -120713 339974 45535 -25171 -80106 -144475 -113187 16738
9555 -34291 196193 -119491 32599 116997 52207 -91840 -71933 -18989 -324450 86555 -206535
9543 182468 -7082 11145 48699 -275541 261009 -17473 -51426 -15604 -7317 154903 -277407
9531 182140 -10117 174285 -143431 -236478 -153849 223276 353933 -513261 -53258 331006
9520 27359 -295661 -56953 75122 71725 186816 -269708 -13190 144992 -262861 -88967 -183053
9509 -183053 -230751 -29194 -254429 -245331 -314491 -77607 20290 85301 -3641 -189910 -203747 99787
9496 33579 -10002 76540 -204878 -255954 8714 -22173 -100026 -103370 -3026 446826 219636 48359
9483A43280a20901D7049b93511g0778F04544B74849I7066a93017A40142j7017
9473A23125b67045B421a7223j88843c1048l52450f307o7748l73212A11973a58153
9461a79347r9188J21334j25956Q4948B40727c62968a08940b7026o342k58446C67123
9449e3281J6519n9507H1975e772o6799j80173A51040b68398i6739J7049j46345
9438b26035A51441Q6736F934L5651q12d50750f546k4704B55305a24505p7212e8664
9425G511J31498a15046c630j29131m2845j1019e5908F2598A3040g2007j89138
9414b61145G6885g1863A40140P2024a92286f235j87148L0813B28214F1846h2915
9402f2290h33A4860a87357D580R5577a90295A62885C4867O2433C6231K2661c9485
$$ plain form
9483 143280 -120901 47049 -293511 -70778 604544 274849 97066 -193017 140142 123125
9473 123125 -267045 2421 -17223 -206066 -31048 -383498 -6307 -74055 -447267 111973 -158153
9461 -179347 -278535 -157201 -283157 -198209 240727 -362968 -108940 -27026 -33368 -291814 367123
9449 -53281 -36762 -96269 81975 -5772 -72571 -252744 151040 -268398 -96739 -79690 -226035
9438 -226035 151441 238177 6934 42585 41773 -450750 -6546 -31250 255305 -124505 -201717 -58664
9425 7511 139009 -115046 -3630 -132761 -175606 -186625 -55908 62598 13040 -72007 -261145
9414 -261145 76885 -71863 140140 212164 -192286 -6235 -193383 -162570 228214 61846 -82915
9402 -62290 -833 14860 -187357 4580 100157 -190295 162885 34867 97300 36231 58892 -39485
9389B0514M5970O6719k5812b419k7212D3443K05954a10926J4625C1716K4888h7327
9376c58668B21855a43708r5158F4490a3344q2686B50458b1281H4511c08894h5542
9364g590A16691b39199j68043A9305g6667A17265a19728J6064N1435a1146k17509
9353b28655f4459F6133N768a76274E5105d01275J87818A02766C2921f9174j82267
9342b51441B00491C3509M5376c26997J01977a11445E2908p72c4298j08731A43813
9330a53909e5798M075J2624r3279l9733A82078a0909j99411G8653B5674M3474
9319F9148L79068j79065J02525j50072i0096o1767D2775a11110b3089A58878a28961
9307a36509k84147a07127A62033d5587j51094R3940C89473b92659i9566p1880
$$ plain form
9389 20514 66484 133203 107391 -2419 -29631 43443 249397 -110926 -96301 31716 56604 -87327
9376 -358668 221855 -143708 -238866 64490 -13344 -96030 250458 -21281 84511 -308894 -85542
9364 -7590 116691 -239199 -407242 19305 -76667 117265 -119728 -103664 -52229 -11146 -228655
9353 -228655 -64459 66133 71901 -176274 55105 -401275 -213457 102766 32921 -69174 -251441
9342 -251441 200491 33509 78885 -326997 -225020 -111445 52908 52136 -34298 -143029 143813
9330 -153909 -55798 -51723 -39099 -132378 -172111 182078 -10909 -210320 78653 25674 69148
9319 69148 448216 269151 371676 221604 -90096 -151863 42775 -111110 -23089 158878 -128961
9307 -136509 -420656 -107127 162033 -45587 -196681 -102741 389473 -292659 -99566 -171446
9297a71446j65863G7064C847h5023j8215j13832B18916a48062o8496D61083a97084
9285c4308j49538E7656O308K77416e1751l6103B93628b90812c0710C3801b1584
9273a00545E7772a06308A66348a01589j68121d6458k97048B7490b70192a14618
9262b92958P9942B50373K6225F3544a78729D3754J64775G7229a00463A1991c0085
9250A19172a93637h5558j95137J35152m1230A15190B7222f3636B84779a24843
9239h1727l95882A7333M4658a62945B7475a34979r1336i8014j38516k6044J22609
9228a39965O9276l97527c9050l96846D4076a2175k7038I8605a08974b3182B50746
9216C2641J2018a26469A67414L18720B2791a63765B6634J74972b51889E6205b48913
$$ plain form
9297 -171446 -337309 77064 3847 -85023 -103238 -217070 218916 -148062 -216558 461083 -197084
9285 -34308 -183846 57656 63964 341380 -51751 -87854 293628 -290812 -30710 33801 -21584
9273 -100545 57772 -106308 166348 -101589 -269710 -46458 -343506 27490 -270192 -114618
9262 -292958 -213016 250373 276598 63544 -178729 43754 208529 77229 -100463 11991 -30085
9250 119172 -193637 -85558 -280695 -145543 -186773 115190 27222 -63636 284779 -124843
9239 -81727 -477609 17333 61991 -162945 27475 -134979 -226315 -98014 -236530 -262574 -139965
9228 -139965 -70689 -468216 -39050 -435896 44076 -12175 -39213 98605 -108974 -23182 250746
9216 32641 44659 -126469 167414 486134 22791 -163765 26634 201606 -251889 56205 -248913
9204b78843j325a24895k0400j22598A413d6545k51960j5565J0213N1240O0430
9193a92187a0434j25270A89373J2680l8429d0462a4536j65168g98B13215a81811
9181a13833j60711A33713a55891j31983A39710a91956I8674a02130B4785a84502
9170a47976O3115k62431G9257l6921b03139D6216K89510a08181j15580a5491k36513
9159b52004B1838a59365f5226C1159b58476e0326r7299K4493A14370B736c5983
9147H956h6153J1597j9577k11547a3303A92544m7368a3153m74413a0118k4343
9136c4461o3689A1964J11034P3889f1004D17222a62595B43179d73838D7640J26844
9125A74484b89379A67784a09699A0320a47873B44410q7834c66267a29484l6137
$$ plain form
9204 -278843 -280168 -124895 -145295 -267893 1413 -46545 -298505 -314070 -303857 -252617 -192187
9193 -192187 -10434 -135704 189373 202053 163624 -40462 -14536 -179704 -798 213215 -181811
9181 -113833 -274544 133713 -155891 -287874 139710 -191956 98674 -102130 24785 -184502
9170 -147976 -84861 -347292 79257 42336 -203139 46216 335726 -108181 -223761 -15491 -252004
9159 -252004 21838 -159365 -65226 31159 -258476 -50326 -147625 -123132 114370 2736 -35983
9147 8956 -86153 -74556 -94133 -305680 -13303 192544 145176 -13153 -487566 -10118 -34461
9136 -34461 -98150 11964 122998 196887 -61004 417222 -162595 243179 -473838 47640 174484
9125 174484 -289379 167784 -109699 10320 -147873 244410 156576 -366267 -129484 -165621
9115a65621k42495e6151A84171g8808B14155E0894a13312A7864b12681A09332
9104a31293A72648a47391K3429l46758a22697o0847A19219g2316a2164r7593e078
9092g6126A4156c81622B76406A28478Q4745i3400j57251A08361j4180a27019C17909
9080a13608c7129A13778m0047P6356b07762A12059b09986C48072i5087k06824
9070c01911B05381b00713C3122c08584A68689M8062b90204j4692n1996J70661
9060a86231K407A2384a19422k34196F3661e5433H6664a0251j78465B7006c74269
9048a35711d1246k34838B3126b18608A25606o2360O185b38120F5938b66546I0130
9036b2228J481B82527k7676a05403A91773Q0118a17194l04258A83136d0287k65943
$$ plain form
9115 -165621 -408116 -56151 184171 -78808 214155 50894 -113312 17864 -212681 109332
9104 -131293 172648 -147391 -123962 -470720 -122697 -183544 119219 -72316 -12164 -109757 -5078
9092 -76126 14156 -381622 276406 128478 213223 -93400 -250651 108361 94181 -127019 317909
9080 -113608 -37129 113778 73731 150087 -207762 112059 -209986 348072 -95087 -301911
9070 -301911 205381 -200713 33122 -308584 168689 216751 -290204 -304896 -356892 -186231
9060 -186231 -183824 12384 -119422 -353618 63661 -55433 86664 -10251 -188716 27006 -374269
9048 -135711 -41246 -276084 23126 -218608 125606 63246 69431 -238120 65938 -266546 90130
9036 -22228 -20747 282527 254851 -105403 191773 271891 -117194 -421452 183136 -40287 -306230
9025c06230b7072m2311c1103n9871A45247g1198j4954j32710Q321n1732h6645
9013B2614J06110n9636J48434j06638b43314C9010A8770a0251j66443a3126j40829
9002a53955e4021A12674C3292a68859b6338j02911j11905f4825A0485b12658F3620
8990h3713A35929D8716a71348B91814b40486b6966A06562J44066F3961b74657
8979a73340r7450c6432A30070m382a05285j32847P1271B08584P3917i5519q7230
8968a82749q078o7054E6573c29891a56400j29588K7661A12479c06990a39734L0673
8957a09061l0562K8935A9566e47430a83934K720g032j5927g070B7963c40257J03412
8945b36845K6578i982j31622k02991c5685j50223d0328C88944c34404a06338D49658
$$ plain form
9025 -306230 -27072 -69383 -31103 -90974 145247 -71198 -86152 -218862 -210541 -262273 -86645
9013 22614 128724 69088 217522 110884 -243314 39010 18770 -10251 -176694 -13126 -153955
9002 -153955 -54021 112674 33292 -168859 -26338 -129249 -241154 -64825 10485 -212658 63620
8990 -83713 135929 48716 -171348 291814 -240486 -26966 106562 250628 63961 -274657
8979 -173340 -270790 -36432 130070 125688 -105285 -238132 -166861 208584 282501 -95519 -182749
8968 -182749 -190827 -257881 56573 -329891 -156400 -285988 -258327 112479 -306990 -139734 -109061
8957 -109061 -139623 -110688 19566 -547430 -183934 -181214 -7032 -22959 -7070 27963 -340257 -236845
8945 -236845 -210267 -9982 -141604 -344595 -35685 -185908 -40328 388944 -334404 -106338 449658
8933D8886b14492A20674O6667a54851D7094f311A93642O5764K76294L44154L595384
8922D475238J0790259D395933A020953C04710L6603g2094A68444d91533F6250
8912c08248C98127A66735J04586r0451G214a11257b6441p0079C98726b69529l2254
8901c01783a36418A75354b94005J30411A01714b68681E8757K09475a84915F8956
8890i2705F7234a25800j07528m5331B9885K25793a30366r1310p3141e8187G6273
8878b94901a01139F4586d78123i8262E482i7038C84694g9046j89944G6085d8268
$$ plain form
8933 48886 -214492 120674 187341 -154851 47094 -6311 193642 259406 535700 879854 4475238
8922 4475238 15265497 4395933 1020953 304710 341313 -72094 168444 -491533 66250
8912 -308248 398127 166735 271321 180870 7214 -111257 -26441 -96520 398726 -269529 -301783
8901 -301783 -136418 175354 -294005 -163594 101714 -268681 58757 268232 -184915 68956
8890 -92705 67234 -125800 -233328 -278659 29885 255678 -130366 -221676 -294817 -58187 76273
8878 -294901 -101139 64586 -478123 -98262 5482 -97038 384694 -79046 -268990 76085 -48268
$$ [...]
##END NTUPLES=NMR SPECTRUM
##END=
