
##TITLE=AC1333_TANAH10083_6524706_ucDJNJxZ3x
##JCAMPDX= 6.0         $$ Bruker NMR JCAMP-DX V2.0
##DATA TYPE= NMR SPECTRUM
##DATA CLASS= NTUPLES
##ORIGIN= BRUKER
##OWNER= Administrator
$$ 1.72 TOPSPIN		Version 2.1
$$ 2012-07-14 22:27:28.875 -0500  Administrator@TOPSPIN
$$ Compression mode = diff/dup
##.OBSERVE FREQUENCY= 400.02188249412
##.OBSERVE NUCLEUS= ^1H
##.ACQUISITION MODE= SIMULTANEOUS (DQD)
##.ACQUISITION SCHEME= undefined
##.AVERAGES= 64
##.DIGITISER RES= 22
##SPECTROMETER/DATA SYSTEM= spect
##.PULSE SEQUENCE= noesygpps1d.comp
##.SOLVENT NAME= COFFEE_meoh
##.SHIFT REFERENCE= INTERNAL, COFFEE_meoh, 1, 14.9606
##AUDIT TRAIL= $$ (NUMBER, WHEN, WHO, WHERE, PROCESS, VERSION, WHAT)
$$ ##TITLE= Audit trail, TOPSPIN		Version 2.1
$$ ##JCAMPDX= 5.01
$$ ##ORIGIN= Bruker BioSpin GmbH
$$ ##OWNER= Administrator
$$ $$ C:\Bruker\TOPSPIN/data/COFFEE/nmr/AC1333_TANAH10083_6524706_ucDJNJxZ3x/12/pdata/1/auditp.txt
$$ ##AUDIT TRAIL=  $$ (NUMBER, WHEN, WHO, WHERE, PROCESS, VERSION, WHAT)
(   1,<2012-07-14 22:27:24.171 -0500>,<Administrator>,<TOPSPIN>,<go>,<TOPSPIN 2.1>,
      <created by zg
	started at 2012-07-14 22:15:53.890 -0500,
	POWCHK enabled, PULCHK disabled,
       configuration hash MD5:
       6B 1B 68 BB D9 2E 58 E2 7F 35 AD 54 07 DF 0E 41
       data hash MD5: 64K
       27 E8 9B CA 71 78 77 42 3D 8B A2 86 66 64 A3 81>)
(   2,<2012-07-14 22:27:27.046 -0500>,<Administrator>,<TOPSPIN>,<proc1d>,<TOPSPIN 2.1>,
      <Start of raw data processing
       efp LB = 0.3 FT_mod = 6 PKNL = 1 PHC0 = 0 PHC1 = 0 SI = 128K 
       data hash MD5: 128K
       7B C1 18 7D DF 4F 87 03 49 88 C1 39 39 BF 07 C8>)
(   3,<2012-07-14 22:27:28.140 -0500>,<Administrator>,<TOPSPIN>,<proc1d>,<TOPSPIN 2.1>,
      <pk PHC0 = -2.576294 PHC1 = 0 
       data hash MD5: 128K
       D6 79 B6 A9 EE 61 94 88 39 A3 75 E4 7C 2E FF 6B>)
(   4,<2012-07-14 22:27:28.375 -0500>,<Administrator>,<TOPSPIN>,<proc1d>,<TOPSPIN 2.1>,
      <abs ABSG = 1 
       data hash MD5: 128K
       9B AC B2 0A 75 CC 1D 9C AC 1B E1 91 F2 43 E9 E2>)
(   5,<2012-07-14 22:27:28.453 -0500>,<Administrator>,<TOPSPIN>,<proc1d>,<TOPSPIN 2.1>,
      <abs ABSG = 2 
       data hash MD5: 128K
       9C 1D E2 B1 1A 18 5E 9B A1 72 BF C3 14 23 11 45>)
(   6,<2012-07-14 22:27:28.671 -0500>,<Administrator>,<TOPSPIN>,<proc1d>,<TOPSPIN 2.1>,
      <abs ABSG = 3 
       data hash MD5: 128K
       F8 01 B6 03 A8 74 B8 8C A8 24 DE BA 6E 25 FF 5D>)
(   7,<2012-07-14 22:27:28.734 -0500>,<Administrator>,<TOPSPIN>,<proc1d>,<TOPSPIN 2.1>,
      <abs ABSG = 4 
       data hash MD5: 128K
       4C 5E 34 67 9D 29 3B 22 1B 1F 0E BA B8 73 50 2E>)
(   8,<2012-07-14 22:27:28.781 -0500>,<Administrator>,<TOPSPIN>,<proc1d>,<TOPSPIN 2.1>,
      <abs ABSG = 5 
       data hash MD5: 128K
       43 99 E3 0C 44 78 56 5C 93 6E AA 42 B8 E0 BE 7C>)
$$ ##END=
$$ 
$$ $$ hash MD5
$$ $$ 36 31 45 8B 02 C5 2A B4 A7 AF 16 3C 4A D2 ED A9
##$RELAX= 
##$RELAX= 
##$RELAX= 
##$RELAX= 
##$RELAX= 
##$RELAX= 
##$RELAX= 
##$RELAX= 
$$ Bruker specific parameters
$$ [...]
150 150 150 150 150 150 150 150
##$TP07= 0
##$TPNAME0= <>
##$TPNAME1= <>
##$TPNAME2= <>
##$TPNAME3= <>
##$TPNAME4= <>
##$TPNAME5= <>
##$TPNAME6= <>
##$TPNAME7= <>
##$TPOAL= (0..7)
0.5 0.5 0.5 0.5 0.5 0.5 0.5 0.5
##$TPOFFS= (0..7)
0 0 0 0 0 0 0 0
##$TUNHIN= 0
##$TUNHOUT= 0
##$TUNXOUT= 0
##$USERA1= <user>
##$USERA2= <user>
##$USERA3= <user>
##$USERA4= <user>
##$USERA5= <user>
##$V9= 5
##$VALIST= <valist>
##$VCLIST= <CCCCCCCCCCCCCCC>
##$VD= 0
##$VDLIST= <DDDDDDDDDDDDDDD>
##$VPLIST= <PPPPPPPPPPPPPPP>
##$VTLIST= <TTTTTTTTTTTTTTT>
##$WBST= 2048
##$WBSW= 25
##$XGAIN= (0..3)
0 0 0 0
##$XL= 0
##$YL= 0
##$YMAX_a= 11282642
##$YMIN_a= -9440869
##$ZGOPTNS= <>
##$ZL1= 120
##$ZL2= 120
##$ZL3= 120
##$ZL4= 120
##$ABSF1= 14.9606
##$ABSF2= -5.597582
##$ABSG= 5
##$ABSL= 3
##$ALPHA= 0
##$AQORDER= 0
##$ASSFAC= 0
##$ASSFACI= 0
##$ASSFACX= 0
##$ASSWID= 0
##$AUNMP= <proc_prof1d_extract.lims>
##$AXLEFT= 0
##$AXNAME= <>
##$AXNUC= <1H>
##$AXRIGHT= 0
##$AXTYPE= 0
##$AXUNIT= <>
##$AZFE= 0.1
##$AZFW= 0.1
##$BCFW= 0
##$BC_mod= 0
##$BYTORDP= 0
##$COROFFS= 0
##$CY= 15
##$DATMOD= 1
##$DC= 0
##$DFILT= <>
##$DTYPP= 0
##$F1P= 0
##$F2P= 0
##$FCOR= 0.5
##$FTSIZE= 131072
##$FT_mod= 6
##$GAMMA= 0
##$GB= 0
##$INTBC= 1
##$INTSCL= 1
##$ISEN= 128
##$LB= 0.3
##$LEV0= 0
##$LPBIN= 0
##$MAXI= 10000
##$MC2= 0
##$MEAN= 0
##$ME_mod= 0
##$MI= 0
##$NCOEF= 0
##$NC_proc= -2
##$NLEV= 6
##$NOISF1= 0
##$NOISF2= 0
##$NSP= 0
##$NTH_PI= 0
##$NZP= 0
##$OFFSET= 14.9606
##$PC= 1
##$PHC0= -2.576294
##$PHC1= 0
##$PH_mod= 1
##$PKNL= yes
##$PPARMOD= 0
##$PPDIAG= 0
##$PPIPTYP= 0
##$PPMPNUM= 2147483647
##$PPRESOL= 1
##$PSCAL= 4
##$PSIGN= 0
##$PYNMP= <proc.py>
##$REVERSE= no
##$SF= 400.020009798
##$SI= 131072
##$SIGF1= 0
##$SIGF2= 0
##$SINO= 400
##$SIOLD= 131072
##$SPECTYP= <>
##$SREGLST= <1H.CDCl3>
##$SSB= 0
##$STSI= 131072
##$STSR= 0
##$SW_p= 8223.68421052631
##$SYMM= 0
##$S_DEV= 0
##$TDeff= 65536
##$TDoff= 0
##$TI= <>
##$TILT= no
##$TM1= 0
##$TM2= 0
##$TOPLEV= 0
##$USERP1= <user>
##$USERP2= <user>
##$USERP3= <user>
##$USERP4= <user>
##$USERP5= <user>
##$WDW= 1
##$XDIM= 131072
##$YMAX_p= 444154853
##$YMIN_p= -12814
##$CURPLOT= <Network HP LaserJet P1505>
##$CURPRIN= <$Network HP LaserJet P1505>
##$DFORMAT= <normdp>
##$LAYOUT= <+/1D_H.xwp>
##$LFORMAT= <normlp>
##$PFORMAT= <normpl>
##$SURQMSG= 1
$$ End of Bruker specific parameters
$$ ---------------------------------
##NTUPLES= NMR SPECTRUM
##VAR_NAME=  FREQUENCY,     SPECTRUM/REAL,   SPECTRUM/IMAG
##SYMBOL=    X,             R,               I
##VAR_TYPE=  INDEPENDENT,   DEPENDENT,       DEPENDENT
##VAR_FORM=  AFFN,          ASDF,            ASDF
##VAR_DIM=   131072,        131072,          131072
##UNITS=     HZ,            ARBITRARY UNITS, ARBITRARY UNITS
##FACTOR=    0.0627417313425164, 1,          1
##FIRST=     8223.62146879497, 522,          -62602
##LAST=      0,             2164,            -63249
##MIN=       0,             -12814,          0
##MAX=       8223.62146879497, 444154853,    0
$$ Real data points
##PAGE= N=1
##DATA TABLE= (X++(R..R)), XYDATA
$$ [...]
61689D32928l857k449j729j784k022k306k842l484l781l536k946k358k009j795
61675C96030j379q11o87j267j820j623j192j491k204k100j030k23l15m98p7L73
61659C79686J44l79l88K22J158K330L535M132L845L349L390L763L744L189K627
61644D14347K600L315M643O106P148P646P835P637O640M963L424K420J282p38
61630D79268l334n440o308n933m889m077m189m914n105m100k550j512j089m79
61616D25349P95K249K984K713K057J776J688P32j632m472o471p525q443r340r426
61601C93034q503p544p349p502p172o251n206m413m014l981l963l544k889k554
61587C18149k581k474k187k293k813k900k112j216j087j520j769j643j424j191
$$ plain form
61689 432928 429071 426622 424893 423109 421087 418781 415939 412455 408674 405138 402192 399834 397825 396030
61675 396030 394651 393840 393153 391886 390066 388443 387251 385760 383556 381456 380426 380203 379888 379390 379313 379686
61659 379686 379830 379451 379063 379285 380443 382773 386308 390440 394285 397634 401024 404787 408531 411720 414347
61644 414347 416947 420262 424905 431011 438159 445805 453640 461277 467917 472880 476304 478724 480006 479268
61630 479268 475934 470494 464186 458253 453364 449287 445098 440184 435079 430979 428429 426917 425828 425349
61616 425349 426144 428393 431377 434090 436147 437923 439611 440343 438711 434239 427768 420243 411800 402460 393034
61601 393034 384531 376987 369638 362136 354964 348713 343507 339094 335080 331099 327136 323592 320703 318149
61587 318149 315568 313094 310907 308614 305801 302901 300789 299573 298486 296966 295197 293554 292130 290939
61573B90939q93o84o70o72o38q14j126j021l80K9l40q29m17P94J689J575Q75M28
61555B87845O22J169J493J321R67Q65R24P53M73O51J266J536J084N96Q49J614
61539C04028K119K150K155K591L534M686N452N363M624L979L772L614L056K075
61525C53198O46j397l700n177n063l834k640k131k174k325k263j981j796j917
61511C17446j955j348k56N18O00L28r2q88j857k126j266n0M96K29l40q53j173
61494C07413j140q04n38n68p05p24o47n02l06k68n08n86q0M99L63n2N67K297L576
61475C07287L395K579K286K425K432K476K860L124K722J876R16l63j838k505j818
61460C27854p69n41q69q65p15j195k008k046j074K2O38J004J445J928K369K595
$$ plain form
61573 290939 290046 289362 288692 288020 287382 286568 285442 284421 284041 284070 283730 282901 282484 283278 284967 286542 287417 287845
61555 287845 288467 289636 291129 292450 293417 294282 295206 295959 296432 297083 298349 299885 300969 301565 302414 304028
61539 304028 306147 308297 310452 313043 316577 321263 326715 332078 336702 340681 344453 348067 351123 353198
61525 353198 353844 352447 348747 343570 338507 334673 332033 329902 327728 325403 323140 321159 319363 317446
61511 317446 315491 314143 313887 314405 315005 315333 315241 314353 312496 310370 309104 309054 309550 309779 309439 308586 307413
61494 307413 306273 305469 304931 304363 303658 302934 302287 301785 301479 301211 300703 300117 300037 300536 300899 300847 301414 303711 307287
61475 307287 310682 313261 315547 317972 320404 322880 325740 328864 331586 333462 334378 334015 332177 329672 327854
61460 327854 327085 326544 325675 324810 324095 322900 320892 318846 317772 317794 318432 319436 320881 322809 325178 327773
61444C27773K189J088J18J62J039J907K510L223M130M900N510O233O985P303O993
61429C82063O235N151L790K399J267M65J5JJ78j9o17p98N3J488K685L457L964
61412D11777M111L886L668L481K561N45j561k560k738l353m822o397p343p439
61398C93816o642n184l922l620l985m102l667l076k569k020j446r75n47j62j03
61383C51796l47k44N02J098P80J21J78P79Q61K48m4O51J827K652K823K524K150
61366C68355K128K512K827K763K640K735K682K217J881K164K516K249J884K501
61352D02054M038N433O243P009Q129R469J0985J2690J3966J3894J2369J0181Q086
61339E24546O539O046O819Q179R216R843J0348J0286Q994O947N344M291K667j2
$$ plain form
61444 327773 329962 331050 331168 331330 332369 334276 336786 340009 344139 349039 354549 360782 367767 375070 382063
61429 382063 388298 393449 397239 399638 400905 401370 401385 401386 401564 401545 400928 400130 400183 401671 404356 407813 411777
61412 411777 415888 419774 423442 426923 429484 430029 428468 425908 423170 419817 414995 408598 401255 393816
61398 393816 387174 381990 378068 374448 370463 366361 362694 359618 357049 355029 353583 352608 352061 351899 351796
61383 351796 351449 351205 351707 352805 353585 353706 353884 354663 355524 355772 355728 356379 358206 360858 363681 366205 368355
61366 368355 370483 372995 375822 378585 381225 383960 386642 388859 390740 392904 395420 397669 399553 402054
61352 402054 406092 411525 417768 424777 432906 442375 453360 466050 480016 493910 506279 516460 524546
61339 524546 531085 537131 543950 552129 561345 571188 581536 591822 600816 607763 613107 617398 620065 620053
61325F20053k819m863o418q106r758j0653j0424r338q054p156o604n714m055k188
61311E23903j063q57r25o20L30J822L230L785L737M504O871R638J0921J0197Q036
61296E83509M687L32l886o728q498j0341j2055j2235j0609q610p391o678n915
61283D95582n232m819m452m033l736l356k373p90Q69K402L875M983N505O149P636
61268D98210R144R177P930P196P694Q199P778P245P692Q929J0281J1726J3389
61255F14590J4858J5753J6198J6157J5148J3227J1412J0512J0182R630Q528O817
61243G63012M396J481j349l907o563r384j1768j3145j3490j3043j2210j1777j2208
61230F60045j2730j2008r950p763o163m675k931j465o97l26j87o44j585k089j732
$$ plain form
61325 620053 617234 612371 605953 597847 588089 577436 567012 557674 549620 542464 535860 530146 526091 523903
61311 523903 522840 521983 521058 520438 520768 522590 525820 529605 533342 537846 544717 554355 565276 575473 583509
61296 583509 588196 588528 584642 577914 569416 559075 547020 534785 524176 515566 508175 501497 495582
61283 495582 490350 485531 481079 477046 473310 469954 467581 466791 467660 470062 473937 478920 484425 490574 498210
61268 498210 507354 516531 524461 531657 539351 547550 555328 562573 570265 579194 589475 601201 614590
61255 614590 629448 645201 661399 677556 692704 705931 717343 727855 738037 747667 756195 763012
61243 763012 767408 768889 767540 763633 757070 747686 735918 722773 709283 696240 684030 672253 660045
61230 660045 647315 635307 625357 617594 611431 606756 603825 602360 601663 601337 601150 600506 598921 596832 595100
61215E95100j297j481j765j300k13O94R66O82J06m06o23q83j701k837l338k780
61199E78924j738p82K51J705L553N679Q145J0925J3901J7130K0430K2762K2792
61186G03677K0174J5775J0825O516L932L271L395L220L140L945M929M766L842
61173G91407L725M376M058K281O89L57L05m45j216j207j079j774l101m562o378
61158G87436q673j0792j2378j3955j5573j6105j4880j2889j1268r693p291m189
61146F49750j103J685L848M332K204k146p281j1681j4271j4859j4448j4142j3653
61133E68235j1942r333p353o286m813k579j061r46p60O81K363L086L629N177P193
61118E45291Q617R935J2236J5177J7608J9339K0820K1892K2336K2822K3863K4684
$$ plain form
61215 595100 593803 592322 590557 589257 589044 589738 590704 591386 591492 591086 590463 589580 587879 585042 581704 578924
61199 578924 577186 576404 576655 578360 581913 587592 595737 606662 620563 637693 658123 680885 703677
61186 703677 723851 739626 750451 756967 760899 764170 767565 770785 773925 777870 782799 787565 791407
61173 791407 795132 799508 803566 805847 806536 806893 807198 806753 805537 804330 803251 801477 798376 793814 787436
61158 787436 778763 767971 755593 741638 726065 709960 695080 682191 670923 661230 653939 649750
61146 649750 648647 650332 654180 658512 660716 658570 651289 639608 625337 610478 596030 581888 568235
61133 568235 556293 546960 539607 533321 528508 525929 524868 523922 523162 523843 526206 529292 532921 538098 545291
61118 545291 553908 563843 576079 591256 608864 628203 649023 670915 693251 716073 739936 764620
61106G64620K4511K4047K4326K4920K4825K4165K3556K2478J9920J5974J1468
61095A004810O579J214l918p950j1064j3785j5808j6644j6848j7342j8174j8989
61083H72081j9928k0931k1089j9945j8533j7876j7430j6314j5121j4903j5216
61072F74795j4705j3070j1056r163p602o771o535n832m168k566j893j424k92R16
61058E90634J477K087L471M793N187N579P060Q772R374R415J0179J1386J2136
61045F81550J2993J4815J6775J7813J8915K1396K4163K5304K5387K6353K8177
61034I13641K9582L1056L3995L7534L9541M0378M2362M5718M8237M8800M8228
61023A359072M6906M4738M3217M4345M7765N2004N7864O6825P6874Q4183Q8676
$$ plain form
61106 764620 789131 813178 837504 862424 887249 911414 934970 957448 977368 993342 1004810
61095 1004810 1011389 1012603 1008685 1000735 989671 975886 960078 943434 926586 909244 891070 872081
61083 872081 852153 831222 810133 790188 771655 753779 736349 720035 704914 690011 674795
61072 674795 660090 647020 635964 626801 619199 612428 605893 600061 595893 593327 591434 590010 589718 590634
61058 590634 592111 594198 597669 602462 607649 613228 620288 629060 638434 647849 658028 669414 681550
61045 681550 694543 709358 726133 743946 762861 784257 808420 833724 859111 885464 913641
61034 913641 943223 974279 1008274 1045808 1085349 1125727 1168089 1213807 1262044 1310844 1359072
61023 1359072 1405978 1450716 1493933 1538278 1586043 1638047 1695911 1762736 1839610 1923793 2012469
61012B012469R3661J00544J09087J22466J45968J80368K23091K76466L47047M35687
61002D046854N38292O59729Q15995J017968J267462J575904J956007K352333K585302
60993A6815846K427466J796378Q76142J4615n17039o61323n01827j28432L70969
60984B0492795Q18921R50582N85348k00407j103906j810342k177679k244381k118985
60975A3191946j893239j628344j366718j131927r28927p56113o14003n01077m10223
60966C961375l34915k74287k28797j95283j69547j50005j35717j23983j12805
60957B236036j03088r5870q9642q2547p4961o7824o0596n3130m7466m5407m5764
60946A469741m6107m5812m5431m4532m2398l9778l7778l5885l3087l0092k8473
$$ plain form
61012 2012469 2106130 2206674 2315761 2438227 2584195 2764563 2987654 3264120 3611167 4046854
61002 4046854 4585146 5244875 6060870 7078838 8346300 9922204 11878211 14230544 16815846
60993 16815846 19243312 21039690 21915832 21930447 21413408 20752085 20250258 20121826 20492795
60984 20492795 21311716 22262298 22847646 22647239 21543333 19732991 17555312 15310931 13191946
60975 13191946 11298707 9670363 8303645 7171718 6242791 5486678 4872675 4371598 3961375
60966 3961375 3626460 3352173 3123376 2928093 2758546 2608541 2472824 2348841 2236036
60957 2236036 2132948 2037078 1947436 1864889 1789928 1722104 1661508 1608378 1560912 1515505 1469741
60946 1469741 1423634 1377822 1332391 1287859 1245461 1205683 1167905 1132020 1098933 1068841 1040368
60935A040368k8160k7784k7035k6732k6780k6073k4555k3485k3341k3013k1640
60924G61770j9885j8658j7722j6279j4317j2586j1680j1572j1740j1436j0195
60913F05700q386o893o132n681n072m411l952l471k567j308k05M06O32P25Q34
60898E60219J071J531K155K678K839K594K128J691J400J091M19p76k231l524m551
60883E68734n556o608p358p470p112o797o807o997p034o603n526m033k914k901
60869D85018l829m685m739m232l794l440k625j189K57J134J778K989M698N560
60855D72901M345J529j050k088j835j124j65J151K368K651J737O0j847l519m322
60840D70792l851k626j772j866k617l636m779n712n882n228m296l449k541j550
$$ plain form
60935 1040368 1012208 984424 957389 930657 903877 877804 853249 829764 806423 783410 761770
60924 761770 741885 723227 705505 689226 674909 662323 650643 639071 627331 615895 605700
60913 605700 597314 590421 584289 578608 573536 569125 565173 561702 559135 557827 557622 558028 558660 559385 560219
60898 560219 561290 562821 564976 567654 570493 573087 575215 576906 578306 579397 579816 579040 576809 573285 568734
60883 568734 563178 556570 549212 541742 534630 527833 521026 514029 506995 500392 494866 490833 487919 485018
60869 485018 481189 476504 471765 467533 463739 460299 457674 456485 456742 457876 459654 462643 467341 472901
60855 472901 477246 478775 477725 475637 473802 472678 472513 473664 476032 478683 480420 480480 478633 475114 470792
60840 470792 466941 464315 462543 460677 458060 454424 449645 443933 438051 432823 428527 425078 422537 420987
60826D20987q21l94K32J197J855J740J319J194J107N30k53n25l82o63j652k611
60810D22860k862k624k500k589k558k263j907j677j568j571j809k366l100l739
60796C89727m089m020l394k248j059n12q79j798k721l334l443k943k149j770k123
60781C53245k602k401j476m12L55O81L96m17j054p77K07R71J088J043J426K318
60765C52591L430M317M453L645K441J620J363J421J854K791L635L450K219Q64
60751C90094o9q41j505j529p78N5M22O17R89J281J181Q51M07n00k049l733m926
60734C79967n502n565n156m568m320m443m368l902l590l677l521k624j581j238
60720C25912j459j398o61L71J049R04Mq13o06L69P79k3j081j270p59k96J23Q62
$$ plain form
60826 420987 420166 419772 420004 421201 423056 424796 426115 427309 428416 428946 428693 428168 427786 427123 425471 422860
60810 422860 419998 417374 414874 412285 409727 407464 405557 403880 402312 400741 398932 396566 393466 389727
60796 389727 385638 381618 378224 375976 374917 374405 373526 371728 369007 365673 362230 359287 357138 355368 353245
60781 353245 350643 348242 346766 346354 346709 347390 347786 347369 346315 345538 345745 346716 347804 348847 350273 352591
60765 352591 356021 360338 364791 368436 370877 372497 373860 375281 377135 379926 383561 387011 389230 390094
60751 390094 390025 389184 387679 386150 385372 385427 385849 386466 387455 388736 389917 390768 391175 390675 388626 384893 379967
60734 379967 374465 368900 363744 359176 354856 350413 346045 342143 338553 334876 331355 328731 327150 325912
60720 325912 324453 323055 322394 322765 323814 324718 324722 323909 323303 323672 324451 324428 323347 322077 321318 321022 321145 322007
60702C22007J518J420Q02M55M66L24J01L64J031J358J205J295J961K574K625K513
60686C42019K770L072K745J908J479K029L101L792L803L610L653L654L032J850
60672C82517Q83P03J069J353J229P14j32j226k400l493m347m705m433l874l585
60657C60273l551l194k296j373q26l65L22Q82Q94P26J167K355L617M215L834K564
60641C69244R02m13j026j429k385l933n285n666n008l841k725j868j170n78k43
60626C34576k22j99J59O90R22P34M06Q0k71l53K29J134J414P02k77p22o78n69
60608C37755m48j67J67M08P26J299J894K109J820J246P56P52J336K012K114J600
60592C55379J041R01J197J794K321K049O84q11j179o52o33j465j919j250l50r2
$$ plain form
60702 322007 323525 324945 325747 326202 326668 326992 327093 327457 328488 329846 331051 332346 334307 336881 339506 342019
60686 342019 344789 347861 350606 352514 353993 356022 359123 362915 366718 370328 373981 377635 380667 382517
60672 382517 383400 384103 385172 386525 387754 388468 388336 387110 384710 381217 376870 372165 367732 363858 360273
60657 360273 356722 353528 351232 349859 349033 348668 348990 349872 350766 351492 352659 355014 358631 362846 366680 369244
60641 369244 370146 369733 368707 367278 364893 360960 355675 350009 345001 341160 338435 336567 335397 334819 334576
60626 334576 334354 334155 334314 335004 335926 336660 337066 337146 336875 336522 336751 337885 339299 340001 339724 339002 338324 337755
60608 337755 337307 337140 337307 337715 338441 339740 341634 343743 345563 346809 347565 348317 349653 351665 353779 355379
60592 355379 356420 357321 358518 360312 362633 364682 365366 364555 363376 362724 362091 360626 358707 357457 357107 357015
60576C57015O1Q39J712J899J911K690L921M565M695N491P409R520J0815J1299
60562D23842J1547J1747J1402R730O488K449j151l830o022p937q986q729p647
60549D32903o425n066l259j143R25K848M580N880O718P420Q113Q717R617J1464
60535D83292J3843J5240J4881J3599J2219J0246P053L183n57m184p497r077p939
60522E44302n497m227m698n414n303m855m755m746m146k725q55O98J301J212J379
60507E01671K077K480K210K308L719N841P825J0339J4499J9746K4508K8501L2604
60494F58328L6859M0353M3024M5667M7939M8009M4675L8413K9944J9118N916q497
60482A049748k2317l4038m2640m7788n0089n0464m9067m5652m0803l5842l1374
$$ plain form
60576 357015 357076 357915 359627 361526 363437 366127 370048 374613 379308 384799 392208 401728 412543 423842
60562 423842 435389 447136 458538 468268 474756 477205 476054 472224 466202 458265 449279 440550 432903
60549 432903 426478 421412 418153 417010 417935 420783 425363 431243 437961 445381 453494 462211 471828 483292
60535 483292 497135 512375 527256 540855 553074 563320 570373 573556 572999 568815 561318 552241 544302
60522 544302 538805 534578 529880 524466 519163 514308 509553 504807 500661 497936 497081 497779 499080 500292 501671
60507 501671 503748 506228 508438 510746 514465 520306 528131 538470 552969 572715 597223 625724 658328
60494 658328 695187 735540 778564 824231 872170 920179 964854 1003267 1033211 1052329 1058245 1049748
60482 1049748 1027431 993393 950753 902965 852876 802412 753345 707693 666890 631048 599674
60471E99674k7095k3072k0087j8325j6846j4902j2891j1462j0429r135p422n763
60459D22245m719m464m626m540l923l172k721k487k300k405k900l224k915k373
60445C75476k069j631o40K30J44l86k67L83N58K03J23K38l73j599k152j607j051
60428C65580j217j378p98N6M67N28N71L84k48r60j322j347j109m91L84J118J630
60411C61848K126K406K025J216P65Q31Q39O68Q88J563J875J426R29J098J639J804
60395C83946J361O47K85R42K666M319M537L371K204J906J994J787J350J022R24
60380D13261J236K073K855K713J861J537K263L112L146K685K582K985L371L264
60366D48944K611J830J545J753J490R4j482j706n93M66Q79J410K451L338L835
$$ plain form
60471 599674 572579 549507 529420 511095 494249 479347 466456 454994 444565 435430 428008 422245
60459 422245 417526 413062 408436 403896 399973 396801 394080 391593 389293 386888 383988 380764 377849 375476
60445 375476 373407 371776 371136 371366 371510 371124 370857 371240 371798 372001 372124 372362 371989 370390 368238 366631 365580
60428 365580 364363 362985 362187 362243 362710 363238 363809 364193 363945 362985 361663 360316 359207 358716 359100 360218 361848
60411 361848 363974 366380 368405 369621 370386 371217 372056 372724 373612 375175 377050 378476 379405 380503 382142 383946
60395 383946 385307 385954 386239 387181 389847 394166 398703 402074 404278 406184 408178 409965 411315 412337 413261
60380 413261 414497 416570 419425 422138 423999 425536 427799 430911 434057 436742 439324 442309 445680 448944
60366 448944 451555 453385 454930 456683 458173 458267 456785 455079 454486 454952 455831 457241 459692 463030 466865
60351D66865M739O362P797Q319Q290Q033P128N532M132L251J893n76l118m512
60337E24135n081n800o576o655o122n671n331m583l502k744k563k586k556k590
60323D61775k780l021l239l450l651l742l453k431p70P18J351J579K396L879N179
60308D50340O002P051Q825J1078J3647J6814K0346K3046K3696K1877J7745J1953
60296F32420N794L10m911j0871j6935k0846k1392j9680j7300j4637j1667q950
60284D91335o807m713k422p22j90j88O8M10M40L89M43J91n11j077j347k032l270
60267D69997l959l490k904l197l648l145k118j808k345k910l098k964k344j331
60253D30736p87j281k035j955j106k50L56P54O95L17N19J568K223J531N23O67
$$ plain form
60351 466865 471604 477966 485763 494082 502372 510405 517533 523065 527197 530448 532341 531765 528647 524135
60337 524135 519054 513254 506678 500023 493901 488230 482899 478316 474814 472070 469507 466921 464365 461775
60323 461775 458995 455974 452735 449285 445634 441892 438439 436008 435238 435956 437307 438886 441282 445161 450340
60308 450340 456342 463393 472218 483296 496943 513757 534103 557149 580845 602722 620467 632420
60296 632420 638214 638524 633613 622742 605807 584961 563569 543889 526589 511952 500285 491335
60284 491335 484528 479815 477393 476671 476481 476293 476361 476771 477211 477600 478043 478234 477723 476646 475299 473267 469997
60267 469997 466038 462548 459644 456447 452799 449654 447536 445728 443383 440473 437375 434411 432067 430736
60253 430736 429949 428668 426633 424678 423572 423322 423678 424432 425127 425444 425963 427531 429754 431285 431808 432475
60237D32475J464J316J91m44k4N14N37M96P52R83J067J336J758J890J741J790
60221D47842K084K198K119K274K672K941L129L579M047L915L397L489M608O053
60207D94347P086P746Q329Q757Q880Q914R250R894J0345R992Q784P477O935P087
60193F13823P068O433N639N091M493L509K325J089l84j841k464k201k393m124
60179F36063o700q622r398r450r022q251p742p830p765o725n239m455m399m120
60165E36345l324k602k192j672r35m39l33k28Q8M15O98J186J931K637K962K660
60149E37197J650M46O4R28K181K620K012J030L59M56J541L232M578N167N648O664
60133E75773P825Q418Q515Q617Q818R003R233R185Q018N626L249K004J538J059
$$ plain form
60237 432475 433939 435255 435446 435002 434978 435492 436029 436525 437277 438260 439327 440663 442421 444311 446052 447842
60221 447842 449926 452124 454243 456517 459189 462130 465259 468838 472885 476800 480197 483686 488294 494347
60207 494347 501433 509179 517508 526265 535145 544059 553309 563203 573548 583540 592324 599801 606736 613823
60193 613823 620891 627324 632963 638054 642547 646056 648381 649470 649086 647245 644781 642580 640187 636063
60179 636063 629363 620741 611343 601893 592871 584620 576878 569048 561283 554558 549319 544864 540465 536345
60165 536345 533021 530419 528227 526555 525620 525181 524848 524620 524708 525123 525821 527007 528938 531575 534537 537197
60149 537197 538847 539293 539357 540285 542466 545086 547098 548128 548487 548943 550484 553716 558294 563461 569109 575773
60133 575773 583598 592016 600531 609148 617966 626969 636202 645387 653405 659031 662280 664284 665822 666881
60119F66881P09Q34Q52J97m14n5P29Q17M20N63J174J264P15K94J04m15j165j510
60101F71994j613k204l137l666m022n136o780p599p192o640o605o353n131l323
60087F02593j719o63k61n22r01o93l1L34L36P12J728K780L468M008M391M136L132
60070F22828J781J09k312n224p430q119p720p187p030p283p737p967p656o978
60056E42075o267n496m604m007l984l856k746r66K95O38P71J250J845K294K766
60041E20008L467M416N617O829P459P395P492Q362R101Q387O435M656L548K320
60027F05492N82r83j851k396l111m047n204o600p837q457q702r114r555r576r448
60012E19193r804j0403j0440r875r292q668p522o171n422n093m247k913k054j748
$$ plain form
60119 666881 667590 668424 669276 669473 669059 669004 669733 670550 670970 671533 672707 673971 674686 674980 675084 674669 673504 671994
60101 671994 670381 668177 665040 661374 657352 652216 645436 637837 630645 624005 617400 611047 605916 602593
60087 602593 600874 600211 599950 599428 598527 597834 597803 598137 598473 599185 600913 603693 607161 611169 615560 619696 622828
60070 622828 624609 624718 622406 617182 609752 601633 593913 586726 579696 572413 564676 556709 549053 542075
60056 542075 535808 530312 525708 521701 517717 513861 511115 510149 510444 511082 511853 513103 514948 517242 520008
60041 520008 523475 527891 533508 540337 547796 555191 562683 571045 580146 588533 594968 599624 603172 605492
60027 605492 606074 605091 603240 600844 597733 593686 588482 581882 574045 565588 556886 547772 538217 528641 519193
60012 519193 509389 498986 488546 478671 469379 460711 453189 447018 441596 436503 432256 429343 427289 425541
59998D25541r57N60J656J594J058Q54Q63R31J536K861M164M710M651M531M618
59983D59171N050N842O506O370N518M669M114L487K624J692N92q46k165k800l138
59968D96686l952m902m886l825k783k239j622o50J89P00J275J947K381K828L771
59953D84918M631M233K673J210K88p26j795k096j873k416l606l554j564M51O34
59938D81408l60q35n91o01j279k304l354m007l719k670j885j768j443k12J323
59923D57703K365L119M116N202O088P038Q216R026Q825P681N933L749J598L64
59909E31023M16J214K105K834L135K818K454K859L680L658K565J531J159P64j07
59894E62108q21j014j322k059k473k038j280n56N91K169L171L128K927L237L463
$$ plain form
59998 425541 424584 425144 426800 428394 429452 430306 431169 432100 433636 436497 440661 445371 450022 454553 459171
59983 459171 464221 470063 476569 482939 488457 493126 497240 500727 503351 505043 505635 504789 502624 499824 496686
59968 496686 492734 487832 482946 479121 476338 474099 472477 471827 472016 472716 473991 475938 478319 481147 484918
59953 484918 489549 493782 496455 497665 497953 497227 495432 493336 491463 489047 485441 481887 480323 480774 481408
59938 481408 481048 480213 479622 479021 477742 475438 472084 468077 464358 461688 459803 458035 456592 456380 457703
59923 457703 460068 463187 467303 472505 478593 485631 493847 502873 511698 519379 525312 529061 530659 531023
59909 531023 531439 532653 534758 537592 540727 543545 545999 548858 552538 556196 558761 560292 561451 562215 562108
59894 562108 561287 560273 558951 556892 554419 552381 551101 550545 551136 553305 556476 559604 562531 565768 569231
59879E69231L173L233M396N949O822O954O615N515L604J758N63n37j993l121l302
59864F08860l121l255l268k582j766j690k195k546k453j870p17N40J005P87J173
59849E86902K716M445N745P445R772J0868Q892M588K51k876m834n592n014l590
59835F19718j962k73J046Q00j551m801p343q714q967p770n376l285k545k395j881
59820E64701j558k182k903k583j851k062k968l315l074l165l525l302k656k540
59806E27017k892k703j849j256j251j156o34k08k99p39j223j481j212o05m55j048
59790E08006j510j141o75j098j961k114j529j078j080j252j692k550l184k852
59776D84290j897j176p37j73L13L94N98J496K476K613K245K399L032L215K745
$$ plain form
59879 569231 572404 575637 580033 585982 592804 599758 606373 611888 615492 617250 617813 617276 615283 612162 608860
59864 608860 605739 602484 599216 596634 594868 593178 590983 588437 585984 584114 583397 583937 584942 585729 586902
59849 586902 589618 594063 599808 607253 617025 627893 636785 641373 641624 638748 633914 628322 623308 619718
59835 619718 617756 617483 618529 619329 617778 612977 605634 596920 587953 580183 574807 571522 568977 566582 564701
59820 564701 563143 560961 558058 555475 553624 551562 548594 545279 542205 539040 535515 532213 529557 527017
59806 527017 524125 521422 519573 518317 517066 515910 515276 515068 514769 514030 512807 511326 510114 509509 509054 508006
59790 508006 506496 505355 504680 503582 501621 499507 497978 496900 495820 494568 492876 490326 487142 484290
59776 484290 482393 481217 480480 480307 480620 481014 481612 483108 485584 488197 490442 492841 495873 499088 501833
59761E01833K248K033K041K525L601M500M473M063M313N229O166P097Q224Q909
59747E67255Q520P873Q290R633J0633J0802J0567R859Q236O099M361L051J634
59734F66813M01k0k15j485l817n806o583o515o071n337m579m046l359k247j551
59719F15583k159l300l437k571k082k464k837k647k282j964j517j234j579j979
59705E83531j436k54L35L27R68K539L684L413K307J352Q34Q08J399K297K906L183
59689F08193L368K987J375r41k646l404l849l940l004j434o96j163j584j232j048
59674E90982j983l532m724n460o075o482o505o342o228o111n960n796n313m151
59660E16320k550j121k3Q26J084M89j89J60J438K564L128L682M465N049N241N175
$$ plain form
59761 501833 504081 506114 508155 510680 514281 518781 523254 527317 531630 536859 543025 550122 558346 567255
59747 567255 575775 583648 591938 601571 612204 623006 633573 643432 651668 657767 662128 665179 666813
59734 666813 667214 667194 666979 665494 661677 655871 649288 642773 636702 631365 626786 622740 619381 617134 615583
59719 615583 613424 610124 606687 604116 602034 599570 596733 594086 591804 589840 588323 587089 585510 583531
59705 583531 582095 581841 582176 582503 583471 586010 589694 593107 595414 596766 597600 598408 599807 602104 605010 608193
59689 608193 611561 614548 615923 614982 612336 608932 605083 601143 598139 596705 596009 594846 593262 592030 590982
59674 590982 588999 585467 580743 575283 569208 562726 556221 549879 543651 537540 531580 525784 520471 516320
59660 516320 513770 512649 512626 513452 514536 515025 514836 514996 516434 518998 522126 525808 530273 535322 540563 545738
59644E45738M577L108J320K8j032k617m196m425l376k676l140l806l682k954k058
59629E20809j015j14Qn28q48p77j095k045k894l313l817m448m388l475k844l318
59613D85898m249m600m185l280j955m14Q09J486J845J903J526J179J601K485K672
59598D82721J882J118J012J002N89K44M81R81J246J271J147Q18N25P01J092R01
59582D97731J7p68r79r27q75p51r04j972l655m671m329l277k395j914j880k441
59566D66010l238l375k480j072L21J633K683K927K157Q23m42j146j005k53L48
59551D63891M52O31J293J858J893K104K975L405K338Q68Q15K009L113M364P074
59536D99083J0977J4744J8761K4086K8424K6659J6984L891o423j1572j2735j1372
$$ plain form
59644 545738 550315 553423 554743 554771 553739 551122 546926 542501 539125 536449 533309 529503 525821 522867 520809
59629 520809 519794 519680 519688 519160 518312 517535 516440 514395 511501 508188 504371 499923 495535 492060 489216 485898
59613 485898 481649 477049 472864 469584 467629 467215 468024 469510 471355 473258 474784 475963 477564 480049 482721
59598 482721 484603 485721 486733 487735 488324 488568 489049 490030 491276 492547 493694 494512 495037 495738 496830 497731
59582 497731 497748 496980 496001 495074 494199 493448 492544 490572 486917 482246 477917 474640 472245 470331 468451 466010
59566 466010 462772 459397 456917 455845 456166 457799 460482 463409 465566 466389 465947 464801 463796 463543 463891
59551 463891 464343 464974 466267 468125 470018 472122 475097 478502 480840 481708 482523 484532 487645 492009 499083
59536 499083 510060 524804 543565 567651 596075 622734 639718 643609 637186 625614 612879 601507
59524F01507q286m409n85K909N689P059P145O991O929O131M296K306N62j699m691
59509F31854p290q799r910j1133j1817j1644j1437j1596j1305j0172r008q173
59497E09570o812m734l239k970k758j793j117j587k127j602p97q52j208p49K37
59482D77462R30J575K598L254K910K534L273M538N152N403O239P269P353O573
59468E37063N861N170L688J556j19q38j090j311j440j322q00L26J770K772L185
59453E54471L860N396P291Q931J0410J1729J2248J1796J1253J1135J0603Q763
59441F67886N887K498j528n957r435j0946j1087j0916j0482r462q261p409o824
59428E83964o414o363o237n091l220k126j940p15K559O219Q662J0766J3770J6767
$$ plain form
59524 601507 593221 588812 588227 591136 596825 603884 611029 618020 624949 631080 635376 637682 638244 636545 631854
59509 631854 624564 615765 605855 594722 582905 571261 559824 548228 536923 526751 517743 509570
59497 509570 502758 498024 494785 491815 489057 487264 486147 484560 482433 480831 480034 479182 477974 477225 477462
59482 477462 478392 479967 482565 485819 488729 491263 494536 499074 504226 509629 515868 523137 530490 537063
59468 537063 542924 548094 551782 553338 553219 552381 551291 549980 548540 547218 546418 546744 548514 551286 554471
59453 554471 558331 563727 571018 579949 590359 602088 614336 626132 637385 648520 659123 667886
59441 667886 673773 676271 674743 668786 659351 648405 637318 626402 615920 606458 598197 590788 583964
59428 583964 577550 571187 564950 559859 556639 554513 552573 551858 554417 560636 569298 580064 593834 610601
59414F10601J8441J9580K1543K3930K6351L0571L7259M1649L6645K0858O97j6003
59402H72122k5805k8984k6685k0675j3484o343J970J2103K0519K0929J0206p666
59390H08207k4174l2856l3440k9993k6070k2423j8613j4921j1960r697p791o186
59378E70083m690k764m21J511K540L110L567L613L313L405L950M003L346L096
59364E97662L705L963L100K259K510L008K736K526L500M845N168M996N777P257
59350F53012P980P828Q079R320J1098J3188J5520J7176J7199J6173J5497J5409
59338H07479J5126J4398J3489J2046R481O154K833m87m001p059r186j1318j4358
59325H34597j7274j8343j7716j6916j6317j5053j3078j1381j0234q976p446o112
$$ plain form
59414 610601 629042 648622 670165 694095 720446 751017 788276 829925 866570 887428 888125 872122
59402 872122 846317 817333 790648 769973 756489 750146 752116 764219 784738 805667 815873 808207
59390 808207 784033 751177 717737 687744 661674 639251 620638 605717 593757 584060 576269 570083
59378 570083 565393 562629 562208 563719 566259 569369 572936 576549 579862 583267 587217 591220 594566 597662
59364 597662 601367 605330 608430 610689 613199 616207 618943 621469 624969 629814 634982 639978 645755 653012
59350 653012 660992 668820 676899 686219 697317 710505 726025 743201 760400 776573 792070 807479
59338 807479 822605 837003 850492 862538 872019 878173 881006 880519 876518 869459 860273 848955 834597
59325 834597 817323 798980 781264 764348 748031 732978 719900 708519 698285 689309 681863 675751
59313F75751m916l495k340k216k681k608j903j318q80k6J095J986L072N113P842
59298F72476J0665J3944J7526J8680J4013L773p747j6370k0934k2203k1095j8706
59286F44022j6280j4213j2012r598p624o320n124l672k198r34O9O82J168K526
59272E70492N296Q394J0356J1306J2517J4392J6211J7456J8021J7504J5671J3248
59260G30864J0978Q368M740Q49k078m374p163j0171j2127j2964j3700j4332j3843
59247F65047j2176j0362q657o410l792j883r19m0J069J845K189K572K929K873
59233F34285K927L976N622O651O901P063O955N813M097L055K560J265j133l579
59219F86458n591p576r280r829r428r129q854p620n744m783n008m926l674j992
$$ plain form
59313 675751 670835 667340 665000 662784 660103 657495 655592 654274 653394 653368 654463 656449 659521 664634 672476
59298 672476 683141 697085 714611 733291 747304 751077 743330 726960 706026 683823 662728 644022
59286 644022 627742 613529 601517 591919 584295 577975 572851 569179 566981 566047 566116 566798 567966 570492
59272 570492 575788 584182 594538 605844 618361 632753 648964 666420 684441 701945 717616 730864
59260 730864 741842 750210 754950 755799 753721 749347 742184 732013 719886 706922 693222 678890 665047
59247 665047 652871 642509 633852 627442 623650 621767 620848 620808 621877 623722 625911 628483 631412 634285
59233 634285 637212 641188 646810 653461 660362 667425 674380 680193 684290 687345 689905 691170 690037 686458
59219 686458 680867 673291 664011 654182 644754 635625 626771 619151 613407 608624 603616 598690 595016 593024
59205E93024n94N67J101K42j503k617k813l168l819l596k356j525j708j745q97
59190E68593l6J21J94P45J320J622K131K855L045K705K863L738M226L828L482
59175F01432L776L955L501L189L732M671N319N680N861N824O065P316R137J0152
59161F79610R946R422R062Q349P155O054M968L121O82j206k433m217o992r699
59147G13822j1559j2845j3499j2886j1436j0654j0823j0509r026p572p123p100
59135E88790o900o977p410p116n488l380j643j26J154J493R80R37J941L006L525
59120E62786M422O356Q346R333R738J0398J1179J1642J2042J2700J3343J3756
59108F86041J4137J4318J3729J2566J1794J1653J1445J1031J1096J1584J1440
$$ plain form
59205 593024 592430 592997 594098 594340 592837 590220 587407 584239 580420 576824 574468 572943 571235 569490 568593
59190 568593 568557 568678 568872 569617 570937 572559 574690 577545 580590 583295 586158 589896 594122 597950 601432
59175 601432 605208 609163 612664 615853 619585 624256 629575 635255 641116 646940 653005 660321 669458 679610
59161 679610 689556 698978 708040 716389 723544 729598 734566 737687 738369 737163 734730 730513 723521 713822
59147 713822 702263 689418 675919 663033 651597 640943 630120 619611 610585 603013 595890 588790
59135 588790 581890 574913 567503 560387 554899 551519 549876 549750 550904 552397 553377 554314 556255 559261 562786
59120 562786 567208 573564 581910 591243 600981 611379 622558 634200 646242 658942 672285 686041
59108 686041 700178 714496 728225 740791 752585 764238 775683 786714 797810 809394 820834
59097H20834J0288Q794P107M625J714k27q98j455k248k160q50M24R21J349J883
59082H50101J292r14l404n221p200j0085j3008j5037j6581j8031j8523j7295j4978
59069G11116j2598j0565r303r355j0147j0214r334q751q795q240o721n558n333
59056E96202m858l608k905l409l703k803j918k157k528j903j102j217j593j223
59042E61275n75l61p4O60Q76M2n12L89J831K508K796L458L868L405L249M833P541
59025E95209R757J1156J2385J3571J4756J6770K0070K3493K5612K6468K6734K6158
59013H22139K4065K0436J5567R627L452j578n250q613j1621j2539j0750q120o251
59000H30564m398j589J262L110M640O458P263N900L614K025M49k520o115q401
$$ plain form
59097 820834 831122 839916 847023 851648 853362 853135 852237 850782 848534 846374 845524 845948 846869 848218 850101
59082 850101 851393 850479 847075 841854 834654 824569 811561 796524 779943 761912 743389 726094 711116
59069 711116 698518 687953 678650 669295 659148 648934 639600 630849 622054 613814 607093 601535 596202
59056 596202 591344 587736 584831 581422 577719 574916 572998 570841 568313 566410 565308 564091 562498 561275
59042 561275 560700 560339 560265 560925 561801 561843 561331 561720 563551 566059 568855 572313 576181 579586 582835 587668 595209
59025 595209 604966 616122 628507 642078 656834 673604 693674 717167 742779 769247 795981 822139
59013 822139 846204 866640 882207 891834 895286 893708 888458 879845 868224 855685 844935 836815 830564
59000 830564 826166 824577 825839 828949 833589 840047 847310 853210 856824 858849 859298 856778 850663 842262
58986H42262r154r607j0234j0811j1694j3140j4137j3771j2858j2502j1989r918
58974G02447o617l628j503K40J686K662L651N117O590P525Q252R054R360Q943
58960G53779Q637Q793Q406O972N598M948L742Q70k582n104p042r425j1918j3654
58946G52020j4716j5247j4532j2530j0726r878q578n732k637p85M05J757K165
58933F60986O28j473k439k951m239n332m752l373k882k864k128j474k264l539
58919F21904l494k758l192m405m528l639l432l968l748k682k131k166j377N86
58905E80970K576L994N183O091O517P299R330J1857J3542J4476J5250J5049J2888
58892G05022R904Q106P566P113P000Q488J1355J4239J6890J9824K2193K2400K0448
$$ plain form
58986 842262 833108 823501 813267 802456 790762 777622 763485 749714 736856 724354 712365 702447
58974 702447 695830 692202 690699 690939 692625 695287 698938 704055 710645 718170 726422 735476 744836 753779
58960 753779 762416 771209 779615 786587 792185 797133 800875 801745 799163 794059 787017 777592 765674 752020
58946 752020 737304 722057 707525 694995 684269 674391 665813 660081 657444 656659 657064 658821 660986
58933 660986 661614 660141 657702 654751 650512 645180 640428 637055 634173 631309 629181 627707 625443 621904
58919 621904 618410 615652 612460 608055 603527 599888 596456 592488 588740 586058 583927 581761 580384 580970
58905 580970 583546 587540 592723 598814 605331 612630 621960 633817 647359 661835 677085 692134 705022
58892 705022 714926 723032 730598 737711 744711 753199 764554 778793 795683 815507 837700 860100 880548
58879H80548J7692J4701J1319Q087N600L073m68m354p515j0470j4025j7133j8457
58866H68598j8759j9289j9065j6511j2769j0394r601q754p771p938q876q850p905
58853G12116p772q742r305q772p816o639n036l884m053m308k877o26J1j205k377
58838F38715k876l832n470o764p654q920r979r414p628o428o093n327l878k732
58824E51720j942p75K80J98k99K97J476J472M15J4N41Q39Q93J567K237J588L56
58807E60877L81J340J403O47O52J141M04j156j416l77k19j377j978j469j432k385
58791E55036l022l038l629m658m468k921j740j366m43J271K468L061M349O116
58777E47016O702O299O877Q426Q558O514M290K964J150j878m521n513n679n965
$$ plain form
58879 880548 898240 912941 924260 932347 937947 941020 940552 936198 928683 918213 904188 887055 868598
58866 868598 849839 830550 811485 794974 782205 771811 762210 753456 745685 737747 728871 720021 712116
58853 712116 704344 695602 686297 677525 669709 663070 658034 654150 650097 645789 642912 642286 642297 641092 638715
58838 638715 635839 632007 626537 619773 612119 603199 593220 583806 576178 569750 563657 558330 554452 551720
58824 551720 549778 549003 549283 549481 549182 549479 550955 552427 552842 552856 553397 554236 555129 556696 558933 560521 560877
58807 560877 561258 562598 564001 564648 565300 566441 566845 565689 564273 563896 563677 562300 560322 558853 557421 555036
58791 555036 552014 548976 545347 540689 536221 533300 531560 530194 529751 531022 533490 536551 540900 547016
58777 547016 553718 560017 566894 575320 583878 590392 594682 597646 598796 596918 592397 586884 581205 575240
58763E75240o130o036o072n795m424k833k589l068k162J67J990K900M224N783
58749E51195N798M296L287L217K609J449J379K192J811L56N19L066N546O394O788
58734E99902P500P474O635O674P887Q468P917P896Q756Q697P303O393O363N211
58720G03076K436K40l49j048k591l110j737k99K31J537M422O828P203O780O672
58705G30291N748L217N12j216k888n259p541r507j2225j5523j7555j7934j8342
58692F31778j9045j8105j5205j2762j1891j0741q221n967n100m447l529l770n171
58679E07824n342l609k568l636m658l816k505k226j934o54M49O70J439L502N415
58664D88351O529Q289J0910J2251J1651J1304J1998J1245P682L628J066j208m145
$$ plain form
58763 575240 569110 563074 557002 551207 546783 543950 541361 538293 536131 536298 538288 541188 545412 551195
58749 551195 556993 561289 564576 567793 570402 571851 573230 575422 577233 577589 578108 581174 586720 593114 599902
58734 599902 607402 614876 621511 628185 636072 644540 652457 660353 669109 677806 685109 691502 697865 703076
58720 703076 705512 705752 705403 704355 701764 698654 696917 696618 696849 698386 702808 709636 716839 723619 730291
58705 730291 736039 739256 739768 738552 735664 730405 722864 713357 701132 685609 668054 650120 631778
58692 631778 612733 594628 579423 566661 554770 544029 535808 529841 524741 520294 516765 512995 507824
58679 507824 502482 498873 496305 492669 488011 484195 481690 479464 477530 476876 477325 477995 479434 482936 488351
58664 488351 494880 503169 514079 526330 537981 549285 561283 572528 580210 583838 584904 583696 579551
58651E79551n930n419m547m798m769l621l319m822n711m436l258m138n236m509
58637E15038l367l549l672k098j60N97J415L486N073M521L307L185L177K199J621
58622E30773K336K339K79j665j453o42j080j331L01K258K642K801M522O337O112
58607E54529M731L958L203J617P60J922L262K816J855K197K781J924M34m73j709
58592E83807l902n229m524l629l824l159k54K599L403M053O558R111R571R487
58578F04068J0774J1748J0454Q783R062R632Q055N871N795O879O785O390P848
58565G12144J0427J2403J4678J8594K2565K4770K6681L0071L3213L4024L4043
58554I73613L5154L5178L1177K4468J8068J1853M675j542m578o246r283j2313
$$ plain form
58651 579551 573621 568202 563655 558857 554088 550467 547148 542326 536615 532179 528921 524783 519547 515038
58637 515038 511671 508122 504450 502352 502192 502789 504204 507690 512763 517284 520591 523776 526953 529152 530773
58622 530773 533109 535448 535727 534062 532609 531967 530887 529556 529857 532115 534757 537558 542080 548417 554529
58607 554529 559260 563218 566421 568038 568798 570720 573982 576798 578653 580850 583631 585555 585989 585516 583807
58592 583807 579905 574676 570152 566523 562699 559540 559286 561885 565288 569341 575899 585010 594581 604068
58578 604068 614842 626590 637044 645827 654889 664521 672576 678447 684242 691121 697906 704296 712144
58565 712144 722571 734974 749652 768246 790811 815581 842262 872333 905546 939570 973613
58554 973613 1008767 1043945 1075122 1099590 1117658 1129511 1134186 1132644 1128066 1121820 1112537 1100224
58542A100224j2502j0832j0135j0286j0003j0971j5369k1408k5884k8931l1851
58531I12052l2956l0368k6436k4377k2887j9032j3990j0875r191o656m198l846
58519G07240l986k067J14p20l292m069l464m207n496m600k515k262l133k278m84
58504F64781p09k302k275j025j194k150j207R49J407M22K97L76j426l508k622
58489F49814L14J918K382M261O691O769N441O159Q674R937J0138J2121J5681J8159
58475G58459J9759K2612K5639K5894K3973K2466K0294J4382N881j228o543j2388
58463I19200j7792j9546j8327j7616j7329j4607j0038o871m832q55M629Q257R939
58450H14212J2475J5642J6630J5621J5012J3872R232K037m114r078j4916j9871
$$ plain form
58542 1100224 1087722 1076890 1066755 1056469 1046466 1035495 1020126 998718 972834 943903 912052
58531 912052 879096 848728 822292 797915 775028 755996 742006 731131 721940 715284 711086 707240
58519 707240 703254 701187 701301 700581 697289 693220 689756 685549 680053 675453 672938 670676 667543 665265 664781
58504 664781 664072 661770 659495 658470 657276 655126 653919 654868 656275 656697 656994 657370 655944 652436 649814
58489 649814 650128 652046 654428 658689 665380 672149 677590 683749 692423 702360 712498 724619 740300 758459
58475 758459 778218 800830 826469 852363 876336 898802 919096 933478 939359 938131 931588 919200
58463 919200 901408 881862 863535 845919 828590 813983 803945 797074 792242 791387 796016 804273 814212
58450 814212 826687 842329 858959 874580 889592 903464 912696 914733 910619 901541 886625 866754
58438H66754k0190j6969j4737j4019j1761p997n498l793k80L677M621L860N547
58425G89215R056J0380J0034J2026J5973J7817J7577J8619J9902J6943J0156M376
58413I52074L94n145j1664j4688j4031j4053j5620j5466j3595j3400j4427j2847
58401H07532r173p654q093o286k369m87l62K217O670Q048O320O333Q484Q275N402
58386H24857M190M649K396k102l618j994k365n007m795j567r05l445l526QJ843
58371H08619O28J248M794O379N001N514Q683R373O861O828J0669J2914J1768J2087
58357I11366J5305J6630J4943J5208J8250J8314J3719R750Q306M984o84k892n34
58344A042665K29k402k457K219N785N502O177R903J2031J1149J2348J6806J8816
$$ plain form
58438 866754 846564 829595 814858 800839 789078 781081 775583 771790 771510 775187 779808 783668 789215
58425 789215 798271 808651 818685 830711 846684 864501 882078 900697 920599 937542 947698 952074
58413 952074 952468 947323 935659 920971 906940 892887 877267 861801 848206 834806 820379 807532
58401 807532 798359 790705 782612 776326 773957 773470 773108 775325 781995 790043 796363 802696 811180 819455 824857
58386 824857 829047 833696 836092 833990 830372 828378 826013 821006 816211 814644 813739 810294 806768 806776 808619
58371 808619 809247 810495 815289 821668 826669 832183 840866 850239 857100 863928 874597 887511 899279 911366
58357 911366 926671 943301 958244 973452 991702 1010016 1023735 1033485 1041791 1046775 1046091 1043199 1042665
58344 1042665 1042894 1040492 1038035 1040254 1046039 1051541 1057718 1067621 1079652 1090801 1103149 1119955 1138771
58331A138771J6789J6344J9010J9085J5292J3989J6926J7522J3307J0204J0348
58320A307587P933J458k198n04K22k449k478J900L831J192J091N907Q304N612
58306A337408N431J0975J4683J2741J2131J6608J9534J7525J7231K1501K2847
58295A508615J7967J4703J7107J7853J3027R999J2716J3870R793Q348J3605J7606
58283A675209J5822J5734K1322K4590K1489K0534K6294L0164K7115K5479L0275
58272A934027L3376L0290K9919L7068M2357M0297M0025M6990N1873M9218M8856
58261B384296N6700O2735O0494N9681O6633P1424O7519O4695O8866O9418O0561
58250C093022N4572N9180O3098N8900N8212O8415P7063P5977P7534Q9871R9995
$$ plain form
58331 1138771 1155560 1171904 1190914 1209999 1225291 1239280 1256206 1273728 1287035 1297239 1307587
58320 1307587 1315520 1316978 1314780 1314276 1314498 1312049 1309571 1311471 1315302 1316494 1317585 1323492 1331796 1337408
58306 1337408 1342839 1353814 1368497 1381238 1393369 1409977 1429511 1447036 1464267 1485768 1508615
58295 1508615 1526582 1541285 1558392 1576245 1589272 1599271 1611987 1625857 1635650 1643998 1657603 1675209
58283 1675209 1691031 1706765 1728087 1752677 1774166 1794700 1820994 1851158 1878273 1903752 1934027
58272 1934027 1967403 1997693 2027612 2064680 2107037 2147334 2187359 2234349 2286222 2335440 2384296
58261 2384296 2440996 2503731 2564225 2623906 2690539 2761963 2829482 2894177 2963043 3032461 3093022
58250 3093022 3147594 3206774 3269872 3328772 3386984 3455399 3532462 3608439 3685973 3775844 3875839
58239C875839R9431J01823J16292J28924J30231J34468J51088J64725J65151J68642
58229E236614J86749K03485K07380K15374K39584K62466K71747K86407L19705
58220G429511L51674L68405L91664M37378M83610N14177N53030O18566O87248
58211A1835263P42199Q11790R17287J031319J134683J261898J440332J640960
58203B0815731J844464K094484K426115K811865L247990L820627M612162N626511
58195D7299949O887890Q510202J0573220J3058741J6032718J9738545K4359448
58188A46460713K9872765L6245811M3219024M9168370N0458282M3245610K6927676
58181D25598251N621762j4382225k8767352l6908027m0336801m0581451l8545842
$$ plain form
58239 3875839 3975270 4077093 4193385 4322309 4452540 4587008 4738096 4902821 5067972 5236614
58229 5236614 5423363 5626848 5834228 6049602 6289186 6551652 6823399 7109806 7429511
58220 7429511 7781185 8149590 8541254 8978632 9462242 9976419 10529449 11148015 11835263
58211 11835263 12577462 13389252 14306539 15337858 16472541 17734439 19174771 20815731
58203 20815731 22660195 24754679 27180794 29992659 33240649 37061276 41673438 47299949
58195 47299949 54187839 62698041 73271261 86330002 102362720 122101265 146460713
58188 146460713 176333478 212579289 255798313 304966683 355424965 398670575 425598251
58181 425598251 431220013 416837788 388070436 351162409 310825608 270244157 231698315
58174B31698315l4974347l0653638k6188987k1934257j8129871j4918005j2271885
58167G2627325j0079075q284710o868935n750974m826890m062433l460754k979104
58159B6314450k557751k193456j909720j686150j482471j300884j163276j055040
58151A2965702r47489q48530p78751p22953o54636n83873n34253m95872m45882
58142F953463l93203l59409l35964l02100k66169k49195k44591k32068k15284
58133D355480k09463k07164j91591j69853j59666j56143j43349j25909j18450
58124B873892j16065j04975r0835q7708r0094q3595p2688p1060p4678p0652o2916
58113A948626o3477o7561o2479n2399n0100n2417m7463l8235l6173l8825l5983
$$ plain form
58174 231698315 196723968 166070330 139881343 117947086 99817215 84899210 72627325
58167 72627325 62548250 54263540 47394605 41643631 36816741 32754308 29293554 26314450
58159 26314450 23756699 21563243 19653523 17967373 16484902 15184018 14020742 12965702
58151 12965702 12018213 11169683 10390932 9667979 9013343 8429470 7895217 7399345 6953463
58142 6953463 6560260 6200851 5864887 5562787 5296618 5047423 4802832 4570764 4355480
58133 4355480 4146017 3938853 3747262 3577409 3417743 3261600 3118251 2992342 2873892
58124 2873892 2757827 2652852 2562017 2474309 2384215 2300620 2227932 2156872 2082194 2011542 1948626
58113 1948626 1885149 1817588 1755109 1702710 1652610 1600193 1552730 1514495 1478322 1439497 1403514
58102A403514l0668l2375l6832l3576k6626k6941l1313k9117k3134k3512k7501
58091A081919k5216j9346j9476k2723j9434j2518j1987j5519j3380p764q422j3564
58079H92570j3613r871j1416j7049j7938j4951j6213k0554k0088j6272j7059k0931
58067F96615j9754j4734j3876j6162j3855q095o895r734r049n081m782p885q116
58054E58597o238q170j2199j1691q230q631j1243q938l339k321n334m871q48J1
58040D66555k464k409l03j720n221m476j058k150o793p515m407m556q268q964
58026D06251o300o451r543r443o135n822q576q073m005k758n209n638l299l430
58012C21569o084n487j444j12k425k673L29J435m08n05J725J557j231j534J120
$$ plain form
58102 1403514 1372846 1340471 1303639 1270063 1243437 1216496 1185183 1156066 1132932 1109420 1081919
58091 1081919 1056703 1037357 1017881 995158 975724 963206 951219 935700 922320 914556 906134 892570
58079 892570 878957 869086 857670 840621 822683 807732 791519 770965 750877 734605 717546 696615
58067 696615 676861 662127 648251 632089 618234 610139 603244 593510 584461 579380 574598 566713 558597
58054 558597 552359 544189 531990 520299 512069 503438 492195 483257 479918 477597 472263 467392 466544 466555
58040 466555 464091 461682 461379 459659 454438 449962 448904 446754 439961 432446 428039 423483 415215 406251
58026 406251 399951 393500 383957 374514 368379 362557 353981 345908 341903 339145 333936 328298 324999 321569
58012 321569 315485 309998 308554 308442 306017 303344 303673 305108 304700 304195 305920 307477 306246 304712 305832
57997C05832J720k23J87L209L634R03J00J882J407j634j952J104K166M8n02J385
57981C19266R84k318l500j736k018n113n744k841j905m619n748l108j347k702
57967B77551l009k17J629L63m49J149J957M86K3J867K669J167N42J651J015k087
57951B86307l619k189j484l055l674k042j145j888j256J142J802L71Q30L853N384
57936B79337M698O115J0457J2750J1149J0327J2790J4433J2225R154P856O064
57924C97355K156j095k007l285o500q943r076r407j1116j1503r528q166q575p794
57910C02516m835l115m047m199j638P05Q61J064K399K133o17k321j173j41j062
57895B86530j338M95J715R09Q52K852L870K380J513L069M006K250N51J114J633
$$ plain form
57997 305832 307552 307329 307516 310725 314359 315262 315362 317244 318651 317017 315065 316169 318335 318383 317881 319266
57981 319266 320250 317932 314432 312696 310678 305565 299821 296980 295075 290456 284708 281600 280253 277551
57967 277551 274542 274325 275954 276317 275868 277017 278974 279460 279483 281350 284019 285186 285728 287379 288394 286307
57951 286307 282688 280499 279015 275960 272286 270244 269099 267211 265955 267097 268899 269270 270100 273953 279337
57936 279337 284035 290150 300607 313357 324506 334833 347623 362056 374281 383435 391291 397355
57924 397355 399511 398416 396409 393124 386624 377681 368605 359198 348082 336579 327051 318885 310310 302516
57910 302516 297681 294566 290519 286320 284682 285387 286248 287312 289711 291844 291227 288906 287733 287592 286530
57895 286530 285192 285687 287402 288311 289163 292015 295885 298265 299778 302847 306853 309103 309654 310768 312401
57880C12401J09j434j372j666l382m122k978k997n457o914n225l371l908m662
57866B65022l555k556l203l037l75K072K115K101M315O753P180P188Q571R740
57852C02331R232Q737R407R224P150N635N896N138J743j332j680j483k962m316
57838C52720l852l732n777p729p448o794p614q005o301m707n160n529l720j693
57824B74659j548j480M10K175J791J203K636M390M246L644M594N732N058L347
57810C10857J421k323q194j2714j3526j3076j3818j3787j0937p797p299p576n634
57797A95597k858k186k741j996n77m55p58L81K032K457K519L505M085L062K445
57782B04512M107O146O250N865P226R148R616R711J1003J1853J0400Q432Q262
$$ plain form
57880 312401 312510 311076 309704 308038 304656 300534 297556 294559 289102 282188 276963 273592 269684 265022
57866 265022 261467 258911 255708 252671 252296 254368 256483 258584 262899 269652 276832 284020 292591 302331
57852 302331 311563 320300 329707 338931 346081 351716 357612 362750 364493 363161 361481 359998 357036 352720
57838 352720 348868 345136 339359 331630 324182 317388 309774 301769 295468 290761 285601 280072 276352 274659
57824 274659 273111 271631 272041 274216 276007 277210 279846 284236 288482 292126 296720 302452 307510 310857
57810 310857 312278 309955 301761 289047 275521 262445 248627 234840 223903 216106 208807 201231 195597
57797 195597 192739 190553 187812 185816 185239 184784 184026 184407 186439 188896 191415 194920 199005 202067 204512
57782 204512 208619 214765 221015 226880 234106 243254 252870 262581 273584 285437 295837 304269 312531
57769C12531Q402O496L846K800K209j66l212m652n349p115q639p904o441o730
57755B86076p534o297m142l963n213n064l300j946j323m32J65m60r98J3J176P04
57739B47462j57L58P64r81l227l074j159N5P30K329L783L285K183K759L849K941
57723B61900J042J001K380K475J246Q43J254O38q04j324j119j634k368k027j738
57708B61765l274n368n557m491m498n142m333k630k275k862k131l19M06J51R64
57693B20406K791L596K958K014N06k452n382n902m548l705l547k617j351j270
57679B01497j444L17L469N703P200J0130J4506J8488K2302K8070L6024M4632N4072
57666D44966O5590P7011Q2210P5570N5273K3597j2819m4344o3971p1812p2012
$$ plain form
57769 312531 320933 327429 331275 334075 336284 336118 332906 328254 322905 315790 307151 299247 292806 286076
57755 286076 278542 272245 268103 264140 258927 253863 250563 248617 247294 246862 247027 246567 245569 245582 246758 247462
57739 247462 247305 247663 248427 247446 244219 241145 239986 240041 240771 243100 246883 250168 252351 255110 258959 261900
57723 261900 262942 263943 266323 268798 270044 270887 272141 272779 271975 270651 269532 267898 265530 263503 261765
57708 261765 258491 253123 247566 243075 238577 233435 229102 226472 224197 221335 219204 218885 219291 219442 220406
57693 220406 223197 226793 229751 231765 232271 229819 224437 218535 213987 210282 206735 204118 202767 201497
57679 201497 200053 200370 203839 209542 216742 226872 241378 259866 282168 310238 346262 390894 444966
57666 444966 510556 587567 669777 745347 800620 824217 811398 767054 703083 631271 559259
57655E59259o7022n7830m7397l9073l2644k6099k0225j7227j5925j3062q757o030
57643B07968n324m150k041j201j987k188j101l74m01J56J081O16r54j464p39o62
57627A87235j381j212k57l33j340j490j052j886l452l373j959j852l112l078j390
57612A60068o40j440j402J38Q21k09p58K02P91J1n35q9j67j264j602n63P0m91
57594A52941p27j56n07k309l517k960k085k036j991j567j839k787k697j176J1
57579A26598R6K82Q54L97j140j853j330j469k792l284k123j244j818k257j300
57564A07617j29J45K86Q25P66k03o87o3N09N32J067K295K844K479K651L465L043
57547A27442R16r00j327j743k940l520k671j666j355q21K22N43J0K37J468J723
$$ plain form
57655 559259 492237 434407 387010 347937 315293 289194 268969 251742 235817 222755 213998 207968
57643 207968 202644 198494 196453 195252 193265 191077 189976 189602 189201 189357 190438 191054 190100 188636 187897 187235
57627 187235 185854 184642 184385 184052 182712 181222 180170 178284 174832 171459 169500 167648 164536 161458 160068
57612 160068 159428 157988 156586 156724 157545 157336 156578 156780 157571 157582 157047 156958 156791 155527 153925 153362 153432 152941
57594 152941 152214 152058 151551 149242 145725 142765 140680 138644 136653 135086 133247 130460 127763 126587 126598
57579 126598 126694 126976 127830 128227 127087 125234 123904 122435 119643 116359 114236 112992 111174 108917 107617
57564 107617 107488 107633 107919 108744 109510 109307 108620 108557 109066 109598 110665 112960 115804 118283 120934 124399 127442
57547 127442 128358 127458 126131 124388 121448 117928 115257 113591 112236 111415 111637 112180 112190 112427 113895 115618
57531A15618L14p64k74L94J60L3M87J43j301j758j38J656J869J351J171N62r65
57514A18558k011j664j101j168q56K31M60r76k290k017j268j312j324m64J46m95
57498A02449j288r87k42k0L2J64m58j793k146q07N92P49N34Q30Q98L72M29J433
57480A00741J766O43k86K37J030R12P37J188R69p83k558k854k459k488k285j200
57464I3310l25n70r40o00n60j564k264j487k72J45L95J181J449L55q60q83m38
57447H6072n63n97K31J017P96K83L92O49O32J034J895J790L06p56l07J79n55j256
57429I1242n81M30L74j18o4j68j045j433l18R49Q43J44K01M98L6n34k78J43j44
57410I0177n18k85j01l72o6J166J790R41R2L46L93q62j932j288k2L10L48J091
$$ plain form
57531 115618 115932 115168 114894 115288 115448 115481 115968 116111 114810 113052 112914 114570 116439 117790 118961 119523 118558
57514 118558 116547 114883 113782 112614 111758 111989 112449 111473 109183 107166 105898 104586 103262 102798 102944 102449
57498 102449 101161 100174 99932 99912 99944 100108 99650 97857 95711 94904 95496 96245 96779 97609 98507 98879 99308 100741
57480 100741 102507 103150 102864 103101 104131 105043 105780 106968 107937 107154 104596 101742 99283 96795 94510 93310
57464 93310 92985 92415 91475 90875 90315 88751 86487 85000 84728 84873 85268 86449 87898 88253 87393 86510 86072
57447 86072 85509 84912 85143 86160 86956 87239 87631 88280 88912 89946 91841 93631 93937 93181 92874 93053 92498 91242
57429 91242 90661 91091 91465 91347 91283 91115 90070 88637 88319 89268 90111 90255 90456 90954 90990 90456 90178 90321 90177
57410 90177 89659 89374 89273 88901 88835 90001 91791 92732 92824 93170 93563 92701 90769 89481 89459 89769 90117 91208
57392I1208J544O75j84N35J966K554K650L083L111K181J738K830L860L171J845
57377A22767J445J113l28j517q61K52l99k138k869k709l055l516k892j901j926
57362A01466k255j441j99m8m32j0M80k66j155l54J246J467P05J056K422K776J824
57345A07282J248J593J732J257Q05L32o39j508j430j007j118j046L3R33K04j124
57329A07547j148l07k93r03p01P3J21k66R6P40L88m57m66n3l64p04K35J525J355
57310A06418K83J71P60M57k88K96J772J951O13l53k49l5J77J174K263J896N07
57293A17813O8Q32J259R10P89R98P15L19Q98J934J939J073O30M53m63j418q79
57276A27870N71J081Q03J319K341K173J146J302K752L546L135K849K870J982M31
$$ plain form
57392 91208 92752 93427 93243 93778 95744 98298 100948 104031 107142 109323 111061 113891 117751 120922 122767
57377 122767 124212 125325 124997 123480 122619 122871 122472 120334 117465 114756 111701 108185 105293 103392 101466
57362 101466 99211 97770 97571 97523 97091 97081 97561 97295 96140 95786 97032 98499 99204 100260 102682 105458 107282
57345 107282 108530 110123 111855 113112 113917 114249 113610 112102 110672 109665 108547 107501 107534 108467 108671 107547
57329 107547 106399 106092 105799 104896 104195 104268 104389 104123 104219 104959 105347 104890 104424 104371 104007 103303 103538 105063 106418
57310 106418 106701 106872 107632 108089 107801 108097 109869 111820 112433 112080 111831 111796 111973 113147 115410 117306 117813
57293 117813 117881 118713 119972 120882 121671 122669 123384 123703 124601 126535 128474 129547 130177 130630 130167 128749 127870
57276 127870 128441 129522 130325 131644 133985 136158 137304 138606 141358 144904 148039 150888 153758 155740 156171
57261A56171k3P05Q38ql37J86K25m14l54N28P56J39J38R34J031K51K39J352J937
57242A64294J410J302K378L313L135K612K448K234J935K216K827K682J991K147
57228A96924L211L691L083K526K606K681K592K890L291L018K594L118L953L571
57214B39749K335J952K429K413K187L251N030N351M292M270N855O844O125N268
57200B97351N419N629N298N402O313O885O654O592P045P177O968P396Q267Q345
57186C90741P822Q110R053R153Q661R462J1615J3113J3407J4056J5498J6536J7303
57173E44530J9350K2180K3285K2437K2348K4098K5507K5152K4526K4875K5295
57162H03583K5389K6487K8716L0026K9678K9667L1206L2874L3638L4644L6442
$$ plain form
57261 156171 156148 156853 157691 157683 157346 157532 157757 157343 156989 157517 158273 158412 158550 159484 160515 160766 161005 162357 164294
57242 164294 165704 167006 169384 172697 175832 178444 180892 183126 185061 187277 190104 192786 194777 196924
57228 196924 200135 203826 206909 209435 212041 214722 217314 220204 223495 226513 229107 232225 236178 239749
57214 239749 242084 244036 246465 248878 251065 254316 259346 264697 268989 273259 279114 285958 292083 297351
57200 297351 302770 308399 313697 319099 325412 332297 338951 345543 352588 359765 366733 374129 382396 390741
57186 390741 398563 406673 415726 424879 433540 443002 454617 467730 481137 495193 510691 527227 544530
57173 544530 563880 586060 609345 631782 654130 678228 703735 728887 753413 778288 803583
57162 803583 828972 855459 884175 914201 943879 973546 1004752 1037626 1071264 1105908 1142350
57151A142350L7551L7366L7559L8965M0058M0016M0286M1504M2024M1173M0871
57140A579723M2216M3491M3430M3449M4679M5793M5866M6428M8506N0402N0584
57129B084567N0241N0904N2060N3077N4907N7938O0718O2657O5386O9608P3538
57118B735601P6266P9802Q5571R1941R7413J03441J11700J21431J31879J44698
57108C779743J61455J81222K02932K27659K56543K89422L27719L75769M36974
57099F239438N11826O02228P14808Q57430J035722J255528J524699J848163K223197
57090A6813039K641756L093874L565810M038448M490854M901945N247003N499863
57082E0292592N643521N668820N549351N221626M609706L685027K505056J192519
$$ plain form
57151 1142350 1179901 1217267 1254826 1293791 1333849 1373865 1414151 1455655 1497679 1538852 1579723
57140 1579723 1621939 1665430 1708860 1752309 1796988 1842781 1888647 1935075 1983581 2033983 2084567
57129 2084567 2134808 2185712 2237772 2290849 2345756 2403694 2464412 2527069 2592455 2662063 2735601
57118 2735601 2811867 2891669 2977240 3069181 3166594 3270035 3381735 3503166 3635045 3779743
57108 3779743 3941198 4122420 4325352 4553011 4809554 5098976 5426695 5802464 6239438
57099 6239438 6751264 7353492 8068300 8925730 9961452 11216980 12741679 14589842 16813039
57090 16813039 19454795 22548669 26114479 30152927 34643781 39545726 44792729 50292592
57082 50292592 55936113 61604933 67154284 72375910 76985616 80670643 83175699 84368218
57074H4368218j24299j359942k479587l473656m326659n005290n471812n706520
57066E6420453n718304n539085n213166m789446m314701l827056l353392k911320
57058B0753983k511348k157638j849874j586015j362940j175630j018130q85603
57050H206805p74182o79630n98079n27563m67039m14560l68144l27505k92809
57041C757294k62614k35000k09911j88231j69429j52215j36535j22726j09639
57032B170994r5916q2054o8946n5471l9907k2183k240K1340M6397O1967N4014
57021A987995J8877l1472p8673j10489j24755j25538j18430j07794r5814q3366
57011A130541p1511o1404n3190m6296m0624l6291l2656k8970k5587k3194k1447
$$ plain form
57074 84368218 84243919 82883977 80404390 76930734 72604075 67598785 62126973 56420453
57066 56420453 50702149 45163064 39949898 35160452 30845751 27018695 23665303 20753983
57058 20753983 18242635 16084997 14235123 12649108 11286168 10110538 9092408 8206805
57050 8206805 7432623 6752993 6154914 5627351 5160312 4745752 4377608 4050103 3757294
57041 3757294 3494680 3259680 3049769 2861538 2692109 2539894 2403359 2280633 2170994
57032 2170994 2075078 1993024 1924078 1868607 1828700 1806517 1804277 1825617 1872014 1933981 1987995
57021 1987995 2006872 1975400 1896727 1786238 1661483 1535945 1417515 1309721 1213907 1130541
57011 1130541 1059030 997626 944436 898140 857516 821225 788569 759599 734012 710818 689371
57000F89371j9685j8288j7801j7442j6169j4416j3149j1987r993p534n541l744
56988E33622j380J180L402O208J0572J5381J8586J9521J8099J3003L389q325j7999
56975F15259k3759k6461k6992k5620k3406k1587j9707j6552j2580r288o649l464
56963C99194K12L319O075R740J4371J9018K3704K8788L2586L1949K5327J3720
56951F08003q15j5573k6992l2638l3379l1817k9034k4757j9713j5300j1524p572
56939C58889l858j221J240N006R561J3506J7569K3731L1851L9599M4985M6190
56927E87048M0027K4420K629j8168l2938m1218m4204m2836l8887l4594l0408k5501
56915C45370k0533j7255j5372j2851r603p806q122q518p556o085m962l710k221
$$ plain form
57000 689371 669686 651398 633597 616155 599986 585570 572421 560434 550441 542907 537366 533622
56988 533622 532242 533422 536824 543032 553604 568985 587571 607092 625191 638194 641583 633258 615259
56975 615259 591500 565039 538047 512427 489021 467434 447727 431175 418595 409307 402658 399194
56963 399194 399406 402725 408800 418540 432911 451929 475633 504421 537007 568956 594283 608003
56951 608003 607188 591615 564623 531985 498606 466789 437755 412998 393285 377985 366461 358889
56939 358889 355031 353810 355050 360056 369617 383123 400692 424423 456274 495873 540858 587048
56927 587048 627075 651495 654124 635956 603018 561800 517596 474760 435873 401279 370871 345370
56915 345370 324837 307582 292210 279359 269756 261950 253828 245310 237754 231669 226707 222997 220776
56902B20776j354j113m21P39J117O04O05J647K812L870N700Q359J0989J3875J8184
56887B86389K3526K8149L1592L4476L5426L1273K1123P826n138j5921k3228k5947
56875D29546k4859k2344j9576j5952j1491p354l565J205O993J2242J6751K2417
56863C84013L0212L8973M7990N8470P0972Q2815Q8588Q2364O0622K6087j1359
56852I59747m0659n7434o4356o4902o0260n2052m3362l5474k6781j6381n882L607
56840D95811J3293K4148L5325M6473N9092P4299R1613J10501J29531J42220J37411
56829A359717J07456N5661n266o0614r9708j18813j21405j14657j03827r0440
56819H08104p5343o0635m7489l4862k1950r868M80J0254K0900L2401M4590N8443
$$ plain form
56902 220776 219422 218309 217888 218627 219744 220348 220953 222600 225412 229282 234982 243341 254330 268205 286389
56887 286389 309915 338064 369656 404132 439558 470831 491954 499780 494642 478721 455493 429546
56875 429546 404687 382343 362767 346815 335324 327970 324405 325610 332603 344845 361596 384013
56863 384013 414225 453198 501188 559658 630630 713445 802033 884397 945019 971106 959747
56852 959747 919088 861654 797298 732396 672136 620084 576722 541248 514467 498086 492204 495811
56840 495811 509104 533252 568577 615050 674142 748441 840054 950555 1080086 1222306 1359717
56829 1359717 1467173 1522834 1517568 1456954 1357246 1238433 1117028 1002371 898544 808104
56819 808104 732761 672126 624637 589775 567825 557957 558437 568691 589591 621992 666582 725025
56807G25025P4465R0573J02002J02220Q4949M8868J605m3447p5929r3388r8434
56796I18509r4632q5766p5407o4922n3710m2214l2339k4369j6428q012j047L825
56784D23488R016J6553K5658L5101M4732N2782N4539M6269K8791N924j8164l8926
56772F85763n2079n6793n6294n3641m9003m2296l5513l0327k5931k1313j7452
56761B45121j5255j3589j1329r320q385p597o217n195n009m323k521j259j668
56748A53454k409k275k236k995l170j936r70j468j785l92J227J137O8m31p25j491
56732A33603j606k26J065P90K29J038K192J912Q24N11O85L74K74J330K498K405
56716A47898J695J564J495O92J7K97N18j47m36N62J200L5j253m67J500K419K254
$$ plain form
56807 725025 799490 890063 992065 1094285 1179234 1228102 1229707 1186260 1110331 1016943 918509
56796 918509 823877 738111 662704 597782 544072 501858 469519 445150 428722 420710 419663 423488
56784 423488 432504 449057 474715 509816 554548 607330 661869 708138 736929 742853 724689 685763
56772 685763 633684 576891 520597 466956 417953 375657 340144 309817 283886 262573 245121
56761 245121 229866 216277 204948 195628 187243 179646 173429 168234 163225 158902 156381 155122 153454
56748 153454 151045 148770 146534 143539 140369 138433 137463 135995 134210 133818 135045 136182 136250 135819 135094 133603
56732 133603 131997 131771 132836 133626 133855 134893 137085 138997 139821 140332 141017 141391 141665 142995 145493 147898
56716 147898 149593 151157 152652 153344 153361 153658 154176 154029 153593 154155 155355 155390 154137 153670 155170 157589 159843
56699A59843K177J766J97j362j415p56p70o87O27J859J257l7J85J339J194k16
56683A65201r87p72p72r87l63Q20J354J391J912K596K426J767J645J776J321O85
56667A79013N60L19o23j119j36J090R41J44K73R02O72j12k83j1J17P54K303L262
56649A88066K440J261J359J614K86j623k070j483j597k215k123j866k590l366
56635A76093k730j588j599k045j370m54j093k403k222r67o97j277r62R1K48l06
56619A56719j08N28J83o55m93K5p38j930j446P7J58j136j375j32N78J84L23J415
56601A52177J866J046R3n67j679k912k923j810r88o20L54J816K594K703K921K682
56585A56753J052p29o12Q29J254M12J07O83P53J94L21J067J038L74O44J885K524
$$ plain form
56699 159843 162020 163786 163983 162621 161206 160450 159680 158993 159620 161479 162736 162699 162884 164223 165417 165201
56683 165201 164214 163442 162670 161683 161320 162140 163494 164885 166797 169393 171819 173586 175231 177007 178328 179013
56667 179013 179573 179892 179269 178150 178014 179104 180045 180189 180462 181364 182036 181924 181641 181630 181747 182501 184804 188066
56649 188066 190506 191767 193126 194740 195026 193403 191333 189850 188253 186038 183915 182049 179459 176093
56635 176093 173363 171775 170176 168131 166761 166307 165214 162811 160589 159622 158925 157648 156686 156777 157025 156719
56619 156719 156611 157139 157322 156667 156174 156199 155461 153531 152085 152162 152320 151184 149809 149677 150255 150439 150762 152177
56601 152177 154043 155089 155182 154615 152936 150024 147101 145291 144303 143683 144037 145853 148447 151150 154071 156753
56585 156753 157805 157076 156464 157293 158547 158959 159066 159749 160502 160696 161017 162084 163122 163496 164140 166025 168549
56568A68549K320K542L300L400K894L163M495N996P663J0166J2959J4948J6239
56555B58634J6755J4366P532j017o709q508q728q480p051n194m877n727n494m170
56541B31332m038n470o268n426m216l271j947p89j210k524k521j228p90j503j393
56526A88738R0J274J496J741J980J161Q2O87K296K130m6j479j069p48j529j853
56510A94951q48R3O7k5J86k16j110j034J14P27K72k55p27j858k781j802L50J132
56492A87236J63n61l55m15p31j6J161Q13p29j004M21J523J658K048K390R48j632
56475A92918k562j397m57l68O59K728L587K785K388K845K257M85j83O41O41p79
56459B06188j388m50Lp27p93K74N26m99q57k23n47j790j434O66J525L72P9J776
$$ plain form
56568 168549 170869 173411 176711 180111 183005 186168 190663 196659 204322 214488 227447 242395 258634
56555 258634 275389 289755 297287 296270 289561 281053 272325 263845 256794 251600 246723 240996 235502 231332
56541 231332 227294 221824 215556 210130 205914 202643 200696 199907 198697 196173 193652 192424 191634 190131 188738
56526 188738 188828 190102 191598 193339 195319 196480 196562 197249 199545 201675 201629 200150 199081 198333 196804 194951
56510 194951 194103 194196 194263 194238 194424 194208 193098 192064 192178 192905 193177 192922 192195 190337 187556 185754 186104 187236
56492 187236 187399 186838 186483 186068 185337 185321 186482 187295 186566 185562 185983 187506 189164 191212 193602 194550 192918
56475 192918 190356 188959 188502 188134 188793 191521 195108 197893 200281 203126 205383 205868 205685 206326 206967 206188
56459 206188 204800 204350 204353 203626 202833 203107 203633 203134 202277 202054 201507 199717 198283 198949 200474 200846 200925 202701
56441B02701K758J558M33Q19Q09o94j636p88kl61j88J096J280m11j448n11K45
56424B05660m75o95O74J404J46j013n51j83j100j481k02P75J96q3J122J879Q74
56407B06947j07K75O14J61O14K245K380J38j430m19Q63N00L06J714K598J378K79
56390B19056J281K495J857P62R67J315O23L41J453K192J552J494K961L608K168
56375B44125J068J772J705r70l577l392j976j585j188M82J573M80q94o27n7m47
56359B36492j39J726K565Q41p34J22J319O72k1J089K003Q51k29P85J776O87k85
56342B49520J067K566J869J079K531L928K523M77J076L007L393L100M090M754
56328B84980L011J002J624L257K895J624J978K715J354p21q36j75j343l181k975
$$ plain form
56441 202701 205459 207017 207450 208269 209078 208384 206748 205960 205958 205597 205409 206505 207785 207374 205926 205415 205660
56424 205660 205185 204490 205164 206568 206714 205701 205150 204967 203867 202386 202184 202959 203155 203072 204194 206073 206947
56407 206947 206840 207115 207729 207890 208504 210749 213129 213267 211837 211418 212281 212781 213087 214801 217399 218777 219056
56390 219056 220337 222832 224689 225451 226418 227733 228356 228697 230150 232342 233894 235388 238349 241957 244125
56375 244125 245193 246965 248670 247700 244123 240731 238755 237170 235982 236464 238037 238517 237623 236996 236939 236492
56359 236492 236353 238079 240644 241485 240751 240873 242192 242864 242843 243932 245935 246786 246557 247342 249118 249805 249520
56342 249520 250587 253153 255022 256101 258632 262560 265083 265560 266636 269643 273036 276136 280226 284980
56328 284980 287991 288993 290617 293874 296769 298393 300371 303086 304440 303719 302883 302708 301365 298184 295209
56313B95209j559j419j911j079N4m06j084J40J806J490L50P46J803J770K035M318
56297C02263O514N988M303M143M376K842J139J713L019K423J231J848K774J536
56283C46112j90M98K376K737K571L966N254M110K635L892O126N960M562N041O448
56268D02098O182N693P817J0855J1288J0081J0517J2090J2328J2318J4498J7243
56256E33008J7536J6833J8460K1604K3594K5631L0174L5354L8179M0666M6358
56245H47397N3376N7528N9784O3776O8323O9555O8218O7721O6926O2115N4266
56234A538985M7107L9724K8517J4991M093l972j3012k3060l0705l6030m2033m7924
56222A476681n0189m9504m9737n0908m9997m7663m7120m7377m4712m0072l7816
$$ plain form
56313 295209 293650 292231 290320 289241 289295 288889 287805 287945 289751 291241 291591 292337 294140 295910 297945 302263
56297 302263 308777 314765 319068 323211 327587 330429 331568 333281 336300 338723 339954 341802 344576 346112
56283 346112 345922 346420 348796 351533 354104 358070 363324 367434 370069 373961 380087 386047 390609 395650 402098
56268 402098 408280 413973 421790 432645 443933 454014 464531 476621 488949 501267 515765 533008
56256 533008 550544 567377 585837 607441 631035 656666 686840 722194 760373 801039 847397
56245 847397 900773 958301 1018085 1081861 1150184 1219739 1287957 1355678 1422604 1484719 1538985
56234 1538985 1586092 1625816 1654333 1669324 1673417 1669445 1656433 1633373 1602668 1566638 1524605 1476681
56222 1476681 1426492 1376988 1327251 1276343 1226346 1178683 1131563 1084186 1039474 999402 961586
56211I61586l7876l6246l2594l0393l0022k8642k6299k5488k5371k3004j9335
56200F46316j7532j6654j3627r926r256j0275q904o175o188p911o946l903l046
56187E25973l990k883m37m89j934n73K315J967o03k90K366K388K75J129M560N138
56171E34912K715K568N212N808L884M023O450O488M016L955O715P643O466P739
56157F08594J1267J1940R867J0761J5225J7597J6682J7687K1956K4789K5175K8049
56145H19589L4952M1921M8455N9122P4455Q9490J02874J18151J34561J46023J50466
56134A820059J50677J45119J28515J03242P9876O4456N4825N0260N3202N9456
56124B709687N8163M5148K6760Q709q697k2814k7970k5833k6165l4399m8032o6282
$$ plain form
56211 961586 923710 887464 854870 824477 794455 765813 739514 714026 688655 665651 646316
56200 646316 628784 612130 598503 588577 579321 569046 560142 553967 547779 539868 532922 529019 525973
56187 525973 521983 519100 518663 518174 516240 515667 517982 519949 519346 519056 521422 523810 524085 525214 529774 534912
56171 534912 537627 540195 545407 551215 555099 559122 565572 572060 576076 580031 586746 594389 600855 608594
56157 608594 619861 631801 641668 652429 667654 685251 701933 719620 741576 766365 791540 819589
56145 819589 854541 896462 944917 1004039 1078494 1167984 1270858 1389009 1523570 1669593 1820059
56134 1820059 1970736 2115855 2244370 2347612 2427488 2491944 2546769 2597029 2650231 2709687
56124 2709687 2767850 2812998 2839758 2848467 2839770 2816956 2788986 2763153 2736988 2702589 2654557 2588275
56112B588275r1760j20369j41371j50646j53271j51204j40312j21926j04756r1944
56102A320716p8030o1736m9440m2778l5318k5209j8778j7829j5843j0561p747
56091I57447q694o870j041J405j570k522J313L164N69M10N158P748N382M784Q518
56076I75201R864O746O582J1641J3814R951P989J1640J3585J0339R136J3216J5078
56063A114782J1442J0151J4855J7726J4798J3505J7529J9439J6088J5615K1128
56052A287058K3338J7884J3960J7000J8900J4539J1615J4682J5853J1078R242
56041A455149J5128J9804J7897J7626K3666K7369K4303K3892L0924L5422L1886
56030A723066L0287L6588M1123L7952L6675M2848M6239M1200L8760M5453N0387
$$ plain form
56112 2588275 2496515 2376146 2234775 2084129 1930858 1779654 1639342 1517416 1412660 1320716
56102 1320716 1242686 1180950 1131510 1088732 1053414 1028205 1009427 991598 975755 965194 957447
56091 957447 948753 941883 940842 942247 940677 938155 939468 942632 943201 943611 948769 956517 961899 966683 975201
56076 975201 985065 991811 998393 1010034 1023848 1033799 1041788 1053428 1067013 1077352 1086488 1099704 1114782
56063 1114782 1126224 1136375 1151230 1168956 1183754 1197259 1214788 1234227 1250315 1265930 1287058
56052 1287058 1310396 1328280 1342240 1359240 1378140 1392679 1404294 1418976 1434829 1445907 1455149
56041 1455149 1470277 1490081 1507978 1525604 1549270 1576639 1600942 1624834 1655758 1691180 1723066
56030 1723066 1753353 1789941 1831064 1869016 1905691 1948539 1994778 2035978 2074738 2120191 2170578
56019B170578M6676M4914N1592N5537N0272M7856N5527O1066N6961N5947O6275
56008B763201P5189P3950P4893Q6010R3779Q9837Q8924J00839J10962J08953J09512
55997C776049J23302J35314J34538J36331J51860J64982J64021J65906J83227
55988E135530J99137K01628K09385K35402K59797K68501K82496L17005L50064
55979G458945L65583L87300M33620M80938N10753N48758O15365O84304P35562
55970A2221128P99881R02104J013102J110739J231987J407063J603266J797929
55962B2087199K041456K378558K780395L234792L825776M637402N668075O936840
55954E3590493Q567069J0650178J3158582J6141503J9853430K4507909L0095092
$$ plain form
56019 2170578 2217254 2262168 2313760 2369297 2419569 2467425 2522952 2584018 2640979 2696926 2763201
56008 2763201 2838390 2912340 2987233 3073243 3167022 3256859 3345783 3446622 3557584 3666537 3776049
55997 3776049 3899351 4034665 4169203 4305534 4457394 4622376 4786397 4952303 5135530
55988 5135530 5334667 5536295 5745680 5981082 6240879 6509380 6791876 7108881 7458945
55979 7458945 7824528 8211828 8645448 9126386 9637139 10185897 10801262 11485566 12221128
55970 12221128 13021009 13923113 14936215 16046954 17278941 18686004 20289270 22087199
55962 22087199 24128655 26507213 29287608 32522400 36348176 40985578 46653653 53590493
55954 53590493 62157562 72807740 85966322 102107825 121961255 146469164 176564256
55947A76564256L6611285M3930815N0613907N2963953M6576230K9999386O895021
55940D44154853j5957464l2987284m2387781m5353494m3988944m0120676l5138261
55933A88220949k9989601k5144617k0780798j7024309j3945793j1464454r434651
55926F0436726p788084o497035n473915m616927l902587l341845k892613k496059
55918B3427661k152925j887395j674887j473859j291423j153354j042918r28574
55910A1822326q20232p42410o81152o09805n39526m94661m63909m22836l80215
55901F667580l57171l43347l16800k85891k70439k61620k39936k13699k01824
55892D176853j96521j79542j58172j49821j47244j33214j14429j07658j06580
$$ plain form
55947 176564256 213175541 257106356 307720263 360684216 407260446 437259832 444154853
55940 444154853 428197389 395210105 352822324 307468830 263479886 223359210 188220949
55933 188220949 158231348 133086731 112305933 95281624 81335831 69871377 60436726
55926 60436726 52648642 46151607 40677692 36060765 32158178 28816333 25923720 23427661
55918 23427661 21274736 19387341 17712454 16238595 14947172 13793818 12750900 11822326
55910 11822326 11002094 10259684 9578532 8968727 8429201 7934540 7470631 7047795 6667580
55901 6667580 6310409 5967062 5650262 5364371 5093932 4832312 4592376 4378677 4176853
55892 4176853 3980332 3800790 3642618 3492797 3345553 3212339 3097910 2990252 2883672
55883B883672r4485p6687o9695p0677o6967o3433p1665q3654q3973p7090p6405
55872B048941p7650o9261n7829n7118o2100n9125n1781n1953n5100m9165l8929
55861A418930l7172m0172l5675k7131k6668l1472k9917k4255k4969k9205k6496
55850A085798j9852k0043k4758k3830j9439k1097k6137k4909k0025k1085k5464
55839H39159k3363j7080j6529k0266j9251j4888j5317j8257j5381r458r495j3036
55827F46838j0783m756m443q537p942l648m426r542j0544p839r078j3349j2918
55814E39033q704q465j1513j0459o116n749q387o674j539m84l015k023K100K845
55800D70850J138L449Q145P894L955L993P276O213J343M88L834M000M79nK722
$$ plain form
55883 2883672 2789187 2712500 2642805 2572128 2505161 2441728 2370063 2286409 2202436 2125346 2048941
55872 2048941 1971291 1902030 1844201 1787083 1724983 1665858 1614077 1562124 1507024 1457859 1418930
55861 1418930 1381758 1341586 1305911 1278780 1252112 1220640 1190723 1166468 1141499 1112294 1085798
55850 1085798 1065946 1045903 1021145 997315 977876 956779 930642 905733 885708 864623 839159
55839 839159 815796 798716 782187 761921 742670 727782 712465 694208 678827 669369 659874 646838
55827 646838 636055 631299 626856 618319 610377 606729 602303 592761 582217 574378 565300 551951 539033
55814 539033 530329 521864 510351 499892 493776 488027 479640 472966 471427 470943 467928 465905 468005 470850
55800 470850 471988 475437 483582 491476 495431 499424 506700 512913 514256 514744 518578 522578 523057 523052 525774
55785E25774J897k423k699K104M483J234l397p817j4542k1240k1918j7590j4844
55772D29022j4017r743k503K051M652J0999J8827J8812R339j225p852j3099j7377
55759D27886j6745j2088r549j0140q877n305m583p121p522m959m557p307q536
55746C20597p419q037j0133q868m737l630n926n681j864r6j759j656J512K398
55732B64701q79l388k590j844k563j795K99o84m910p090n642m779n839n123k069
55717B15805r23k419k189O59J821L82O52L612N039M044M889Q170Q823N256K182
55702B55803J871Q17k446m413m029m999q081r013o745n841p918q514n472k789
55688A88231l008l169j426n19j560j265J599L623L314L647N626O067M235L769
$$ plain form
55785 525774 527671 525248 522549 524653 529136 530370 526973 519156 504614 483374 461456 443866 429022
55772 429022 415005 405262 402759 404810 409462 420461 439288 458100 467439 466214 458362 445263 427886
55759 427886 411141 399053 389504 379364 370487 365182 360599 353478 345956 340997 336440 329133 320597
55746 320597 313178 305141 295008 286140 281403 277773 271847 266166 264302 264206 262447 260791 262303 264701
55732 264701 263822 260434 257844 256000 253437 251642 251941 251257 246347 239257 233615 228836 222997 217874 215805
55717 215805 214882 212463 210274 210933 212754 213136 213788 217400 222439 226483 231372 239542 248365 253621 255803
55702 255803 257674 258491 256045 251632 247603 242604 234523 225510 218765 212924 205006 196492 191020 188231
55688 188231 185223 182054 180628 180109 178549 177284 178883 182506 185820 189467 195093 201160 205395 209164
55674B09164N493N291J755r95p77o83k327k757r62n04k581l309r68P22l80j180
55658B05002K04R17m43p20J515K894J727J233L062L918J961L61J066J219q54k120
55642B20942q16J14j037j377N58J354j093l753m290m974p261q361o832n835p070
55627A70269p218m262j617j996k717j179L63l74j253k44N91l64p15J068K097K55
55611A52704j846j896j951l695m628k930j273j845k383j029j90j539k211k40J193
55596A26241n51k454j158J177J157KK12M54j266k972k134l90l24p46M09J735J204
55579A20596K62R85K114J908J825L569N553N955O191P759Q975Q413Q126R673J0471
55564B02375P952L970J302q02l779n963n747n171o319p451o663n970p511r004
$$ plain form
55674 209164 214657 219948 221703 220708 219931 219248 216921 214164 213202 212698 210117 206808 205840 206562 206182 205002
55658 205002 205206 206123 205680 204960 206475 209369 211096 212329 215391 219309 221270 221631 222697 223916 223062 220942
55642 220942 220126 220240 219203 217826 218384 219738 218645 214892 210602 205628 198367 190006 183174 177339 170269
55627 170269 163051 158789 157172 155176 152459 151280 151643 151269 150016 149772 150363 149999 149284 150352 152449 152704
55611 152704 150858 148962 147011 143316 138688 135758 134485 132640 130257 129228 129038 127499 125288 125048 126241
55596 126241 125690 123236 122078 123255 124412 124414 124626 125080 123814 120842 118708 118318 117994 117248 117657 119392 120596
55579 120596 120858 121843 123957 125865 127690 131259 136812 142767 148958 156717 165692 174105 182231 191904 202375
55564 202375 210327 214297 215599 214797 211018 205055 199308 194137 187818 180367 173704 167734 160223 151219
55550A51219p447m376l042l168k714k137k575k529n74J198N14q97m46P15L65k36
55534A23870J129L024K705R44K43L62k98q77K14J594J047m56n82J71j81j274j539
55517A30096j393j994k533j984j651k839m008l398k298k508k946j981p32p69r34
55502I8128Q9O43r40k712k208o98n85j044j27J183J041N77J617K707J509p63j418
55485I6999q94j209j797r48L58K27k77Q80K487J974Q0m66L74N72J8M8K02q38k210
55466I5580k285j769k037k013k38J586R97q70j144P9O35M13O95R07j44j160l54
55449H8878R05L34r38l72J192J065k67j39J306J500J68o09m15o11r61j55R12K39
55431I2032j456j769q49p95j463q10J082K049J634J198Q12m16j516q35N92N12
$$ plain form
55550 151219 143772 139396 136354 133186 130472 128335 125760 123231 122657 123855 124369 123472 123026 123741 124106 123870
55534 123870 124999 128023 130728 131672 131915 132277 131979 131102 131316 132910 133957 133501 132919 133090 132909 131635 130096
55517 130096 128703 126709 124176 122192 120541 117702 113694 110296 107998 105490 102544 100563 99831 99062 98128
55502 98128 98217 98860 97920 95208 93000 92302 91717 90673 90546 91729 92770 93347 94964 97671 99180 98417 96999
55485 96999 96105 94896 93099 92151 92509 92736 92459 93339 95826 97800 97880 97414 97788 98360 98378 98426 98628 97790 95580
55466 95580 93295 91526 89489 87476 87238 88824 89821 88951 87807 87886 88521 88934 89629 90536 90392 89232 88878
55449 88878 89783 90117 89179 88807 89999 91064 90797 90658 91964 93464 93632 93023 92608 91997 91036 90881 91793 92032
55431 92032 90576 88807 87958 87163 85700 84890 85972 88021 89655 90853 91665 91249 89733 88898 89490 90002
55415I0002m14K67K161K568J263O51J313J387L94j30j2p38k146k309j029j85l95
55398I2648m88k59o28j147m47Q23P09n47q31J76P87N70O76J055N75k55J67J363
55380I4947J298m4p35m10m83j037o79M93Q89M02K98L46q36k606k744j088K27J98
55362H8436k64p57j649k149j152K64J51r04q13J68L2j006p92P29J429R52J055
55345H3730J904J675J68p23n06o90j575j734r87o40o09M11J830J690L89K84J445
55328H6062J540K99R8J498K112Q66l73m85p96j851j994n32P78P27L07K65j68j101
55310H7252j317p11o24j087o00P26R28j77m03R15J748J068L81M43j57j713k075
55293H4597l07J351J011r2j85L05L86M58R11R29K02j29M07O01j45o68l60m24j500
$$ plain form
55415 90002 89588 89855 92016 94584 95847 96498 97811 99198 99592 99462 99450 98712 96566 94257 93228 93043 92648
55398 92648 92160 91901 91273 90126 89679 90502 91211 90664 89833 90009 90796 91366 92042 93097 93672 93417 93584 94947
55380 94947 96245 96201 95466 95056 94573 93536 92857 93350 94239 94641 94939 95285 94449 91843 89099 88011 88238 88436
55362 88436 88172 87415 85766 83617 82465 82729 82880 81976 81163 81331 81363 80357 79565 80294 81723 82675 83730
55345 83730 85634 87309 87477 86754 86248 85558 83983 82249 81262 80622 80013 80424 82254 83944 84333 84617 86062
55328 86062 87602 87901 87999 89497 91609 92475 92102 91617 90821 88970 86976 86444 87222 87949 88256 88521 88353 87252
55310 87252 85935 85224 84600 83513 82913 83639 84567 84390 83987 84902 86650 87718 88099 88542 88385 86672 84597
55293 84597 84290 85641 86652 86560 86375 86680 87066 87524 88435 89364 89566 89437 89844 90445 90300 89632 89272 88848 87348
55274H7348k237j553l49K79O31J086J107N99N10J058J225P23N57R95J004L89L17
55257I3689J015J092L3q93q93p33q29m38M62P00L9l17j2q3p04o67K02N30n1k09
55237I1933N25R32M78J63K95r4r95j158o38r61k072j991l25Q32M90K67J135J601
55219I0417N58p18q97n19k61K87R37N00q43j163O9J006N76l8j5k03p43l24R57
55200H9583J086k54p00O77J505K30j261j112n12q51r08N78K158K139J408J349
55184I5115J214P3q57l76K80k96r93l22P05L95o12p00j37r4k91J10N82L60J85
55165I4341Q30J337O66k65k56Ln61j233r21k34j10J69J454K591K091O53j09l19
55147A00127r81j685j351l32K77N25R32Q66l98j922k256j553q53j96P97J443R35
$$ plain form
55274 87348 85111 83558 83209 83488 84119 85205 86312 86911 87421 88479 89704 90427 90984 91979 92983 93372 93689
55257 93689 94704 95796 95829 94936 94043 93310 92481 92043 92505 93205 93244 92927 92915 92832 92128 91461 91663 92193 92142 91933
55237 91933 92458 93390 93868 94031 94326 94232 93237 92079 91441 90480 88408 86417 86092 86924 87414 87681 88816 90417
55219 90417 90975 90257 89360 88841 88580 88867 89804 90304 89461 88298 88367 89373 89949 89911 89896 89693 88950 88626 89583
55200 89583 90669 90415 89715 90392 91897 92127 90866 89754 89242 88391 87483 88061 90219 92358 93766 95115
55184 95115 96329 96402 95545 95169 95449 95153 94160 93838 94543 94938 94326 93626 93489 93395 93104 93214 93796 94156 94341
55165 94341 95171 96508 97174 96909 96653 96656 96095 94862 93941 93707 93597 93766 95220 97811 99902 100555 100446 100127
55147 100127 99146 97461 96110 95778 96055 96580 97512 98378 97980 96058 93802 92249 91396 91200 91997 93440 94375
55130I4375J4n1N40O87K91P4J49J30J15L45N55N84P52R27K98j070j793j163k37
55111I5522m2j32J45N27Q58J567K247J668J41k70R53J643N20n80P6J144O80n76
55093A06091q39l92n06q37l67L11Q5m71j81N19N38K52O24J233J136O59N16K61
55075A08632o29j336j186j096j775j947m52J306J347K18j57L86O59N67Q09R47
55059A06293J48q57p23K12N44J20j33k3j5l1J24r3q69j135k71M83jp50m17L74
55039A02980L93J79P90J456P25r76k077k297k251j679j35J409J757J398J361J289
55023A04322N64J40J042K181J913O98j3l24j048j512p41K81Q4n25J20J329J091
55006A09602m49j292q81l84j33N50J239P48n49j089n46J57Q43J877K543J896P44
$$ plain form
55130 94375 94389 94338 94878 95565 95856 95930 96079 96209 96324 96669 97224 97808 98560 99487 99785 98715 96922 95759 95522
55111 95522 95480 95348 95493 96020 96878 98445 100692 102360 102501 102231 103184 104827 105347 104767 104843 105987 106667 106091
55093 106091 105252 104860 104354 103517 103150 103461 103546 103075 102894 103413 103951 104203 104827 106060 107196 107855 108371 108632
55075 108632 108003 106667 105481 104385 102610 100663 100211 101517 102864 103082 102925 103311 103970 104537 105346 106293
55059 106293 106441 105584 104861 105073 105617 105737 105604 105581 105566 105535 105659 105566 104697 103562 103291 103774 103773 103023 102606 102980
55039 102980 103373 103552 104342 105798 106523 105547 103470 101173 98922 97243 97108 98517 100274 101672 103033 104322
55023 104322 104886 105026 106068 108249 110162 110860 110847 110523 109475 107963 107222 107503 107587 107062 107182 108511 109602
55006 109602 109153 107861 106980 106596 106463 107013 108252 109000 108451 107362 106816 106973 107816 109693 112236 114132 114876
54989A14876N23P98J99q65r07j23Q8j90J45O75J19r12p03M00M97m13n26L45M70
54970A14496m67p64J50Q31O16O21J305J522P91J83K91L87J59K27N19J98m28o4
54952A20573J161J589P53L6J88L27q7l75l24p19j548j678q41j48j37j31L9l53
54934A18325j120r59L46J324J084M64L05K83L9k4K96O77J140J932K515K248K014
54917A30889L278N567O929P026P508Q955R740Q656O554M501K230n76l152m804
54903A93301n861o708p050o800o433o062n297m317l798l632l021j976j297j067
54889A29982o66k20m33r89q67k25j65n86k20J098K128K383K642L108L070K753
54873A42793L388N047O380O895P469Q194P822N982L863K102K2k412l982m385m979
$$ plain form
54989 114876 115399 116197 116396 115531 114624 114501 114589 114399 114544 115219 115338 114426 113723 114123 114620 114207 113681 114026 114496
54970 114496 114029 113265 113415 114246 114862 115483 116788 118310 119101 119284 119575 119962 120121 120348 120867 121065 120637 120573
54952 120573 121734 123323 124076 124112 124300 124627 124540 124165 123841 123122 121574 119896 119055 118907 118770 118639 118678 118325
54934 118325 117205 116246 116592 117916 119000 119464 119769 120052 120091 120067 120363 121040 122180 124112 126627 128875 130889
54917 130889 134167 139734 146663 153689 161197 170152 179892 188548 195102 199603 201833 201257 198105 193301
54903 193301 187440 180732 173682 166882 160449 154387 149090 144773 140975 137343 134322 132346 131049 129982
54889 129982 129316 129096 128663 127674 126807 126582 126417 125831 125611 126709 128837 131220 133862 136970 140040 142793
54873 142793 146181 151228 157608 164503 171972 180166 187988 193970 197833 199935 199957 197545 193563 189178 184199
54858A84199o377p209o348m682l596l216l078l168l421l359k999k853k781k131
54844A28981j301j423k312k470j576j014j437j788j383r69r57n30N85J290R72
54829A14668N23N89M98j94p47p08o78q16k50J138J965J396L60j49m02p48o81k8
54811A15736L71J17p5J33L4n29n19M97J460J527J217J073P77K76K18N16J72p49
54793A22252q11L81J310J004L93K46j90j270j693o48O29Q42N72Q03J130R85J047
54776A26982J858K445J876R23O92Q51P07P79J713K800L133L254M139N453O199
54761A63804O373O652P185P748Q280Q407P303M909K289O0k334n025o886p331p441
54746A93993q095q411p364n730m886m812m592l958l108j979q12m33r27j092k51
$$ plain form
54858 184199 177822 170613 164265 159583 155987 152771 149693 146525 143104 139745 136746 133893 131112 128981
54844 128981 127680 126257 123945 121475 119899 118885 117448 115660 114277 113308 112351 111821 112406 113696 114668
54829 114668 115191 115780 116278 116084 115337 114629 113951 113135 112885 114023 115988 117384 117744 117595 117193 116445 115764 115736
54811 115736 116107 116224 116149 116282 116316 115787 115268 115765 117225 118752 119969 121042 121819 122095 122313 122829 123001 122252
54793 122252 121441 121822 123132 124136 124529 124775 124585 123315 121622 120974 121603 122445 123017 123820 124950 125935 126982
54776 126982 128840 131285 133161 134084 134776 135627 136334 137113 138826 141626 144759 148013 152152 157605 163804
54761 163804 170177 176829 184014 191762 200042 208449 215752 220661 222950 223010 220676 215651 208765 201434 193993
54746 193993 185898 177487 170123 164393 159507 154695 150103 146145 143037 141058 140246 139813 138886 137794 137543
54731A37543O27O06K63L13J64p06j258l61J293K261K467K802L427L974M690O001
54715A64106P408P953P326N743L507J307m0q52k434m920o647o537n655n411n623
54700A59231n542n233m731l397j449o15j682k940k596j317o37m18K17P67L24m09
54684A29573k49K39k76j458j917j620j606j824j304j27O24P35R30J296J246Q62
54668A25124P49Q14M91m5l11o58j646k629k472j397n82k69L01J177J465Q33Rl91
54650A20563m47l29qL63N38N81O96R00J211J658J783R36m94j181p40k81m10j92
54632A25147Q93J545O57o57o97K53O98L45m0l43r06j266q03j08j25m55q5P62J073
54613A25888Q52Q56R69M45n32j009p45j85N79J492J743P21o43r62l87r1k55j13
$$ plain form
54731 137543 138170 138776 139039 139352 139516 138810 137552 137191 138484 140745 143212 146014 149441 153415 158105 164106
54715 164106 171514 179467 186793 192536 196043 197350 197310 196458 194024 189104 182457 175920 170265 164854 159231
54700 159231 153689 148456 143725 140328 138879 138264 136582 133642 131046 129729 129092 128674 128891 129658 129982 129573
54684 129573 129324 129563 129287 127829 125912 124292 122686 120862 119558 119431 120055 120790 121720 123016 124262 125124
54668 125124 125873 126687 127178 127133 126822 126164 124518 121889 119417 118020 117438 117169 117470 118647 120112 120945 120954 120563
54650 120563 120116 119787 119779 120142 120680 121261 121957 122857 124068 125726 127509 128445 127951 126770 126030 125749 125339 125147
54632 125147 126040 127585 128242 127585 126888 127141 127839 128184 128144 127801 126895 125629 124826 124718 124593 124138 124053 124815 125888
54613 125888 126740 127596 128565 129010 128478 127469 126724 126539 127118 128610 130353 131074 130431 129469 129082 128991 128736 128623
54595A28623L31K88l05o43l43K78J006J656J618O59k81k59K44K33o1J91P54Q24
54577A34813O27R49J496J290M24j27j83m00q71j099j130j374j584j292q73q81
54561A29785q09J02J325J802J757K162K817K619J506M75j06o41r67m45O66J400
54545A43448J518J451J128L13k81K16J162J198M30K02Q11J148O59K8j92k24k09
54528A52806m5o4o61j345j310p54m24k60K20O54L90j36r6J70j06l75L52J395J230
54509A51641R9l01L94Q62N64M15P54P32J16k23k7j13o98r73o99o01p92n74j2j9
54489A50545n29m09M94R98P40P37J282J192lr91p39j2J67J07M43Q89J032J252
54471A57195J818K130J761J334J497J895J878J536J312J257J260J369J415R47
$$ plain form
54595 128623 128954 129242 128937 128294 127951 128229 129235 130891 132509 133168 132887 132628 132872 133105 133044 133235 133989 134813
54577 134813 135440 136389 137885 139175 139599 139472 139289 138889 138018 136919 135789 134415 132831 131539 130666 129785
54561 129785 128976 129078 130403 132205 133962 136124 138941 141560 143066 143541 143435 142794 141827 141382 142048 143448
54545 143448 144966 146417 147545 147858 147577 147793 148955 150153 150583 150785 151596 152744 153403 153431 153239 153015 152806
54528 152806 152761 152697 152036 150691 149381 148627 148203 147943 148163 148817 149207 149071 148975 149145 149039 148664 149016 150411 151641
54509 151641 151740 151439 151833 152695 153259 153674 154428 155160 155276 155053 155026 154913 154215 153242 152543 151942 151150 150576 150564 150545
54489 150545 150016 149607 150101 151099 151839 152576 153858 155050 155047 154056 153317 153305 153472 153579 154022 154911 155943 157195
54471 157195 159013 161143 162904 164238 165735 167630 169508 171044 172356 173613 174873 176242 177657 178604
54457A78604n5r13j038m87K54O03J27r00j478j071m45m18m73K28J080Q31k91r37
54439A73221q13q64j320j398r20n41l27K07N67l26k029k719j824p34n30o95n52
54422A58403k53J71J052J919J675M75k09J67N71L73J88K40j74r85r92K1O79L81
54404A63702K94J057J403M34o64n77N0P4m1O81J722J871J220Q49J049J216J038
54387A75378P46N31N39R76J591J685J128O55O34N02j04o67q15j014j521j733j290
54370A77221q21p92o10K92J365J815J704J449R99L28o9J46O07R61J343J705J534
54353A89177P97K21J47j4o56j278j427j411j535j678j973k866l952l980k623j126
54337A65823n75o77q38j111j402j025Q5Q10M18l87p23p31p23l57M46Q37L35k59
$$ plain form
54457 178604 178549 177636 176598 176111 176365 176968 177095 176195 174717 173646 173201 172783 172310 172538 173618 174449 174158 173221
54439 173221 172408 171544 170224 168826 167906 167365 167038 167245 167812 167486 165457 162738 160914 160180 159650 158955 158403
54422 158403 158150 158321 159373 161292 162967 163442 163233 163400 163971 164344 164532 164772 164598 163613 162621 162642 163321 163702
54404 163702 163996 165053 166456 166890 166226 165649 165699 165773 165732 166413 168135 170006 171226 172075 173124 174340 175378
54387 175378 176124 176655 177194 178170 179761 181446 182574 183229 183863 184365 184261 183594 182779 181765 180244 178511 177221
54370 177221 176400 175608 174998 175290 176655 178470 180174 181623 182622 182950 182881 183027 183634 184595 185938 187643 189177
54353 189177 189974 190195 190342 190328 189672 188394 186967 185556 184021 182343 180370 177504 173552 169572 166949 165823
54337 165823 165248 164571 163733 162622 161220 160195 160280 161090 161508 161121 160398 159667 158944 158587 159033 159870 160205 159946
54319A59946r7M45O37N17L38p8o68q12m77n66j268j353p3J368J477N79J0J09J93
54300A60227r6n47r33r59k80P90J283R06M75M50J79p28j497j548j527j959k029
54283A52207r57M68R76N97K30K32M80J045J742J773Q46j44l59j06J06N03J137
54266A60776J184K54o73p49n92r47j183m91N16Q37P78J107J530J453J387J895
54250A67082K060P74j059j506m15N46M22j53m96o92q00o25m59q08j332j132j61
54233A61246O67P82M73J21k50o27r40j294j667j637r70j42K70L35L88M34N37J121
54215A58847K134K621J897N51n08j224j810j864j127m53p57j545j573o32M17R21
54199A55895Q31J99p44j305j035l44J94O57J203J421J082Q39J190J539J196O04
$$ plain form
54319 159946 159849 160294 160931 161448 161786 161708 161040 160228 159751 159185 157917 156564 156491 157859 159336 159915 159925 160034 160227
54300 160227 160131 159584 158651 157692 157412 158202 159485 160391 160866 161316 161495 160767 159270 157722 156195 154236 152207
54283 152207 151250 151718 152694 153291 153521 153753 154233 155278 157020 158793 159639 159495 159136 159030 159136 159639 160776
54266 160776 161960 162214 161541 160792 160200 159253 158070 157579 158095 158932 159710 160817 162347 163800 165187 167082
54250 167082 169142 169916 168857 167351 166936 167482 167904 167751 167255 166563 165763 165138 164679 163871 162539 161407 161246
54233 161246 161913 162695 163168 163289 163039 162412 161472 160178 158511 156874 155904 155762 156032 156367 156755 157189 157726 158847
54215 158847 160981 163602 165499 166050 165542 164318 162508 160644 159517 159064 158307 156762 155189 154557 154974 155895
54199 155895 156726 156925 156181 154876 153841 153497 153691 154348 155551 156972 158054 158893 160083 161622 162818 163422
54183A63422M85N14%p55r67p40p76j156j426j502j452r71N0R05R60O19N30N50
54165A58290M02M53Q67Q53o0q92o55k7j84q24q71l64r2K3M95Q27K06p83q21L2
54145A56875N89N99Q34J294J078J56l74l8M02L09o8l96o66o78j66N33Q21P63P75
54126A62642O78J51k39L41J492J956J351M21k92q30j025n43K78O78N25K79J59
54109A68022K10P35J637J883Q54l19j59R15J226L75n09p81q91r33l26Q19J508
54092A74266J364J081J098J047P54O83J080J602K025K434K769L006L670N201O962
54077B09042P763P231N666L094l71l532n024n068n067n514n631m928l809k572
54063A91280j150J35P39Q42J023J094M46n51q87n37m64r50j219p60J51J228K321
$$ plain form
54183 163422 163907 164421 164421 163666 162699 161959 161183 160027 158601 157099 155647 154676 154726 155631 156591 157210 157740 158290
54165 158290 158692 159145 160012 160865 160805 159913 159258 159231 159047 158223 157352 156988 156896 156919 157414 158241 158447 157664 156843 156875
54145 156875 157464 158063 158897 160191 161269 161425 161051 161013 161415 161724 161656 161260 160594 159916 159750 160283 161104 161867 162642
54126 162642 163320 163471 163232 163573 165065 167021 168372 168793 168501 167671 166646 166103 166381 167059 167584 167863 168022
54109 168022 168232 168967 170604 172487 173341 173022 172863 173778 175004 175379 174870 174089 173198 172265 171939 172758 174266
54092 174266 175630 176711 177809 178856 179610 180293 181373 182975 185000 187434 190203 193209 196879 202080 209042
54077 209042 216805 224036 229702 232796 232425 228893 223869 218801 213734 208220 202589 197661 193852 191280
54063 191280 190130 190265 191004 191846 192869 193963 194409 193858 192971 192434 191970 191020 189801 189041 189192 190420 192741
54046A92741K921K705K428K988L836L729K848K647L635M850N573O050O397O272
54032B49620N863N846O252O497O567O805O807N951M916M989N962O383N817N019
54018C33294L917J504j925m545n554o136p227q147q181p860p760p484o728o025
54004B61143n674n155m310l891m224m515m080l229k384j434m85j13l78o77q33
53989B19761j271j843j789j110p05r12j178j356j814k123j393j13J15q51j338
53974B02080o08j2n16j124q14k72l46m00M23J573K087K082K061J819J098M62M63
53957B10056Q02J117J579K024J648M58k21M30J536K043K218K697L225L421L720
53942B36753M504N276N625O086P083Q138Q906R980J1669J3145J3714J3768J3371
$$ plain form
54046 192741 195662 198367 200795 203783 207619 211348 214196 216843 220478 225328 230901 236951 243348 249620
54032 249620 255483 261329 267581 274078 280645 287450 294257 300208 305124 310113 316075 322458 328275 333294
54018 333294 337211 338715 336790 332245 326691 320555 313328 305181 297000 289140 281380 273896 267168 261143
54004 261143 255469 250314 246004 242113 237889 233374 229294 226065 223681 222247 221762 221649 221271 220594 219761
53989 219761 218490 216647 214858 213748 213043 212131 210953 209597 207783 205660 204267 204154 204269 203418 202080
53974 202080 201472 201460 200944 199820 199006 198734 198388 197988 198411 199984 202071 204153 206214 208033 209131 209593 210056
53957 210056 210858 211975 213554 215578 217226 217684 217463 217893 219429 221472 223690 226387 229612 233033 236753
53942 236753 241257 246533 252158 258244 265327 273465 282371 292351 304020 317165 330879 344647 358018
53929C58018J1223O379J48m998p732q174o901m775k977k000j122L20J891K987
53915C42287L855M850N681O240P135Q416Q880P654N521L673K220R18J76R5k97
53900D07304j596k815k937k653l088l906m146m067m503n171n312n395o465q186
53886C47064r145q882q232p873p838q089q315p542n233k517j051r82j262j537
53872B68566k308l413l864l317k523k152k175k390k661k663k248j981k428l168
53858B31275l331k903k595k600k451j979j467r48k42L94M87J57p7k17o85j373
53842B11445j598j072l20j0k69o69o17P4P79O48k20p68m35J77M24N88J013J256
53824B10426Q94M70O77J230J414J161Q16M21Q8L50J274J937J719J357J681K080
$$ plain form
53929 358018 369241 375620 375768 370770 363038 354864 347963 343188 340211 338211 337089 337409 339300 342287
53915 342287 346142 350992 356673 362913 370048 378464 387344 394998 400519 404192 406412 407330 407506 407601 407304
53900 407304 405708 402893 399956 397303 394215 390309 386163 382096 377593 372422 367110 361715 355250 347064
53886 347064 337919 329037 320805 312932 305094 297005 288690 281148 275915 273398 272347 271365 270103 268566
53872 268566 266258 262845 258981 255664 253141 250989 248814 246424 243763 241100 238852 236871 234443 231275
53858 231275 227944 225041 222446 219846 217395 215416 213949 213001 212759 213153 213640 213797 213720 213503 212818 211445
53842 211445 209847 208775 208455 208445 208176 207507 206890 206964 207743 208391 208171 207403 206968 207145 207569 208157 209170 210426
53824 210426 211320 211790 212467 213697 215111 216272 217088 217509 217597 217947 219221 221158 222877 224234 225915 227995
53808B27995J640J005J643L542N219N832N907O013O002N772N595N487N082M380
53794B91114L810L540L307K950K517J962J342J071J372J765J697J324R77L98p25
53779C18421j864k243k027k076k741l699m657n403n521m920m361m608n307n526
53765B63468n021m231l357k414j794j830k011j604q21n06q83j462j899k166k147
53750B31322j882j838k166k102j035L50R80R35R33Q41J9j147j526r40k88L9N23
53733B23018J214J417J032R66J743K627K656J833R14N33Q70J624K228K415K518
53718B47608K795K749J870P50N45J365K106K027J642J797K522L167L312L179L314
53703B80748L833M119L565K581K252K790L267L194L351M287N074M625L422K694
$$ plain form
53808 227995 229635 230640 232283 235825 241044 246876 252783 258796 264798 270570 276165 281652 286734 291114
53794 291114 294924 298464 301771 304721 307238 309200 310542 311613 312985 314750 316447 317771 318748 319146 318421
53779 318421 316557 314314 312287 310211 307470 303771 299114 293711 288190 283270 278909 274301 268994 263468
53765 263468 258447 254216 250859 248445 246651 244821 242810 241206 240385 239879 238996 237534 235635 233469 231322
53750 231322 229440 227602 225436 223334 222299 222649 223629 224564 225497 226338 226357 225210 223684 222744 222456 222495 223018
53733 223018 224232 225649 226681 227647 229390 232017 234673 236506 237420 237953 238823 240447 242675 245090 247608
53718 247608 250403 253152 255022 255772 256317 257682 259788 261815 263457 265254 267776 270943 274255 277434 280748
53703 280748 284581 288700 292265 294846 297098 299888 303155 306349 309700 313987 319061 323686 327108 329802
53689C29802K507K045J267Q94R39O45j64q25j026j141j353j423j382j558j880
53674C27347j964j855j899j988j686j041n11k56j45k25m95n51k12n1n66j281j528
53657C11093j576j967k305j840q22j09J68M13M83O6k96J27Q63Q73L39L34R70J336
53639C08150J190J184J427J339J024J290K113K534K347K447L171L669L362K799
53625C38046K647K836L207L877M645M889M504M059L900L927M284N275O507P201
53611C99804P421P923Q741R014Q407P449O419N073L653K843K496J648J95p94p30
53596D69562k97j62q6J41Q4m48r18j033j315k154l196m034m645m829m166k919
53580D39585k022j822j746j519j594k019k051j455j158j898l055l550l163k433
$$ plain form
53689 329802 332309 334354 335621 336515 337454 338099 337935 337110 336084 334943 333590 332167 330785 329227 327347
53674 327347 325383 323528 321629 319641 317955 316914 316403 316147 316002 315777 315282 314731 314519 314468 313902 312621 311093
53657 311093 309517 307550 305245 303405 302583 302474 302642 303055 303538 303604 303308 303435 304298 305171 305510 305844 306814 308150
53639 308150 309340 310524 311951 313290 314314 315604 317717 320251 322598 325045 328216 331885 335247 338046
53625 338046 340693 343529 346736 350613 355258 360147 364651 368710 372610 376537 380821 386096 392603 399804
53611 399804 407225 415148 423889 432903 441310 448759 455178 460251 463904 466747 469243 470891 471086 470292 469562
53596 469562 469265 469103 469017 469158 469242 468794 467876 466843 465528 463374 460178 456144 451499 446670 442504 439585
53580 439585 437563 435741 433995 432476 430882 428863 426812 425357 424199 422301 419246 415696 412533 410100
53566D10100j830j561j612j648j309p95o10o95n18K5N97J189J956K399J893R21
53550D08502O00R29Q86L44L72J355K326K712L274M558N764N954N438N095N239
53535D53348N757O581P479Q170Q977J0441J2113J2843J2572J2528J3304J4100
53523E78213J4375J4815J5903J6919J7267J7616J8759K0435K2119K3956K6034
53512G86411K7661K8309K8398K8453K8383K8235K8614K9623L0438L0660L0962
53501A106147L1579L1548L0443K9590L0222L1463L1561L0206K8280K6130K3623
53490A430792K1364K0260K0081J9689J8647J7588J7183J7588J8732K0317K1595
53479A643836K1893K1176J9726J7576J4759J1672Q729O003L565J417j104n031
$$ plain form
53566 410100 408270 406709 405097 403449 402140 401345 400735 400040 399522 399547 400144 401333 403289 405688 407581 408502
53550 408502 409102 410031 410917 411261 411633 412988 415314 418026 421300 425858 431622 437576 443014 448109 453348
53535 453348 459105 465686 473165 481335 490312 500753 512866 525709 538281 550809 564113 578213
53523 578213 592588 607403 623306 640225 657492 675108 693867 714302 736421 760377 786411
53512 786411 814072 842381 870779 899232 927615 955850 984464 1014087 1044525 1075185 1106147
53501 1106147 1137726 1169274 1199717 1229307 1259529 1290992 1322553 1352759 1381039 1407169 1430792
53490 1430792 1452156 1472416 1492497 1512186 1530833 1548421 1565604 1583192 1601924 1622241 1643836
53479 1643836 1665729 1686905 1706631 1724207 1738966 1750638 1759367 1765370 1768935 1770352 1769248 1764217
53467A764217j0237j5077j8193j9814k0699k0842k0194j9697k0449k2409k4837
53456A551769k7353k9663l0995l0896l0089k9487k8945k8006k7275k7799k9330
53445A231931l0360k9720k7344k3698j9471j5705j3240j1921j0880r520p827n985
53433A026260m243k798j376O71L425O057P960R604J1692J4061J6076J7562J8672
53420A123623J9401J9970K1079K3017K5095K6700K8287L0528L3105L5290L7151
53409A423246L9180M1162M2609M3947M6266M9854N3932N7742O1140O4121O6440
53398A989639O7839O8313O8201O8253O9191P0896P2408P3065P3095P2805P1877
53387B765582O9935O7117O3644N9580N5525N2593N0960M9310M6507M2989L9649
$$ plain form
53467 1764217 1753980 1738903 1720710 1700896 1680197 1659355 1639161 1619464 1599015 1576606 1551769
53456 1551769 1524416 1494753 1463758 1432862 1402773 1373286 1344341 1316335 1289060 1261261 1231931
53445 1231931 1201571 1171851 1144507 1120809 1101338 1085633 1072393 1060472 1049592 1040072 1032245 1026260
53433 1026260 1022017 1019219 1017843 1018514 1021939 1027996 1035956 1045560 1057252 1071313 1087389 1104951 1123623
53420 1123623 1143024 1162994 1184073 1207090 1232185 1258885 1287172 1317700 1350805 1386095 1423246
53409 1423246 1462426 1503588 1546197 1590144 1636410 1686264 1740196 1797938 1859078 1923199 1989639
53398 1989639 2057478 2125791 2193992 2262245 2331436 2402332 2474740 2547805 2620900 2693705 2765582
53387 2765582 2835517 2902634 2966278 3025858 3081383 3133976 3184936 3234246 3280753 3323742 3363391
53376C363391L6350L2535K8504K4724K0485J4380N853m676j6741k9804m2700n4085
53364C378216o3201o9632p3043p4042p4507p5876p7662p8645p8767p8539p7422
53353B556880p4441p0202o6590o4568o3592o3209o3720o5023o5979o5434o3147
53342A830975n9597n5594n2002m9119m6326m2990l9421l6218l3060k9210k4862
53331A362576k1002j8065j5773j4096j3366j3511j4012j4536j4750j3900j1668
53320A197897r163p797p363o443m630k913j781l34K187N115P255Q254Q616Q999
53306A197899R898J1492J3562J5759J7993K0177K1913K3094K4492K6893K9833
53295A413005L2176L3788L5655L8202M0423M0988L9479L6446L2978L0303K9090
$$ plain form
53376 3363391 3399741 3432276 3460780 3485504 3505989 3520369 3526222 3521546 3504805 3475001 3432301 3378216
53364 3378216 3315015 3245383 3172340 3098298 3023791 2947915 2870253 2791608 2712841 2634302 2556880
53353 2556880 2482439 2412237 2345647 2281079 2217487 2154278 2090558 2025535 1959556 1894122 1830975
53342 1830975 1771378 1715784 1663782 1614663 1568337 1525347 1485926 1449708 1416648 1387438 1362576
53331 1362576 1341574 1323509 1307736 1293640 1280274 1266763 1252751 1238215 1223465 1209565 1197897
53320 1197897 1188734 1180937 1173574 1167131 1162501 1159588 1157807 1157473 1159660 1164775 1172030 1180284 1188900 1197899
53306 1197899 1207797 1219289 1232851 1248610 1266603 1286780 1308693 1331787 1356279 1383172 1413005
53295 1413005 1445181 1478969 1514624 1552826 1593249 1634237 1673716 1710162 1743140 1773443 1802533
53284A802533K8886K8665K7927K6795K5175K2542J8553J3383P621K266j644m126
53272A998576o594j0287j4780j8917k2700k6996l1670l5463l7751l9176m0331
53261A713911m1130m1732m2815m4388m5335m4801m3268m1762m0584l9338l7680
53250A251078l5664l3721l2555l2661l3787l5084l5856l5859l5177l4229l3631
53239H72854l3398l2660l0767k8261k5983k3689k0645j7208j4543j2831j1162
53228F21707r273q033p879p997p708p566q431j0165j1900j3033j3465j3332j2935
53215D89990j2566j2139j1304j0042q730p686o987o679o628o352n592m819m562
53202C85904m561m403m542n619o984p249o345n659n893o062n119l463k155j556
$$ plain form
53284 1802533 1831419 1860084 1888011 1914806 1939981 1962523 1981076 1994459 2002080 2004346 2002702 1998576
53272 1998576 1991982 1981695 1966915 1947998 1925298 1898302 1866632 1831169 1793418 1754242 1713911
53261 1713911 1672781 1631049 1588234 1543846 1498511 1453710 1410442 1368680 1328096 1288758 1251078
53250 1251078 1215414 1181693 1149138 1116477 1082690 1047606 1011750 975891 940714 906485 872854
53239 872854 839456 806796 776029 747768 721785 698096 677451 660243 645700 632869 621707
53228 621707 612434 604401 596522 588525 580817 573251 564820 554655 542755 529722 516257 502925 489990
53215 489990 477424 465285 453981 443939 435209 427523 420536 413857 407229 400877 395285 390466 385904
53202 385904 381343 376940 372398 366779 359795 352546 346201 340542 334649 328587 323468 320005 317850 316294
53188C16294j399j474j667j805j933k198k329j774o63J38J70j02k13m08j027j824
53172B97786k342k464k280j869j436j218j082o82j10J72P1j07l08p30j152j097
53156B81152p92r85j669j885j208m78n59j180j533j441j317j411j526j253l30
53141B63585R22J539R05j98l17P33J537J010j80o62j15O12P25K54k07j34M35R38
53123B71382R54P97J021J513J578Q65k55j190j445o65J005K606L159K683J909
53108B85917J158K83n54r58j050j297j682j922k283l159l988l830k922k324k127
53093B59262j454l48jo60r66p0J057J336J169J330J450Q31j33n50l30L3L95P12
53075B63063M79n35j492j364k82P41J079Q23J99n90j193j409j412j339j000m36
$$ plain form
53188 316294 314895 313421 311754 309949 308016 305818 303489 301715 301052 301190 301360 301258 301045 300637 299610 297786
53172 297786 295444 292980 290700 288831 287395 286177 285095 284413 284303 284475 284546 284439 284131 283401 282249 281152
53156 281152 280360 279375 277706 275821 274613 274135 273576 272396 270863 269422 268105 266694 265168 263915 263585
53141 263585 264507 266046 266951 266753 266436 267169 268706 269716 269536 268874 268759 269371 270096 270350 270143 270009 270444 271382
53123 271382 272336 273133 274154 275667 277245 278110 277855 276665 275220 274555 275560 278166 281325 284008 285917
53108 285917 287075 287358 286804 285846 284796 283499 281817 279895 277612 274453 270465 266635 263713 261389 259262
53093 259262 257808 257460 257459 256799 255833 255763 256820 258156 259325 260655 262105 262936 262803 262253 261923 261956 262351 263063
53075 263063 263542 263007 261515 260151 259869 260610 261689 262512 262711 262121 260928 259519 258107 256768 255768 255332
53059B55332k14o94j415j757j770j765j617j043k25M41R56J517J973J989J567
53044B53275R89M07k19q80j498k008k291k262k018j682j169m57Q0O9k16j98J92
53027B40114O29J099J667J770Q19n73j103n51M5J04J22L81M02J02J76Q33J326
53010B47362J278J200J140L04j224j896r55R9l33j491j524l04O68O74M43O25R69
52993B47035J067Q62M26J9J99J081J738J236R1k71O23J799K173J640P90K15K18
52976B60941P25J367J856K154K137J560O44K01O53J356J452R93O45O97R45J276
52960B79602J674J813J274J34j004j543j347q69q57j589k379k388j855j815k476
52945B66375k854k309j462j105j107j047j022j138r77l61L3l74j081j284j031
$$ plain form
53059 255332 255118 254424 253009 251252 249482 247717 246100 245057 244832 245273 246229 247746 249719 251708 253275
53044 253275 254264 254671 254452 253572 252074 250066 247775 245513 243495 241813 240644 240187 240267 240336 240120 239922 240114
53027 240114 240743 241842 243509 245279 246098 245525 244422 243871 243916 244020 244142 244523 244925 245027 245203 246036 247362
53010 247362 248640 249840 250980 251284 250060 248164 247209 247308 246975 245484 243960 243656 244324 244998 245441 246066 247035
52993 247035 248102 248964 249390 249409 249608 250689 252427 253663 253754 253483 254106 255905 258078 259718 260508 260723 260941
52976 260941 261666 263033 264889 267043 269180 270740 271384 271585 272238 273594 275046 276039 276684 277381 278326 279602
52960 279602 281276 283089 284363 284497 283493 281950 280603 279734 278877 277288 274909 272521 270666 268851 266375
52945 266375 263521 261212 259750 258645 257538 256491 255469 254331 253354 252993 253026 252652 251571 250287 249256
52930B49256q91j007j170j324j317p20M13J200J006L15j57n13j111j600j401o25
52914B40354K58J115J786J739R19L04O50J323J316Q28O74P30K16q05j442j361
52898B48604j048q08m78j36r0k18r4K03J69k10l56Q0Q52J498J688J362Q50N71
52880B52439L18n87k018k712j914n32J45K05N37J210J628J817K289K851K813K181
52864B60670J642J334Q03J25L0P88J782K312K140J248j78j515k132k081j888j843
52848B63237j947k292k833l141l039l054l546l868l204j885q83m17PM18L56j40
52832B33769m67l77j25J39L77K71l34q17m76L56P70O40N34N89M35J42J95N24M82
52813B36627j61r78j556j632q61O82J987K011J079M98R16J852K600K665J640l00
$$ plain form
52930 249256 248365 247358 246188 244864 243547 242827 243240 244440 245446 245761 245604 245091 243980 242380 240979 240354
52914 240354 240612 241727 243513 245252 246171 246475 247125 248448 249764 250592 251266 251996 252212 251407 249965 248604
52898 248604 247556 246748 246270 246134 246044 245826 245732 245935 246104 245894 245538 245618 246470 247968 249656 251018 251868 252439
52880 252439 252757 252170 250152 247440 245526 244994 245139 245344 245881 247091 248719 250536 252825 255676 258489 260670
52864 260670 262312 263646 264449 264574 264604 265392 267174 269486 271626 272874 272696 271181 269049 266968 265080 263237
52848 263237 261290 258998 256165 253024 249985 246931 243385 239517 236313 234428 233545 233128 233135 233553 233909 233769
52832 233769 233302 232925 232800 232939 233316 233587 233253 232436 231960 232316 233086 233726 234260 234849 235284 235426 235621 236145 236627
52813 236627 236466 235488 233932 232300 231439 232121 234108 236119 237198 237696 238612 240464 243064 245729 247369 247069
52797B47069j931k108j292r03j421k066k258k119j702r40l78o58j247r28L45J309
52781B28772J245P14K31l69r17o06O33J674J680J130P49M03k22p30n99o0L20L84
52763B34432K37j28n81p27m67k02j56N2P46J570J885J499O99q3m39j68M76R65
52745B39610J078J091J337J835K296K300J647O85M8r5r8O9R64K475L319K635J273
52728B62469N11K99j12m28K05J417J896J291L85n23j805l053l118j955r06p10
52712B55863o40p9L98J99k33l25l23o32j057j298j485j655j433o74K12Q93J410
52695B49141J651J339P49N75Q17P29P9m52m15j62L1L95Q65Q42K20k88k73j57k22
52676B55464j16K96N10L18J85K10k59j351k030j453k01N39L52m05j288j820j538
$$ plain form
52797 247069 245138 243030 241738 240835 239414 237348 235090 232971 231269 230329 229951 229293 228046 227118 227463 228772
52781 228772 230017 230731 230962 230593 229676 229070 229703 231377 233057 234187 234936 235339 235117 234387 233788 233728 234048 234432
52763 234432 234669 234541 233960 233233 232766 232564 232408 232460 233206 234776 236661 238160 238859 238776 238337 238169 238645 239610
52745 239610 240688 241779 243116 244951 247247 249547 251194 251879 251927 251832 251734 251803 252767 255242 258561 261196 262469
52728 262469 262980 263279 263167 262739 262944 264361 266257 267548 267933 267410 265605 262552 259434 257479 256573 255863
52712 255863 255223 255144 255542 255741 255508 255183 254860 254228 253171 251873 250388 248733 247300 246626 246838 247731 249141
52695 249141 250792 252131 252880 253455 254272 255001 255080 254628 254213 254051 254082 254477 255342 256184 256404 256116 255843 255686 255464
52676 255464 255348 255644 256154 256472 256657 256867 256608 255257 253227 251774 251573 252112 252464 252059 250771 248951 247413
52659B47413n70K93M98K96J56K79Q00J733K581K796K693K964L265K528Q33m23
52643B68135o38q50j807k609k245j275r17j352j928k289k293j609k61J006J660
52628B50728K135K991M051N001O046P152P353N749K696o28l328m998n465n001
52614B74482m159l075j564j77K6q23j141j51Q43M38p72j274q24k30K20P98J234
52597B63851R55J84k74j70P6J36j3k74k88L18J076Q57m84j528j198k07L07N67
52579B63891J251J834J417N76O91J769K445K028J102J47r83k081k383j654n95
52564B69455R0K86R2l19m89r0L79P7r66j859k010j595r70l25O5m1m13o04n48m37
52544B59778j98L27R08J231J423J656J591R02K5l98n15q63j271j102l77K47O31
$$ plain form
52659 247413 246843 247136 247634 247930 248086 248365 249165 250898 253479 256275 258968 261932 265197 267725 268558 268135
52643 268135 267497 266647 264840 262231 259986 258711 257794 256442 254514 252225 249932 248323 248062 249068 250728
52628 250728 252863 255854 259905 264906 270952 278104 285457 291206 293902 293274 289946 284948 279483 274482
52614 274482 270323 267248 265684 265507 265533 264710 263569 263418 264261 264699 263927 262653 261829 261599 261819 262617 263851
52597 263851 264806 264990 264716 264546 264622 264758 264745 264471 264183 264501 265577 266434 265950 264422 263224 263017 263324 263891
52579 263891 265142 266976 268393 268969 269660 271429 273874 275902 277004 277151 276168 274087 271704 270050 269455
52564 269455 269545 269831 269923 269604 269115 269025 269404 269481 268515 266656 264646 263051 262081 261756 261821 261780 261367 260763 260215 259778
52544 259778 259580 259907 260815 262046 263469 265125 266716 267618 267643 267245 266730 265867 264596 263494 263117 263364 263995
52527B63995J273K266K972K981K596K216J821J265N98m2n40p32n58j68L66J151
52511B81460J990K268J837J544K247L679M913N529N516M597K611K84j424k561
52497C14490l845n219n784n177l942k529q85P09J439R87K8o76j008j105r09n18
52481B86056l96p66j169j005l01L41M15j6l71j06O88J313J358J233J532K136K435
52464B93377K330K384K963L687L920L589L326L809M778M835K736r68m127n221
52450C21418m831m443m508m375l699k922k449k148j761j260q10o82j081j733j913
52435B82803j270l31K04L67O02R84J192J005L34q15j954k170j214K2O67R83J535
52418B82944J939J508O85O13J385J916J665J424K131L619M963N581N744O369Q289
$$ plain form
52527 263995 265268 267534 270506 273487 276083 278299 280120 281385 281983 281941 281401 280669 280111 279943 280309 281460
52511 281460 283450 285718 287555 289099 291346 295025 299938 305467 310983 315580 318191 318475 317051 314490
52497 314490 310645 305426 299642 294465 290523 287994 287109 287818 289257 290244 290272 289596 288588 287483 286574 286056
52481 286056 285660 284894 283725 282720 282419 282760 283175 283159 282788 282682 283370 284683 286041 287274 288806 290942 293377
52464 293377 295707 298091 301054 304741 308661 312250 315576 319385 324163 328998 331734 330766 326639 321418
52450 321418 316587 312144 307636 303261 299562 296640 294191 292043 290282 289022 288212 287530 286449 284716 282803
52435 282803 281533 281202 281406 281773 282375 283359 284551 285556 285890 285075 283121 280951 279737 279759 280426 281409 282944
52418 282944 284883 286391 287076 287689 289074 290990 292655 294079 296210 299829 304792 310373 316117 322486 330775
52403C30775J1444J4725J6731J6479J3471P846R62m962q601j0467j1540j1712
52391C65151j0458q341o605n591m684l618k740k136j529r68p25n65n2O24J021
52376C18784J336J941K388K104J802K800M944O614O989O872O921O507N000K995
52362C77997J382J21j253k556l210l195k998k870k625k048j185l07L00N92P95
52347C58940J040J164J155J452K336L315L671L382K988K828L051L909N325O514
52333D01070O863O886P441Q386Q987R401J0526J2478J4332J5430J5990J6398J6896
52320E51084J7865J9412K0634K0378J8791J7052J5640J4078J2426J1635J1977
52309G30972J2372J1828J0643R647R208R288R715R929R348Q225P417P149O881
$$ plain form
52403 330775 342219 356944 373675 390154 403625 411471 412433 407471 398870 388403 376863 365151
52391 365151 354693 346352 339747 334156 329472 325854 323114 320978 319449 318481 317756 317191 317139 317763 318784
52376 318784 320120 322061 324449 326553 328355 331155 336099 342713 349702 356574 363495 370002 375002 377997
52362 377997 379379 379500 378247 375691 372481 369286 366288 363418 360793 358745 357560 357253 357553 358145 358940
52347 358940 359980 361144 362299 363751 366087 369402 373073 376455 379443 382271 385322 389231 394556 401070
52333 401070 407933 414819 422260 430646 439633 449034 459560 472038 486370 501800 517790 534188 551084
52320 551084 568949 588361 608995 629373 648164 665216 680856 694934 707360 718995 730972
52309 730972 743344 755172 765815 775462 784670 793958 803673 813602 822950 831175 838592 845741 852622
52296H52622O460O308O224N255L076M50k098m865p819j0079j1107j1386j1295
52283H21746j0410q569o571n044l594j795k9J381K962N083P038Q009Q291Q727
52269H27225R594J0778J2308J3866J4532J3868J2705J1991J1503J0583R492Q930
52257I67375Q751Q228P397P025P329P592P230O526O160O349O487N531K925o91
52243A054214l991o289p959r445j0564j1055j1115j0924j0312r277q283p544o729
52230I40727n806n337n434n206l988k360j250o85k54k1o9K07J286K553L182L531
52214I21076M507N854O426O040N792O325O919O713N970N492N442N309M777M158
52200A000800L993M414M945M979M392L617L077K859L003L629M492M921M567L905
$$ plain form
52296 852622 859082 865390 871614 876869 879945 880395 878297 873432 865613 855534 844427 833041 821746
52283 821746 811336 802767 796196 791152 787558 785763 785734 787115 790077 795160 802198 810207 818498 827225
52269 827225 836819 847597 859905 873771 888303 902171 914876 926867 938370 948953 958445 967375
52257 967375 976126 984354 991751 998776 1006105 1013697 1020927 1027453 1033613 1039962 1046449 1051980 1054905 1054214
52243 1054214 1050223 1043934 1035975 1026530 1015966 1004911 993796 982872 972560 963283 955000 947456 940727
52230 940727 934921 929584 924150 918944 914956 912596 911346 910661 910407 910386 910317 910524 911810 914363 917545 921076
52214 921076 925583 931437 937863 943903 949695 956020 962939 969652 975622 981114 986556 991865 996642 1000800
52200 1000800 1004793 1009207 1014152 1019131 1023523 1027140 1030217 1033076 1036079 1039708 1044200 1049121 1053688 1057593
52186A057593L606L727L954M197M413M126K783N57j748l606n196o942q879j0531
52172A048054j1253j0808r694q705q040p225n918m431l169k080r18K48J207J966
52158I79234K680L474M489N726O633O374M753K446J60j828l125l105j959j003
52144A004949j236k037k097j137J02J143K040K626K435J522N97J95K66O76J600
52129A011644L190N191P146Q875J0712J3195J6399J9625K2095K3949K6002K8420
52117A196443L0263L0637K9730K8224K6320K3903K1175J8462J5753J2933J0179
52106A444022P520M498Q93k561m861n908o325o413n990n113m214l523k979k659
52092A406387k723l022l324l913n332p461r463j0756j1536j2203j2682j2595j1741
$$ plain form
52186 1057593 1061199 1064926 1068880 1073077 1077490 1081616 1084399 1084956 1083208 1079602 1074406 1067464 1058585 1048054
52172 1048054 1036801 1025993 1016299 1007594 999554 992329 986411 981980 978811 976731 975813 976061 977268 979234
52158 979234 981914 985388 989877 995603 1002236 1008610 1013363 1015809 1015969 1014141 1011016 1007911 1005952 1004949
52144 1004949 1003713 1001676 999579 998442 998544 999687 1001727 1004353 1006788 1008310 1008907 1009102 1009368 1010044 1011644
52129 1011644 1014834 1020025 1027171 1036046 1046758 1059953 1076352 1095977 1118072 1142021 1168023 1196443
52117 1196443 1226706 1257343 1287073 1315297 1341617 1365520 1386695 1405157 1420910 1433843 1444022
52106 1444022 1451542 1456040 1456933 1454372 1449511 1443603 1437278 1430865 1424875 1419762 1415548 1412025 1409046 1406387
52092 1406387 1403664 1400642 1397318 1393405 1388073 1380612 1371149 1360393 1348857 1336654 1323972 1311377 1299636
52079A299636j0209q113n525k594L09K703M418N798P300Q898J0194J1106J1974
52066A335895J2912J3547J3617J3298J2780J1971J0944J0039R192P752N481L183
52054A460611J724Q77j55j473k472k902l213l947n282p164r396j1706j4029j6535
52040A384938j9007k0647k0978k0639k0602k0759k0049j7934j5137j2768j1224
52029A185194j0085q691o709m413k561j805k091k774l307l769m675o260p953q745
52015A111356q341p640p646q128q086p375o985p593q769j0000j1487j3436j5306
52002I90564j6464j6918j6918j6520j6070j6316j7298j7885j7253j6095j5373
51991H07454j4613j2594r328o183m163l214l069l711m820n733o249o836p905r313
$$ plain form
52079 1299636 1289427 1281314 1275789 1273195 1273504 1276207 1280625 1286423 1293723 1302621 1312815 1323921 1335895
52066 1335895 1348807 1362354 1375971 1389269 1402049 1414020 1424964 1435003 1444195 1451947 1457428 1460611
52054 1460611 1462335 1463212 1463057 1461584 1459112 1456210 1452997 1449050 1443768 1436604 1427208 1415502 1401473 1384938
52040 1384938 1365931 1345284 1324306 1303667 1283065 1262306 1242257 1224323 1209186 1196418 1185194
52029 1185194 1175109 1166418 1159709 1155296 1152735 1150930 1148839 1146065 1142758 1138989 1134314 1128054 1120101 1111356
52015 1111356 1103015 1095375 1087729 1079601 1071515 1064140 1057155 1049562 1040793 1030793 1019306 1005870 990564
52002 990564 974100 957182 940264 923744 907674 891358 874060 856175 838922 822827 807454
51991 807454 792841 780247 770919 764736 760573 757359 754290 750579 745759 740026 733777 726941 719036 709723
51977G09723j0620j1490j1875j2230j3178j4620j5473j4970j3710j2746j1989
51966E66822j0414p645m387j393J226L642N931Q149J0145J1404J1597J1064J0186
51953F16327Q619N920K607l23k744n276p911r684r888q749o827m557k443p99Q83
51938E75155L499O984J0174J2248J3552J4666J5339J4945J3487J1621R848P959
51926G09477N290J530k608n731p113p410p618p615o512m283k303k096m140p930
51912F50938j2554j7002k0430k2411k2780k1372j8330j4515j0952p925n045k111
51900D75511O62L146N408P343Q724R615J0232J0450R898Q323N462R34m951j0616
51886E40141j4333j5805j5850j4915j2874j0128p593n473l148n03J754L327M749
$$ plain form
51977 709723 699103 687613 675738 663508 650330 635710 620237 605267 591557 578811 566822
51966 566822 556408 548763 544376 542983 544209 547851 553782 561931 572076 583480 595077 606141 616327
51953 616327 624946 630866 633473 633150 630406 625130 617219 607535 597647 588898 582071 577514 575071 574272 575155
51938 575155 578654 585638 595812 608060 621612 636278 651617 666562 680049 691670 701518 709477
51926 709477 714767 716297 713689 707958 700845 693435 685817 678202 671690 667407 665104 663008 658868 650938
51912 650938 638384 621382 600952 578541 555761 534389 516059 501544 490592 482667 477622 475511
51900 475511 476173 479319 484727 492070 500794 510409 520641 531091 540989 549312 554774 555708 550757 540141
51886 540141 525808 510003 494153 479238 466364 456236 448643 443170 440022 439519 441273 444600 449349
51873D49349O223P200P590Q185R229R674Q743P215O146N152L143K13k472m392
51859E21198o038p562q286p814o673n413l737j181J833M282N656O273O471O061
51845E05070M794K975J149o13k662m973o843p609p344o722o402o651p204p342
51831D49623o481m877l391k350j180N40K230L063L030K656K021Q03r54k729m093
51816D37911m820m741l976l054k307j451k90O77J031J340K383L863M795M903M594
51801D40858L848K279K31j314k053k525k913k772k137j733j752j556j044j160
51787D26257k395l709l868l102k546k505k249j261O9J093J623J836J833J448N79
51772D13103l90p35p2J235K615L948N417O982Q448R865J1299J2487J3198J3642
$$ plain form
51873 449349 455572 462772 470362 478547 487776 497450 506193 513408 519554 524706 527849 528062 525590 521198
51859 521198 515160 507598 499312 491498 484825 479412 475675 474494 476327 480609 486265 492538 499009 505070
51845 505070 509864 512839 513988 513375 510713 505740 498897 491288 483944 477222 470820 464169 456965 449623
51831 449623 443142 438265 434874 432524 431344 431884 434114 437177 440207 442863 444884 445687 444733 442004 437911
51816 437911 433091 428350 424374 421320 419013 417562 417272 417949 418980 420320 422703 426566 431361 436264 440858
51801 440858 444706 446985 447216 445902 443849 441324 438411 435639 433502 431769 430017 428461 427417 426257
51787 426257 423862 420153 416285 413183 410637 408132 405883 404622 404691 405784 407407 409243 411076 412524 413103
51772 413103 412713 411978 411906 413141 415756 419704 425121 432103 440551 450416 461715 474202 487400 501042
51758E01042J3926J3359J1120P369L006j496o106j0294j3137j4419j4747j4473
51746D75150j3446j1889j0524r546q456p089n885m838l227p96J708L746N777Q303
51732D18988J0837J2509J3038J2525J0855Q078M927K369Q59M60J246K924M316
51719E03931L876J029l170o820q680q968q597p776n917l154j054j084k811m562
51705D46243n392n491n031l849k091l2K610N907Q453Q314N518K226J15j089k096
51690D54315k536j693L35K824M856N242L212k74l085m353n170o370p059o242m539
51675D29463l061j724Q1K033L389M270N230O117O503O783P733R330J0906J2060
51661D99113J2571J1874R603O257K484j826o713j0832j2231j0482p088l704o23
$$ plain form
51758 501042 514968 528327 539447 546816 549822 548326 542220 531926 518789 504370 489623 475150
51746 475150 461704 449815 439291 429745 421289 414200 408315 403477 400250 399454 401162 404908 410685 418988
51732 418988 429825 442334 455372 467897 478752 486830 491757 494126 494985 495445 496691 499615 503931
51719 503931 507807 508836 505666 498846 490166 481198 472601 464825 458908 455754 454700 453616 450805 446243
51705 446243 440851 435360 430329 426480 424389 424357 426967 432874 441327 449641 455159 457385 457500 456411 454315
51690 454315 451779 450086 450421 453245 458101 463343 466555 466281 463196 458843 453673 447303 440244 434002 429463
51675 429463 426402 424678 424759 426792 430181 434451 439681 445798 452301 459084 466817 476147 487053 499113
51661 499113 511684 523558 533161 539418 541902 540076 533363 522531 510300 499818 492730 489026 488403
51648D88403K717O344R092R241N986L87n358r640j2167j3143j2693j1408j0387
51635D47374j0069r702q555p016n834m982l978k750j394K93K327M073M935N070
51621D09792M806L990K594J268N29r3j243k572l185k863k099j334q48r67j676
51606D06099k404k752k968l174k851j731m63L13R08J782K604L105M127O662J0402
51591D19659J4085J6649J7118J4321Q207R10m929q606j0917j1998j1261r216p366
51578D26656o070m077p60K662M888O479R044J3015J6919J8814J8179J6534J6168
51565E38451J8055K1162K3792K5092K4957K3462K1398K0729K3199K8472L4506
51554H03275L9649M3565M6246M6921M4075L6245K3309P582p093j8276k6582l3717
$$ plain form
51648 488403 491120 497464 506556 515797 521783 522170 516812 507172 495005 481862 469169 457761 447374
51635 447374 437305 427603 419048 412032 406198 401216 397238 394488 393094 393387 395714 399787 404722 409792
51621 409792 414598 418588 421182 422450 422979 422886 421643 419071 415886 413023 410924 409590 408742 407775 406099
51606 406099 403695 400943 397975 394801 391950 390219 389756 390069 390977 392759 395363 398468 402595 409257 419659
51591 419659 433744 450393 467511 481832 490039 490949 486020 477414 466497 454499 443238 434022 426656
51578 426656 420586 416509 415749 418411 423299 429778 438822 451837 468756 487570 505749 522283 538451
51565 538451 556506 577668 601460 626552 651509 674971 696369 717098 740297 768769 803275
51554 803275 842924 886489 932735 979656 1023731 1059976 1083285 1090867 1083774 1065498 1038916 1005199
51542A005199l9819m3885m5903m6736m6294m3638l8993l3942k9412k4960k0336
51531E91281j6290j3372j1279r869r478r690r066o908m243k356j236j94Q24J387
51517D99511J407J075M21n51j695l065m908o926q121p890o809n930n573n279m590
51502D41077l597k845k796l240l364k748k035k081k667k785k021q37L34J335J747
51487D13477J204L85N31J672K380J678J61j220k437l715m557m375l581l185l587
51472C94831m368m944m936m196k992j972j565j587j591j334q23k44J9k54n93k24
51456C63227Q43J703J758J424J310J316R79L39o7K48J424L198M940O023O418O727
51440D01810P621R471J2241J5077J6135J3840Q659K950j201l377l981l055p57
$$ plain form
51542 1005199 965380 921495 875592 828856 782562 738924 699931 665989 636577 611617 591281
51531 591281 574991 561619 550340 540471 530993 521303 512237 505329 501086 498730 497494 497300 498124 499511
51517 499511 500918 501993 502414 501863 500168 497103 492195 485269 477148 469258 462449 456519 450946 445667 441077
51502 441077 437480 434635 431839 428599 425235 422487 420452 418371 415704 412919 410898 410061 410395 411730 413477
51487 413477 414681 415066 415597 417269 419649 421327 421488 420268 417831 414116 409559 405184 401603 398418 394831
51472 394831 390463 385519 380583 376387 373395 371423 369858 368271 366680 365346 364523 364279 364298 364044 363451 363227
51456 363227 364070 365773 367531 368955 370265 371581 372560 372899 372832 373080 374504 377702 382642 388665 395083 401810
51440 401810 409431 418902 431143 446220 462355 476195 484854 487804 486603 483226 479245 476190 475433
51427D75433J732K702J252k143o043q751r148p468n016k860j130K47Q38L13p54
51412D39204j416j458j410j527j408o08O60J641J722J017K72O1J78M3m07p05o95
51395D35164q35j442k077j923m95K120N244P798Q992R118R282J0270J2084J4607
51381E07907J8084K2683K8220L4495M1265M7708N2861N7153O2496O9658P5863
51370A018393P6149O7496N1300L1935J3509k099j5009k6072l5829m4299n1247
51359A084227n6389n9455o0384n9534n7412n4117m9414m3475l7263l1852k7519
51348E47413k3720j9828j5812j2286r962q969q716q517q211p920p479o525n188
51335D04280m090l572l332k997k646k568k803l125l233k843j942r85n59o48n97
$$ plain form
51427 475433 477165 479867 481119 478976 472933 464182 455034 447566 442550 439690 438560 438807 439645 439958 439204
51412 439204 437788 436330 434920 433393 431985 431377 432037 433678 435400 436417 436689 436750 436928 436971 436564 435859 435164
51395 435164 434329 432887 430810 428887 428392 430512 435756 443554 452546 461664 470946 481216 493300 507907
51381 507907 525991 548674 576894 611389 652654 700362 753223 810376 872872 942530 1018393
51370 1018393 1094542 1162038 1213338 1245273 1258782 1256683 1241674 1215602 1179773 1135474 1084227
51359 1084227 1027838 968383 907999 848465 791053 736936 687522 644047 606784 574932 547413
51348 547413 523693 503865 488053 475767 465805 456836 448120 439603 431392 423472 415993 409468 404280
51335 404280 400190 396618 393286 390289 387643 385075 382272 379147 375914 373071 371129 370144 369585 368937 368340
51320C68340O5R96J496J350J060J258K062K989L568L877M251M507M010K704J392
51305D03925O06j76j490k750l078k829l057l764l869l025k230k319k923l285l208
51290C66528k741j866r81q21j336j403k99J254K197K632L408M686N818O492P117
51275C90685P923Q305P368N037K322M28l88q51j474j770j042M97K066L430M779
51260D27315N631M950K628l7j731k319k358k166j858j677j842k413l469m935o155
51245D09564o351n664n028m752m151k839j574j194j536j887j951j716j070j15
51231C69736N56M95q4p03j094j023l24N51P40J61k24J95Q00Q37O15Q70J610K332
51213C76046K898L394L598L273K643J987J247M74R6J55l4o91q36L76K097K705
$$ plain form
51320 368340 368405 369401 370897 372247 373307 374565 376627 379616 383184 387061 391312 395819 399829 402533 403925
51305 403925 404531 404355 402865 400115 397037 394208 391151 387387 383518 380493 378263 375944 373021 369736 366528
51290 366528 363787 361921 360940 360119 358783 357380 357081 358335 360532 363164 366572 371258 377076 383568 390685
51275 390685 398608 406913 414281 419318 421640 422068 421680 420829 419355 417585 416543 417040 419106 422536 427315
51260 427315 432946 437896 440524 440487 438756 436437 434079 431913 430055 428378 426536 424123 420654 415719 409564
51245 409564 403213 397549 392521 387769 383618 380779 379205 378011 376475 374588 372637 370921 369851 369736
51231 369736 370292 370787 370703 370000 368906 367883 367559 368110 368850 369011 368787 368982 369782 370619 371234 372104 373714 376046
51213 376046 378944 382338 385936 389209 391852 393839 395086 395560 395656 395811 395777 395086 394250 394626 396723 399428
51197C99428J877P28J00k32o71j118j347j325j097p80o46p40o51j56K07j20o97
51180C92760o22J21P16Q50J097J830K545K591J971J103K43n05j026j275j384j468
51164C99547j480j290p55L08K028M262O523Q139Q583P805O313M698L082J248p57
51149D48254k560l999n171n831n443m053k640k065k238k630l094l669m040l821
51135C97000l112k296j512p73k52m5N8K09K62K49O19J548K428K655K489K550K835
51118D04912K906K792K975L546M010L972L555L103K799K584K228J526N99k05p21
51103D40581r96q59k4J164J701J043k16j123j361j163p79m88n74q89q93n05k91
51086D34328l93j22Q30J523R96k74j058r50m57R0P29J273J406J239J087Q98N37
$$ plain form
51197 399428 401305 402033 402133 401901 401230 400112 398765 397440 396343 395563 394917 394177 393526 393370 393577 393457 392760
51180 392760 392138 392259 392975 393825 394922 396752 399297 401888 403859 404962 405205 404700 403674 402399 401015 399547
51164 399547 398067 396777 396022 396330 398358 402620 409143 417282 425865 433670 439983 444681 447763 449011 448254
51149 448254 445694 441695 436524 430693 425250 421197 418557 416492 414254 411624 408530 404861 400821 397000
51135 397000 393888 391592 390080 389307 389055 389010 389068 389277 389539 389788 390407 391955 394383 397038 399527 402077 404912
51118 404912 407818 410610 413585 417131 421141 425113 428668 431771 434570 437154 439382 440908 441507 441302 440581
51103 440581 439585 438726 438702 439866 441567 442610 442394 441271 439910 438747 437968 437480 436906 436017 435124 434619 434328
51086 434328 433935 433813 434643 436166 437162 436888 435830 434880 434423 434513 435242 436515 437921 439160 440247 441145 441682
51069D41682L23O38J291J959K844M243N880P419R203J1746J4992J8823K3508K8387
51055E72938L0758K7831K0065J1335N576M261O959J2512J8773K2579K1677J6857
51043G72121J1292P487N072J668m272j1664j7841k0841k0239j6394j0361m811
51031F91217l248o882j3082j8079k0571k1509k1350j9450j5937j2178q942n655
51019E24334k051P78J819J598J404J784K475L281M282N445O575P649Q780J0005
51005E78158J1121J1788J1878J1816J2186J2779J2569J1071R168P907P009N536
50993G02986L513J806O29n65j812k492k632l158m418n446n151l524j264J119L484
50978F83075N899Q551J1259J3071J3011J1381R602Q724Q809R772J1840J4945J8585
$$ plain form
51069 441682 442005 442643 443934 445893 448737 452980 458860 466279 475482 487228 502220 521043 544551 572938
51055 572938 603696 631527 651592 662927 668503 672764 679723 692235 711008 733587 755264 772121
51043 772121 783413 790900 795972 797640 793368 781704 763863 743022 722783 706389 696028 691217
51031 691217 687969 681087 668005 649926 629355 607846 586496 567046 551109 538931 529989 524334
51019 524334 522283 523061 524880 526478 527882 529666 532141 535422 539704 545149 551724 559373 568153 578158
51005 578158 589279 601067 612945 624761 636947 649726 662295 673366 682534 690441 697450 702986
50993 702986 706499 708305 708934 708369 706557 704065 701433 698275 693857 688411 683260 679736 678472 679591 683075
50978 683075 688974 697525 708784 721855 734866 746247 755849 764573 773382 783154 794994 809939 828524
50965H28524K2561K7057L1658L5289L7644L9830M2939M6670M9934N2181N3518
50954A267805N3953N3306N1623M9176M6147M2568L8409L3642K8571K3974K0470
50943A709644J7707J4944J2556J2091J4221J7348J8823J7284J3357Q637M498J577
50931A862687l02j837l641n909q697j2193j6484k1313k6327l1436l6695m1973
50919A655880m6759n0372n2435n3293n3685n3804n2922n0343m6407m2099l7968
50908A115793l3996l0288k7075k4214k1358j8725j6914j5929j5055j3846j2581
50897H85812j1621j0865j0046r060p931o832o087n709n147l995k717j939j412
50884H02451m90N72R63P62Q29J251J181N00K58J026J992K420K860M136N959P433
$$ plain form
50965 828524 851085 878142 909800 945089 982733 1022563 1065502 1112172 1162106 1214287 1267805
50954 1267805 1321758 1375064 1426687 1475863 1522010 1564578 1602987 1636629 1665200 1689174 1709644
50943 1709644 1727351 1742295 1754851 1766942 1781163 1798511 1817334 1834618 1847975 1856612 1861110 1862687
50931 1862687 1862385 1860548 1856907 1850998 1842301 1830108 1813624 1792311 1765984 1734548 1697853 1655880
50919 1655880 1609121 1558749 1506314 1453021 1399336 1345532 1292610 1242267 1195860 1153761 1115793
50908 1115793 1081797 1051509 1024434 1000220 978862 960137 943223 927294 912239 898393 885812
50897 885812 874191 863326 853280 844220 836289 829457 823370 817661 812514 808519 805802 803863 802451
50884 802451 801961 802533 803496 804258 805087 806338 807519 808019 808277 809303 811295 813715 816575 820711 826670 834103
50868H34103Q234Q607Q789R163J0330J2402J4639J6428J8017J9812K1566K3044
50856A005134K4862K7791L1533L5071L8099M1399M5834N1502N7903O4574P1487
50845A495189P8921Q6839R4476J00954J06338J11507J16837J21503J24307J24500
50835B561371J21539J14785J04109R0393P5004N9109M3676K9536J6971N852l444
50824C218901r788j2535j2259r739m775L119J3284K4024L3778M1289M4839M2566
50812C372704L3995K0680M897j1990k9660m7811o5638q2346r7730j11757j23624
50801B861720j31753j35064j33930j29541j22572j13087j01463q8706p5678o2663
50791A767263m9867l7749k6620j6310o540K621J0702J6959K0705K1893K1310J9675
$$ plain form
50868 834103 842337 850944 859733 868896 879226 891628 906267 922695 940712 960524 982090 1005134
50856 1005134 1029996 1057787 1089320 1124391 1162490 1203889 1249723 1301225 1359128 1423702 1495189
50845 1495189 1574110 1660949 1755425 1856379 1962717 2074224 2191061 2312564 2436871 2561371
50835 2561371 2682910 2797695 2901804 2992197 3067201 3126310 3169986 3199522 3216493 3222345 3218901
50824 3218901 3209113 3196578 3184319 3174580 3169805 3172924 3186208 3210232 3244010 3285299 3330138 3372704
50812 3372704 3406699 3427379 3432276 3420286 3390626 3342815 3277177 3194831 3097101 2985344 2861720
50801 2861720 2729967 2594903 2460973 2331432 2208860 2095773 1994310 1905604 1829926 1767263
50791 1767263 1717396 1679647 1653027 1636717 1630177 1632798 1643500 1660459 1681164 1703057 1724367 1744042
50779A744042J6827J2472P435L216K59k329n127p528q974j0120j2141j5480j9872
50766A702680k4913l0097l4695l8196m0592m2013m2506m2336m1934m1267l9776
50755A284355l7227l4068l0738k7243k3664k0433j7719j5180j2538r889p165m017
50743A044474m72L024O426J0216J4404J8347K1836K5496K9629L3685L7402M1455
50731A285922M6187N0653N3753N5579N6784N7456N7579N7862N8994O0431O1002
50720A902202O0420N9242N7645N5054N0821M4487L5569K3987J0731k489j4257
50709B283412k3776l0411l3554l2900k8640k1547j3037m606L169J0665J7955K4063
50697B150793K7857K9032K7603K3082J4902L348j0527k5482m0117n2881o2747
$$ plain form
50779 1744042 1760869 1773341 1780776 1783992 1784251 1781922 1776795 1769267 1760293 1750173 1738032 1722552 1702680
50766 1702680 1677767 1647670 1612975 1574779 1534187 1492174 1449668 1407332 1365398 1324131 1284355
50755 1284355 1247128 1213060 1182322 1155079 1131415 1110982 1093263 1078083 1065545 1055656 1048491 1044474
50743 1044474 1044002 1047026 1053452 1063668 1078072 1096419 1118255 1143751 1173380 1207065 1244467 1285922
50731 1285922 1332109 1382762 1436515 1492094 1548878 1606334 1663913 1721775 1780769 1841200 1902202
50720 1902202 1962622 2021864 2079509 2134563 2185384 2229871 2265440 2289427 2300158 2297669 2283412
50709 2283412 2259636 2229225 2195671 2162771 2134131 2112584 2099547 2094941 2098110 2108775 2126730 2150793
50697 2150793 2178650 2207682 2235285 2258367 2273269 2276617 2266090 2240608 2200491 2147610 2084863
50686B084863o9537p3147p3025o9077o2480n4759m6429l7260k7440j7551p656
50675A546502K687J3551K4490L5197M5716N6005O5722P4296Q0826Q4171Q3662
50664B112825P9645P3042O4742N5637M6781L8872L1947K5953K1350J8578J7269
50653B586641J6323J4522J0956N471p73n853q742j0152j1296j2291j2154r951
50641B562701n504N18O938J2917J8630K4573L0175L4044L5727L6023L5388L3397
50629B825527L0270K7404K5677K4847K5227K7605K9616K4400O160k3040n3971
50618B969722p7502q9698r1016q3755p1041n6062m0765k5851j2088n17Q662J5996
50606B446085K1226K3059K0853J5411P726k072j4069k7678m1718n4822o5687p3668
$$ plain form
50686 2084863 2015326 1942179 1869154 1800077 1737597 1682838 1636409 1599149 1571709 1554158 1546502
50675 1546502 1549189 1562740 1587230 1622427 1668143 1724148 1789870 1864166 1944992 2029163 2112825
50664 2112825 2192470 2265512 2330254 2385891 2432672 2471544 2503491 2529444 2550794 2569372 2586641
50653 2586641 2602964 2617486 2628442 2633913 2633140 2627287 2618545 2608393 2597097 2584806 2572652 2562701
50641 2562701 2557197 2557715 2564653 2577570 2596200 2620773 2650948 2684992 2720719 2756742 2792130 2825527
50629 2825527 2855797 2883201 2908878 2933725 2958952 2986557 3016173 3040573 3046733 3023693 2969722
50618 2969722 2892220 2802522 2711506 2627751 2556710 2500648 2459883 2434032 2421944 2421427 2430089 2446085
50606 2446085 2467311 2490370 2511223 2526634 2534360 2532288 2518219 2490541 2448823 2394001 2328314 2254646
50594B254646p9146q2661q3881q2278p8589p4376p0232o5554o0144n4833n0234
50583A472718m6037m1891l8081l4904l2171k9620k7153k4477k1245j7630j4125
50572A145384j0781p406m365k136j79K622O156Q923J0037J0389J1472J3917J7512
50559A201545K1782K6098K9969L3755L8408M4160N0089N5167N9136O2171O4394
50548A686674O5949O6848O6561O4338O0176N4896M9343M4285M0928M0372M2369
50537B282739M5621M9563N4754O1143O7241P1757P5120P8577Q2548Q6648R0774
50526C046485R5333J00666J06813J13518J20106J25705J29923J32837J34061J32341
50516D237788J26560J16635J03063Q6103O5837M2715J7534q849l5509o1459q5966
$$ plain form
50594 2254646 2175500 2092839 2008958 1926680 1848091 1773715 1703483 1637929 1577785 1522952 1472718
50583 1472718 1426681 1384790 1346709 1311805 1279634 1250014 1222861 1198384 1177139 1159509 1145384
50572 1145384 1134603 1127197 1122832 1120696 1120517 1123139 1129295 1138218 1148255 1158644 1170116 1184033 1201545
50559 1201545 1223327 1249425 1279394 1313149 1351557 1395717 1445806 1500973 1560109 1622280 1686674
50548 1686674 1752623 1819471 1886032 1950370 2010546 2065442 2114785 2159070 2199998 2240370 2282739
50537 2282739 2328360 2377923 2432677 2493820 2561061 2632818 2707938 2786515 2869063 2955711 3046485
50526 3046485 3141818 3242484 3349297 3462815 3582921 3708626 3838549 3971386 4105447 4237788
50516 4237788 4364348 4480983 4584046 4670149 4735986 4778701 4796235 4787386 4751877 4690418 4604452
50505D604452j08518j28230j43624j53329j56783j54073j45484j31485j12890
50496C370036r0666o5722l9022j1841J4241L7491N6295O9539P6512P6248O7265
50485C560376M8690K1757j0177m3213p4302j01421j23231j38999j48744j53176
50475B837560j53366j50261j44425j36390j27124j17616j07939r7535q6617p6354
50465A639933o7267n8519m9628m1789l6407l3116l0592k8510k7376k6900k6117
50454A213712k4730k2980k0486j6800j2852j0105q353o005k635N22K837N221Q275
50441A105621J1171J3063J4199J4847J4429J2659J0397Q578P261O521P273J0305
50429A236324J5095K0316K4901K8271L0236L1202L1794L1995L1354L0189K9599
$$ plain form
50505 4604452 4495934 4367704 4224080 4070751 3913968 3759895 3614411 3482926 3370036
50496 3370036 3279370 3213648 3174626 3162785 3177026 3214517 3270812 3340351 3416863 3493111 3560376
50485 3560376 3609066 3630823 3620646 3577433 3503131 3401710 3278479 3139480 2990736 2837560
50475 2837560 2684194 2533933 2389508 2253118 2125994 2008378 1900439 1802904 1716287 1639933
50465 1639933 1572666 1514147 1464519 1422730 1386323 1353207 1322615 1294105 1266729 1239829 1213712
50454 1213712 1188982 1166002 1145516 1128716 1115864 1105759 1097406 1091401 1088766 1089288 1092125 1097346 1105621
50441 1105621 1116792 1129855 1144054 1158901 1173330 1185989 1196386 1204964 1212225 1218746 1226019 1236324
50429 1236324 1251419 1271735 1296636 1324907 1355143 1386345 1418139 1450134 1481488 1511677 1541276
50418A541276L0056L1030L2310L4545L8002M1988M6073N0788N6421O2154O7089
50407B031732P1176P4477P6444P6644P5375P3006O9528O5241O0874N6422N0738
50396B781657M2901L2978K0967O192j1409l0410m9063o6409q1512r2831r9316
50385B453745j01260r9271r3353q3879p2310n9950m6882l3090j9560p099M820
50374A841911J6572K6575L2488L3662L1129K5550J6642M415j0159k5590m0167
50363A953028n2194o0831o6519o9883p0781o9118o5846o2088n7980n3438m9378
50352A274972m6820m5169m2770l9016l4697l0400k5744k0268j4066p455p60N523
50340I73330J0845J4649J5772J2554M639n632j4643k0285k2632k2482k0482j7517
$$ plain form
50418 1541276 1571332 1602362 1634672 1669217 1707219 1749207 1795280 1846068 1902489 1964643 2031732
50407 2031732 2102908 2177385 2253829 2330473 2405848 2478854 2548382 2613623 2674497 2730919 2781657
50396 2781657 2824558 2857536 2878503 2884695 2873286 2842876 2793813 2727404 2645892 2553061 2453745
50385 2453745 2352485 2253214 2159861 2075982 2003672 1943722 1896840 1863750 1844190 1837091 1841911
50374 1841911 1858483 1885058 1917546 1951208 1982337 2007887 2024529 2028944 2018785 1993195 1953028
50363 1953028 1900834 1840003 1773484 1703601 1632820 1563702 1497856 1435768 1377788 1324350 1274972
50352 1274972 1228152 1182983 1140213 1101197 1066500 1036100 1010356 990088 976022 968567 967807 973330
50340 973330 984175 998824 1014596 1027150 1031789 1026157 1011514 991229 968597 946115 925633 908116
50328I08116j4626j2146r652o868m063j624J03P88O78R40K512M782O303O669O732
50313H88644O937O655N486M272M237N594P558R364J0843J2144J3224J3760J3546
50300A002264J2757J1676J0316Q823Q038Q908J1238J3770J5674J7152J8418J9230
50288A158264J9732K0743K2732K5773L0842L8967M7496M9108L7501J4271j1594
50277A453835l1031m0640m2115l8694l3027k6775k0683j5122j0668p770o010m481
50265A176819k851j324J92K044M117O128Q492J2008J6736K2213K8602L6450M5363
50252A354989N4107O2267P0587P9300Q7105R2208R3593R0940Q4286P4501O3586
50241B207469N3923M7248M4154M3876M4445M3552L9570L1512J8488J31k2378m6506
$$ plain form
50328 908116 893490 881344 871692 864824 860761 859137 859240 860028 860706 861646 864158 868940 875243 881912 888644
50313 888644 895581 902236 907722 911994 916231 921825 929383 938747 949590 961734 974958 988718 1002264
50300 1002264 1015021 1026697 1037013 1045836 1053874 1062782 1074020 1087790 1103464 1120616 1139034 1158264
50288 1158264 1177996 1198739 1221471 1247244 1278086 1317053 1364549 1413657 1451158 1465429 1453835
50277 1453835 1422804 1382164 1340049 1301355 1268328 1241553 1220870 1205748 1195080 1187310 1181300 1176819
50265 1176819 1173968 1172644 1172836 1174880 1178997 1185125 1193617 1205625 1222361 1244574 1273176 1309626 1354989
50252 1354989 1409096 1471363 1541950 1621250 1708355 1800563 1894156 1985096 2069382 2143883 2207469
50241 2207469 2261392 2308640 2352794 2396670 2441115 2484667 2524237 2555749 2574237 2574368 2551990 2505484
50229B505484o9636q9590j04187j11676j12056j07210r9229q9133p7477o5300
50219A579990n4020m4915l9204l7989m1338m7395n2923n5163n3437m9177m4328
50208A060101l9645l4570k8711k2824j8041j4775j2793j1807j1256j0095p790
50197H47794n245l845l725l915l904m066m540m794m486l905l320k686k174k288
50183G94901l086l928m261m172m008l862l637l177k295j006K51R63J056Q14N84
50168G65137Q83K318M737O941P948Q171Q637R519J0366J1285J2778J4613J6005
50155H79338J6875J7823J8918J9699K0339K1618K3648K5658K7195K8481K9462
50144A129054K9772K9894L1136L4119L8311M3454N0319N9580P1082Q4698J00794
$$ plain form
50229 2505484 2435848 2346258 2242071 2130395 2018339 1911129 1811900 1722767 1645290 1579990
50219 1579990 1525970 1481055 1441851 1403862 1362524 1315129 1262206 1207043 1153606 1104429 1060101
50208 1060101 1020456 985886 957175 934351 916310 901535 888742 876935 865679 855584 847794
50197 847794 842549 838704 834979 831064 827160 823094 818554 813760 809274 805369 802049 799363 797189 794901
50183 794901 791815 787887 783626 779454 775446 771584 767947 764770 762475 761469 761720 762683 763739 764553 765137
50168 765137 766020 768338 773075 780016 787964 796135 804772 814291 824657 835942 848720 863333 879338
50155 879338 896213 914036 932954 952653 972992 994610 1018258 1043916 1071111 1099592 1129054
50144 1129054 1158826 1188720 1219856 1253975 1292286 1335740 1386059 1445639 1516721 1601419 1702213
50133A702213J19029J37537J53869J65924J71564J68831J57933J42429J27234
50124C046563J15508J07985J04450J04381J05965J05558R8802Q2433N5529J9821
50114C946995k0786o1516r8280j28774j52450j69535j80113j84205j82608j76932
50104B591796j68505j57694j44738j30614j16359j02096q7690p4071o2945n5282
50094A491802n0790m8532m7155m4949m0895l5625l0389k5336j9932j4691j0816
50083A122692q153n230j664R98J556P68n5q74k396m643o973q868j0078j0517j0533
50068A056030j0644j0796j0551j0101j0066j0169r434p952p087p384p671o959
50056I47216n799m922l957k560j487j239q69N72K392L513M381O023Q044R194R517
$$ plain form
50133 1702213 1821242 1958779 2112648 2278572 2450136 2618967 2776900 2919329 3046563
50124 3046563 3162071 3270056 3374506 3478887 3584852 3690410 3789212 3871645 3927174 3946995
50114 3946995 3926209 3864693 3766413 3637639 3485189 3315654 3135541 2951336 2768728 2591796
50104 2591796 2423291 2265597 2120859 1990245 1873886 1771790 1684100 1610029 1547084 1491802
50094 1491802 1441012 1392480 1345325 1300376 1259481 1223856 1193467 1168131 1148199 1133508 1122692
50083 1122692 1114539 1109309 1107645 1108643 1110199 1110967 1110912 1110038 1107642 1102999 1096026 1087158 1077080 1066563 1056030
50068 1056030 1045386 1034590 1024039 1013938 1003872 993703 984269 976317 969230 961846 954175 947216
50056 947216 941417 936495 932538 929978 928491 927252 926383 926955 929347 932860 937241 943264 951308 960502 970019
50041I70019J0267J1933J3774J5173J6077J6185J5065J3212J1822J1473J1843
50030A116843J2587J3516J4090J3936J3695J4283J5435J6227J6925J8843K2291
50019A288671K6258L0512L6424M4832N4515O3938P3286Q3214R2212R6962R5569
50008A986393Q9245Q0430P0370N9301M8203L9206L4074L2916L4437L6758L7523
49997B548856L3836K3198M939j9326m6548p3250r6103j12622j21966j24925j22948
49986A893141j17341j09249r9702q9397p8825o8799o0315n3666m8303m3794m0291
49975A083459l7742l5445l2912l0546k8715k6805k3964k0391j7063j4526j2732
49964H02618j1677j1272j0827r661q215p616q021q319p658o459n422m370k672
$$ plain form
50041 970019 980286 992219 1005993 1021166 1037243 1053428 1068493 1081705 1093527 1105000 1116843
50030 1116843 1129430 1142946 1157036 1170972 1184667 1198950 1214385 1230612 1247537 1266380 1288671
50019 1288671 1314929 1345441 1381865 1426697 1481212 1545150 1618436 1701650 1793862 1890824 1986393
50008 1986393 2075638 2156068 2226438 2285739 2333942 2373148 2407222 2440138 2474575 2511333 2548856
49997 2548856 2582692 2605890 2610829 2591503 2544955 2471705 2375602 2262980 2141014 2016089 1893141
49986 1893141 1775800 1666551 1566849 1477452 1398627 1329828 1269513 1215847 1167544 1123750 1083459
49975 1083459 1045717 1010272 977360 946814 918099 891294 867330 846939 829876 815350 802618
49964 802618 790941 779669 768842 759181 750966 743350 735329 727010 719352 712893 707471 703101 700429
49951G00429l37K010L975N735P535R381J1194J2897J4204J4582J3726J1979J0056
49938H17366Q361O732M992L501K838K941K709N97m313j1481j8816k3811k5288
49925G66328k4174k2285k0493j8440j5748j2713r805p224n176l826k704r20J562
49912F24382L493L816L000K297K141K071J943K310L509N082O296O918P271P801
$$ plain form
49951 700429 700092 702102 706077 711812 719347 728728 739922 752819 767023 781605 795331 807310 817366
49938 817366 825727 832459 837451 840952 843790 846731 849440 850037 845724 834243 815427 791616 766328
49925 766328 742154 719869 699376 680936 665188 652475 642670 635446 630270 626444 623740 622820 624382
49912 624382 627875 631691 634691 636988 639129 641200 643143 645453 648962 654044 660340 667258 674529 682330
$$ [...]
##END NTUPLES=NMR SPECTRUM
##END=
